##TITLE=1H_PhEPA0207
 D2O, 8 sc, 
 5.07.2021
##JCAMPDX= 6.0         $$ Bruker NMR JCAMP-DX V2.0
##DATA TYPE= NMR FID
##DATA CLASS= NTUPLES
##ORIGIN= UXNMR, Bruker Analytische Messtechnik GmbH
##OWNER= root
$$ XWIN-NMR		Version 3.5
$$ Mon Jul  5 10:11:26 2021 Russian Standard Time (UT+4h)  she@DPX200
##.OBSERVE FREQUENCY= 200.131506
##.OBSERVE NUCLEUS= ^1H
##.DELAY= (6, 6)
##.ACQUISITION MODE= SIMULTANEOUS
##.ACQUISITION SCHEME= undefined
##.AVERAGES= 8
##.DIGITISER RES= 18
##SPECTROMETER/DATA SYSTEM= spect
##.PULSE SEQUENCE= zg30
##.SOLVENT NAME= CDCl3
##.SHIFT REFERENCE= (INTERNAL, CDCl3, 0, 15.7039)
##AUDIT TRAIL= $$ (NUMBER, WHEN, WHO, WHERE, WHAT)
$$ ##TITLE= Audit trail, XWIN-NMR		Version 3.5
$$ ##JCAMPDX= 5.01
$$ ##ORIGIN= Bruker BioSpin GmbH
$$ ##OWNER= she
$$ F:/spectra/data/she/nmr/H-F/1/audita.txt
$$ ##AUDIT TRAIL=  $$ (NUMBER, WHEN, WHO, WHERE, WHAT)
(   1,<2021-07-05 10:10:08.76 +0400>,<she>,<DPX200>,
      <created by zg, POWCHK disabled, PULCHK disabled
       configuration hash MD5:
       00 E9 B6 7A A2 85 ED C7 34 08 36 98 17 FE 4E 26
       data hash MD5: 16K
       4F 23 DC BC DB 6F 9D 9F 0A C8 5A D0 F3 49 88 B7>)
$$ ##END=
$$ 
$$ hash MD5
$$ 7A EA 60 B4 59 F1 F4 DF 36 C1 14 A3 75 41 B7 F9
##$RELAX= 
##$RELAX= 
##$RELAX= 
##$RELAX= 
##$RELAX= 
##$RELAX= 
$$ Bruker specific parameters
$$ --------------------------
##$DU= <F:/spectra>
##$EXPNO= 1
##$NAME= <H-F>
##$PROCNO= 1
##$TYPE= <nmr>
##$USER= <she>
##$AMP= (0..31)
100 100 100 100 100 100 100 100 100 100 100 100 100 100 100 100 100 100 
100 100 100 100 100 100 100 100 100 100 100 100 100 100 
##$AQSEQ= 0
##$AQ_mod= 1
##$AUNM= <au_zg>
##$AUTOPOS= <>
##$BF1= 200.13
##$BF2= 200.13
##$BF3= 200.13
##$BF4= 200.13
##$BF5= 200.13
##$BF6= 200.13
##$BF7= 200.13
##$BF8= 200.13
##$BYTORDA= 1
##$CFDGTYP= 0
##$CFRGTYP= 5
##$CHEMSTR= <none>
##$CNST= (0..31)
1 1 145 1 1 1 1 1 1 1 1 1 1 1 1 1 1 1 1 1 1 1 1 1 1 1 1 1 1 1 1 1 
##$CPDPRG= <>
##$CPDPRG1= <>
##$CPDPRG2= <>
##$CPDPRG3= <>
##$CPDPRG4= <mlev>
##$CPDPRG5= <mlev>
##$CPDPRG6= <mlev>
##$CPDPRG7= <mlev>
##$CPDPRG8= <mlev>
##$CPDPRGB= <>
##$CPDPRGT= <>
##$D= (0..31)
0 1.2 0 0 0 0 0 0 0 0.06 0 0.03 0 0 0 0 0.0002 0 0 0 0 0 0 0 0 0 0 0 0 
0 0 0 
##$DATE= 1625465408
##$DBL= (0..7)
120 120 120 120 120 120 120 120 
##$DBP= (0..7)
150 150 150 150 150 150 150 150 
##$DBP07= 0
##$DBPNAM0= <>
##$DBPNAM1= <>
##$DBPNAM2= <>
##$DBPNAM3= <>
##$DBPNAM4= <>
##$DBPNAM5= <>
##$DBPNAM6= <>
##$DBPNAM7= <>
##$DBPOAL= (0..7)
0.5 0.5 0.5 0.5 0.5 0.5 0.5 0.5 
##$DBPOFFS= (0..7)
0 0 0 0 0 0 0 0 
##$DE= 6
##$DECBNUC= <off>
##$DECIM= 32
##$DECNUC= <off>
##$DECSTAT= 4
##$DIGMOD= 1
##$DIGTYP= 9
##$DL= (0..7)
0 120 120 120 120 120 120 120 
##$DP= (0..7)
150 150 150 150 150 150 150 150 
##$DP07= 0
##$DPNAME0= <>
##$DPNAME1= <>
##$DPNAME2= <>
##$DPNAME3= <>
##$DPNAME4= <>
##$DPNAME5= <>
##$DPNAME6= <>
##$DPNAME7= <>
##$DPOAL= (0..7)
0.5 0.5 0.5 0.5 0.5 0.5 0.5 0.5 
##$DPOFFS= (0..7)
0 0 0 0 0 0 0 0 
##$DQDMODE= 0
##$DR= 18
##$DS= 0
##$DSLIST= <SSSSSSSSSSSSSSS>
$$ [...]
##$SUBNAM2= <"">
##$SUBNAM3= <"">
##$SUBNAM4= <"">
##$SUBNAM5= <"">
##$SUBNAM6= <"">
##$SUBNAM7= <"">
##$SUBNAM8= <"">
##$SUBNAM9= <"">
##$SW= 20.0188882624521
##$SWIBOX= (0..15)
0 0 2 0 0 0 0 0 0 0 0 0 0 0 0 0 
##$SW_h= 4006.41025641026
##$TD= 16384
##$TD0= 1
##$TE= 0
##$TE2= 300
##$TE3= 300
##$TEG= 300
##$TL= (0..7)
0 120 120 120 120 120 120 120 
##$TP= (0..7)
150 150 150 150 150 150 150 150 
##$TP07= 0
##$TPNAME0= <>
##$TPNAME1= <>
##$TPNAME2= <>
##$TPNAME3= <>
##$TPNAME4= <>
##$TPNAME5= <>
##$TPNAME6= <>
##$TPNAME7= <>
##$TPOAL= (0..7)
0.5 0.5 0.5 0.5 0.5 0.5 0.5 0.5 
##$TPOFFS= (0..7)
0 0 0 0 0 0 0 0 
##$TUNHIN= 0
##$TUNHOUT= 0
##$TUNXOUT= 0
##$USERA1= <user>
##$USERA2= <user>
##$USERA3= <user>
##$USERA4= <user>
##$USERA5= <user>
##$V9= 5
##$VALIST= <valist>
##$VCLIST= <CCCCCCCCCCCCCCC>
##$VD= 0
##$VDLIST= <DDDDDDDDDDDDDDD>
##$VPLIST= <PPPPPPPPPPPPPPP>
##$VTLIST= <TTTTTTTTTTTTTTT>
##$WBST= 1024
##$WBSW= 4
##$XGAIN= (0..3)
0 0 0 0 
##$XL= 0
##$YL= 0
##$YMAX_a= 389244
##$YMIN_a= -405038
##$ZGOPTNS= <>
##$ZL1= 120
##$ZL2= 120
##$ZL3= 120
##$ZL4= 120
##$ABSF1= 10
##$ABSF2= 0
##$ABSG= 5
##$ABSL= 3
##$ALPHA= 0
##$AQORDER= 0
##$ASSFAC= 0
##$ASSFACI= 0
##$ASSFACX= 0
##$ASSWID= 0
##$AUNMP= <proc_1d>
##$AZFE= 0.1
##$AZFW= 0.1
##$BCFW= 1
##$BC_mod= 2
##$BYTORDP= 1
##$COROFFS= 0
##$CY= 11.3945322036743
##$DATMOD= 1
##$DC= 2
##$DFILT= <>
##$DTYPP= 0
##$F1P= 15.9154993809931
##$F2P= -4.1035820241983
##$FCOR= 0.5
##$FTSIZE= 0
##$FT_mod= 4
##$GAMMA= 1
##$GB= 0.15
##$INTBC= 1
##$INTSCL= 1
##$ISEN= 128
##$LB= 0.24
##$LEV0= 0
##$LPBIN= 0
##$MAXI= 10000
##$MC2= 0
##$MEAN= 0
##$ME_mod= 0
##$MI= 1.114404
##$NCOEF= 0
##$NC_proc= 0
##$NLEV= 6
##$NOISF1= 3.799351
##$NOISF2= 2.8
##$NSP= 1
##$NTH_PI= 0
##$NZP= 0
##$OFFSET= 15.70392
##$PC= 1
##$PHC0= -12077.27
##$PHC1= 12.80099
##$PH_mod= 1
##$PKNL= yes
##$PPARMOD= 0
##$PSCAL= 0
##$PSIGN= 0
##$REVERSE= no
##$SF= 200.130013532006
##$SI= 16384
##$SIGF1= 3
##$SIGF2= 2
##$SINO= 400
##$SIOLD= 16384
##$SREGLST= <1H.CDCl3>
##$SSB= 0
##$STSI= 0
##$STSR= 0
##$SW_p= 3612.71676300578
##$SYMM= 0
##$S_DEV= 0
##$TDeff= 0
##$TDoff= 0
##$TI= <>
##$TILT= no
##$TM1= 0
##$TM2= 0
##$TOPLEV= 0
##$USERP1= <user>
##$USERP2= <user>
##$USERP3= <user>
##$USERP4= <user>
##$USERP5= <user>
##$WDW= 1
##$XDIM= 8192
##$YMAX_p= 0
##$YMIN_p= 0
$$ End of Bruker specific parameters
$$ ---------------------------------
##NTUPLES= NMR FID
##VAR_NAME=  TIME,          FID/REAL,        FID/IMAG
##SYMBOL=    X,             R,               I
##VAR_TYPE=  INDEPENDENT,   DEPENDENT,       DEPENDENT
##VAR_FORM=  AFFN,          ASDF,            ASDF
##VAR_DIM=   8192,          8192,            8192
##UNITS=     SECONDS,       ARBITRARY UNITS, ARBITRARY UNITS
##FACTOR=    0.0002496,     1,               1
##FIRST=     0,             0,               0
##LAST=      2.0444736,     0,               0
##MIN=       0,             -405038,         0
##MAX=       2.0444736,     389244,          0
$$ Real data points
##PAGE= N=1
##DATA TABLE= (X++(R..R)), XYDATA
$$ plain form
0 0 0 0 0 0 0 0 0 0 0 -8 8 -8 8 -8 16 -16 24 -24 32 -40 48 -56 64 -80 90 -107 128 -144 168 -192 217 -249
32 -249 284 -321 363 -409 458 -515 575 -641 715 -792 879 -975 1077 -1192 1314 -1450 1597
49 1597 -1759 1938 -2136 2352 -2598 2871 -3177 3529 -3931 4397 -4951 5615 -6425 7453 -8793
64 -8793 10630 -13310 17600 -25607 45727 -207846 -265505 159159 237580 267563 57142 -264406
76 -264406 -405038 -206785 53232 278302 281919 76700 -172454 -305659 -266172 20877 288564
87 288564 318194 157970 -97835 -325334 -250079 35526 257690 349221 237514 -107870 -313078
98 -313078 -192610 19216 211530 350629 230873 -67685 -242616 -216477 -44309 192256
108 192256 301917 219912 16510 -224515 -295368 -87728 159877 264709 233396 22891
$$ packed form
0@%%%%%%%%%qJ6j6J6j6K4l2M0m8N6p2Q8j04J20j44J70j97K35k72L12l60M09m66
32b49N33o05O84p72Q67r73J090j216J356j507J671j854K052k269K506k764L047
49A597l356L697m074M488m950N469o048O706p460Q328r348J0566j2040J3878j6246
64h793J9423k3940L0910m3207P1334k53573n7659M24664P8421K9983k10421l21548
76b64406j40632J98253K60017K25070L617k05219k49154j33205L9487K87049K67687
87B88564K9630j60224k55805k27499P5255K85605K22164R1531j11707l45384k05208
98c13078J20468K11826J92314J39099j19756k98558j74931K6139J72168K36565
108A92256J09661q2005k03402k41025p0853K07640K47605J04832l1313k10505
$$ plain form
118 22891 -249348 -300022 -126273 94713 257206 219842 -18686 -216272 -264232 -186028 35828
129 35828 234731 195233 10526 -161677 -274625 -217960 7267 191599 214933 80097 -152397
140 -152397 -285720 -201185 -9257 172521 244506 105654 -128183 -241318 -192403 -22876
150 -22876 177518 235891 120061 -49326 -194051 -209510 -31240 168909 225237 164714 9115
161 9115 -179745 -211063 -47764 143021 240732 193059 11966 -160705 -194015 -78417 115680
172 115680 238118 181533 20533 -128498 -196150 -109674 80644 198445 176825 54388 -120307
183 -120307 -215453 -131968 36568 162580 187567 68510 -124512 -219079 -154061 914 147646
194 147646 179366 65067 -102272 -207488 -176069 -19891 129275 161090 82774 -64672 -196029
$$ packed form
118B2891k72239n0674J73749K20986J62493l7364k38528j97586m7960P8204K21856
129C5828J98903l9498j84707j72203j12948N6665K25227J84332K3334j34836k32494
140a52397j33323Q4535J91928J81778P1985j38852k33837j13135M8915J69527
150b2876K00394N8373j15830j69387j44725j5459J78270K00149N6328o0523j55599
161I115j88860l1318J63299J90785R7711m7673j81093j72671l3310J15598J94097
172A15680J22438n6585j61000j49031o7652Q6476J90318J17801k1620j22437j74695
183a20307r5146Q3485J68536J26012K4987j19057j93022r4567O5018J54975J46732
194A47646L1720j14299j67339j05216L1419J56178J49166L1815p8316j47446j31357
$$ plain form
205 -196029 -185212 -39511 105642 166637 114231 -40233 -178198 -180188 -59107 95708 182488
216 182488 131096 -17428 -147663 -172687 -69279 91284 180136 142873 18096 -119771 -167349
227 -167349 -74575 74201 168213 161540 48616 -101764 -161775 -87996 50303 161665 171111
238 171111 61571 -85344 -158917 -107873 29998 148733 162526 70486 -68416 -160283 -125055
249 -125055 6659 122660 152410 81840 -56941 -160093 -139101 -22802 97723 147875 88584
260 88584 -46268 -153706 -152216 -47498 81207 141111 93542 -28575 -142812 -159141 -61706
271 -61706 66015 133026 104773 -6353 -127333 -156295 -71992 51160 130810 119125 15961
282 15961 -105965 -148744 -81094 41021 130691 129864 38551 -82248 -140787 -87213 32062 125629
$$ packed form
205a96029J0817J45701J45153O0995n2406j54464j37965j990J21081J54815Q6780
216A82488n1392j48524j30235k5024J03408J60563Q8852l7263j24777j37867m7578
227a67349R2774J48776R4012o673j12924j50380o0011P3779J38299J11362R446
238A71111j09540j46915p3573N1044J37871J18735J3793r2040j38902r1867L5228
249a25055J31714J16001K9750p0570j38781j03152K0992J16299J20525N0152n9291
260H8584j34852j07438J490J04718J28705N9904m7569j22117j14237j6329R7435
271f1706J27721O7011k8253j11126j20980k8962Q4303J23152P9650j1685j03164
282A5961j21926m2779O7650J22115Q9670q27r1313j20799n8539N3574J19275R3567
$$ plain form
294 125629 136962 59564 -61580 -132767 -92964 18376 115773 140589 74548 -44590 -125375
305 -125375 -102002 497 102530 137985 83216 -30425 -120691 -113506 -18697 85303 129707
316 129707 88506 -18822 -117121 -123892 -38341 65569 119708 91868 -8265 -111259 -131543
327 -131543 -56742 47529 110492 94714 4084 -101007 -135039 -71355 32653 102973 99099
338 99099 19073 -86671 -132787 -81154 20318 97651 105595 35744 -69034 -125607 -87022 10074
350 10074 93385 112354 52759 -49694 -115885 -90696 700 87993 116896 68218 -30833 -105865
362 -105865 -93981 -9510 79867 117745 80168 -14425 -96885 -98341 -22133 68496 114439 87355
374 87355 -1247 -89015 -103880 -36905 54350 107319 90388 9265 -82087 -109544 -51998 38309
$$ packed form
294A25629J1333p7398j21144p1187L9803J11340R7397K4816o6041j19138q0785
305a25375K3373J02499J02033L5455n4769j13641r0266P185R4809J04000M4404
316A29707m1201j07328r8299o771Q5551J03910N4139k7840j00133j02994k0284
327a31543P4801J04271O2963j5778r0630j05091l4032O3684J04008P0320l874
338I9099q0026j05744m6116N1633J01472P7333P944o9851j04778n6573L8585R7096
350A0074Q3311J8969n9595j02453o6191K5189R1396Q7293K8903m8678r9051p5032
362a05865J1884Q4471Q9377L7878l7577r4593q2460j456P6208R0629M5943k7084
374H7355q8602q7768j4865O6975R1255N2969j6931q1123r1352k7457N7546R0307
$$ plain form
386 38309 97447 91191 18309 -75012 -113193 -66026 22057 87762 91591 26733 -65825 -113386
398 -113386 -77864 8092 79785 91906 36006 -53660 -109949 -85499 -2899 72635 93507 47351
410 47351 -39668 -102594 -88408 -12468 65895 97035 59433 -25159 -92522 -89119 -21030 60146
422 60146 99395 69955 -9846 -82300 -89944 -27528 53641 97223 78181 4955 -73207 -90631
434 -90631 -34867 43770 92302 83518 16504 -63806 -91837 -46692 31924 87547 84395 23994
446 23994 -54569 -93768 -59554 20153 80308 82461 29847 -47292 -93817 -68313 5862 69008
458 69008 82105 36392 -40709 -90550 -74770 -9437 58626 83091 44048 -31523 -86980 -80785
470 -80785 -18603 51685 81273 52328 -19106 -82689 -83070 -22462 44678 77961 60700 -5267
$$ packed form
386C8309N9138o256p2882r3321l8181M7167Q8083O5705L829o4858r2558m7561
398a13386L5522Q5956P1693J2121n5900q9666n6289K4450Q2600P5534K0872m6156
410D7351q7019o2926J4186P5940P8363L1140l7602q4592o7363L403O8089Q1176
422F0146L9249k9440p9801p2454p644O2416Q1169M3582j9042p3226p8162j7424
434i0631N5764P8637M8532q784o7014q0310k8031M5145P8616N5623l152o0401
446B3994p8563l9199L4214P9707O0155K153n2614p7139m6525K5504P4175O3146
458F9008J3097m5713p7101m9841J5780O5333O8063K4465l9043p5571n5457O195
470h0785O2182P0288K9588k8945p1434o3583l81O0608O7140L3283j7261o5967
$$ plain form
482 -5267 -72883 -81925 -29740 37474 77942 67448 7949 -59571 -81897 -39701 32676 79321
494 79321 71988 18376 -49832 -81000 -45043 25658 75233 75497 25574 -43367 -76052 -48748 12117
507 12117 66318 77956 32827 -35530 -73590 -57377 -793 57852 77062 40763 -27873 -77210
519 -77210 -65875 -7424 49725 72393 45599 -21925 -76561 -69112 -15066 40370 67452 47310
531 47310 -12622 -67104 -72759 -27652 32847 66028 51646 -618 -58907 -77227 -36092 28011
543 28011 66677 59095 7348 -54825 -74114 -37276 21470 64821 64075 14074 -45475 -66570 -40039
556 -40039 12946 59567 66756 26806 -32546 -66121 -46712 6901 54142 69655 38944 -26002
568 -26002 -68751 -50653 1985 49727 69601 41160 -21443 -63547 -53691 -7297 43064 64309
$$ packed form
482e267o7616r042N2185O7214M0468j0494n9499o7520k2326M2196P2377M6645
494G9321p333n3612o8208l1168L5957P0701M9575K64m9923o8941l2685K7304O0865
507A2117N4201J1638m5129o8357l8060J6213N6584N8645J9210l6299o8636m9337
519g7210J1335N8451N7149K2668k6794o7524n4636P449N4046N5436K7082k0142
531D7310n9932n4482n655M5107O0499L3181j4382n2264n8289j8320M1135O4103
543B8011L8666p582n1747o2173j9289L6838N8746M3351p46n0001n9549k1095K6531
556d0039N2985M6621P189l9950n9352l3575J9409N3613M7241J5513l0711o4946
568b6002m2749J8098N2638M7742J9874k8441o2603m2104R856M6394N0361K1245
$$ plain form
580 64309 40921 -11374 -56754 -60715 -18765 33518 59975 46875 -3175 -56795 -65906 -27176
592 -27176 24530 59486 51895 -1554 -55054 -64647 -32439 17972 56196 50760 4641 -44919 -63155
605 -63155 -37713 11928 49249 52667 18730 -35484 -64431 -41739 6270 46558 59567 27688
617 27688 -30402 -61249 -43532 2178 47367 60965 29753 -20759 -53424 -45917 -2224 42904
629 42904 57035 36580 -8426 -49909 -49286 -8991 34080 57130 45471 -3544 -49555 -51726 -16939
642 -16939 28242 57650 45340 -2104 -45182 -53858 -23440 23184 50247 41935 5614 -39138
654 -39138 -56854 -29682 13597 42041 45445 13885 -36604 -58494 -36281 4862 41138 49315
666 49315 15987 -32493 -56316 -40662 1793 40126 46564 19838 -22721 -52398 -41770 -1165
$$ packed form
580F4309k3388n2295m5380l961M1950N2283K6457j3100n0050n3620r111L8730
592b7176N1706L4956p591n3449n3500r593L2208N0411L8224n436m6119m9560j8236
605f3155K5442M9641L7321L418l3937n4214k8947K2692M8009M0288J3009l1879
617B7688n8090l0847J7717M5710M5189J3598l1212n0512l2665P507M3693M5128
629D2904J4131k0455m5006m1483O23M0295M3071K3050j1659m9015m6011k171L4787
642a6939M5181K9408j2310m7444m3078q676L0418M6624K7063q312l6321m4752
654c9138j7716K7172M3279K8444L404l1560n0489k1890K2213M1143L6276Q177
666D9315l3328m8480k3823J5654M2455L8333O438k6726m2559k9677J0628M0605
$$ plain form
678 -1165 33509 45846 30040 -13088 -48585 -42329 -7471 29271 50955 37365 -7381 -43865
690 -43865 -44011 -12130 29702 51818 38001 -823 -38208 -45008 -14004 25698 45846 39949 7105
703 7105 -34078 -45159 -19328 16039 42170 44002 11408 -31211 -46642 -27784 9431 41208
715 41208 43220 12694 -27799 -48776 -33010 5767 35718 39609 16346 -23601 -48356 -35244
727 -35244 -1151 28190 39872 21565 -18849 -45666 -38663 -8455 25662 42006 25345 -12771
739 -12771 -42542 -41423 -10703 25098 41003 28999 -5388 -38596 -40578 -11595 21311 39832
751 39832 34114 1692 -32818 -38848 -15855 17079 40746 37735 7306 -27111 -39156 -20490 14499
764 14499 39791 38685 11959 -23374 -39578 -22943 9892 35114 38952 15560 -20741 -38872
$$ packed form
678a165L4674J2337j5806m3128l5497O256L4858L6742K1684j3590m4746l6484
690d3865j46L1881M1832K2116j3817l8824l7385o800L1004L9702K0148n897l2844
703G105m1183j1081K5831L5367K6131J832l2594m2619j5431J8858L7215L1777
715D1208K012l0526m0493k0977J5766L8777K9951L891k3263l9947k4755J3112
727c5244L4093K9341J1682j8307m0414k6817P003L0208L4117J6344j6661l8116
739a2771k9771J119L0720L5801J5905j2004l4387l3208j982K8983L2906J8521
751C9832n718l2422l4510o030K2993L2934K3667l011l0429l4417j2045J8666L4989
764A4499K5292j106k6726l5333j6204J6635L2835K5222L838k3392l6301j8131
$$ plain form
776 -38872 -26290 2603 30041 38791 18170 -17423 -38897 -31534 -3234 26049 36844 20446
788 20446 -13615 -39387 -35283 -7100 21567 34364 22829 -9565 -37440 -36632 -11493 17402 33695
801 33695 25307 -4713 -33037 -37208 -15771 14826 33946 28228 821 -28508 -36670 -17677 12584
814 12584 33487 31737 6273 -24499 -34712 -18431 9402 32098 34772 11496 -19926 -32973
826 -32973 -20359 6062 29971 35745 16141 -15260 -32769 -23240 2881 26904 34991 19486 -11624
839 -11624 -32541 -26166 -1441 22949 33413 20948 -8623 -31462 -29379 -7016 18775 31628
851 31628 21751 -5770 -29977 -31943 -11946 14220 29704 23271 -2769 -28520 -33006 -15439 9899
864 9899 27886 25384 934 -25982 -32929 -17753 6678 26261 27422 5882 -22016 -32238 -19223
$$ packed form
776c8872J2582K8893K7438Q750k0621l5593k1474P363K8300K9283J0795j6398
788B0446l4061k5772M104K8183K8667J2797j1535l2394k7875Q08K5139K8895J6293
801C3695q388l0020k8324m171K1437L0597J9120n718k7407k9329q162J8993L0261
814A2584K0903j750k5464l0772j0213J6281K7833K2696K674k3276l1422j3047
826c2973J2614K6421K3909N774j9604l1401j7509R529K6121K4023Q087j5505l1110
839a1624k0917O375K4725K4390J0464j2465k9571k2839K083K2363K5791J2853
851C1628r877k7521k4207j966J9997K6166J5484o433k6040k5751m486J7567K5338
864I899J7987k502k4450k6916o947J5176K4431J9583J161k1540k7898j0222J3015
$$ plain form
877 -19223 4724 24942 29261 11117 -17149 -30856 -20346 3018 23870 30509 15532 -12160
889 -12160 -28886 -21580 672 22489 31247 18811 -7798 -26728 -23085 -2398 20087 30918 21093
902 21093 -4471 -25215 -24812 -6049 16499 29488 22553 -2035 -24438 -26575 -9952 12212 27028
915 27028 23221 300 -23530 -28442 -13650 8205 24231 23507 3018 -21939 -29774 -16693 4758
928 4758 21658 23827 6097 -19198 -29994 -18897 2121 19876 24527 9529 -15402 -28798 -20431
941 -20431 75 18878 25546 13266 -10892 -26715 -21224 -1581 17823 26445 16891 -6435 -24158
954 -24158 -21404 -3408 16307 27035 19869 -2602 -21759 -21747 -5728 14086 26475 21850 798
967 798 -19930 -22796 -8309 11215 24577 22726 3531 -18618 -24188 -11139 7671 21824 22771
$$ packed form
877a9223K3947K0218M319j8144k8266j3707J0510K3364K0852O639j4977k7692
889a2160j6726P306K2252K1817Q758j2436k6609j8930L643K0687K2485J0831r825
902B1093k5564k0744M03J8763K2548J2989o935k4588k2403k137J6623K2164J4816
915B7028l807k2921k3830m912J4792K1855J6026p24k0489k4957p835J3081K1451
928D758J6900K169j7730k5295j0796J1097K1018J7755M651j4998k4931j3396Q367
941b0431K0506J8803O668j2280k4158j5823N491J9643J9404Q622r554k3326j7723
954b4158K754J7996J9715J0728p166k2471j9157J2J6019J9814J2389m625k1052
967G98k0728k866J4487J9524J3362j851j9195k2149n570J3049J8810J4153R47
$$ plain form
980 22771 5535 -17398 -25380 -14510 3914 19206 22066 7216 -15235 -26111 -17815 829 16999
993 16999 21465 9260 -12736 -26031 -19691 -1698 14917 21627 11659 -10046 -24315 -20145 -4075
1006 -4075 13348 22377 14197 -6373 -21733 -20453 -5693 12380 22650 17046 -2013 -19477 -20719
1019 -20719 -6323 11188 22350 19703 1593 -17504 -20233 -7496 9258 21740 20956 4219 -14730
1032 -14730 -20128 -10182 6945 20477 20899 6598 -12421 -21216 -13010 4255 18110 20680 8520
1045 8520 -11503 -22024 -14916 805 15316 20467 9251 -10448 -21359 -16988 -2732 12982 19464
1058 19464 10301 -7687 -20758 -19260 -4990 10903 18557 12711 -4757 -20280 -19950 -6266 9100
1071 9100 18630 14914 -2482 -18219 -19138 -7758 7850 18956 16217 776 -14683 -18827 -9188
$$ packed form
980B2771j7236k2933p982J0870J8424J5292K860j4850k2451j0876Q296J8644J6170
993A6999M466j2205k1996j3295O340J7993J6615O710r968k1705j4269M170J6070
1006d075J7423R029q180k0570j5360J280J4760J8073J0270n604j9059j7464j242
1019b0719J4396J7511J1162k647j8110j9097k729J2737J6754J2482p84j6737j8949
1032a4730n398R946J7127J3532M22j4301j9019q795Q206J7265J3855K570j2160
1045H520k0023j0521P108J5721J4511N151j1216j9699j0911M371J4256J5714O482
1058A9464r163j7988j3071J498J4270J5893P654n846j7468j5523L30J3684J5366
1071I100R530l716j7396j5737r19J1380J5608J1106k739j5441j5459m144R639
$$ plain form
1084 -9188 6997 18496 17888 4808 -12330 -18974 -9870 5551 17601 19691 7284 -11000 -18194
1097 -18194 -10732 3257 16499 19910 8292 -8729 -17365 -12946 696 14475 18795 9964 -6422
1110 -6422 -18101 -15167 -1627 11742 18066 11600 -5784 -18652 -16282 -4235 9353 17549 11832
1123 11832 -4795 -17317 -17131 -6732 7447 16214 12302 -1829 -15570 -18179 -8230 5626 15228
1136 15228 14510 1253 -14617 -18192 -9005 4341 15351 16239 3065 -12486 -16894 -9645 3546
1149 3546 15137 16520 5621 -9029 -15893 -10460 2274 13740 17244 8958 -6600 -15940 -11409
1162 -11409 370 12355 18337 10724 -5674 -15494 -12397 -1466 11187 17523 10811 -3972 -14581
1175 -14581 -13560 -3296 8645 15392 11760 -1699 -14325 -15064 -5780 5716 14407 13199 -426
$$ packed form
1084i188J6185J1499o08j3080j7138o644R104J5421J2050K090j2407j8284p194
1097a8194P462J3989J3242L411j1618j7021q636M419J3642J3779M320q831j6386
1110f422j1679K934J3540J3369O324o466j7384j2868K370J2047J3588Q196n717
1123A1832j6627j2522J86J0399J4179Q767l912j4131j3741k609R949J3856R602
1136A5228p18j3257j5870l575R187J3346J1010Q88j3174j5551m408P249J3191
1149C546J1591J383j0899j4650o864N433J2734J1466L504q286j5558r340M531
1162a1409J1779J1985N982p613j6398r820L097J0931J2653O336o712j4783j0609
1175a4581J021J0264J1941O747l632j3459j2626p39R284J1496Q691j208j3625
$$ plain form
1188 -426 -14148 -16018 -7933 3977 13962 13238 540 -12892 -16229 -9010 2966 12417 13150 3010
1202 3010 -10727 -15874 -9547 1207 11038 14525 5914 -8655 -15178 -10426 -94 11109 15806 7692
1216 7692 -6500 -14190 -10924 -345 10791 15528 9283 -3982 -13203 -11081 -1346 9101 15115 11124
1230 11124 -2006 -12295 -11597 -3345 7275 15014 12122 -749 -11758 -12809 -5144 5990 13867
1243 13867 12031 572 -11346 -13782 -6377 3984 11777 12069 2108 -10612 -14257 -8037 1613 10454
1257 10454 12534 3482 -9360 -14593 -9830 339 9919 12425 4732 -7609 -14357 -10483 -348 8868
1271 8868 12458 6698 -5618 -13363 -10426 -1552 7765 13238 8804 -3457 -12028 -10719 -2664 7323
1285 7323 13671 10220 -1404 -11012 -11097 -3167 6679 13006 11248 685 -10080 -11165 -3996 4976 11952
$$ packed form
1188d26j3722j870Q085J1910R985p24j2698j3432l337P219J1976R451P33j0140
1202C010j3737n147O327J0754R831L487q611j4569o523M752J0332J1203M697q114
1216G692j4192p690L266J0579J1136M737o245j3265r221K122R735J0447O014l991
1230A1124j3130j0289O98Q252J0620P739k892j2871j1009j051P665J1134P877
1243A3867j836j1459j1918k436P405J0361P793K92r961j2720l645O220R650Q841
1257A0454K080r052j2842n233M763J0169R580K506p693j2341o748L874J0135R216
1271H868L590n760j2316p745K937Q874R317N473m434j2261q571J309Q055R987
1285G323O348l451j1624r608q5P930R846O327j758j0563j0765j085P169Q972O976
$$ plain form
1300 11952 11940 2242 -9053 -11684 -5873 3213 11218 12081 3155 -8139 -12446 -7689 1819 10053 11602
1315 11602 4002 -7403 -12820 -8697 130 8357 11284 5028 -6415 -12562 -9580 -1726 6999 11423
1329 11423 6225 -4920 -12022 -10468 -2731 6326 11349 7519 -3067 -11339 -10667 -3047 5699 11171
1343 11171 8936 -1039 -10134 -10443 -3680 4845 11141 10045 867 -8533 -10398 -4743 3984 11006 10881
1358 10881 2581 -7321 -10482 -5593 3051 10229 11281 3826 -6413 -10518 -6468 1475 9041 11269
1372 11269 4703 -5599 -10616 -7641 -173 7668 10942 5447 -4662 -10748 -8832 -1679 6268 10277
1386 10277 6177 -3664 -10689 -9582 -2854 4937 9891 7024 -2463 -10095 -9969 -3921 4019 9567 7863
1401 7863 -927 -9075 -10042 -4627 3320 9483 8849 775 -7822 -9775 -4971 2657 9249 9675 2402 -6457
$$ packed form
1300A1952j2r698j1295k631N811R086Q005Q63q926j1294m307M757R508Q234J549
1315A1602p600j1405n417M123Q827Q227K927o256j1443o147K982P854Q725M424
1329A1423n198j1145p102J554P737R057N023l830j0586q272O72P620Q746N472
1343A1171k235r975r095l09O763Q525O296j096r178r400j865N655Q727P022j25
1358A0881q300r902l161M889Q644P178J052p455j0239m105M050P943P566K228
1372A1269o566j0302n017K975P468P841L274n495j0109o086J916P153P947M009
1386A0277m100r841p025J107O728P791M954k867r487p632J26O048P940N548j704
1401G863q790q148r67N415P947O163o34q074q597j953M804P628O592M26p273q859
$$ plain form
1417 -6457 -9331 -5468 1799 8825 10348 3821 -5262 -9024 -5927 857 8075 10602 4963 -4250 -8947
1432 -8947 -6592 -290 7021 10326 5725 -3379 -8889 -7412 -1506 5629 9834 6298 -2629 -8891 -8231
1447 -8231 -2804 4311 9096 6755 -1721 -8669 -8933 -3930 3103 8405 7258 -548 -8034 -9135 -4689
1462 -4689 2225 7941 7863 682 -7076 -9016 -5224 1465 7609 8533 2055 -5926 -8678 -5502 840 7233
1478 7233 9046 3594 -4644 -8313 -5775 216 6726 9408 4725 -3449 -7878 -6030 -471 5969 9415
1493 9415 5749 -2365 -7579 -6458 -1387 4964 9043 6387 -1464 -7363 -7069 -2363 3813 8324 6709
1508 6709 -708 -7225 -7644 -3346 2626 7498 7027 140 -6890 -8071 -4267 1560 6767 7186 1073 -6246
1524 -6246 -8254 -4968 710 6180 7461 2090 -5329 -8098 -5365 -6 5687 7785 3311 -4322 -7705
$$ packed form
1417f457k874L863P267P026J523o527r083l762L097O784P218K527n639r213m697
1432h947K355O302P311L305m601r104n510J477N906P135M205l536q927o262O60
1447h231N427P115M785k341q476o948k64N003P033N302j147p806p486j101M446
1462d689O914N716p8p181p758j940L792O689O144R24o478p981k752L176O342O393
1478G233J813n452q238l669K538N991O510K682m683q174m429J848N559O440L446
1493I415l666q114n214J121N071O351M079k656p851n899K94M706O176M511j615
1508F709p417o517m19M298N972M872m71o887p030j181L804N827N207M19o113p319
1524f246k008L286N678N470J281n371p419k769K733N359N693K098m474p633l383
$$ plain form
1539 -7705 -5547 -564 5202 8130 4462 -3084 -7172 -5661 -1018 4686 8233 5430 -1877 -6676 -5841
1554 -5841 -1430 4128 7983 6175 -756 -6245 -6119 -2110 3318 7583 6648 79 -5778 -6503 -3025 2360
1570 2360 6974 6724 748 -5393 -6869 -3905 1371 6224 6702 1517 -4938 -7169 -4629 336 5338
1585 5338 6770 2254 -4542 -7233 -5164 -562 4688 6826 3005 -3687 -6986 -5507 -1029 4149 6777
1600 6777 3835 -2547 -6687 -5653 -1391 3623 6759 4873 -1326 -6140 -5670 -1777 3112 6854 5576
1615 5576 -356 -5365 -5665 -2266 2783 6737 5914 550 -4716 -5767 -2745 2109 6149 6299 1444 -4342
1631 -4342 -5852 -3291 969 5456 6603 2009 -3959 -6010 -4043 165 4894 6358 2516 -3450 -6217
1646 -6217 -4654 -483 4031 5933 3120 -2863 -6155 -4985 -1217 3202 5917 3709 -2139 -5856 -5285
$$ packed form
1539g705K158M983N766K928l668p546m088J511M643N704L547k803p307m799Q35
1554e841M411N558L855j808o931n489J26M009N428M265r35o569n857p25L478N385
1570B360M614k50n976o141j476K964N276M853M78n185o455k231K540M965N002
1585E338J432m516o796k691K069M602N250K138l821o692l299J479M478N178K628
1600F777k942o382m140J034M262N014L136j886o199m814M70L893M889L742j278
1615E576n932n009l00L399N049L954q23n364n266j051L022M854M040J50m855n786
1631d342j510K561M260M487J147m594n968k051J967M208M729J464l842n966k767
1646f217J563M171M514J902k813n983l292J170L768M419K715k208n848l717N71
$$ plain form
1661 -5285 -1959 2774 5958 4241 -1270 -5393 -5442 -2317 2446 5762 4761 -282 -4856 -5350 -2439 1808
1677 1808 5539 5436 636 -4191 -5078 -2834 1243 5434 5837 1428 -3532 -5064 -3276 780 4996 5851
1693 5851 2270 -2922 -5189 -3504 203 4212 5879 2839 -2540 -5127 -3904 -598 3561 5794 3099
1708 3099 -2066 -5036 -4499 -1402 2946 5448 3443 -1419 -5063 -4884 -1879 2174 4977 3906 -929
1723 -929 -4817 -4802 -2437 1433 4938 4300 -249 -4280 -4853 -2884 1082 4738 4610 585 -3714 -4834
1739 -4834 -2949 734 4398 5062 1480 -3189 -4573 -2947 175 3999 5458 2173 -2509 -4280 -3312
1754 -3312 -274 3834 5440 2809 -1813 -4281 -3557 -563 3257 5231 3348 -1357 -4281 -3661 -1136
1769 -1136 2430 5024 3658 -993 -3958 -3890 -1921 1704 4729 3749 -458 -3863 -4415 -2504 1119 4248
$$ packed form
1661e285L326M733L184j717n511m123m9L125M763L316j001n043m574m94K911M247
1677A808L731j03m800m827q87K244M077M191M03m409m960j532J788M056M216Q55
1693E851l581n192k267J685L707M009J667l040n379k587J223L306M159K233k695
1708C099n165k970N37L097M348K502k005m862l644J79L005M053K803j071m835
1723i29l888J5K365L870L505o38m549m031n73J969L966L656j28m025m299j120
1739d834J885L683L664O64l582m669j384J626L122L824J459l285m682j771R68
1754c312L038M108J606k631m622k468P24K994L820J974j883m705k924O20K525
1769a136L566K594j366m651k965O8J969L625L025r80m207l405n52J911L623L129
$$ plain form
1785 4248 4023 117 -3832 -4535 -2565 486 3741 4285 627 -3467 -4273 -2908 -98 3518 4430 1262
1801 1262 -2674 -4227 -3253 -286 3277 4584 2113 -2069 -4228 -3157 -501 2869 4744 2784 -1592
1816 -1592 -3789 -3059 -832 2447 4833 3111 -994 -3387 -3248 -1289 2111 4568 3555 -213 -3349
1831 -3349 -3542 -1512 1540 4089 3910 138 -3349 -3579 -1903 792 3788 4053 375 -3052 -3679 -2501
1847 -2501 254 3440 3842 856 -2638 -3958 -2853 -90 2827 3851 1467 -2384 -3959 -2874 -601
1862 -601 2369 4060 1878 -2018 -3623 -3019 -984 2226 4102 2306 -1319 -3420 -3081 -1054 1967 3976
1878 3976 2908 -541 -3264 -3124 -1154 1576 3883 3408 -128 -2858 -2938 -1464 1213 3817 3539 343
1894 343 -2483 -3094 -1846 837 3414 3633 852 -2333 -3302 -2029 388 2926 3722 1204 -2238 -3356
$$ packed form
1785D248k25l906l949p03J970L051L255N44l658m094q06J365K810L616R12l168
1801A262l936j553R74K967L563J307k471m182k159J071K656L370J875j960m376
1816a592k197P30K227L279K386j722m105k393J39J959L400K457j013l768l136
1831c349j93K030L052K549j79l772l487k30J676K695K996K65l678l427o27J178
1847b501K755L186M02k986l494j320J105K763K917J024k384l851j575J085K273
1862f01K970J691k182l896j605O04K035L210J876j796l625k101L39K027L021K009
1878C976j068l449k723J40J970K730K307m75l536k730q0J474K677K604k78l196
1894C43k826o11J248K683K577K19k781l185r69J273K417K538P96k518l442j118
$$ plain form
1910 -3356 -2391 -228 2438 3542 1385 -1940 -3316 -2763 -718 2116 3411 1743 -1461 -3373 -2920 -1001
1926 -1001 1646 3329 2140 -1141 -3218 -2904 -1210 1331 3443 2510 -620 -2827 -2890 -1346 1135 3367
1942 3367 2844 -24 -2407 -2834 -1565 828 3191 3176 537 -2169 -2742 -1613 550 2973 3369 953
1958 953 -1931 -2690 -1844 184 2694 3455 1200 -1603 -2725 -2122 -211 2234 3324 1596 -1374 -2761
1974 -2761 -2301 -601 1823 3194 1805 -1112 -2759 -2502 -1020 1430 3114 1958 -862 -2671 -2686 -1326
1990 -1326 1090 2865 2217 -416 -2474 -2702 -1516 670 2814 2447 -30 -2252 -2621 -1605 393 2646
2006 2646 2732 418 -1842 -2444 -1723 193 2538 2977 912 -1591 -2406 -1758 1 2328 3140 1250 -1165
2023 -1165 -2358 -1835 -317 2043 3097 1641 -959 -2180 -1968 -600 1632 3022 1782 -705 -2224
$$ packed form
1910c356R65K163K666J104k157l325j376N53K045K834J295j668l204j912M53J919
1926a001K647J683j189l281k077L14J694K541K112r33l130k207o3J544K481K232
1942C367n23k868k383m27J269K393K363j5k639k706n73J129K163K423L96k416
1958I53k884p59Q46K028K510P61k255k803j122O03J911K445J090j728k970j387
1974b761M60J700K424J371j389k917j647K57J482K450J684j156k820j809j5J360
1990a326K416J775o48k633k058k28J186K186K144l67k477k222l69J016J998K253
2006B646Q6k314k260o02P21J916K345M39k065k503q15O48J759K327Q12j890k415
2023a165j193N23J518K360J054j456k600j221K12J368K232J390j240k487j519
$$ plain form
2038 -2224 -2157 -964 1231 2795 1968 -550 -2166 -2280 -1258 763 2640 2150 -280 -2123 -2319 -1484 375
2055 375 2396 2292 -35 -1988 -2358 -1602 83 2186 2399 325 -1710 -2295 -1701 -58 1945 2538 772
2072 772 -1358 -2129 -1699 -274 1808 2689 1127 -1131 -2013 -1746 -400 1614 2794 1437 -808 -1877
2088 -1877 -1675 -597 1340 2762 1752 -445 -1818 -1753 -809 1028 2583 1971 -246 -1775 -1905 -1030 647
2105 647 2353 2086 -67 -1740 -1927 -1250 339 2147 2112 220 -1627 -2060 -1499 16 1848 2163 440
2122 440 -1486 -2093 -1559 -258 1584 2222 694 -1256 -1973 -1667 -498 1426 2308 1106 -954 -1901 -1560
2139 -1560 -585 1208 2373 1361 -691 -1728 -1541 -698 1017 2374 1637 -348 -1597 -1567 -814 770 2255
2156 2255 1870 -65 -1497 -1624 -899 540 2075 1962 155 -1458 -1643 -1087 226 1880 2074 406 -1269
$$ packed form
2038b224O7J193K195J564q27k518j616j14J022K021J877m90k430j843j96Q35J859
2055C75K021j04k327j953l70P56J685K103K13k074k035n85N94J643K003N93j766
2072G72k130p71M30J425K082Q81j562k258q82K67J346K014J180j357k245j069
2088a877K02J078J937J422j010k197j373O5R44J837J555o12k217j529j30Q75J677
2105F47J706k67k153j673j87O77J589J808l5j892j847m33N61J515J832L15j723
2122D40j926o07N34J301J842O38j528j950p17L06J169J924Q82j202k060r47L41
2139a560R75J793J165j012k052j037J87Q43J715J357p37j985j249L0P53J584J485
2156B255l85j935j432j27P25J439J535j13j807j613j85N56J313J654J94j668j675
$$ plain form
2173 -1269 -1731 -1276 -65 1608 2029 559 -1145 -1799 -1413 -311 1320 2024 823 -1072 -1737 -1497 -545
2190 -545 1111 2004 1005 -830 -1683 -1590 -722 826 1950 1256 -506 -1571 -1591 -812 685 2038 1546 -266
2208 -266 -1522 -1498 -857 583 1949 1666 -8 -1261 -1448 -966 367 1833 1823 301 -1054 -1474 -1042 157
2226 157 1606 1938 598 -1049 -1520 -1114 -49 1462 1974 644 -901 -1484 -1162 -310 1255 1908 817
2243 817 -682 -1489 -1359 -514 967 1746 1052 -536 -1550 -1397 -725 663 1720 1159 -449 -1408 -1386 -890
2261 -890 547 1764 1328 -214 -1210 -1441 -940 332 1605 1410 106 -1050 -1409 -917 127 1496 1605
2278 1605 340 -1012 -1345 -1045 -30 1421 1793 485 -773 -1205 -1153 -124 1247 1761 708 -589 -1248
2295 -1248 -1194 -356 1012 1654 957 -502 -1215 -1172 -546 798 1752 1018 -402 -1154 -1241 -803 578 1574 1059
$$ packed form
2173a269m62M55J211J673M21j470j704o54L86J102J631P04j201j895o65K40R52
2190e45J656Q93r99j835q53R3Q68J548J124o94j762j065k0P79J497J353m92j812
2208b66j256K4O41J440J366k83j674j253j87M82J333J466j0j522j355m20M32J199
2226A57J449L32j340j647m71M06J065J511N12j330j545n83L22Q52J565O53j091
2243H17j499q07J30Q45J481P79o94j588j014J53O72J388J057n61j608r59K2M96
2261h90J437J217m36j542r96k31N01J272J273j95j304j156l59M92J044J369J09
2278A605j265j352l33L00J015J451L72j308j258m32N2J029J371N14j053j297o59
2295a248N4Q38J368O42o97j459p13M3O26J344R54p34j420p52q7M38J381R96n15
$$ plain form
2314 1059 -232 -1103 -1358 -926 339 1435 1254 -63 -1071 -1250 -879 49 1375 1342 3 -1059 -1198
2331 -1198 -1013 -32 1308 1392 240 -717 -1131 -1036 -173 1071 1478 516 -632 -1178 -1016 -290 969 1599 794
2350 794 -520 -1084 -1006 -460 877 1653 806 -404 -940 -991 -531 666 1480 942 -150 -840 -1106 -665 436
2369 436 1395 1194 -100 -913 -1042 -853 119 1361 1245 -10 -813 -1016 -886 35 1156 1142 160 -742 -1021
2388 -1021 -909 -213 995 1298 350 -677 -1060 -941 -365 828 1412 537 -620 -964 -943 -458 774 1424
2406 1424 595 -438 -874 -986 -491 657 1321 841 -237 -861 -911 -493 406 1343 960 -123 -761 -854 -615
2425 -615 250 1235 1060 -19 -694 -897 -798 168 1109 1092 160 -680 -931 -803 -75 899 1210 295 -648 -893
2445 -893 -825 -253 786 1219 331 -558 -825 -823 -423 778 1170 452 -364 -875 -851 -458 452 1126 705 -317
$$ packed form
2314A059j291q71k55M32J265J096j81j317j008j79L71R28J326l3j339j062j39
2331a198J85R81J340Q4j152r57m14R5Q63J244M07r62j148n46J62P26J259O30q05
2350G94j314n64P8N46J337P76q47j210n36n1M60J197Q14n38j092o90k66M41J101
2369D36R59k01j294q13j29J89R72J242j16j255q03k03J30R21J121j4r82r02k79
2388a021J12O96J208L03r48j027l83J19N76J193N84q75j157l44K1M85J232O50
2406A424q29j033m36j12M95J148O64m80j078o24n0M18Q99R37l83j083o38r3K39
2425f15Q65R85j75j079o75k03R9R66R41j7r32q40k51J28P28R74L11r15r43k45
2445h93O8N72J039M33q88q89k67KM00J201L92p18q16n11K4L93R10O74m21j022
$$ plain form
2465 -317 -804 -858 -537 354 1170 814 -180 -701 -834 -571 319 1093 895 -65 -650 -773 -652 151 1071 979 119
2486 119 -579 -819 -658 -1 976 1084 133 -513 -732 -682 -157 806 1051 329 -402 -767 -756 -274 685 1088 390
2507 390 -403 -777 -776 -371 466 1079 573 -334 -697 -745 -469 424 1030 621 -209 -699 -822 -542 299 963 712
2528 712 -81 -632 -777 -642 152 908 831 46 -539 -734 -615 -10 871 859 180 -466 -662 -686 -95 760 926
2549 926 301 -338 -606 -666 -170 641 967 309 -299 -612 -659 -232 544 1067 511 -232 -609 -670 -400 426 920
2570 920 587 -181 -534 -672 -483 277 853 614 -100 -553 -673 -564 157 813 692 -12 -508 -651 -633 20
2590 20 740 723 89 -378 -659 -656 -113 698 778 192 -348 -576 -580 -239 662 830 295 -248 -532 -629 -276 496 871
2613 871 399 -206 -470 -624 -380 450 901 518 -92 -427 -593 -453 335 890 568 -74 -359 -595 -507 187
$$ packed form
2465c17m87n4L21Q91Q16l56r94n21j33K63Q90P74j98r60n85j23J21Q03R20r2q60
2486A19o98k40J61O57R77J08r51o46k19N0N25R63K45p22p31l65J1M82R59M03o98
2507C90p93l74JM05Q37O13n06r07l63m8K76Q93O06m09q30m90j23K80Q41O64k51
2528G12p93n51j45J35P94P56p7p85n85j95J19O05Q81j2o79o46j96k4N91Q55J66
2549I26o25o39k68o0M96Q11L26o58o08l13m7M27P76N23n56p43l77o1K70Q26M94
2570I20l33p68l53j38J89P60N76k39p14m53j20J09P21O56j21p04m96j43J8O53
2590B0P20j7o34m67k81LN43Q11Q0n86n40k28mL41R01J68n35n43k84r7L53P72L75
2613H71m72o05k64j54K44Q30M51l83o10l35j66J40P88N55l22o42k85k36Q8O94
$$ plain form
2633 187 780 546 -8 -359 -565 -568 32 715 611 6 -385 -576 -610 -122 626 701 142 -339 -503 -572 -156 596
2655 596 781 112 -262 -471 -601 -274 508 757 279 -166 -432 -579 -371 392 839 382 -117 -409 -546 -443
2675 -443 272 813 426 -60 -347 -501 -490 218 784 533 6 -319 -523 -468 105 726 578 69 -290 -423 -553
2696 -553 -30 621 666 77 -273 -415 -572 -104 585 700 198 -225 -454 -539 -218 448 655 245 -182 -425 -565
2717 -565 -396 359 676 346 -182 -385 -591 -425 260 653 386 -49 -291 -523 -467 174 653 451 -30 -287
2737 -287 -518 -432 110 570 450 13 -297 -434 -495 -31 633 588 105 -185 -351 -555 -94 490 558 149 -176
2758 -176 -387 -472 -187 418 534 239 -159 -358 -426 -303 398 701 279 -105 -348 -455 -410 224 621 293 -62
2779 -62 -266 -547 -342 148 567 359 7 -274 -398 -433 6 468 446 -4 -226 -351 -501 -30 535 504 50
$$ packed form
2633A87N93k34n54l51k06lO00O83j04o05l91j91l4M88P48P5n59m81j64o9M16P52
2655E96J85o69l74k09j30L27P82K49m78m45k66j47K08P63M47m57m99k92j37J03
2675d43P15N41l87m86k87j54J1P08N66k51n27l25k04N5N73O21j48n09l59j33j30
2696e53N23O51M5n89l50j42j57M68O89J15n02m23k29q5L21O66K07m10m27k43j40
2717e65J69P55L17l30n28k03k06J66O85L93k67m35k42k32N6O41M79k02m81k57
2737b87k31Q6N42M60j20m37l10j37o1M64O64m5m83k90j66k04M61N84O8m09l25
2758a76k11q5K85O05J16k95l98j99o8J23P01L03m22l84k43j07M5O34L97l28l55
2779f2k04k81K05M90M19k08l52k81j24l5M39M62k2m50k22j25j50M71N65l1m54
$$ plain form
2800 50 -154 -401 -497 -33 471 489 202 -178 -368 -409 -128 321 537 281 -83 -264 -446 -248 355 594 294
2821 294 -36 -254 -533 -318 364 545 339 -10 -257 -476 -301 242 513 413 -7 -193 -374 -338 5 574
2841 574 378 -13 -163 -388 -561 -28 432 378 90 -118 -426 -447 -66 418 460 156 -146 -331 -411 -120 414
2862 414 464 136 -83 -201 -482 -244 340 492 214 2 -246 -495 -259 219 454 314 46 -265 -436 -257
2882 -257 173 467 335 -27 -141 -307 -392 123 509 328 44 -37 -376 -447 26 392 391 157 -82 -383 -387 -2
2904 -2 362 388 108 -126 -272 -357 -161 358 452 72 -28 -199 -533 -248 272 373 142 8 -236 -430 -210 261
2926 261 397 160 12 -230 -342 -272 142 463 215 24 -79 -358 -420 114 506 269 51 -63 -409 -342 125
2947 125 435 326 111 -88 -377 -375 -71 401 363 133 -21 -217 -416 -85 397 315 141 39 -252 -456 -203
$$ packed form
2800E0k04k47r6M64N04J8k87l80j90m1K81M49K16k56l64j81j82J98O03K39l00
2821B94l30k18k79K15O82J81k06l49k47k19J75N43K71j00m20j86j81L6L43N69
2841E74j96l91j50k25j73N33M60n4k88k08l08k1L81M84M2l04l02j85q0K91N34
2862D14N0l28k19j18k81K38N84J52k78k12k48k49K36M78K35j40k68l11j71J79
2882b57M30K94j32l62j14j66q5N15L86j81k84q1l39p1M73L66jk34k39l01mL85
2904bL64K6k80k34j46q5J96N19R4l80j00j71l34K85N20J01k31j34k44j94K20M71
2926B61J36k37j48k42j12P0M14L21k48j91j03k79o2N34L92k37k18j14l46O7M67
2947A25L10j09k15j99k89KL04M72l8k30j54j96j99L31M82q2j74j02k91k04K53
$$ plain form
2968 -203 291 350 134 14 -246 -365 -287 176 344 158 -48 -135 -348 -322 104 347 188 33 -129 -373 -356 99
2990 99 409 256 105 -107 -379 -378 2 335 282 59 -52 -265 -359 -127 369 282 109 -27 -176 -390 -144 307
3012 307 336 132 35 -197 -403 -129 281 364 151 57 -161 -337 -238 205 364 165 46 -64 -348 -305 208 360
3034 360 200 113 -79 -397 -310 86 295 250 51 -93 -306 -331 59 351 221 67 -84 -286 -361 -20 298 239
3056 239 100 11 -310 -408 -150 231 314 99 48 -181 -336 -178 261 300 128 31 -143 -318 -223 136 280 177
3078 177 52 -117 -362 -220 201 276 178 96 -41 -274 -304 128 315 218 70 -76 -300 -348 74 297 231 124
3100 124 -58 -291 -311 4 292 217 79 50 -234 -381 -93 240 262 90 2 -145 -392 -176 238 281 91 68
3122 68 -171 -408 -156 211 245 132 28 -140 -345 -237 105 281 207 115 -48 -344 -268 119 260 139 63 -60
$$ packed form
2968b03M94N9k16j20k60j19P8M63J68j86k06q7k13K6M26K43j59j55j62k44J7M55
2990I9L10j53j51k12k72JL80L33n3k23j11k13r4K32M96q7j73j36j49k14K46M51
3012C07K9k04r7k32k06K74M10Q3k13r4k18j76R9M43J59j99j19j10k84M3N13J52
3034C60j60q7j92l18Q7L96K09m5j99j44k13k5L90K92j30j54j51k02p5L41L18n9
3056B39j39q9l21r8K58L81Q3k15n1k29j55J58M39L9j72r7j74j75R5L59J44j03
3078A77j25j69k45J42M21P5r8q2j37k33l0M32J87r7j48j46k24m8M22K23o6j07
3100A24j82k33k0L15K88p5j38k9k84j47K88L33K2j72q8j47k47K16M14M3j90k3
3122F8k39k37K52L67L4j13j04j68k05J08L42J76p4r2j63k96P6L87J41j21p6j23
$$ plain form
3144 -60 -319 -257 51 246 197 93 -12 -228 -291 2 296 205 106 28 -227 -345 -17 190 218 65 50 -215 -336
3167 -336 -55 210 245 90 113 -183 -333 -135 168 222 79 115 -84 -299 -216 125 165 53 77 -105 -369 -238
3189 -238 111 236 135 61 -43 -268 -261 74 195 107 86 -21 -299 -274 56 186 155 95 22 -290 -319 -32 288
3212 288 207 108 37 -184 -340 -37 250 244 165 61 -137 -341 -102 176 225 178 78 -92 -281 -126 191 185 179 104
3236 104 -52 -293 -200 158 221 112 105 -72 -334 -250 85 255 173 174 -14 -284 -307 41 215 138 100 25 -268 -347
3260 -347 44 183 114 93 92 -230 -294 -21 181 181 106 104 -199 -292 -60 210 250 103 72 -163 -268 -151 141 149 111
3285 111 136 -30 -350 -168 145 192 99 111 -69 -300 -175 166 237 155 109 -30 -268 -236 61 234 136 76 69 -238
3309 -238 -270 33 198 126 116 46 -197 -283 -34 156 144 97 59 -193 -294 -97 179 127 50 87 -82 -297 -36 140
$$ packed form
3144f0k59O2L08J95m9j04j05k16o3K93K94r1r9p8k55j18L28K07K8j53j5k65j21
3167c36K81K65L5j55K3k96j50J98L03N4j43L6j99k15Q3L41M0j12K4j82k64J31
3189b38L49J25j01p4j04k25PL35J21q8k1j07k78K5L30J30l1o0p3l12k9K87L20
3212B88q1r9p1k21j56L03K87op9j04j98k04K39K78M9m7j00j70j89J55L17oop5
3236A04j56k41R3L58O3j09pj77k62Q4L35J70q2Jj88k70k3L48J74p7l8p5k93p9
3260c47L91J39o9k1jl22o4K73K02%p5kl03r3K32K70M0j47l1k35j05J17K92Ql8
3285A11K5j66l20J82L13M7r3J2j80k31J25L41P1q2m6j39k38L2K97J73r8o0pl07
3309b38l2L03J65p2j0p0k43q6K49J90j2m7l8k52j01J97K76n2p7L7j69k15K61J76
$$ plain form
3333 140 170 31 99 -56 -310 -167 132 174 72 79 -74 -243 -114 41 185 134 135 39 -265 -302 80 224 72
3356 72 132 84 -244 -311 50 159 75 155 55 -224 -176 -27 176 167 112 40 -175 -312 -77 188 145 60 114 -99 -305
3381 -305 -63 119 137 117 121 -105 -302 -89 36 95 148 91 -117 -261 -188 24 194 102 128 -7 -260 -198 94 108
3405 108 12 177 13 -224 -188 14 75 128 167 45 -178 -222 -32 155 135 171 30 -156 -271 -3 196 129 121 142
3429 142 -131 -345 -19 107 80 88 146 -143 -235 -120 133 90 131 194 -137 -264 -183 86 127 87 27 -51 -248 -169 68
3454 68 72 76 85 25 -214 -172 34 59 116 148 27 -238 -269 -35 155 142 157 49 -199 -243 -12 156 18 123 94 -142
3480 -142 -254 -37 92 57 143 106 -114 -285 -107 127 114 105 136 -35 -308 -117 187 94 98 140 -21 -237 -109 80
3504 80 126 68 130 -20 -284 -193 56 118 81 161 42 -213 -161 59 87 94 110 34 -230 -266 8 72 61 181 71 -181
$$ packed form
3333A40L0j39O8j55k54J43K99M2j02Pj53j69J29J55J44n1Jr6l04l7L82J44j52
3356G2O0m8l28o7L61J09q4Q0j00k79M8J49K03rn5p2k15j37K35K65m3q5N4k13k06
3381c05K42J82J8k0Mk26j97K13J25N9N3n7k08j44P3K12J70r2K6j35k53O2K92J4
3405A08r6J65j64k37L6K02O1N3L9j22k23m4J90J87k0L6j41j86j15K68J99o7qK1
3429A42k73k14L26J26k7QN8k89r2J15K53m3M1O3l31j27Q1K69M1m0o0p8j97P9K37
3454F8MMRo0k39M2K06K5N7L2j21k65l1K34J90j3J5j08k48m4K31J68j38J05k9k36
3480a42j12K17J29l5Q6l7k20j71J78K34j3rL1j71k73J91L04r3MM2j61k16J28J89
3504H0M6n8O2j50k64R1K49O2l7Q0j19k55N2K20K8PJ6p6k64l6K74O4j1J20j10k52
$$ plain form
3530 -181 -253 -50 84 63 122 95 -90 -241 -35 83 71 89 156 -85 -312 -23 80 60 70 188 -61 -253 -50
3553 -50 60 24 136 126 -26 -196 -193 89 86 107 132 60 -247 -171 -23 91 80 137 63 -221 -185 14 70 126 133 114 -116
3580 -116 -263 -12 98 34 172 121 -118 -263 -17 54 70 128 158 -141 -245 -100 86 54 137 134 -33 -192 -110 144
3604 144 64 123 164 -3 -204 -188 64 94 44 182 77 -204 -129 55 78 70 141 17 -238 -187 -3 88 23 88 53
3629 53 -121 -220 -10 61 39 126 114 -133 -228 -61 137 60 138 90 -97 -211 -15 48 18 124 152 -55 -276 -137
3653 -137 119 63 100 158 -52 -268 -120 79 50 129 153 -5 -206 -174 55 59 32 170 31 -200 -134 16 64 78
3677 78 198 118 -162 -177 34 95 110 132 85 -159 -227 -42 54 84 183 80 -113 -207 -38 91 85 120 94 -56 -231
3702 -231 -48 14 46 71 143 -95 -279 -124 71 89 131 194 -57 -204 -164 105 35 137 150 5 -206 -173 29 26
$$ packed form
3530a81p2K03J34k1N9k7j85j51K06J18j2J8O7k41k27K89J03k0J0J18k49j92K03
3553e0J10l6J12j0j52j70LK82lK1K5p2l07P6J48J14j1N7p4k84L6J99N6N6Pj9k30
3580a16j47K51J10o4J38n1k39j45K46P1J6N8L0k99j04J45J86l2Q3lj67j59Q2K54
3604A44q0N9M1j67k01J6K52L0n0J38j05k81P5J84K3qP1j24k55N1J84R1o5O5l5
3629E3j74r9K10P1k2Q7j2k47r5J67J98p7P8m8j87j14J96O3l0J06K8k07k21J39
3653a37K56n6L7N8k10k16J48J99k9P9K4j58k01L2K29Mk7J38j39k31O6J50M8J4
3677G8J20q0k80j5K11O1J5K2m7k44o8J85R6L0R9j03j93r4J69J29oL5k6j50j75
3702b31J83O2L2K5P2k38j84J55J95J8M2O3k51j47M0K69p0J02J3j45k11L3K02l
$$ plain form
3726 26 50 121 44 -183 -203 -8 78 65 175 67 -127 -190 25 59 90 110 71 -134 -193 -49 40 70 154 140 -118 -218
3752 -218 -39 84 67 153 144 -61 -188 -102 -24 -17 126 89 -35 -260 -119 44 22 123 117 -44 -206 -132 23 -1 55
3777 55 216 18 -181 -118 -6 31 63 192 100 -201 -204 -26 2 45 150 142 -155 -171 24 48 40 190 122 -118 -207 -40
3803 -40 63 21 147 171 -120 -243 -12 65 58 150 197 -78 -225 -81 -13 89 92 184 14 -259 -172 11 -31 77 189
3828 189 9 -199 -146 31 -58 45 236 75 -150 -176 -1 26 91 193 28 -157 -182 29 -6 66 160 137 -109
3851 -109 -200 12 -17 36 196 105 -163 -160 -78 11 -38 116 197 -48 -216 -111 64 46 79 168 -14 -238 -73 34
3875 34 4 140 151 -51 -214 -76 54 54 98 201 44 -162 -171 52 19 22 191 98 -181 -157 -4 30 16 163 99
3900 99 -189 -162 -143 10 61 154 138 -130 -153 -63 26 -14 92 229 -88 -202 -78 29 -19 181 164 -103 -180 -59
$$ packed form
3726B6K4P1p7k27k0J95Q6j3J10j08j94o3K15L4L1K0l9k05n9J44Q9L0Q4j4k58j00
3752b18J79J23j7Q6rk05j27Q6P8PJ43l7j24k25J41J63k2J01oj61j62P4J55k4N6
3777E5J61j98j99O3J12L7L2J29r2l01lJ78K8M3J05qk97j6J95K4qJ50o8k40q9J67
3803d0J03m2J26K4k91j23K31P7pR2M7k75j47J44O8J02LR2j70k73Q7J83m2J08J12
3828A89j80k08N3J77q9J03J91j61k25k6J75K7O5J02j65j85k5K11l5P2R4k3k46
3851a09r1K12k9N3J60r1k68LQ2Q9m9J54Q1k45j68J05J75j8L3Q9j82k24J65J07
3875C4l0J36J1k02j63J38J30%M4J03j57k06rK23l3LJ69r3k79K4J53L4j4J47o4
3900I9k88K7J9J53N1R3j6k68k3R0Q9m0J06J37l17j14J24J07m8K00j7k67p7J21
$$ plain form
3924 -59 -39 -22 123 163 -40 -207 -126 17 -43 58 159 83 -212 -146 0 24 96 200 38 -165 -182 2 1 20 143
3949 143 47 -126 -135 -10 28 31 142 108 -72 -199 -27 28 -14 164 115 -113 -198 -39 23 21 100 167 -121 -198 -49 20
3975 20 10 138 174 -65 -173 -120 -22 -15 140 185 -1 -178 -63 43 -32 102 219 32 -152 -109 10 30 86 163
3999 163 17 -150 -137 -54 8 21 127 113 -161 -138 -23 20 -15 151 113 -146 -200 -27 -56 55 159 149 -64 -203
4023 -203 -38 17 -29 167 166 -100 -147 -29 26 -25 115 136 -28 -166 -84 15 31 105 212 -11 -162 -164 -1 8 62 209
4049 209 65 -109 -214 -35 6 59 127 75 -170 -125 16 24 77 194 39 -196 -145 -7 -47 36 163 92 -84 -110
4073 -110 -2 -45 14 119 189 -54 -171 -38 -36 -67 120 157 -27 -193 -128 -15 20 119 176 8 -172 -22 6 -37
4097 -37 26 182 43 -138 -112 -15 -86 49 184 24 -152 -142 10 -18 103 220 -3 -98 -95 -3 -27 8 199 131 -121
$$ packed form
3924e9K0J7J45M0k03j67Q1J43o0J01J01p6k95O6J46K4P2J04j62k03j7J84jJ9J23
3949A43r6j73rJ25L8LJ11l4j80j27J72N5m2J78m9k28q5J59O2kP9O7k88p7J49O9
3975B0j0J28L6k39j08N3R8PJ55M5j86j77J15J06p5J34J17j87j84M3J19K0N6P7
3999A63j46j67J3Q3O2J3J06j4k74K3J15M3l5J66l8k59n4J73k9J11J04j0k13j39
4023b03J65N5m6J96jk66m7J18N5n1J40K1j64j38Q2R9J6P4J07k23j51kJ63RN4J47
4049B09j44j74j05J79M1N3O8n2k45M5J41QN3J17j55k35N1J38m0Q3J27p1j76k6
4073a10J08m3N9J05P0k43j17J33Kl1J87L7j84j66O5J13L5R9N7j68j80J50K8m3
4097c7O3J56j39j81K6R7p1J35J35j60j76J0J52k8J21J17k23r5LR2k4L5J91o8k52
$$ plain form
4122 -121 -166 43 -27 -35 143 177 -80 -132 -59 -13 12 139 170 -106 -196 -46 16 31 81 186 20 -234 -94 28 -27
4147 -27 76 224 1 -170 -105 23 -20 60 183 73 -116 -52 -14 -4 13 207 25 -154 -82 36 25 39 194 73
4171 73 -118 -220 16 -64 -10 186 145 -137 -138 22 -49 -44 157 178 -121 -148 -54 -42 14 117 137 -15 -177 -25 -5
4196 -5 -36 156 149 -1 -157 -103 -30 36 118 138 -36 -199 -135 6 7 80 213 52 -111 -49 17 -15 0 236 26 -56
4222 -56 -142 39 14 18 185 82 -131 -119 -46 -15 -21 142 162 -95 -157 -16 34 -28 155 150 -25 -185 12 -17 -12 137
4248 137 195 -12 -155 -42 -44 -86 66 184 -34 -165 -66 8 -29 64 193 42 -151 -100 -90 21 26 153 70 -163
4272 -163 -38 -11 -14 46 124 94 -100 -75 -73 10 29 153 147 -192 -102 -5 -10 -2 110 127 -79 -107 -38 -71 -9 120 163 -49
4300 -49 -91 -60 -35 -35 122 171 -31 -113 -5 -40 -30 129 140 -13 -129 -100 -21 -72 23 184 57 -141 -93 -12 -7 34 162
$$ packed form
4122a21m5K09p0qJ78L4k57n2P3M6K5J27L1k76r0J50O2J5N0J05j66k54J40J22n5
4147b7J03J48k23j71O5J28m3Q0J23j10j89O4L8J0J7J94j82j79P2J18j1J4J55j21
4171G3j91j02K36q0N4J96m1k82jJ60p1NK01K1k99k7R4J2N6J03K0j52j62J52K0
4196el1J92pj50j56N4P3O6Q2K0j74j63O4J41JP3J33j61j63O2O6l2J5K36k10q2
4222e6q6J81k5MJ67j03k13J2P3L1oJ63K0k57o2J41N0o2J83nj75j60J97k9NJ49
4248A37N8k07j43J13km2J52J18k18j31R9P4l7R3J29j51j93N1J0J11NJ27q3k33
4272a63J25K7lO0P8l0j94K5KQ3J9J24ol39R0R7nQJ12J7k06k8O9l3O2J29M3k12
4300d9m2L1K5%J57M9k02q2J08l5J0J59J1j53j16K9P9n1R5J61j27j98M8Q1NM1J28
$$ plain form
4327 162 71 -134 -78 -23 -14 16 157 108 -136 -131 -32 -32 -13 179 157 -128 -169 -21 -116 -20 99 170 -110 -145 -14 0 4
4354 4 89 156 -43 -150 -39 7 -59 154 165 -58 -156 -47 14 -97 86 138 26 -181 -56 -52 -57 44 167 16 -165
4379 -165 -98 34 -28 5 173 27 -97 -106 -43 -73 43 183 76 -88 -76 -24 -10 -22 199 85 -62 -97 20 -34
4403 -34 16 180 132 34 -122 -7 -5 -64 114 183 -44 -177 -43 -33 -52 114 134 -21 -109 -71 -17 -71 69 155 2
4428 2 -139 -65 -3 -68 77 167 58 -153 -55 7 -56 44 169 38 -90 -92 -39 -62 -11 115 111 -144 -161 -29 -98 -1
4454 -1 118 92 -88 -122 -21 -37 -21 173 122 -73 -159 5 -13 -20 70 154 -46 -177 -8 4 -67 58 169 -29 -80
4479 -80 -8 17 -41 94 191 23 -129 -129 -83 -24 25 233 59 -138 -77 -1 -83 -20 205 80 -112 -105 12 -67 12 154
4505 154 98 -79 -66 -26 -67 10 118 122 -75 -67 -42 1 -33 120 158 -45 -121 -19 -72 -96 99 155 -24 -131 -72 -106
$$ packed form
4327A62r1k05N6N5RL0J41m9k44NR9%J9J92k2k85m1J48r5R6J19P1k80l5J31J4M
4354DQ5O7j99j07J11M6o6K13J1k23r8J09O1j11J83N2j12k07J25MnJ01J23j51j81
4379a65O7J32o2L3J68j46j24rO3l0J16J40j07j64J2N2J4j2K21j14j47l5J17n4
4403c4N0J64m8r8j56J15Kn9J78O9k27j33J34J0j9J66K0j55q8L8N4n4J40Q6j53
4428Bj41P4O2o5J45R0j09k11R8O2o3J00J25j31j28kN3k3N1J26mk55j7J32o9R7
4454aJ19k6j80l4J01j6J6J94n1j95q6J64j8pR0Q4k00j31J69J2p1J25J11j98n1
4479h0P2K5n8J35R7j68j52%M6N9M9K08j74j97O1P6q2O3K25j25j92PJ17p9P9J42
4505A54n6j77J3M0m1P7J08Mj97QK5M3l4J53L8k03p6J02n3k4J95N6j79j07N9l4
$$ plain form
4531 -106 -100 70 159 11 -92 -138 -15 -31 -4 138 29 -152 -93 -70 -70 20 96 6 -123 -30 -30 -87 17 158 66 -146
4557 -146 -86 -26 -21 40 102 149 -59 -132 -72 -11 -33 189 77 -96 -126 -57 -2 -20 99 107 -71 -154 -52 -37 -82 86 129
4584 129 -9 -69 -69 -71 -1 45 138 27 -119 -71 -62 -100 75 188 14 -109 -74 -18 -62 27 145 63 -53 -62 -27 -58 -6
4611 -6 201 117 -72 -78 70 -50 -27 135 78 -104 -139 13 -67 -40 107 112 -52 -111 -13 -34 -50 146 109 -62 -73 -22
4637 -22 -43 -69 96 147 -60 -66 -55 -31 -19 26 125 23 -101 -41 -45 -20 38 134 78 -58 -67 33 -29 16 163 34 -150
4664 -150 -102 -49 -71 -20 186 43 -40 -40 -81 -57 14 126 102 -51 -103 -6 -12 -55 108 147 -24 -85 23 -70 -64 113 123
4691 123 -46 -84 -16 -22 -24 76 128 10 -99 -109 -19 -82 83 145 59 -109 -23 1 -24 -4 195 54 -111 -32 50 -78
4717 -78 -16 162 75 -9 -31 -67 -76 -23 179 80 -73 -83 7 -54 15 113 135 -69 -39 -9 -61 -58 128 130 -84 -97 -11 -26 -38
$$ packed form
4531a06OJ70Q9j48j03m6J23j6K7J42j09j81N9K3%R0P6r0j29R3%n7J04J41r2k12
4557a46O0O0NO1O2M7k08p3O0O1k2K22j12j73l0O9N5j8J19Qj78q3J02J5m5J68M3
4584A29j38o0%kP0M6R3j11j46M8Rl8J75J13j74j23L5N6m4Q9J18q2j16rL5l1N2
4611fK07q4j89oJ48j20K3J62n7j82l5J52q0K7J47Nj64n9R8k1j6J96l7j71j1N1
4637b2k1k6J65N1k07oJ1K4J2M5R9j02j24O0mK5N8R6n6j36rJ00o2M5J47j29j84
4664a50M8N3k2N1K06j43q3%m1K4P1J12k4j53n2R7om3J63L9j71o1J08r3OJ77J0
4691A23j69l8O8okJ00N2j18j09j0R0o3J65O2q6j68Q6K4k5K0J99j41j65P9Q2j28
4717g8O2J78q7q4k2l6rN3K02r9j53j0R0o1O9R8K2k04L0L0n2LJ86Kk14j3Q6j5j2
$$ plain form
4746 -38 79 145 -4 -120 2 -23 -86 36 143 -5 -74 10 -10 -26 27 161 38 -93 -8 -95 -71 17 139 13
4770 13 -127 -13 -5 -73 39 133 125 -137 -27 -14 -47 -30 150 108 -85 -33 22 -78 -11 127 74 -41 -116 -47 -70 -96
4796 -96 118 161 -20 -76 -39 -17 -93 30 138 -22 -84 -12 -59 -27 85 167 32 -103 -26 -7 -123 -18 60 106 -163
4821 -163 -51 -19 -102 -35 174 28 -42 -75 35 -94 56 141 80 -88 -43 -28 -53 -7 146 101 -67 -27 -33 -23 -30 134
4847 134 132 -16 -72 -25 -33 -55 63 97 -58 -50 -79 -44 -100 88 127 2 -67 -29 -32 -62 27 143 -23 -104 -50 -16 -79 62
4875 62 114 10 -57 -98 -44 -81 49 205 92 -146 -27 29 -73 -11 99 36 -57 -21 -6 -55 -5 98 74 -30 -42
4900 -42 -41 -96 -1 122 150 -31 -106 -19 -10 -45 134 102 -58 -154 -52 -29 41 72 112 -16 -86 -39 -6 -33 33 167 7
4927 7 -89 -24 -50 -67 15 118 81 -106 -9 -53 -63 9 131 33 -90 -20 13 -122 -22 108 91 -42 -119 18 -82 -33
$$ packed form
4746c8J17O6j49j16J22k5o3J22J07j48o9Q4k0j6N3J34j23j31Q5q7K4Q8J22j26
4770A3j40J14Qo8J12R4qk62J10J3l3J7J80m2j93N2N5j00O7J38n3j15p5O9k3k6
4796i6K14M3j81n6L7K2p6J23J08j60o2P2m7L2J12Q2j35j35P7J9j16J05P8M6k69
4821a63J12L2q3O7K09j46p0l3J10j29J50Q5o1j68M5J5k5M6J53m5j68M0oJ0pJ64
4847A34kj48n6M7qk2J18L4j55Qk9L5n6J88L9j25o9L8ll0Q9J16j66q1N4L4o3J41
4875F2N2j04o7m1N4l7J30J56j13k38J19N6j02O2J10o3r3L6J5m9N0J03k4j04j2
4900d2Jn5R5J23K8j81p5Q7Rl5J79l2j60r6J02K3P0L1M0j28p0M7L3k7O6J34j60
4927Gr6O5k6j7Q2J03l7j87R7m4j0P2J22r8j23P0L3j35J00J30j7j33p7J37j00M9
$$ plain form
4953 -33 96 95 -55 -133 -38 -48 -25 162 109 -14 -66 0 -15 -67 30 111 8 -83 20 -44 -30 98 160 4 -80 -24 -29
4980 -29 -66 118 192 -2 -42 -19 -10 -32 48 127 -9 -62 4 48 -119 87 143 47 -88 -21 19 -63 66 85 124 -49 -78
5007 -78 -11 -80 -44 169 86 -78 -86 34 -74 -13 80 107 -44 -35 -1 -22 -26 17 137 35 -46 -12 -30 -34 68 169 33
5034 33 -31 -10 -7 -67 34 136 4 -63 -42 -29 -33 51 108 -3 -67 -40 -66 -77 37 128 60 -73 -78 11 -60 -10 150 107
5062 107 -98 -91 -54 4 -3 143 50 -43 -28 -53 -21 -52 72 85 -18 -73 3 -79 -68 59 114 -95 -87 -21 -38 14 129 33
5090 33 -15 -17 -12 -15 -33 19 68 -13 -33 -32 5 -67 -11 145 32 -64 -62 44 -107 -21 138 85 -52 1 23 -81 22 61 70
5119 70 -37 -60 -9 -8 -83 98 133 5 -53 -60 -64 -40 65 111 -22 -81 -13 -17 -65 49 58 2 -48 59 0 -33 46 91 -7
5148 -7 -71 -54 -63 -101 2 120 12 -99 -35 44 -35 71 135 31 -43 2 -21 -59 -67 59 58 16 -7 3 -78 -60 136 66
$$ packed form
4953c3J29jj50p8R5j0K3J87n3j23n2O6j5n2R7Q1j03r1J03o4J4J28O2j56q4N6n
4980b9l7J84P4j94m0K3Rk2Q0P9j36n3O6M4j67K06N6r6j35O7M0q2J29J9L9j73k9
5007g8O7o9L6K13q3j64qJ20j08O1R3K7j51RL4k1mM3J20j02q1L4j8mJ02J01j36
5034C3o4K1Lo0J01J02j32o7K1J3mQ4N7j11o4K7k6j1J14R1o8j33nQ9p1N0J60m3
5062A07k05PL7N8pJ46r3r3J5k5L2l1J24J3j03n5P6q2J1J27N5k09QO6j7N2J15r6
5090C3m8kNlj8N2M9q1k0JL7p2N6J56j13r6KJ06j51Q6J59n3j37N3K2j04J03L9R
5119G0j07k3N1Jp5J81L5j28n8pmK4J05M6j33n9O8mm8J14Rn6n0J07n9l3P9M5r8
5148go4J7rl8J03J18j08j11O4P9p9J06O4j04p4M5k3l8qJ26jm2k3J0q1J8J96p0
$$ plain form
5176 66 -71 16 62 -31 -8 78 89 -53 -41 -15 -64 -44 57 113 45 -32 1 -27 -69 50 123 -1 -84 -18 -15 -91 48 186
5204 186 -8 -23 1 -70 -79 56 126 15 -31 -66 10 -45 10 110 44 -91 -93 -11 -51 -32 100 78 -31 -2 -43 -53 28
5231 28 144 67 21 -14 11 -26 -47 81 96 -22 -25 -24 -30 15 80 90 -48 -76 57 -46 -62 56 88 8 -58 44 -22 -66
5259 -66 56 119 -6 -23 -6 23 -50 -16 142 28 -73 -66 -36 -72 -58 120 79 -56 -75 -37 -96 -8 81 99 -43 -46 -44 -31
5287 -31 -74 79 56 -97 -74 -26 -51 -59 106 96 -34 -84 19 -47 -43 85 139 -16 -23 21 -3 -47 63 68 53 -61 8 -49
5315 -49 -39 61 101 22 -72 -1 4 -65 -33 115 34 -85 1 -31 -83 4 88 75 -52 -53 34 -58 10 78 71 -56 -52 66 -60
5344 -60 -8 101 84 4 -93 23 -63 -6 124 98 7 -53 44 -40 -23 -9 102 2 -37 -6 0 -30 41 121 9 -34 -23 -35
5372 -35 -118 0 152 -17 -48 -25 -20 -50 43 67 13 -37 -59 -14 -10 -28 45 21 -19 25 48 -27 4 87 79 -30 -12 24 -38 17
$$ packed form
5176F6j37Q7M6r3K3Q6J1j42J2K6m9K0J01N6o8p7L3k8m2J19P3j24q3O6Lp6J39J38
5204A86j94j5K4p1rJ35P0j11m6l5P6n5N5J00o6j35kQ2m0J9J32k2j09K9m1j0Q1
5231B8J16p7m6l5K5l7k1J28J5j18lJoM5O5J0j38k8J33j03j6J18L2q0o6J02o6m4
5259f6J22O3j25j7J7K9p3L4J58j14j01PL0l6J4J78m1j35j9L8n9Q8Q9J8j42lKJ3
5287c1m3J53k3j53K3M8k5qJ65j0j30n0J03o6MJ28N4j55pM4k4m4J10Nj5j14O9n7
5315d9J0J00M0p9r4P1No9L2J48q1j19Q6l2n2Q7Q4j3j27jQ7r2O8O8pj27MJ18j26
5344f0N2J09j7q0r7J16q6N7J30k6r1o0R7q4J7J4J11j00l9L1Ol0P1Q0j12m3J1j2
5372c5q3J18J52j69l1K3Nl0R3K4n4n0k2M5Mj8P3k4m0M4K3p5L1Q3qj09J8L6o2N5
$$ plain form
5402 17 100 77 -33 -16 17 -38 -47 107 40 -44 -68 9 -82 -49 93 62 20 -99 19 5 -34 60 84 -25 -46 16 20 -46
5430 -46 45 81 70 -24 -18 11 -55 14 80 -29 -12 -66 -52 -44 3 86 66 -29 -36 31 -21 31 86 18 -40 -50 4 -16 -42 85 115
5461 115 -27 -111 82 -69 -49 63 60 -20 -79 43 -74 -57 75 15 -18 -110 45 -51 -65 44 61 15 -43 -24 40 -34
5487 -34 30 148 13 -30 -21 62 -62 27 51 22 -43 31 -30 -23 11 73 36 -73 28 -53 -33 -33 104 25 -34 -39 -34 -70 -26 59
5517 59 44 25 -9 21 -49 -4 63 86 13 -49 -30 -23 -38 16 71 -41 -65 43 -8 -33 42 110 2 -10 16 -66 -49 -27 74
5546 74 79 -72 -25 -11 -40 41 61 26 28 -26 29 -81 32 106 46 16 -12 -35 8 2 36 35 -32 -20 55 -67 37 105 64 -24
5576 -24 -41 32 -32 -23 98 94 11 18 -48 -9 -23 67 59 -34 -47 53 18 -53 16 43 23 -10 47 69 -62 16 50 64 -13 -17 -7
5607 -7 -48 30 76 51 -14 -10 40 -36 -37 46 87 11 16 46 -50 -28 76 76 -8 0 -24 -10 -53 78 67 -25 -46 -7 -12 -71 16 48 17
$$ packed form
5402A7Q3k3j10J7L3n5rJ54o7q4k4P7r1L3J42l1m2j19J18j4l9R4K4j09k1O2Mo6
5430d6R1L6j1r4OK9o6O9O6j09J7n4J4QM7Q3k0r5pO7n2N2N5o8n8j0N4k0k6J27L0
5461A15j42q4J93j51K0J12lq0n9J22j17J7J32o0l3r2J55r6j4J09J7m6n8J9O4p4
5487c4O4J18j35m3RQ3j24Q9K4k9o5P4o1PL4O2l7j09J01q1K0%J37p9n9nNl6M4Q5
5517E9j5j9l4L0p0M5O7K3p3o2J9Pj5N4N5j12k4J08n1k5P5O8j08j2K6q2J7K2J01
5546G4Nj51M7J4k9Q1K0l5Kn4N5j10J13P4o0l0k8k3M3oL4jo7J2P5j22J04O8m1q8
5576b4j7P3o4RJ21mq3Po6L9j4R0qr3j3J00l5p1O9K7k0l3N7K2j31P8L4J4p7mJ0
5607gm1P8M6k5o5MN0p6jQ3M1p6NL0r6K2J04%q4Qk4J4m3J31j1r2k1L9nn9Q7L2l1
$$ plain form
5640 17 -40 42 -49 -55 47 72 -36 -49 39 -4 -48 21 104 21 -54 -55 49 -50 -50 119 36 -33 -8 15 -84 61 109 34 -43
5669 -43 -65 -10 3 -10 81 50 -43 -19 -27 -38 -45 8 35 -54 -9 15 -21 -46 59 40 -33 12 -6 -43 -66 -22 76 -23 -31 -58 -29
5700 -29 -68 -14 79 21 -35 -30 3 -44 57 70 35 -45 20 -10 -119 12 80 8 -89 -44 -11 -63 -37 41 10 13 -71 19 -26 -4
5730 -4 37 10 -42 -90 16 21 24 95 48 -11 -24 -72 -34 -29 34 71 15 -38 -9 -45 1 4 67 -31 -17 17 -34 -51 -26 100 48 -6
5762 -6 15 -55 -16 7 82 7 -2 41 3 -53 2 -3 52 -56 -39 -49 -45 -107 101 58 -35 10 2 -33 -6 115 52 -33 -37 -25 -36 29
5794 29 57 20 15 -79 18 21 -11 45 56 8 -68 -25 -52 -68 -10 84 -4 -23 -29 -22 -33 11 30 16 -47 -34 10 -18 -26 56 26 -102
5826 -102 -39 -9 -92 -8 40 75 -30 -58 2 -25 21 69 23 -45 -4 12 -18 -36 -13 34 1 -14 -60 -59 -91 90 33 -15 -58
5855 -58 -3 -63 -66 88 31 -64 -59 36 -12 37 64 127 -29 -16 -72 17 -25 -18 102 34 -73 9 -19 -69 18 50 -16 1 -12 -63
$$ packed form
5640A7n7Q2r1oJ02K5j08j3Q8m3m4O9Q3q3p5jJ04r9%J69q3o9K5K3r9J45M8p5p7
5669d3k2N5J3j3R1l1r3K4qj1pN3K7q9M5K4l6k5J05j9p3M5j8l7k3M4R8r9qk7K9
5700b9l9N4R3n8n6NL3m7J01J3l5q0O5l0j09J31O8p2r7M5L3n2K6P8l1Lq4R0m5K2
5730dM1k7n2m8J06NLP1m7n9j3m8L8NO3L7n6n3K9l6M6LO3r8J4L4n1j7K5J26n2n4
5762fK1p0L9K3P5p5rM3l8n6N5nN5j08J7j0Mo2K08m3r3M5ql5K7J21o3q5mJ2j1O5
5794B9K8l7nr4R7Ll2N6J1m8p6M3k7j6N8R4q8j9oPj1M4J9j4o3J3M4k8qQ2l0j28
5826a02O3L0q3Q4M8L5j05k8O0k7M6M8m6o8M1J6l0j8K3M7l3j5m6Jl2J81n7m8m3
5855e8N5o0lJ54n7r5NR5m8M9K7O3j56J3n6Q9m2PJ20o8j07Q2k8n0Q7L2o6J7j3n1
$$ plain form
5885 -63 -69 46 74 -21 -56 -48 -47 3 -5 29 -13 -60 -7 28 -44 -28 -7 14 -89 -37 -4 -65 -40 63 34 -8 -67 59 -7 -20
5915 -20 46 102 -28 -8 -1 -58 27 25 69 -11 -12 -23 68 -26 21 52 45 -3 -13 23 -60 -11 35 45 -94 -27 -6 -44 13 40 20
5946 20 -70 -52 12 -53 -52 22 7 -25 13 -2 -25 -20 17 30 -27 12 22 22 -34 17 90 -19 8 3 -1 -28 27 37 -4 -14 -27 -42
5978 -42 -35 22 -3 1 -35 -47 14 -39 39 38 1 5 -38 22 -77 28 64 3 -47 -2 6 -46 -3 64 52 -93 12 -20 -35 -22 -5
6009 -5 -23 -91 -15 10 -45 -40 43 25 -12 -43 6 -15 -66 88 64 58 -62 6 18 -61 55 70 30 -50 1 -7 8 -37 39 27 8
6040 8 10 -14 -14 9 126 -25 -57 39 -18 -9 39 69 -11 -31 -31 -23 -2 -6 70 27 -14 15 5 -59 -22 18 30 11 16 3 -23 -40 27
6073 27 40 -13 -56 -48 -51 -60 41 16 -13 -9 9 -4 -20 31 95 -92 -26 -8 -27 -20 -8 63 -37 -33 -37 -18 -24 -34 57 -32 -18 -11 -14 -25
6107 -25 -26 47 26 6 -19 -8 -25 -36 59 56 9 0 0 -24 -33 101 15 31 -34 -35 -17 -44 58 39 -80 10 -4 -32 -36 57 60 -16 -57
$$ packed form
5885f3oJ15K8r5l5QJN0qL4m2m7N3L5p2J6K1K1j03N2L3o1K5J03k9m2n9J26o6j3
5915b0O6N6j30K0Pn7Q5kM4q0jj1R1r4M7L1pm8j0L6q3M9M6J0j39O7K1l8N7K7k0
5946B0r0J8O4o5JP4j5l2L8j5k3NL7J3n7L9J0%n6N1P3j09K7nmk7N5J0m1j0j3j5
5978d2PN7k5Ml6j2O1n3P8jl7Mm3O0r9J05L6o1n0M5Qn2M3O7j2j45J05l2j5J3J7
6009ej8o8P6K5n5NQ3j8l7l1M9k1n1J54k4oj20O8J2p9J16J5m0q0N1qJ5m5P6j2j9
6040HKk4%K3J17j51l2R6n7RM8L0q0k0%QK1mP6m3m1K9j0o4L7M0J2j9Nj3k6j7O7
6073B7J3n3m3QlrJ01k5k9MJ8j3j6N1O4j87O6J8j9PJ2P1j00MmJ9oj0R1q9J4Plj1
6107b5jP3k1k0k5J1j7j1R5lm7r%k4rJ34q6J6o5jJ8k7J02j9j19R0j4k8mR3Lp6m1
$$ plain form
6140 -57 -19 -75 32 22 38 5 -37 -28 6 -37 38 80 14 -85 -1 90 -3 10 77 34 -11 -5 -21 -23 14 57 28 43 1 28 -7
6171 -7 -27 56 27 -27 -19 -8 -31 -34 48 54 23 -11 -4 -5 -17 30 77 -24 11 -68 -33 -20 0 -1 -42 -30 -22 -32 -47 4 47 -11 -48 45
6205 45 -12 -23 12 26 -6 -32 2 -11 -29 9 -12 10 10 -13 -60 -43 3 -9 110 -37 -22 31 -4 9 28 23 -52 3 -15 -6 8
6236 8 84 -15 -32 -17 17 -30 -16 3 82 -48 -39 -9 26 -2 -12 67 -36 -52 2 -56 -2 14 30 0 -12 48 -2 16 9 75 6
6267 6 -24 -16 -1 -8 -1 76 -18 -22 32 15 -20 40 16 -14 3 -38 -22 -65 -47 17 27 -58 8 -36 -39 -7 63 49 -18 -8 5 -30 13
6300 13 42 90 -4 -34 -5 -20 32 42 -20 -7 -27 -55 -42 -1 19 52 -11 -63 38 -14 -11 20 50 -10 -8 -59 -30 -7 -5 33 36 -77
6332 -77 -29 -26 5 -30 33 1 -16 -26 -11 -33 3 30 18 -14 -16 53 -38 -23 71 0 -3 -53 -25 -12 -29 104 85 21 30 6 21 -38
6364 -38 18 46 -30 -52 -4 -37 0 59 32 5 -11 32 49 -2 42 83 -6 -58 -29 -17 55 22 -48 5 18 -27 33 -8 35 64
$$ packed form
6140e7L8n6J07j0J6l3m2RL4m3P5M2o6r9Q4R1r3J3O7m3m5Oj6kL7M3k9J5m2K7l5
6171gk0Q3k9n4QJ1k3lQ2Ol1l4Pjj2M7M7j01L5p9L5J3K0jm1J2Qj0j5N1M3n8l7R3
6205D5n7j1L5J4l2k6L4j3j8L8k1K2%k3m7J7M6j2J19j47J5N3l5J3J9np5N5j8RJ4
6236HP6r9j7J5L4m7J4J9P9j30RL0L5k8j0P9j03j6N4n8N4J6J6l0j2O0n0J8pO6o9
6267Fl0QJ5pPP7r4mN4j7l5O0k4l0J7m1J6m3J8O4J0q5O6m4lL2P0j4o7J0J3l5M3
6300A3K9M8r4l0K9j5N2J0o2J3k0k8J3M1K0L3o3n2J01n2LL1L0o0Kn1K9K3KL8Lj13
6332g7M8LL1l5O3l2j7j0J5k2L6K7j2l2kO9r1J5R4p1ln0K8J3j7J33j9o4Rk4J5n9
6364c8N6K8p6k2M8l3L7N9k7k7j6M3J7n1M4M1q9n2K9J2P2l3p0N3J3m5O0m1M3K9
$$ plain form
6394 64 -13 3 -43 42 -19 11 84 9 -7 -5 -27 -2 1 34 49 -52 -16 -9 -9 -48 -7 15 3 -43 -19 19 -35 34 39 11 -26 -24 32
6427 32 -26 74 65 44 -37 -22 43 0 -28 31 50 -19 -14 -23 -23 19 43 -15 -7 -57 -8 -4 -55 12 19 3 -45 9 -46 -27 -33 13 3 11
6461 11 48 -41 23 72 99 -6 6 50 -41 -24 -31 61 17 -20 -23 -45 -76 11 -5 -5 -9 -61 -41 -56 36 42 42 10 -35 -18 -63 37
6493 37 57 8 -20 -52 -11 59 -51 23 -6 5 -10 -14 -14 17 38 4 20 -56 -9 -3 -17 54 24 -35 -6 19 12 -41 12 -50 -39 -68
6525 -68 -41 11 18 -3 57 1 -46 32 -29 14 -17 33 16 -45 -9 -14 -11 -32 66 29 -51 -14 -72 -33 38 -6 -25 -39 -2 5 -19 1
6557 1 11 13 8 -28 0 -9 11 -14 -5 -10 -56 -38 -34 -25 16 44 -60 -59 -6 3 9 -10 44 -65 2 -5 2 -39 -18 68 24 -29 -26 -41 -36 -26 47
6594 47 -35 -88 56 17 6 23 20 -24 -66 -77 -4 4 -32 40 12 -37 1 -11 -26 11 42 32 -50 -40 -35 29 -20 -20 -12 -52 -35 -17
6626 -17 -5 -32 45 34 -69 -25 26 -1 39 102 -2 -74 -50 8 -15 24 -7 38 -3 -72 0 -39 -17 -6 54 4 -36 -69 19
$$ packed form
6394F4p7J6m6Q5o1L0P3p5j6Kk2K5LL3J5j01L6P%l9M1K2j2m6K4L8n4O9Nk8l7KN6
6427C2n8J00rk1q1J5O5m3k8N9J9o9Nr%M2K4n8Qn0M9Mn1O7Pj6m8N4n5J9oM6j0Q
6461A1L7q9O4M9K7j05J2M4r1J7pR2m4l7lk2l1Q7j6%mn2K0j5R2O%l2m5J7m5J00
6493C7K0m9k8l2M1P0j10P4k9J1j5m%L1K1l4J6p6M7Oj4P1l0n9K9K5pn3N3o2J1k9
6525f8K7N2Pk1O0n6m7P8o1M3l1N0j7o1L6nLk1R8l7q0L7n8L9P1m4j9j4L7Pk4K0
6557AJ0Knl6K8rK0k5Rnm6J8MRM1K8j04JN3ROj9N4j09O7pPm1K1Q6m4n3Lj5NJ0P3
6594D7q2n3J44l9j1J7lm4m2j1P3Ql6P2k8m9L8j2j5L7L1j0q2J0NO4m9%Qm0J7J8
6626a7J2k7P7j1j03M4N1k7M0O3j04p2K4N8k3L9l1M5m1o9P2l9K2J1O0n0m0l3Q8
$$ plain form
6655 19 3 44 84 -29 -53 -86 -26 45 -34 70 12 -29 42 -10 -19 25 48 70 -54 -67 17 27 56 73 33 -12 -38 -7 42
6684 42 -35 -7 32 22 -35 -73 32 -28 76 68 33 -35 -4 2 -21 60 5 -2 -7 -38 -30 -34 -37 30 -8 -14 -37 33 -40 47 71 24 -18
6717 -18 -15 -26 -43 -68 93 66 -17 27 -5 -37 24 30 82 21 -42 -11 0 -6 49 73 -11 -43 9 -27 -19 71 57 66 3 -87 6 -20
6749 -20 4 59 50 -54 -11 -49 8 -3 60 14 -12 36 -16 -67 7 66 -36 -26 2 17 -77 44 -27 28 -32 4 35 4 -3 21
6779 21 45 24 21 -4 0 32 60 19 42 -61 -28 -21 -86 55 27 56 13 34 79 19 23 10 -9 -58 -39 47 -17 16 22 5 -51 -17
6811 -17 -22 15 3 41 28 -30 -17 21 -32 -28 29 5 -33 -9 47 -45 36 -18 44 4 47 32 -20 58 33 48 -18 -25 -7 -3 -49 15
6843 15 47 -14 -15 -8 -59 -1 -14 16 2 -67 1 -13 -33 -7 37 -20 5 -18 34 -35 -10 97 11 -12 -29 -21 -32 -19 51 -18 -17 35
6875 35 4 0 -24 54 11 9 41 -28 -43 10 12 50 -16 -2 12 20 -87 104 -26 -60 -4 -40 11 -21 42 75 -24 -12 3 33 2
$$ packed form
6655A9j6M1M0j13k4l3O0P1p9J04n8m1P1n2rM4K3K2j24j3Q4J0K9J7m0m5k6L1M9
6684D2p7K8L9j0n7l8J05o0J04ql5o8L1Ok3Q1n5pnl1QmlO7l8ok3P0p3Q7K4m7m2
6717a8Lj1j7k5J61k7q3M4l2l2O1ON2o1o3L1J1oN5K4q4l2N2l6QR0j4Ro3r0R3k6
6749b0K4N5rj04M3l8N7j1O3m6k6M8n2n1P4N9j02J0K8J5r4J21p1N5o0L6L1l1pK4
6779B1K4k1lk5ML2K8m1K3j03L3Po5J41k8K9m3K1M5o0Mj3j9m9J9Q6o4L3Oj7n6L4
6811a7nL7j2L8j3n8J3L8n3MN7k4l8K4N6r2Q1n4O2m0M3j5n2P8k5J5o6pJ8Mm6O4
6843A5L2o1jPn1N8j3L0j4o9O8j4k0K6M4n7K5k3N2o9K5J07q6k3j7Qj1J3P0o9JN2
6875C5l1mk4P8m3kL2o9j5N3KL8o6J4J4Qj07J91j30l4N6l6N1l2O3L3r9J2J5L0l1
$$ plain form
6906 2 -31 -17 -3 -4 2 23 6 43 1 13 25 -59 35 -53 -29 13 9 -34 13 36 -59 -28 42 -23 -51 -11 -34 -32 36 129 -15 26
6938 26 -12 -1 -5 1 24 71 -85 15 22 7 16 17 35 -19 -32 -25 31 -50 6 34 -2 -20 -45 -10 -20 37 35 -15 13 -29 2 34 18
6971 18 12 -12 18 -40 38 10 -22 14 22 3 -7 18 30 21 55 -7 15 -47 -38 10 25 70 -19 -13 -33 -53 -18 -25 38 30 -64 2 -24 -36
7005 -36 -66 5 60 46 -16 28 11 -47 14 39 24 -30 -26 -3 -35 -18 42 -45 -39 -31 -23 -20 64 26 15 -26 -2 4 5 -9 40 19 79 0
7039 0 -1 -4 9 -6 -33 -48 -2 72 -24 -4 -26 62 -36 -41 -15 -7 46 16 -14 1 -16 -80 -31 -50 49 57 12 -40 -61 32 12 42 -7
7072 -7 44 25 -23 -17 11 42 20 8 -7 -13 -72 -35 -6 44 28 -31 21 -53 31 -28 26 -12 -73 -53 -53 62 3 -25 -23 -10 -57 24
7104 24 16 45 86 34 -10 -25 -33 -16 -24 21 23 44 11 -60 -13 -80 42 11 -29 23 -31 20 -12 -17 -17 15 -69 -73 -32 -35 59 29 22 11
7138 11 -36 -27 -29 -11 -10 45 -13 -66 23 14 39 37 18 7 -30 25 -32 -28 14 -15 -16 16 -43 -11 20 13 -1 35 -16 20 -26 11 54 43
$$ packed form
6906Bl3J4J4jOK1j7L7m2J2J2q4R4q8K4M2mm3M7K3r5L1P0o5k8M0k3KO8R3j44M1
6938B6l8J1mOK3M7j56J00Pj5RJJ8n4j3PN6q1N6K8l6j8k5L5j0N7kn0K8m2L1L2j6
6971A8ok4L0n8P8k8l2L6Qj9j0K5J2rL4o2K2o2RM8J5M5q9Ok0k0L5pO3qr4O6k6j2
7005c6l0P1N5j4o2M4j7n8O1K5j5n4MK3l2J7O0q7OQQLQ4l8j1m1K4OJj4M9k1O0p9
7039@jlJ3j5k7j5M6P4r6K0k2Q8r8nK6QN3l0l0J5j7o4M9j9R9Qm5n2k1R3k0L0m9
7072gN1j9m8OK8L1k2j2j5on9L7K9N0j6n9N2p4Q4n9N4l8o1K0%J15n9k8KJ3m7Q1
7104B4qK9M1n2m4j5qJ7qM5KK1l3p1M7o7J22l1m0N2n4N1l2n%L2q4mM1lR4l0pj1
7138A1m7RkJ8JN5n8n3Q9rK5kj9j1l7N5n7MM2k9jL2n9L2L1pj4L6n1L6m6L7M3j1
$$ plain form
7172 43 18 -24 21 -33 34 -21 -3 -12 2 -47 -28 25 -8 38 28 -22 -24 9 3 15 23 -75 26 -5 12 -27 20 18 -30 9 0 -30 0
7205 0 -65 58 24 -31 -30 31 29 -53 -9 -13 -4 -5 -51 -20 35 59 -19 1 -47 21 -38 -19 -21 37 -24 -54 -32 11 29 -23 24 -2 -41
7238 -41 41 -83 4 6 -20 -18 35 -40 -50 -4 19 -15 -7 -16 -83 14 -9 9 40 23 -1 -1 -83 -17 6 -24 11 36 -37 -31 21 -37 41
7271 41 42 -6 -80 -26 -21 17 12 52 -21 -21 -31 -17 -43 59 45 -36 -3 -8 -52 -32 -35 37 -27 -14 -86 23 9 17 68 -19 -12 -6 -13 -16 -22
7306 -22 31 9 -10 15 -24 5 -6 1 -36 -17 44 -66 -55 25 13 -7 -43 -3 -42 -18 7 49 37 1 15 13 -68 41 -2 58
7336 58 26 -37 -17 60 -25 -51 76 -18 -31 44 -5 -17 24 60 -43 -8 34 8 -5 -15 38 -11 -16 -56 -20 -42 -14 -17 36 -71
7366 -71 -103 -17 -48 -29 14 22 10 5 -7 -18 7 40 28 -54 33 -32 -38 2 -3 50 -10 30 13 80 13 27 2 -6 9 -43 -27 13 -7
7399 -7 46 39 -15 4 -7 -20 -11 47 -26 8 -26 4 -26 25 41 36 -34 19 -65 -71 -51 -5 70 -46 -22 39 -30 -16 37 44 -43 26 44
$$ packed form
7172D3k5m2M5n4O7n5J8rJ4m9J9N3l3M6j0n0kL3oJ2Qr8J01l1J7l9M7km8L9rl0L0
7205@o5J23l4n5JO1kq2M4mRjm6L1N5K4p8K0m8O8n9J9kN8o1l0K2M3J8n2M7k6l9
7238d1Q2j24Q7Kk6KN3p5j0M6K3l4Qro7R7k3J8L1j7k4%q2O6K3l0L5K5p3ON2n8P8
7271D1Jm8p4N4NL8nM0p3%j0J4k6J02j4q1L3nm4K0lP2o4J3p2J09j4QN1q7POplo
7306b2N3k2j9K5l9K9j1Pl7J9O1j10J1Q0j2k0l6M0l9K4K5M2j2l6J4kq1J09m3O0
7336E8l2o3K0P7q5k6J27r4j3P5m9j2M1L6j03L5M2k6j3j0N3m9nm0L6k2K8lN3j07
7366g1l2Q6l1J9M3Qj2nj2j1K5L3j2q2Q7o5oM0nN3o0M0j7O7o7J4k5qJ5n2J6M0k0
7399gN3pn4J9j1j3RN8p3L4l4L0l0N1J6np0N3q4oK0M6P5j16K4O1o9J4N3Pq7O9J8
$$ plain form
7432 44 6 22 20 32 -55 -81 -25 -8 -42 21 24 13 -36 32 21 -35 -7 5 29 -32 2 66 -3 62 38 15 -64 -27 24 -31 1
7463 1 13 -55 5 27 -20 -21 45 58 11 7 4 -16 1 -41 42 86 -86 -9 43 42 4 54 14 10 -1 13 7 16 29 35 -14 -2 10 20
7497 20 3 16 1 13 20 -1 -16 33 -9 12 -5 -19 -64 47 -46 3 34 -32 -5 6 -46 -9 11 26 35 -52 -10 -19 -56 -8 27
7528 27 54 -24 0 -42 42 -19 20 12 23 -26 8 -27 -33 41 55 -15 12 70 -15 10 28 32 -13 -7 -24 20 -27 65 -12 13 60 1
7560 1 4 -21 21 35 77 -4 3 41 -36 51 19 -6 8 10 -38 -29 54 58 31 13 95 -20 10 28 17 20 -5 -18 12 -35 2 -45 -41 -62
7594 -62 -23 -17 -17 22 10 33 -20 -25 3 27 16 30 -2 48 -44 22 -25 35 0 3 -56 -24 -4 15 20 -69 59 4 -14 -17 -4 -16 -6
7627 -6 -14 -10 9 -3 -10 63 25 -12 33 -8 39 -28 1 -30 50 -24 16 15 15 -21 -62 30 18 -49 -6 20 -58 -31 26 2 -11 -2 37 8
7661 8 -14 5 49 -1 -24 42 20 3 20 55 -1 -9 26 8 -45 2 12 8 -5 20 -5 -15 25 1 -14 -3 -75 -14 25 24 21 -2 38
$$ packed form
7432D4l8J6kJ2q7k6N6J7l4O3Lj1m9O8j1n6K8J2K4o1L4O4o9O5k4k3p9L7N1n5L2
7463AJ2o8O0K2m7jO6J3m7mlk0J7m2Q3M4j72P7N2jl8N0m0mj1J4oRJ3Om9J2J2J0
7497B0j7J3j5J2Pk1j5M9m2K1j7j4m5J11r3M9L1o6K7J1n2L7K0J5Rq7M2rl7M8L5
7528B7K7p8K4m2Q4o1L9qJ1m9L4l5oP4J4p0K7N8q5K5J8Mm5Oj7M4m7R2p7K5M7n9
7560ALk5M2J4M2q1PL8p7Q7l2k5J4Km8RQ3Mk7j8Q2j15L0J8j1Lk5j3L0m7L7m7Mk1
7594f2L9O%L9j2K3n3nK8K4j1J4l2N0r2O6m7O0l5Ln9L2K0J9Nq9J28n5j8lJ3j2J0
7627fqMJ9j2pP3l8l7M5m1M7o7K9l1Q0p4M0j%l6m1R2j2o7M3K6p8K7N7k4j3RL9k9
7661Hk2J9M4n0k3O6k2j7J7L5n6qL5j8n3M7J0mj3K5k5j0M0k4j5J1p2O1L9jlk3M0
$$ plain form
7694 38 -31 -4 -36 25 13 -34 -43 33 -17 -33 -34 22 88 29 -9 -62 11 -14 23 13 2 -16 37 -30 6 29 29 3 -14 51 -12 -24
7726 -24 7 39 -4 17 24 20 -50 8 45 -20 1 2 0 -13 14 -32 52 -67 -15 44 38 15 15 13 -21 28 -54 -7 -26 36 7 16 17 13 19
7761 19 10 -6 9 -46 14 14 -45 28 11 63 -24 -15 34 -32 21 44 -45 -3 13 -14 -26 23 -24 44 38 -18 -4 -36 -50 -39 -10 -26
7793 -26 -9 30 -45 -8 65 21 13 18 -9 78 -2 33 26 31 -6 -2 -7 -26 -7 -10 32 10 -11 23 67 -3 8 -18 3 -33 -7 -26 51 36
7827 36 -20 -20 -50 -23 -14 -40 21 34 37 -7 9 -19 -74 4 0 -15 -11 -31 19 -33 30 47 -2 -18 -32 28 2 -25 -16 21 -9 39 33 -40
7861 -40 1 43 3 15 -28 46 -46 27 67 14 7 15 61 88 -62 70 63 -14 -55 -40 55 28 53 -16 -39 -38 -19 -6 -46 18 0
7892 0 -12 -51 -9 -47 2 -25 -27 -62 -51 -11 19 2 -8 10 6 4 34 -75 -67 82 38 46 -16 -3 17 24 16 17 11 -52 -5 -16 -47 -27
7926 -27 -6 -47 7 -57 9 -8 -54 63 14 5 -46 -13 -54 -26 -7 46 5 -3 -4 -18 -33 -52 82 -13 -5 5 30 -35 61 77 7
$$ packed form
7694C8o9K7l2O1j2m7rP6n0j6jN6O6n9l8n3P3k5L7j0j1j8N3o7L6K3%k6j7O5o3j2
7726b4L1L2m3K1Pmp0N8L7o5K1Jkj3K7m6Q4j19N2N9ok3%kl4M9q2M7j9O2k9RJmO
7761A9rj6J5n5O0%n9P3j7N2q7RM9o6N3K3q9M2J6k7j2M9m7O8on6J4l2j4J1K9j6
7793b6J7L9p5L7P3m4qNk7Q7q0L5pNl7Mnj9J9lM2k2k1L4M4p0J1k6K1l6K6j9P7j5
7827C6n6%l0K7Rk6O1J3Lm4J6k8n5P8mj5Mk0N0n2O3J7m9j6j4O0k6k7RL7l0M8op3
7861d0M1M2m0J2m3P4r2P3M0n3pQM6K7j50J32pp7m1J5R5k7K5o9k3JJ9J3m0O4j8
7892@j2l9M2l8M9k7kl5J1M0L0j7j0J8mkL0j09QJ49m4Qo2J3K0PqJoo3M7j1l1K0
7926b7K1m1N4o4O6j7m6J17m9rn1L3m1K8J9N3m1qjj4j5j9J34r5QJ0K5o5R6J6p0
$$ plain form
7957 7 -17 2 5 -38 19 32 -67 10 36 16 40 47 30 -41 -75 31 9 -26 -34 48 1 -37 62 -4 59 -19 31 71 9 32 -20 -124
7989 -124 -3 6 22 11 -6 -11 -21 -83 21 -16 33 24 -5 4 -49 -26 2 -36 -44 -4 36 -49 0 15 -41 -33 17 -26 -41 46 -32 -36
8021 -36 -22 11 -14 -14 -31 16 -13 -9 -13 -11 -50 -35 78 34 -29 -53 43 -9 -4 7 42 64 2 -5 16 0 -7 16 -16 -13 -20 -29 -9 -4 27
8056 27 -36 35 2 -69 -57 -60 43 15 -6 34 30 -24 17 65 4 -34 23 86 -28 -2 43 -3 -12 -44 -50 -47 -3 -21 -25 2 39 -17
8088 -17 2 -44 -13 -21 -28 1 85 12 -10 21 20 1 -3 13 -36 -4 22 43 11 -20 -3 -17 4 -43 -5 -31 10 12 74 2 21 1 -29
8121 -29 -16 -3 -24 -11 -9 85 29 -1 -46 -26 -30 -32 47 -9 -23 43 9 -19 -60 59 1 -20 54 64 -47 -8 -4 15 37 -79 -6
8152 -6 20 19 19 27 -4 -7 21 -22 50 47 -21 37 -40 -7 -9 20 -30 27 -1 -11 -12 17 -19 59 0 5 -15 21 19 -2 -2 31 -30 46 30 -10
8188 -10 -18 43 16
$$ packed form
7957Gk4J9Lm3N7J3r9P7K6k0K4Pj7p1l4J06k2l5qQ2m7l8R9o6O3p8N0M0o2K3n2j04
7989a24J21RJ6j1j7nj0o2J04l7M9rk9Rn3K3K8l8qM0M0q5M9J5n6QN0m3j5Q7p8m
8021c6J4L3k5%j7M7k9MmKl9J5J13m4o3k4R6n2NJ1L5K2o2pK1j6pK3l2LprK0NL1
8056B7o3P1l3p1J2lJ03k8k1M0mn4M1M8o1l8N7O3j14K6M5m6rl2oLM4j8mK7L7n6
8088a7J9m6L1qpK9Q4p3k2L1jj9mJ6m9L2K6K1l2l1J7j4K1m7L8k6M1KO2p2J9k0l0
8121b9J3J3k1J3KR4n6l0m5K0mkP9n6j4O6l4k8m1J19n8k1P4J0j11L9MJ9K2j16P3
8152fK6j%Ql1lK8m3P2lo8N8p7L3kK9n0N7k8j0jK9l6P8n9Nk0L6kk1%L3o1P6j6m0
8188a0qO1k7
8191A6
$$ Imaginary data points
##PAGE= N=2
##DATA TABLE= (X++(I..I)), XYDATA
$$ plain form
0 0 0 0 0 0 0 0 0 0 0 0 0 0 0 0 0 0 0 8 -6 8 -8 8 -8 12 -14 16 -16 21 -24 26 -31 36 -37 45 -52 53 -63 69 -77
39 -77 88 -96 105 -118 127 -143 156 -171 191 -208 230 -256 280 -309 345 -377 422 -471 530 -598
59 -598 680 -784 917 -1090 1331 -1685 2244 -3247 5395 -11910 72320 388530 324405 106279
73 106279 -111045 -322630 -271476 60594 315563 348675 184747 -95872 -267340 -217450 -23311
84 -23311 248479 389244 226988 -52539 -241720 -281342 -68728 253546 352851 225396 -453
95 -453 -276434 -334405 -54725 212223 273811 219614 4734 -272999 -311638 -113620 111101
106 111101 253401 211227 -2941 -212910 -311464 -221153 59966 262643 204968 21009 -189512
117 -189512 -337861 -232865 48188 226357 224401 59080 -196231 -302737 -184171 2983
$$ packed form
0@%%%%%%%%%%%%%%%%%Qj4J4j6J6j6K0k6L0l2L7m5N0n7O7p3Q2r7J05j16J32j46
39g7J65j84K01k23K45k70K99l27L62l99M38m86N36n89O54p22P99q93J001j128
59e98J278j464J701k007K421l016L929n491Q642j7305Q4230L16210o4125k18126
73A06279k17324k11585N1154L32070K54969L3112j63928k80619j71468M9890J94139
84b3311K71790J40765j62256k79527j89181l9622K12614L22274R9305j27455k25849
95d53k75981n7971K79680K66948O1588n4197k14880k77733l8639J98018K24721
106A11101J42300m2174k14168k09969r8554R0311K81119K02677n7675j83959k10521
117a89512j48349J04996K81053J78169j956j65321k55311j06506J18566J87154
$$ plain form
127 2983 183469 257873 94510 -147386 -239893 -192696 -33794 186893 268096 140378 -64284
138 -64284 -226612 -222754 -19657 192934 260991 181889 -24630 -217338 -203426 -24398 161656
149 161656 262312 191476 -13012 -165648 -186217 -82427 123598 259817 186025 14579
159 14579 -132003 -212527 -128007 92501 232304 192861 36822 -147486 -230041 -136119 48228
170 48228 192930 196619 36631 -149042 -215542 -155263 -684 163771 184280 48918 -110704
181 -110704 -211600 -190540 -24463 145082 175986 82420 -78412 -215936 -198107 -33767 128626
192 128626 185402 107105 -61518 -189366 -182325 -52731 116721 195962 120312 -27978 -146467
203 -146467 -176890 -71539 106071 195538 144646 14711 -125471 -177343 -78147 88242 191150
$$ packed form
127B983J80486P4404j63363k41896r2507M7197J58902K20687Q1203j27718k04662
138f4284j62328L858K03097K12591O8057p9102k06519j92708J3912J79028J86054
149A61656J00656p0836k04488j52636k0569J03790K06025J36219p3792j71446
159A4579j46582q0524Q4520K20508J39803l9443j56039j84308q2555R3922J84347
170D8228J44702L689j59988j85673o6500O0279J54579J64455K0509j35362j59622
181a10704j00896K1060J66077J69545L0904r3566j60832j37524J7829J64340J62393
192A28626N6776p8297j68623j27848P041J29594J69452P9241p5650j48290j18489
203a46467l0423J05351J77610Q9467n0892j29935j40182n1872R9196J66389J02908
$$ plain form
214 191150 170222 36675 -115547 -167235 -87743 63238 182745 174420 46858 -94135 -160835
225 -160835 -110439 37135 163082 165545 63186 -74448 -167356 -133063 9079 136544 161696
236 161696 76449 -68613 -170118 -147596 -21332 114189 158624 78831 -59493 -159921 -159205
247 -159205 -47210 95838 150024 85516 -37644 -147473 -166578 -63590 77704 144488 102931
258 102931 -14551 -133856 -163188 -74748 62496 146615 119687 5922 -112070 -153603 -83973
269 -83973 52566 147295 130617 29570 -86694 -144818 -90496 41288 141086 140639 52761 -66798
281 -66798 -136764 -97133 24418 131337 147311 67398 -51469 -129077 -107382 3982 118089
292 118089 145373 75256 -37840 -124238 -119664 -17393 99084 137636 81450 -26993 -121009
$$ packed form
214A91150k0928j33547j52222n1688P9492J50981J19507q325j27562j40993o6700
225a60835N0396J47574J25947K463j02359j37634r2908L4293J42142J27465K5152
236A61696q5247j45062j01505K2522J26264J35521M4435p9793j38324j00428P16
247a59205J11995J43048N4186o4508j23160j09829j9105J02988J41294O6784m1557
258A02931j17482j19305k9332Q8440J37244Q4119k6928j13765j17992m1533O9630
269h3973J36539R4729j6678j01047j16264n8124N4322J31784R9798m47q7878j19559
281f6798o9966L9631J21551J06919J5974p9913j18867p7608K1695J11364J14107
292A18089K7284p0117j13096q6398M574J02271J16477L8552n6186j08443r4016
$$ plain form
303 -121009 -130150 -39565 77464 129435 86078 -17597 -115105 -137349 -60156 57967 121641
314 121641 90191 -5473 -104761 -140425 -75528 41894 114930 96515 9974 -90567 -137437
325 -137437 -85258 28546 110642 105407 27203 -72925 -129043 -91204 17042 107327 114323 44674
337 44674 -53694 -118299 -94857 6269 102112 121155 60958 -35661 -107758 -97923 -5967 93206
349 93206 124116 73766 -20329 -98760 -102066 -20579 80484 122102 81900 -8069 -91484 -107743
361 -107743 -37110 64626 115760 85975 1718 -85109 -113479 -54099 46770 107012 88090
372 88090 10087 -78337 -116971 -69674 28709 97865 89910 18661 -69459 -116830 -81807 13071
384 13071 89578 92389 29192 -57510 -112885 -89475 355 82299 96335 41856 -43562 -105130
$$ packed form
303a21009r141R0585J17029N1971m3357j03675r7508k2244P7193J18123O3674
314A21641l1450r5664r9288l5664O4897J17422P3036j8415q6541j00541m6870
325a37437N2179J13804Q2096n235p8204j00128n6118L7839J08246R0285O996o9649
337D4674r8368o4605K3442J01126R5843J9043o0197r6619p2097R835R1956R9173
349I3206L0910n0350r4095p8431l306Q1487J01063M1618m0202q9969q3415j6259
361a07743P0633J01736N1134k9785q4257q6827k8370N9380J00869O0242j8922
372H8090p8003q8424l8634M7297R8383O9156p955p1249q8120m7371L5023R4878
384A3071P6507K811o3197q6702n5375K3410Q9830Q1944J4036n4479q5418o1568
$$ plain form
396 -105130 -92664 -10289 76146 101459 54445 -28945 -94364 -93238 -19539 70093 104843 65894
408 65894 -13753 -83421 -93067 -27720 61646 104536 76204 224 -74740 -93326 -36731 50294
420 50294 101386 83163 10689 -67029 -94463 -48134 37927 95703 84281 18254 -58566 -96265
432 -96265 -60485 24459 86858 83278 25371 -50994 -96755 -71349 8421 77023 84818 31491
444 31491 -45016 -93936 -79340 -6976 68875 86672 37328 -36794 -88710 -83815 -17374 60058
456 60058 85553 46891 -24211 -82745 -84694 -24499 50340 85145 59025 -10585 -74728 -84731
468 -84731 -31891 44318 86911 66513 1779 -63463 -84558 -38882 40325 85549 69557 13526
480 13526 -51407 -82545 -45691 30430 80601 74518 22973 -42868 -79101 -54415 15558 76079
$$ packed form
396a05130J2466Q2375Q6435K5313m7014q3390o5419J126P3699Q9632L4750l8949
408F5894p9647o9668r646O5347Q9366M2890k8332p5980p4964j8586N6595Q7025
420E0294N1092j8223p2474p7718k7434M6329Q6061N7776j1422o6027p6820l7699
432i6265L5780Q4944O2399l580n7907p6365m5761K5406P9770O8602P795n3327
444C1491p6507m8920J4596P2364P5851J7797m9344p4122n1916M895O6441P7432
456F0058K5495l8662p1102n8534j949O0195P4839L4805k6120o9610o4143j0003
468h4731N2840P6209M2593k0398o4734o5242k1095M5676P9207M5224j5992n6031
480A3526o4933l1138L6854P6121N0171o083n1545o5841l6233K4686O9973O0521
$$ plain form
492 76079 79787 28292 -37924 -77600 -62393 4093 68917 78427 33026 -32421 -77755 -66747
504 -66747 -5230 55466 73468 40854 -24205 -75845 -71623 -17451 44322 72300 47305 -14868
516 -14868 -71039 -78786 -27904 41203 72259 49555 -5903 -63783 -80392 -32924 36421 69617
528 69617 53454 3311 -53426 -74457 -38977 25032 68716 62163 13265 -42763 -70418 -47159
540 -47159 16634 69702 69092 22770 -36087 -70702 -49627 13524 64428 69547 30721 -29895 -67815
553 -67815 -49872 5200 54183 67824 37009 -19929 -62653 -58358 -8311 47986 66888 41226
565 41226 -10911 -61951 -68784 -16973 43613 64389 43080 -7752 -60557 -69111 -23732 33103
577 33103 60699 44754 -3957 -52199 -66143 -34668 21588 58560 49098 5891 -44034 -69111
$$ packed form
492G6079L708n1495o6216l9676J5207O6486O4824R510m5401o5447m5334J1008
504f6747O1517O0696J8002l2614o5059n1640M222N4172O1773K7978k4995o2173
516a4868n6171p747N0882O9107L1056k2704n5458n7880j6609M7468O9345L3196
528F9617j6163n0143n6737k1031L5480O4009M3684o553m8898n6028k7655K3259
540d7159O3793N3068o10m6322n8857l4615K1075O3151N0904N119l8826o0616l7920
553f7815J7943N5072M8983J3641l0815n6938m2724M295N0047N6297J8902k5662
565D1226n2137n1040o833N1811O0586K0776k1309n0832n2805q554M5379N6835
577C3103K7596j5945m8711m8242j3944L1475N6256L6972r462m3207m9925k5077
$$ plain form
589 -69111 -42323 16746 56894 54891 15931 -40547 -69248 -41701 13303 53528 58097 21681
601 21681 -32569 -60853 -43194 5427 50248 59033 28582 -18454 -54991 -50874 -1933 47991
613 47991 60638 37152 -10442 -55187 -54139 -6635 42806 61565 40567 -9253 -50875 -52204
625 -52204 -15195 34016 58802 40028 -3425 -42794 -55879 -26449 25622 53621 42566 5584
637 5584 -41121 -62303 -32795 18490 49786 46349 8423 -40921 -60701 -36298 10731 47024
649 47024 45836 10052 -31748 -55154 -42537 3481 43409 45542 19135 -20759 -54345 -47106 -1014
662 -1014 40158 50372 28532 -16482 -52112 -45789 -4906 38183 53887 31040 -11295 -43188
674 -43188 -44542 -10440 34824 51735 33837 -317 -36200 -47872 -16428 28540 49311 40562
$$ packed form
589f9111K6788N9069M0148k003l8960n6478k8701K7547N5004M0225M569l6416
601B1681n4250k8284J7659M8621M4821Q785l0451m7036l6537M117M8941M9924
613D7991J2647k3486m7594m4745J048M7504M9441J8759k0998m9820m1622j329
625e2204L7009M9211K4786j8774m3453l9369j3085K9430N2071K7999j1055l6982
637E584m6705k1182K9508N1285L1296l437l7926m9344j9780K4403M7029L6293
649D7024j188l5784m1800k3406J2617M6018L9928K133k6407l9894l3586P239M6092
662a014M1172J0214k1840m5014l5630O323M0883M3089J5704k2847m2335l1893
674d3188j354L4102M5264J6911j7898l4154l5883j1672L1444M4968K0771q749
$$ plain form
686 40562 6786 -35756 -49955 -21895 21573 49073 42877 6412 -33387 -48673 -28209 15056
698 15056 45269 39187 8887 -26583 -49026 -34936 7370 37971 38844 15871 -22734 -50637 -39581
711 -39581 -554 33808 42443 19380 -21020 -48128 -41792 -5969 32530 42797 20643 -14360
723 -14360 -42595 -42943 -9055 29120 41093 26630 -5089 -38240 -42965 -12654 24404 42932 33813
736 33813 686 -33993 -42020 -16835 22073 45034 36044 4697 -28053 -41180 -20455 19093
748 19093 42414 36293 10380 -23017 -41087 -24299 12256 37806 38520 14465 -20885 -40982 -29254
761 -29254 4458 34781 39265 15578 -18584 -40658 -33975 -1063 30569 36688 17513 -14533 -40323
774 -40323 -36977 -6066 24643 35021 21388 -10183 -38395 -38887 -11503 20841 35685 24236 -5686
$$ packed form
686D0562l3776m2542j4199K8060M3468K7500o196l6465l9799j5286K0464M3265
698A5056L0213o082l0300l5470k2443J4090M2306L0601Q73k2973l8605k7903J1056
711c9581L9027L4362Q635k3063m0400k7108O336L5823L8499J0267k2154l5003
723a4360k8235l48L3888L8175J1973j4463l1719l3151m725L0311L7058J8528r119
736C3813l3127l4679q027K5185L8908K2961q990l1347l2750j3127K0725L9548
748A9093K3321o121k5913l3397j8070J6788L6555K5550P14k4055l5350k0097J1728
761b9254L3712L0323M484k3687l4162k2074O683L2912L1632O119j9175l2046k5790
774d0323L346L0911L0709J0378j3633l1571k8212m92K7384L2344J4844j1449k9922
$$ plain form
787 -5686 -34240 -39868 -15438 19191 36034 26463 -61 -29094 -38954 -17648 16383 35440 30268
800 30268 5666 -24243 -36562 -19779 12215 35184 33997 10357 -19786 -34806 -22278 8725
812 8725 33861 35341 14340 -15808 -34336 -24654 5180 30210 34741 17691 -12313 -33971 -27682
825 -27682 74 25893 33593 19454 -9214 -32869 -31628 -5853 22139 32146 20033 -6213
837 -6213 -31335 -34627 -11151 18126 30561 21214 -3376 -29164 -35482 -15408 13585 29489 23505
850 23505 52 -25998 -34977 -18492 9932 28803 26063 4689 -21948 -34001 -20233 7742
862 7742 27789 28404 9947 -17164 -32479 -21326 5667 26779 29939 14447 -12085 -30285 -23023
875 -23023 2895 25612 30842 17581 -7534 -27998 -25224 -736 23476 30751 19494 -4296 -26181
$$ packed form
787e686k8554n628K4430L4629J6843r571k6524k9033r860K1306L4031J9057n172
800C0268k4602k9909j2319J6783L1994K2969j187k3640l0143j5020J2528L1003
812H725K5136J480k1001l0148j8528R682K9834K5030M531j7050l0004k1658O289
825b7682K7756K5819P700j4139k8668k3655J241K5775K7992J0007j2113k6246
837f213k5122l292K3476K9277J2435r347k4590k5788o318K0074K8993J5904n984
850B3505k3453k6050q979J6485K8424J8871k740k1374k6637j2053J3768K7975
862G742K0047O15j8457k7111j5315J1153K6993K1112L160j5492k6532j8200P262
875b3023K5918K2717N230j3261k5115k0464K774K4488K4212P275j1257k3790k1885
$$ plain form
888 -26181 -27154 -5249 19885 29850 20676 -2088 -24854 -28981 -10018 15375 28035 21397 -116
901 -116 -23666 -30594 -14231 11040 25680 21895 2264 -21888 -31699 -17664 7371 23681 22552
914 22552 5140 -19129 -31559 -20251 4418 22413 23602 8521 -15083 -30078 -22046 2198
926 2198 21780 24910 11969 -10513 -27643 -22974 153 21146 26272 15295 -6059 -24747 -23426
939 -23426 -2252 19803 27216 18086 -2451 -22007 -23993 -5294 17530 27222 19943 613 -19873
952 -19873 -24911 -8461 14314 25808 20947 2914 -18475 -26106 -12025 10358 23582 21114 4622
965 4622 -17064 -27125 -15869 6383 21342 20737 6184 -15004 -27731 -19270 3033 19277 20296
978 20296 8082 -12351 -27230 -21372 -85 17460 20909 10382 -9305 -25182 -22369 -2931 16315
$$ packed form
888b6181r73K1905K5134R965r174k2764k2766m127J8963K5393J2660o638k1513
901a16k3550o928J6363K5271J4640l785j9631k4152r811J4035K5035J6310j129
914B2552j7412k4269j2430J1308K4669J7995J189j5081k3604j4995Q032K4244
926B198J9582L130j2941k2482j7130M669K3127K0993N126j0977k1354j8688J321
939b3426K1174K2055P413r130k0537j9556j986J8699K2824R692p279j9330k0486
952a9873n038J6450K2775J1494m861j8033k1389p631J4081K2383J3224k468j6492
965D622k1686j0061J1256K2252J4959o05j4553k1188j2727Q461K2303J6244J019
978B0296j2214k0433j4879N858K1287J7545L449j0527j9687j5877K813J9438J9246
$$ plain form
991 16315 22136 12792 -5776 -22371 -22769 -4784 15542 22960 15662 -1877 -19763 -22363 -5914
1004 -5914 13881 23075 18325 1508 -17244 -21741 -7940 11584 22922 19875 4205 -14608 -22069
1017 -22069 -10809 9473 22014 19968 6197 -12627 -22970 -13458 6549 19634 19594 7575 -11475
1030 -11475 -23011 -16001 2355 17065 19544 8325 -9945 -22478 -18835 -1619 15219 19181 9497
1043 9497 -7717 -22088 -20850 -3770 13309 18625 11451 -5309 -20980 -20860 -5489 11057 18924
1056 18924 13679 -2536 -18114 -20438 -7812 9853 19744 15492 1128 -14840 -20690 -9265 9405
1069 9405 19687 17188 4464 -12774 -20167 -9806 7595 18844 18700 6539 -10611 -18741 -11552
1082 -11552 4556 17875 19134 7960 -8078 -18606 -14559 2049 16345 18486 9430 -6581 -19440
$$ packed form
991A6315N821r344j8568j6595l98J7985K0326P418p298j7539j7886k600J6449
1004e914J9795R194m750j6817j8752m497J3801J9524J1338l047j5670j8813p461
1017b2069J1260K0282J2541k046j3771j8824j0343R512K0007J3085m0j2019j9050
1030a1475j1536P010J8356J4710K479j1219j8270j2533L643J7216J6838L962r684
1043I497j7214j4371J238J7080J7079N316p174j6760j5671J20J5371J6546P867
1056A8924n245j6215j5578k324J2626J7665R891m252j4364j5968n850J1425J8670
1069I405J0282k499j2724j7238p393J0361J7401J1249j44j2161j7150q130P189
1082a1552J6108J3319J259j1174j6038j0528M047J6608J4296K141r056j6011j2859
$$ plain form
1095 -19440 -16297 -243 13660 17614 10341 -5860 -18948 -17277 -3732 10926 17115 10750 -4100
1108 -4100 -17306 -19116 -6824 9406 16490 11764 -1415 -16402 -20319 -7940 8132 15941 13446
1121 13446 704 -15001 -19223 -8609 6285 15821 14894 2960 -11641 -17822 -10410 4915 16026
1134 16026 16006 6087 -8568 -17860 -11720 4203 15538 16938 8492 -7090 -17319 -11918 2584 14211
1148 14211 17247 9295 -5348 -15644 -13164 -472 12502 16536 10143 -2857 -15070 -15696 -3126
1161 -3126 10535 15723 11406 -1603 -15541 -17139 -5098 8342 14913 11606 -1072 -14558 -17190
1174 -17190 -7325 6164 13729 11436 930 -12073 -17616 -9575 4430 12797 12449 3728 -10368 -17951
1188 -17951 -10710 3285 12714 13959 5512 -8807 -16676 -10992 2281 12675 14334 6876 -5782
$$ packed form
1095a9440L143J6054J3903L954p273j6201j3088J671J3545J4658O189o365j4850
1108d100j3206j810J2292J6230P084m726j3179j4987l917J2379J6072P809k495
1121A3446j2742j5705m222J0614J4894R536r27j1934j4601o181P412J5325J1111
1134A6026k0r919j4655r292O140J5923J1335J400q446j5582j0229N401J4502J1627
1148A4211L036p952j4643j0296K480J2692J2974M034o393j3000j2213o26J2570
1161c126J3661N188m317j3009j3938j598J2041J3440O571l307j2678j3486k632
1174a7190R865J3489P565k293j0506j3003n543Q041J4005Q367l48q721j4096p583
1188a7951P241J3995R429J245q447j4319p869N684J3273J0394J659p458j2658
$$ plain form
1201 -5782 -14774 -11676 1115 11796 14461 9325 -2714 -13959 -12655 -499 10643 15073 11034
1214 11034 -1543 -13428 -13304 -2378 9515 14966 10924 -612 -12058 -14045 -4432 7779 13482
1227 13482 10814 1113 -11165 -15167 -6703 5380 12086 11488 2310 -10774 -15825 -8630 3371 11520
1241 11520 11601 2922 -9355 -15732 -10219 2132 10782 11270 4374 -7079 -15147 -11252 839 9872
1255 9872 11843 6600 -4966 -14187 -11726 -571 9620 13084 7967 -3206 -12552 -11892 -1628 9418
1269 9418 13292 8970 -890 -10951 -12165 -2622 8217 12790 10372 1141 -10017 -12533 -4186 6605
1283 6605 12549 11223 2274 -9189 -13112 -6042 5216 11901 10837 3011 -8009 -13636 -7844 3526
1297 3526 10432 10331 4006 -6840 -13852 -9475 1285 9146 10698 4892 -5967 -13552 -10779 -589
$$ packed form
1201e782q992L098J2791J0681K665n136j2039j1245J304J2156J1142M430m039
1214A1034j2577j1885J24J0926J1893N451m042j1536j1446j987R613J2211N703
1227A3482k668r701j2278m002Q464J2083O706n98r178j3084n051P195J2001Q149
1241A1520Q1q679j2277o377N513J2351Q650M88o896j1453q068L895J2091R033
1255I872J971n243j1566r221K461J1155J0191L464n117j1173r346O60J0264J1046
1269I418L874m322r860j0061j214R543J0839M573k418r231j1158k516Q347J0791
1283F605N944j326q949j1463l923P070J1258O685j064p826j1020n627N792J1370
1297C526O906j01o325j0846p012M377J0760P861J552n806j0859p585K773J0190
$$ plain form
1311 -589 8485 10918 5601 -4662 -12783 -11406 -1604 7786 10825 6773 -2682 -11637 -11527 -2456 6877
1326 6877 10992 8426 -671 -10271 -11517 -3502 6237 11442 9553 1047 -8745 -11536 -4508 5777 11408
1341 11408 10010 2577 -7264 -11506 -5475 4572 10609 10415 3838 -6195 -11415 -6840 2726 9734
1355 9734 10590 4576 -5313 -11523 -8384 955 8682 10284 5074 -4428 -11616 -9638 -646 7358 9759
1370 9759 5720 -3458 -11314 -10455 -2088 6125 9490 6536 -2158 -10631 -10938 -3332 5263 9478 7353
1385 7353 -640 -9376 -11096 -4202 4733 9501 8223 1050 -7907 -10920 -4865 4065 9459 9146 2689
1400 2689 -6395 -10469 -5510 3229 9308 9709 3966 -5084 -10083 -6304 2246 8657 9906 4999 -4001
1415 -4001 -9881 -7258 929 7699 9680 5674 -3037 -9805 -8236 -550 6519 9210 6060 -2202 -9561
$$ packed form
1311e89R074K433n317j0263q121J377R802R390L039m052r455q955J10R071R333
1326F877M115k566r097r600j246Q015R739N205j889q506r792k791P028J0285N631
1341A1408j398p433r841m242O031J0047O037j94o577j0033n220M575R566P008
1355I734Q56o014r889o210L139R339P727J602n210r502p188J978Q992Q004K401
1370I759m039r178p856Q59Q367Q213L365k954q694q473l07P606Q595M215k125
1385G353p993q736j720O894Q935M768j278p173q957l013O055Q930N394l13o457
1400B689r084m074M959Q739O079M01n743r050m999L779Q550O411J249m907r000
1415d001n880K623Q187O770J981m006q711o768J569P686P069K691l150q262p359
$$ plain form
1430 -9561 -9185 -2020 5340 8637 6446 -1261 -9187 -9930 -3327 4265 8191 6727 -253 -8423 -10252
1445 -10252 -4241 3392 7895 7323 1072 -7199 -10176 -5048 2735 7728 7951 2392 -5910 -9775 -5557
1460 -5557 2093 7563 8459 3701 -4458 -9158 -6079 1414 7250 8855 4839 -3171 -8699 -6607 562
1475 562 6682 8822 5668 -1974 -8300 -7234 -507 5926 8530 6114 -1095 -7968 -8019 -1760 4867 7968
1491 7968 6355 -282 -7598 -8655 -2977 3798 7351 6458 471 -7016 -9149 -4070 2792 6782 6525
1506 6525 1368 -6224 -9347 -5060 1905 6419 6707 2366 -5085 -9161 -5680 1289 6053 7048 3375
1521 3375 -3966 -8635 -6076 644 5901 7412 4343 -2609 -7966 -6363 77 5539 7565 5230 -1300
1536 -1300 -7314 -6711 -609 4995 7497 5945 -177 -6669 -7130 -1519 4357 7202 6269 611 -6189 -7470
$$ packed form
1430i561L76P165P360L297k191p707p926p43O603P592L926j464o980q170j829
1445a0252O011P633M503n72o251q271k977N128P783M993K23n559q302l865M218
1460e557P650N470Q96m758q159m700L079P493N836J605m016q010n528K092P169
1475E62O120K140l154p642o326J066O727O433K604k416p209o873n1O259O627L101
1491G968j613o637p316j057N678O775L553q93n987p487k133N079O862L990k57
1506F525n157p592l123M287O965M514K88m341p451m076L481O969M764R95l673
1521C375p341m669K559O720N257J511l069o952n357J603O440N462K026k335o530
1536a300o014O03O102N604K502j552o122o492m61N611N876K845r33n658o800j281
$$ plain form
1552 -7470 -2644 3439 6675 6192 1320 -5614 -7934 -3662 2489 6029 6160 1781 -5030 -8208 -4576
1567 -4576 1447 5586 6191 2371 -4364 -8003 -5355 482 5010 6249 2964 -3398 -7770 -5973 -190
1582 -190 4763 6327 3889 -2236 -7313 -6182 -647 4350 6437 4752 -1102 -6561 -6306 -1219 4091
1597 4091 6640 5233 16 -5671 -6433 -1898 3702 6432 5569 1070 -4881 -6712 -2621 2979 6148
1612 6148 5936 1735 -4342 -6688 -3337 2035 5727 6008 2061 -3882 -6810 -4211 1151 5105 5757 2573
1628 2573 -3186 -6944 -4966 339 4373 5587 3184 -2551 -6913 -5521 -446 3809 5559 3615 -1904
1643 -1904 -6477 -5902 -1200 3518 5466 3958 -852 -5764 -6127 -1676 3166 5335 4490 173 -5093 -6123
1659 -6123 -2156 2598 5455 5211 948 -4442 -5896 -2657 2212 5466 5406 1660 -3611 -5843 -3122 1777
$$ packed form
1552g470M826O083L236m83m872o934k320M272O151L540J31m379o811l178L632
1567d576O023M139O05l820o735l639K648N837M528J239l285o362m372J797N783
1582a90M953J564k438o125n077J131N535M997K087j685n854n459K55N087N310
1597D091K549j407n217n687p62M535N600K730q63m499n951j831M091N600L169
1612F148k12m201o077k346L351N372L692K81l947n943k928K599N362L954O52l184
1628B573n759l758J978N305M034J214k403n735m362J392N075M255J750j944n519
1643a904m573N75M702M718J948j508m810m912l63M451M842K169q45m317n266j030
1659f123L967M754K857k44m263n390j454L239M869L254o0l746n271k232K721M899
$$ plain form
1675 1777 5038 5483 2474 -2853 -5868 -3581 1018 4397 5534 3062 -2411 -5820 -4206 75 3893
1690 3893 5380 3180 -1821 -5732 -4865 -630 3358 4974 3430 -1186 -5573 -5379 -1250 2654 4623
1705 4623 3896 -534 -5252 -5534 -1957 2134 4681 4127 6 -4611 -5608 -2551 1828 4540 4347 939
1721 939 -3849 -5555 -2686 1477 4258 4834 1899 -3227 -5323 -2938 1043 4139 5133 2400 -2467 -5087
1737 -5087 -3346 639 3964 4994 2975 -1657 -4941 -3765 225 3499 4787 3492 -1076 -4819 -4066
1752 -4066 -596 2801 4716 3623 -671 -4609 -4601 -1390 2344 4443 3548 -152 -4332 -5025 -1854 1853
1768 1853 3837 3774 459 -4001 -5090 -2306 1062 3540 4119 1061 -3531 -5102 -2850 726 3592 4149
1784 4149 1667 -2702 -5039 -3214 626 3388 4182 2417 -1979 -4842 -3228 338 2920 4357 2997
$$ packed form
1675A777L261M45l009n327l015K287M599L379J137k472n473l409J614M281L818
1690C893J487k200n001l911Q67M235L988J616j544m616m387J94M129L904J969
1705D623p27m430m718k82L577M091K547n54m121m617r97L057M379K712j93l408
1721I39m788j706K869M163K781N76k935n126k096K385L981L096R94k733m867k620
1737e087J741L985L325J030k019m632l284J176L990L274J288j295m568l743P53
1752d066L470L397J915j093m294l938QL211L734K099q95l700m180o93L171L707
1768A853J984o3l315m460j089K784L368K478N79l058m592j571K252L576K866N57
1784D149k482m369k337J825L840K762P94j765m396k863J614L566K582J437j360
$$ plain form
1799 2997 -1290 -4288 -3431 -305 2764 4435 3314 -547 -3978 -3831 -697 2653 4205 3507 81 -3903
1815 -3903 -4034 -949 2051 3766 3748 476 -3620 -4157 -1590 1338 3602 3695 736 -3126 -4452 -2467
1831 -2467 1001 3240 3507 1313 -2787 -4751 -2698 667 2729 3524 1740 -2394 -4586 -2933 -16
1846 -16 2517 3703 2068 -1755 -4247 -3271 -337 2477 3681 2481 -934 -3982 -3472 -373 2287 3561
1862 3561 3062 -312 -3722 -3437 -623 1956 3655 3495 214 -3194 -3458 -1111 1727 3568 3422 725
1878 725 -2758 -3756 -1580 1442 3241 3398 1246 -2450 -3910 -1810 928 2768 3437 1432 -2254 -3884
1894 -3884 -2392 283 2536 3336 1558 -1827 -3900 -2866 -15 2287 3066 1863 -1376 -3956 -3118 -405
1910 -405 1872 3045 2214 -907 -3668 -3229 -759 1634 3139 2563 -372 -3232 -3307 -1006 1563 3039
$$ packed form
1799B997m287k998Q57L126L069J671j121l861l431J47L134L350J552o98l426l984
1815c903j31L085L000J715j8l272m096n37K567K928K264R3k959l862j326J985
1831b467L468K239K67k194m100j964K053L365K062P95j784m134k192J653K917
1846a6K533J186j635l823k492R76K934K814J204j200l415l048N10L099K660J274
1862C561m99l374l410K85K814K579J699j60l281l408k64K347K838J841j46k697
1878G25l483r98K176L022J799J57k152l696j460K100K738J840O69k005l686j630
1894c884J492K675K253Q00j778l385k073J034K851K302P79j203l239k580Q38K713
1910d05K277J173q31l121k761M39K470K393J505n76k935k860p5K301K569J476
$$ plain form
1926 3039 2766 336 -2799 -3380 -1127 1455 2981 3020 807 -2341 -3282 -1403 1079 2818 3264 1220
1942 1220 -1880 -3173 -1755 720 2657 3192 1536 -1539 -3270 -2162 348 2293 3038 1810 -1291
1957 -1291 -3344 -2426 -73 1861 2889 1955 -1002 -3242 -2761 -511 1578 2673 2043 -612 -3078 -2993
1973 -2993 -913 1298 2622 2257 -177 -2863 -3097 -1158 1031 2528 2512 214 -2531 -3071 -1338 830
1989 830 2454 2709 704 -2049 -2944 -1446 622 2349 2833 1202 -1655 -2892 -1608 544 2170 2930
2005 2930 1651 -1272 -2816 -1800 219 1989 2893 1802 -861 -2774 -2132 -69 1686 2717 1993 -576
2021 -576 -2651 -2404 -483 1400 2514 2129 -350 -2595 -2587 -800 1052 2274 2156 -99 -2466 -2704 -1182
2038 -1182 700 2111 2205 237 -2295 -2794 -1318 501 1958 2357 681 -1908 -2774 -1490 367 1843
$$ packed form
1926C039k73k430l135n81K253K582J526L9k213l148r41J879K482J739M46k044
1942A220l100j293J418K475J937N35j656l075j731J108K510J945P45j228l101
1957a291k053R18K353J934J028r34k957k240M81K250K089J095o30k655k466Q5
1973b993K080K211J324l65k434k686k34J939K189J497j6k298k745n40J733K168
1989H30J624K55k005k753q95J498K068J727M84j631k857j237J284K152J626P60
2005B930j279k923j544J016K019J770R04j091k663j913O42K063J755J031p24k569
2021e76k075K47J921J883J114l85k479k245QJ787J852J222j18k255k367k38J522
2038a182J882J411R4j968k532m99J476J819J457L99j676k589q66J284J857J476
$$ plain form
2054 1843 2357 1084 -1544 -2682 -1569 239 1752 2492 1437 -1057 -2576 -1758 94 1636 2505 1767
2070 1767 -654 -2375 -1874 -103 1457 2492 2017 -373 -2238 -2024 -384 1227 2305 2100 -14 -2153
2086 -2153 -2203 -631 869 2082 2022 240 -2074 -2378 -998 626 1822 2128 419 -1923 -2521 -1182 422
2103 422 1561 2082 692 -1657 -2497 -1459 176 1474 2048 1001 -1266 -2469 -1577 2 1344 2103
2119 2103 1293 -941 -2332 -1673 -94 1230 2029 1545 -571 -2179 -1762 -259 1136 2101 1781 -126 -1937
2136 -1937 -1878 -360 1010 1944 1970 134 -1843 -1872 -637 786 1803 2024 468 -1611 -2032 -833 588
2153 588 1664 1986 676 -1418 -2159 -1110 407 1421 1870 916 -1193 -2181 -1301 88 1216 1792 1059
2170 1059 -969 -2147 -1534 -153 1067 1855 1201 -726 -2119 -1703 -367 962 1724 1423 -393 -1984
$$ packed form
2054A843N14j273k628j138J113J808J513P40j055k494j519Q18J852J542Q69p38
2070A767k421j721N01J771J560J035m75k390j865K14J640J611J078k05k114k139
2086b153n0J572J500J213o0j782k314l04J380J624J196L06j709k342n98J339J604
2103D22J139N21j390k349q40J038J635J298N74j047k267j203Q92J579J342P59
2119B103q10k234j391O59J579J324P99m84k116j608M17J503J395R65l20j907j811
2136a937N9J518J370R34K6j836j977k9J235J423J017K21j556k079m21J199J421
2153E88J076L22j310k094p41J049J517J014M49r54k109r88Q80J389J128N76p33
2170A059k028j178O13J381J220P88o54j927j393M16J336J329P62l01j816j591
$$ plain form
2186 -1984 -1745 -425 805 1654 1613 -4 -1734 -1726 -586 685 1648 1678 258 -1519 -1801 -678 590 1611
2204 1611 1835 538 -1280 -1827 -784 425 1415 1865 821 -1135 -1844 -936 226 1272 1800 930 -914
2221 -914 -1793 -1193 -28 1129 1699 1066 -692 -1831 -1406 -198 958 1614 1203 -545 -1895 -1467 -306
2238 -306 730 1520 1313 -360 -1687 -1540 -602 594 1434 1433 -10 -1471 -1649 -623 554 1356 1551 305
2256 305 -1350 -1732 -686 355 1363 1681 532 -1159 -1599 -855 235 1258 1662 698 -859 -1532 -984
2273 -984 174 1169 1647 985 -660 -1617 -1111 -12 924 1603 1146 -568 -1579 -1149 -273 756 1534 1122
2291 1122 -363 -1469 -1247 -406 625 1415 1200 -82 -1432 -1485 -523 465 1307 1353 103 -1448 -1474 -586
2309 -586 190 1166 1436 271 -1216 -1462 -830 108 1109 1383 489 -916 -1494 -896 124 937 1447 811
$$ packed form
2186a984K39J320J230Q49m1j617j730QJ140J271R63L0j420j777k82J123J268J021
2204A611K24j297j818n47J043J209R90M50j044j956p09R08J162J046N28q70j844
2221i14q79O00J165J157N70o33j758j139M25J208J156O56m11j748j350M28J161
2238c06J036P90k07j673j327J47R38J196Q40jj443j461j78J026J177Q02J95j246
2256C05j655l82J046J041J008L18j149j691m40P44J090J023M04r64j557o73N48
2273i84J158R95M78o62j645r57N06J099R36O79m57j714j011M30Q76J029P78m12
2291A122j485j106K22Q41J031P90k15j282j350n3R62R88Q42M6j250j551k6Q88
2309e86P76R76K70j165j487k46O32R38J001K74q94j405n78N98J020Q13N10o36
$$ plain form
2327 811 -768 -1542 -846 25 796 1537 874 -684 -1313 -920 -164 801 1450 1023 -326 -1240 -1031 -215 722
2346 722 1281 1230 -85 -1315 -1170 -257 421 1252 1364 -26 -1266 -1123 -513 261 1171 1230 115 -1047 -1253
2365 -1253 -643 149 1021 1172 362 -954 -1414 -751 22 820 1273 630 -916 -1370 -781 -60 685 1291 691
2384 691 -613 -1227 -857 -146 685 1267 824 -333 -1264 -893 -212 585 1142 1114 -174 -1179 -935 -233 461
2403 461 1148 1195 -49 -1068 -987 -415 334 1082 1107 136 -927 -1093 -474 287 919 1171 344 -903 -1183 -562
2423 -562 99 756 1226 498 -805 -1174 -629 -73 668 1160 585 -599 -1140 -727 -145 618 1027 681 -465
2442 -465 -1149 -849 -203 468 1096 881 -280 -1077 -855 -274 310 1028 949 -139 -1004 -832 -348 307 922 998
2462 998 112 -925 -948 -345 255 896 1097 307 -815 -966 -378 196 814 1121 376 -708 -958 -517 9
$$ packed form
2327H11j579p74O96Q71P71P41o63j558o29L93P56R65O49m27j349r14K09Q16R37
2346G22N59n1j315j230J45R13O78Q31J12j390j240J43O10P74R10N9j115j162k06
2365a253O10P92Q72J51q10j316m60O63P73P98M53o43j546m54N89P21P45O06o00
2384F91j304o14L70P11Q31N82m43j157r31L71O81P97N57k8j288j005K44P02O94
2403D61O87M7j244j019Q1N72P49P48K5r71j063j66O19P61O32K52q27j247k80O21
2423e62O61O57M70p28j303l69N45N56P41M92n75j184n41M13N82P63M09l46j146
2442d65o84L00O46O71O28k15j161p97K22N81N84P18p9j088q65J72M84O55O15P6
2462I98q86j037k3O03O00O41K01p90j122j51N88N74O18L07p45j084k50M41N26
$$ plain form
2481 9 672 1087 463 -583 -1024 -618 -29 591 1001 675 -384 -1007 -646 -125 419 977 739 -330 -1009 -735
2501 -735 -281 331 828 750 -191 -921 -755 -270 243 793 868 -3 -869 -885 -338 194 771 922 74 -760 -859
2522 -859 -459 132 719 1020 338 -664 -883 -467 36 664 1011 361 -483 -845 -417 -60 531 996 557 -388
2542 -388 -852 -519 -115 414 916 659 -278 -830 -629 -222 287 833 687 -155 -767 -663 -333 204 749 749 -66
$$ packed form
2481IO63M15o24j046m41M06N89O20M10l26j059o23L61N21N44N58k38j069o79K74
2501g35M54O12M97p8r41p30J66M85N13N50P5q71q66j6N47N32N77J51q48q34r9
2522h59M00N91N87L01o82j002k19M16N03O28L47o50q44l62M28L57N91M65m39r45
2542c88m64L33M04N29N02k57r37n52K01M07N09N46j46q42o12J04L30N37N45%q15
$$ [...]
8191a5
##END NTUPLES=NMR FID
##END=
