##TITLE=1H_PhEDiP0706
 CDCl3
 8 sc, 
 8.6.2023
##JCAMPDX= 6.0         $$ Bruker NMR JCAMP-DX V2.0
##DATA TYPE= NMR FID
##DATA CLASS= NTUPLES
##ORIGIN= UXNMR, Bruker Analytische Messtechnik GmbH
##OWNER= root
$$ XWIN-NMR		Version 3.5
$$ Thu Jun  8 13:55:37 2023 Russian Standard Time (UT+4h)  she@DPX200
##.OBSERVE FREQUENCY= 200.13135
##.OBSERVE NUCLEUS= ^1H
##.DELAY= (6, 6)
##.ACQUISITION MODE= SIMULTANEOUS
##.ACQUISITION SCHEME= undefined
##.AVERAGES= 8
##.DIGITISER RES= 18
##SPECTROMETER/DATA SYSTEM= spect
##.PULSE SEQUENCE= zg30
##.SOLVENT NAME= CDCl3
##.SHIFT REFERENCE= (INTERNAL, CDCl3, 0, 15.7039)
##AUDIT TRAIL= $$ (NUMBER, WHEN, WHO, WHERE, WHAT)
$$ ##TITLE= Audit trail, XWIN-NMR		Version 3.5
$$ ##JCAMPDX= 5.01
$$ ##ORIGIN= Bruker BioSpin GmbH
$$ ##OWNER= she
$$ F:/spectra/data/she/nmr/H-F/1/audita.txt
$$ ##AUDIT TRAIL=  $$ (NUMBER, WHEN, WHO, WHERE, WHAT)
(   1,<2023-06-08 13:54:36.34 +0400>,<she>,<DPX200>,
      <created by zg, POWCHK disabled, PULCHK disabled
       configuration hash MD5:
       00 E9 B6 7A A2 85 ED C7 34 08 36 98 17 FE 4E 26
       data hash MD5: 16K
       6D D2 52 28 F3 83 25 69 A7 E2 A5 8A DB 0D AC 6B>)
$$ ##END=
$$ 
$$ hash MD5
$$ 4C 85 FA 5A 57 BB 5B A2 6B 38 B6 39 86 EE E7 F4
##$RELAX= 
##$RELAX= 
##$RELAX= 
##$RELAX= 
##$RELAX= 
##$RELAX= 
$$ Bruker specific parameters
$$ --------------------------
##$DU= <F:/spectra>
##$EXPNO= 1
##$NAME= <H-F>
##$PROCNO= 1
##$TYPE= <nmr>
##$USER= <she>
##$AMP= (0..31)
100 100 100 100 100 100 100 100 100 100 100 100 100 100 100 100 100 100 
100 100 100 100 100 100 100 100 100 100 100 100 100 100 
##$AQSEQ= 0
##$AQ_mod= 1
##$AUNM= <au_zg>
##$AUTOPOS= <>
##$BF1= 200.13
##$BF2= 200.13
##$BF3= 200.13
##$BF4= 200.13
##$BF5= 200.13
##$BF6= 200.13
##$BF7= 200.13
##$BF8= 200.13
##$BYTORDA= 1
##$CFDGTYP= 0
##$CFRGTYP= 5
##$CHEMSTR= <none>
##$CNST= (0..31)
1 1 145 1 1 1 1 1 1 1 1 1 1 1 1 1 1 1 1 1 1 1 1 1 1 1 1 1 1 1 1 1 
##$CPDPRG= <>
##$CPDPRG1= <>
##$CPDPRG2= <>
##$CPDPRG3= <>
##$CPDPRG4= <mlev>
##$CPDPRG5= <mlev>
##$CPDPRG6= <mlev>
##$CPDPRG7= <mlev>
##$CPDPRG8= <mlev>
##$CPDPRGB= <>
##$CPDPRGT= <>
##$D= (0..31)
0 1.2 0 0 0 0 0 0 0 0.06 0 0.03 0 0 0 0 0.0002 0 0 0 0 0 0 0 0 0 0 0 0 
0 0 0 
##$DATE= 1686218075
##$DBL= (0..7)
120 120 120 120 120 120 120 120 
##$DBP= (0..7)
150 150 150 150 150 150 150 150 
##$DBP07= 0
##$DBPNAM0= <>
##$DBPNAM1= <>
##$DBPNAM2= <>
##$DBPNAM3= <>
##$DBPNAM4= <>
##$DBPNAM5= <>
##$DBPNAM6= <>
##$DBPNAM7= <>
##$DBPOAL= (0..7)
0.5 0.5 0.5 0.5 0.5 0.5 0.5 0.5 
##$DBPOFFS= (0..7)
0 0 0 0 0 0 0 0 
##$DE= 6
##$DECBNUC= <off>
##$DECIM= 32
##$DECNUC= <off>
##$DECSTAT= 4
##$DIGMOD= 1
##$DIGTYP= 9
##$DL= (0..7)
0 120 120 120 120 120 120 120 
##$DP= (0..7)
150 150 150 150 150 150 150 150 
##$DP07= 0
##$DPNAME0= <>
##$DPNAME1= <>
##$DPNAME2= <>
##$DPNAME3= <>
##$DPNAME4= <>
##$DPNAME5= <>
##$DPNAME6= <>
##$DPNAME7= <>
##$DPOAL= (0..7)
0.5 0.5 0.5 0.5 0.5 0.5 0.5 0.5 
##$DPOFFS= (0..7)
0 0 0 0 0 0 0 0 
##$DQDMODE= 0
##$DR= 18
##$DS= 0
##$DSLIST= <SSSSSSSSSSSSSSS>
$$ [...]
##$SUBNAM2= <"">
##$SUBNAM3= <"">
##$SUBNAM4= <"">
##$SUBNAM5= <"">
##$SUBNAM6= <"">
##$SUBNAM7= <"">
##$SUBNAM8= <"">
##$SUBNAM9= <"">
##$SW= 18.05172834244
##$SWIBOX= (0..15)
0 0 2 0 0 0 0 0 0 0 0 0 0 0 0 0 
##$SW_h= 3612.71676300578
##$TD= 16384
##$TD0= 1
##$TE= 0
##$TE2= 300
##$TE3= 300
##$TEG= 300
##$TL= (0..7)
0 120 120 120 120 120 120 120 
##$TP= (0..7)
150 150 150 150 150 150 150 150 
##$TP07= 0
##$TPNAME0= <>
##$TPNAME1= <>
##$TPNAME2= <>
##$TPNAME3= <>
##$TPNAME4= <>
##$TPNAME5= <>
##$TPNAME6= <>
##$TPNAME7= <>
##$TPOAL= (0..7)
0.5 0.5 0.5 0.5 0.5 0.5 0.5 0.5 
##$TPOFFS= (0..7)
0 0 0 0 0 0 0 0 
##$TUNHIN= 0
##$TUNHOUT= 0
##$TUNXOUT= 0
##$USERA1= <user>
##$USERA2= <user>
##$USERA3= <user>
##$USERA4= <user>
##$USERA5= <user>
##$V9= 5
##$VALIST= <valist>
##$VCLIST= <CCCCCCCCCCCCCCC>
##$VD= 0
##$VDLIST= <DDDDDDDDDDDDDDD>
##$VPLIST= <PPPPPPPPPPPPPPP>
##$VTLIST= <TTTTTTTTTTTTTTT>
##$WBST= 1024
##$WBSW= 4
##$XGAIN= (0..3)
0 0 0 0 
##$XL= 0
##$YL= 0
##$YMAX_a= 181039
##$YMIN_a= -254597
##$ZGOPTNS= <>
##$ZL1= 120
##$ZL2= 120
##$ZL3= 120
##$ZL4= 120
##$ABSF1= 10
##$ABSF2= 0
##$ABSG= 5
##$ABSL= 3
##$ALPHA= 0
##$AQORDER= 0
##$ASSFAC= 0
##$ASSFACI= 0
##$ASSFACX= 0
##$ASSWID= 0
##$AUNMP= <proc_1d>
##$AZFE= 0.1
##$AZFW= 0.1
##$BCFW= 1
##$BC_mod= 2
##$BYTORDP= 1
##$COROFFS= 0
##$CY= 11.3945322036743
##$DATMOD= 1
##$DC= 2
##$DFILT= <>
##$DTYPP= 0
##$F1P= 15.7292609196834
##$F2P= 12.9074282941183
##$FCOR= 0.5
##$FTSIZE= 0
##$FT_mod= 4
##$GAMMA= 1
##$GB= 0.15
##$INTBC= 1
##$INTSCL= 1
##$ISEN= 128
##$LB= 0.24
##$LEV0= 0
##$LPBIN= 0
##$MAXI= 10000
##$MC2= 0
##$MEAN= 0
##$ME_mod= 0
##$MI= 1.114404
##$NCOEF= 0
##$NC_proc= 0
##$NLEV= 6
##$NOISF1= 3.799351
##$NOISF2= 2.8
##$NSP= 1
##$NTH_PI= 0
##$NZP= 0
##$OFFSET= 15.70392
##$PC= 1
##$PHC0= -20064.36
##$PHC1= 11.85272
##$PH_mod= 1
##$PKNL= yes
##$PPARMOD= 0
##$PSCAL= 0
##$PSIGN= 0
##$REVERSE= no
##$SF= 200.130013532006
##$SI= 16384
##$SIGF1= 3
##$SIGF2= 2
##$SINO= 400
##$SIOLD= 16384
##$SREGLST= <1H.CDCl3>
##$SSB= 0
##$STSI= 0
##$STSR= 0
##$SW_p= 3612.71676300578
##$SYMM= 0
##$S_DEV= 0
##$TDeff= 0
##$TDoff= 0
##$TI= <>
##$TILT= no
##$TM1= 0
##$TM2= 0
##$TOPLEV= 0
##$USERP1= <user>
##$USERP2= <user>
##$USERP3= <user>
##$USERP4= <user>
##$USERP5= <user>
##$WDW= 1
##$XDIM= 8192
##$YMAX_p= 0
##$YMIN_p= 0
$$ End of Bruker specific parameters
$$ ---------------------------------
##NTUPLES= NMR FID
##VAR_NAME=  TIME,          FID/REAL,        FID/IMAG
##SYMBOL=    X,             R,               I
##VAR_TYPE=  INDEPENDENT,   DEPENDENT,       DEPENDENT
##VAR_FORM=  AFFN,          ASDF,            ASDF
##VAR_DIM=   8192,          8192,            8192
##UNITS=     SECONDS,       ARBITRARY UNITS, ARBITRARY UNITS
##FACTOR=    0.0002768,     1,               1
##FIRST=     0,             0,               0
##LAST=      2.2672688,     0,               0
##MIN=       0,             -254597,         0
##MAX=       2.2672688,     181039,          0
$$ Real data points
##PAGE= N=1
##DATA TABLE= (X++(R..R)), XYDATA
$$ [...]
$$ plain form
1000 -321 -301 390 1821 -232 -2160 -147 -510 -2991 -578 1838 -753 -2024 -1140 -1498 -473 1021 -175
1017 -175 330 1768 -1128 -2194 1872 2384 367 1531 1334 -600 562 765 -322 2249 2327 -2470 -1984
1034 -1984 1618 -911 -2081 1641 630 -2792 -1350 -930 -2315 415 1454 -1976 -1039 1984 -1255
1049 -1255 -2438 2942 2931 -1899 39 2751 -931 -879 3418 1234 -953 2688 541 -3927 1399 3457
1065 3457 -3622 -1317 4583 -2328 -5221 2987 966 -4709 1852 2326 -5399 -295 3895 -4458 -1768
1080 -1768 7039 -1027 -5413 4831 2511 -5687 2294 5597 -3353 -482 4740 -3015 -2675 6003 295
1095 295 -4959 3795 2763 -6927 -1053 5678 -2371 -3379 4272 -568 -5605 1839 1949 -4578 1470
1110 1470 4785 -4948 -3099 6104 -964 -5312 5369 3560 -6166 905 5410 -3679 -762 6192 -2544
$$ packed form
1000c21K0O91J431k053j928K013l63k481K413K416k591j271Q84l58J025J494j196
1017a75N05J438k896j066M066N12k017J164j97j934J162K03j087K571P8m797M86
1034a984L602k529j170L722j011l422J442M20j385K730J039l430R37L023l239
1049a255j183N380j1m830J938K712l682N2M297k184k187L641k147m468N326K058
1065C457p079K305N900o911k893Q208k021n675O561M74p725N104M190q353K690
1080a768Q807q066m386J0244k320q198P981L303q950K871N222p755L40Q678n708
1095B95n254Q754j032r690N874O731q049j008P651m840n037P444J10o527O048
1110A470L315r733J849R203p068m348J0681j809r726P071M505r089K917O954q736
$$ plain form
1125 -2544 -4022 5543 143 -5617 4631 4056 -6689 -714 4939 -3940 -2844 5196 -826 -4484 2605
1140 2605 129 -4678 2432 3540 -4007 -926 3981 -2126 -3132 3896 2234 -2591 983 2081 -2068
1155 -2068 -163 3011 -620 -1050 2702 -453 -3624 1555 2676 -2698 -623 2985 -1679 -3161 1038
1170 1038 -186 -1745 1482 654 -1946 1122 940 -2971 -340 2583 -651 -806 2148 789 -639 349
1186 349 -239 299 1596 -292 -543 1482 -199 -1801 447 453 -572 767 -393 -1797 650 91 -2803
1203 -2803 333 2436 -1691 -1425 2170 -186 -1718 1398 688 -1322 1209 1241 -1837 545 2787 -1073
1219 -1073 -1615 2663 963 -2898 305 2125 -1962 -1286 2307 -542 -1954 1989 -196 -3703 1383
1234 1383 2219 -3683 -73 4680 -2154 -3494 3802 724 -3856 2756 2935 -3563 722 3359 -3696
$$ packed form
1125b544j478R565n400n760J0248n75j0745N975N653q879J096Q040o022l658P089
1140B605k476m807P110J108p547L081M907o107j006P028j662m825L574J098m149
1155b068J905L174l631m30L752l155l171N179J121n374K075L608m664j482M199
1170A038j224j559L227q28k600L068j82l911K631K923l234j55K954j359j428R88
1186C49n88N38J297j888k51K025j681j602K248Oj025J339j160j404K447n59k894
1203b803L136K103m127K66L595k356j532L116p10k010K531L2l078K382K242l860
1219a073n42M278j700l861L203J820m087O76L593k849j412L943k185l507N086
1234A383Q36n902L610M753o834j340P296l078m580O612J79o498M285K637p055
$$ plain form
1249 -3696 -1066 5297 -1488 -3784 4343 1002 -5597 1180 3555 -3542 -1019 3730 -2115 -2790 3240
1264 3240 -329 -3728 2770 2597 -4173 -183 4434 -1992 -3013 3966 1330 -3542 1755 2724 -3144
1279 -3144 -74 3619 -2563 -2132 4423 -587 -4727 2872 2484 -5045 -280 4212 -2724 -2407 3726 -994
1295 -994 -3332 3082 736 -4040 2268 3330 -3795 -586 4582 -1316 -2857 3386 1270 -2932 1320
1310 1320 2130 -2276 -58 2390 -1976 -1723 2686 -352 -3368 1342 2089 -3095 -1178 2560 -1157 -2324
1326 -2324 1898 497 -2188 1477 1547 -2232 584 2912 -1648 -1074 3413 335 -2505 1885 1789 -2138
1342 -2138 40 1704 -1299 -637 1320 -1193 -1489 1269 -441 -2484 317 1147 -1707 -1058 1189 108
1358 108 -1030 224 690 -8 393 721 133 510 1271 137 -546 1197 1228 -950 -433 1444 -48 -1578
$$ packed form
1249c696K630O363o785k296Q127l341o599O777K375p097K523M749n845o75O030
1264C240l569l399O498j73o770L990M617o426j021O979k636m872N297R69n868
1279c144L070L693o182M31O555n010m140P599l88p529M765M492o936L17O133m720
1295i94k338O414k346m776O308J062p125L209N168n898j541O243k116m202M252
1310A320Q10m406K218K448m366K53M409l038l016M710P47n184J917L738l717j167
1326b324M222j401k685L665P0l779K816K328m560N74M487l078k840M390r6l927
1342b138K178J664l003O62J957k513k96K758j710k043K801Q30k854O49K247j081
1358A08j138J254M66o98M01L28n88L77P61j134o83J743L1k178N17J877j492j530
$$ plain form
1376 -1578 -33 369 -1014 -731 -218 -796 -394 16 -1122 -776 629 -19 -1117 301 1346 -103 -596
1393 -596 963 1107 -167 199 1048 493 134 622 36 -286 974 307 -1342 173 1022 -1481 -1354 1131
1411 1131 -156 -1690 140 195 -1358 -114 509 -1025 20 1130 -1053 -942 1732 567 -1200 937
1427 937 1491 -893 -328 1358 323 -39 975 -35 -640 764 316 -1148 404 1260 -1269 -1520 793
1444 793 117 -1409 -15 595 -1010 -813 45 -594 70 1020 -562 -1003 927 433 -1050 665 1889
1461 1889 -70 -499 680 390 172 810 370 -104 422 -182 -949 222 866 -492 -988 -255 -403 -991
1479 -991 -663 58 167 -358 -830 -425 187 190 42 352 448 283 -31 8 866 1340 316 -125 672 504 -501
1500 -501 -54 878 -3 -711 -257 -301 -484 -34 -360 -888 49 -47 -1393 -493 1009 -201 -1000 617 745
$$ packed form
1376a578J545M02j383K83N13n78M02M10j138L46J405o48j098J418J045j449m93
1393e96J559J44j274L66Q49n55l59M88n86l22J260o67j649J515Q49k503J27K485
1411A131j287j534J830N5j553J244O23j534J045J110k183J11K674j165j767K137
1427I37N54k384N65J686j035l62J014j010o05J404m48j464J552Q56k529k51K313
1444G93o76j526J394O10j605J97Q58o39O64R50j582m41J930m94j483J715J224
1461A889j959m29J179k90k18O38m40m74N26o04p67J171O44j358m96P33j48n88
1479i91L28P21J09n25m72M05O12Lj48L10R6j65l14L9Q58M74j024m41P97j68j005
1500e01M47R32q81p08M54m4j83M50l26n28R37r6j346R00J502j210p99J617J28
$$ plain form
1519 745 -655 100 857 -131 233 811 -294 30 1413 -46 -1042 984 923 -1245 -210 1113 -552
1536 -552 -1004 478 -41 -631 596 -104 -1208 269 564 -1287 -172 1578 -267 -1329 613 438 -797
1553 -797 436 806 -542 -91 416 -884 -15 1679 44 -1027 706 400 -1245 169 1381 1
1569 1 -173 162 -723 -308 934 23 -490 759 -119 -1718 -288 1009 -125 -336 285 -511 -816 -39 -27
1588 -27 280 1016 23 -1168 98 776 -218 313 1312 152 -777 -113 41 192 1027 357 -730 46 -67
1607 -67 -1319 50 1481 -258 -1079 138 -438 -1010 571 577 -503 334 128 -1504 93 1723 -197
1624 -197 -490 1319 3 -1503 595 1160 -320 569 710 -1286 -476 1121 -566 -691 1572 88 -2110
1641 -2110 26 1061 -948 -288 1271 -511 -1030 596 -264 -869 1364 773 -1673 93 1508 -1198
$$ packed form
1519G45j400P55P57r88L64N78j105L24J383j459r96K026o1k168J035J323j665
1536e52m52J482n19n90J227p00j104J477K95j851J115J750j845j062J942j75j235
1553g97J233L70j348M51N07j300Q69J694j635j071J733l06j645J414J212j380
1569Aj74L35q85M15J242r11n13J249q78j599J430J297j134k11O21p96l05P77J2
1588b7L07P36r93j191J266O78r94N31R99j160r29O64J54J51Q35o70j087P76j13
1607f7j252J369J431j739q21J217n76n72J581Oj080Q37k06j632J597J630j920
1624a97k93J809j316j506K098N65j480Q89J41j996Q10J597j687j25K263j484k198
1641b110K136J035k009O60J559j782n19J626q60o05K233n91k446J766J415k706
$$ plain form
1657 -1198 -934 1891 280 -1565 605 723 -1230 483 1275 -1119 -294 1591 -1001 -1421 1909 630
1673 630 -1906 660 1475 -1493 -473 1531 -565 -843 1234 -313 -1446 1104 606 -1771 190 1547
1689 1547 -1249 -1130 1437 111 -1353 743 762 -1049 208 1016 -864 -116 1719 -265 -1146 1378
1705 1378 756 -1501 297 1588 -760 -691 1155 -367 -1124 720 11 -1251 661 617 -1750 -431 1321
1722 1321 -863 -1089 1257 393 -1246 244 725 -555 336 962 -377 1 1145 -244 -676 1176 791
1739 791 -901 18 961 -358 -707 322 108 -595 -103 -193 -731 -73 199 -886 -474 641 -149 -864 374
1758 374 596 -321 -89 500 265 244 483 101 253 617 25 -182 463 466 -197 -325 140 45 -368 -412 -31 189
1780 189 -449 -699 -26 -89 -455 -83 84 -150 68 34 -461 237 743 -322 -238 1012 358 -743 378 831
$$ packed form
1657a198K64K825j611j845K170J18j953J713P92k394Q25J885k592m20L330j279
1673F30k536K566Q15k968J020K004k096k78K077j547j133K550m98k377J961J357
1689A547k796J19K567j326j464K096J9j811J257Q08j880P48J835j984q81K524
1705A378o22k257J798J291k348O9J846j522p57J844p09j262J912m4k367J319J752
1722A321k184k26K346q64j639J490M81j280Q91O26j339L78J144j389m32J852l85
1739G91j692R19R43j319l49J029k14p03M92r0n38O58K72j085M12J115p90p15J238
1758C74K22r17K32N89k35k1K39l82J52L64n92k07O45Lo63j28M65r5m13m4L81K20
1780A89o38k50O73o3l66L72J67k34K18l4m95O98N06j065Q4J250o54j101J121M53
$$ plain form
1800 831 -358 -83 701 -65 -244 570 -268 -586 584 290 -1107 45 950 -827 -989 834 56 -1200
1818 -1200 269 445 -960 7 730 -950 -349 1378 -509 -1135 1409 814 -1320 459 1517 -783
1834 -783 -384 1479 -118 -645 1413 215 -1310 1002 880 -1829 -244 1631 -1070 -1504 1189 -31
1850 -31 -1760 272 516 -1484 -31 1093 -1111 -601 1703 -270 -1440 1474 1161 -1409 421 1945
1866 1945 -586 -512 1744 62 -1046 1236 450 -1523 606 1214 -1736 -746 1488 -968 -1812 1131
1882 1131 273 -1764 349 832 -1487 -196 1302 -935 -641 1800 55 -1301 1320 1206 -1371 164
1898 164 1720 -559 -587 1355 -34 -1035 861 361 -1396 395 1044 -1400 -681 1315 -540 -1565
1914 -1565 735 490 -1219 44 870 -831 -241 935 -567 -560 1291 219 -1209 784 1033 -1016 -148
$$ packed form
1800H31j189K75P84p66j79Q14q38l18J170k94j397J152R05j777j62J823p78j256
1818a200J469J76j405R67P23j680O01J727j887o26K544n95k134J779J058k300
1834g83L99J863j597n27K058j198j525K312j22k709J585J875k701m34K693j220
1850c1j729K032K44k000J453J124k204N10K304j973j170K914l13k570J830J524
1866A945k531P4K256j682j108K282p86j973K129O08k950R90K234k456q44K943
1882A131q58k037K113M83k319J291J498k237K94K441j745j356K621j14k577J535
1898A64J556k279k8J942j389j001J896n00j757J791O49k444P19J996j855j025
1914a565K300k45j709J263Q26j701N90J176j502PJ851j072j428J993K49k049Q68
$$ plain form
1931 -148 1277 -213 -664 833 133 -580 691 359 -795 342 725 -911 -445 935 -227 -941 406
1948 406 295 -885 -157 281 -519 -176 443 -382 -415 587 -56 -703 452 785 -337 -46 775 138 -144
1967 -144 533 295 -48 476 142 -439 251 439 -514 -283 434 -259 -781 -159 2 -396 -162 -156 -441 -79 -94
1988 -94 -352 54 569 -71 -254 398 405 4 320 562 347 257 24 -71 390 431 -178 -78 232 -234 -724 -125
2010 -125 199 -218 -322 -301 -518 -273 -45 -274 92 421 -272 -607 248 397 -16 360 683 43 -188 206
2030 206 132 344 773 107 -396 107 44 -586 88 731 -176 -655 -187 -246 -442 172 153 -301 -39 -122 -790 -96
2052 -96 888 163 -333 313 115 -486 78 704 322 192 206 -340 -146 525 174 -143 480 163 -777 -316 459
2073 459 -9 -244 198 -133 -610 -242 -83 -118 250 157 -660 -385 274 -93 -218 539 528 -359 -159 304 159
$$ packed form
1931a48J425j490m51J497p00p13J271l32j154J137L83j636M66J380j162p14J347
1948D06j11j180P28M38q00L43O19q25l3J002o43o47J155L33j122K91Q21o37k82
1967a44O77k38l43N24l34n81O90J88r53K31P17o93n22O22J61l98K34Ok85L62j5
1988i4k58M06N15o40j83O52Pm01L16K42k15r0k33r5M61M1o09J00L10m66m90N99
2010a25L24m17j04K1k17K45K28k29L66L29o93l35Q55J49m13L76L23o40k31L94
2030B06p4K12M29o66n03N03o3o30O74O43r07m79M68n9j96O14j9m54K62q3o68O94
2052i6R84p25m96O46j98o01N64O26l82j30J4n46J94O71l51l17O23l17r40M61P75
2073D59m68k35M42l31m77L68J59l5L68r3q17K75O59l67j25P57j1q87K00M63j45
$$ plain form
2094 159 245 436 130 -51 264 23 -167 425 400 -317 -343 179 -107 -430 -10 115 -241 -269 -211 -258 -79 11
2116 11 -267 -209 187 -37 -375 73 350 70 -147 251 355 125 -19 183 188 261 166 -29 141 220 -69 -340
2138 -340 110 264 -301 -368 0 -105 -473 -188 105 -78 -208 -175 -323 -17 176 -84 16 309 81 -379 67
2159 67 534 188 32 291 58 -122 5 125 173 278 52 -335 -174 144 -198 -232 252 60 -505 -348 -22
2180 -22 -24 9 110 -97 -166 13 -198 -59 505 324 -175 -76 281 18 -52 296 343 131 -54 -154 30 264 67
2203 67 -132 58 28 -275 -346 61 145 -110 -262 -191 -46 -82 -266 5 197 -71 -280 -71 117 51 94 145 97
2226 97 120 20 -60 223 439 21 -155 238 163 -211 -9 266 -41 -161 -86 -234 -131 63 -224 -436 67 19
2248 19 -517 -119 412 -142 -275 244 143 -165 159 271 -72 347 336 -201 68 616 -17 -271 482 303 -479
$$ packed form
2094A59Q6J91l06j81L15k41j90N92k5p17k6N22k86l23M20J25l56k8N8m7J79R0
2116A1k78N8L96k24l38M48K77k80k17L98J04k30j44K02NP3r5j95J70P9k89k71
2138c40M50J54n65o7L68j05l68K85K93j83j30L3j48L06J93k60J00K93k28m60M46
2159F7M67l46j56K59k33j80J27J20M8J05k26l87J61L18l42l4M84j92n65J57L26
2180b2kL3J01k07o9J79k11J39N64j81m99R9L57k63p0L48M7k12j85j00J84K34j97
2203F7j99J90l0l03p1M07Q4k55j52P1J45l6j84K71J92k68k09K09J88o6M3N1m8
2226I7K3j00q0K83K16m18j76L93p5l74K02K75l07j20P5j48J03J94k87k12N03m8
2248A9n36L98N31n54j33N19j01l08L24J12l43M19j1n37K69N48o33k54P53j79p82
$$ plain form
2269 -479 -54 279 -255 -249 156 -334 -338 194 -271 -596 255 156 -633 -158 538 -229 -382 474 265 -196 330 303
2291 303 -153 331 431 -254 -18 712 -119 -492 385 318 -533 -106 308 -331 -330 168 -298 -440 286 -168 -610
2312 -610 251 397 -495 -150 596 -93 -326 397 238 -141 261 301 -177 183 422 -283 -178 528 4 -477
2332 -477 213 270 -395 -243 213 -152 -206 96 -110 -254 130 -76 -437 97 293 -318 -225 425 60 -301 141
2353 141 236 -41 73 198 41 156 263 -128 -36 292 22 -308 129 264 -137 -198 47 -20 -167 -132 -76 -84 -75
2376 -75 -62 -187 -54 85 -103 -260 64 161 -146 -165 185 183 -77 -16 184 164 16 160 152 77 162 19 -148 170
2400 170 280 -217 -128 282 11 -353 -48 132 -274 -218 50 -109 -114 92 -209 -271 241 70 -343 120 482 -223
2422 -223 -214 360 160 -218 218 291 -136 123 284 -221 22 429 -155 -326 390 118 -546 21 374 -350 -243
$$ packed form
2269d79M25L33n34OM05m90mN32m65l25Q51r9p89M75O96p67j53Q56k09m61N26k7
2291C03m56M84J00o85K36P30q31l73Q77o7q51M27M14o39JM98m66j42P26m54m42
2312f10Q61J46q92L45P46o89k33P23j59l79M02M0m78L60K39p05J05P06n24m81
2332d77O90N7o65J52M56l65n4L02k06j44L84k06l61N34J96o11R3O50l65l61M42
2353A41R5k77J14J25j57J15J07l91R2L28k70l30M37J35m01o1K45o7j47L5N6qR
2376g5J3j25J33J39j88j57L24R7l07j9L50kk60O1K00k0j48J44qp5Q5j43j67L18
2400A70J10m97Q9M10k71l64L05J80m06N6K68j59nK06l01o2N12j71m13M63L62p05
2422b23RN74k00l78M36P3m27K59J61n05K43M07n84j71P16k72o64N67L53p24J07
$$ plain form
2443 -243 260 -214 -292 217 -92 -461 230 174 -562 -76 560 -189 -336 474 189 -387 262 284 -241 183 411
2464 411 -259 -46 585 -140 -435 534 221 -594 17 393 -321 -273 325 -183 -395 220 -89 -461 285 340 -595
2485 -595 -117 514 -220 -349 566 316 -306 211 242 -287 148 432 -178 -24 499 -163 -434 431 269 -438
2505 -438 -13 307 -395 -299 231 -203 -295 219 -191 -534 180 159 -411 25 419 -142 -222 308 135 -156 326
2526 326 281 -139 123 296 -195 75 485 -57 -290 314 136 -388 -17 213 -162 -117 40 -243 -167 99 -167
2547 -167 -249 182 20 -352 21 358 -73 -93 229 99 -85 159 116 33 288 195 -122 87 228 -90 -58 307
2569 307 65 -226 -85 -85 -134 -19 12 -122 -52 -19 -295 -180 198 -26 -166 135 72 -133 -104 131 80 156 154 -101
2593 -101 13 149 60 -8 290 182 -194 -155 92 -30 0 87 -27 -119 -73 -201 -182 117 130 -224 -106 76 -147
$$ packed form
2443b43N03m74p8N09l09l69O91n6p36M86O36p49j47Q10k85n76O49K2n25M24K28
2464D11o70K13O31p25k95R69l13q15O11L76p14M8N98n08k12O15l09l72P46N5r35
2485e95M78O31p34j29R15k50o22N17L1n29M35K84o10J54N23o62k71Q65j62p07
2505d38M25L20p02R6N30m34r2N14m10l43P14k1n70M36L94n61q0N30j73k91M82
2526C26m5m20K62J73m91K70M10n42k33O04j78n24L71K30l75M5J57k83P6K66k66
2547a67q2M31j62l72L73L37m31k0L22j30j84K44m3q3K55r3l17K09J41l18L2L65
2569C07k42k91J41%m9J15L1j34P0L3k76J15L78k24j40L01o3k05K9K35n1P6kk55
2593a01J14J36q9o8K98j08l76L9K47j22L0Q7j14r2M6j28J9K99J3l54J18J82k23
$$ plain form
2616 -147 -187 162 216 -6 -3 -91 -74 100 225 -1 107 149 -109 -165 169 229 -21 37 69 -84 -136 -5 36 55 132
2641 132 -140 -244 -64 71 -156 22 187 -99 -287 -65 117 50 108 97 -10 -27 13 -71 145 279 122 -155
2663 -155 13 133 -67 -55 187 74 -74 -83 -59 -70 99 66 -108 -38 -1 -226 -174 164 99 -187 -64 66 -110
2686 -110 -84 112 76 69 48 -67 -86 197 112 -79 91 241 -56 -168 51 144 -43 -24 19 -91 -78 -17 -132 -47
2710 -47 100 -115 -230 14 18 -193 -93 115 -5 -145 32 117 -57 12 67 15 104 128 -76 36 225 45 -85
2733 -85 103 144 -74 -14 34 -75 -29 -39 -118 -73 33 -65 -171 54 120 -161 -84 135 68 -63 10 8 70 0 -15 -6 83
2760 83 95 -88 -28 138 48 -106 35 97 -24 -128 29 67 -47 -53 -34 -8 -18 -56 -165 37 73 -60 -112 69 65
2785 65 -11 -21 50 46 34 -70 46 14 20 -91 -4 102 18 -46 -54 71 13 -56 -6 29 38 -71 -60 119 55 -54 -39 87
$$ packed form
2616a47m0L49N4k22Lq8J7J74J25k26J08M2k58n6L34O0k50N8L2j53n2J31M1J9P7
2641A32k72j04J80J35k27J78J65k86j88K22J82o7N8j1j07j7M0q4K16J34j57k77
2663a55J68J20k00J2K42j13j48rK4j1J69l3j74P0L7k25N2L38o5k86J23J30j76
2686a10K6J96l6pk1j15j9K83q5j91J70J50k97j12K19R3j87J9M3j10J3O1j15Q5
2710d7J47k15j15K44Mk11J00K08j20j40J77Q5j74O9N5n2Q9K4k04J12J89j80j30
2733h5J88M1k18O0M8j09M6j0p9M5J06r8j06K25O6k81P7K19o7j31P3kO2p0j5RQ9
2760H3J2j83O0J66r0j54J41O2j21j04J57L8j14oJ9K6j0l8j09K02L6j33n2J81m
2785F5p6j0P1mj2j04J16l2Oj11Q7J06q4o4qJ25n8o9N0L5Rj09J1J79o4j09J5J26
$$ plain form
2813 87 12 -28 4 -36 28 11 -81 -55 114 41 -59 26 166 -73 -45 71 30 13 8 55 19 132 19 -108 32 155
2839 155 -98 -102 109 19 -196 -52 80 -108 -26 41 -49 15 124 -58 -81 113 30 -164 -20 107 -62 -116 124
2862 124 61 -108 31 48 -91 100 122 -113 46 224 -43 -189 116 91 -195 -24 157 -36 -43 103 -30 -26 106
2885 106 -66 -170 140 90 -219 -57 140 -65 -166 104 31 -99 -27 50 -96 15 90 -104 -29 186 -8 -142
2907 -142 136 78 -136 -24 131 -22 -101 42 -3 -97 70 -2 -152 63 109 -112 -99 203 -28 -140 79 43 -119
2930 -119 -19 3 -54 9 87 -61 -23 131 48 -171 19 162 -95 -44 83 -14 -95 77 66 -79 12 7 -106 66
2954 66 75 -124 -145 79 63 -197 -42 122 -67 -72 57 -5 4 26 47 -23 105 53 -74 -31 109 -35 -114 26 46 -114
2980 -114 -102 36 -41 -37 35 -52 -95 -7 -75 -165 70 180 -20 -92 111 10 -75 73 119 -13 4 37 -15 37 102 30
$$ packed form
2813H7p5m0L2m0O4j7r2K6J69p3j00Q5J40k39K8J16m1j7nM7l6J13j13j27J40J23
2839A55k53mK11r0k15J44J32j88Q2O7r0O4J09j82k3J94q3j94J44J27j69n4K40
2862A24o3j69J39J7j39J91K2k35J59J78k67j46L05k5k86J71J81j93pJ46j33MJ32
2885A06j72j04L10n0l09J62J97k05j01K70p3j30P2P7j46J11P5j94P5K15j94j34
2907a42K78n8k14J12J55j53p9J43m5r4J67p2j50K15M6k21J3L02k31j12K19l6j62
2930a19J00K2n7O3P8j48L8J54q3k19J90J43k57N1J27r7q1J72j1j45R1nj13J72
2954F6Rj99k1K24j6k60J55J64j89nJ29o2RK2K1p0J28n2j27M3J40j44p9J40K0j60
2980a14J2J38p7MP2q7m3Q8o8r0K35J10k00p2K03j01q5J48M6j32J7L3n2N2O5p2
$$ plain form
3006 30 -85 123 40 -189 8 131 -92 -131 27 -54 -181 3 14 -87 5 -62 -142 -80 143 -2 -78 89 130 -167
3030 -167 5 155 1 11 106 45 15 74 -13 12 86 107 -179 -72 127 -36 -148 92 40 -136 -26 -18 -119 -15
3054 -15 95 -67 -56 19 -101 -155 79 178 -31 13 153 -72 -98 160 68 -16 127 59 -166 23 127 -98 -9 96
3078 96 13 -198 -26 104 -117 -82 80 -62 -49 28 -94 -82 168 109 -142 57 81 -65 -46 183 69 -41 -10
3101 -10 17 19 89 127 -123 29 78 -117 -158 142 18 -180 -64 -47 -199 -72 -1 -27 25 26 -133 -88 67 116 -50
3126 -50 121 162 -55 14 99 128 42 128 82 -93 101 38 -92 -6 82 -127 -125 18 -87 -168 -41 63 -131 -41 -88
3151 -88 -81 3 93 -51 -26 119 -9 -146 90 173 58 8 143 75 33 98 9 14 124 -6 -116 22 103 -105 -87
3176 -87 54 1 -107 -76 -7 -76 0 -13 -68 -23 -47 -100 20 92 66 -105 35 113 -30 3 158 49 71 38 -88 27
$$ packed form
3006C0j15K08q3k29J97J23k23l9J58q1j27J84J1j01R2o7q0O2K23j45p6J67M1k97
3030a67J72J50j54J0R5o1l0N9q7K5P4K1k86J07J99j63j12K40n2j76J10Qj01J04
3054a5J10j62J1P5j20n4K34R9k09M4J40k25k6K58r2q4J43o8k25J89J04k25Q9J05
3078I6q3k11J72J30k21L5J62j42J3P7j22J2K50n9k51J99K4j46J9K29j14j10L1
3101a0K7KP0L8k50J52M9j95m1L00j24j98J16J7j52J27P1k6N2Jj59M5J55M9j66
3126e0J71M1k17O9Q5K9q6Q6m6j75J94o3j30Q6Q8k09KJ43j05q1J27J04j94R0m7
3151h8PQ4R0j44K5J45j28j37K36Q3j15n0J35o8m2O5q9NJ10j30j10J38Q1k08J8
3176h7J41n3j08L1O9o9P6j3n5M5k4n3J20P2k6j71J40P8j43L3J55j09K2l3j26J15
$$ plain form
3202 27 64 49 -111 44 26 -199 -96 -16 24 -43 -39 -54 -76 -25 -65 -60 84 37 -29 -65 82 43 -44 89 138 23 63
3229 63 54 -9 37 62 37 16 35 -39 -64 46 50 -116 -51 28 -22 -33 -48 -2 -24 -19 -93 -80 49 45 -60 0 92 69 7 96
3259 96 142 58 17 38 -14 33 86 48 36 70 -29 -44 -12 61 -89 -48 -13 -45 -54 -47 -23 -68 -11 -11 -54 -5 -35 -78 4 86 68
3290 68 -35 -26 63 21 7 36 33 24 -24 -24 17 157 -13 -14 30 19 -59 -40 44 26 -33 -103 -15 -64 -30 -49 -88 -53 -1 -46 -65
3321 -65 25 -10 -27 3 53 60 29 4 133 44 14 23 5 39 25 -3 8 44 30 -60 12 108 -37 -64 18 -2 -96 -5 -17 23
3351 23 9 -15 -57 73 11 -5 -51 22 27 -19 -7 15 51 55 -3 -36 75 -20 -34 -27 25 -24 -62 -41 30 -59 -90 -48 8 10 -26
3382 -26 -90 -23 -13 2 6 -29 2 22 52 48 46 -24 21 6 71 -25 90 71 19 12 -42 -1 79 -49 -17 -58 -10 -16 -65 -41 -8 -62
3414 -62 -26 -58 -74 41 -82 -30 59 34 22 -3 27 22 49 63 47 144 -8 -38 26 77 14 13 62 67 -12 -8 -19 2 -63 -37 -83
$$ packed form
3202B7L7j5j60J55j8k25J03Q0M0o7Mj5k2N1m0NJ44m7o6l6J47l9q7J33M9j15M0
3229F3ro3M6K5k5k1J9p4k5J10Mj66O5P9n0j1j5M6k2Np4J3J29mj05O0R2k3o2Q9
3259I6M6q4m1K1n2M7N3l8j2L4r9j5L2P3j50M1L5l2rPK4m5N7%m3M9l0m3Q2Q2j8
3290F8j03RQ9m2j4K9lrm8%M1J40j70jM4j1p8J9Q4j8n9p0Q8m9L4j9l9L5N2m5j9
3321f5R0l5j7L0N0Pl1k5J29q9l0Rj8L4j4k8J1L6j4r0P2R6j45k7Q2k0r4R1j2M0
3351B3j4k4m2J30o2j6m6P3Nm6J2K2L6Mn8l3J11r5j4PN2m9l8K1P1q9l1M2N6Kl6
3382b6o4O7J0J5Ml5L1K0L0mkp0M5j5O5r6J15j9n2pn4M1Q0j28L2m1M8om9K4L3n4
3414f2L6l2j6J15j23N2Q9k5j2k5L0nK7J4j6R7j52l0O4N1o3jM9Np9Mj1K1o5K6m6
$$ plain form
3445 -83 41 -4 -40 -54 -4 19 -67 23 56 2 -10 53 20 -27 78 31 37 76 58 -2 21 40 35 -19 45 36 -39 -55 34 -46 -31
3476 -31 56 -61 -58 72 -47 -79 71 87 -107 -44 69 16 -73 53 67 29 14 6 -11 -11 68 26 21 90 6 -92 28 25 -41
3505 -41 -25 28 -72 -56 -16 -45 -26 46 19 -116 -25 82 -110 -32 118 54 -52 18 18 -23 49 60 -14 -10 97 -37 19
3532 19 97 78 -43 -12 75 -96 -11 29 -12 -20 -3 -16 -74 -51 15 -48 35 83 -41 -77 8 51 -45 32 31 -3 18 0 -55 11
3562 11 145 40 -76 36 54 5 38 125 29 -54 -26 -27 -111 -17 -2 -60 17 16 -139 -33 24 11 -46 3 31 -83 -20 78
3590 78 46 15 49 -24 -61 49 54 43 97 143 -108 -53 40 -14 -86 43 17 -79 -8 45 -12 22 80 15 -36 31 44 -84 45
3619 45 105 -38 -35 39 10 -21 54 26 -16 3 19 -48 48 105 -64 -95 43 3 -156 10 91 15 -28 11 -24 -52 -13 31
3647 31 -25 80 39 -111 20 95 -3 -28 49 44 -7 15 12 29 38 -24 -47 -18 5 -6 -71 57 67 -97 -59 15 -38 -16 66
$$ packed form
3445h3J24m5l6j4N0K3q6R0L3n4j2O3l3m7J05m7OL9j8o0K3J9nn4O4rp5j6Q9q0J5
3476c1Q7j17LJ30j19l2J50J6j94O3J13n3q9J26J4l8j5qj7%P9m2nO9q4r8J20lo6
3505d1J6N3j00J6M0k9J9P2k7j35R1J07j92P8J50o4j06P0%m1P2J1p4MJ07j34N6
3532A9P8j9j21L1Q7j71Q5M0m1qJ7j3n8K3O6o3Q3M8j24l6Q5M3r6P7jl4K1j8n5O6
3562A1J34j05j16J12J8m9L3Q7r6q3K8jq4R4J5n8P7jj55J06N7j3n7M9K8j14O3R8
3590G8l2l1L4p3l7J10Nj1N4M6k51N5R3n4p2J29k6r6P1N3n7L4N8o5n1O7J3j28J29
3619D5O0j43LP4k9l1P5k8m2J9J6o7R6N7j69l1J38m0j59J66Q1p6m3L9l5k8L9M4
3647C1n6J05m1j50J31P5r8k5P7nn1K2lJ7Ro2k3K9K3j1o5J28J0j64L8P4n3K2Q2
$$ plain form
3676 66 62 -43 42 20 -16 131 100 -8 25 56 -65 -18 47 48 -1 18 26 11 39 18 -76 22 58 -67 -141 -4 102 -13
3704 -13 -5 24 -10 -46 52 -17 -20 42 -6 -62 -4 53 -54 36 117 -35 -71 -3 8 26 -17 19 8 14 43 -36 -48 99 -3 -31
3734 -31 6 20 18 -38 41 -78 2 -3 -33 -28 40 -29 -75 -11 -12 -105 0 30 23 37 0 21 9 29 5 36 -27 -34 -41 -39 68 -46
3766 -46 -8 47 66 -19 -56 -3 30 -5 -4 -13 26 61 -14 -27 65 65 -26 -10 52 -21 2 -33 12 37 7 -3 10 8 -63 6 34 35 -54
3799 -54 -65 6 12 -13 -61 -56 -19 -80 -64 -27 0 -4 -9 19 -12 -26 2 19 67 21 23 80 48 -1 -18 9 6 43 -29 -18 17 -42 -13
3832 -13 -38 3 0 -20 -94 6 60 29 -96 -20 -2 12 -25 -11 -7 -19 24 5 2 37 -48 -2 60 25 -5 16 -1 -41 -7 -59 26
3863 26 -5 49 -15 1 1 -43 -5 -11 39 58 19 35 56 20 -23 -54 46 -11 -49 -33 6 -48 -56 36 16 7 3 -27 4 5 -37 -20 -14
3896 -14 7 -48 -8 -44 6 -21 68 37 62 63 53 -1 6 57 -28 0 36 90 -40 15 -2 -33 -13 -13 52 -1 -22 -30 -51 -13 -45 -4
$$ packed form
3676F6mj05Q5k2l6J47l1j08L3L1j21M7O5Jm9J9Qj5K8k1r4R8L6j25p4J37J06j15
3704a3QK9l4l6R8o9lO2m8n6N8N7j07R0Q1j52l6O8J1J8m3L6j1OK9p9j2J47j02k8
3734c1L7J4kn6P9j19Q0nl0NO8o9m6O4jr3J05L0pJ4l7K1j2K0k4L1o3ppKJ07j14
3766d6L8N5J9q5l7N3L3l5JrL9L5p5j3R2%r1J6O2p3K3l5M5K5l0j0J3kp1O9K8Jq9
3799e4j1P1Ok5m8NL7o1J6L7K7mnK8l1j4K8J7M8m6KN7l2m9j7K7lL7p2J1L5n9K9
3832a3k5M1lk0p4J00N4l1j25P6J8J4l7J4Mj2M3j9lL5q5M6O2l5l0K1j7m0L4n2Q5
3863B6l1N4o4J6%m4L8oN0J9l9J6K1l6m3l1J00n7l8J6L9n4qR2k0rml0L1Jm2J7O
3896a4K1n5M0l6N0k7Q9l1K5Jj0n4PN1q5K8L6N4j30N5j7l1K0%O5n3k1qk1L8l2M1
$$ plain form
3928 -4 -27 -2 -7 -14 0 76 -12 -21 9 31 7 84 -23 83 14 -48 28 18 68 -8 8 54 8 2 -4 -11 31 2 32 -31 -6 17 -22
3961 -22 -18 -11 26 -48 9 15 16 51 -12 -53 -49 -12 -52 -38 25 -45 14 -1 36 -28 -44 27 -18 23 -2 -11 -22 23 -14 -32 9 26 25 12
3995 12 -1 -33 2 -13 17 13 -42 40 3 26 -18 -23 -8 11 57 9 5 14 -86 -11 -2 -27 -24 32 13 -37 -11 -4 31 10 58 57 -31 26
4029 26 2 -61 24 25 14 20 14 9 48 -7 74 19 84 21 -25 -5 41 -7 -4 81 -40 -4 -13 8 -22 37 -14 -85 13 26 -63 -51 31
4062 31 13 -40 39 14 -64 -12 23 59 36 45 -24 -20 15 10 -34 76 48 -5 -10 17 -18 -6 45 -20 -9 -8 -8 20 27 16 3 -55 0
4095 0 46 -48 5 47 -65 -39 2 -3 0 -20 32 -11 30 -3 -85 31 54 -38 -41 33 -12 -61 24 28 -35 25 -28 -96 9 54 -12
4126 -12 37 70 3 -42 4 25 25 -16 77 10 2 16 -3 4 91 40 -49 -39 75 -14 -56 111 -3 -37 49 -2 -44 53 34 -62
4156 -62 -20 -18 -61 -96 -23 12 6 71 40 -50 7 105 9 31 75 -15 -44 -13 41 -27 30 40 20 -42 -60 -64 -24 17 23 -68 -28 -42
$$ packed form
3928dk3K5npJ4P6q8rL0K2k4P7j07J06o9o2P6j0N0p6J6M6m6oopM2k9L0o3K5K3l9
3961b2MPL7p4N7OJL5o3m1ML7m0J4O3p0N9j5L7o4j6P1m5M1k5rj1M5l7j8M1J7jj3
3995A2j3l2L5j5L0mn5Q2l7K3m4nJ5J9M6m8mRj00P5Rk5LN6j9n0K6PL5k1M8jq8N7
4029B6k4o3Q5Jj1OonL9n5Q1n5O5o3m6K0M6m8LQ5j21L6rK1l0N9n1p1R8J3q9J2Q2
4062C1j8n3P9k5p8N2L5L6k3Ro9ML5nm4J10k8n3nK7l5J2N1o5J1J%K8Pj1j3n8N5
4095@M6r4N3M2j12K6M1nLk0N2m3M1l3q2J16K3r2lP4m5m9Q5Mo3O0n3o8J05M5o6
4126a2M9L3o7m5M6K1%m1R3o7qJ4j9PQ7n1q9J0J14q9m2J67j14l4Q6n1m2R7j9r6
4156f2M2Km3l5P3L5oO5l1r0N7R8r6K2M4r0k9L1N4o8N7J0k0o2j8mM0M1Or1M0j4
$$ plain form
4188 -42 -30 22 43 -8 -31 -1 19 -66 6 64 27 55 -21 0 -9 96 -1 26 87 60 -33 8 90 0 -33 -36 -36 -23 20 -26 -50
4219 -50 22 -20 -13 2 -7 -16 -2 3 24 -45 -24 22 -58 25 85 1 -16 -11 8 -31 5 45 -41 -49 44 22 -30 16 15 31 -4 1 -48 -29
4253 -29 31 -41 29 8 5 35 -9 32 -19 5 -3 29 26 26 33 -9 27 -38 -24 34 95 -17 -13 10 37 -19 -19 2 28 -17 -20 -15 -10 3 -29
4288 -29 -15 14 47 -29 42 33 2 -18 57 -5 8 -7 -7 18 19 22 2 46 -11 12 -37 54 -8 -54 -71 -67 34 -33 -63 -43 34 -7
4320 -7 -38 -93 -7 52 -44 32 41 -14 -53 45 50 -19 48 -34 60 -29 57 0 7 28 -2 -20 -18 -27 -20 37 28 30 -19 -2 -21 -45 -33 -48 -17
4355 -17 -21 -38 -82 -81 -26 -58 -40 35 4 4 -31 3 -80 -8 42 33 45 59 -27 27 54 12 -3 -12 26 1 -47 45 -8 -52 -61 -6 -24
4388 -24 9 -44 -61 52 -17 52 1 2 -18 38 11 59 -57 52 32 2 -14 45 -45 -81 23 -14 -27 -28 -12 -4 1 -48 -7 28
4418 28 34 -45 -38 40 -26 3 -5 -20 -12 4 -31 37 45 -25 -56 10 76 43 18 34 45 -9 -12 -16 43 -14 -55 1 -17 -31 -27 -7 -30 -32 -12
$$ packed form
4188d2J2N2K1n1k3L0K0q5P2N8l7K8p6K1rJ05r7K7O1k7r3M1Q2r0l3l%J3M3m6k4
4219e0P2m2PJ5rrJ4NK1o9K1M6q0Q3O0q4j7NJ9l9L6M0q6qR3k2n2M6jJ6l5Nm9J9
4253b9O0p2P0k1lL0m4M1n1K4qL2l%Pm2L6o5J4N8O1j12MK3K7n6%K1K6m5lNNJ3l2
4288b9J4K9L3p6P1rl1k0P5o2J3j5%K5JLk0M4n7K3m9R1o2m6j7MJ01o7l0K0P7m1
4320gl1n5Q6N9r6P6Rn5l9R8No9O7q2R4q9Q6n7PK1l0j8KrPN7rKm9J7j9k4J2j5L1
4355a7mj7m4JN5l2J8P5l1%l5L4q3P2N0rJ2J4q6N4K7m2j5rL8k5m8R2n3m4rN5j8
4388b4L3n3j7J13o9O9n1Jk0N6k7M8j16J09k0l0j6N9r0l6J04l7j3jJ6QNm9M1L5
4418B8Op9PP8o6K9qj5QJ6l5O8Qp0l1O6O6l3k5J6J1n4lmN9n7m1N6j8j4MK0k3kK0
$$ plain form
4453 -12 -48 -26 -4 -3 1 21 -7 15 48 -29 -34 47 58 29 49 13 6 30 9 -15 -52 12 -4 17 16 -5 13 27 15 -27 -5 28 -80
4486 -80 -121 36 8 -35 -10 8 11 -8 71 -78 -41 15 3 -1 34 46 -21 35 26 60 -15 49 -12 18 -42 -11 -8 -1 30 16 -49 43
4518 43 -25 19 13 15 -20 21 16 -21 24 7 -31 -23 15 8 -50 34 2 -9 11 44 -18 -33 5 17 9 14 -23 -50 22 12 10 1 30 -41 9
4553 9 43 53 -2 -29 31 10 -20 34 -21 2 34 61 -58 -23 32 -59 -3 42 -17 -72 12 -16 -56 -69 8 -15 39 -55 -36 -17
4583 -17 -9 14 -11 -26 -58 -83 6 32 42 15 23 4 2 -7 12 57 52 52 -77 -9 -34 3 5 6 32 -16 19 -25 2 17 -2 -34 -47 8
4617 8 -12 -80 -20 29 7 -71 -32 -1 13 9 -19 -44 28 18 -24 1 50 -5 12 72 5 -32 23 -1 -23 -41 56 -2 -33 18 -25
4648 -25 -22 24 30 -19 -12 -14 19 -11 103 53 -22 -20 -63 -42 -36 -4 -50 68 19 -20 -51 57 -28 -29 13 6 -17 50 50 13 10 -56 -8 -37
4682 -37 51 57 10 53 -8 -27 2 40 26 -26 -1 5 -35 -30 83 -30 -11 33 -26 -57 18 5 -32 50 25 -19 -14 35 -22 6 41
$$ packed form
4453a2l6K2K2JMK0k8K2L3p7nQ1J1k9K0l6pK4k1k4l7O4j6K1jk1J8J4j2m2K2L3j08
4486h0m1J57k8m3K5J8Lj9P9j49L7N6j2mL5J2o7N6rL4p5O4o1L0o0L1LPL1j4o5R2
4518D3o8M4oKl5M1nl7M5j7l8QL8pn8Q4l2j1K0L3o2j5L8J2qNl7k7P2j0krK9p1N0
4553IL4J0n5k7O0k1l0N4n5K3L2K7j19L5N5r1N6M5n9n5Q4k8m0j3P7k3N4r4J9J9
4583a7QK3k5j5l2k5Q9K6J0k7Qj9krJ9M5n%j29O8k5L7KJK6m8L5m4K7J5j9l2j3N5
4617Hk0o8O0M9k2p8L9L1J4mk8k5P2j0m2K5M9n5J7O0o7l7N5k4k2j8R7n8l1N1m3
4648b5LM6Om9PkL3l0J14n0p5Km3K1OL2m6J18m9l9l1J08q5jM2pk3O7%l7lo6M8k9
4682c7Q8Om7M3o1j9K9L8j4n2K5Om0NJ13j13J9M4n9l1P5j3l7Q2k5m4NM9n7K8L5
$$ plain form
4713 41 17 -20 -18 -31 -2 -23 15 9 -7 6 -8 -23 8 32 -19 26 -2 57 31 31 -6 12 20 32 -76 -12 -17 -4 7 -2 17 -32 -13
4746 -13 -28 20 66 -33 -9 -38 -27 -45 29 -44 9 -70 -8 16 -45 7 19 1 -9 3 22 50 42 -1 32 60 36 32 4 34 60
4777 60 34 0 7 -38 6 2 -40 -7 -25 -17 -39 -10 -2 -18 23 18 -6 2 46 3 -13 37 -15 -11 5 15 -14 7 -24 -12 52 -41 -49 49
4811 49 40 -2 -14 5 -21 -12 14 -50 -51 -8 20 -29 28 4 26 21 53 -40 50 -46 -24 -4 -45 16 22 11 1 12 -18 -60 6 -13 -2
4844 -2 -32 20 -15 26 1 -29 -25 -24 -56 -57 22 -21 -22 -29 27 13 73 23 -20 11 39 0 -22 45 -14 51 44 -10 -51 9 -31 -10 -51 -17
4878 -17 8 1 40 -22 -23 -31 8 -19 -37 -43 -15 7 -41 33 -15 48 33 -23 -18 6 23 43 76 -3 -10 1 -10 19 29 19 -29 -13 32
4911 32 -25 -17 -62 -34 -36 -2 9 -44 -55 1 -3 1 6 31 -35 49 -23 13 -22 -28 37 -3 -17 7 15 -6 -23 1 2 11 -16 31 22 -51 32
4946 32 -30 16 10 20 49 13 22 -23 -26 22 41 3 17 14 1 0 18 -16 -31 9 51 -8 19 -17 22 -26 -3 8 -90 -5 -25 -7 18
$$ packed form
4713D1k4l7Kj3K9k1L8oj6J3j4j5L1K4n1M5k8N9k6%l7J8QJ2j08O4nJ3J1rJ9m9J9
4746a3j5M8M6r9K4k9J1j8P4p3N3p9O2K4o1N2J2j8j0J2J9K8qm3L3K8k4mk8L0K6
4777F0k6l4Pm5M4mm2L3j8Qk2K9Qj6M1nk4QM4m3j6N0n2MJ6J0k9K1l1J2O4r3qR8
4811D9rm2j2J9k6RK6o4jM3K8m9N7k4K2nL2r3R0r6K2K0m1O1Oj1j0J1l0m2O6j9J1
4844bl0N2l5M1k5l0MJl2jP9m3jpN6j4O0n0m3L1K8l9k2O7n9O5pn4m1O0m0K1m1L4
4878a7K5pL9o2jqL9k7j8oK8K2m8P4m8O3j5n6NK4J7K0L3p9pJ1j1K9J0j0m8J6M5
4911C2n7Qm5K8kL4J1n3j1N6mMNK5o6Q4p2L6l5oO5m0j4K4Qk1j7K4JRk7M7rp3Q3
4946C2o2M6oJ0K9l6Rm5lM8J9l8J4lj3jJ8l4j5M0M2n9K7l6L9m8K3J1r8Q5k0J8K5
$$ plain form
4979 18 4 14 36 -46 52 40 57 -12 5 15 -20 -29 -53 11 -9 -12 -1 -9 34 -16 14 49 -2 -6 2 -26 -31 16 9 -11 -44 -16 -49 49
5013 49 -50 -60 -8 2 -17 18 2 -12 -25 -8 30 25 3 -6 48 7 2 46 -49 26 72 -5 5 52 15 16 -60 22 -1 27 -2 -27
5045 -27 0 5 -34 -8 -7 -7 -21 -14 -13 -76 9 -19 -13 -42 50 13 -35 0 24 11 -45 5 43 4 -10 -14 75 28 13 -58 1 23 -4 30
5079 30 51 39 -27 42 33 -79 12 6 7 -38 42 -58 -35 -30 8 -23 51 -9 -34 33 92 22 -36 -17 -21 -94 4 65 -22 6 50 28
5111 28 -28 -16 -28 -6 38 17 -81 23 8 -11 66 45 -44 -14 20 64 -11 18 69 -41 -47 58 9 7 26 39 -1 -12 -37 -30
5141 -30 -17 -24 -29 -29 62 9 -23 8 -1 -8 -7 -35 8 29 31 19 -62 56 -1 -31 -25 27 12 10 61 -28 18 29 -56 50 54 -18 -15 -12 11
5176 11 -27 -18 51 -27 -5 -71 -2 -10 -4 49 -42 4 -55 27 -44 24 15 24 -28 25 -35 13 -12 -16 6 28 33 20 12 7 -2 -16 -14 -8 16 20 31
5213 31 -8 2 35 -57 -39 -7 -40 16 -17 -23 8 1 10 -7 -23 -3 5 -56 -28 -12 -7 17 17 37 17 16 -80 6 -36 -35 41 56 -4 -17
$$ packed form
4979A8j4J0K2q2R8j2J7o9J7J0l5rk4O4k0lJ1qM3n0L0L5n1mQk8nM7pk0l3K8l3R8
5013D9r9j0N2J0j9L5j6j4j3J7L8nk2rN4m1nM4r5P5M6p7J0M7l7Jp6Q2k3K8k9k5
5045b7K7Nl9K6J%j4PJo3Q5k8Ok9R2l7m8L5K4j3n6N0L8l9j4mQ9m7j5p1N9K2k7L4
5079C0K1j2o6O9rj12R1oJm5Q0j00K3NL8l1P4o0k5O7N9p0n8J9mp3R8O1q7K8M4k2
5111B8n6J2j2K2M4k1r8J04j5j9P7k1q9L0L4M4p5K9N1j10oJ05m9kJ9J3m0j1k5P
5141c0J3pn%R1n3l2L1rpJk8M3K1Kj2q1J18n7l0ON2j5kN1q9M6J1q5J06Mp2LLK3
5176A1l8RO9p8K2o6O9qON3r1M6n9Q2p1O8rRn2N3o0M8k5mK2K2Nj3qnrj4KOK4MJ1
5213C1l9J0L3r2J8L2l3N6l3oL1pRj7j6K0Qo1K8J6NK4%K0k0jr6Q6m2JP6J5o0j3
$$ plain form
5247 -17 21 24 88 -29 -49 34 4 18 5 10 46 -16 -36 7 -4 -39 -26 -77 -35 -85 37 46 -35 3 75 -4 -12 -5 -64 -35 16 42
5279 42 25 57 13 2 -22 -32 16 -19 8 -57 -35 -9 16 8 28 39 -25 -4 13 3 22 1 29 3 0 4 -23 -34 66 -9 -1 -46
5311 -46 -11 -21 -3 6 -3 25 -3 42 -71 -3 -28 23 5 16 23 -42 -1 0 33 29 2 -33 13 -11 -43 40 -28 -42 17 39 -14 36
5343 36 34 -31 8 1 -4 -22 0 14 11 -12 -56 -1 -20 -31 -16 -3 -35 11 -38 -17 -3 38 -38 4 -11 -40 39 -23 -11 42 -5 36
5375 36 28 19 -6 -13 -41 4 -11 24 45 0 64 3 -49 -15 19 2 -40 -41 4 -47 -20 -36 22 11 -12 -35 -48 -41 57 -10 -14 -24 -54
5408 -54 -25 32 -44 -10 -12 -33 10 -26 79 20 28 21 -4 31 45 35 -1 -16 -28 26 -21 13 3 31 -9 -26 40 -7 -3 40 -46 -24
5440 -24 -39 -61 -51 -31 -22 -39 -2 0 4 1 4 -12 78 -27 -4 20 8 7 6 17 6 18 8 1 66 14 34 36 46 52 -21 11 19 0 -49
5475 -49 5 22 62 -16 17 -30 34 0 -20 -43 -32 -68 1 -38 31 -6 -16 24 -15 20 -36 31 20 -2 1 57 14 6 -20 -10 -26
$$ packed form
5247a7L8LO4j17k0Q3l0J4j3NL6o2k0M3j1l5J3n1M2n0J22Rq1L8P2p9qPn9K9N1K6
5279D2j7L2m4j1k4j0M8l5K7o5K2K6K5qK0J1o4K1J7j0J9k1K8k6lMk7j1J00p5Qm5
5311d6L5j0J8RrK8k8M5j13O8k5N1j8J1Po5M1JL3mk7l5M6k4l2Q3o8j4N9K2n3N0
5343C6ko5L9pnj8K2J4lk3m4N5j9j1J5J3l2M6m9K1J4M1p6M2j5k9P9o2J2N3m7M1
5375C6qrk5pk8M5j5L5K1m5O4o1n2L4L4j7m2jM5n1K7j6N8j1k3k3j3PR8o7mj0l0
5408e4K9N7p6L4kk1M3l6J05n9Qpk5L5J4j0l6j5j2N4m7L4j0K8m0j7O6m7MM3q6K2
5440b4j5k2J0K0Rj7L7KMlLj6R0j05K3K4j2jjJ1j1J2j0pO5n2K0KJ0Op3L2Qj9m9
5475d9N4J7M0p8L3m7O4l4k0k3J1l6O9l9O9l7j0M0l9L5n6O7j1k2LN6m3qk6J0j6
$$ plain form
5506 -26 -1 31 -4 16 19 -23 18 -2 -47 46 12 -33 -5 -28 -19 -56 -10 -35 21 -25 -11 4 -6 13 47 35 45 -58 8 2 29
5537 29 42 60 2 -41 -30 -2 -26 -29 9 66 41 49 26 49 24 1 -4 22 32 12 -37 26 -3 3 -54 -36 -8 44 68 -44 -45 21
5569 21 -4 -49 -17 0 -23 -69 -16 -34 6 2 12 -55 9 -20 38 28 43 -5 3 23 34 -72 21 65 -30 -1 -18 -18 3 -10 -25
5600 -25 6 44 12 -10 -21 -20 -31 -44 5 26 -35 -76 -13 -23 10 -13 -24 8 24 25 -46 -48 -6 -38 -28 -15 -2 48 -2 -13 26 -35
5632 -35 3 14 7 -4 -32 91 35 27 29 -28 23 30 38 -15 -24 -5 -35 -22 -62 -4 59 -87 -15 -29 -70 2 15 -54 11 17 -14 16 -12
5665 -12 25 -57 47 -9 -9 -26 38 10 20 31 -22 5 50 16 -66 17 49 40 -10 20 -16 8 18 -4 -33 15 -13 16 16 30 7
5696 7 -66 -43 -9 -8 47 6 -33 -12 27 -41 -12 -30 9 -20 -28 42 -2 25 56 -48 14 18 -2 -13 18 33 8 -16 55 54 5 3 -8
5729 -8 -74 -35 -7 -26 0 -6 -12 24 -10 23 -27 10 -26 -12 9 20 27 -41 -20 -1 -8 16 -20 -24 13 -20 -1 -6 69 -8 24 -3 -25 -11
$$ packed form
5506b6K5L2l5K0Lm2M1k0m5R3l4m5K8k3Rl7M6k5N6m6J4J5j0J9L4j2J0j03O6oK7
5537B9J3J8n8m3J1K8k4lL8N7k5Qk3K3k5k3nK6J0k0m9O3k9On7J8K8N2K4j12jO6
5569B1k5m5L2J7k3m6N3j8M0mJ0o7O4k9N8j0J5m8QK0J1j06R3M4r5K9j7%K1j3j5
5600b5L1L8l2k2j1Jj1j3M9K1o1m1O3j0L3k3j1L2J6Jp1kM2l2J0J3J3N0n0j1L9o1
5632c5L8J1pj1k8J23n6qKn7N1PQn3rJ9l0J3m0N8O3j46P2j4m1P2J3o9O5Ol1L0k8
5665a2L7q2J04n6%j7O4k8J0J1n3K7M5l4q2Q3L2rn0L0l6K4J0k2k9M8k8K9%J4k3
5696Gp3K3L4JN5m1l9K1L9o8K9j8L9k9qP0m4K7L1j04O2Mk0j1L1J5k5k4P1jm9kj1
5729ho6L9K8j9K6ooL6l4L3n0L7l6J4K1J1Po8K1J9pK4l6mL7l3J9nP5p7L2k7k2J4
$$ plain form
5763 -11 29 26 -13 37 -8 -33 5 11 0 -50 21 -10 70 -24 -8 -29 16 43 -37 21 20 -10 33 38 -32 -22 -12 -66 -14 -69 19 30
5795 30 -34 -21 7 -4 -10 4 7 6 17 -14 1 -10 -15 10 -26 0 34 30 70 8 -9 17 22 3 28 -16 35 -11 -36 -43 -48 -2 -43 10
5829 10 -43 -33 25 -19 38 -28 -21 -30 17 -31 23 -6 4 -73 45 -4 -24 -24 40 -8 103 34 15 -8 -20 58 -37 -17 45 -13 -29
5860 -29 31 18 -8 -36 29 -70 -18 25 -33 10 -6 -34 -60 28 -24 -34 -20 -32 26 -13 -23 -9 -14 54 1 -17 -15 -1 2 13 84 36
5892 36 -12 13 33 -42 -50 -28 22 -8 19 -12 18 37 17 16 -10 9 -7 20 -19 -47 29 -45 -7 21 -34 -12 -37 -4 23 -6 -1 20
5924 20 4 64 -44 19 9 -11 23 10 -32 44 49 -13 -36 -34 -11 3 30 33 -13 24 -31 -7 5 -32 52 31 -41 -35 -16 19 -16 -43
5956 -43 9 -28 2 0 -15 -7 -17 -30 6 0 15 12 22 23 2 -22 23 53 -19 64 13 5 0 -22 39 11 56 19 24 35 10 30 22 33 35
5991 35 15 16 -8 -6 -23 -37 -6 18 -15 -15 111 -38 -10 -16 -35 22 8 27 -25 -7 -9 14 36 -11 14 1 -8 32 -23 -19 5 24 13
$$ packed form
5763a1M0ll9N0m5k5L8Oj1n0P1l1Q0r4J6k1M5K7q0N8jl0M3Np0J0J0n4N2n5Q8J1
5795C0o4J3K8j1oJ4LjJ1l1J5j1nK5l6K6L4mM0o2j7K6Nj9K5m4N1m6k5pnM6m1N3
5829A0n3J0N8m4N7o6PrM7m8N4k9J0p7J18m9k0%O4m8J11o9j9k3j2P8r5K0O2n8j6
5860b9O0j3k6k8O5r9N2M3n8M3j6k8k6Q8n2j0J4j2N8l9j0J4nO8n3j8KJ4LJ1P1m8
5892C6m8K5K0p5qK2N0l0K7l1L0J9k0jk6J9j6K7l9k8P6p4L8K8n5K2k5L3K7k9NK1
5924B0j6O0j08O3j0k0L4j3m2P6No2k3KK3J4K7Lm6L7n5K4J2l7Q4k1p2OJ9L5l5k7
5956d3N2l7L0kj5Qj0j3L6oJ5lJ0Jk1k4M5L0p2Q3n1qnk2O1k8M5l7NJ1k5K0qJ1K
5991C5k0Jk4Kj7j4L1K4l3%J26j49K8oj9N7j4J9n2J8kK3K2m7K5j3rM0n5MK4J9j1
$$ plain form
6024 13 64 -10 -48 -38 -36 16 10 -20 3 21 14 14 37 -16 33 -7 -22 30 1 -4 -3 24 -15 4 0 -36 2 -42 -22 -25 -62 -9 -3 -14 -30
6059 -30 34 -30 -68 39 -43 19 15 -17 46 14 -3 41 50 4 69 3 33 -18 1 12 -5 44 -12 -28 -39 -10 -17 -18 -27 -30 4 -30 31
6092 31 31 12 45 -31 -17 -8 -45 56 -17 -30 -4 34 12 14 -19 -4 -27 -32 31 -10 24 26 25 65 -18 53 -5 18 -23 -4 36 23 16
6125 16 18 -26 -1 5 2 -36 18 -3 -60 32 13 -29 22 57 3 8 9 -22 19 54 -56 -39 8 53 45 -7 -18 -1 35 -24 31 20 -34
6158 -34 -15 4 8 -2 -16 -19 -44 32 8 48 -26 2 -3 19 -53 -3 4 -11 18 71 3 -15 34 -31 54 38 -2 25 32 -32 2 -5 -42
6191 -42 20 -33 -3 17 53 -14 18 -9 -2 10 7 3 -39 -62 42 60 34 -42 -23 -15 -40 -51 -15 0 12 7 -60 7 -78 30 10 -24
6223 -24 30 -34 -25 -63 -43 -2 -14 34 -19 -18 53 45 56 68 6 -12 52 38 23 15 53 45 -67 9 -8 15 3 71 68 -64 24 -58
6255 -58 -1 -29 -37 -2 19 1 -10 -55 7 7 0 -36 -39 3 -43 16 94 6 28 39 35 -58 4 26 -14 23 17 -14 93 20 -29 -3 44
$$ packed form
6024A3N1p4l8J0KN2ol0K3J8p%K3n3M9m0j5N2k9nJK7l9J9ml6L8m4K0ll7N3Oj1j6
6059c0O4o4l8J07q2O2ml2O3l2j7M4Rm6O5o6L0n1J9J1j7M9n6j6j1K9pjrlL4l4O1
6092C1%j9L3p6J4Rl7J01p3j3K6L8k2Kl3J5k3nO3m1L4KjM0q3P1n8K3m1J9M0j3p
6125A6Km4K5Oll8N4k1n7R2j9m2N1L5n4NJl1M1L5j10J7M7M5qn2j1J7L6n9N5j1n4
6158c4J9J9Mj0j4lk5P6k4M0p4K8nK2p2N0Pj5K9N3o8j8M9o5Q5j6m0K7Po4L4pl7
6191d2O2n3L0K0L6o7L2k7PJ2lmm2k3J04J8k6p6J9Qk5j1L6J5J2no7O7q5J08k0l4
6223b4N4o4Rl8K0M1j2M8n3JP1qJ1J2o2j8O4j4j5qL8qj12P6j7K3j2O8lj32Q8q2
6255e8N7k8qL5K1j8j1m5O2%pl6lM2m6N9P8q8K2J1mr3O2K2m0L7ol1J07p3m9K6M7
$$ plain form
6288 44 -13 -4 39 6 8 -11 -30 4 31 -12 -21 -22 18 32 -31 17 -24 -8 -28 -32 5 16 8 28 -18 31 -27 24 30 -60 -56 76 -7 21
6322 21 20 32 3 -8 -1 0 46 -15 31 1 23 7 46 -46 -57 40 28 -17 -59 -16 -46 67 -38 -12 64 -37 -33 29 -20 1 -51
6353 -51 -78 7 -21 -50 -29 26 14 -29 -16 -49 45 -26 22 10 18 -18 20 46 -14 -11 21 47 20 33 -39 39 5 20 21 -12 49 6
6385 6 -35 -57 27 -30 21 35 17 -32 26 20 -23 -8 -57 8 1 -8 14 -14 -24 -32 -31 26 20 81 -35 -4 26 23 -4 27 -56 -22 -11 17
6419 17 -15 -34 -108 40 -21 -41 55 -27 19 -95 -28 17 1 29 -69 23 26 -17 15 -17 0 -10 9 -5 -57 -19 26 -11 -49 -52
6449 -52 19 -17 0 -2 4 18 48 -7 -10 -16 -27 50 23 29 27 -18 47 28 2 12 -110 20 27 -62 -31 39 43 -30 -27 -16 -52 -28 -15 -10
6483 -10 27 -26 7 -55 -46 -27 21 73 42 28 -8 10 -12 14 -10 -25 -13 -35 -7 46 40 -34 17 3 -31 -13 -23 -7 60 -2 -17
6514 -17 34 -63 35 -20 6 49 -2 -1 -23 -13 -12 -53 2 -11 -7 19 -39 -51 8 -14 11 -7 -19 5 5 -1 10 -20 -26 -4 19 71 9
$$ packed form
6288D4n7RM3l3Kj9j9L4K7m3rjM0J4o3M8m1J6k0mL7J1qK0m6M9n8N1Or0MJ32q3K8
6322B1jJ2k9j1PJM6o1M6l0K2j6L9r2j1R7j2m5m2M3l0J13j05K6P6j01MO2m9K1n2
6353e1k7Q5k8k9K1N5j2m3J3l3R4p1M8j2Ql6L8K6o0LL2K6k7J3p2P8l4J5Jl3O1m3
6385Fm1k2Q4n7N1J4j8m9N8om3J5m9O5prK2k8j0qJN7oO1j16L1L0lk7L1q3L4J1K8
6419A7l2j9p4J48o1k0R6q2M6j14O7M5j6K8r8R2Lm3L2l2J7j0J9j4n2L8M5l7l8l
6449e2P1l6J7kOJ4L0n5loj1P7k7Okm5O5j9k6J0j22J30Pq9L1P0Mp3LJ1l6K4J3N
6483a0L7n3L3o2RJ9M8N2l1j4l6J8k2K6k4j5J2k2K8N3op4N1j4l4J8j0J6O7o2j5
6514a7N1r7R8n5K6M3n1Jk2J0Jm1N5j3MK6n8j2N9k2K5j8j2K4%oJ1l0oK2K3N2o2
$$ plain form
6547 9 -35 -30 -21 -67 29 13 18 -9 -43 2 -15 15 27 22 24 -7 26 -18 -26 -48 -55 -12 -44 5 13 16 -12 11 -40 13 41 9 6 14 -41 69
6583 69 7 -28 21 15 15 26 25 -17 -19 10 -42 8 -11 13 28 2 1 36 -8 10 14 59 -8 -42 -39 0 9 30 27 -28 38 -43 11 -3 76
6618 76 3 -61 -30 -21 -16 -22 2 10 30 -10 -3 34 13 -5 -43 -29 -8 -5 66 6 27 36 26 -46 -6 -15 26 -65 -9 -68 -52 42 5 -15
6652 -15 -20 -21 -6 -23 14 21 -37 75 -19 14 3 -10 -1 32 39 78 -1 10 -19 -25 -3 54 21 33 26 -36 40 44 1 26 -9 -68 -48 -43
6686 -43 -33 -26 -26 33 -20 -44 30 39 -18 18 2 -24 -31 11 -55 -32 -22 1 26 21 -23 -52 59 -24 -9 36 36 -10 -5 15 27 74 40
6719 40 57 30 10 12 -17 5 -7 34 -56 -49 -8 -33 -46 -25 26 -11 -41 14 -61 -12 18 -3 -16 -6 -23 54 1 -35 21 -24 27
6750 27 46 13 66 20 34 -18 -23 -2 14 8 13 -9 -3 12 20 -7 5 28 -8 21 9 -6 -44 -49 14 55 -44 5 -61 -27 -1 -36 -20
6783 -20 -18 -3 -49 59 -13 8 -18 29 56 -10 23 24 43 -19 -14 36 -5 40 24 -8 -11 7 23 -1 14 103 48 2 -41 -36 -29 -18 -18
$$ packed form
6547Im4NRm6R6j6Nk7l4M5j7L0J2nKl1L3m4qk2pM3l2M9QLk8K3n1N3K8l2lQn5J10
6583F9o2l5M9o%J1jm2kK9n2N0j9K4J5k6jL5m4J8MM5o7l4LL9RK1ln5O6q1N4j4P9
6618G6p3o4L1RNoK4QK0m0PL7k1j8l8J4K1LP1o0K1Rj0p2M0rM1r1N6n9J6R4l7k0
6652a5njJ5j7L7Pn8J12r4L3j1j3RL3PL9p9J1k9oK2N7l3J2po2P6Mm3K5l5n9K0N
6686d3J0P%N9n3k4P4Rn7L6j6k6pM2o6K3J0K3K5nm4k9J11q3J5M5%m6NK0J2M7l4
6719D0J7k7k0Kk9K2j2M1r0PM1k5j3K1N1l7l0N5p5M9L0k1j3J0j7P7n3l6N6m5N1
6750B7J9l3N3m6J4n2nK1J6oNk2OJ5Qk7J2K3l6K9j2j5l8nO3M1r9M9o6L4K6l5J6
6783b0KJ5m6J08p2K1k6M7K7o6L3JJ9o2NN0m1M5j6l2lJ8J6k4J5Q9n5m6m3NPJ1%
$$ plain form
6816 -18 37 29 14 -15 3 74 -84 38 58 -14 46 7 -25 -13 -3 14 52 26 27 55 18 21 -5 19 -15 11 -11 50 28 -33 17
6847 17 4 -47 -56 -21 15 -29 -25 6 -8 8 -8 -3 -60 9 21 -68 -29 -48 41 7 -37 -17 -19 -18 13 -35 11 -79 17 31 57 7 19
6880 19 -39 28 38 -21 -8 -63 8 5 55 8 18 37 10 53 -18 44 51 -14 6 27 6 -42 -62 33 -15 -24 -63 -77 -3 13 -36 -30
6912 -30 19 -25 58 11 14 -15 -22 -71 1 -12 21 2 53 13 33 35 7 9 -7 -12 4 -7 3 58 -9 22 9 -35 -30 -22 62 82 -30
6945 -30 1 -11 32 29 29 45 -35 0 27 19 2 -21 35 -88 -43 -61 -33 26 28 19 -17 8 -28 -35 -13 46 -32 9 0 -26 38 -46 1
6978 1 18 -53 -5 34 8 -27 31 24 -5 -47 -24 18 -53 7 -26 -31 17 -55 -46 26 -14 -58 35 -1 -18 10 9 22 2 16 41 27 -33
7011 -33 5 70 -75 -19 11 38 36 -13 5 22 1 -6 -23 38 -36 14 27 -3 2 -40 -13 1 -11 10 10 -14 3 -41 -18 18 -14 18
7043 18 -4 -49 0 -20 -36 -64 27 -18 -25 -23 -1 9 36 -7 9 45 35 20 13 25 17 16 3 0 -4 -23 10 -4 -58 -18 -2 0 -30 17
$$ packed form
6816a8N5qj5k9J8P1j58J22K0p2O0l9l2J2J0J7L8k6JK8l7Lk6K4l4K6k2O1k2o1N0
6847A7j3n1rL5L6m4ML1j4J6j6Nn7O9J2q9L9j9Q9l4m4K0kJL1m8M6r0R6J4K6n0J2
6880A9n8O7J0n9J3n5P1lN0m7J0J9k7M3p1O2Po5K0K1k1m8k0R5m8rl9j4P4J6m9O
6912c0M9m4Q3m7Lk9pm9P2j3L3j9N1m0K0Kk8Kj6nJ6j1J0N5o7L1j3m4NQQ4K0j12
6945c0L1j2M3l%J6q0L5K7qj7k3N6j23M5j8K8N9Krl6K5l6pK2N9p8M1rk6O4q4M7
6978AJ7p1M8L9k6l5N8pk9m2K3M2p1O0l3nM8p2RP2m0m4R3l6j7K8jJ3k0J4K5j4o0
7011c3L8O5j45N6L0K7km9J8J7k1pj7O1p4N0J3l0Nm2K7J4j2K1%k4J7m4K3L6l2L2
7043A8k2m5M9k0j6k8R1m5pKK2J0K7m3J6L6j0j5pJ2qjj3lmj9L3j4n4M0J6Kl0M7
$$ plain form
7077 17 -3 -25 2 -15 -21 -26 21 -5 -71 -17 -8 -29 29 8 -42 -13 17 13 20 -54 54 -6 6 17 -26 57 58 25 3 10 -5 27 32 -20
7111 -20 39 -1 -7 -22 -29 61 31 50 -25 -31 -16 -2 22 26 33 -29 3 -24 17 -27 -66 -23 -43 -41 -30 19 -55 -12 2 12 -6 6 62
7144 62 -1 0 -20 14 6 -1 -14 24 16 -10 13 19 49 6 39 36 28 8 6 -33 -3 -34 -5 -68 -2 15 -77 4 -27 26 -43 26 88 -16
7178 -16 -65 2 -49 49 18 15 -24 -4 -9 23 14 19 -1 28 20 2 41 47 32 39 30 17 -22 13 43 11 27 -11 -29 45 -5 -16 35 -31
7212 -31 9 3 -101 -5 -17 14 4 5 24 7 -42 44 -20 -12 -18 -45 54 -72 -39 -3 55 45 -27 23 -21 22 -4 -30 65 31 -5
7243 -5 91 50 10 -7 -5 -14 18 -19 -58 50 23 -28 25 2 -23 33 -3 2 21 -37 -44 -19 -42 -21 37 -28 24 -11 -20 -4 -12 64 20
7276 20 24 16 -10 -73 38 41 -11 52 23 -20 2 14 33 -20 -27 -1 15 1 13 -4 -48 12 -34 -35 -64 -42 -52 -34 15 35 -28 -1
7308 -1 30 -57 11 -11 -31 9 -33 22 34 -4 22 -20 23 1 6 -54 25 43 -36 8 9 7 -61 45 14 26 -31 -44 -1 30 -24 -13
$$ packed form
7077A7k0k2K7j7onM7k6o6N4Rk1N8k1n0K9L0mPp4J08o0J2J1m3Q3Jl3k2Pj5L2Nn2
7111b0N9m0oj5pR0l0J9p5oJ5J4K4MPo2L2k7M1m4l9M3k0KJ1M9p4M3J4J0j8J2N6
7144F2o3Jk0L4qpj3L8qk6K3OL0m3L3lqk0kl9L0l1K9o3O6J7r2Q1l1N3o9O9O2j04
7178a6m9O7n1R8l1ll9K0nL2rNk0K9qj8L9Oj5Prj3l9L5L0l2J6l8j8P4n0j1N1o6
7212c1M0oj04R6j2L1j0JJ9j7m9Q6o4Qok7R9j26L3L6N8j0p2N0m4M3k6k6R5l4l6
7243eR6m1m0j7KrL2l7l9J08k7n1N3k3k5N6l6NJ9n8pK5k3K1N8o5N2l5rJ6qP6m4
7276B0Mqk6o3J11Ln2O3k9m3K2J2J9n3pK6J6j4J2j7m4O0m6jk9K2j0J8M9K0o3K7
7308aL1q7O8k2k0M0m2N5J2l8K6m2M3k2No0P9J8p9M4Jko8J06l1J2n7j3M3L1n4J1
$$ plain form
7340 -13 -55 -33 -36 -3 18 10 -26 37 13 -54 -32 3 41 -17 7 -7 7 22 11 -1 84 17 -72 -11 -20 4 -21 50 12 69 8 47
7372 47 -10 -18 -22 -7 -27 19 -9 1 -36 -14 -64 -15 -15 25 18 -1 -19 -36 -25 -19 9 42 -68 16 -17 71 24 -26 7 -36 -32 -15 -45
7405 -45 5 25 9 9 31 27 45 46 7 1 -32 44 -16 60 -28 14 44 25 6 -6 -13 -32 -15 0 2 -35 13 -7 12 -13 22 -36 -23
7438 -23 -74 13 38 57 39 19 -11 3 -9 14 5 -22 -1 7 -20 -34 -54 12 -44 16 28 0 24 -27 -13 -4 -35 -32 -61 1 32 -38
7470 -38 -26 -68 51 -54 -26 -16 19 8 6 -38 8 -15 21 7 0 3 15 -24 21 -3 36 27 21 -13 9 4 35 22 -4 7 -10 -25
7502 -25 58 -15 -27 60 -26 -84 -26 35 -53 6 -12 -6 -5 31 -16 10 -73 -15 -21 20 -26 -18 11 -9 7 -17 -37 51 -37 37 -20 -36
7534 -36 2 -2 55 38 30 20 -35 -19 41 44 1 64 8 12 -28 -24 10 41 -44 -46 30 15 -55 -43 -33 -24 37 -6 -32 -26 5 -12 -29 31
7568 31 -9 11 -48 36 -8 31 -11 34 1 10 56 -3 -20 -26 33 14 -5 19 -4 76 -2 32 23 -20 -38 27 14 -21 -42 39 20 4
$$ packed form
7340a3m2K2lL3K1ql6O3k4o7K2L5L8n8K4j4J4J5j1j2Q5o7q9O1rK4k5P1l8N7o1L9
7372D7n7qmJ5k0M6k8J0l7K2n0M9%M0pj9j8j7J1OK8L3j10Q4l3Q8m7n0L3m3MJ7l0
7405d5N0K0j6%K2mJ8Jl9ol3P6o0P6q8M2L0j9j9j2pj9J7J5Kl7M8k0J9k5L5n8J3
7438b3n1Q7K5J9j8k0l0J4j2K3rk7K1Qk7j4k0O6n6O0J2k8K4n1J4Rl1Lk9O2L1p0
7470c8J2m2J19j05K8J0L5j1km4M6k3L6j4pLJ2l9M5k4L9rol4K2nL1j3k6J1j7j5
7502b5Q3p3j2Q7q6n8N8O1q8N9j8OJL6m7K6q3N8oM1m6QK9k0J6k4k0Q8q8P4n7j6
7534c6L8mN7j7qj0n5J6O0Lm3O3n6Mm0ML4L1q5kP6j5p0J2J0RO1m3k6OL1j7j7O0
7568C1m0K0n9Q4m4L9m2M5l3RM6n9j7oN9j9j9K4k3Q0p8L4rm3j8O5j3l5k1Q1j9j6
$$ plain form
7600 4 3 4 -31 -43 19 10 -5 -25 -21 -30 11 -13 6 -5 17 4 -49 18 43 60 15 37 31 32 25 -12 16 -10 13 17 2 -29 32 -11 1
7635 1 -3 -22 0 27 -69 -78 24 4 27 -2 -7 1 -4 -12 20 16 16 -10 14 13 -9 -11 -17 -34 24 48 -25 -5 68 15 41 31 -31 37 -9 0
7671 0 -16 -11 23 -15 10 18 -3 -36 -25 3 -14 8 16 18 -18 27 -6 -8 -4 -10 -10 20 2 -37 33 -26 -24 -14 21 8 9 7 44 21 5 -18
7707 -18 16 22 -44 10 30 39 52 -10 21 56 -2 7 -22 50 5 0 -3 56 -28 -6 -10 0 -34 -24 65 -46 -29 -3 -26 -64 -21 -6 -12
7740 -12 -45 38 43 -21 -1 33 37 -43 14 48 47 16 -14 22 0 19 27 45 31 -8 9 -14 -5 38 -27 -16 -23 -21 -14 -7 -12 -27 -73 -35 17
7775 17 -10 -62 -14 0 -47 14 19 14 25 -40 11 10 -3 44 -6 3 59 85 -5 32 28 20 2 -11 38 13 7 17 11 15 -26 23 22 -52 78
7810 78 32 3 47 4 -24 -32 -17 -59 7 -23 -2 -49 -12 -9 -13 15 11 -8 -11 -28 16 58 15 -8 -2 3 0 82 8 10 54 66 -16 -5 22
7845 22 4 33 27 42 -11 -29 -4 18 4 7 -5 -9 21 23 -15 -48 29 -6 -13 5 -22 -15 -16 2 1 -20 7 -24 10 31 41 -3 -7 -34 10
$$ packed form
7600DjJl5j2O2rj5k0MrM1k4J9j1K2j3n3O7K5J7m5K2oJpl7K8k6K3Mj5l1O1m3J2
7635Amj9K2K7r6rJ02k0K3k9nQnqL2m%k6K4jk2koj7N8K4p3K0P3n3K6j0o2O8m6R
7671@j6NL4l8K5Qk1l3J1K8j7K2QKl6M5l3kMo%L0j8l9P0n9KJ0L5j3JkL7k3j6k3
7707a8L4Oo6N4K0RJ3o2L1L5n8Rk9P2m5nlN9q4K2mJ0l4J0Q9j11J7K6k3l8M3J5o
7740a2l3Q3No4K0L4Mq0N7L4jl1l0L6k2J9QJ8j4l9J7k3RM3o5J1pKPPnj5m6L8N2
7775A7k7n2M8J4m7O1NnJ1o5N1jj3M7n0RN6K6r0L7mqj8j3M9k5oJ0oMm1M9jp4J30
7810G8m6k9M4m3k8qJ5m2O6l0K1m7L7LmK8mj9lj7M4M2m3k3ONlQ2p4KM4J2q2J1K7
7845B2j8K9oJ5n3j8K5K2j4Lj2mL0Kl8l3P7l5pJ8k7PjJ8jk1K7l1L4K1J0m4mk7M4
$$ plain form
7880 10 53 -25 42 -48 -5 -1 27 -10 1 -50 53 -18 -79 -48 -25 49 -26 26 -39 -22 29 -58 -2 -9 -10 -13 21 -6 -11 -52 -34 -26 2
7913 2 -17 14 1 -36 -38 37 42 3 47 18 -26 -2 56 18 21 -16 26 37 -21 48 17 -4 20 -29 -7 -23 58 13 -71 6 -16 5
7945 5 22 -10 10 10 -49 -23 -6 -13 33 -8 -1 -34 -26 16 27 -42 30 -8 8 1 13 -2 -4 6 -21 -16 16 37 24 30 21 -78 6 -20 19
7980 19 -21 56 -14 6 23 5 -29 -67 -50 -8 -35 22 -91 -1 11 15 -4 1 24 -5 -29 15 43 -1 9 13 5 -31 -9 20 4 -8
8012 -8 11 -3 -30 -21 13 23 30 -43 27 3 -24 -6 53 -13 9 15 1 -1 13 0 -31 -57 8 -6 8 3 16 4 2 32 -25 -29 -76 3
8046 3 -1 -43 18 18 11 -15 -30 10 32 34 27 32 8 40 11 15 -25 5 -21 -8 -51 -18 -58 -7 -49 -1 -26 24 28 16 17 -48 -30 -30 -23 7
8082 7 -26 -8 -21 -37 16 -66 49 -11 -18 -24 -31 17 -16 20 27 -3 7 36 -5 -4 53 -2 48 74 1 -18 12 19 -18 -64 -20 20 16 -27
8116 -27 -24 -22 -1 20 41 -41 0 -66 -16 24 -18 -31 8 37 -11 -20 -16 30 12 -18 5 27 0 19 -70 8 13 10 -27 26 6 -30 5
$$ packed form
7880A0M3p8O7r0M3MK8l7J1n1J03p1o1L1K3P4p5N2o5J7N1q7N6pjlL4k7nm1J8QK8
7913Bj9L1j3l7kP5Nl9M4k9m4K4N8l8Ll7M2J1n8O9l1k1K4m9K2j6Q1m5q4P7k2K1
7945EJ7l2K0%n9K6J7pM6m1Pl3QM2J1o9P2l8J6pJ2j5kJ0k7NL2K1j3Orr9Q4k6L9
7980A9m0P7p0K0J7j8l4l8J7M2k7N7j13R0J2Mj9NK3k9k4M4K8m4J0Mql6K2K9j6j2
8012hJ9j4k7RL4J0Pp3P0k4k7J8N9o6K2Oj4kJ4j3l1k6O5j4J4nJ3j2kL0n7mm7P9
8046Cmm2O1%pk6j5M0K2KpNk4L2k9Mm0L0k6J3m3L3m0N1m2M8k5N0Mj2Jo5J8%PL0
8082Gl3J8j3j6N3q2J15o0popM8l3L6Pl0J0K9m1JN7n5N0K6p3j9L0Pl7m6M4M0mm3
8116b7LKK1K1K1q2M1o6N0M0m2j3L9K9m8rMM6j8l0K3K2k7J9q9P8Nll7N3k0l6L5
$$ plain form
8149 5 26 -25 -18 -16 12 -9 2 14 43 -39 -12 -1 -10 29 -50 15 -51 -45 -27 -18 -14 -34 -22 24 -5 4 -39 16 -30 0 -23 32 -47 -11
8183 -11 19 11 10 13 -16 -38 -24 26
$$ packed form
8149EK1n1PKK8k1J1J2K9q2K7J1rL9p9O5o6OJ8RMk0J2M6k9Rm3N5m6L0k3N5p9L6
8183a1L0qjLk9k2J4N0
8191B6
$$ Imaginary data points
##PAGE= N=2
##DATA TABLE= (X++(I..I)), XYDATA
$$ plain form
0 0 0 0 0 0 0 0 0 0 0 0 0 8 -8 8 -8 16 -16 24 -24 32 -40 48 -56 64 -72 88 -104 120 -136 154 -176 200 -232
33 -232 259 -295 328 -371 416 -464 516 -575 639 -708 787 -867 958 -1058 1166 -1286 1416
50 1416 -1559 1718 -1894 2090 -2311 2559 -2842 3165 -3545 3991 -4528 5189 -6024 7114 -8608
65 -8608 10791 -14283 20748 -36715 158649 155526 -125755 150461 62280 -186144 27970 158155
77 158155 -124025 -41766 104912 -143073 -181138 79489 -40662 -183472 11098 20428 -166131
88 -166131 -35887 95998 -39282 -37297 106895 16380 -60077 92864 115787 -25267 38914
99 38914 120982 -25105 -43709 122829 53015 -67775 60262 51567 -132506 -37233 75992
110 75992 -86692 -72829 81894 -59866 -128133 69927 17697 -122940 38704 56716 -130282
$$ packed form
0@%%%%%%%%%%%Qj6J6j6K4l2M0m8N6p2Q8j04J20j36J60j92K24k56K90l30L76m32
33b32M91n54O23o99P87q80R80j091J214j347J495j654J825k016K224k452K702
50A416k975L277l612L984m401M870n401O007o710P536q519R717j1213J3138j5722
65h608J9399k5074L5031n7463J95364l123k81281K76216q8181k48424K14114J30185
77A58155k82180Q2259J46678k47985l8065K60627j20151j42810J94570R330j86559
88a66131J30244J31885j35280J985J44192r0515p6457J52941K2923j41054O4181
99C8914Q2068j46087j8604J66538o9814j20790J28037q695j84073R5273J13225
110G5992j62684J3863J54723j41760o8267J98060n2230j40637J61644J8012j86998
$$ plain form
121 -130282 -22735 105587 -35769 -10738 117494 -16384 -73413 65409 14895 -55554 78068
132 78068 75636 -52136 2351 51112 -36081 -18014 53698 6410 -19512 21534 -2149 -33255
144 -33255 3016 10910 -27833 -22383 10295 -7520 -34429 -5147 7239 -36763 -32597 8378 -13353
157 -13353 -19972 26301 4967 -27300 22080 21116 -20987 32454 55693 -10040 9985 50772 -5138
170 -5138 -1793 51108 4507 -16183 30770 -9163 -39830 18736 -2098 -53864 -6102 -4146 -58833
183 -58833 -19492 10419 -33029 -12988 14736 -29025 -17397 26692 -3685 -5465 43413 24507
195 24507 -2389 30452 31824 6129 19534 23222 2282 6533 12191 -3581 -6390 2420 -6223
208 -6223 -23724 -21259 -6621 -16292 -30520 -10095 -2415 -27475 -14639 10935 -9791 -6144 24169
$$ packed form
121a30282J07547J28322j41356K5031J28232j33878n7029J38822n0514p0449J33622
132G8068k432j27772N4487M8761q7193J8067P1712m7288k5922M1046k3683l1106
144c3255L6271P894l8743N450L2678j7815k6909K9282J2386m4002M166M0975k1731
157a3353o619M6273k1334l2267M9380r64m2103N3441K3239o5733K0025M0787n5910
170e138L345N2901m6601k0690M6953l9933l0667N8566k0834n1766M7762J956n4687
183e8833L9341K9911m3448K0041K7724m3761J1628M4089l0377j780M8878j8906
195B4507k6896L2841J372k5695J3405L688k0940M251N658j5772k809Q810q643
208f223j7501K465J4638r671j4228K0425P680k5060J2836K5574k0726L647L0313
$$ plain form
221 24169 -1318 -12607 29757 13911 -16121 30902 34726 -17559 9386 35806 -14317 -8497
233 -8497 29646 -9827 -21689 20030 -6215 -31609 13174 6896 -34284 -3330 15148 -23260
245 -23260 -14877 15982 -4491 -13880 9535 3541 -9990 6759 11155 -6120 -148 15305 726
258 726 -11750 9296 14176 -11149 -4609 17737 -1705 -12674 12950 5221 -14535 9219 9924
271 9924 -18653 3276 19989 -16564 -10424 23489 -4881 -21273 14229 5300 -21110 3872 7762
284 7762 -18715 -1150 11874 -15221 -7664 16175 -5278 -14622 11341 7208 -10998 3339 12274
297 12274 -1242 869 10503 3048 -297 8336 4407 -4591 3866 8454 -5680 -6252 7663 -644
311 -644 -13313 -794 3558 -10994 -6767 2693 -7503 -6974 3336 -5922 -8042 7075 1490 -8931
$$ packed form
221B4169k5487j1289M2364j5846l0032M7023L824n2285K6945K6420n0123N820
233h497L8143l9473j1862M1719k6245k5394M4783o278m1180L0954J8478l8408
245b3260Q383L0859k0473r389K3415n994j3531J6749M396j7275N972J5453j4579
258G26j2476K1046M880k5325O540K2346j9442j0969K5624p729j9756K3754P05
271I924k8577K1929J6713l6553O140L3913k8370j6392L5502q929k6410K4982L890
284G762k6477J7565J3024k7095P557K3839k1453r344K5963m133j8206J4337Q935
297A2274j3516K111R634p455l345Q633l929q998Q457M588j4134n72J3915q307
311f44j2669J2519M352j4552M227R460j0196N29J0310r258k120J5117n585j0421
$$ plain form
325 -8931 6038 10813 -3832 451 10655 2686 -12 6489 3369 2301 6890 2088 -1512 4936
339 4936 3133 -5812 -3984 1144 -3021 -7298 -4144 -626 -2273 -4964 -4000 -1718 -2174 -4226 -4368 -1593
355 -1593 1606 1147 -116 3544 7270 4005 358 2920 5044 1474 -914 2478 5224 2958 852
370 852 1880 1902 -237 -3231 -5333 -3609 -1398 -4552 -5068 1323 2109 -3372 -2336 561 -1987 -2933 -2044
387 -2044 -1706 2154 3466 -598 2724 7752 1512 -2342 2476 652 -3104 6 45 147 4839 1352
403 1352 -3241 3372 3114 -6458 -3166 3388 -2193 -3348 2839 2130 1093 3257 -278 -2515 1184 -1254
419 -1254 -6380 -2001 3389 -860 -4436 1132 3508 -3781 -5009 1651 -739 -4622 1503 1705 -2191
434 -2191 6151 6799 -3951 4279 11742 -5017 -5154 11942 1679 -7929 8344 4897 -9199 2747
$$ packed form
325h931J4969M775j4645M283J0204p969k698O501l120j068M589m802l600O448
339D936j803q945J828N128m165m277L154L518j647k691R64K282m56k052j42K775
355a593L199m59j263L660L726l265l647K562K124l570k388L392K746k266k106
370H52J028K2k139k994k102J724K211l154n16O391P86n481J036K897k548r46Q89
387b044L38L860J312m064L322N028o240l854M818j824l756L110L9J02M692l487
403A352m593O613k58r572L292O554n581j155O187p09j037K164l535k237L699k438
419a254n126M379N390m249l576N568K376p289j228O660k390l883O125K02l896
434b191Q342O48j0750Q230P463j6759j37J7096j0263r608J6273l447j4096J1946
$$ plain form
448 2747 3206 -12911 -1013 6690 -14110 -9543 8767 -6468 -12807 7630 3520 -9651 2222
461 2222 4434 -5874 3713 10252 -859 2098 11220 1315 -3946 7988 9533 -1591 -970 5477
475 5477 -1197 -7617 429 2413 -6198 -3483 -382 -10620 -7030 5404 -4537 -8927 6969 32
489 32 -14682 2482 10529 -4791 2561 12193 -3224 -2168 10638 175 -574 13072 936 -9548
503 -9548 5388 4602 -6007 3715 6099 -5418 -4185 -2703 -6354 553 2192 -5561 -2077 49 -6013
518 -6013 -1308 3660 -368 1549 -676 -9371 -892 7245 -1642 2402 11924 -874 -7425 3277 1224
533 1224 -1448 8202 4439 -4300 2979 3449 -5360 1227 8632 -739 -6703 -993 418 -4353 -3488 2472
549 2472 94 -6927 -2955 190 -6295 -1185 5378 -7551 -7068 9553 -1283 -9834 13457 10646
$$ packed form
448B747M59j6117J1898P703k0800M567J8310j5235o339K0437m110j3171J1873
461B222K212j0308R587O539j1111K957R122r905n261J1934J545j1124O21O447
475E477o674o420Q046J984q611K715L101j0238L590J2434r941m390J5896o937
489C2j4714J7164Q047j5320P352R632j5417J056J2806j0463p49J3646j2136j0484
503i548J4936p86j0609R722K384j1517J233J482l651O907J639p753L484K126o062
518f013M705M968m028J917k225q695Q479Q137q887M044R522j2798o551J0702k053
533A224k672R650l763q739P279M70q809O587P405r371n964N710J411m771Q65N960
549B472k378p021L972L145o485N110O563j2929M83J6621j0836q551K3291k811
$$ plain form
563 10646 -12371 4577 15113 -8780 28 18608 -5090 -6951 17741 -594 -13287 15324
575 15324 6105 -22217 -160 9478 -17529 -6239 14707 -7705 -14025 5679 -5934 -16091 6826
588 6826 8705 -9291 1984 12742 -6072 -8033 12990 8626 -5914 7812 15067 -4004 -2542
601 -2542 12974 -2024 -10216 11208 4447 -14852 6359 11575 -20270 -10705 12936 -12223 -16406
614 -16406 15719 1330 -19897 5764 4516 -19367 4826 17932 -11490 -2946 19308 -6040
626 -6040 -11718 19343 10713 -10075 7338 9878 -10648 -1026 13372 -398 -3420 8011 -3510
639 -3510 -15867 -119 7556 -7221 -4032 9806 -4973 -17862 997 5243 -10552 1506 12439
652 12439 -8521 -7181 12371 -3366 -10719 15027 7145 -14189 8471 16304 -10434 -1462 15409
$$ packed form
563A0646k3017J6948J0536k3893Q808J8580k3698j861K4692j8335j2693K8611
575A5324r219k8322K2057R638k7007J1290K0946k2412o320J9704j1613j0157K2917
588F826J879j7996J1275J0758j8814j961K1023m364j4540J3726P255j9071J462
601b542J5516j4998q192K1424o761j9299K1211N216l1845R565K3641k5159m183
614a6406L2125j4389k1227K5661j248k3883K4193J3106k9422Q544K2254k5348
626f040n678L1061q630k0788J7413K540k0526R622J4398j3770l022J1431j1521
639c510j2357J5748P675j4777L189J3838j4779j2889J8859M246j5795J2058J0933
652A2439k0960J340J9552j5737p353K5746p882k1334K2660P833k6738Q972J6871
$$ plain form
665 15409 -7051 -9211 13573 2380 -7803 10840 3467 -16343 -1223 7067 -9564 -3538 11000
678 11000 -2904 -12358 100 1129 -7046 378 6490 -3405 -5741 3419 -272 -5174 7820 9896
692 9896 -6381 -1637 10790 -2955 -6426 13095 6697 -8947 4389 6215 -9857 1434 10699
705 10699 -7552 -4680 9219 -7746 -12986 7653 1605 -11959 2722 5363 -9352 -2451 4772
718 4772 -5748 -2944 6012 -1616 -2503 7940 4281 -3231 2469 5337 -767 -928 4489 4116 -170
733 -170 71 1793 -914 -1279 1699 -1405 -3772 898 -1823 -7810 -665 3149 -4984 -3193 3540 -2380
749 -2380 -4341 1826 -398 -1609 3818 613 -1707 5066 3331 -2005 3308 4327 -1129 1008 2106
764 2106 -797 2020 1333 -3337 1348 2514 -5041 -2188 2721 -3941 -3974 1883 -2492 -3107 2984 -1749
$$ packed form
665A5409k2460k160K2784j1193j0183J8643p373j9810J5120Q290j6631O026J4538
678A1000j3904r454J2458J029q175P424O112r895k336R160l691m902J2994K076
692I896j6277M744J2427j3745l471J9521o398j5644J3336J826j6072J1291R265
705A0699j8251K872J3899j6965n240K0639o048j3564J4681K641j4715O901P223
718D772j0520K804Q956p628q87J0443l659p512N700K868o104j61N417l73m286
733a70K41J722k707l65K978l104k367M670k721n987P145L814q133J791O733n920
749b380j961O167k224j211N427l205k320O773j735n336N313J019n456K137J098
764B106k903K817o87m670M685J166p555K853M909o662l3N857m375o15O091m733
$$ plain form
780 -1749 -4375 3968 1317 -5616 2387 5543 -3220 -939 5525 186 -1688 3818 1309 -1784 2859
795 2859 1912 -3414 428 4200 -2518 -4256 3399 1606 -5938 -748 4166 -3361 -3527 3708 -1422 -4569
811 -4569 3988 575 -6400 3868 5658 -6961 -507 9217 -3340 -5544 7570 1256 -6561 4691
825 4691 3610 -6228 2700 5765 -6704 -1535 7760 -4080 -6800 6210 1626 -7418 2004 4714
839 4714 -4662 -1108 4422 -2969 -2999 4572 -501 -4995 3978 4164 -5100 -303 6560 -2013 -4752 4464
855 4464 1532 -5121 1967 3581 -4283 344 4938 -4252 -3241 5802 -1627 -6870 4120 3250 -6235
870 -6235 545 5519 -3223 -1876 4522 -1697 -2940 4444 206 -4184 3833 3697 -4529 -136 5054
885 5054 -1890 -3587 2511 435 -3241 485 982 -2228 396 1528 -2850 -1570 2896 -917 -3684
$$ packed form
780a749k626Q343k651o933Q003L156q763K281O464n339j874N506k509l093M643
795B859r47n326L842L772o718j738P655j793p544N190M914p527j66P235n130l147
811d569Q557l413o975J0268J790j2619O454R724j2557k204J3114o314p817J1252
825D691j081r838Q928L065j2469N169R295j1840k720J3010m584r044R422K710
839D714r376L554N530p391l0P571n073m494Q973J86r264M797O863q573k739R216
855D464k932o653P088J614p864M627M594r190J011R043p429n243J0990q70r485
870f235O780M974q742J347O398o219j243P384m238m390Q017j36q226M393N190
885E054o944j697O098k076l676L726M97l210K624J132m378J280M466l813k767
$$ plain form
900 -3684 2052 2818 -2483 -533 3479 281 -832 1933 353 -786 2111 375 -1966 1993 2298 -2702
916 -2702 -1140 2455 -890 -2789 364 -20 -1808 -523 -593 -1328 650 193 -2083 -105 1844 -533
932 -533 -1111 1619 1464 -137 424 1174 1142 1334 314 -358 1208 1068 -1170 -369 1466 -267 -1913 -631
950 -631 -23 -867 -688 -1021 -1212 -31 -855 -2258 247 1879 -1184 -1513 1287 642 -790 1038 1661 693
968 693 1003 183 -644 1781 2289 -684 -89 2059 -460 -2319 496 1477 -647 -969 -761 -1604 -1114 -247
986 -247 -1060 -438 875 -1331 -3032 -131 1862 -377 -317 1787 340 -1277 443 1469 1548 2369 737
1003 737 -1269 735 1591 -840 513 2772 -169 -2411 -746 -434 -468 587 -772 -1565 -230 -2032
1019 -2032 -3144 824 1866 -1215 -804 246 -1239 -204 1438 417 1642 2323 -1471 -1313 3240 1678
$$ packed form
900c684N736P66n301J950M012l198j113K765j580j139K897j736k341L959L05n000
916b702J562L595l345j899L153l84j788J285p0p35J978m57k276J978J949k377
932e33n78K730j55j601N61P50l2J92j020o72J566j40k238Q01J835j733j646J282
950f31O08q44J79l33j91J181q24j403K505J632l063l29K800o45j432J828O23r68
968F93L10q20q27K425N08k973N95K148k519j859K815R81k124l22K08q43M90Q67
986b47q13O22J313k206j701K901J993k239O0K104j447j617J720J026P9Q21j632
1003G37k006K004Q56k431J353K259k941k242J665L12l4J055j359p93J335j802
1019b032j112L968J042l081M11J050j485J035J642j021J225O81l794J58M553j562
$$ plain form
1035 1678 -703 2368 2024 -2053 -928 950 -765 387 1576 -2000 -2403 953 -1216 -3231 1270
1050 1270 1929 -3386 -2354 1756 -824 -1898 2530 1512 -1887 1233 1455 -2741 1233 4939 -1573
1065 -1573 -1663 5105 120 -4650 3215 3531 -4038 327 3435 -4383 -2097 4328 -2822 -3698 5367 -368
1081 -368 -7422 2282 3570 -5932 -280 5880 -3057 -3181 4576 -1018 -3504 5505 2346 -5174 2247
1096 2247 4518 -5104 -1400 7243 -239 -4367 3614 1351 -5440 1139 3936 -3607 -679 4464 -3935
1111 -3935 -4784 5199 664 -6399 2868 4248 -6420 -1734 5988 -2447 -3168 5374 -716 -5204 4649
1126 4649 2762 -5344 2911 5637 -5628 -2218 6555 -1345 -3709 5122 1015 -5275 1718 2174 -4160
1141 -4160 992 3981 -3934 -2964 3587 -1176 -4076 2935 2450 -3684 -807 2295 -1760 -1079 3053 119
$$ packed form
1035A678k381L071l44m077J125J878j715J152J189l576m03L356k169k015M501
1050A270O59n315J032M110k580j074M428j018l399L120K22m196L974L706o512
1065a573r0O768m985m770P865L16p569M365L108p818K286O425p150q76R065n735
1081c68p054R704J288r502N652O160q937j24P757n594k486R009l159p520P421
1096B247K271r622L704Q643p482m128P981k263o791O579K797p543K928N143q399
1111c935q49R983m535p063R267J380j0668M686P722q435p21Q542o090m488R853
1126D649j887q106Q255K726j1265L410Q773p900k364Q831m107o290O993M56o334
1141d160N152K989p915R70O551m763k900P011m85o134K877L102m055O81M132k934
$$ plain form
1157 119 -1847 2062 716 -2859 1692 3896 -1768 -1290 3128 -520 -3155 1587 1680 -1490 916 1109
1173 1109 -2312 -287 966 -2804 -1219 2542 -504 -2035 1227 424 -1742 -234 204 86 1287 86
1189 86 -814 1316 520 -1394 929 1750 -148 520 381 -1381 460 1056 -1806 43 2596 -1328 -2390
1206 -2390 1545 160 -2515 459 944 -1856 61 1265 -1662 -396 2511 -683 -2102 2154 1603
1221 1603 -2632 52 3020 -763 -1452 2687 699 -2097 1314 900 -3091 620 3024 -2807 -1482
1236 -1482 4108 -1434 -4783 2772 1942 -4305 979 3537 -3447 -1213 3781 -2207 -2135 5126 113 -4532
1252 -4532 3305 2748 -5023 383 5110 -2354 -2282 3893 -715 -3652 2587 1162 -3820 1353 3041 -4006
1268 -4006 -1796 4188 -1186 -4042 3076 2240 -3972 309 3445 -2458 -1277 3859 -982 -2733 3986
$$ packed form
1157A19j966L909j346l575M551K204n664M78M418l648k635M742R3l170K406J93
1173A109l421K025J253l770J585L761l046j531L262q03k166J508M38j18J201j201
1189H6r00K130p96j914K323Q21j898O68j39j762J841N96k862J849K553l924j062
1206b390L935j385k675K974M85k800J917J204k927J266K907l194j419M256n51
1221A603m235K684K968l783o89M139j988k796L411m14l991L711K404n831J325
1236a482N590n542l349P555q30o247N284K558o984K234M994n988P2P261n013m645
1252d532P837n57p771N406M727p464P2O175m608k937O239j425m982N173J688p047
1268d006K210N984n374k856P118q36o212M281L136n903J181N136m841j751O719
$$ plain form
1283 3986 1157 -4542 1939 3977 -4098 -1378 4889 -1428 -3608 3236 453 -4058 1865 1863 -4092 478
1299 478 3548 -3396 -2271 4248 -544 -3912 2616 2250 -3134 376 2910 -1612 -797 2799 -656 -1859
1315 -1859 2713 1051 -2941 1051 2912 -2351 -1764 2824 -268 -2956 1264 1158 -2614 18 1532
1330 1532 -2343 -900 2414 -1393 -2248 2680 818 -2927 1101 2584 -1716 -381 2596 -235 -743
1345 -743 1887 119 -1162 1620 668 -1938 370 1689 -1376 -1492 921 1 -1772 -542 301 -735
1361 -735 -655 -15 -445 -367 495 -135 -748 846 1364 -590 -324 1855 883 -935 631 1519 -70 -156 751
1380 751 -11 -164 273 -674 -892 402 -208 -1557 -510 688 -788 -1471 -12 426 -779 -606 637
1397 637 253 -294 427 404 -57 932 955 -610 388 1716 -360 -854 1671 857 -1402 132 867 -1024
$$ packed form
1283C986k829n699O481K038q075K720O267o317k180O844k783m511N923kn955M570
1299D78L070o944J125O519m792l368O528l66n384L510K534m522Q15L596l455j203
1315a859M572j662l992L992J861n263N87M588l092k688M220j06l772K632J514
1330A532l875J443L314l807q55M928j862l745M028J483m300J335K977k831n08
1345g43K630j768j281K782r52k606K308J319l065j16K413r20j773J230Q43j036
1361g35Q0O40m30P8Q62o30o13J594N18j954K66K179r72j818J566Q88j589q6R07
1380G51p62j53M37r47k18J294o10j349J047J198j476o83J459M38j205J73J243
1397F37l84n47P21k3m61R89K3j565R98J328k076m94K525q14k259J534P35j891
$$ plain form
1415 -1024 -495 707 -851 -741 639 -1016 -1602 1077 479 -1890 -40 1140 -1141 -1013 1183 455
1431 455 -541 631 269 -598 811 1033 -530 517 1572 -526 -1044 1328 1120 -940 40 973 -737
1448 -737 -937 304 -140 -385 459 -696 -1615 188 327 -1406 -159 1271 -620 -1411 339 531 -118
1465 -118 523 482 -57 445 368 -178 874 1505 132 -598 399 460 -257 -78 473 275 -574 -991 -597 2
1485 2 -206 -629 -535 -428 -552 -660 -353 320 659 -225 -564 373 716 -155 245 1300 566 -256 273 605 219
1506 219 464 256 -320 94 236 -958 -517 939 -237 -1508 -90 425 -1166 -701 490 -317 -565 328
1524 328 -186 -327 1017 210 -1011 758 1302 -836 -307 1502 131 -908 732 705 -486 346 250 -1075
1542 -1075 15 871 -867 -489 1404 -251 -1691 386 813 -844 -15 728 -711 -551 426 -464 -254
$$ packed form
1415a024N29J202j558J10J380j655n86K679n98k369J850J180k281J28K196p28
1431D55r96J172l62q67J409K22j563J047J055k098n18K372k08k060R80R33j710
1448g37k00J241m44k45Q44j155r19J803J39j733J247J430j891p91J750J92o49
1465a18O41m1n39N02p7n46J052O31j373p30R97O1p17J79N51j98q49m17L94N99
1485Bk08m23R4J07j24j08L07O73L39q84l39R37L43q71M00J055p34q22N29L32l86
1506B19K45k08n76M14J42j194M41J456j176j271J418N15j591M65J191q07k48Q93
1524C28n14j41J344q07j221J769N44k138N29J809j371j039J640k7j191Q32r6j325
1542a075J090Q56j738L78J893j655j440K077M27j657Q29P43j439J60R77q90K10
$$ plain form
1559 -254 1455 26 -1503 272 736 -1009 -67 1463 -21 -793 143 -198 -120 1057 458 -605 474
1576 474 229 -1230 70 1559 169 -733 62 -286 -784 138 350 -36 337 -385 -1517 -255 838 -251
1594 -251 -217 858 -212 -1201 -20 602 369 778 353 -747 -13 548 -475 421 1621 -75 -1320 75
1612 75 225 -680 484 800 -736 -409 5 -1301 -268 1514 -233 -1325 643 84 -1576 453 1594
1629 1594 -346 -165 666 -897 -497 1475 244 -773 1217 489 -1912 -17 1747 -508 -679 1134
1645 1134 -301 -1355 499 368 -808 819 764 -1731 -553 1568 -717 -1247 1637 679 -1834 89
1661 89 1134 -1003 -24 1355 -882 -825 1405 -423 -1538 1526 1054 -1950 34 1822 -1007 -949 1625
1678 1625 23 -1198 975 330 -1371 802 1172 -1499 -294 1765 -771 -1513 1306 527 -1606 210
$$ packed form
1559b54J709j429j529J775M64j745R42J530j484p72R36l41P8J177n99j063J079
1576D74k45j459J300J489j390r02P95l48m98R22K12l86L73p22j132J262J093j089
1594b51L4J075j070r89J181O22k33M09m25j100P34N61j023Q96J200j696j245J395
1612G5J50r05J164L16j536L27M14j306J033J782j747j092J968n59j660K029J141
1629A594j940J81Q31j563M00J972j231j017J990p28k401J895J764k255j71J813
1645A134j435j054J854j31j176J627n5k495J178K121k285n30K884r58k513J923
1661H9J045k137R79J379k237N7K230j828j115L064m72l004J984J788k829N8K574
1678A625j602j221K173o45j701K173L70k671J205K059k536p42K819p79k133J816
$$ plain form
1694 210 935 -1215 -493 949 -730 -689 1308 -120 -1522 898 1060 -1413 -100 1870 -309 -1006 1169
1711 1169 376 -995 866 852 -906 423 1027 -1258 -651 1496 -328 -1455 799 471 -1625 -352
1727 -352 753 -694 -394 624 -522 -631 760 -94 -850 842 1035 -812 -162 1239 190 -499 686
1744 686 734 -194 194 412 -218 129 473 -578 -575 496 -117 -1085 -76 408 -735 -719 157 -125 -347 -2
1764 -2 -127 -66 357 82 -215 490 676 -111 -12 565 464 102 8 375 446 -107 -465 240 280 -379 -214 50
1786 50 -304 -339 -187 -626 -205 380 -445 -641 543 263 -981 -71 833 -251 -370 739 224 -309 448
1805 448 217 -455 601 677 -720 44 1209 -297 -938 872 539 -1056 84 770 -772 -438 717
1822 717 -711 -844 935 -276 -1522 707 843 -1640 -383 1439 -739 -1070 1236 232 -987 1068
$$ packed form
1694B10P25k150P22J442j679M1J997j428j402K420J62k473J313J970k179o97K175
1711A169p93j371J861j4j758J329O04k285O07K147j824j127K254l28k096J273
1727c52J105j447L00J018j146j09J391q54p56J692J93j847O50J401j049o89J185
1744F86M8r28L88K18o30L47L44j051LJ071o13r68J009M84j143J6Q76k82k22L45
1764bj25O1M23k75k97P05J86p87R9N77j01l62r4L67P1n53l58P05M0o59J65K64
1786E0l54l5J52m39M21N85q25j96J184k80j244R10R04j084j19J109n15n33P57
1805D48k31o72J056P6j397P64J165j506o41J810l33j595J140O86j542L34J155
1822G17j428j33J779j211j246K229J36k483J257J822k178l31K306j004j219K055
$$ plain form
1838 1068 785 -1123 694 1407 -1101 -304 2121 -83 -1361 1350 854 -1584 117 1121 -1168 -583
1854 -583 1068 -983 -1329 1102 -210 -2054 577 1084 -1740 -590 1704 -525 -1217 1394 568 -1138
1870 -1138 1018 1179 -1028 536 1779 -938 -671 1945 22 -1602 1146 1080 -1673 -108 1125 -1280
1886 -1280 -927 1128 -746 -1423 1136 101 -1907 442 1143 -1500 -485 1725 -267 -993 1240 552
1902 552 -981 763 945 -959 285 1517 -731 -772 1479 68 -1527 639 964 -1199 -314 942
1918 942 -649 -734 766 -317 -993 852 229 -1453 183 1069 -1021 -672 1229 -8 -953 615 385
1935 385 -666 438 617 -631 171 1020 -488 -440 1176 255 -877 426 752 -613 -180 554 -261 -366
1953 -366 391 -282 -670 253 -5 -947 30 520 -677 -571 483 -48 -527 156 328 -142 298 317 -228 380
$$ packed form
1838A068k83j908J817P13k508P97K425k204j278K711m96k438J701J004k289N85
1854e83J651k051l46K431j312j844K631N07k824J150K294k229o92K611q26j706
1870a138K156J61k207J564J243k717K67K616j923j624K748o6k753J565J233k405
1886a280L53K055j874o77K559j035k008K349P01k643J015K210j992p26K233o88
1902E52j533J744J82j904J244J232k248m1K251j411j595K166L25k163Q85J256
1918I42j591q5J500j083o76J845o23j682J636Q86k090L49J901j237r45J568k30
1935C85j051J104J79j248Q02Q49j508M8J616r21j132J303L26j365M33P34q15j05
1953c66P57o73l88R23k58r42R77M90j197J06J054n31m79O83J72m70M40J9n45O08
$$ plain form
1973 380 741 -95 -59 821 245 -408 207 523 -73 -75 -39 -294 -279 -125 -516 -259 154 -424 -784 -118 51 -427
1995 -427 -124 281 -32 -190 -26 35 464 548 89 39 528 198 -202 348 709 111 -178 -35 -205 -155 35
2016 35 -161 -133 35 -518 -899 -82 295 -346 -246 164 -270 -529 81 206 174 558 121 -465 213 560 -60
2037 -60 274 933 82 -644 66 324 -50 311 248 -372 -301 -96 -545 -199 679 -71 -876 -103 25 -657 -114
2058 -114 583 83 -273 -68 -234 -105 616 401 -105 316 282 -583 -98 963 406 -236 261 89 -417 -7
2078 -7 353 100 126 45 -597 -464 248 -13 -458 153 102 -701 -501 159 32 -76 181 -38 -241 139 160 -41
2100 -41 409 500 -178 -203 482 306 -60 228 389 -98 -189 54 -39 54 23 -198 -301 29 -139 -483 -233 169
2122 169 -187 -429 -67 172 -202 -265 67 139 13 81 66 144 250 74 -8 298 563 -35 -193 282 165 -190
$$ packed form
1973C80L61q36L6Q80n76o53O15L16n96kL6k55J5J54l91K57M13n78l60O66J69m78
1995d27L03M05l13j58J64O1M29Q4m59n0M89l30m00N50L61n98k89J43j70N0J90
2016C5j96K8J68n53l81Q17L77o41J00M10m34k59O10J25l2L84m37n86O78L47o20
2037f0L34O59q51p26P10K58l74L61o3o20P1K05m49L46Q78p50q05P73J28o82N43
2058a14O97n00l56K05j66J29P21k15n06M21l4q65M85J061n57o42M97j72n06M10
2078gL60k53K6q1o42J33P12k61m45O11n1q03K00O60j27j08K57k19k03L80K1k01
2100d1M50R1o78k5O85j76l66K88J61m87r1K43r3R3l1k21j03L30j68l44K50M02
2122A69l56k42L62K39l74o3L32P2j26O8j5P8J06j76q2L06K65n98j58M75j17l55
$$ plain form
2144 -190 -21 303 -1 -255 -257 -261 -133 58 -179 -281 43 -144 -543 -147 393 51 -267 48 108 -178 66 298
2166 298 155 261 179 -193 41 452 255 -1 277 211 -372 -221 210 149 -75 -57 -171 -286 -133 -220 -169 183
2188 183 47 -468 -358 110 -12 -178 158 207 -56 -171 -59 198 316 201 -48 123 183 -119 -80 322 317 -8
2210 -8 -159 -87 94 -1 -123 -60 129 -135 -431 -145 83 -104 -194 -68 -80 -92 -112 -123 142 224 -12 -222 247 352
2234 352 -72 65 371 159 -56 132 71 48 255 43 -221 163 136 -420 -116 318 -126 -515 54 -54 -461
2255 -461 -154 73 -206 -30 135 -367 -117 511 75 -302 438 504 -263 67 635 -7 -90 374 112 -150 288
2276 288 12 -437 170 277 -584 -361 455 -201 -658 138 91 -553 -74 165 -314 -15 384 -217 -168 671 123
2297 123 -434 379 614 -252 -15 634 0 -198 336 51 -288 280 13 -537 103 339 -583 -496 399 -119
$$ packed form
2144a90J69L24l04k54kmJ28J91k37j02L24j87l99L96N40l42l18L15O0k86K44K32
2166B98j43J06q2l72K34M11j97k56K78o6n83J51M31o1k24J8j14j15J53q7N1L52
2188A83j36n15J10M68j22j66L36M9k63j15J12K57J18j15k49J71O0l02L9M02nl25
2210hj51P2J81r5j22O3J89k64k96K86K28j87r0J26j2j2k0j1K65Q2k36k10M69J05
2234C52m24J37L06k12k15J88o1k3K07k12k64L84k7n56L04M34m44l89N69j08m07
2255d61L07K27k79J76J65n02K50O28m36l77P40O6p67L30N68o42q3M64k62k62M38
2276B88k76m49O07J07q61K23Q16o56m57P96m7o44M79K39m79K99L99o01M9Q39n48
2297A23n57Q13K35q66K37O49o34j98N34k85l39N68k67n50O40K36r22Q7Q95n18
$$ plain form
2317 -119 -630 87 165 -418 -42 231 -296 33 358 -195 -202 467 223 -374 260 572 -195 -92 421 61 -155
2338 -155 226 42 -237 66 27 -386 36 241 -338 -324 242 -25 -469 -141 156 -202 -113 87 -58 29 89 -79
2360 -79 -40 294 137 -165 138 398 12 -100 172 194 -45 16 96 11 3 -15 -123 -52 38 -54 -229 -33 179 -197
2384 -197 -285 31 47 -254 -152 97 72 -85 42 19 8 98 20 -72 199 273 -57 -64 392 135 -264 27 352 -62
2408 -62 -119 234 51 -137 74 -104 -310 148 126 -387 -65 310 -319 -451 195 180 -418 79 252 -232 -59
2429 -59 216 -168 -85 466 34 -293 433 388 -339 75 522 -108 -223 363 -44 -256 236 106 -430 95 190
2450 190 -525 -243 448 -200 -595 266 112 -599 -23 302 -318 -98 357 -212 -155 572 49 -371 417 439 -468
2471 -468 2 659 -26 -254 419 147 -338 184 179 -389 140 283 -572 -310 435 -235 -543 336 172 -600 -93
$$ packed form
2317a19n11P17P8n83L76K73n27L29L25n53pO69k44n97O34L12p67J03N13l60k16
2338a55L81j84k79L03l9m13M22K05n79J4N66k67m44L28K97l58Q9K00j45Q7O0j68
2360g9L9L34j57l02L03K60l86j12K72K2k39O1Q0q5qj8j08P1R0r2j75J96K12l76
2384a97q8L16J6l01J02K49k5j57J27k3j1R0p8r2K71P4l30pM56k57l99K91L25m14
2408f2n7L53j83j88K11j78k06M58k2n13L22L75o29j32O46j5n98M97J73m84J73
2429e9K75l84Q3N51m32l27P26m5p27M14M47o30j15N86m07k12M92j30n36N25R5
2450A90p15K82O91o48l95Q61j54p11N76L25o20K20M55n69N7P27n23m20P88K2r07
2471d68M70O57o85k28O73k72m85N22nn68N29J43q55K62P45o70l08Q79j64p72N07
$$ plain form
2492 -93 250 -295 -29 402 -177 -196 400 63 -376 435 513 -331 29 521 -92 -197 412 123 -307 246 23
2513 23 -465 44 230 -467 -219 307 -275 -541 183 107 -316 53 135 -274 -93 224 -111 40 460 43 -267
2534 -267 373 329 -151 94 431 -23 -111 157 33 -89 188 -5 -259 109 17 -447 -104 225 -139 -324 62
2555 62 -46 -284 -72 37 -1 98 13 -222 28 282 -10 54 389 202 -173 26 150 27 90 193 -61 -57 80
2578 80 -241 -127 222 13 -310 -97 -3 -237 -149 103 -2 -38 -70 -137 -54 165 85 -83 169 148 -169 -127 185
2601 185 209 61 149 56 -59 37 -4 -34 165 179 -209 -189 94 -48 -112 122 136 -181 -221 -37 -67 57 134 -45
2625 -45 -41 59 -148 -121 204 248 -56 -33 125 -45 -34 156 183 42 111 -138 -195 83 153 -30 -25 120 -102 -324
2649 -324 -19 105 -91 -66 -44 -107 -186 2 -44 30 173 -14 -226 -28 160 -16 -4 235 149 -141 -57 47 75
$$ packed form
2492i3L43n45K66M31n79j9N96l37m39Q11P8q44L60M92o13j05O09k89m30N53k23
2513B3m88N09J86o97K48N26n82k66P24p6m23L69Q2m09J81L17l35J51M20m17l10
2534b67O40m4m80K45L37m54q8K68j24j22K77j93k54L68r2m64L43L29l64j85L86
2555F2j08k38K12J09l8R9q5k35K50K54k92O4L35j87l75J99J24j23O3J03k54MJ37
2578H0l21J14L49k09l23K13R4k34Q8K52j05l6l2o7Q3K19q0j68K52k1l17M2L12
2601A85K4j48Q8r3j15R6m1l0J99J4l88K0K83j42o4K34J4l17m0J84l0J24P7j79
2625d5MJ00k07K7L25M4l04K3J58j70J1J90K7j41O9k49n7K78P0j83NJ45k22k22
2649c24L05J24j96K5K2o3p9J88m6P4J43j87k12J98J88j76J2K39q6k90Q4J04K8
$$ plain form
2672 75 91 97 -31 -28 61 -124 -95 284 93 -179 -143 25 -108 -118 16 -8 -108 -56 -88 -87 77 113 -98 -50 186 -38
2698 -38 -173 112 197 -66 43 119 2 -35 120 9 82 117 -48 -194 14 146 -114 -124 116 -31 -253 -19
2720 -19 6 -57 -33 -9 -138 -6 101 -98 -53 192 33 -146 56 201 -82 -7 160 80 46 4 -28 -69 113 -64
2744 -64 -116 81 71 -234 -134 104 29 -123 -33 49 -39 -88 -47 -27 50 62 -108 -59 94 30 -101 64 160 -11 -100
2769 -100 95 89 1 9 -17 57 71 -57 -113 55 50 -90 -131 31 11 -130 -106 5 14 -40 -145 -18 56 -16 -45 71 141
2796 141 17 -44 -59 87 54 -40 -47 71 98 -18 -63 63 81 -117 -106 119 22 -49 -3 31 -13 29 -68 -99 32 28 -107
2823 -107 -19 138 -20 -113 72 79 -59 -73 58 -1 78 49 -65 31 121 -81 -49 154 86 -128 -35 121 -27 -58 61
2848 61 -32 -27 18 -15 -98 109 56 -139 -73 210 -29 -119 86 51 -81 17 75 24 40 75 -114 -46 151 3 -157 94
$$ packed form
2672G5J6Oj28LQ9j85K9L79j91k72L6J68j33j0J34k4j00N2l2JJ64L6k11M8K36k24
2698c8j35K85Q5k63J09P6j17l7J55j11P3L5j65j46K08J32k60j0K40j47k22K34
2720a9K5o3K4K4j29J32J07j99M5K45j59j79K02J45k83P5J67q0l4m2l2m1J82j77
2744f4n2J97j0l05J00K38p5j52R0Q2q8m9M1K0P7J2j70M9J53o4j31J65R6j71q9
2769a00J95oq8Qk6P4J4j28n6J68nj40m1J62k0j41K4J11Rn4j05J27P4p2k9J16P0
2796A41j24o1j5J46l3r4pJ18K7j16m5J26J8j98J1K25r7p1M6L4m4M2r7l1J31mj35
2823a07Q8J57j58r3J85Pj38j4J31n9P9k9j14R6R0k02L2K03o8k14R3J56j48l1J19
2848F1r3NM5l3q3K07n3j95O6K83k39r0K05l5j32R8N8n1J6L5j89O8J97j48j60K51
$$ plain form
2874 94 146 -155 -13 130 -7 -75 54 -15 -58 80 23 -157 33 134 -166 -88 202 -40 -205 30 89 -146 -52
2897 -52 83 -79 -24 53 -137 -45 109 43 -197 83 173 -103 -91 219 48 -30 96 45 -58 68 78 -106 76
2920 76 89 -51 -117 113 3 -198 16 74 -114 -87 20 -33 -35 84 -57 -55 132 103 -118 50 205 -61 -110 137
2944 137 99 -20 52 93 21 18 48 -108 -9 123 -77 -169 27 62 -129 -119 139 -27 -122 39 -23 -51 33 23 -8 40
2970 40 47 -102 -41 136 57 -81 46 123 -35 -35 130 42 -10 65 -7 -48 18 -53 -53 30 127 -131 -163 46 16 -86 15
2997 15 66 -28 -83 58 70 -6 82 29 -85 13 103 -80 29 158 22 -146 60 62 -26 37 55 -76 -20 -20 -136 -114
3023 -114 155 47 -161 33 -12 -169 -85 139 -18 -53 44 27 -67 2 96 -23 82 113 -115 -78 150 43 -41 71
3047 71 147 -171 -30 94 -26 8 42 -91 -201 11 -80 -190 12 170 -158 -144 43 18 -109 15 55 -17 34
$$ packed form
2874I4N2l01J42J43j37o8J29o9m3J38n7j80J90J01l00P8K90k42j65K35N9k35R4
2897e2J35j62N5P7j90R2J54o6k40K80R0k76J2L10j71p8J26n1j03J26J0j84J82
2920G6J3j40o6K30j10k01K14N8j88K7J07n3kJ19j41KJ87k9k21J68J55k66m9K47
2944A37l8j19P2M1p2lL0j56R9J32k00r2J96L5j91J0K58j66r5J61o2k8Q4j0l1M8
2970D0Pj49O1J77p9j38J27P7j58%J65q8n2P5p2m1O6p1%Q3R7k58l2K09l0j02J01
2997A5N1r4n5J41J2p6Q8n3j14R8R0j83J09J29j36j68K06Kq8O3J8j31N6%j16K2
3023a14K69j08k08J94m5j57Q4K24j57l5R7j7r4O9R4j19J05L1k28L7K28j07q4J12
3047G1P6l18J41J24j20L4L4j33j10K12r1j10K02J58l28J4J87k5j27J24M0p2N1
$$ plain form
3070 34 56 -81 37 203 -12 -88 123 33 -116 63 118 -43 16 58 -92 -120 17 -86 -88 32 -6 -251 -73 105
3094 105 -135 -146 89 30 -121 25 99 36 116 121 -47 17 108 -41 -67 186 168 -94 -11 81 -65 -81 75 0 -79
3119 -79 8 -108 -189 42 48 -114 -98 63 -164 -168 99 69 -27 -1 29 -44 31 108 71 120 182 -70 -87 114 91 -52 16
3146 16 113 -95 -70 39 -51 -14 8 -100 -127 23 -27 -144 -64 76 -82 -107 -6 29 -36 67 174 16 87 42 -64
3171 -64 66 146 35 21 117 48 -126 9 101 -20 6 -51 -77 -72 -19 -43 -100 22 4 -165 -6 56 -60 2 54 60 -51
3198 -51 -40 14 47 97 19 -36 44 109 -99 -7 93 60 -42 -3 56 -6 -34 12 -36 23 -45 -110 -132 49 -13 -76 -5 13
3226 13 -75 -77 77 9 20 -10 5 -26 86 4 -54 95 150 -62 7 79 45 -68 42 15 28 14 -33 -72 -27 -55 -86 -64
3254 -64 5 -58 -167 6 21 -105 -45 24 22 -50 -35 -38 -23 -1 -27 -30 36 78 -54 41 60 17 -37 2 37 1 3 -8 -46 -20
$$ packed form
3070C4K2j37J18J66k15p6K11r0j49J79N5j61N9M2j50k8J37j03kJ20l8k45J78J78
3094A05k40j1K35n9j51J46P4o3Q0Nj68O4R1j49k6K53j8k62Q3R2j46j6J56p5p9
3119g9Q7j16q1K31Oj62J6J61k27mK67l0r6K6L0p3P5P7l7M9O2k52j7K01k3j43O8
3146A6R7k08K5J09r0L7K2j08k7J50n0j17Q0J40j58k5J01L5o5J03J07j58P1m5j06
3171f4J30Q0j11j4R6o9j74J35R2j21K6n7k6NN3k4n7J22j8j69J59O2j16O2N2Oj11
3198e1J1N4L3N0p8n5Q0O5k08R2J00l3j02L9N9o2k8M6m8N9o8o5k2J81o2o3P1J8
3226A3q8kJ54o8J1l0J5l1J12q2n8J49N5k12O9P2l4j13J10k7J3j4m7l9M5k8l1K2
3254f4O9o3j09J73J5j26O0O9kp2J5lJ5K2k6lO6M2j32R5J9m3n4L9L5l6Kj1l8K6
$$ plain form
3284 -20 -45 -51 -63 -4 3 -98 -52 40 -24 -87 -53 22 43 34 1 15 32 -32 48 64 121 5 -27 26 97 64 20 27 53 -8 -54
3315 -54 -21 3 -81 -45 -50 -34 -43 -72 -40 -10 -33 -122 -15 -18 -17 -39 -11 56 51 22 8 35 39 44 -27 55 89 64 -27 -7 102 -18
3347 -18 9 4 -4 -43 -22 -51 19 -7 -27 -43 -8 17 -68 -28 14 52 -52 -50 57 50 11 5 39 27 66 -8 -5 30 83 17 21 47 30
3380 30 -6 32 0 -23 -83 -86 15 -12 -45 -112 -6 2 -28 -68 -5 -43 -41 25 36 63 -5 -17 4 69 -2 13 51 46 73 21 -13
3411 -13 39 23 0 -33 -29 21 -66 -86 2 -119 -91 -36 -46 -19 -61 -6 -49 -7 -41 -46 -30 81 36 11 47 32 59 -23 61 93
3441 93 13 23 24 27 27 -24 -64 37 -1 -101 -11 17 -45 -73 -53 0 -21 -47 -27 -78 42 -3 8 -27 -3 79 -33 12 111 12
3471 12 17 63 25 17 17 -16 7 26 -19 -64 -12 36 -76 -67 0 -29 -112 -7 14 -76 -29 -8 -56 -52 42 -25 -32 82 3 -60 43
3502 43 76 13 21 48 -18 -12 15 49 -13 51 26 -102 -23 44 -63 -119 43 11 -89 -31 9 -77 -26 51 -70 38 52 -31
$$ packed form
3284b0k5oj2N9Pj01M6R2o4o3L4P5K1rl3J4J7o4Q0J6N7j16l2N3P1l3m4PK6o1m6
3315e4L3K4q4L6nJ6rk9L2L0k3q9J07lJk2K8O7nk9j4K7MNp1Q2L4k5r1K0J09j20
3347a8K7nql9K1k9P0k6k0j6L5K5q5M0M2L8j04KJ07pl9oL4j2L9p4LL5N3o6MK6j7
3380C0l6L8l2k3o0lJ01k7l3o7J06Ql0m0O3l8KO6J1K7o8j2K1O5p1J5L8nK7n2l4
3411a3N2j6k3l3MN0q7k0Q8j21K8N5j0K7m2N5m3M2l4nJ6J11m5k5L6j5K7q2Q4L2
3441I3q0J0JL%n1m0J01l8j00R0K8o2k8K0N3k1k6K0n1J20m5J1l5K4Q2j12M5R9r9
3471A2NM6l8q%l3K3J9m5m5N2M8j12RO7k9q3J05K1r0M7K1m8MR4o7pJ14p9o3J03
3502D3L3o3QK7o6OK7L4o2O4k5j28P9O7j07n6J62l2j00N8M0q6N1P7j21J08J4q3
$$ plain form
3530 -31 -17 84 66 -107 55 18 29 -49 23 53 -5 9 -7 -41 29 50 -82 -4 25 -73 -147 40 50 -34 -30 50 -40 -46 27
3559 27 61 -49 77 -4 -90 45 30 48 6 126 29 -34 13 112 -16 84 17 -55 -6 42 -82 5 39 60 -83 -22
3585 -22 8 -47 -14 97 47 -6 -21 -12 -103 77 62 37 28 76 -45 -43 89 31 -27 33 114 -64 -28 68 8 3 107 -18 -82
3614 -82 62 69 -17 29 52 -58 -86 -16 31 -11 14 36 -31 26 39 -36 36 141 51 -26 59 68 -87 -31 96 36 -80 -24
3642 -24 5 -69 52 -55 -55 43 59 -134 -64 92 -34 -106 16 32 -54 2 28 -3 37 51 14 -71 21 60 -87 31 -3
3669 -3 -70 -33 86 8 -65 29 -15 -30 8 -8 -50 -12 101 -83 -59 25 19 -92 42 50 1 11 20 8 9 54 -34 -11 88 19
3699 19 -63 32 27 -50 -36 -26 -19 -30 -24 39 -60 2 -56 -74 -24 69 -38 -61 34 10 -48 -22 88 -37 -9 -5 -1 -6 33 -19 29 66
3731 66 1 7 -14 7 -32 26 68 -3 -30 -10 17 -57 43 51 -8 26 6 35 -77 59 -11 -36 16 -27 -15 -30 68 17 -1 36
$$ packed form
3530c1J4J01j8j73J62l7J1p8P2L0n8J4j6l4P0K1j32P8K9r8p4J87J0q4MQ0r0oP3
3559B7L4j10J26q1q6J35j5J8m2J20r7o3M7R9j28J00o7p2M9M8j24Q7L4K1j43O1
3585b2L0n5L3J11n0n3j5Rr1J80j5k5rM8j21KJ32n8n8O0Q1j78L6R6o0nJ04j25o4
3614h2J44Pq6M6K3j10k8P0M7m2K5K2o7N7J3p5P2J05r0p7Q5Rj55N6J27o0j16N6
3642b4K9p4J21j07%R8J6j93P0J56j26p2J22J6q6N6K6l1M0J4l7q5R2L9j47J18l4
3669co7L7J19p8p3R4m4j5L8j6m2L8J13j84K4Q4oj11J34Qm9J0Rj2JM5q8K3R9o9
3699A9q2R5np7J4J0Pj1OO3r9O2n8j8N0R3j07k3R5k4n8K6J10j25K8MMnL9n2M8L7
3731F6o5Ok1K1l9N8M2p1k7K0K7p4J00Qn9L4k0K9j12J36p0k5N2m3J2j5R8n1j8L7
$$ plain form
3761 36 15 -19 45 40 -81 19 26 -64 5 38 38 -2 -17 9 49 11 -66 17 22 61 -7 -32 -10 -7 -72 2 0 35 -18 24 56 24
3793 24 -4 -11 27 9 -37 -9 -8 33 -35 -25 7 -50 -20 -18 -43 9 30 -64 15 -13 -9 3 -24 27 22 9 -1 -12 19 -14 -41 21 56
3826 56 -9 -40 52 73 -15 -49 41 6 -22 -76 -11 8 -19 -14 -41 15 52 -13 -30 -11 16 -10 14 15 5 48 -23 -53 52 25 -23
3857 -23 22 11 30 -4 33 48 36 -1 9 -3 -65 32 -28 13 3 9 -13 44 0 -66 -40 10 16 -2 18 16 83 -13 -61 -36 10 20
3889 20 -37 39 22 44 1 -7 -18 56 -36 -57 17 18 -59 -14 31 1 -4 21 19 23 20 -63 14 43 -29 -58 16 68 0 -16 17 -8 3
3922 3 -8 -11 69 35 39 10 46 49 -50 -39 -2 -27 -54 6 -3 -25 -26 -67 57 42 -39 48 5 7 -18 0 45 53 -48 41 37 15 28 -12
3956 -12 -31 49 26 11 -53 -24 31 -33 -13 -7 8 -24 23 0 24 21 -39 -10 -7 -49 -3 -21 28 -26 -61 48 -1 57 57 -11 -48 21
3988 21 -51 -19 -3 -30 12 -54 31 -8 -71 -13 -9 -70 -77 -15 16 -20 76 29 10 16 -7 -50 41 29 66 -1 9 1 -32 -24 50 8 3
$$ packed form
3761C6k1l4O4nj21J00Pr0O9L3%m0j5K6M0l8p7Q3NL9o8k5K2Lo5P4kL5n3M2L2l2
3793B4k8pL8j8m6K8JM1o8J0L2n7L0Kk5N2K1r4P9k8MJ2k7N1nj3j0j1L1l3k7O2L5
3826E6o5l1R2K1q8l4R0l5k8n4O5J9k7Nk7N6L7o5j7J9K7k6K4Jj0M3p1l0J05k7m8
3857b3M5j1J9l4L7J5j2l7J0j2o2R7o0M1j0Ok2N7m4o6K6N0Oj8K0kO7r6m8K5M6J0
3889B0n7P6j7K2m3qj1P4r2k1P4Jp7M5M5l0nK5kMlq3P7K9p2k9P4N2o8j6L3k5J1
3922Cj1lQ0l4Mk9L6Lr9J1L7k5k7O0rk2jm1J24j5q1Q7m3Kk5J8M5Qj01Q9mk2J3m0
3956a2j9Q0k3j5o4K9N5o4K0OJ5l2M7k3K4lo0K9Lm2M6j8M9n4l5J09m9N8%o8l7O9
3988B1p2L2J6k7M2o6Q5l9o3N8Mo1pO2L1l6R6m7j9Ok3m3R1j2L7o7J0ql3QP4m2n
$$ plain form
4021 3 -8 -53 22 -4 -41 -70 70 -45 -49 -23 25 5 -30 40 17 -73 -20 -10 73 62 -29 -52 -30 39 36 -41 12 7 -41 -17 8
4052 8 8 37 40 16 1 50 -26 3 14 18 -76 -13 2 -43 24 48 -4 -38 14 -37 -25 16 -27 -25 -9 2 -52 -44 48 3 -22 18 -13
4085 -13 -47 -14 13 -19 17 20 -70 -33 41 26 -53 49 -1 -50 20 63 -56 -64 69 -6 -19 -9 24 -65 5 85 4 -19 15 -12
4115 -12 -37 7 5 -11 81 -64 -73 -29 69 -9 -7 73 3 -96 -45 53 25 6 -12 -23 -49 61 -23 -32 43 26 -27 4 48 22 12
4146 12 -22 10 -49 -31 37 24 28 7 -47 -58 -11 -49 -22 -37 6 6 -63 12 -44 -44 28 7 -38 83 -24 -67 -26 39 26 -10 38
4177 38 -11 -2 -4 -23 41 41 30 -21 4 66 -60 47 -34 -4 -49 -24 -18 -19 -66 40 -13 -47 -38 -29 -13 -57 -27 -34 10 2 -68 -46 69
4210 69 40 -55 -1 12 19 22 13 6 46 4 -33 -41 46 -72 -20 1 -19 -21 -48 3 -16 -24 0 -40 10 43 9 -18 26 -56 -14 -26 10
4243 10 16 -12 26 39 3 5 6 -11 15 -6 53 -44 -18 -17 30 12 -18 -15 -56 -30 41 -44 -49 12 80 -10 -49 -12 92 27 1 -8 70
$$ packed form
4021Cj1m5P5k6l7k9J40j15mK6M8k0l5P0k3r0N3J0Q3j1r1k3K2O9lp7N3nm8K4K5
4052H%K9Lk4j5M9p6K9J1Mr4O3J5m5O7K4n2l4N2n1J2M1m3KJ6J1n4QR2m5k5M0l1
4085a3l4L3K7l2L6Lr0L7P4j5p9J02n0m9P0M3j19qJ33p5j3J0L3q9P0Q0q1k3L4k7
4115a2k5M4kj6R2j45rM4R8p8KQ0p0r9N1R8k8j9j8j1k6J10q4rP5j7n3L1M4k6j0
4146A2l4L2n9J8O8j3Mk1n4j1M7l8K7j5M3%o9P5n6%P2k1m5J21j07m3M1O5j3l6M8
4177C8m9Rkj9O4%j1n1K5O2j26J07q1L0m5K5Ojm7J06n3l4RRJ6m4L0pM4qp0K2J15
4210F9k9r5N4J3PLrpM0m2l7qQ7j18N2K1k0kk7N1j9qK4m0N0L3l4k7M4q2M2j2L6
4243A0Ok8L8J3l6KJj7K6k1N9r7K6JM7j8l0Lm1K6P1q5nO1O8r0l9L7J04o5k6rP8
$$ plain form
4276 70 37 -51 35 12 37 17 19 -4 40 -21 -38 -61 5 14 -58 -9 -64 -71 -38 -57 35 33 47 20 0 -18 -4 24 -16 50 11 34
4308 34 11 47 44 -27 59 -1 52 62 -57 39 40 -10 -21 -47 -21 4 -32 45 63 18 -11 24 -11 -21 -13 -20 6 51 -2 -19 7 9
4340 9 18 -58 44 16 -36 35 45 10 -39 59 -18 -21 -11 -14 25 2 -8 -48 -15 -31 -58 11 4 -52 -89 -9 -92 3 -17 -41 3 -49
4372 -49 11 -5 23 -8 1 -21 -15 -16 13 32 44 29 33 -2 -8 18 20 -24 -32 -17 -23 -27 -9 -54 -43 -19 -5 7 6 3 -41 -30 -6 -14 18 15 15
4409 15 21 18 29 10 51 4 38 3 4 -6 -56 -3 37 19 35 6 37 -84 -13 -31 -27 -33 8 -42 13 31 -15 28 70 27 -26 22
4441 22 21 1 11 17 27 -3 -41 -7 55 34 -25 -58 16 37 -28 -54 6 -10 0 14 7 -49 14 20 -31 6 2 -5 -24 48 -17 -32 13
4474 13 55 10 -32 -6 21 -39 23 12 4 -64 -42 -32 -8 -10 -29 -30 9 -38 -48 -49 -6 -54 -23 17 6 6 32 38 35 3 19 -29 58 -2
4508 -2 -79 -8 8 16 4 0 14 19 -19 -27 -42 19 33 -14 2 21 8 -41 5 2 20 -30 -36 -71 19 57 -14 -55 -6 -37 -60 7 64 17
$$ packed form
4276G0l3q8Q6k3K5k0Kk3M4o1j7k3O6Rp2M9n5pL3j9R2kJ4k7k0j8J4K8m0O6l9K3
4308C4k3L6lp1Q6o0N3J0j19R6Jn0j1k6K6K5l6P7J8m5k9L5l5j0QpK6M5n3j7K6K
4340IRp6J02k8n2P1J0l5m9R8p7lJ0lL9k3j0m0L3j6k7O9pn6l7Q0q3R5k0k4M4n2
4372d9O0j6K8l1Rk2OjK9J9J2j5Ml5oK6Km4qJ5omJ8m5J1K4J4J2jlm4J1K4qL2l%
4409A5OlJ1j9M1m7L4l5Jj0n0N3M0j8J6k9L1j21P1j8MoM1n0N5J8m6M3M2m3n3M8
4441B2jk0J0OJ0l0l8L4O2k1n9l3P4K1o5k6O0j6J0J4pn6O3On1L7mpj9P2o5j5M5
4474A3M2m5m2K6K7o0O2j1qo8K2J0K4kj9jL9m7j0jM3m8L1M0j1%K6Oll2J6m8Q7o0
4508bp7P1J6Qj2mJ4Nl8qj5O1J4m7J6J9j3m9M6lJ8n0ol5R0L8p1m1M9l1k3O7N7m7
$$ plain form
4542 17 -33 -17 34 -18 -3 -24 21 -1 -37 -1 24 -11 4 -15 -53 -44 -28 9 -15 45 28 -31 -51 -45 -19 7 14 33 15 -40 34 -6
4574 -6 -23 20 35 -10 -50 -8 30 -31 77 -56 -73 -32 5 -8 -37 -30 -8 -33 -15 -21 -52 28 7 -16 -19 12 -32 -57 61 51 -18
4605 -18 -17 15 -44 -33 19 37 66 25 -15 -32 -37 -42 -23 14 47 2 -42 -57 9 -4 -41 -35 -10 -2 -21 -17 17 69 -29 -6 16 -21 -42
4638 -42 35 26 -39 -19 -20 -10 -26 66 8 -30 87 61 -2 -9 39 -4 -23 19 -13 -53 23 16 -35 -39 -1 -3 6 -17 -64 45 1 -37 -68
4671 -68 43 -21 -14 -17 -30 -27 10 -26 -39 -27 34 36 -25 -12 -8 -47 -79 15 44 -34 21 -33 22 -76 -26 -20 -36 15 -21 -56 29 64 23
4704 23 -3 34 27 -4 43 26 14 11 78 53 17 37 -54 3 9 -17 -50 37 25 27 27 -14 -10 -25 17 9 34 69 60 -8 -28 45 31 -2
4738 -2 65 15 70 26 28 40 11 4 23 1 6 -4 13 -37 22 -7 -35 -28 -56 52 1 -6 21 9 -40 31 47 -10 -45 -40 19 28 -17 -3
4772 -3 17 11 39 30 32 42 -56 1 -1 26 -6 8 17 -21 -15 38 -7 -5 19 -43 2 18 3 -21 -43 18 21 -48 -56 -5 -18 8 -4 13 5 10
$$ packed form
4542A7n0J6N1n2J5k1M5k2l6L6K5l5J5j9l8RJ6L7k4O0j7n9k0OK6K6PJ9j8n5P4m0
4574fj7M3J5m5m0M2L8o1J08j33j7M1L7j3k9PK2k5J8ol1Q0k1k3lL1m4k5J18j0o9
4605a8JL2n9J1N2J8K9m1m0j7nnJ9L7L3m5m4j5O6j3l7OK5Qj9ML4N2r8K3K2l7k1
4638d2P7ro5K0jJ0j6R2n8l8J17k6o3pM8m3j9M2l2m0P6pn1mL8kRk3m7J09m4l8l1
4671f8J11o4Plj3LL7l6j3J2O1Ko1J3Ml9l2R4K9p8N5n4N5r8N0Oj6N1l6l5Q5L5m1
4704B3k6L7pl1M7j7j2lO7k5l6K0r1N7Ok6l3Q7j2K%m1Mj5M2qK5L5ro8k0P3j4l3
4738bO7n0N5m4KJ2k9pJ9k2Nj0J7n0N9k9k8Pk8J08n1pK7j2m9P1J6n7l5NN9Rm5J4
4772cK0oK8rKJ0r8N7kK7l2J4Rl8ON3m5KK4o2M5J6j5k4k2O1Lo9qN1j3K6j2J7qN
$$ plain form
4808 10 18 -60 12 33 -26 -26 -41 -12 39 9 29 -30 -34 0 -12 -41 41 -48 21 50 12 -4 5 33 -7 -35 37 -52 13 4 52 16 -18
4841 -18 27 6 0 27 1 -23 10 7 3 -59 39 -13 -18 4 -3 -2 12 -44 -25 0 5 -49 16 -4 -5 27 -35 -19 -69 -24 51 14 -29 -16
4875 -16 2 14 18 -34 -19 52 -6 -38 -50 -15 -38 31 -62 58 19 -11 4 30 9 -58 -29 -22 15 -27 18 -10 -23 44 -14 -30 80
4906 80 31 22 -26 5 65 -5 98 14 -26 31 -36 1 -12 23 47 -33 3 15 23 4 -30 20 19 -34 31 18 -18 1 10 -3 -15 53
4938 53 -9 6 -36 -26 -51 -62 15 -50 12 -38 -63 10 64 6 19 22 -7 33 -44 39 16 16 -13 35 45 6 -15 45 32 47 -16
4969 -16 23 60 -17 33 27 -22 34 58 -31 -66 4 14 -7 58 13 38 -37 -1 -26 -46 13 12 -20 -7 -13 42 13 39 -25 21 23 -9
5001 -9 16 -10 33 9 8 54 -18 -51 -53 -39 -91 24 18 -27 39 15 -54 -15 6 -14 31 -45 3 -17 -41 4 36 -45 14 -53 43 63
5033 63 16 -40 21 30 -49 56 16 35 -21 -3 33 -47 3 21 -60 -31 9 -35 7 -20 14 22 20 12 10 3 43 -40 4 80 -38 -105
$$ packed form
4808A0Qp8P2K1n9%j5K9N1l0K0n9mL4j2k9Q2q9O9K9l8j6RK8m0k8P2q9O5rM8l6l4
4841a8M5k1oK7k6k4L3lmo2R8n2nK2pJJ4n6J9K5Nn4O5k0jL2o2J6n0M5P5l7m3J3
4875a6J8J2Mn2J5P1n8l2j2L5k3O9r3J20l9l0J5K6k1o7K9PL7m2M5k8j3O7n8j6J10
4906H0m9rm8L1O0p0J03q4m0N7o7L7j3L5K4q0L6J2Qj9l4N0jn3O5j3l6J9Rj3j2O8
4938E3o2J5m2J0k5j1P7o5O2n0k5P3N4n8J3Lk9M0p7Q3k3%k9M8J0l9k1O0j3J5o3
4969a6L9L7p7N0om9N6K4q9l5P0J0k1O5m5K5p5L6k5k0N9jl2J3oN5k9K6o4M6Kl2
5001iK5k6M3k4jM6p2l3kJ4n2J15om5O6k4o9L9K1k0M5p6M8k0k4M5L2q1N9o7R6K0
5033F3m7n6O1Rp9J05m0J9n6J8L6q0N0J8q1K9M0m4M2k7L4QkqkpM0q3M4P6j18o7
$$ plain form
5065 -105 28 -19 8 18 41 -5 -26 22 -15 1 32 -13 -18 -39 -28 -34 12 23 8 -5 -46 -6 8 31 39 -9 -20 -32 -77 17 -39
5096 -39 2 -17 33 -4 29 1 -13 31 -12 -19 -9 -9 63 -11 -24 30 8 -11 -6 18 -33 39 -24 -12 20 58 -38 -42 -43 47 -15 -22 1
5129 1 -21 -11 57 47 9 -47 38 -9 31 3 -37 10 43 -11 37 -28 -15 -36 -17 8 11 -9 33 -30 -14 21 -29 6 17 12 -14 -7
5161 -7 23 -35 -7 44 -35 -59 35 21 3 -9 -21 -77 -20 73 -54 -29 34 -38 -8 -29 8 -11 -17 25 -5 -30 -7 -16 -17 8 -5 -8
5193 -8 -3 -45 7 -20 30 42 -69 43 -23 -29 29 -37 -80 -24 9 -44 18 41 12 2 28 23 -31 8 -23 39 14 7 1 -65 3 -51
5225 -51 -34 60 -35 -47 -18 32 -32 -60 25 -17 -41 -28 3 2 33 3 12 -2 -59 -10 -24 12 23 1 -3 29 -33 36 56 -53 -49 4
5257 4 -5 -37 22 55 -35 -15 -29 -73 -66 -19 -48 -34 -24 53 1 29 -16 44 -21 5 28 -9 -23 40 -11 20 30 -33 -9 25 -60 19
5289 19 23 24 -40 -12 5 -37 -21 -24 33 30 -7 -29 28 -1 -49 30 -13 32 20 8 38 -32 10 -28 31 36 -13 -59 -7 45 4 -8 -21
$$ packed form
5065a05J33m7K7J0K3m6k1M8l7J6L1m5nk1J1oM6J1j5j3m1M0J4K3Qm8j1j2m5R4n6
5096c9M1j9N0l7L3k8j4M4m3pJ0%P2p4j3N4k2j9NK4n1P2o3J2L2L8r6mjR0o2pK3
5129Ak2J0O8j0l8n6Q5m7M0k8m0M7L3n4M8o5J3k1J9K5Lk0M2o3J6L5n0L5J1nk6P
5161gL0n8K8N1p9k4R4j4j8j2j2n6N7R3j27K5O3p2L0k1L7j9oM2l0k5K3rjK5j3l
5193hNm2N2k7N0J2j11J12o6oN8o6m3N6L3n3O2K3k9j0K6nn4L9l1O2k5poo6O8n4
5225e1J7R4r5j2K9N0o4k8Q5m2k4J3L1jL1l0Rj4n7M9j4L6J1k2mL2o2O9K0j09MN3
5257Drl2N9L3r0K0j4m4PM7k9J4J0P7n2K8m5O0o5K6K3l7j4O3n1L1J0o3K4L4q5P9
5289A9MJo4K8J7m2J6lN7ll7k2N7k9m8P9m3M5j2j2L0p0M2l8N9Nm9m6N2N2m1j2j3
$$ plain form
5322 -21 -17 10 4 3 -5 9 -49 -2 -33 -2 -49 -11 13 -14 15 -41 -51 24 -20 -50 3 13 41 -24 -11 25 19 40 -26 -22 -5 46 10
5355 10 -8 4 -21 -27 3 -32 -13 -34 -35 -39 -9 -53 -42 -13 7 29 -54 -6 -36 -40 -9 37 -30 30 1 -27 -4 -42 15 -4 -11 6 -65
5388 -65 -25 6 1 -2 16 22 -23 2 72 -5 -12 -20 39 -15 -28 -21 0 19 42 36 -31 2 -40 25 -24 -5 -47 57 -64 42 5 -14
5420 -14 -8 -5 -8 3 29 -16 12 14 4 -5 -29 -52 -49 16 22 -36 5 31 -7 -24 -29 -6 23 -33 -15 -6 -38 -19 45 -65 -3 -45 -16 23
5454 23 -5 94 -15 -20 -26 -12 21 33 22 -40 -26 46 21 -34 0 10 -10 -4 27 -40 -18 29 3 13 -12 -29 -24 39 -41 24 36 31
5486 31 -20 -35 -19 -13 12 22 55 3 -11 10 11 -30 -19 -3 6 -45 22 -37 22 -3 18 28 -3 -42 12 26 -73 -24 -8 8 -23 74
5518 74 -21 -53 9 -43 -49 71 50 -41 19 -74 16 -22 -16 -20 -3 33 -33 -39 -41 18 -16 -32 -38 7 24 -10 -22 -8 -18 -42 -36 -3 44
5551 44 24 -26 -6 -2 -11 -30 -5 4 -45 -52 45 10 27 9 -19 13 33 -5 -10 11 -28 37 -18 -9 -12 -33 -30 16 -14 45 41 -53 36 61 -13
$$ packed form
5322b1MK7ojqJ4n8M7l1L1m7L8K4k7K9n6j0P5m4l0N3J0K8o5J3L6oK1o6MJ7N1l6
5355A0j8J2k5oL0l5J9k1jmL0m4J1K9K0K2q3M8l0mL1M6o7O0k9k8K3l8N7j9pJ7p1
5388f5M0L1nlJ8Om5K5P0p7pqN9n4j3PK1J9K3oo7L3m2O5m9J9m2J04j21J06l7j9
5420a4OLlJ1K6m5K8Kj0rk4k3LO5On8M1K6l8j7nK3K9n6J8Rl2J9O4j10O2m2K9L9
5454B3k8R9j09noJ4L3J2j1o2J4P2k5n5L4J0k0OL1o7K2M7k6J0k5j7NO3q0O5J2n
5486C1n1j5J6OK5J0L3n2j4K1Jm1J1J6Rn1O7n9N9k5K1J0l1l9N4J4r9M9J6J6l1R7
5518G4r5l2O2n2oJ20k1r1O0r3R0l8OmJ7L6o6okN9l4j6oM5J7l4j2J4j0k4OL3M7
5551D4k0n0K0Mrj9K5Rm9pR7l5J7j8k8L2K0l8nK1l9O5n5Rlk1LM6l0N9mr4Q9K5p4
$$ plain form
5586 -13 -14 -46 8 60 -17 11 -49 42 19 -77 -17 -19 7 37 -10 8 -9 3 9 -37 4 43 47 -37 -39 -16 29 -39 -15 -15 -23 57 -54
5619 -54 41 -83 44 6 -27 -37 -2 -15 -30 1 26 20 -1 -24 13 45 -24 -2 -3 -19 -72 106 -31 -72 -3 26 -12 -28 -23 10
5649 10 -24 -27 -22 7 -44 6 -29 -29 11 -30 -17 26 -82 17 37 20 29 31 13 -4 -27 15 -59 -42 7 29 13 -43 7 11 49 -10 -9
5682 -9 2 28 -31 -8 -15 42 -43 6 24 -13 33 -3 39 -15 41 -8 5 40 -42 -50 -50 15 -2 -25 56 -11 1 -2 -18 -32 -38 42 15
5715 15 -27 -33 -41 -4 7 -12 -30 -8 18 -35 -30 17 14 1 3 -35 -27 0 13 9 48 -18 27 -42 16 37 -8 26 -12 -19 -52 -30 -5 -43
5749 -43 64 -25 -20 23 -16 -22 -40 51 9 37 -18 21 -20 4 -6 36 -46 45 -55 4 21 -44 -29 31 17 -18 34 -15 19 -14
5779 -14 16 8 -30 10 43 43 8 18 11 -2 20 -1 -12 -31 29 -52 -37 -23 8 -33 18 -31 -23 24 46 25 9 -18 -35 -19 -6 19
5811 19 -26 6 -59 -16 -21 7 -35 -18 -14 -33 -26 7 4 59 44 -42 -37 29 29 3 32 -26 -27 60 12 -41 -41 -21 -35 -3 -29 0 -27 42
$$ packed form
5586a3jl2N4N2p7K8o0R1k3r6O0kK6L0m7J8j7J2Om6M1L9Mq4kK3M5o8K4%qQ0j11
5619e4R5j24J27l8l3j0L5j3j5L1K5ok1k3L7L2o9K2jj6n3J78j37m1O9K9l8j6NL3
5649A0l4lNK9n1N0l5%M0m1J3M3j08R9K0j7RKj8j7k3M2p4J7M9K2j6n6N0ML8n9J
5682iJ1K6n9K3pN7q5M9J8l7M6l6M2n4N6m9J3L5q2q%O5j7k3Q1o7J2lj6j4oQ0k7
5715A5m2oqL7J1j9j8K2K6n3NM7lj3Kl8QK7J3mL9o6M5o9N8K1m5L4l8pl3K2K5l8
5749d3J07q9NM3l9oj8R1m2K8n5L9m1K4j0M2q2R1j00N9J7o5J5O0j4l5N2m9L4l3
5779a4L0ql8M0L3%l5J0pj3K2k1j1j9O0q1J5J4L1m1N1m9QM7K2k1j6k7j7J6J3K5
5811A9m5L2o5M3nK8m2J7Mj9PL3lN5j5q6NO6%k6K9n8jQ7m8n3%K0j4L2k6K9k7O9
$$ plain form
5845 42 31 -12 23 12 -27 -41 -60 -29 15 -42 -11 -9 12 -53 -15 -36 29 0 18 -27 -47 -5 25 -26 30 -22 -47 27 -3 -9 -21
5876 -21 -80 0 26 -7 7 26 11 19 -28 40 6 46 49 -44 -31 -5 -2 -41 -9 -15 24 0 14 -22 -12 -15 -17 -38 0 -34 -70 24 9
5909 9 -22 -17 -28 -31 -46 -3 8 -18 -87 -8 53 10 -36 46 15 29 -33 27 18 -7 31 1 47 -25 7 53 15 -8 -4 -46 -42 11 20 -9
5943 -9 -31 -3 -4 -3 -10 -15 -28 -6 -15 -14 -16 7 14 3 -7 -37 -20 69 8 -24 20 9 -19 25 -17 2 -38 -11 17 11 32 -16 -3 19 -7
5978 -7 -11 -38 17 18 -15 13 9 41 -4 23 -34 -19 26 49 -28 15 24 15 -8 -39 -21 6 -45 1 -3 36 -6 -24 0 -1 -9 -19 16 -15 19
6013 19 42 8 -6 -49 -13 -29 -17 20 -38 5 11 -18 -22 27 -12 -36 18 55 -10 5 -50 -45 -19 26 46 -8 -38 -29 -17 17 4 14
6045 14 -25 -36 -21 -9 -33 7 16 -56 -45 10 5 19 33 4 10 -4 11 -92 11 32 -38 -19 5 5 -3 22 45 -20 -13 49 -40 19
6077 19 -36 18 12 28 -26 4 -43 5 -33 4 85 4 13 8 -7 -6 61 -46 24 -30 -40 -2 -63 19 11 0 -16 31 26 -9 54 -10 -39
$$ packed form
5845D2j1m3L5j1l9j4j9L1M4n7L1KK1o5L8k1O5k9J8m5k0M2L0n1N6n2k5P4l0oj2
5876b1n9Q0K6l3J4J9j5Qm7O8l4M0Lr3J3K6Ll9L2oL9k4J4l6J0lkk1L8l4l6R4j5
5909Il1Nj1lj5M3J1k6o9P9O1m3m6Q2l1J4o2O0rk5L8l0M6p2L2M6l8k3Mm2MN3Rk9
5943ik2K8jJpnj3K2rJkK3Pj1j0l0J7Q9o1l2M4j1k8M4m2J9m0K7K8oK1m8J3K2k6
5978gmk7N5Jl3K8mL2m5K7n7J5M5K3p7M3Rrk3l1J8K7n1M6mL9m2j8K4jqj0L5l1L4
6013A9K3l4j4m3L6j6J2L7n8M3Ok9mM9l9k4N4L7o5J5n5NK6M5K0n4l0RJ2L4j3J0
6045A4l9j1J5J2k4M0Rp2J1N5nJ4J4k9Oj4J5j03J03K1p0J9K4%qK5K3o5PO2q9N9
6077A9n5N4oJ6n4L0m7M8l8L7Q1q1Rnj5JO7j07P0n4j0L8o1Q2qj1j6M7nl5O3o4k9
$$ plain form
6110 -39 22 -30 -21 -11 -29 -72 19 -11 -15 -37 40 36 12 9 -27 -12 4 61 -4 34 26 -76 -4 57 -19 10 -9 -59 -11 19 32 5
6142 5 -7 63 -31 -25 -39 13 19 -5 21 17 -6 33 19 -3 -63 18 -1 -17 30 -12 -25 47 39 17 53 24 -26 84 29 19 42 -5
6174 -5 -24 40 -12 -16 18 80 20 8 31 20 11 -37 3 -4 38 11 38 -8 13 6 37 18 7 42 -23 -13 -14 27 3 28 41 38 46 23
6208 23 36 -6 13 -52 -13 24 57 -19 47 -8 11 17 -7 10 -15 39 9 11 1 -32 -21 56 -38 7 -22 22 6 34 13 59 -21
6239 -21 36 -47 -21 65 16 15 -53 15 -1 16 -1 41 -1 22 -22 -18 -46 16 -9 -8 -15 -20 -19 -17 -39 22 38 -1 12 -14 -62 7 38 -6
6273 -6 12 -41 27 27 0 -8 41 21 -33 -6 1 2 23 1 11 20 -33 15 54 -8 15 5 52 -19 -25 -2 -32 0 -16 -38 -16 -27 -21 -25 -5
6308 -5 21 -39 -10 -4 42 -24 -34 -2 -28 16 10 -4 -14 52 17 -6 -12 31 42 -6 -27 35 -6 -39 5 -15 17 -34 20 -14 -7 26 -26
6341 -26 18 48 46 -10 -43 7 12 6 -20 66 63 3 -12 12 -10 -59 -8 -35 -1 -10 58 -30 -57 31 17 -26 -3 -8 -19 -49 -12 39 -33
$$ packed form
6110c9O1n2RJ0j8m3R1l0mk2P7mk4ll6J5J6N7o5L8qj02P2O1p6K9j9n0M8L0J3k7
6142Ej2P0r4Oj4N2Ok4K6mk3L9j4k2o0Q1j9j6M7m2j3P2qk2L6k9n0J10n5j0K3m7
6174ej9O4n2mL4O2o0j2K3j1rm8M0pM2k7K7m6K1pL1j9j1L5o5J0jM1k4K5J3lQk3
6208B3J3m2J9o5L9L7L3p6O6n5J9Ok4J7k5N4l0Kj0l3J1P7r4M5k9M4j6K8k1M6q0
6239b1N7q3K6Q6m9jo8O8j6J7j7M2m2K3m4Mk8O2k5JpnJKk2O1J6l9J3k6m8O9L1m4
6273fJ8n3O8%k7qM9k0n4K7PJK1k2J0Rn3M8L9o2K3j0M7p1oK3l0L2j6k2K2j1OmK0
6308eK6o0K9OM6o6j0L2k6M4oj4j0O6l5k3oM3J1m8k1O2m1l3M4k0L2n1N4l4PL3n2
6341b6M4L0kn6l3N0Nok6Q6lo0j5K4k2m9N1k7L4rO8q8k7Q8j4m3K3nj1l0L7N1p2
$$ plain form
6374 -33 -6 -87 16 -5 44 -16 4 70 37 -8 -24 31 -18 -12 3 -47 -28 -26 6 -29 31 -6 9 49 -47 -44 -1 -24 -10 -11 -28 -51
6406 -51 42 32 40 10 35 13 -24 -17 -32 -4 -27 -100 -25 12 71 8 10 -41 -36 -2 -46 -4 -19 -41 -48 27 18 18 -28 -19 62 20 -23 35
$$ packed form
6374c3K7q1J03k1M9o0K0O6l3m5j6N5m9OJ5n0J9KL2l5O0l7J5M0r6LM3k3J4jj7k3
6406e1R3j0Ql0K5k2l7Pj5K8k3p3P5L7N9o3Kn1NL4m4M2j5k2pP5r%m6RQ1m2m3N8
$$ [...]
8191b1
##END NTUPLES=NMR FID
##END=
