##TITLE=1H_PhEDiP0606
 CDCl3
 8 sc, 
 7.6.2023
##JCAMPDX= 6.0         $$ Bruker NMR JCAMP-DX V2.0
##DATA TYPE= NMR FID
##DATA CLASS= NTUPLES
##ORIGIN= UXNMR, Bruker Analytische Messtechnik GmbH
##OWNER= root
$$ XWIN-NMR		Version 3.5
$$ Wed Jun  7 15:34:10 2023 Russian Standard Time (UT+4h)  she@DPX200
##.OBSERVE FREQUENCY= 200.13135
##.OBSERVE NUCLEUS= ^1H
##.DELAY= (6, 6)
##.ACQUISITION MODE= SIMULTANEOUS
##.ACQUISITION SCHEME= undefined
##.AVERAGES= 8
##.DIGITISER RES= 18
##SPECTROMETER/DATA SYSTEM= spect
##.PULSE SEQUENCE= zg30
##.SOLVENT NAME= CDCl3
##.SHIFT REFERENCE= (INTERNAL, CDCl3, 0, 15.7039)
##AUDIT TRAIL= $$ (NUMBER, WHEN, WHO, WHERE, WHAT)
$$ ##TITLE= Audit trail, XWIN-NMR		Version 3.5
$$ ##JCAMPDX= 5.01
$$ ##ORIGIN= Bruker BioSpin GmbH
$$ ##OWNER= she
$$ F:/spectra/data/she/nmr/H-F/1/audita.txt
$$ ##AUDIT TRAIL=  $$ (NUMBER, WHEN, WHO, WHERE, WHAT)
(   1,<2023-06-07 15:33:02.81 +0400>,<she>,<DPX200>,
      <created by zg, POWCHK disabled, PULCHK disabled
       configuration hash MD5:
       00 E9 B6 7A A2 85 ED C7 34 08 36 98 17 FE 4E 26
       data hash MD5: 16K
       EC 20 69 DB 53 E5 25 A0 31 58 8F 97 78 FA 6E C7>)
$$ ##END=
$$ 
$$ hash MD5
$$ 67 88 07 19 2B 34 0A 39 3D EB 28 6E 98 83 5A 1A
##$RELAX= 
##$RELAX= 
##$RELAX= 
##$RELAX= 
##$RELAX= 
##$RELAX= 
$$ Bruker specific parameters
$$ --------------------------
##$DU= <F:/spectra>
##$EXPNO= 1
##$NAME= <H-F>
##$PROCNO= 1
##$TYPE= <nmr>
##$USER= <she>
##$AMP= (0..31)
100 100 100 100 100 100 100 100 100 100 100 100 100 100 100 100 100 100 
100 100 100 100 100 100 100 100 100 100 100 100 100 100 
##$AQSEQ= 0
##$AQ_mod= 1
##$AUNM= <au_zg>
##$AUTOPOS= <>
##$BF1= 200.13
##$BF2= 200.13
##$BF3= 200.13
##$BF4= 200.13
##$BF5= 200.13
##$BF6= 200.13
##$BF7= 200.13
##$BF8= 200.13
##$BYTORDA= 1
##$CFDGTYP= 0
##$CFRGTYP= 5
##$CHEMSTR= <none>
##$CNST= (0..31)
1 1 145 1 1 1 1 1 1 1 1 1 1 1 1 1 1 1 1 1 1 1 1 1 1 1 1 1 1 1 1 1 
##$CPDPRG= <>
##$CPDPRG1= <>
##$CPDPRG2= <>
##$CPDPRG3= <>
##$CPDPRG4= <mlev>
##$CPDPRG5= <mlev>
##$CPDPRG6= <mlev>
##$CPDPRG7= <mlev>
##$CPDPRG8= <mlev>
##$CPDPRGB= <>
##$CPDPRGT= <>
##$D= (0..31)
0 1.2 0 0 0 0 0 0 0 0.06 0 0.03 0 0 0 0 0.0002 0 0 0 0 0 0 0 0 0 0 0 0 
0 0 0 
##$DATE= 1686137582
##$DBL= (0..7)
120 120 120 120 120 120 120 120 
##$DBP= (0..7)
150 150 150 150 150 150 150 150 
##$DBP07= 0
##$DBPNAM0= <>
##$DBPNAM1= <>
##$DBPNAM2= <>
##$DBPNAM3= <>
##$DBPNAM4= <>
##$DBPNAM5= <>
##$DBPNAM6= <>
##$DBPNAM7= <>
##$DBPOAL= (0..7)
0.5 0.5 0.5 0.5 0.5 0.5 0.5 0.5 
##$DBPOFFS= (0..7)
0 0 0 0 0 0 0 0 
##$DE= 6
##$DECBNUC= <off>
##$DECIM= 32
##$DECNUC= <off>
##$DECSTAT= 4
##$DIGMOD= 1
##$DIGTYP= 9
##$DL= (0..7)
0 120 120 120 120 120 120 120 
##$DP= (0..7)
150 150 150 150 150 150 150 150 
##$DP07= 0
##$DPNAME0= <>
##$DPNAME1= <>
##$DPNAME2= <>
##$DPNAME3= <>
##$DPNAME4= <>
##$DPNAME5= <>
##$DPNAME6= <>
##$DPNAME7= <>
##$DPOAL= (0..7)
0.5 0.5 0.5 0.5 0.5 0.5 0.5 0.5 
##$DPOFFS= (0..7)
0 0 0 0 0 0 0 0 
##$DQDMODE= 0
##$DR= 18
##$DS= 0
##$DSLIST= <SSSSSSSSSSSSSSS>
$$ [...]
##$SUBNAM2= <"">
##$SUBNAM3= <"">
##$SUBNAM4= <"">
##$SUBNAM5= <"">
##$SUBNAM6= <"">
##$SUBNAM7= <"">
##$SUBNAM8= <"">
##$SUBNAM9= <"">
##$SW= 18.05172834244
##$SWIBOX= (0..15)
0 0 2 0 0 0 0 0 0 0 0 0 0 0 0 0 
##$SW_h= 3612.71676300578
##$TD= 16384
##$TD0= 1
##$TE= 0
##$TE2= 300
##$TE3= 300
##$TEG= 300
##$TL= (0..7)
0 120 120 120 120 120 120 120 
##$TP= (0..7)
150 150 150 150 150 150 150 150 
##$TP07= 0
##$TPNAME0= <>
##$TPNAME1= <>
##$TPNAME2= <>
##$TPNAME3= <>
##$TPNAME4= <>
##$TPNAME5= <>
##$TPNAME6= <>
##$TPNAME7= <>
##$TPOAL= (0..7)
0.5 0.5 0.5 0.5 0.5 0.5 0.5 0.5 
##$TPOFFS= (0..7)
0 0 0 0 0 0 0 0 
##$TUNHIN= 0
##$TUNHOUT= 0
##$TUNXOUT= 0
##$USERA1= <user>
##$USERA2= <user>
##$USERA3= <user>
##$USERA4= <user>
##$USERA5= <user>
##$V9= 5
##$VALIST= <valist>
##$VCLIST= <CCCCCCCCCCCCCCC>
##$VD= 0
##$VDLIST= <DDDDDDDDDDDDDDD>
##$VPLIST= <PPPPPPPPPPPPPPP>
##$VTLIST= <TTTTTTTTTTTTTTT>
##$WBST= 1024
##$WBSW= 4
##$XGAIN= (0..3)
0 0 0 0 
##$XL= 0
##$YL= 0
##$YMAX_a= 14166
##$YMIN_a= -17224
##$ZGOPTNS= <>
##$ZL1= 120
##$ZL2= 120
##$ZL3= 120
##$ZL4= 120
##$ABSF1= 10
##$ABSF2= 0
##$ABSG= 5
##$ABSL= 3
##$ALPHA= 0
##$AQORDER= 0
##$ASSFAC= 0
##$ASSFACI= 0
##$ASSFACX= 0
##$ASSWID= 0
##$AUNMP= <proc_1d>
##$AZFE= 0.1
##$AZFW= 0.1
##$BCFW= 1
##$BC_mod= 2
##$BYTORDP= 1
##$COROFFS= 0
##$CY= 11.3945322036743
##$DATMOD= 1
##$DC= 2
##$DFILT= <>
##$DTYPP= 0
##$F1P= 15.7292609196834
##$F2P= 12.9074282941183
##$FCOR= 0.5
##$FTSIZE= 0
##$FT_mod= 4
##$GAMMA= 1
##$GB= 0.15
##$INTBC= 1
##$INTSCL= 1
##$ISEN= 128
##$LB= 0.24
##$LEV0= 0
##$LPBIN= 0
##$MAXI= 10000
##$MC2= 0
##$MEAN= 0
##$ME_mod= 0
##$MI= 1.114404
##$NCOEF= 0
##$NC_proc= 0
##$NLEV= 6
##$NOISF1= 3.799351
##$NOISF2= 2.8
##$NSP= 1
##$NTH_PI= 0
##$NZP= 0
##$OFFSET= 15.70392
##$PC= 1
##$PHC0= -19981.69
##$PHC1= 6.85272
##$PH_mod= 1
##$PKNL= yes
##$PPARMOD= 0
##$PSCAL= 0
##$PSIGN= 0
##$REVERSE= no
##$SF= 200.130013532006
##$SI= 16384
##$SIGF1= 3
##$SIGF2= 2
##$SINO= 400
##$SIOLD= 16384
##$SREGLST= <1H.CDCl3>
##$SSB= 0
##$STSI= 0
##$STSR= 0
##$SW_p= 3612.71676300578
##$SYMM= 0
##$S_DEV= 0
##$TDeff= 0
##$TDoff= 0
##$TI= <>
##$TILT= no
##$TM1= 0
##$TM2= 0
##$TOPLEV= 0
##$USERP1= <user>
##$USERP2= <user>
##$USERP3= <user>
##$USERP4= <user>
##$USERP5= <user>
##$WDW= 1
##$XDIM= 8192
##$YMAX_p= 0
##$YMIN_p= 0
$$ End of Bruker specific parameters
$$ ---------------------------------
##NTUPLES= NMR FID
##VAR_NAME=  TIME,          FID/REAL,        FID/IMAG
##SYMBOL=    X,             R,               I
##VAR_TYPE=  INDEPENDENT,   DEPENDENT,       DEPENDENT
##VAR_FORM=  AFFN,          ASDF,            ASDF
##VAR_DIM=   8192,          8192,            8192
##UNITS=     SECONDS,       ARBITRARY UNITS, ARBITRARY UNITS
##FACTOR=    0.0002768,     1,               1
##FIRST=     0,             0,               0
##LAST=      2.2672688,     0,               0
##MIN=       0,             -17224,          0
##MAX=       2.2672688,     14166,           0
$$ Real data points
##PAGE= N=1
##DATA TABLE= (X++(R..R)), XYDATA
0 0 0 0 0 0 0 0 0 0 0 0 0 0 0 0 0 0 0 0 0 0 0 0 2 -8 8 -8 8 -8 8 -8 16 -16 16 -16 24 -24 24 -32 32 -40 40 -48 53
43 53 -56 64 -72 79 -86 96 -104 114 -126 139 -154 170 -189 209 -232 261 -293 333 -380 440 -520
64 -520 629 -786 1036 -1496 2623 -11262 -9359 7908 -11514 -2814 11825 -4016 -10460 8080
78 8080 1028 -6058 11084 10414 -6893 3727 12389 -1596 -178 13237 3023 -6279 2696 1879
92 1879 -6948 225 4141 -6214 -5849 2464 -4424 -8539 2752 2479 -8940 -3405 3986 -4293 -3096
107 -3096 8000 2367 -3372 5450 2797 -5570 4241 7737 -4405 -686 7839 -2314 -4424 6809
121 6809 2167 -5271 1759 510 -6605 428 3863 -3585 -571 4345 -3404 -5156 2436 1042 -2921
136 -2921 1097 1945 -2016 -1180 671 -865 -216 1898 145 -1584 900 1823 -1264 -898 2746 1199
152 1199 -1582 1395 2565 -662 142 1553 -1227 -273 2180 -1274 -1769 2189 -748 -4078 247 868
168 868 -2807 -707 693 -2092 -526 1021 -1752 -36 2731 -790 -1290 2763 1574 -306 2106 1814
184 1814 -69 1003 325 -945 1313 1264 -1630 -660 739 -1508 -2082 -373 -619 -1296 -1053 -1265 -862 174
202 174 -93 -465 525 1128 213 -274 1088 1990 628 121 1547 1156 -148 650 775 -313 280 -141 -1970
221 -1970 -468 851 -1806 -1651 1152 -628 -2397 145 331 -1249 387 588 -1066 766 1593 -922
237 -922 179 2530 206 -1030 1300 1039 -620 241 609 -276 70 8 -921 -277 514 -561 -1166 6
255 6 437 -768 -970 478 614 -662 -302 672 71 -116 444 -135 -42 971 -161 -1006 967 946 -1208
274 -1208 -252 1262 -319 -820 497 33 -361 473 -216 -640 833 486 -1073 6 1100 -308 -827
291 -827 369 426 -335 -267 -9 0 71 -151 -493 -65 442 -187 -746 205 760 -349 -598 614 539 -369 -15
312 -15 436 132 212 146 -295 302 643 -497 -533 685 246 -798 -170 401 -190 -412 -237 -177 53 -77 -511
333 -511 -106 524 9 -486 139 545 34 -323 104 536 276 -159 80 540 357 -220 -214 227 193 -364 -471
354 -471 79 274 -250 -489 1 256 -268 -654 -152 276 -107 -426 107 527 242 -74 71 382 343 -134 -270
375 -270 311 529 -112 -219 434 432 -283 -438 -33 27 -311 -502 -220 154 58 -313 -194 311 230 -469 -403 369
397 369 294 -328 27 668 372 -31 76 128 195 119 -394 -242 477 42 -623 108 584 -214 -475 -25 -33 -173
419 -173 -192 -213 175 394 -150 -279 343 312 -202 -201 114 217 -80 -356 108 547 -45 -358 174 163 -278 -168
441 -168 -44 77 379 -25 -414 365 539 -435 -247 621 125 -460 -69 104 -25 60 -136 -218 179 -20 -648
462 -648 -323 416 128 -499 -142 464 6 -469 229 640 98 48 218 -115 206 559 -260 -90 918 -151
482 -151 -1171 295 615 -747 -203 493 -644 -635 166 -545 -269 942 -127 -953 531 564 -725 204 1167
501 1167 43 -298 318 -3 25 741 305 -268 237 27 -936 -459 675 163 -740 -186 112 -723 -562 400
521 400 154 -142 246 -352 -650 652 652 -431 575 1181 -593 -624 934 313 -344 601 97 -701 242 104
541 104 -727 422 633 -1102 -836 384 -322 -537 524 275 -332 -72 -304 -346 575 530 -220 141 449 -186
561 -186 -282 397 607 235 -112 -150 -12 -6 -70 6 166 149 -324 -652 -50 390 -157 -277 243 -128 -571 -180 -19
584 -19 127 577 24 -466 337 163 -788 143 953 -28 -56 536 -244 -252 482 -264 -266 996 139 -959 374
605 374 492 -946 -237 653 -389 -316 400 -483 -488 557 -227 -822 515 494 -773 -86 865 -36 -379 445
625 445 237 -267 327 423 -174 309 679 -480 -566 725 141 -946 275 734 -839 -572 543 -483 -651
644 -651 592 -286 -925 720 349 -1143 446 1154 -935 -526 1192 -11 -473 1102 433 -646 499
661 499 249 -940 416 1147 -557 -487 735 -391 -1198 177 474 -440 -58 217 -642 -461 305 -225 -399
680 -399 729 410 -830 -11 941 -186 -374 880 319 -606 328 397 -438 447 700 -750 -277 797 -542
699 -542 -871 798 245 -981 47 300 -709 -55 455 -493 -117 599 -433 -554 699 294 -545 228
717 228 573 -159 -68 350 50 -19 160 -135 -162 319 210 -296 -24 317 -229 -557 56 243 -240 -145 124 -127
739 -127 -106 57 -212 -18 399 -140 -405 320 286 -334 80 412 -28 2 115 -174 127 295 -306 -134 480
760 480 -55 -429 189 167 -262 -47 -34 -219 110 12 -397 76 382 -273 -285 336 107 -244 52 152 1 114
782 114 40 -122 159 256 -192 -179 313 168 -327 -90 296 -43 -280 63 51 -152 52 -46 -276 171 224 -447
804 -447 -126 534 -126 -467 345 277 -330 81 259 -226 83 279 -336 -79 518 -179 -463 415 270 -484 -57
825 -57 333 -190 -201 185 -101 -113 251 -44 -287 255 272 -379 -151 419 -18 -365 176 251 -197 -27 166 -169
847 -169 -29 209 -264 -272 382 31 -506 157 421 -319 -225 344 -26 -196 198 -10 -146 324 90 -356 205
868 205 410 -319 -245 369 39 -339 65 144 -128 -4 10 -210 9 145 -261 -225 271 89 -342 2 324 -39
890 -39 -147 171 99 -43 92 18 -46 223 139 -249 12 311 -123 -291 167 141 -216 -100 37 -80 -6 1 -175
913 -175 -4 170 -167 -238 207 187 -173 -39 219 57 -75 46 90 103 75 -69 -63 151 80 -174 -12 197 -42
936 -42 -257 -46 87 -54 -110 -45 -9 3 -83 -137 50 182 -32 -146 84 156 -45 -42 156 169 13 -61 17 108 85
961 85 -42 -56 100 61 -174 -167 84 78 -164 -138 38 -14 -147 -106 20 78 24 -98 -52 141 74 -122 50 252 77
986 77 -117 30 155 61 -10 29 80 63 -69 -157 -16 134 -22 -186 -11 105 -182 -239 75 114 -66 -56 -11 -64
1010 -64 27 52 -66 136 271 -128 -224 197 168 -149 90 240 -100 -157 17 -90 18 230 -82 -246 103 8
1032 8 -339 33 366 -62 -261 48 -12 -144 124 179 -32 84 65 -291 -90 397 84 -233 178 148 -382 -134
1054 -134 337 27 -82 164 -171 -332 181 86 -270 238 326 -461 -299 355 17 -239 329 154 -354 5 105
1075 105 -226 176 452 -253 -301 305 -35 -396 276 421 -243 -179 156 -166 -130 325 48 -241 186 49 -496
1096 -496 26 499 -138 -291 305 -3 -467 104 293 -181 82 249 -348 -201 406 -70 -286 437 234 -509
1116 -509 -56 349 -192 -111 351 -31 -241 178 -26 -296 237 292 -319 -126 340 -123 -326 236 229 -217 -51
1137 -51 142 -155 -57 245 -50 -156 244 20 -398 72 374 -174 -166 325 -16 -338 108 143 -147 143 182 -262
1159 -262 -39 287 -141 -213 322 120 -335 -38 222 -84 -57 178 -5 -139 28 -63 -147 147 201 -174 -153 168
1181 168 -32 -271 103 288 -105 -135 98 -74 -132 172 71 -109 192 110 -328 -42 321 -96 -214 264 109
1202 109 -256 7 136 -119 9 117 -155 -97 193 -42 -217 165 211 -232 -130 243 6 -199 108 149 -136
1223 -136 20 127 -127 -19 242 -106 -236 242 110 -349 21 296 -200 -192 216 -36 -183 173 5 -246 141
1244 141 161 -300 -13 375 -107 -226 237 115 -221 66 200 -104 19 161 -127 -110 219 -24 -267 135 194
1265 194 -288 -165 236 -46 -235 119 74 -192 41 92 -212 34 254 -166 -149 324 45 -282 144 238 -154
1286 -154 -18 207 -68 -59 153 -82 -138 185 32 -253 41 169 -181 -157 125 2 -151 8 39 -82 25 46
1308 46 -86 11 167 -39 -111 144 130 -119 -33 163 -1 -71 65 29 -21 51 -34 -114 57 43 -157 -54 125 -39
1332 -39 -147 8 35 -49 -51 4 23 49 9 -43 53 94 -9 -27 61 78 13 -40 19 69 -14 -105 -12 44 -50 -91 -25 -13 -41
1361 -41 -49 -75 -27 39 -37 -98 54 93 -37 -59 87 96 -17 10 80 68 30 22 0 37 64 -38 -98 54 68 -142 -98 93
1389 93 -26 -154 -29 25 -81 -17 -5 -69 25 75 -86 -41 181 38 -117 74 142 -55 -33 99 26 3 59 -31 -47
1414 -47 71 10 -151 13 98 -92 -132 55 39 -110 -30 36 -47 -5 9 -56 1 101 -31 -104 94 83 -111 -29 138
1439 138 11 -68 44 25 -26 38 -6 -58 58 40 -121 -51 94 -28 -131 19 53 -69 -77 9 -13 0 5 -44 -6 49
1465 49 -20 -63 58 116 -12 -55 50 57 -29 -6 54 38 -34 -60 -65 -10 31 -46 -51 11 -16 -113 -80 39 44 -54 -56 3 5 -46 6
1496 6 74 90 27 -23 -23 53 76 20 20 85 22 -113 -60 74 35 -44 -18 -38 -93 -69 -22 -5 63 19 -124 -90 41 -1 -56 82
1526 82 105 -73 -100 18 42 46 84 14 -58 6 -32 -100 76 155 -47 -120 24 -19 -94 49 100 -13 -39 -33 -99 -16 112
1553 112 3 -53 70 -11 -175 -28 144 20 -41 24 -22 -93 6 26 7 82 48 -136 -76 109 23 -68 97 87 -114
1578 -114 -70 41 -10 22 67 -40 -61 28 -38 -107 68 122 -75 -94 46 -12 -67 43 60 2 8 -12 -60 32 106 -26 -35
1605 -35 86 15 -115 -26 83 0 -46 8 -15 -56 -28 -23 -26 48 27 -90 -49 65 -17 -53 66 77 -32 -40 17 6 20 41
1633 41 18 17 33 -24 -57 34 77 -4 -42 7 -1 -70 -40 39 38 -14 -41 -50 -47 -5 -7 -10 40 44 -74 -62 59 59 -13 10 70 -15 -60 7
1667 7 43 51 45 -17 -43 6 8 -53 18 90 -13 -110 -23 26 -15 -14 34 14 -40 -27 -36 -15 75 33 -69 -14 49 -60 -56 89 67 -33
1699 -33 -5 3 -31 30 49 -11 11 58 -59 -82 53 72 -42 -12 48 -28 -59 4 15 5 28 -28 -62 9 31 -61 -21 82 1
1728 1 -77 9 57 -13 -7 42 13 -7 6 -22 -8 54 5 -65 -4 43 -41 -55 30 12 -40 -34 -1 -4 -3 -14 -24 8 30 -24 -20 46 57
1761 57 5 -4 54 38 -17 -12 50 32 -13 -19 -1 -14 -2 -27 -40 3 3 -69 -59 33 -11 -71 -13 37 -22 -35 14 26 17 38 6 -9 55
1794 55 39 -39 16 88 11 -58 27 49 -48 -37 11 -25 -22 -2 -58 -69 27 -24 -103 25 73 -69 -50 71 5 -68 30 39 -32 38
1824 38 44 -52 12 72 -55 -65 86 27 -104 16 72 -53 -45 28 -22 -31 38 -8 -57 56 44 -98 -1 91 -38 -72 75
1851 75 47 -78 8 42 -46 6 64 -48 -32 99 -9 -102 67 74 -84 -15 86 -28 -56 51 1 -58 33 16 -71 22
1877 22 76 -71 -55 88 -5 -100 32 62 -29 -5 42 -7 0 59 -14 -32 88 47 -77 11 86 -46 -67 53 21 -50 -3
1904 -3 15 -56 -16 1 -69 -35 55 -34 -78 43 50 -54 -17 70 7 -11 35 28 7 44 28 -39 29 49 -27 -22 73 23 -74 -15 27
1935 27 -20 -48 8 -15 -20 -14 -28 -51 27 32 -50 -20 56 -4 -59 45 59 -33 -14 25 -16 -9 27 -8 -14 39 -2 -58 12 55 -34 -44
1967 -44 42 6 -64 -5 23 -19 7 23 -34 -35 43 -6 -47 46 45 -65 -39 52 -10 -44 36 24 -38 0 -6 -50 26 70 -44 -25 58
1998 58 -13 -77 36 77 -32 -28 22 -32 -22 42 -3 -20 43 2 -87 1 77 -34 -27 66 15 -65 -5 47 -15 21 37 -58 -32 48
2028 48 -26 -50 77 34 -93 -32 39 -43 -33 45 6 -54 15 -8 -63 44 61 -34 -14 65 -14 -57 74 70 -26 11 20 -43 -11
2057 -11 50 -15 -13 66 -24 -88 9 55 -56 -29 51 -31 -70 7 -3 -24 48 27 -45 1 36 -50 -19 85 28 -61 3 11 -40 -2
2087 -2 56 -4 2 25 -43 -43 60 36 -34 15 39 -50 -50 46 24 -4 32 8 -56 9 22 -46 23 76 -35 -73 16 13 -41 10 52 -28
2119 -28 -38 -3 -33 0 60 12 -38 23 13 -54 4 81 17 -39 10 -1 -34 20 38 -3 27 16 -60 -36 59 15 -28 45 21 -66
2149 -66 -24 34 10 13 34 -27 -52 25 0 -38 36 50 -43 -55 23 -2 -30 35 30 -36 -11 -6 -44 9 65 -9 -41 36 11 -60 23 74
2181 74 -9 -34 18 -21 -29 38 20 -25 28 19 -64 -32 55 -1 -44 30 9 -66 -15 30 -25 -5 28 -39 -29 40 -4 -51 28 51 -57
2212 -57 -23 36 2 -16 42 30 -23 6 6 -40 25 54 -36 -39 42 -5 -67 15 44 -39 -26 28 -24 -17 41 -5 -40 43 16 -71 -9 50
2244 50 -30 -46 31 5 -50 8 26 -34 -8 30 -49 -12 52 -15 -53 33 38 -47 2 50 -8 -18 36 4 -15 34 2 -51 20 34 -52
2275 -52 -30 48 -7 -66 13 18 -40 -13 11 -22 -13 29 -14 -26 49 7 -48 20 46 -30 -17 40 -3 -30 12 2 -25 6 9 -40 -4 28
2307 28 -29 -37 30 18 -21 -8 23 -10 -11 22 -15 -1 26 -5 -34 28 24 -37 -6 32 -16 -32 -1 6 -25 -4 -2 -12 5 0 -29 -13 13
2340 13 -2 -26 15 23 0 -7 19 19 10 -9 0 12 12 1 -13 -1 15 -18 -30 7 15 -11 -9 5 -3 -24 -12 1 1 -8 -15 -18 9 -3 -25 -21 20
2377 20 10 -24 -7 21 2 -21 -3 15 -4 12 6 -4 9 22 -10 -21 25 9 -16 -6 25 -8 -29 6 4 -11 0 -6 -11 6 7 -29 -13
2410 -13 17 -16 -25 19 17 -28 -3 15 -19 -8 14 -8 -5 16 -5 -29 13 21 -28 -15 22 -5 -20 8 9 -19 5 0 -17 15 18 -16 -5 29
2444 29 3 -30 -3 12 -21 0 11 -11 -24 1 -10 -12 17 2 -25 9 24 -24 -16 24 20 -18 -1 18 0 16 6 -7 11 18 -7 -19
2476 -19 16 12 -10 7 8 -16 -8 2 6 13 18 -7 -12 6 2 -11 13 23 -18 -15 0 -4 -12 1 3 6 -2 -20 -17 20 20 8 -12 15 -16 -13 4 14 9
2515 9 5 -8 -21 6 15 -2 -3 29 6 -21 -6 -5 -2 8 9 -13 -5 -12 -26 9 19 -12 -30 -3 2 -37 -8 25 -4 -3 -5 -27 -19 15 4 -17 16
2552 16 12 -27 -13 19 7 1 24 -1 -33 8 14 -8 18 20 -22 -24 15 -12 -36 11 22 -37 -28 2 -24 4 15 -10 -18 10 -24 -34 9 32
2586 32 -6 -16 11 -17 -35 5 11 -11 6 7 -34 -6 37 -19 -14 35 -1 -35 3 25 -13 6 27 -10 -22 21 -5 -10 25 15 -29 -20 13
2619 13 -8 -30 35 5 -26 -6 -2 -33 1 25 -10 -20 12 -12 -38 18 29 -16 -5 9 -9 -14 21 21 1 25 8 -28 2 37 -9 -11
2651 -11 31 2 -31 7 24 -9 6 26 -19 -27 -10 -10 -26 22 8 -35 -18 2 -20 -18 24 20 -14 -12 -10 -27 2 20 -3 3 30 -17 -16 20
2685 20 31 -14 -4 6 -6 -19 13 12 2 14 -4 -29 -3 27 -16 -9 26 -12 -31 2 13 -14 4 12 -6 -1 -4 -11 -7 33 -1 -25 4 19
2719 19 -13 -19 9 9 -9 -1 -7 -8 12 13 -3 6 12 -7 -11 12 11 -11 -3 16 10 -1 4 13 3 15 6 -3 9 11 -7 -1 8 -6 -24 -6 7 9 0 -12 -14
2760 -14 -3 -13 -11 4 19 -1 -18 8 14 -1 7 18 12 12 -6 -2 1 16 8 -7 9 1 -7 -8 1 -9 -11 -5 -2 0 -13 -13 -8 3 4 -9 -2 -3 -7 -9 -3 15
2802 15 16 3 6 -5 18 6 -11 19 21 -1 -4 6 1 10 10 2 1 8 1 -14 14 11 -10 -10 18 1 -10 4 8 -19 5 2 -7 -1 -2 -15 -4 13 8 -16
2842 -16 -2 8 -7 -4 -4 -11 0 -8 -10 -11 6 0 -9 8 19 9 -13 14 18 -4 5 10 -10 6 2 -5 2 2 0 -7 6 1 -25 -6 10 -4 -25 0 -8 -11
2882 -11 -11 -11 1 1 0 -17 -7 10 1 -7 1 17 -6 1 7 2 7 19 -8 4 11 -14 -11 8 9 -7 -16 -9 -4 -16 7 0 3 -10 -9 -7 -8 -6 -23 -12 -2 7
2924 7 -10 2 15 6 -5 -14 5 -7 -6 7 5 1 8 7 1 8 8 -3 -2 4 2 -7 7 7 -1 -10 -12 6 -8 -1 -10 3 9 11 -6 1 11 -3 -18 9 5 -19 -4
2967 -4 -3 0 -1 16 -10 -12 3 -8 -9 7 15 -19 -14 6 -5 -14 13 14 -3 -10 7 -15 8 28 -2 -14 13 5 -21 20 22 -5 -12 8 -6 -5 7 -2
3005 -2 -18 10 -2 -29 -14 12 -11 -14 13 6 -22 -6 3 -12 3 14 -14 -18 18 -2 -18 7 19 -15 -8 24 -9 -4 26 1 -17 5 6 -34
3039 -34 2 27 -17 -15 19 -13 -26 -2 8 -25 -10 -2 -22 -24 7 2 -20 10 5 -32 8 21 -12 -10 25 1 -22 8 13 -14 4 17 -31 -11
3073 -11 19 -7 -13 25 0 -26 -11 13 -21 -8 27 4 -14 8 -9 -30 12 16 -15 -2 22 -21 -23 10 18 -18 0 15 -26 -2 19 -7
3105 -7 -11 37 7 -34 6 19 -20 -7 30 2 -12 12 0 -15 18 9 -15 -6 11 -21 -21 24 6 -16 -5 4 -23 -1 12 -6 -18 11 -16
3138 -16 -31 6 12 -18 0 8 -18 -10 14 15 -13 12 0 -14 0 21 -4 5 36 -10 -20 10 19 -5 5 22 -5 -19 2 -2 -7 7 -6 -23
3172 -23 -5 1 -29 -13 27 -4 -18 -6 -7 -8 -4 1 -3 1 14 -17 -16 25 13 -7 18 5 -8 -3 14 7 8 7 1 -14 1 2 -10 -3 8 -8 -23 3
3210 3 -6 -21 -15 3 -5 -12 -3 -19 -13 11 -6 -10 -2 -2 -12 -13 3 1 -15 0 -15 1 11 4 6 10 10 -11 -5 11 0 5 -2 5 -3 1 -2 3 4 4 -11 0 1 -6
3254 -6 -12 10 5 -10 -8 -2 -5 -13 0 3 -2 -7 -9 -10 7 -3 -9 -6 -2 -6 -16 -1 9 -2 -4 -2 0 5 10 -3 12 15 12 -2 -3 -3 -11 2 5 5 -2 -12 -11 -3 -4 -13 -3
3301 -3 -5 2 -16 -4 -8 -6 -14 -6 -8 8 -8 2 -7 4 2 -4 -12 9 3 0 -4 10 12 8 0 -3 9 5 5 -1 8 3 2 7 -3 -9 -8 -7 -7 4 -23 -2 -1 -13 -10 -4 -1
3348 -1 2 -1 -10 11 1 -7 -1 -7 12 -4 -9 -4 -3 -1 9 3 -4 12 -4 2 8 -1 -7 0 -2 6 -9 4 -3 -4 0 -3 -1 -2 -12 -11 -9 -8 -6 -10 -5 -6 -2 -14 -3 5 -15 -14
3396 -14 -5 -11 -2 0 -2 -2 12 3 -3 -7 0 -6 -11 1 -3 -12 -3 -5 1 -2 0 8 -2 4 2 -6 12 5 1 -2 0 4 -1 -4 -8 -3 -21 -11 -8 -3 -1 -26 -4 8 -4 -12 3 7 -1
3445 -1 6 0 -3 14 16 -5 12 9 8 5 13 14 -9 -2 -2 7 -7 -6 -9 -10 9 -5 -14 0 0 -28 -18 8 -5 -5 -7 -14 -12 -10 0 -11 6 9 -13 -5 9 -7 -8
3488 -8 1 8 -4 0 2 -6 1 2 5 -9 3 1 -10 9 5 -5 -3 8 -5 -4 10 -4 -12 8 -3 -9 -12 3 -9 -9 3 -11 -10 3 4 -1 0 3 -2 -12 -2 -15
3530 -15 -5 8 9 -10 4 4 -18 -3 16 -3 5 4 4 0 -2 9 4 2 14 -9 -7 10 1 -1 -6 6 -12 -12 6 -12 -13 12 -12 -24 -11 -4 -14 -3
3568 -3 2 -1 -4 1 5 3 14 7 0 12 12 -1 -1 21 2 -4 10 1 -5 -3 12 4 -6 -5 -12 -13 5 2 -1 1 1 -15 -16 -5 1 -4 -3 -10 -5 6 3 9 2 24 -11 -11 6
3615 6 5 8 13 13 -5 -6 -2 6 3 9 3 -8 10 -2 -20 7 10 -5 -9 5 -12 -5 -2 3 4 2 9 -3 2 7 -11 -13 3 5 -17 -6 0 -6 5 -4 -1 -5 10 1 -1
3660 -1 6 16 3 -6 12 1 -3 24 11 -4 -2 5 -1 5 4 5 -4 1 -10 -13 -11 4 4 3 3 -8 -14 -3 3 -2 -3 -4 -10 -7 5 5 2 10 14 -9 -3 15 0 2 13
3705 13 -9 -1 3 6 1 12 4 1 7 -3 -9 -5 -2 0 -1 -6 -15 -8 -8 1 -13 -6 -8 -9 -14 7 -2 -5 8 3 -3 -12 16 5 6 17 7 -1 1 2 -3 -5 16 5 0 7 0 0
3753 0 -1 8 0 -2 1 -17 -12 7 9 -10 -3 11 -8 -16 -2 -1 1 -9 -12 -13 -5 -10 -8 3 1 12 -7 11 0 -8 5 5 3 -9 0 -1 4 8 -1 -6 10 8 0 2 4 -4
3799 -4 5 -1 -3 -9 -2 1 -9 -2 3 -6 -6 -3 -1 -10 -1 -4 -6 -9 -17 -12 -8 -12 -4 -1 2 4 -1 -2 8 6 -3 -1 13 6 7 4 8 10 1 12 10 13 6 0 -1 1 -4 -10 1 3 -1 -1 -5 -11 -8 -2
3855 -2 5 4 -2 -2 -14 -5 -2 0 -2 8 8 -2 4 2 13 11 10 -6 13 4 2 4 7 1 -10 4 6 7 6 -7 2 -1 -3 -1 -5 -5 -9 -6 -8 -6 -4 -10 -3 -3 7 0 -8 -3 0 -12
3905 -12 2 2 4 -1 4 5 10 1 3 2 11 -4 -4 2 -2 -11 0 3 4 -3 -1 -1 9 3 6 -2 8 6 1 -5 -3 1 -1 0 -3 6 -10 -5 1 -11 -13 -10 -1 -7 -4 7 2 3 5 3 8 8
3957 8 21 8 16 5 -1 7 7 5 0 12 3 -6 -1 2 -4 8 10 -2 -9 4 -2 -12 5 10 -8 0 -6 -5 -3 -3 -8 -11 -12 -4 0 -2 -7 4 0 -2 -2 5 10 11 10 18 9 -6 6
4006 6 5 8 0 14 15 -9 1 7 -1 -16 3 -11 3 14 0 -2 -10 4 -12 -10 -2 -1 -1 7 -3 -4 -1 1 -10 6 3 -5 -12 5 15 -1 6 11 2 7 -2 -1 5 12
4050 12 -6 -8 8 4 -7 3 9 6 0 2 1 -14 -14 0 -17 2 1 -11 -9 1 -4 -3 12 9 -12 0 3 -12 -8 9 10 1 12 0 -10 3 10 12 8 10 -2
4091 -2 -9 -1 13 4 14 18 -4 -9 6 -1 -20 6 -2 -11 6 0 -19 -10 5 -3 -12 -5 -2 -7 1 -2 1 -7 13 3 0 12 13 0 -3 13 6 7 10 15 5 0 7 -2 6 17
4137 17 -3 -6 -1 -14 -11 -4 -2 -11 -4 8 -11 -3 0 -9 -8 4 -6 -17 -11 6 -13 -12 -1 4 -12 8 -11 -12 7 8 -4 -2 7 3 0 11 5 6 3 7 -7 -1 16
4180 16 3 -11 -4 -1 -14 6 7 -11 -17 6 -6 -3 5 -13 -9 -2 -11 -1 -9 2 -4 -9 1 -14 -19 3 6 -3 5 -9 4 -1 5 9 0 3 -3 6 -1 12 -4 10
4222 10 10 6 -1 7 -3 -7 -6 -4 -2 -5 -7 -11 -13 -8 -8 -4 -14 3 -1 -8 1 -3 1 -2 8 -4 5 4 -7 -8 2 2 -3 7 11 4 12 7 7 8 14 2 -3 -6 9 -1 7 -1 -4
4271 -4 -1 -3 -8 -2 -1 -4 0 -4 0 -15 -19 -3 -8 -4 -5 -1 4 6 12 7 6 12 1 -7 12 0 -7 4 10 -3 -6 2 3 -7 -7 8 6 -10 -2 -5 -4 2 4 -3 20 2 3 5 -5
4320 -5 1 -10 3 -12 -5 -3 -9 -3 2 -2 -3 -3 3 1 1 -1 13 -4 13 11 1 4 5 9 0 10 5 -4 10 15 6 1 -4 2 8 2 7 -1 1 -2 0 -4 -5 -3 -1 -5 -1 -5 -7 10 -6
4371 -6 -10 5 1 4 3 -7 8 -3 -2 0 3 21 17 7 14 6 0 -3 11 13 8 6 0 3 -7 0 -2 -9 -1 -7 -8 -2 -6 -3 -10 -7 -6 2 -4 2 3 -13 3 9 -1 1 5 2 -2 -1
4421 -1 4 4 0 1 5 -7 1 11 -9 2 6 5 2 6 4 -6 -12 -13 -8 -2 -5 -4 -6 -3 -2 -5 -1 7 -10 -7 5 -10 -7 0 -6 -8 -2 -21 -1 12 1 1 -3 5 -2 -5 -3 7
4469 7 -4 4 -4 4 -2 6 -3 3 6 7 -8 -3 5 -4 -4 2 0 5 -4 -3 -8 -10 2 -3 -5 -6 -10 -1 -3 -4 -2 -13 1 -15 3 -2 -5 -2 4 7 6 1 14 6 0 14 7 -4 5 14 12
4520 12 -1 5 2 -8 0 -10 4 1 9 -3 -9 0 -10 -5 -2 3 -9 -5 6 -8 6 1 -3 -11 3 4 -4 12 2 4 6 7 2 -1 1 7 2 8 7 1 -2 10 8 -3 10
4565 10 -3 -11 -2 -5 -7 -11 0 -8 -13 -4 -17 -8 -2 1 -8 -12 -5 -14 -3 9 1 -5 -7 -2 -10 -2 11 2 7 14 -7 5 9 9 5 1 4 1 -2 9 -1 2 2 2 -4 -3 -14 -9 -1
4614 -1 -1 -9 0 -8 6 2 -7 6 -6 -15 -5 -9 -10 1 0 -3 -2 -6 3 3 9 3 7 6 5 -3 9 7 3 8 11 -10 2 4 3 4 8 10 -1 -3 0 -8 -4 -1 -5 -21 -1 6 -5
4663 -5 3 3 -2 -21 -6 -12 -6 0 20 7 3 8 6 2 25 16 -3 9 12 0 13 22 2 0 3 -1 -4 5 -1 -8 8 4 -9 -8 -4 -2 -9 -3 -2 -2 -19 -1 -9 -9 -8 -1 -11
4710 -11 0 -2 -8 -9 -1 -2 -3 -6 -4 -5 10 9 -6 1 -7 1 -3 12 -5 -12 -1 -2 -7 0 8 -6 -7 -6 -14 -11 -10 -12 -5 2 -6 -6 -7 -6 -5 -10 -2 -11 -3 1 -1 2 -4 3 3 -5 0 -9 -6
4763 -6 19 14 10 7 11 6 13 14 -2 4 4 3 2 3 6 4 -1 0 3 11 -1 -9 -18 -6 -9 -12 -6 3 9 -3 -3 -6 5 -8 4 2 -5 4 4 5 7 4 6 8 8 0 1 5 4 2 0 7 0
4816 0 -4 -1 4 -6 6 0 -2 -1 -3 -2 8 -9 -10 -9 -4 -20 -14 -6 0 0 -4 -4 3 -6 -3 -3 -1 -1 -14 4 2 -1 5 -3 1 5 2 3 4 -8 4 -2 0 -3 2 2 4 13 5 2 -1 4
4868 4 -1 0 -9 3 -13 -7 -2 -11 2 0 -4 -11 -3 -6 4 -7 -2 -5 -2 1 2 0 8 -2 -1 4 -4 9 3 4 3 -3 -1 2 2 -4 -8 3 -4 -9 1 -14 -4 0 0 -8 2 -3 5
4917 5 -4 -2 1 3 -8 -7 3 -2 -6 0 -9 -5 9 -6 -1 -15 8 2 5 -7 12 0 1 3 -2 8 -2 -1 -6 2 1 -5 1 -11 -10 -7 -10 0 3 2 3 -6 -14 -2 -4 -3 -2
4964 -2 -4 -9 -3 -5 12 5 -2 0 0 2 -7 0 -4 1 2 3 7 -1 3 -1 -9 -4 3 1 4 1 5 -7 -4 5 -4 7 3 -4 0 -8 -1 -17 -7 -3 -2 -7 -11 3 -9 -5 -11 -3 5 2 -1 1 6 -5
5018 -5 3 2 -9 -3 4 9 6 -1 18 -4 4 -8 0 -6 5 1 -1 -10 -8 -25 -14 0 -5 -6 -3 -8 -25 -10 -14 -14 -8 -17 -2 -9 2 -12 -15 2 0 -7 -11 11 -12 2
5062 2 5 14 -8 11 8 -2 -8 1 -8 -9 -2 -9 4 -8 6 -12 -1 4 -5 -1 -4 0 -12 0 0 -6 -18 -3 -2 -13 0 -9 -7 -6 5 -1 -9 6 -3 -1 3 3 -9 13
5106 13 8 5 -3 6 -2 5 13 -1 -3 -14 -1 -9 0 0 -11 -2 -1 -2 -9 -2 3 -11 -8 -9 -12 -5 -6 0 -10 2 1 -1 2 7 -7 9 0 -10 7 -1 5 3 9 2 -11 -3 0 -4
5154 -4 -1 -1 4 -2 -4 4 -4 1 8 4 -12 -8 -15 -13 -6 -1 -17 0 -3 -10 -12 -13 2 6 4 -9 -7 0 1 -4 1 1 0 -4 2 -6 -5 4 6 -6 -11 4 -2 -12 -6 3 -6 -9 10 1 -1 -5
5206 -5 0 -4 -3 -8 -1 -1 -3 -12 -14 -7 0 -5 -10 -6 -6 -14 -3 -4 -5 7 -6 5 4 1 -2 -3 8 1 5 -1 0 3 5 1 -6 4 10 -1 3 -2 -9 -7 6 10 2 -3 -7 -5 1 -9 -5 2
5258 2 6 -10 -4 8 -7 -13 -17 -7 2 2 -3 2 13 13 -2 6 14 4 11 1 -4 9 -7 14 12 -3 13 -4 0 4 -3 3 -9 6 -3 -4 -13 -1 -3 -9 -4 -4 -6 -9
5302 -9 -5 -7 -5 3 -6 0 8 12 0 0 4 1 13 12 8 3 1 15 2 -11 6 -1 0 9 5 4 1 3 -6 0 -3 -9 -12 -3 -11 -7 -3 -10 -3 -2 -5 -3 -1 -4 0 -10 -2 3 -4 -7 3 -2 11
5355 11 7 5 14 11 -5 1 1 -1 7 -7 1 -10 8 5 -3 -6 -13 9 1 -7 1 -1 -15 -12 -8 -3 -5 -6 -15 0 4 -5 -6 -12 -3 -15 -5 -1 -10 9 1 4 7 10 4 13 12 11 -4
5404 -4 3 6 5 -7 4 -5 1 -4 -1 -5 -4 5 4 -1 -5 -9 -4 8 1 -3 0 9 1 -9 1 -8 -9 2 -4 -2 -4 3 -9 -5 -4 -14 4 1 4 4 -2 0 -9 3 4 -1 -2 5 9 -1
5454 -1 -3 -7 10 2 -3 0 1 -16 0 -4 -8 -4 -2 -3 -2 -7 2 -7 -5 -4 -2 -2 -11 1 -5 -6 -7 -8 -10 0 -6 0 -6 8 -2 -1 0 -1 -5 -2 4 -3 -1 6 -6 3 1 -3 6 3 -8 -6
5506 -6 -6 -9 -13 -19 -17 -4 -6 -12 1 -5 -14 5 -1 -10 -9 -8 -6 1 4 -6 -3 -4 8 4 -2 5 1 3 4 1 10 0 -2 -6 -5 7 -5 0 -10 1 -4 -8 -9 -9 -18 -8 -6 -9 -6 -16
5556 -16 -13 -3 3 -4 -9 -11 -5 -1 2 3 6 -1 2 6 0 5 3 5 1 -8 -1 2 -1 2 -2 -3 -6 7 -2 -7 -14 -12 -1 -9 -3 -8 -10 -7 -16 -7 -6 -8 -5 -13 -9 -7 -6 -11 -3 -7 -1 9 -4 -4 2
5611 2 1 -3 -2 2 11 -4 1 7 -2 -9 3 3 0 -8 -8 -1 -2 4 3 -3 0 -2 -2 4 -12 6 -3 -7 -8 1 -5 -8 -1 0 -2 2 6 -6 -10 -1 -4 -1 1 8 -8 -3 4 -7 -4 11 5 -6
5663 -6 2 -3 -3 7 2 6 -9 2 -8 -1 -5 -7 -20 -9 5 -9 -9 -8 -2 -6 0 -2 -11 1 0 -1 4 2 4 6 6 2 -8 -4 -1 -2 2 -4 -8 2 -4 3 2 9 5 5 -3 -5 5
5712 5 -1 1 -5 0 -4 6 0 -8 -3 -9 -2 -9 -6 -15 -7 -3 -8 4 5 -7 2 1 -5 -8 -4 7 -12 5 11 -2 -5 -3 1 4 13 3 -7 3 2 -4 5 10 0 -11 0 4 -7
5759 -7 -9 5 10 -2 -8 -10 0 -6 -14 -9 -5 -5 -5 -5 -9 -11 0 1 8 -4 -5 2 -2 -3 2 0 -6 8 4 -1 8 5 -3 -2 6 -4 11 -7 -4 -7 -1 0 -6 -2 5 -8 -9 9 3 3
5809 3 -3 -15 -4 -12 -13 5 -4 -1 -4 -12 -7 5 -3 1 -7 2 -5 2 6 3 9 6 8 2 4 -6 1 5 3 2 1 -9 4 -7 -3 -6 3 -3 -6 -3 5 -1 -6 -4 -4 -3 -3 4 1 0 11 -4
5861 -4 2 1 2 -5 1 0 -10 1 9 -2 4 8 5 4 4 17 6 -2 3 5 6 3 -9 -1 -12 -5 -4 -5 -14 -12 -1 -5 3 -4 -10 1 -5 6 -3 -8 -5 6 15 11 -6 0 4 -3 5
5910 5 4 -1 0 2 10 2 8 7 -5 0 -1 13 -4 6 -5 -1 -10 -6 -7 1 3 -2 -8 -2 -8 -12 -5 -2 -5 5 -6 4 0 -1 -1 -5 7 6 10 6 -2 4 16 16 5 6 17 -6
5958 -6 8 7 5 7 10 -4 3 -4 1 -8 7 -7 -6 1 -3 2 -1 -13 -8 2 -7 -7 3 0 -12 -4 -16 -7 4 -9 -1 -5 -6 2 12 3 5 3 11 5 0 6 8 8 5 5 -1 -3 -3
6007 -3 2 6 4 -4 1 -1 3 -9 -1 1 -7 -11 10 -5 -14 -14 7 -6 -4 0 -15 1 -2 4 1 -2 7 -4 4 4 8 3 -6 1 2 1 9 8 11 1 0 -2 12 9 0 8 2 1 5 0 -16
6058 -16 -13 -1 -4 -5 6 -5 -7 -4 -7 -2 0 5 1 -5 -1 -1 1 7 5 2 9 -3 5 8 -1 -4 5 0 9 -2 2 4 6 -2 5 6 0 7 2 -4 -4 0 -6 -10 -8 -10 -5 -2 -11 -5 2 -13 0
6111 0 -1 3 -8 -7 -4 -5 4 -4 6 3 11 6 8 8 4 -2 2 4 2 -1 1 5 3 0 13 3 1 -3 -4 -3 -9 -9 -10 -1 3 4 -3 4 0 -6 -11 5 -9 -7 -15 -2 3 1 -1 -10 4 8 3
6164 3 -3 8 3 2 6 8 -2 3 4 7 14 9 4 -10 1 7 -9 2 -6 -8 -8 2 -6 -3 -5 0 -10 -2 -1 3 0 -5 3 1 0 -2 -6 -6 -1 0 2 8 0 -1 17 2 9 9 9 2 -6
6215 -6 2 -6 -4 4 -1 2 2 -2 2 2 -3 0 0 5 -2 -5 -1 -12 -8 -5 -2 1 -6 -3 -2 -8 -1 4 -5 -3 2 1 5 9 0 11 1 10 1 2 4 3 6 1 -4 13 5 9 -3 3 -1 2 4 8 -2
6270 -2 2 -1 -5 -3 -2 -2 -7 -2 -16 -11 0 5 -7 -3 -6 1 -9 2 7 -10 8 14 11 1 7 13 7 -7 -3 1 15 6 -2 9 3 1 3 7 8 4 9 -5 7 -6 -5 -1 -2
6317 -2 -7 6 -2 -7 -1 2 6 -6 2 -2 0 -3 -7 -7 10 -2 1 -4 -2 -3 2 2 14 1 12 6 7 10 0 -8 -3 2 -5 0 -8 1 -10 -2 -1 -6 -2 3 5 -3 1 2 -3 -2 -3 7 11
6368 11 10 -2 7 3 -3 4 3 0 0 -6 1 -4 9 14 23 8 12 9 2 7 7 1 7 -4 11 0 -5 -1 2 2 -7 4 -6 3 -5 -1 3 10 1 2 -3 5 -2 12 9 16 0 6 -5
6417 -5 -1 7 9 -2 -4 14 19 12 13 23 5 9 8 5 3 -6 5 2 9 13 -1 5 6 -4 -5 0 2 -4 -4 -16 -2 -9 0 1 5 -1 3 1 -2 13 -2 10 7 -4 -1 13 3
6464 3 -3 11 6 2 10 1 3 5 3 0 -1 0 4 5 -6 4 -11 -6 -2 -1 4 2 -10 -1 11 -12 4 -1 -3 -4 -10 5 -2 8 -5 -4 -1 -2 0 1 0 0 5 10 11 1 13 9
6512 9 13 -5 2 11 2 3 -5 6 -1 3 6 -7 1 -1 2 -4 -3 8 -10 -2 -2 -6 0 -13 -11 -4 2 6 -4 0 -3 7 -2 -2 10 0 2 1 11 4 -4 9 2 3 10 2 2 7 6
6561 6 4 2 2 -2 -15 -4 -2 -11 1 -2 -6 -6 -1 5 9 -5 3 -1 7 -8 4 5 5 0 5 1 1 -1 1 8 5 5 11 3 8 11 2 8 -2 12 6 5 7 9 -8 -1 3 -3 -3 -8 -3 -10
6613 -10 -3 -1 -4 6 -1 -12 -17 -2 -1 4 9 6 1 -9 4 8 6 10 1 1 12 -2 -3 -2 6 6 2 2 1 7 13 7 1 10 -2 -5 2 -5 5 5 -2 0 -5 -6 4 -3 2 6 -8
6662 -8 -7 12 -8 5 2 2 -4 4 -9 -1 9 12 11 5 8 10 7 2 9 -6 1 9 10 1 11 5 10 -1 -6 1 3 2 -5 -7 4 -8 -5 -12 -8 3 -13 -11 -5 -13 -5 -3 -8 -6 2
6711 2 0 -7 3 -1 2 1 5 4 3 2 -1 3 4 -9 7 6 10 9 8 1 2 5 -5 -11 4 -1 -1 1 4 -2 -5 -5 0 -8 -9 -5 -2 -2 -9 -2 5 -2 -6 7 7 3 7 1 7 -2 2 9 10 4 -2
6766 -2 17 -1 -6 -3 6 5 15 -3 10 -3 0 1 -4 -1 -5 -4 -12 -11 -5 -3 4 -7 -3 -5 -8 -5 -6 1 3 -6 0 5 -4 6 2 1 3 2 6 18 4 0 2 -4 8 5 8 0 3 6
6816 6 2 -5 -5 -8 -6 -4 -5 -7 -3 -2 -13 -5 -7 -7 -16 -4 -2 7 -5 -6 -6 -8 6 4 -3 5 5 13 17 3 9 10 -1 3 9 -3 -2 2 3 -3 -5 4 -3 -6 -3 0 4 0 -5 -5 -7 -2 -5 10
6870 10 2 -3 4 1 -16 -7 -5 4 5 -5 -10 -5 2 3 -8 -6 0 -2 2 6 14 6 -1 6 7 -1 3 12 1 0 5 -7 4 -2 -3 0 -12 -5 -8 -7 -6 1 3 0 -1 -17 -2 1 -6 4
6920 4 4 -1 -5 -15 12 -8 -7 6 10 -2 5 14 5 4 11 9 13 13 8 11 0 7 3 7 1 5 4 -7 -12 7 -9 -15 -3 -5 -8 -5 -3 -5 -7 -19 -7 -2 2 2 -1 -8 -3 10
6968 10 1 -5 5 7 4 16 -2 0 0 -5 -1 -5 -7 7 8 3 1 1 -2 -4 3 7 0 1 -10 1 -1 2 -2 -10 -11 -10 -15 -8 1 -8 -6 -4 -6 -8 -1 -8 0 3 1 5 13 11 1 7 4 7 1
7021 1 -1 0 5 -3 1 0 -9 0 3 -9 -14 4 -6 -6 -1 -4 -6 -9 -5 -7 -10 -2 -12 -2 -4 6 -3 0 -5 4 2 2 6 6 11 1 5 6 3 13 18 13 5 3 0 -1 -9 0 1 -5 -7 2 -1
7074 -1 4 8 3 -7 -2 1 0 0 -10 -9 3 -9 -5 -2 -3 -2 4 -8 -4 -3 3 9 -1 -4 -5 7 6 16 -2 3 -3 9 7 6 12 7 -12 3 -5 -1 3 -2 -5 -1 -4 -6 -3 0 1
7123 1 -18 -9 -1 -2 -11 5 -3 -3 -2 -1 4 -2 0 4 2 2 8 0 -2 5 -1 6 8 7 1 11 9 9 8 4 7 3 7 -5 0 -2 8 -6 8 -1 1 -7 -8 -5 1 -2 1 8 -9 -15 -12 0
7175 0 -1 -1 -3 4 -2 8 0 5 1 10 13 5 5 12 15 12 18 11 5 11 7 1 5 1 4 -5 -4 4 1 6 -2 -9 1 -1 -3 -1 -1 1 0 -3 -13 -8 2 0 1 8 8 6 -2 0 8 14 6 6 6 2 8
7232 8 3 5 0 6 -8 4 8 2 4 2 -8 8 -6 1 -5 2 -14 -8 -2 -1 -6 -2 -2 -4 -7 -7 -4 -6 1 9 -12 -8 1 3 6 0 5 0 8 1 4 7 -1 8 6 9 17 6 11 3 1 -5 6
7285 6 -1 -5 -7 0 -8 3 -1 1 1 2 -2 -11 -2 2 -6 -6 -7 6 3 6 2 4 2 -2 6 13 0 4 -1 2 3 -1 9 3 -1 5 -3 7 13 6 -6 4 2 1 -9 -3 -3 -3 -8 -14 -9 -7 -7
7338 -7 1 -5 -11 -3 -6 0 -5 -1 -2 10 6 -1 1 9 8 2 12 8 -3 10 9 0 2 -1 -4 -4 11 7 9 -5 -2 16 3 -7 1 -5 -2 -2 -12 -7 1 -9 -7 -12 -4 1 -7 -13 -9 -11
7388 -11 -5 -3 -6 1 -2 2 0 -5 2 12 5 -4 -3 1 0 5 -4 7 1 -3 3 6 -13 -8 -1 2 -8 -13 -10 -2 -7 -9 1 -11 0 -2 4 -11 -15 -1 -5 -7 3 -6 0 1 -5 -3 3 -1
7438 -1 -7 2 10 -2 12 -2 10 1 8 5 -3 -1 2 -2 -4 7 -2 6 -1 0 3 -3 -2 1 -1 -1 -11 -2 -2 -5 -4 4 -3 -1 1 -8 2 -2 3 14 -1 2 8 0 -1 -4 1 5 8 12 8 4
7490 4 7 11 4 -5 12 -6 6 -2 -1 -3 -11 6 -3 -3 -5 -9 -6 -6 4 -6 -7 1 -8 -4 -11 -7 -2 -4 -5 6 3 5 6 13 4 5 5 -2 7 0 -7 2 5 2 -8 -7 -2 8 -3 -8 -1
7541 -1 -1 -10 -4 1 5 -10 -5 -3 -5 -9 -7 -16 -10 3 -10 -11 -2 -9 -19 -1 4 -2 -3 0 0 7 -7 4 3 5 15 4 -7 4 0 0 -7 9 -5 8 -2 -6 -6 -15 -1
7586 -1 -6 -3 -2 -6 2 -4 -6 -11 0 -3 -4 -4 -3 0 -5 0 -9 5 -4 -3 -6 -4 -13 4 8 6 6 2 8 5 3 1 4 9 -2 -5 -8 -4 -4 -2 3 -12 -3 2 2 -6 -9 6 -9 -8 -3 -8 -8 3
7640 3 -4 -12 3 -5 4 -3 2 2 -3 -2 2 -4 2 9 7 8 1 6 4 8 2 7 11 3 -2 2 6 6 2 -2 4 2 -4 -4 -5 -2 -22 -4 -16 -3 -2 -15 -4 5 -6 -4 7 -4 9 -1
7690 -1 2 6 -3 17 2 3 -2 10 7 7 7 -6 3 11 6 5 -11 -2 -2 -5 0 0 4 -11 -7 -7 -2 -8 -4 -11 -10 -5 -12 2 -3 -1 -6 0 -13 7 -2 -6 -2 -3 -1 8 9 2 3 6 1 -7
7742 -7 -2 9 7 -2 2 -11 9 -13 -5 -2 -4 3 -4 7 -8 2 -1 4 0 0 -6 -6 -10 -4 -7 -8 -4 -2 -8 -11 -7 -1 3 -3 -4 6 8 -1 10 -1 9 8 10 11 1 1 -2 6 9
7791 9 4 -2 -4 -4 -4 -4 -10 -1 -5 -6 -3 -5 -7 -5 -1 -8 -1 -1 -3 -2 -2 3 2 -4 3 -2 3 7 -5 -2 4 1 5 3 0 9 1 3 2 15 4 1 -5 -7 1 5 -8 -12 5 1 -4 -4 0 -8 -17 1
7847 1 -4 -8 -3 -6 5 0 0 -3 3 8 4 -3 -1 0 7 5 5 -4 0 7 1 16 13 7 1 -2 12 5 5 -10 -4 -1 5 5 6 0 -1 -7 -4 -7 -20 -11 -7 -5 6 -3 -7 -5 -10 0 -4 2 2 6
7901 6 8 6 0 0 1 3 3 -3 6 8 2 -3 2 -4 4 11 9 4 3 -6 5 3 3 1 -1 -4 0 4 -5 7 0 3 -12 -4 1 -9 -3 -3 -8 3 -2 -2 5 7 5 7 0 -1 0 1 1 15 11 11 12
7956 12 7 4 -4 -6 7 -1 0 -2 -4 -5 3 -7 -7 0 0 0 1 -3 -6 -2 -9 -15 -2 -9 6 4 -2 -2 6 -3 -1 1 2 3 -6 -1 3 12 -3 1 5 -2 3 10 7 8 5 3 -1 1 -6 -5 -8 1 -12
8011 -12 2 1 3 0 0 -5 1 -7 -6 -3 -1 -2 3 -3 6 8 3 5 8 -1 -6 11 13 8 8 13 9 10 9 4 3 2 6 4 12 9 -3 9 -6 -8 -2 0 -9 7 -1 2 -12 -6 -7 -7 -13 -10 -12
8064 -12 -6 -1 -4 3 -7 9 -2 13 1 4 10 0 2 9 -8 4 7 3 1 3 4 0 6 1 2 0 -4 -10 -9 -1 -1 -4 -4 2 -1 -18 -8 -8 -15 -7 -8 -6 -13 -18 -9 -8 -11 -7 -4 -2
8114 -2 -5 -7 -9 -3 4 0 -2 5 -1 -10 4 7 12 4 13 4 2 -1 -3 4 -11 -8 -9 -8 4 -6 -11 -3 -5 -14 0 1 -11 -13 0 -10 -10 -17 -15 -18 -7 -8 1 -6 -1 -2 5 -4 3 0 3 6
8166 6 2 8 13 5 0 2 6 9 9 -14 -8 -4 5 -12 -5 5 -13 -10 -2 -7 -8 -9 -5 0 0
8191@
$$ Imaginary data points
##PAGE= N=2
##DATA TABLE= (X++(I..I)), XYDATA
0 0 0 0 0 0 0 0 0 0 0 0 0 0 0 0 0 0 0 0 0 0 0 0 0 0 0 0 0 0 0 0 0 0 0 0 0 0 0 0 0 0 4 -4 4 -4 4 -6 7 -7 8 -8 10 -12 12 -12 12
55 12 -13 17 -18 19 -21 23 -23 25 -26 26 -21 3 48 -239 1924 14166 -3796 -8777 8055 -5943 -17224
76 -17224 1746 2104 -10748 2885 6575 -11282 -4471 10190 -1695 -4220 10894 4975 -6604
89 -6604 3735 8047 -1397 2618 8687 -1317 -3852 5273 1017 -6056 2643 3818 -8847 -6421 3304
104 3304 -3771 -6656 3980 707 -7922 225 2477 -6093 1058 7889 -3442 -3112 8144 1067 -4286
119 -4286 7173 5480 -4808 1133 3962 -3899 499 5915 -2188 -2711 3551 -2414 -5826 2413 2523
134 2523 -3482 -630 1583 -2718 -2434 804 -249 -607 1390 93 -1946 110 1450 -1334 -1574 1998
150 1998 1210 -1980 522 2729 -501 -643 1919 25 -215 2721 419 -1310 2567 1212 -2821 908
166 908 2782 -1811 -1245 1154 -1846 -1879 468 -1961 -1900 1176 -1543 -3152 1100 925 -1992 280 1305
183 1305 -804 376 1360 288 2063 2786 -42 340 2385 446 -734 1149 962 -573 -548 -661 -841
200 -841 -342 -862 -1728 -1145 -647 -1467 -1781 -397 638 -463 -975 706 1043 -174 645 1565 577 846 1264
219 1264 -119 739 2329 -36 -978 1659 387 -2264 -105 789 -1527 -754 165 -1638 -732 714 -1476
236 -1476 -1207 1509 -158 -1869 755 1364 -593 165 1223 257 275 684 -76 255 1075 59 -754 287
254 287 715 -550 -933 345 505 -885 -788 397 -66 -635 49 -112 -363 547 -4 -988 655 1157 -1018
273 -1018 -513 1416 46 -1016 508 465 -463 275 108 -616 533 608 -984 -230 1143 -156 -952 423
291 423 682 -312 -263 230 157 61 -79 -319 -34 375 -146 -727 51 621 -413 -828 378 492 -603 -334
311 -334 412 71 -65 131 -137 209 676 -196 -408 812 586 -599 -56 717 36 -387 -19 54 40 -52 -447
332 -447 -202 331 -167 -756 -167 300 -257 -597 -52 378 104 -266 7 499 315 -187 -87 449 453 -40 -83
353 -83 451 574 -20 -276 144 316 -258 -611 -129 261 -193 -567 -103 245 -161 -521 -287 41 3 -309 -295
374 -295 309 586 -7 -146 533 566 -149 -232 312 384 11 -125 159 398 161 -285 -245 139 -9 -638 -567 210
396 210 202 -469 -223 454 127 -382 -142 99 95 87 -156 -43 616 342 -382 186 723 -124 -545 71 157 -133 -91
419 -91 -44 147 287 -216 -418 186 234 -346 -287 159 225 -49 -216 161 533 -22 -451 88 223 -276 -188 110
441 110 77 200 -53 -451 157 481 -403 -390 596 233 -487 23 405 143 129 58 -101 199 114 -444 -182 475
463 475 144 -587 -318 295 -112 -640 -37 447 -195 -411 32 -78 44 503 -25 -144 818 207 -848 493
483 493 1195 -321 -278 737 -249 -654 359 -62 -396 588 -171 -1321 4 490 -916 -368 832 -250
501 -250 -852 155 247 18 659 417 -268 206 399 -325 70 1140 570 -563 -130 406 -359 -442 463 182
521 182 -571 -266 -426 -805 261 525 -697 -200 726 -693 -968 892 646 -466 423 487 -450 358 734
540 734 -271 369 858 -762 -777 784 245 -503 405 232 -708 -433 -225 -363 304 330 -554 -340 225 -241
560 -241 -357 379 559 19 -260 -105 178 248 183 215 279 147 -166 -346 188 611 0 -372 133 -47 -559 -102
582 -102 229 69 209 -173 -746 -52 205 -674 -45 928 -109 -548 293 -113 -427 479 142 -259 821 390
602 390 -915 246 898 -575 -225 995 11 -446 469 -102 -552 461 34 -860 238 527 -862 -490
620 -490 667 -177 -809 100 189 -445 40 420 -170 48 570 -256 -471 822 629 -609 293 1077 -431
639 -431 -584 819 85 -665 532 128 -959 359 495 -1212 -199 968 -963 -1086 964 170 -935
656 -935 584 456 -952 93 599 -574 327 1365 -285 -673 840 182 -851 494 1024 -247 -255 275
674 275 -456 -509 350 -12 -524 306 224 -1017 -426 760 -193 -758 498 332 -783 63 653 -255 179 774
694 774 -481 -382 971 22 -714 841 686 -892 -81 662 -451 -244 539 -362 -446 419 -331 -755 460
713 460 322 -753 -101 500 -273 -345 269 69 -142 139 31 -48 373 320 -192 -25 372 -27 -387 209 463
734 463 -121 -183 165 -57 -195 37 -131 -149 233 -158 -537 155 296 -404 -151 365 -96 -233 90 -77 26
755 26 310 -147 -159 479 111 -418 198 361 -201 -69 159 -77 81 128 -291 -4 374 -232 -404 251 134
776 134 -362 -76 161 -65 -45 15 -137 59 200 -151 -195 294 214 -287 -84 370 53 -260 93 192 -109 4
798 4 71 -186 79 234 -350 -234 469 -22 -558 219 360 -395 -111 325 -164 -87 300 -195 -171 490 -10 -477
820 -477 341 417 -460 -150 439 -89 -277 195 31 -177 168 8 -323 107 251 -358 -249 400 65 -399 110
841 110 345 -158 -121 202 -65 -73 229 -102 -237 357 179 -463 56 459 -278 -364 299 42 -321 104 79 -200
863 -200 166 133 -352 61 420 -259 -298 401 191 -327 66 287 -65 -51 87 -107 -16 158 -177 -239 231 106
885 106 -388 -97 290 -92 -290 77 94 -140 -11 44 -46 154 164 -185 -21 341 7 -239 205 287 -167 -95
907 -95 149 14 -21 17 -129 -66 116 -148 -279 122 165 -260 -176 135 -15 -179 -13 87 39 9 -59 -34 167 148
931 148 -91 3 243 52 -179 54 214 24 -82 3 29 -8 -70 -114 9 111 -109 -239 -5 96 -112 -139 77
954 77 97 -82 -113 19 107 87 -23 -9 128 114 -78 -67 180 171 -82 -85 106 45 -117 -72 42 38 -58 -155 -104 66 6
981 6 -183 -56 151 -4 -204 -21 157 54 -22 53 107 64 -20 -37 87 210 49 -135 14 139 -93 -191 101
1004 101 145 -129 -161 -38 -88 -50 22 -82 1 132 -161 -277 181 240 -146 9 251 -64 -164 111 91 52 215
1027 215 -20 -242 96 136 -225 22 355 -83 -378 -3 62 -127 68 156 -124 -99 12 -222 -84 382 127
1048 127 -323 46 204 -291 -125 426 128 -205 65 -45 -271 205 253 -210 85 303 -411 -354 442 170 -299
1069 -299 165 182 -405 -107 245 -109 52 355 -250 -415 272 125 -346 177 434 -276 -330 209 2 -141 287
1090 287 112 -302 39 135 -344 1 543 -69 -418 202 127 -421 68 411 -148 -124 203 -264 -256 396 89 -347
1112 -347 271 274 -509 -156 460 -55 -208 311 35 -329 101 103 -242 140 322 -298 -240 326 -7 -342 187 281
1134 281 -258 -157 174 -79 -113 220 11 -213 140 83 -330 38 428 -119 -288 249 63 -348 65 262 -125
1155 -125 0 173 -224 -126 287 -43 -239 245 162 -357 -83 301 -29 -141 139 10 -177 9 45 -84 110
1176 110 174 -187 -210 151 54 -223 74 283 -131 -246 81 17 -127 146 122 -140 68 113 -274 -92 362 -4
1198 -4 -250 218 167 -263 -36 218 -54 -55 123 -83 -129 169 14 -240 94 200 -237 -221 212 48 -245 43
1220 43 165 -149 -85 151 -63 -67 206 -30 -229 204 205 -279 -14 361 -90 -220 244 74 -213 106 94 -257
1242 -257 49 202 -253 -107 309 -92 -343 154 148 -266 -35 227 -83 -83 148 -50 -126 200 67 -238 109 256
1264 256 -192 -174 275 57 -256 83 151 -190 -42 122 -166 -61 224 -143 -234 232 86 -324 55 282 -141
1285 -141 -114 207 -9 -104 158 30 -118 179 123 -206 24 226 -109 -177 138 67 -173 -21 52 -78 -43 19 -103
1308 -103 -64 101 -52 -168 72 124 -145 -72 160 30 -85 64 93 -18 58 34 -51 85 118 -93 -49 166 12
1331 12 -145 9 68 -78 -75 -28 -23 -11 -53 -94 -13 15 -61 -83 26 51 -14 -40 34 100 39 -46 51 121 10 -26 53 50 5
1360 5 -8 -28 0 37 -31 -100 4 50 -96 -122 30 37 -76 -75 39 31 -27 -8 16 49 73 -5 -56 94 119 -68 -52 141
1388 141 48 -123 -6 69 -54 -52 3 -85 -37 36 -108 -102 104 18 -180 11 133 -64 -68 89 55 -32 49 25 -31 86
1414 86 68 -79 23 139 -46 -100 83 76 -101 -42 48 -46 -64 -9 -52 -53 43 -50 -133 40 81 -122 -65 126 9 -111
1440 -111 37 66 -21 29 40 -8 69 80 -48 -16 136 24 -97 33 94 -53 -71 23 25 -20 -23 -55 -54 13 -50 -95 4 67
1468 67 -59 -108 25 52 -28 -13 63 54 -9 -28 6 63 74 16 -21 30 22 -57 -32 74 54 -63 -85 -6 -5 -48 -15 41 27 -62
1498 -62 -88 -36 48 71 11 -10 51 2 -81 -2 145 77 -36 -11 0 -40 -17 37 33 29 -17 -127 -91 63 31 -59 24 53 -112
1527 -112 -137 43 73 19 48 -14 -71 25 30 -8 94 150 -52 -133 48 59 -40 53 119 -34 -75 -17 -39 18 119 11 -96
1554 -96 5 -3 -137 -17 148 24 -106 -1 -7 -84 20 76 -3 34 23 -114 -73 128 61 -60 67 79 -106 -62 97
1579 97 59 15 56 -17 -71 43 22 -58 60 115 -92 -127 41 27 -73 20 65 -50 -51 -32 -60 22 90 -17 -67 50 37
1606 37 -89 3 134 41 -59 21 31 -29 0 33 16 47 30 -79 -47 68 14 -65 37 50 -65 -91 8 18 -3 21 -4
1633 -4 -14 10 -20 -41 46 86 -7 -52 12 22 -31 -9 58 51 -24 -49 -20 -8 20 16 -13 7 10 -75 -84 62 75 -54 -18 46 -26 -59
1665 -59 22 60 35 19 -30 -40 24 35 -10 17 81 -3 -108 -13 66 -3 -27 26 -17 -67 -38 -16 -8 51 8 -94 -44 43 -37 -51
1695 -51 77 60 -66 -49 20 -18 18 58 -7 -15 38 -37 -59 87 107 -32 -22 43 -15 -55 23 47 2 4 -25 -52 0 23 -53
1724 -53 -38 39 -14 -101 -31 57 -23 -41 14 3 -22 1 0 7 61 25 -40 19 79 1 -23 52 42 -36 -19 14 7 -5 -18 -34 -12 -11
1756 -11 -49 -50 11 16 -49 -45 27 23 -23 -21 35 36 -10 2 23 15 11 0 -8 25 26 -50 -39 39 20 -71 -36 33 -28 -62 -9 11 -24 -12 -13 -26
1792 -26 32 31 -44 3 94 11 -60 40 74 -13 -13 67 16 -21 13 -13 -44 25 11 -94 0 57 -75 -98 47 13 -91 0 29
1821 29 -45 -2 43 -51 -1 74 -22 -47 91 63 -73 10 96 -29 -44 61 14 -39 44 11 -64 29 37 -88 -47 94 -16
1848 -16 -100 47 41 -90 -33 47 -29 -28 53 -33 -50 71 7 -99 35 100 -68 -39 103 14 -73 42 34 -37 24 42 -55 7
1876 7 93 -47 -67 76 27 -102 6 71 -46 -43 41 -28 -50 21 -12 -63 44 31 -75 -22 85 -23 -63 53 50 -45 -1
1903 -1 40 -27 -10 43 -24 -17 66 -7 -78 20 43 -80 -49 45 1 -54 9 11 -24 13 19 -24 10 54 0 -18 61 31 -52 -12 65 -7
1935 -7 -31 25 5 -24 -3 -17 -48 6 23 -73 -42 31 -10 -76 8 49 -41 -41 24 6 -9 36 21 -8 36 13 -50 14 76 -8 -55
1966 -55 32 24 -66 -17 42 -25 -24 9 -46 -48 27 -2 -50 18 35 -82 -64 53 -4 -63 26 24 -57 -17 10 -25 12 54 -46 -59 55
1997 55 11 -61 37 88 -28 -37 31 10 -27 51 18 -24 21 -6 -76 -6 86 -12 -65 38 10 -90 -7 43 -9 -22 25 -49 -41 47
2027 47 13 -36 55 43 -84 -36 70 -6 -22 57 10 -57 -10 9 -45 33 60 -55 -48 37 -7 -69 44 67 -45 -29 30 -15
2055 -15 -8 60 -4 -25 38 -12 -80 6 80 -40 -43 37 -23 -86 3 17 -25 4 19 -64 -36 45 -21 -25 78 22 -79 -9 47 -10
2085 -10 -1 62 2 -41 9 -19 -41 62 47 -44 -18 36 -46 -50 49 35 -37 -7 -8 -60 -3 30 -27 -10 47 -33 -88 17 43 -27 0
2116 0 38 -32 -63 5 5 5 58 11 -48 0 31 -37 2 95 9 -59 -9 13 -17 18 38 -7 -12 0 -47 -30 66 25 -51 5 19 -67
2148 -67 -43 51 16 -25 11 -25 -55 15 29 -19 15 46 -52 -59 33 35 -16 30 41 -46 -24 23 -7 20 59 -7 -61 21 17 -49 11 64
2180 64 -21 -52 14 1 -23 30 19 -32 11 22 -46 -24 72 6 -50 19 41 -47 -11 45 6 -16 16 -27 -36 33 21 -47 23 49 -45
2211 -45 -32 50 31 -23 25 37 -20 3 34 -21 10 56 -10 -41 46 21 -55 5 47 -37 -28 17 -8 -36 19 5 -48 14 17 -54 -9
2242 -9 62 -16 -39 39 29 -33 14 38 -15 7 31 -22 -24 47 0 -47 36 43 -48 -20 57 4 -29 23 16 -25 14 13 -35 17 49 -22 -28
2275 -28 43 -4 -66 8 26 -45 -21 11 -20 -27 24 -12 -38 38 15 -51 5 50 -21 -22 53 20 -15 22 24 3 30 38 -18 5 36 -5
2307 -5 -45 32 19 -47 -22 13 -12 -26 20 -19 -18 14 -2 -30 15 28 -24 -20 20 -8 -29 21 21 -10 -1 18 -1 5 19 -22 -8 21 13 -19
2341 -19 15 35 -10 -20 15 15 -7 5 4 0 2 -7 -20 -3 11 -14 -15 12 7 -15 -17 11 2 -12 -13 2 -1 -10 0 -8 -8 2 -5 -5 13 13 -21 -21 21
2380 21 6 -20 4 8 4 8 14 4 7 11 -11 -5 21 21 -17 -2 35 -9 -26 9 4 -20 -6 9 -11 2 -5 -30 -19 16 -19 -30 18 25 -26 -8
2416 -8 26 -2 -8 17 14 1 18 4 -18 18 41 -19 -10 35 22 -17 -3 27 -9 1 8 -17 -10 10 -16 -8 21 1 -39 3 33 -8 -16 11
2450 11 -6 -17 0 -5 -14 14 13 -20 -8 12 -16 -26 25 11 -16 -5 7 8 -5 21 -10 -3 11 -5 -14 27 19 -19 -7 8 1 -22 1 10 0
2485 0 4 -26 -25 3 1 -13 9 11 -29 -28 -6 -2 0 12 -3 -4 -3 2 -6 20 31 3 -9 13 20 0 10 35 12 10 -14 -30 10 29 -5 7 20
2522 20 -19 -32 1 16 -2 -2 0 -30 -12 -11 -13 13 25 5 -47 -4 7 -9 -2 14 -3 -23 -13 -4 -1 18 6 -25 -4 11 -25 -13 30 11
2556 11 -21 16 2 -24 3 23 14 19 15 -30 -32 19 13 -24 3 12 -22 -32 -4 -12 -9 15 -14 -24 4 -5 -34 17 44 -7 -27 12 -7 -26 34
2591 34 36 8 -4 15 -22 1 38 -2 -18 16 6 -36 3 41 1 -8 17 -19 -26 5 0 -10 12 10 -36 -28 19 -6 -27 27 15 -38 -21
2624 -21 11 -10 0 22 -8 -23 6 4 -36 25 43 -17 -19 18 -2 -25 20 29 -12 3 -5 -33 -3 30 -9 -15 17 -2 -42 -7 27 -6 2
2657 2 16 -25 -37 4 -1 -17 10 9 -40 -20 14 -17 -25 29 6 -29 -6 12 -16 7 27 -9 -16 18 0 -22 21 39 -9 -14 15 -9 -21
2690 -21 11 15 -5 -5 -8 -27 -6 19 -11 -6 22 -8 -34 -6 19 -12 -7 3 -8 -20 -2 -2 -7 15 0 -28 -13 18 -5 -8 21 11 -5 -5 5
2725 5 -4 10 17 -4 11 14 -9 -14 1 14 -10 -22 9 -12 -23 -5 -3 -10 -4 -14 -17 0 7 -11 4 14 4 -13 4 2 -2 -3 -4 -13 -3 -4 -4 9 9
2764 9 -4 -10 -2 3 1 0 13 2 3 -1 -7 10 21 1 3 3 -5 1 1 -3 14 -8 -14 -9 -1 -5 -10 -10 -2 -17 -18 -7 9 3 -15 -12 18 1 -5 7 10 3 -13 -15 13
2809 13 14 1 8 6 10 2 1 11 2 8 -6 -3 1 2 -17 -27 -2 -1 -23 -12 2 -7 -17 1 -8 -6 7 -5 -14 2 -2 -7 4 18 -3 -3 10 9 3 9 14 -1
2851 -1 11 15 -10 -2 11 -8 -12 8 5 -15 -7 -1 -6 -13 -3 0 -2 5 0 -27 13 -2 -14 -2 13 -2 -19 4 5 -12 -8 -8 -4 -4 4 -10 -4 9 2 -12 7
2892 7 15 -3 -3 6 7 6 7 7 -1 14 6 -2 13 8 3 -9 8 1 -10 3 -2 -11 -7 -16 0 4 9 -3 -17 -2 13 -1 -13 8 0 -11 -4 -2 -2 -4 -5 6 5 -6
2936 -6 6 11 8 16 -7 -5 12 -1 -9 10 11 -4 -11 4 5 -7 -5 -7 -3 -21 -11 -30 -18 6 -7 -17 -3 5 -12 -7 11 -6 -4 3 -1 -13 17 7 -3
2975 -3 5 18 -17 -11 19 10 -17 8 4 -17 -14 -3 -18 0 21 -14 -26 5 2 -28 0 26 -17 -28 4 -3 -22 6 4 -20 -5 -2 -30 -13 17
3010 17 1 -16 14 7 -25 -2 15 -3 2 23 -7 -15 8 4 -19 13 6 -18 -29 26 -10 -11 8 9 -22 -6 12 -22 0 23 -3 -22 15 -1
3044 -1 -30 1 16 -23 -17 3 -20 -18 24 9 -21 3 6 -33 -7 31 1 -14 20 7 -19 13 24 -9 12 33 -18 -3 13 -2 -26 11
3076 11 18 -31 -18 17 -21 -21 15 -3 -24 5 -5 -29 5 24 -19 -11 12 -9 -30 14 22 -11 -1 16 -17 -8 22 -4 -3 32 4 -25 11
3109 11 37 18 -13 30 -1 -17 18 14 -17 10 14 -20 -16 6 -18 -20 21 3 -37 -10 -1 -27 2 15 -8 -8 9 -9 -8 11 25 -6 -5 18
3143 18 -2 -13 14 10 -4 8 9 -17 -2 23 8 -5 20 -1 -29 5 23 -7 2 11 -8 -16 8 -1 -1 18 7 -24 -11 3 -11 -7 4 1 -20
3178 -20 -1 13 -9 3 12 7 -7 6 4 -7 13 18 -14 -1 12 3 -8 16 20 -4 11 4 -5 2 15 3 6 27 -3 -9 13 7 -12 2 0 -6 -16
3215 -16 4 -12 -6 6 -14 -9 -11 4 -12 12 13 4 0 4 8 3 10 14 10 21 18 3 13 15 13 0 10 11 -5 -8 -8 1 -5 5 -11 -17 5 -7 -11 4 14
3256 14 0 -13 0 6 -5 6 11 11 2 -4 2 13 18 1 6 13 9 -10 10 12 -4 7 7 11 1 6 9 2 4 3 -5 -3 -1 -10 -5 -5 -4 -7 -8 -2 1 -6 -8 0 -7 -2 -2 -6
3304 -6 5 9 2 0 5 6 5 -4 11 -7 9 -5 -1 0 0 -3 -9 9 9 5 9 16 2 5 1 4 -1 -1 -10 7 -2 -2 -10 0 0 -3 -6 -8 3 -14 -12 -11 -3 -11 0 -9 -4 -1 -2
3353 -2 4 3 10 11 -9 14 9 10 -3 8 10 5 2 0 4 6 -7 -1 4 14 5 -2 5 1 -14 -2 1 -4 -1 -14 -19 -6 0 -9 -2 1 -9 -5 -1 -6 0 -14 10 8 0 10 4
3400 4 6 9 7 -4 7 10 8 0 7 8 8 -2 3 -3 1 -4 -15 -3 -1 3 -5 12 -6 2 -6 8 0 -4 -10 -3 8 6 0 -7 8 5 -15 -7 3 -6 7 -7 7 8 0 12
3446 12 1 -3 19 -5 9 13 11 0 0 6 -1 4 1 7 -1 -11 -11 -4 1 -4 -11 -3 -4 -21 -13 6 -8 -10 -3 6 -4 6 10 6 12 12 -6 -2 5 -9 4 8 8 -10 3
3491 3 12 11 6 12 -3 0 16 10 0 14 8 -7 -8 -5 -9 -9 -11 3 -5 -3 -4 -19 -6 9 -1 -20 -1 -1 -10 8 11 -3 11 5 1 -1 17 8 -8 16 14 -8
3533 -8 7 1 -6 3 11 -9 -14 -4 -8 -5 5 -2 -9 -1 -1 -11 -15 2 1 -17 -11 -4 -11 -3 9 -4 -7 8 -7 -16 5 19 -1 2 10 -10 -12 8 5 6 11 19 -1 -5
3577 -5 -5 -9 0 18 10 -2 7 10 -2 -3 9 -1 -4 -3 4 -7 -3 1 -13 -1 7 -9 -11 10 12 -4 -15 3 -15 7 3 -5 13 5 -10 2 16 12 5 14 26
3618 26 16 -3 15 11 7 23 11 -9 1 -7 -11 5 17 -7 -22 -11 -6 -8 -7 6 -12 -6 3 -6 -5 10 1 -3 11 -4 -2 -3 17 2 -6 9 2 -9 10
3657 10 7 -5 14 3 -4 2 11 5 -2 20 18 -9 -3 7 -9 4 4 1 -21 -2 2 -9 -1 7 -5 -17 -5 -5 -17 -2 4 -4 -3 -3 -1 -2 12 5 -9 1 4
3698 4 -13 0 2 -4 9 9 2 -11 0 4 -2 10 13 -3 4 6 -6 -7 14 -4 -8 1 11 0 1 -8 -13 -19 -1 -1 -14 1 0 -8 -1 11 -2 7 6 14 1 10 1
3741 1 4 5 12 4 10 19 7 -1 8 12 -7 -1 0 -7 -7 -1 3 5 11 -8 -14 -4 -1 -9 -11 -1 -15 -5 4 -9 -12 -3 0 5 -9 -2 5 -10 7 10 -2 -6 0 4 8 9 16 9 -2
3790 -2 -4 2 10 -2 7 -2 1 -7 -15 -12 -6 -2 -7 -5 -7 -10 -2 -3 -5 -13 -13 -14 -8 9 5 1 0 -2 -1 5 6 1 5 -5 3 -2 3 -8 -2 5 1 7 5 7 5 3 2 0 9 -5 4 4 2 2 -5 3
3846 3 7 -7 -4 -2 -12 2 -7 -13 -13 -3 -1 5 -8 6 11 2 8 11 0 2 6 0 3 -3 5 10 5 6 14 4 9 -3 13 1 0 -2 4 11 6 3 3 -4 -2 -7 -1 -10 4 -9
3894 -9 -11 -13 -1 5 -7 -11 -3 -1 -3 0 12 12 1 8 7 2 5 7 0 9 5 6 0 11 8 4 14 1 7 -6 -8 -5 -9 -2 -4 -10 4 -6 4 3 -1 -8 5 -4 -11 -11 -8 1 4
3943 4 -4 -1 0 5 12 3 1 0 -3 12 -5 1 7 13 -1 12 12 11 5 5 10 0 9 7 2 11 -3 -5 4 3 -8 4 -4 5 7 -3 5 -3 4 8 -3 4 9 -1 1 0 6 6 3 9
3993 9 3 2 -5 13 0 18 10 13 15 21 7 2 21 8 5 1 15 -12 -4 4 0 -6 3 1 -4 0 1 -22 -12 10 -11 2 13 8 -7 12 9 -5 -5 6 4 5 14
4036 14 0 1 -3 11 -5 -3 13 -4 -5 0 -2 5 18 8 2 -3 -6 -1 0 9 -7 -12 2 10 -11 -7 9 -1 4 12 -5 -12 -6 10 -14 -1 0 -12 -5 7 4 -2
4078 -2 12 1 -3 6 -1 -4 9 17 -1 4 1 -8 -5 5 7 2 2 0 -3 -15 -2 1 -7 0 5 -18 -10 10 -11 -8 -7 -4 -20 -2 0 -14 0 6 -6 -15 9 6 -9 17
4122 17 9 -3 3 17 1 14 13 15 -5 -3 3 -2 5 8 -8 -12 0 -6 -7 0 -2 -3 -13 -4 -11 -11 13 4 -11 14 6 -7 1 0 -4 -12 6 -5 -11 5 1 -4 7 8
4166 8 0 -5 17 8 1 8 12 10 0 12 5 3 11 3 -5 -3 6 -12 12 0 -3 -5 6 -9 -19 1 -3 -4 -3 4 -13 -9 2 5 -8 10 1 -4 11 0 -5 -1 7 3 -4
4211 -4 9 -2 3 11 8 -6 -6 9 11 -5 5 -6 -12 1 -3 -3 -3 0 -7 4 -9 -7 -11 3 5 -2 -12 11 -13 -5 7 11 2 5 0 -9 1 7 2 1 29 7 12
4254 12 -5 7 2 13 11 6 -6 7 -7 1 6 -4 -7 10 8 5 5 4 3 -9 -4 -9 -7 -4 4 -7 -1 9 -12 -6 1 8 0 9 11 8 17 16 16 9 9 8 12 17 18 2 14
4301 14 5 9 10 9 -1 -2 4 -1 -3 -13 -1 2 -4 1 2 0 12 0 4 1 2 -14 -2 7 9 3 -4 4 12 9 18 10 2 3 10 11 12 17 9 5 15 10 6 9 14 7 11 12 10 1 9 12
4353 12 0 -3 4 2 -6 -8 -6 4 -9 0 1 11 1 2 7 12 -4 9 16 2 2 2 6 11 3 2 8 5 -1 9 4 15 11 9 13 8 18 6 14 14 12 11 8 8 9 5 -4 2
4401 2 6 2 0 -1 -4 -3 -9 2 -3 -1 5 7 9 3 6 3 15 7 4 4 -7 10 -3 12 15 8 2 8 13 10 3 -8 12 10 15 3 -3 2 -2 -3 9 2 -1 -2 1 -3 -4 8 -9
4450 -9 -9 -1 2 2 1 13 11 4 7 15 1 4 6 17 14 10 8 18 5 10 9 6 -5 2 3 6 -10 2 6 4 -3 5 1 5 4 -4 1 9 -2 7 4 4 -7 4 3 -9 -4 8
4498 8 -2 0 6 5 -11 5 5 11 5 22 8 7 15 10 8 5 23 0 3 12 2 1 2 3 -4 5 2 9 5 3 6 -13 3 3 -13 5 -4 0 12 1 1 -1 10 2 0 -3
4544 -3 7 1 0 2 15 -3 6 14 2 8 16 10 10 3 6 0 20 1 3 22 -1 -17 3 -5 -3 3 5 -3 -6 -3 -13 -3 6 10 8 -2 -4 2 0 11 13 9 10 10 3 9 11
4591 11 9 0 11 7 2 10 14 7 12 16 4 3 7 14 3 -3 -1 -12 0 3 -6 2 -5 -7 0 -3 -4 -10 -4 0 -11 -10 0 2 3 8 6 4 3 11 -2 -1 15 16 -9 4 7 -8
4639 -8 13 9 10 -4 -4 1 5 13 -1 -7 15 -9 -11 -3 0 -4 -4 7 5 -5 4 2 -9 8 9 -3 -11 5 -1 -6 17 6 5 9 7 5 4 19 22 6 12 11 0 10
4683 10 19 5 9 20 7 11 1 7 0 1 1 -3 -13 -5 -2 -8 0 -8 -12 6 -3 -6 -1 4 -3 -5 1 1 -5 -4 17 1 -1 10 8 9 10 9 0 6 3 -6 -8 11 4 9 10 8 2 9
4733 9 11 1 -4 3 -15 -20 -9 -4 -8 -5 0 -1 1 11 -1 -5 -3 -3 8 7 10 -3 3 11 -1 8 5 2 10 6 9 7 13 3 13 3 11 13 11 2 -1 -3 5 4 5 -3 3 1 -6 3
4783 3 -2 -5 -9 -2 4 2 0 -2 -6 -3 3 3 -9 9 7 7 0 4 -4 0 11 3 8 6 1 7 10 5 2 2 -5 -3 9 12 3 0 2 -2 -4 -1 0 -2 -6 -5 -7 -6 5 -5 -8 -9 -8 -2 11 1
4837 1 7 -2 -1 2 0 2 12 0 4 15 9 21 12 12 12 4 10 6 3 6 -5 3 5 -2 8 7 5 -4 -5 2 -3 4 -8 -7 8 -7 -6 -2 9 3 10 -8 8 5 7 11 -2 8
4885 8 13 8 7 2 5 7 -5 3 7 17 5 2 8 3 -1 8 -3 -2 1 -2 2 1 1 0 -6 0 -10 -7 -3 -5 -4 -10 -1 -7 1 -6 -3 0 2 -12 0 4 11 -1 14 0 14 -1 -2
4934 -2 8 3 8 6 1 4 -1 5 5 -2 -1 -8 1 -7 -9 -5 -1 -14 -8 0 -16 -16 -8 -4 -4 -2 -2 3 -3 0 -2 -1 4 1 5 4 14 -4 12 13 0 15 9 3 0 -1 -1 5 -4 4 -9 -2
4986 -2 -4 -2 6 -5 -2 2 0 0 -3 0 -2 -13 -3 -9 -8 -5 -1 -1 -6 5 5 -11 -5 4 2 7 9 5 2 7 9 9 13 6 2 6 8 1 2 3 15 2 5 7 7 10 4 3 4 5 -2 -11 -10 -6
5040 -6 -13 5 -6 -4 1 16 2 5 -5 -7 -10 3 6 -1 10 10 3 0 4 11 7 5 -4 -1 1 11 -6 17 16 14 -10 -2 8 -6 -2 3 7 -5 -1 3 -8 -11 -4 -3 -2 0
5086 0 -10 -4 5 1 2 -5 4 -2 10 0 2 1 7 11 8 8 1 -3 3 9 6 14 11 11 -6 3 4 -9 -5 7 2 -4 8 -6 -11 -3 -5 -13 -14 7 1 -6 -4 -10 -8 6 9 -5 -5 5
5136 5 7 4 12 2 3 1 7 6 11 14 -3 -3 9 -1 1 4 2 -10 4 4 5 -2 -3 10 3 9 3 -5 -4 0 -2 1 -1 -4 -12 -3 -2 2 2 3 -2 1 12 -6 4 18 10 7 12 23
5186 23 9 7 11 16 15 13 4 9 9 12 -8 5 -2 -7 1 4 4 -1 3 5 -10 5 -4 -17 -5 -5 -1 1 -4 -5 -1 7 7 3 1 3 4 0 9 1 10 0 5 3 9 19 3 8 16 15
5236 15 5 7 2 2 -4 -2 -5 -5 -9 -7 -3 2 1 -3 -11 -7 0 -7 0 8 0 1 7 9 6 8 -3 3 3 3 6 4 3 0 -4 8 2 11 10 -2 -1 5 1 11 3 6 6 5 -1 -5 1 1 1 -11
5290 -11 2 -8 -4 -7 -1 -1 -6 -3 -8 -6 -6 -1 2 0 2 8 -7 3 2 4 8 3 -10 -3 6 5 -2 3 12 8 7 9 20 8 9 -1 3 0 3 -9 6 2 -2 1 -1 -6 -10 -3 9
5339 9 1 -1 -3 -1 -4 0 -16 5 5 3 5 5 -1 4 8 4 6 14 7 -1 4 3 7 19 1 0 6 3 2 6 2 2 -1 12 -3 9 6 3 1 3 4 -9 -8 -3 2 -8 -12 -12 -3 -12 -1
5390 -1 3 14 -2 3 -1 10 10 14 12 8 4 12 17 7 2 3 1 4 4 0 12 -4 -2 -6 -1 1 2 1 -11 2 -1 -3 -10 4 -9 -1 -7 0 4 3 6 0 0 -1 4 5 13 5 12 9 10
5441 10 8 1 0 10 -1 7 -7 0 3 3 8 12 -7 -5 10 8 -10 -2 3 -4 -6 -2 -1 1 -2 7 13 5 -5 12 -8 -2 3 -1 8 -12 7 3 10 12 4 5 14 3 4 10 3 3
5489 3 -2 -10 7 12 5 7 12 8 6 -2 -12 6 -7 -7 -9 -12 -2 0 -6 -4 -4 -7 -4 -6 -10 2 -3 1 2 3 6 12 9 17 11 10 9 16 11 -9 1 14 6 -1 7 5 8 3 9 2 8 2
5541 2 -11 -4 -1 -5 -5 3 7 -2 -9 4 3 -7 1 2 -15 8 9 -1 4 -4 -10 -12 -9 7 -5 8 -1 6 10 6 7 11 18 -9 -2 16 3 0 4 8 -7 -10 0 -9 -5 6
5587 6 -7 4 4 5 3 -5 0 9 -8 -1 6 2 3 3 7 1 10 -3 6 5 -3 -2 13 13 -3 3 9 5 7 3 9 9 13 9 -1 5 13 -3 -6 -3 -3 -6 2 2 -12 -2 2 -11 -6 -5
5637 -5 -4 -1 -3 6 -1 -2 5 1 9 6 2 3 10 5 7 10 15 6 2 5 5 -2 12 8 2 7 12 4 0 4 -3 -9 3 -3 -3 6 -1 -5 1 8 -5 -3 -10 0 -2 -15 -2 6 10 13 6 8 7 13 8
5692 8 7 18 6 7 17 13 13 13 6 1 10 11 -4 5 4 1 -4 5 3 -7 1 -1 -4 -7 5 -2 1 5 -5 -7 7 4 -14 -1 2 0 -3 6 -2 4 9 10 3 1 11 13 1 10 14
5741 14 3 3 9 17 3 12 3 7 3 6 3 -5 -1 4 12 -4 3 4 -7 1 -9 -10 -1 -3 0 10 2 5 3 1 -9 -2 12 2 -1 -2 1 -1 8 14 17 12 10 12 5 12 17 10 17 13 -2
5792 -2 -5 4 0 -1 8 -4 7 -3 -7 -4 5 0 -14 -11 -5 -11 -7 -10 -1 1 2 5 5 8 5 12 5 6 -4 7 12 7 -4 14 12 2 6 8 11 3 3 -4 11 2 -1 1 0 2 -8 10
5842 10 0 -9 -5 5 -6 -12 -2 -11 -10 -16 -9 -5 -2 3 -3 -3 7 9 10 10 6 2 2 2 1 2 5 -3 1 -5 2 -1 -2 4 -3 -1 7 4 0 -1 -1 -6 -7 1 -2 3 1 -4 -3 1 -2 0 -13 3
5896 3 -4 0 2 5 3 0 -3 -7 -3 3 7 6 9 5 1 0 -2 2 9 -1 7 5 3 -5 3 -9 -2 0 6 16 -8 4 4 -7 3 -2 -1 7 2 4 -2 -5 5 0 11 -4 7 8 -2
5945 -2 7 4 3 7 12 3 13 14 -2 10 6 -10 14 -1 10 2 7 -1 -5 3 4 0 10 -6 -4 -10 -6 -11 8 -6 -3 6 5 2 -1 -10 -7 7 -8 12 3 2 -1 -3 5 17
5991 17 1 -1 -3 -2 5 -2 15 9 10 5 1 11 14 13 10 3 7 -1 -3 -2 -12 -3 -7 -4 -2 -11 -8 -2 -3 -8 -2 5 -3 3 5 3 2 8 9 7 10 12 2 12 14 6 14 4 -2 5 9 -3
6043 -3 -1 -2 13 -1 3 -2 -11 6 -2 11 1 6 -3 -3 -5 -10 -9 -2 3 -5 -10 -3 -2 1 -2 -1 10 -4 2 2 5 2 14 9 9 8 5 -10 6 17 2 5 -1 9 0 -2 15
6090 15 3 1 0 2 2 -3 6 -8 -5 0 6 6 5 -2 4 0 2 -8 1 0 5 10 7 9 12 10 5 4 10 3 17 10 1 16 7 22 9 8 5 5 2 2 5 5 10 5 9 -2 6 2 0 3
6142 3 11 -1 10 0 0 -1 11 1 0 8 -13 0 1 8 -6 6 11 -4 -1 8 9 10 7 7 4 5 4 12 11 6 2 14 11 8 1 1 2 -15 4 -3 -3 -8 -11 -8 1 -3 -11 -6
6190 -6 -4 4 -7 -7 7 3 8 8 3 0 4 10 2 -2 7 11 3 4 7 9 2 5 1 -1 16 1 4 3 2 10 1 4 -6 -4 0 2 -5 -2 4 -11 -4 1 0 -6 -1 7 -1 0 8 -11 -1 1 11
6243 11 -4 9 6 10 3 4 10 7 3 2 10 -2 7 3 7 10 0 2 8 -1 -3 6 2 3 -4 9 7 -1 -1 1 6 -7 -2 -5 4 -7 -1 4 -1 -5 10 1 1 1 8 13 5 4 13 9 9 17
6295 17 12 13 13 3 -3 6 2 -4 5 0 -5 2 0 0 -7 3 5 -9 -3 -2 -5 1 1 -5 3 1 4 3 0 -3 7 7 3 -1 4 5 2 8 9 12 9 15 14 13 -3 9 4 2 12 4 2 -1 4
6348 4 0 7 -3 -8 0 -7 -10 -13 -3 -2 -2 2 4 1 -4 1 -2 -5 8 -3 7 0 6 4 8 1 -6 2 11 10 11 7 2 5 1 3 10 0 9 7 -5 17 6 -4 0 0 0 -8 -12 4
6398 4 3 -10 2 -5 -9 -1 -9 -8 -5 3 2 4 6 5 1 0 7 9 1 12 6 1 7 4 10 4 6 4 -1 1 4 9 9 9 0 5 -5 6 -7 10 0 -13 -3 -4 -9 -11 -7 2 2 -5 -10
6449 -10 -4 10 1 -4 6 13 3 1 2 4 -8 14 15 4 4 14 14 6 -7 2 1 5 3 -9 -4 -8 0 1 -1 6 -3 -2 -6 -14 -2 -4 3 -2 -4 -9 -6 9 12 11 -4 -4 4 2
6497 2 1 2 2 5 11 7 8 11 5 11 7 12 9 12 6 -3 4 5 2 4 4 -3 8 2 -8 5 1 -10 -2 0 -4 -6 -5 -6 5 -2 5 4 -1 -8 -2 -5 -5 9 -4 1 2 -2 -9 1 4 -6
6549 -6 1 7 0 10 8 13 5 4 8 2 9 2 11 4 11 1 3 7 8 1 -5 -3 -15 3 -3 -6 6 0 3 2 5 6 0 10 5 10 1 9 3 10 10 5 -1 16 -1 1 9 8 11 2 3 5 -1
6602 -1 0 -1 -5 0 8 1 -4 -3 -1 -5 -1 -4 -12 -12 -2 2 -2 -11 -4 2 2 -7 -5 1 5 4 6 5 -11 10 3 7 1 0 -2 7 -1 10 -1 1 -4 7 1 2 -9 -1 5 11 15 -5 -13 -8 -4
6655 -4 -6 -3 -13 2 -5 -8 -12 4 3 7 -12 -3 -6 -5 8 1 -1 -5 2 4 9 4 16 18 9 2 2 2 3 -5 -5 -2 -13 0 -5 -3 -6 -4 -15 -16 -2 4 -14 -1 -2 -5 -9 -1 -3
6704 -3 -8 -2 5 0 7 0 3 5 5 7 11 -1 -3 0 8 2 6 -3 2 9 -6 1 -2 2 5 -1 -10 -6 -3 -1 -3 3 3 0 -7 -5 1 3 6 2 3 -8 -6 0 -3 12 1 -3 -7 7 5 -6 6
6757 6 3 -6 5 14 9 -6 1 4 0 7 16 -4 -1 9 -3 -4 2 -9 -1 2 -6 -15 -15 -3 -1 1 6 -4 -5 -5 -12 -7 3 -12 -8 2 -1 4 7 2 0 2 4 5 -2 2 -4 3 -3 -2
6807 -2 0 -6 2 0 5 -3 -6 9 -5 -7 -5 -2 -3 -2 8 -1 -7 -3 -1 -1 -4 -3 -14 -5 -6 -4 -8 -6 -7 2 -1 0 12 6 4 6 5 2 0 7 1 9 5 4 -2 2 -5 -4 -5 -4 -10 1 -8 -1 -8
6862 -8 -3 -12 -3 -5 -4 -5 -9 -13 -5 -8 -2 9 4 -4 -3 -7 -7 2 9 10 -2 5 -5 7 9 2 1 5 13 9 3 6 5 -2 0 2 2 -8 -3 -6 -9 2 -12 -10 -7 -15 -13 -11 -12 -11 1 4 0
6915 0 -3 -5 -6 -6 -5 3 0 -3 -3 6 3 13 -2 6 4 -4 8 -2 -4 1 0 6 7 11 5 2 -1 3 -2 -4 -16 2 -16 -2 -9 -11 3 -18 -12 -4 -10 -6 -2 -9 -2 1 6 1 -1 5 -5
6966 -5 9 4 8 13 16 8 -5 4 -3 3 0 0 -2 -2 10 4 5 4 5 -2 -8 -13 -3 -7 -2 0 0 -4 -9 -2 -2 1 -9 0 -7 -4 0 2 -1 -9 -16 2 -3 -7 4 4 1 9 14 6 -13 1
7018 1 5 2 8 2 7 -6 -5 0 -5 -8 -4 -18 -3 -7 -1 -16 -18 -5 -1 -8 -2 -7 -4 -6 -2 -15 -10 -10 -2 0 -8 12 3 1 5 3 12 8 11 -2 -6 5 -3 7 5 7 9 8 -4 -2
7068 -2 5 1 3 1 -8 -4 -8 -1 -5 -15 -17 -8 -3 -5 -3 0 5 -10 10 0 5 5 1 3 2 7 0 6 7 14 14 3 6 13 2 13 -2 2 12 3 0 4 -3 11 -3 13 3 5
7116 5 8 -3 14 -9 0 3 -7 -2 -4 -5 -5 1 7 3 12 7 -3 -1 4 4 3 -1 8 7 5 5 -1 -1 10 13 0 15 2 2 -2 1 1 -3 -1 -3 4 -1 6 4 5 -6 -5 1 -5 -9 -7
7167 -7 0 2 0 -5 1 3 -4 -1 -3 3 -9 0 -3 0 4 -1 15 3 7 14 18 12 7 -1 3 -8 6 8 4 5 -9 -7 -5 0 -11 -7 -8 -4 -6 -2 -9 -3 -3 -5 -3 -12 -1 2 -5 -6 -5 -9 8
7220 8 -3 0 -2 0 2 -6 8 4 2 13 10 12 10 8 5 -2 -5 -8 -2 -3 -1 -5 -9 0 8 0 -9 9 -14 -16 -2 0 1 -3 -9 -5 -4 -2 1 -1 9 1 1 -5 8 2 -1 1 -2 -5 5 4
7272 4 6 6 4 -5 0 -2 -9 5 2 2 1 0 2 5 0 -6 1 4 -2 -6 -8 0 -8 -1 -7 -5 -2 1 0 -2 1 3 11 17 4 9 4 7 16 11 14 10 11 7 3 8 5 1 3 4 2 -1 -1 8 2 0 -4 -5 1
7331 1 2 -2 -2 1 -6 -9 -9 2 -13 -1 -2 2 -1 2 0 3 3 -1 11 9 6 9 14 17 10 13 14 11 -1 3 8 11 2 -5 9 -2 -7 -3 9 -6 5 -11 -7 0 0 -3 -6 -2 5 0
7381 0 2 -11 1 -6 3 -9 0 2 -1 -4 1 5 1 0 5 -2 12 12 7 17 7 7 4 -4 -2 3 -6 -1 -7 -2 -11 -7 -2 4 0 3 -4 -4 -5 -11 -1 2 -6 0 3 -5 7 -1 -3 -6 -3 6 2
7434 2 -1 6 -1 -3 1 -1 5 4 15 10 9 12 -1 3 4 -7 -11 4 1 -7 -14 -6 2 -5 -5 -10 -11 -13 -7 -10 -16 -10 -2 -5 -7 -11 -4 1 3 -5 6 5 2 4 -13 3 -2 2 7 7 0 0 12
7487 12 7 -10 3 -2 5 -2 -7 0 8 4 -5 -3 -7 -1 1 0 -1 -12 -11 4 -8 -5 -15 -2 -3 -2 -3 1 4 11 -5 2 8 4 7 3 14 7 1 2 -10 3 5 -6 -1 -2 -3 5
7535 5 2 7 1 -5 -10 3 -8 -5 -7 -7 -7 -4 -7 -11 -6 -6 -13 -11 2 -3 1 -12 -4 -1 -3 -5 -3 8 11 12 1 13 2 1 3 12 5 1 -1 -4 3 12 3 4 -7 -2 -3 -11 -3 -4 -7 4
7587 4 0 -2 -13 -14 -5 -2 -1 -2 -1 -2 -2 -8 -3 -11 -5 9 -8 9 -10 2 2 11 3 2 10 5 3 8 6 -3 7 -3 9 -6 -3 -2 -10 -4 -4 0 -9 -7 -2 -4 -6 -8 -8 -5 -8 -11 -6
7638 -6 1 -14 -2 -2 6 2 8 0 3 0 7 1 0 14 3 2 2 -5 4 1 4 6 1 -4 2 -3 3 0 -10 0 6 -3 -4 -9 -8 -5 -4 -11 -10 -8 -9 -2 -3 2 -12 2 -7 7 3 9 8 0
7690 0 6 15 13 12 10 8 5 3 2 0 1 9 -2 6 6 0 -7 0 4 1 -2 -10 -4 -5 -7 -7 7 -10 5 -7 -9 2 5 -12 -2 4 -4 2 8 3 1 -3 2 8 6 9 5 10 5 14 5 17
7742 17 4 2 3 5 1 -2 -6 2 -2 -3 7 0 -8 -4 -2 -11 -10 4 -2 5 -5 -13 -4 2 11 -13 -5 1 -5 0 5 -2 7 3 -2 16 9 11 8 6 -12 10 6 -2 3 2 4 6 4 -5 0 -5
7794 -5 7 -4 -6 -3 -12 -5 -7 -14 -7 -10 6 -4 0 2 -2 0 4 7 -1 1 5 3 -11 -3 2 10 4 3 3 4 4 8 0 -2 0 5 7 2 1 4 -2 -7 -1 4 -14 -3 -2 6 -4 -4 7 -7
7846 -7 -1 1 -7 -1 -4 -1 -8 5 14 -4 -1 7 1 7 7 7 25 3 12 3 0 8 5 3 3 -9 5 8 7 -1 -1 -4 3 -2 -2 -7 -3 3 -1 -3 -11 -13 -3 -4 -3 -10 -18 0 -2 -5 12 2
7898 2 -9 -4 0 0 4 12 4 3 3 5 15 14 2 5 -3 -2 2 7 3 -11 -2 -11 -1 -3 -5 -3 -6 1 -8 3 -4 -2 3 -4 -7 -3 -7 -8 -9 -1 -2 0 -6 3 1 -4 -8 0 1 5 2 4 8 11 9
7953 9 4 13 7 0 -2 -2 5 5 -1 6 5 1 -6 -10 -8 0 2 0 -10 -1 -10 -9 4 -12 -5 -1 7 -3 1 3 0 2 7 8 4 5 1 16 9 0 0 11 7 5 6 7 5 -2 -4 -1 11 -9 -1
8006 -1 -5 0 -8 -2 -3 -7 -5 -1 -2 -9 -12 -6 -8 6 -5 -2 8 1 5 1 6 0 5 5 4 -4 1 13 0 6 -2 2 0 1 3 -3 -1 -3 2 -11 3 6 -11 -2 -2 6 -7 -2 -5 4 -18
8057 -18 -7 -11 -5 -4 -12 -1 -5 -3 5 6 6 -1 -2 7 5 10 5 -2 2 21 16 12 0 7 -1 5 2 7 5 2 17 8 -9 1 0 -2 2 -11 -6 -1 -10 -8 -6 -7 -4 3 -8 -3 2 0 3
8108 3 0 2 -3 -3 3 11 11 1 11 -3 3 4 2 9 7 -1 13 15 11 7 -2 0 -2 -2 12 0 -4 -5 -10 -4 1 -5 -5 -12 -5 -2 0 -4 -3 3 3 -1 0 3 -8 0 -1 3 -4 4 5 3 7 8
8162 8 -7 10 8 -1 2 3 2 7 2 -2 6 0 -8 -1 -3 -8 -6 -8 -19 -6 -4 -9 -6 0 -10 -9 -6 -4 9
8191I
##END NTUPLES=NMR FID
##END=
