##TITLE=1H_PhDiP0609
 CDCl3
 8 sc, 
 7.9.2023
##JCAMPDX= 6.0         $$ Bruker NMR JCAMP-DX V2.0
##DATA TYPE= NMR FID
##DATA CLASS= NTUPLES
##ORIGIN= UXNMR, Bruker Analytische Messtechnik GmbH
##OWNER= root
$$ XWIN-NMR		Version 3.5
$$ Thu Sep  7 13:53:41 2023 Russian Standard Time (UT+4h)  she@DPX200
##.OBSERVE FREQUENCY= 200.13135
##.OBSERVE NUCLEUS= ^1H
##.DELAY= (6, 6)
##.ACQUISITION MODE= SIMULTANEOUS
##.ACQUISITION SCHEME= undefined
##.AVERAGES= 8
##.DIGITISER RES= 18
##SPECTROMETER/DATA SYSTEM= spect
##.PULSE SEQUENCE= zg30
##.SOLVENT NAME= CDCl3
##.SHIFT REFERENCE= (INTERNAL, CDCl3, 0, 15.7039)
##AUDIT TRAIL= $$ (NUMBER, WHEN, WHO, WHERE, WHAT)
$$ ##TITLE= Audit trail, XWIN-NMR		Version 3.5
$$ ##JCAMPDX= 5.01
$$ ##ORIGIN= Bruker BioSpin GmbH
$$ ##OWNER= she
$$ F:/spectra/data/she/nmr/H-F/1/audita.txt
$$ ##AUDIT TRAIL=  $$ (NUMBER, WHEN, WHO, WHERE, WHAT)
(   1,<2023-09-07 13:52:22.65 +0400>,<she>,<DPX200>,
      <created by zg, POWCHK disabled, PULCHK disabled
       configuration hash MD5:
       00 E9 B6 7A A2 85 ED C7 34 08 36 98 17 FE 4E 26
       data hash MD5: 16K
       B1 25 41 99 08 F5 D4 83 F5 B5 1B 00 40 66 47 3F>)
$$ ##END=
$$ 
$$ hash MD5
$$ C4 D0 5B F7 39 BB 6B 62 77 9E 4E E9 BB 46 4F 29
##$RELAX= 
##$RELAX= 
##$RELAX= 
##$RELAX= 
##$RELAX= 
##$RELAX= 
$$ Bruker specific parameters
$$ --------------------------
##$DU= <F:/spectra>
##$EXPNO= 1
##$NAME= <H-F>
##$PROCNO= 1
##$TYPE= <nmr>
##$USER= <she>
##$AMP= (0..31)
100 100 100 100 100 100 100 100 100 100 100 100 100 100 100 100 100 100 
100 100 100 100 100 100 100 100 100 100 100 100 100 100 
##$AQSEQ= 0
##$AQ_mod= 1
##$AUNM= <au_zg>
##$AUTOPOS= <>
##$BF1= 200.13
##$BF2= 200.13
##$BF3= 200.13
##$BF4= 200.13
##$BF5= 200.13
##$BF6= 200.13
##$BF7= 200.13
##$BF8= 200.13
##$BYTORDA= 1
##$CFDGTYP= 0
##$CFRGTYP= 5
##$CHEMSTR= <none>
##$CNST= (0..31)
1 1 145 1 1 1 1 1 1 1 1 1 1 1 1 1 1 1 1 1 1 1 1 1 1 1 1 1 1 1 1 1 
##$CPDPRG= <>
##$CPDPRG1= <>
##$CPDPRG2= <>
##$CPDPRG3= <>
##$CPDPRG4= <mlev>
##$CPDPRG5= <mlev>
##$CPDPRG6= <mlev>
##$CPDPRG7= <mlev>
##$CPDPRG8= <mlev>
##$CPDPRGB= <>
##$CPDPRGT= <>
##$D= (0..31)
0 1.2 0 0 0 0 0 0 0 0.06 0 0.03 0 0 0 0 0.0002 0 0 0 0 0 0 0 0 0 0 0 0 
0 0 0 
##$DATE= 1694080342
##$DBL= (0..7)
120 120 120 120 120 120 120 120 
##$DBP= (0..7)
150 150 150 150 150 150 150 150 
##$DBP07= 0
##$DBPNAM0= <>
##$DBPNAM1= <>
##$DBPNAM2= <>
##$DBPNAM3= <>
##$DBPNAM4= <>
##$DBPNAM5= <>
##$DBPNAM6= <>
##$DBPNAM7= <>
##$DBPOAL= (0..7)
0.5 0.5 0.5 0.5 0.5 0.5 0.5 0.5 
##$DBPOFFS= (0..7)
0 0 0 0 0 0 0 0 
##$DE= 6
##$DECBNUC= <off>
##$DECIM= 32
##$DECNUC= <off>
##$DECSTAT= 4
##$DIGMOD= 1
##$DIGTYP= 9
##$DL= (0..7)
0 120 120 120 120 120 120 120 
##$DP= (0..7)
150 150 150 150 150 150 150 150 
##$DP07= 0
##$DPNAME0= <>
##$DPNAME1= <>
##$DPNAME2= <>
##$DPNAME3= <>
##$DPNAME4= <>
##$DPNAME5= <>
##$DPNAME6= <>
##$DPNAME7= <>
##$DPOAL= (0..7)
0.5 0.5 0.5 0.5 0.5 0.5 0.5 0.5 
##$DPOFFS= (0..7)
0 0 0 0 0 0 0 0 
##$DQDMODE= 0
##$DR= 18
##$DS= 0
##$DSLIST= <SSSSSSSSSSSSSSS>
$$ [...]
##$SUBNAM2= <"">
##$SUBNAM3= <"">
##$SUBNAM4= <"">
##$SUBNAM5= <"">
##$SUBNAM6= <"">
##$SUBNAM7= <"">
##$SUBNAM8= <"">
##$SUBNAM9= <"">
##$SW= 18.05172834244
##$SWIBOX= (0..15)
0 0 2 0 0 0 0 0 0 0 0 0 0 0 0 0 
##$SW_h= 3612.71676300578
##$TD= 16384
##$TD0= 1
##$TE= 0
##$TE2= 300
##$TE3= 300
##$TEG= 300
##$TL= (0..7)
0 120 120 120 120 120 120 120 
##$TP= (0..7)
150 150 150 150 150 150 150 150 
##$TP07= 0
##$TPNAME0= <>
##$TPNAME1= <>
##$TPNAME2= <>
##$TPNAME3= <>
##$TPNAME4= <>
##$TPNAME5= <>
##$TPNAME6= <>
##$TPNAME7= <>
##$TPOAL= (0..7)
0.5 0.5 0.5 0.5 0.5 0.5 0.5 0.5 
##$TPOFFS= (0..7)
0 0 0 0 0 0 0 0 
##$TUNHIN= 0
##$TUNHOUT= 0
##$TUNXOUT= 0
##$USERA1= <user>
##$USERA2= <user>
##$USERA3= <user>
##$USERA4= <user>
##$USERA5= <user>
##$V9= 5
##$VALIST= <valist>
##$VCLIST= <CCCCCCCCCCCCCCC>
##$VD= 0
##$VDLIST= <DDDDDDDDDDDDDDD>
##$VPLIST= <PPPPPPPPPPPPPPP>
##$VTLIST= <TTTTTTTTTTTTTTT>
##$WBST= 1024
##$WBSW= 4
##$XGAIN= (0..3)
0 0 0 0 
##$XL= 0
##$YL= 0
##$YMAX_a= 293399
##$YMIN_a= -246229
##$ZGOPTNS= <>
##$ZL1= 120
##$ZL2= 120
##$ZL3= 120
##$ZL4= 120
##$ABSF1= 10
##$ABSF2= 0
##$ABSG= 5
##$ABSL= 3
##$ALPHA= 0
##$AQORDER= 0
##$ASSFAC= 0
##$ASSFACI= 0
##$ASSFACX= 0
##$ASSWID= 0
##$AUNMP= <proc_1d>
##$AZFE= 0.1
##$AZFW= 0.1
##$BCFW= 1
##$BC_mod= 2
##$BYTORDP= 1
##$COROFFS= 0
##$CY= 11.3945322036743
##$DATMOD= 1
##$DC= 2
##$DFILT= <>
##$DTYPP= 0
##$F1P= 15.7292609196834
##$F2P= 12.9074282941183
##$FCOR= 0.5
##$FTSIZE= 0
##$FT_mod= 4
##$GAMMA= 1
##$GB= 0.15
##$INTBC= 1
##$INTSCL= 1
##$ISEN= 128
##$LB= 0.24
##$LEV0= 0
##$LPBIN= 0
##$MAXI= 10000
##$MC2= 0
##$MEAN= 0
##$ME_mod= 0
##$MI= 1.114404
##$NCOEF= 0
##$NC_proc= 0
##$NLEV= 6
##$NOISF1= 3.799351
##$NOISF2= 2.8
##$NSP= 1
##$NTH_PI= 0
##$NZP= 0
##$OFFSET= 15.70392
##$PC= 1
##$PHC0= -21203.13
##$PHC1= 9.45271
##$PH_mod= 1
##$PKNL= yes
##$PPARMOD= 0
##$PSCAL= 0
##$PSIGN= 0
##$REVERSE= no
##$SF= 200.130013532006
##$SI= 16384
##$SIGF1= 3
##$SIGF2= 2
##$SINO= 400
##$SIOLD= 16384
##$SREGLST= <1H.CDCl3>
##$SSB= 0
##$STSI= 0
##$STSR= 0
##$SW_p= 3612.71676300578
##$SYMM= 0
##$S_DEV= 0
##$TDeff= 0
##$TDoff= 0
##$TI= <>
##$TILT= no
##$TM1= 0
##$TM2= 0
##$TOPLEV= 0
##$USERP1= <user>
##$USERP2= <user>
##$USERP3= <user>
##$USERP4= <user>
##$USERP5= <user>
##$WDW= 1
##$XDIM= 8192
##$YMAX_p= 0
##$YMIN_p= 0
$$ End of Bruker specific parameters
$$ ---------------------------------
##NTUPLES= NMR FID
##VAR_NAME=  TIME,          FID/REAL,        FID/IMAG
##SYMBOL=    X,             R,               I
##VAR_TYPE=  INDEPENDENT,   DEPENDENT,       DEPENDENT
##VAR_FORM=  AFFN,          ASDF,            ASDF
##VAR_DIM=   8192,          8192,            8192
##UNITS=     SECONDS,       ARBITRARY UNITS, ARBITRARY UNITS
##FACTOR=    0.0002768,     1,               1
##FIRST=     0,             0,               0
##LAST=      2.2672688,     0,               0
##MIN=       0,             -246229,         0
##MAX=       2.2672688,     293399,          0
$$ Real data points
##PAGE= N=1
##DATA TABLE= (X++(R..R)), XYDATA
$$ plain form
0 0 0 0 0 0 0 0 0 0 0 0 0 8 -8 8 -8 16 -16 16 -24 24 -32 40 -48 56 -64 72 -88 101 -116 133 -152 173 -196
33 -196 221 -248 280 -314 351 -394 437 -485 541 -599 663 -732 807 -892 982 -1083 1192 -1314
51 -1314 1447 -1597 1761 -1949 2159 -2398 2678 -3002 3386 -3852 4427 -5162 6131 -7472 9463
66 9463 -12715 18898 -34735 157746 252664 -140279 87302 133594 -231121 -107666 177479
77 177479 -109273 -148199 120985 -68247 -246229 45834 38217 -183584 -15089 85428 -137844
88 -137844 -69520 134929 14197 -55511 118275 74690 -74148 53013 145796 -15895 -14756
99 -14756 114899 -10825 -102850 80657 76859 -92815 16148 81760 -130255 -87211 101489
110 101489 -51094 -109825 97257 -2840 -151512 64471 89778 -105356 25298 101918
$$ packed form
0@%%%%%%%%%%%Qj6J6j6K4l2L2m0M8n6P2q8J04j20J36j60J89k17K49k85L25l69
33a96M17m69N28n94O65p45Q31r22J026j140J262j395J539j699J874k065K275k506
51a314K761l044L358l710M108m557N076n680O388p238Q279r589J1293j3603J6935
66I463k2178L1613n3633J92481R4918l92943K27581M6292l64715J23455K85145
77A77479k86752l8926K69184j89232j77982K92063p617k21801J68495J00517k23272
88a37844O8324K04449j20732o9708J73786m3585j48838J27161R2783j61691J139
99a4756J29655j25724r2025J83507l798j69674J08963O5612k12015M3044J88700
110A01489j52583n8731K07082j00097j48672K15983K5307j95134J30654P6620
$$ plain form
120 101918 -122593 -67236 115035 -25728 -43851 132152 8523 -115599 37896 24380
130 24380 -83631 47991 88407 -48269 -9743 55700 -34107 -22155 66140 16907 -22312
141 -22312 29890 15300 -26306 3857 17535 -18845 -27831 -6046 -9762 -29970 -11572 4502
153 4502 -36142 -43279 -47 -16523 -28417 29346 20504 -26817 18392 34034 -13976 31128 68471
166 68471 2035 11194 55226 -6259 -7370 56469 4066 -27856 28018 -13757 -57130 9242
178 9242 -3613 -60504 -9655 -7820 -70584 -21753 15325 -37920 -7635 35183 -22375 -17013 38008
191 38008 3656 -2545 51654 29461 1274 39300 32832 -1233 20357 24988 -8405 -4919 8159
204 8159 -8586 -14789 -5381 -8836 -22593 -24880 -11173 -14549 -27906 -7091 1629 -26266 -9009
$$ packed form
120A01918k24511N5357J82271j40763j8123J76003j23629j24122J53495j3516
130B4380j08011J31622M0416j36676L8526O5443q9807J1952Q8295m9233l9219
141b2312N2202j4590m1606L0163J3678l6380q986K1785l716k0208J8398J6074
153D502m0644p137M3232j6476j1894N7763q842m7321M5209J5642m8010M5104L7343
166F8471o6436R159M4032o1485j111O3839n2403l1922N5874m1775m3373O6372
178I242j2855n6891N0849J835o2764M8831L7078n3245L0285M2818n7558N362N5021
191C8008l4352o201N4199k2193k8187L8026o468l4065K1590M631l3393L486J3078
204H159j6745o203R408l455j3757k287J3707l376j3357K0815Q720k7895J7257
$$ plain form
217 -9009 20733 -9909 -7807 34676 3947 -19660 30472 18068 -23424 25387 34204 -24868 6371
230 6371 37668 -22114 -12467 36723 -11835 -28354 26227 1022 -33100 16134 15917 -29271 407
243 407 20068 -21141 -12173 19333 -6965 -18000 9753 3027 -17681 -2095 9788 -9534 -12216
256 -12216 9167 1797 -16361 4246 14917 -11851 -4030 23081 -902 -11504 25201 12982
268 12982 -17084 17271 22524 -19574 3298 27503 -15721 -11851 24860 -8671 -24645 15619
280 15619 -446 -31178 3313 7186 -28864 -6746 13848 -17724 -12164 15840 -4165 -13120 12801
293 12801 7957 -8636 7899 15761 -1181 2327 16681 5635 -2982 10252 9209 -5720 329
306 329 9345 -4844 -8917 6178 -1894 -15051 706 2239 -15804 -4810 5984 -11388 -8884
$$ packed form
217i009K9742l0642K102M2483l0729k3607N0132j2404m1492M8811Q817n9072L1239
230F371L1297n9782R647M9190m8558j6519N4581k5205l4122M9234k17m5188K9678
243D07J9661m1209Q968L1506k6298j1035K7753o726k0708J5586J1883j9322k682
256a2216K1383p370j8158K0607J0671k6768P821K7111k3983j0602L6705j2219
268A2982l0066L4355N253m2098K2872K4205m3224L870L6711l3531j5974M0264
280A5619j6065l0732L4491L873l6050K2118K0594l1572N560K8004k0005q955K5921
293A2801m844j6593J6535P862j6942L508J4354j1046q617J3234j043j4929O049
306C29R016j4189m073J5095q072j3157J5757J533j8043J0994J0794j7372K504
$$ plain form
319 -8884 7462 -4604 -10330 7278 2986 -8331 6359 9352 -4694 3592 11069 -1730 -251
332 -251 8873 1217 -1777 6268 3930 -1653 2696 3265 -3073 -2682 -188 -3834 -4781 -1445 -1228 -2517
348 -2517 -1247 311 -1519 -3150 -1278 -1865 -3849 -921 985 -140 2093 3960 2395 1380 1480 211
364 211 -1444 -850 271 91 1429 2958 2410 1866 1451 110 -1696 -2256 -1356 -1521 -384 2597 1963 1796
382 1796 3402 8 -2145 -386 -3483 -5035 -505 -1148 -3101 2231 2288 -3617 -187 1235 -7341 -4182
398 -4182 2484 -4725 -2123 8456 2051 -361 9660 4191 -3819 5106 4694 -5057 2401 8230 -1708
413 -1708 605 8353 -975 -5270 1800 -3331 -10184 -3890 -1379 -6846 -4452 2480 -1550 -6425 466
428 466 1593 -6810 -1787 6554 -1770 -2422 11195 6020 -3203 10720 10301 -7688 2672 11436 -8092
$$ packed form
319h884J6346j2066n726J7608m292j1317J4690K993j4046Q286P477j2799J479
332b51R124p656k994Q045k338n583M349N69o338L91K494l646r47L336K17j289
348b517J270J558j830j631J872n87j984K928J906j125K233J867j565j015J00j269
364B11j655N94J121j80J338J529n48n44m15j341j806n60R00j65J137K981o34j67
382A796J606l394k153J759l097j552M530o43j953N332N7n905L430J422q576L159
398d182O666p209K602J0579o405k412J0021n469q010Q925m12r751P458N829r938
413a708K313P748r328m295P070n131o853O294K511n467K394O932m030m875O891
428D66J127q403N023Q341q324o52J3617n175r223J3923m19j7989J0360Q764j9528
$$ plain form
443 -8092 -2981 13975 -4325 -9634 10502 -1405 -15045 5728 3483 -16903 -1290 6882 -13218
456 -13218 -3940 11933 -5650 -7203 8932 -2007 -8616 7182 5469 -4922 2737 5541 -3534
469 -3534 -1068 6211 2649 -1022 1806 2524 -1968 -1711 5372 3658 -4055 1600 3957 -6590 -665
484 -665 9460 -2295 -4804 5896 -4224 -10823 4182 1902 -9473 1012 2161 -11194 -2566
497 -2566 5797 -4900 -2111 4183 -5055 -3677 5092 2666 4259 7549 1977 2311 4605 1192 6464
512 6464 8816 -2074 -201 4616 -7187 -2126 11614 -3653 -9367 4242 -10510 -19616 4023
525 4023 1196 -14597 3749 5576 -16893 -2913 12602 -6888 -3235 15399 -1615 -7714 14944
538 14944 10168 -2595 11480 11523 -6215 -1028 9962 588 -3992 5661 1295 -11801 -4558 5098
$$ packed form
443h092N111J6956j8300n309K0136j1907j3640K0773k245k0386J5613Q172k0100
456a3218R278J5873j7583j553J6135j0939o609J5798j713j0391P659K804r075
469c534K466P279l562l671K828P18m492K57P083j714p713N655K357j0547N925
484f65J0125j1755k509J0700j0120o599J5005k280j1375J0485J149j3355Q628
497b566Q363j0697K789O294r238J378Q769k426J593L290n572L34K294l413N272
512F464K352j0890J873M817j1803N061J3740j5267n714J3609j4752r106K3639
525D023k827j5793J8346J827k2469J3980J5515j9490L653J8634j7014o099K2658
538A4944m776j2763J4075M3j7738N187J0990r374m580R653m366j3096P243R656
$$ plain form
552 5098 -6370 -9404 4034 -4831 -18875 75 7222 -12893 -1609 13918 -11654 -10789 18949
565 18949 2431 -10577 18423 7781 -20167 7581 18788 -9582 6814 24827 -10602 -13980
577 -13980 13713 -4854 -13502 17258 8396 -16374 517 4290 -16604 -5692 10419 -4846 -9469
590 -9469 4381 -812 -10743 -239 5854 -5158 -6084 6514 3751 -6029 5704 10884 -7929 -4282
604 -4282 13622 -157 -4869 17619 7032 -13550 6107 10107 -12628 2421 17408 -9870 -11044
617 -11044 10893 -6188 -14040 11144 2940 -17860 -2675 1762 -14403 -2957 12415 -1682 -8411
630 -8411 2265 -1978 -9557 3744 14155 4433 165 8847 2687 -9191 5378 15490 -2234
643 -2234 613 16584 -4031 -13605 11532 2185 -18658 5658 9711 -19637 -3665 14503 -16985
$$ packed form
552E098j1468l034J3438q865j4044J8950P147k0115J1284J5527k5572Q65K9738
565A8949j6518j3008K9000j0642k7948K7748J1207k8370J6396J8013l5429l378
577a3980K7693j8567q648L0760q862k4770J6891L773k0894J0912J6111j5265m623
590i469J3850n193r931J0504O093j1012r26J2598k763r780J1733N180j8813L647
604d282J7904j3779m712K2488j0587k0582J9657M000k2735J5049J4987k7278j174
617a1044K1937j7081p852K5184q204k0800J5185M437j6165J1446J5372j4097o729
630h411J0676m243p579J3301J0411r722m268Q682o160j1878J4569J0112j7724
643b234K847J5971k0615r574K5137r347k0843K4316M053k9348J5972J8168l1488
$$ plain form
656 -16985 -16323 12875 -8158 -18440 15835 7579 -18099 5308 10658 -16511 -404 21663 -1027
669 -1027 -4161 17375 2437 -12290 10369 13090 -6915 2082 12107 -7479 -10355 9994 3729
682 3729 -11581 3086 5703 -17831 -9799 10486 -7060 -11569 12683 -16 -20020 4708 9301
695 9301 -15742 2040 18968 -10412 -7761 19237 -2207 -11683 18310 7731 -13801 10612 13008
708 13008 -13223 1082 14274 -9951 -6747 13986 -1864 -9604 8577 18 -14590 -636 2987
721 2987 -8964 -1747 6416 -4322 -7131 2185 -386 -5907 1949 5081 -3190 -1898 5405 1007 -1761
736 -1761 7062 6007 -3130 2410 5969 -3635 -93 8105 -1135 -2849 5981 -1171 -5999 3455 -93
751 -93 -7471 576 277 -7901 -790 2082 -6329 -1031 3213 -5528 -1571 4549 -3749 -1466 6349 -1152
$$ packed form
656a6985O62K9198k1033j0282L4275q256k5678K3407N350k7169J6107K2067k2690
669a027l134K1536j4938j4727K2659K721k0005Q997J0025j9586k876K0349o265
682C729j5310J4667K617k3534Q032K0285j7546m509K4252j2699k0004K4728M593
695I301k5043J7782J6928k9380K651K6998k1444r476K9993j0579k1532K4413K396
708A3008k6231J4305J3192k4225L204K0733j5850p740J8181q559j4608J3954L623
721B987j1951P217Q163j0738k809R316k571n521P856L132q271J292P303m398k768
736a761Q823j055r137N540L559r604L542Q198r240j714Q830p152m828R454l548
751i3p378Q047k99q178P111K872q411N298M244q741L957O120q298K283P815p501
$$ plain form
767 -1152 -1319 7886 1674 -2407 7044 2798 -4576 4837 4753 -4908 2124 5516 -5294 -2220 4625 -4021
783 -4021 -5342 3215 -1606 -7145 581 1375 -6204 -1678 3925 -3057 -3792 4299 1120 -4329 3138 5497
799 5497 -3428 -23 8067 -1019 -3902 8079 2653 -6903 5101 6071 -8203 -205 8086 -6960
813 -6960 -5787 8609 -2919 -9650 7134 2153 -11360 3001 6318 -10104 -1647 9084 -5528
826 -5528 -5182 9515 331 -7465 6685 4932 -7839 1863 7646 -5253 -2444 8177 -913 -5458
840 -5458 5604 2941 -7000 743 5407 -5798 -3777 6670 -1714 -6439 5346 2577 -7708 1450
854 1450 5534 -6695 -2749 7621 -2714 -5573 7618 1883 -7252 4638 4991 -7406 269 6884
868 6884 -4783 -3101 7448 -904 -5585 5331 2091 -6674 1674 3952 -5518 -1256 5004 -2334
$$ packed form
767a152j67R205o212m081R451m246p374R413q4r661P032L392j0810L074O845q646
783d021j321Q557m821n539P726P94p579M526N603o982p35Q091l179n449P467K359
799E497q925L405Q090r086k883J1981n426r556J2004R70j4274P998Q291j5046
813f960J173J4396j1528o731J6784m981j3513J4361L317j6422Q457J0731j4612
826e528L46J4697r184p796J4150j753j2771R702N783j2899K809J0621r090m545
840e458J1062k663r941P743M664j1205K021J0447q384m725J1785k769j0285R158
854A450M084j2229L946J0370j0335k859J3191n735r135J1890L53j2397P675O615
868F884j1667J682J0549q352m681J0916l240q765Q348K278r470M262O260p338
$$ plain form
882 -2334 -3042 4448 615 -4308 1992 2524 -3899 -231 3919 -1740 -1721 3720 325 -2727 2067 1777
898 1777 -3193 -292 2418 -2221 -1597 2845 -635 -2601 1818 207 -2948 722 1331 -2193 -222 2004
914 2004 -917 -493 2489 252 -812 1723 365 -994 1386 956 -609 831 517 -913 -57 335
930 335 -892 -520 -21 -1567 -1123 313 -1096 -895 798 -831 -1408 649 69 -753 1273 1266 -803 459
948 459 1873 -149 360 2740 218 -1034 1777 462 -1405 1493 1250 -2040 -415 902 -2146 -1309
964 -1309 1816 -1215 -2597 944 -842 -2851 1206 968 -2204 344 1315 -1865 -119 2848 -4 -575
980 -575 2426 205 -1438 2350 1794 -1047 1467 1448 -1920 -118 2027 -790 -950 1476 -1063 -2873
996 -2873 754 353 -2608 445 941 -3375 -1201 1951 -1570 -1420 2815 -401 -3135 2252 1860 -2689
$$ packed form
882b334p08P490l833m923O300N32o423L668M150n659J9N441l395l052M794k90
898A777m970K901K710m639O24M442l480j966M419j611l155L670O09l524J971K226
914B004k921M24K982k237j064K535j358j359K380m30j565J440l14j430Q56L92
930C35j227L72M99j546M44J436j409K01J693j629n77K057n80q22K026pk069J262
948D59J414k022N09K380k522j252K811j315j867K898k43l290J625J317l048Q37
964a309L125l031j382L541j786k009M057k38l172K548R71l180J746K967k852n71
980e75L001k221j643L788n56k841K514j9l368J802K145k817j60K426k539j810
996b873L627m01k961L053M96m316K174L152l521J50M235l216k734N387l92m549
$$ plain form
1012 -2689 2410 4012 -3068 -187 4785 -1723 -1548 5475 -33 -4346 3543 1838 -5319 1988 4211
1027 4211 -5750 -1874 4663 -4515 -4280 5476 -1205 -6299 3620 1838 -6673 1679 5518 -5036 -1669
1042 -1669 6715 -2228 -4040 7023 2169 -5354 4053 4722 -5654 24 6958 -3382 -4077 6680
1056 6680 -346 -7231 4273 3426 -8049 203 5993 -6606 -4141 7318 -2430 -7258 6738 2415
1070 2415 -8820 3443 6440 -7868 -568 9403 -4184 -4417 9160 -95 -7721 6488 4552 -8128
1084 -8128 2282 7290 -7084 -2860 8013 -3089 -5863 6574 832 -8038 2571 4339 -6750
1097 -6750 -1107 6446 -3846 -4758 6042 515 -6008 3656 3755 -6014 -159 6265 -2787 -2906 6525
1112 6525 -38 -6104 4022 3479 -5421 1851 5717 -4837 -2776 5413 -1716 -4237 5117 1185 -6227
$$ packed form
1012b689N099J602p080K881M972o508J75P023n508m313P889j705p157P307K223
1027D211r961L876O537r178K35R756o681n094R919j782q511Q352L839j0554L367
1042a669Q384q943j812J1063m854p523R407O69j0376N678O934j0340o95J0757
1056F680p026o885J1504q47j1475Q252N790j2599K465J1459r748m828J3996m323
1070B415j1235J2263K997j4308P300R971j3587k33J3577r255p626J4209j936j2680
1084h128J0410N008j4374M224J0873j1102k774J2437n742q870J0609J768j1089
1097f750N643P553j0292r12J0800n527o523R664R9r769N855O424r052j19R431
1112F525o563o066J0126n43q900P272L866j0554K061Q189p129k521R354l932p412
$$ plain form
1127 -6227 1588 2865 -4901 333 4720 -3211 -2974 2991 -1219 -2962 3404 2200 -2715 442 1714
1142 1714 -2255 -448 2871 424 -753 1236 565 -1138 -19 1546 -2 -1148 765 422 -1610
1157 -1610 36 989 -1389 -1273 889 -123 -1051 1055 524 -2009 -757 426 -719 554 1990 653
1173 653 -275 -379 -214 -72 169 1217 1398 -621 -727 805 -403 -924 1871 900 -2648 -203 1065
1190 1065 -2865 -320 3366 -1452 -2038 2552 -1067 -3514 2397 1810 -3042 1138 3105 -2880 -905
1205 -905 3850 -949 -2075 3438 850 -3068 1500 2100 -2894 -753 3023 -831 -2176 2642 602
1220 602 -3968 76 1927 -2943 -942 3916 -675 -3348 2468 937 -4377 1470 4283 -3036 -875
1235 -875 4768 -2005 -3429 4727 1280 -4199 2896 3183 -4992 -467 4654 -3033 -2511 4985 -887 -4854
$$ packed form
1127f227P815J277p766N234M387p931K37N965m210j743O366j204m915L157J272
1142A714l969J807L319k447j177J989o71j703J119J565j548j146J913l43k032
1157a610J646R53k378J16K162j012r28K106n31k533J252J183j145J273J436j337
1173F53r28j04J65J42K41J048J81k019j06J532j208n21K795r71l548K445J268
1190A065l930K545L686m818n86M590l619k447N911n87m852M180J967n985J975
1205i05M755m799j126N513k588l918M568O00m994K141L776l854j345M818k040
1220F02m570M044J851m870K001M858m591k673N816j531n314N847K813p319K161
1235h75N643o773j424Q156l447n479P095K87q175M525N121p687N22P496n872l967
$$ plain form
1251 -4854 2824 1389 -4964 704 3730 -3414 -1961 4097 -1129 -3806 3277 1972 -3790 1316 3983
1266 3983 -2702 -1518 4432 -360 -3440 3643 2452 -4325 985 4065 -3842 -1913 4797 -1627 -4151
1281 -4151 3636 744 -5543 1430 3257 -4819 -1026 4570 -2940 -3312 4344 -90 -4099 3205 2615
1296 2615 -3786 841 4128 -2245 -1255 4424 13 -2753 2932 1622 -3212 733 2817 -2278 -1567
1311 -1567 2655 -943 -3436 1359 790 -3784 -154 2276 -2660 -1775 2707 -869 -2816 2247 1373 -2666
1327 -2666 1355 3144 -1781 -122 3607 -509 -1289 3000 778 -1797 1593 1515 -1951 -241 1471 -1525
1343 -1525 -1585 1028 -656 -2077 -21 -99 -1705 -774 346 -613 -946 541 575 -774 281 1353 2
1360 2 -101 1603 949 -398 1154 1578 -452 175 1623 -268 -705 1189 -13 -1368 218 221 -1432 -797
$$ packed form
1251d854P678j435o353N668L026p144J453O058n226k677P083j305n762N106K667
1266C983o685J184N950m792l080P083j191o777N310L080p907J929O710o424k524
1281d151P787k892o287O973J827q076L793N596p510l72P656m434m009P304n90
1296B615o401M627L287o373R90N679m411k766N685j310m834L945K084n095P11
1311a567M222l598k493M795n69m574L630K430m936Q85M482l576j947N063q74m039
1327b666M021J789m925J659L729m116p80M289k222k575L390p8l466J710J712k996
1343a525o0K613j684j421K056p8j606R31J120r59l33J487L4j349J055J072j351
1360Bj03J704o54j347J552M24k030O27J448j891m37J894j202j355J586Lj653O35
$$ plain form
1378 -797 341 -885 -1426 109 -320 -1502 -181 483 -824 -559 883 304 -724 841 1389 -456 243
1395 243 1915 11 -385 1999 824 -927 1195 1292 -1378 -107 1640 -1001 -1295 1271 -628 -2327
1411 -2327 531 141 -2364 -382 707 -1865 -1289 1142 -475 -1521 1174 782 -1468 734 1961 -431
1427 -431 229 2222 423 -686 1708 1562 -798 692 1804 -1118 -917 1603 -546 -1838 773 -98
1443 -98 -2673 -578 746 -2019 -1266 1313 -1135 -2118 1159 375 -1613 1150 1614 -1237 97 2215
1459 2215 77 -223 2459 930 -1218 1233 1383 -1090 386 1638 -1016 -1256 879 -386 -1681 530
1475 530 447 -2129 -826 633 -1445 -889 1369 -405 -1532 744 384 -1257 690 1714 -840 -346
1491 -346 1575 -251 -559 1973 747 -962 831 727 -1092 295 1504 -439 -601 942 -504 -1221
$$ packed form
1378g97J138j226n41J535m29j182J321O64j307K65J442n79j028J565N48j845O99
1395B43J672j904l96K384j175j751K122R7k670J271J747k641k94K566j899j699
1411b327K858l90k505J982J089k572N76K431j617j046K695l92k250K202J227k392
1427d31O60J993j799j109K394j46k360J490J112k922K01K520k149j292K611q71
1443i8k575K095J324k765P53K579k448r83L277p84j988K763M64k851J334K118
1459B215k138l00K682j529k148K451J50k473J476J252k654k40K135j265j295K211
1475E30q3k576J303J459k078N56K258j774j127K276l60j641J947J024k554M94
1491c46J921j826l08K532j226j709J793j04j819J387J209j943j62J543j446p17
$$ plain form
1507 -1221 897 331 -1322 50 119 -1484 -468 822 -547 -803 415 -493 -1265 457 502 -664 441
1524 441 681 -675 153 1210 300 210 1166 223 -541 822 896 -249 646 665 -1007 -380 483 -651 -579
1543 -579 376 -758 -1382 -236 -192 -1088 84 339 -1164 -526 512 -388 -86 1210 374 -414 769 769 -114
1562 -114 827 1379 -193 -129 953 -193 -453 1007 241 -994 -63 5 -1166 -383 635 -732 -991 277
1580 277 -523 -1063 578 432 -744 84 444 -598 -16 1032 318 -302 580 292 -459 489 868 -90 1
1599 1 396 -119 -281 374 497 -240 -148 144 -430 -476 384 161 -501 -246 82 -623 -509 570 55 -696 132
1620 132 173 -933 -48 830 -254 -429 716 32 -656 644 1021 -499 120 1105 -428 -482 1325 412
1638 412 -885 660 714 -1257 -212 1354 -749 -1146 1082 -369 -1933 785 806 -1770 -82 1326
$$ packed form
1507a221K118n66j653J372O9j603J016J290j369k56J218r08p72J722M5j166J105
1524D41K40j356Q28J057r10r0R56r43p64J363P4j145Q95J9j672O27Q63j134P2
1543e79R55j134o24J146M4q96J172K55j503O38J038r00L02J296q36p88J183%q83
1562a14R41N52j572O4J082j146k60J460p66j235R31O8j171P83J018j367k59J268
1580B77q00n40J641j46j176Q28L60j042N82J048p14o20Q82k88p51R48L79r58R1
1599AL95n15j62O55J23p37R2K92n74m6Q60k23o62K55L28p05J14J079n15p51Q28
1620A32M1j106Q85Q78j084j75J145o84o88J300L77j520O19R85j533n4J807r13
1638D12j297J545N4j971J045J566k103l97K228j451j564K718K1k576J688J408
$$ plain form
1654 1326 -1578 -1104 1917 -162 -1622 1743 781 -2190 908 2024 -1482 -107 2495 -863 -1498 2202
1670 2202 447 -2042 1322 1541 -2354 -187 2109 -1618 -1353 2124 -415 -2409 1274 920 -2491 143
1686 143 2012 -1912 -1186 2418 -525 -1969 2049 828 -2331 870 2062 -1806 -368 2688 -898
1701 -898 -1813 2405 510 -2242 1498 1602 -2421 -17 2222 -1554 -1214 2295 -436 -2300 1469 628
1717 628 -2494 493 1594 -1938 -643 1857 -953 -1513 1577 277 -1718 933 1330 -1549 -67 1706
1733 1706 -785 -688 1719 196 -1086 1025 872 -1168 218 1428 -658 -509 1236 -341 -1198 698
1749 698 97 -1143 181 433 -1146 -563 444 -726 -729 615 -176 -736 431 48 -537 340 475 -68
1767 -68 483 593 108 395 517 56 351 584 -1 84 544 -363 -430 374 -448 -665 216 -399 -1059 -57 -133
$$ packed form
1654A326k904M74L021k079j460L365r62k971L098J116l506J375K602l358o35L700
1670B202j755k489L364K19l895K167K296l727K65L477k539j994L683l54l411K634
1686A43J869l924P26L604k943j444M018j221l159L201J192l868J438L056l586
1701h98r15M218j895k752L740J04m023K404K239l776L40L509k731j864L769q41
1717F28l122K987J101l532J295K500k810n60L090j300j995K651L97k879J482J773
1733A706k491R7K407j523j282K111j53k040J386J210k086J49J745j577q57J896
1749F98o01j240J324K52j579N83J007j170lJ344p91n60J167l83n85Q77J35n43
1767f8N51J10m85K87J22m61K95K33n85Q5M60r07o7Q04q22k17Q81o15o60J002p6
$$ plain form
1788 -133 -1113 -357 445 -800 -605 830 -200 -697 1056 609 -666 687 1252 -506 67 1589 107
1805 107 -584 1352 450 -1306 613 974 -1400 -269 1276 -1057 -1411 1071 -353 -2057 678 711 -2049
1822 -2049 33 1554 -1613 -908 1944 -466 -1486 1816 917 -1770 868 1887 -1535 -194 2359
1837 2359 -633 -1184 2150 386 -1972 1132 1246 -1939 -219 1960 -1194 -1457 1889 -327 -2317 965
1853 965 813 -2361 24 1766 -1595 -1244 1910 -499 -2187 1572 972 -2153 774 2092 -1582 -393
1869 -393 2475 -439 -1310 2226 839 -1785 1219 1813 -1809 -153 2069 -1205 -1349 1794 -314 -2203
1885 -2203 805 631 -2322 -353 1355 -1628 -1257 1557 -549 -1647 1391 707 -1629 615 1684 -879
1901 -879 -198 2104 106 -846 1711 805 -1307 925 1337 -1148 -189 1350 -819 -1290 879 -138 -1688
$$ packed form
1788a33r80P56Q02j245J95J435j030m97J753m47j275J353N65j758N73J522j482
1805A07o91J936r02j756J919L61k374J131J545k333l54K482j424j704K735L3k760
1822b049K082J521l167P05K852k410j020L302q99k687K638J019l422J341K553
1837B359k992n51L334j764k358L104J14l185J720K179l154k63L346k216j990L282
1853I65j52l174K385J742l361L51L154k409j688L759o00l125K927J318l674J189
1869c93K868k914q71L536j387k624L004N94l622J656K222l274j44L143k108j889
1885b203L008j74k953J969J708k983L71K814k106j098L038o84k336K244J069k563
1901h79O81K302j998r52K557r06k112K232M12k485R59J539k169m71K169j017j550
$$ plain form
1918 -1688 344 434 -1568 -408 732 -1112 -840 868 -240 -992 776 567 -800 288 1026 -368
1934 -368 -3 1192 179 -201 848 431 -391 312 630 -204 -154 522 -204 -525 202 71 -589 -98 -35 -648
1954 -648 -474 19 -254 -517 -166 -86 -543 -203 210 -136 -24 250 109 -48 187 471 303 245 533 373 61
1975 61 431 565 191 116 308 -34 -362 99 104 -576 -273 -67 -760 -681 17 -429 -643 -35 -198 -711 -176 383
1997 383 -199 45 696 17 -150 785 608 67 710 733 -114 109 745 166 -105 535 -1 -717 -32 -22 -656
2018 -656 -292 32 -746 -833 -151 -309 -632 76 75 -666 -154 354 -130 162 738 244 -86 439 478 197 511
2039 511 767 28 2 354 6 7 335 62 -438 -333 -241 -450 -286 -29 -326 -566 -405 -368 -362 21 65 -122 -196
2062 -196 -112 29 120 351 493 173 19 208 189 318 582 513 105 -102 107 2 15 330 90 -362 -279 -194
$$ packed form
1918a688K032R0k002J160J140j844K72J708j108p52J768k09j367J088P38j394
1934c68L65J195j013l80J049m17q22P03L18q34N0O76p26l21P27j31o60M91O3o13
1954f48J74M93k73k63L51Q0m57L40M13l46J12K74j41j57K35K84j68n8K88j60l12
1975F1L70J34l74p5J92l42l28M61No80L03K06o93P9O98m46k14O08j63n13N35N59
1997C83n82K44O51o79j67R35j77n41O43K3q47K23O36n79k71O40n36p16O85J0o34
2018f56L64L24p78q7O82j58l23P08jp41N12N08m84K92N76m94l30N25L9k81L14
2039E11K56p39k6L52l48JL28k73n00J05R2k09J64K57k97k40J61L7OL83M4j87p4
2062a96Q4J41R1K31J42l20j54J89j9J29K64o9m08k07K09j05J3L15k40m52Q3Q5
$$ plain form
2084 -194 -354 -114 66 -235 -573 -382 -209 -444 78 238 -336 -282 33 -109 25 505 398 2 167 283
2104 283 -34 392 827 265 14 289 -62 -171 312 279 -167 -185 -114 -521 -402 152 -190 -467 -165 -366 -595
2125 -595 -72 79 -166 -64 61 -214 -175 360 328 78 346 249 -109 318 483 225 268 317 -8 -53 143 168
2147 168 -49 123 -115 -497 -192 -135 -318 -88 -109 -424 -359 -126 -191 -173 188 -18 -267 40 99 -68 314 381
2169 381 -39 128 339 70 135 428 286 -127 152 216 -180 93 265 -236 -190 176 -291 -331 77 -66 -453
2190 -453 -155 71 -449 -195 310 -253 -327 303 -67 -406 311 308 -159 126 464 -58 -73 595 159 -186 464
2211 464 300 -409 192 396 -335 -169 330 -221 -548 200 65 -685 -8 210 -651 -309 282 -359 -502 252
2231 252 22 -492 188 530 -344 14 759 -109 -177 748 292 -282 447 500 -378 20 672 -276 -413 459 -101
$$ packed form
2084a94j60K40J80l01l38J91J73k35N22J60n74N4L15j42J34M80j07l96J65J16
2104B83l17M26M35n62k51K75l51j09M83l3m46j8P1m07J19N54l42k77L02k01k29
2125e95N23J51k45J02J25k75L9N35l2k50K68r7l58M27J65k58M3M9l25m5J96K5
2147A68k17J72k38l82L05N7j83K30k1l15O5K33o5J8L61k06k49L07N9j67L82O7
2169C81m20J67K11k69O5K93j42m13K79O4l96K73J72n01M6L66m67m0M08j43l87
2190d53K98K26n20K54N05n63p4O30l70l39P17lm67K85L38n22j5O68m36l45O50
2211D64j64p09O01K04p31J66M99n51l27P48j35p50O77K18q61L42N91o41j43P54
2231B52k30n14O80L42q74L58P45q68o8R25m56n74P29N3q78L98O52r48j37Q72n60
$$ plain form
2252 -101 -698 149 135 -746 -215 322 -601 -538 367 -144 -660 326 347 -630 164 636 -281 -20 724 102 -273
2273 -273 568 412 -461 300 677 -440 -164 637 -187 -538 449 17 -762 10 282 -713 -386 494 -466 -649
2293 -649 442 -72 -628 304 321 -531 66 664 -191 -228 718 221 -392 518 401 -425 169 525 -336 -206
2313 -206 450 -62 -508 273 182 -615 -56 274 -522 -261 358 -248 -442 244 46 -490 66 347 -273 -54
2333 -54 450 -38 -195 375 132 -199 292 282 -141 8 349 -73 -196 243 33 -245 130 88 -224 -46 24
2354 24 -178 -209 -67 -42 -192 -49 56 -165 -62 19 -31 -12 90 132 105 -8 172 134 -65 159 179 19 53 141
2378 141 29 -184 46 175 -225 -76 142 -193 -216 113 -226 -385 106 93 -366 -39 250 -169 -253 347 41
2399 41 -280 323 218 -360 147 392 -152 -114 473 18 -342 387 269 -492 180 433 -438 -219 420 -218 -439
$$ packed form
2252a01n97Q47j4q81N31N37r23O3R05n11n16R86K1r77P94M72r17K61P44o22l75
2273b73Q41j56q73P61L77j117K76Q01q24l51R87m32p79P72K72r95L27Q80r60j83
2293f49J091n14n56R32J7q52N97N98q55l7R46m97o13R10j17q26N94L56q61J30
2313b06O56n12m46P81r1p97N59L30p96K61O19o06j94O86j98n36N56K81o20K19
2333e4N04m88j57N70k43l31M91j0m23J49L41m22j23M39k10k78L75m2l12J78P0
2354B4k02l1J42K5j50J43J05k21J03Q1n0J9J02M2k7j13J80l8j99K24K0j60L4Q8
2378A41j12k13K30J29m00J49K18l35k3L29l39j59M91j3m59L27K89m19q4O00l06
2399D1l21O03j05n78N07K45n44L8N87m55l60P29j18p61O72K53q71K19O39o38k21
$$ plain form
2420 -439 406 108 -529 64 351 -633 -227 510 -309 -424 494 74 -590 212 339 -500 -77 710 -230 -298
2440 -298 612 42 -587 499 477 -447 215 611 -313 -300 665 -42 -577 587 292 -785 127 444 -627
2459 -627 -245 478 -312 -574 366 36 -754 170 423 -657 -136 629 -326 -389 691 144 -525 463 464 -498
2479 -498 96 795 -272 -282 726 6 -518 438 207 -566 77 395 -541 -359 516 -285 -646 287 -56 -678
2499 -678 164 359 -452 -162 415 -210 -415 564 208 -404 399 407 -446 176 626 -141 -87 552 37 -313 319
2520 319 246 -408 76 245 -526 -245 276 -279 -333 133 -134 -458 -27 137 -338 -74 299 -249 -212 314 35
2541 35 -59 347 228 -80 162 297 31 110 327 -40 -120 169 35 -96 113 -38 -237 -167 -86 -229 -140 -41 -171
2564 -171 -174 -110 -186 -107 90 -32 -59 63 -57 -64 147 120 45 147 207 23 136 257 95 34 192 -20 -136 214
$$ packed form
2420d39Q45k98o37N93K87r84M06P37q19j15R18m20o64Q02J27q39M23P87r40o8
2440b98R10n70o29J086k2r24O62L96r24J3R65p07n35J164k95j077R12L17j071
2459f27L82P23p90k62R40l30p90R24K53j080N21P65r55o3J080n47o69R88Jr62
2479d98N94O99j067j0J008p20n24R56k31p73O43L18r36J82Q75q01l61R33l43o22
2499f78Q42J95q11K90N77o25k05R79l56o12Q03Qq53O22M50p67N4O39n15l50O32
2520C19p3o54M84J69p71K81N21n55n4M66k67l24M31J64m75K64L73n48L7N26k79
2541C5r4M06j19l08K42J35k66P9K17l67q0K89j34j31K09j51j99P0Q1j43Q9R9j30
2564a71lO4p6P9J97j22k7J22j20pK11k7p5J02O0j84J13J21j62o1J58k12j16L50
$$ plain form
2588 214 67 -172 31 64 -307 -179 30 -180 -245 77 -150 -411 68 35 -249 131 180 -177 -47 230 46
2609 46 38 347 121 -129 159 244 -100 174 328 -100 -61 221 -33 -135 129 76 -343 -79 64 -333 -185 137
2631 137 -282 -358 59 -82 -261 86 134 -239 -62 197 -110 -1 380 107 -55 289 113 -21 190 268 37
2652 37 -5 219 -56 -151 141 9 -230 -12 -73 -294 -59 -5 -138 -111 -29 -91 -227 17 28 -133 42 67 -93
2675 -93 79 162 124 152 182 99 20 66 165 44 121 84 -49 44 -13 -67 61 -54 -129 -149 -153 -125 -105 -68 -57 -126 -121 -5
2703 -5 -114 36 85 -47 44 67 85 51 209 111 74 129 172 7 111 225 19 -5 74 -65 -57 60 -86 -106 -72 -119
2729 -119 -204 -128 6 -101 -183 8 -126 -110 79 39 -52 107 74 -29 78 128 152 122 235 113 19 121 137 59
2753 59 121 15 -25 -21 -6 -70 -123 -76 -105 -228 -56 -28 -154 -38 -91 -83 -61 -73 -37 75 -22 68 54 53 100 107 149 67 82
$$ packed form
2588B14j47k39K03L3l71J28K09k10o5L22k27k61M79l3k84L80M9l57J30K77j84
2609D6qL09k26k50K88Q5l44K74J54m28L9K82k54j02K64n3m19K64J43l97J48L22
2631A37m19p6M17j41j79L47M8l73J77K59l07J09L81k73j62L44j76j34K11P8k31
2652C7m2K24k75r5K92j32k39K18o1k21K35N4j33K7Q2o2j36K44J1j61J75K5j60
2675i3J72Q3l8K8L0q3p9M6R9j21P7l7j33R3n7n4J28j15p5k0mK8K0L7J1o9NJ16
2703ej09J50M9j32R1K3J8l4J58r8l7N5M3j65J04J14k06k4P9j39QJ17j46k0L4m7
2729a19q5P6J34j07q2J91j34J6J89m0r1J59l3j03J07N0K4l0J13j22r4J02J6p8
2753E9O2j06m0MJ5o4n3M7k9j23J72K8j26J16n3QK2j2L6J12r7R0j4jM7PM2q2J5
$$ plain form
2782 82 124 68 18 119 26 39 81 -54 -34 -17 4 -55 -142 -28 -44 -133 -34 -81 -174 -34 -16 -152 -13 57 14 -48 87
2809 87 28 -53 78 85 -71 -10 191 -75 7 131 50 -82 113 147 -163 -19 174 -94 -93 142 -94 -166 85 50
2833 50 -213 -35 120 -155 -108 243 -98 -162 168 45 -183 40 168 -139 -69 248 -50 -103 277 115 -178 131
2855 131 177 -237 35 213 -108 -114 191 -47 -220 105 144 -223 -16 144 -216 -121 222 -79 -191 144 85 -249
2877 -249 74 255 -154 -70 241 -32 -163 171 103 -124 146 184 -128 -8 252 -133 -139 197 -21 -209 132 87
2899 87 -216 -22 198 -170 -179 185 -61 -206 142 27 -220 34 166 -165 -45 173 -95 -70 141 87 -160 5
2921 5 175 -148 -42 202 -31 -28 222 25 -88 109 36 -57 -49 95 -99 -142 27 -14 -153 -31 13 -109 -27 52
2945 52 -48 -125 78 58 -14 18 109 -73 20 79 33 12 58 -10 -17 -17 61 -21 -27 85 58 -57 17 -35 -63 -56 -2 -23 -115 -32
$$ packed form
2782H2M2n6n0J01r3J3M2j35K0J7K1n9q7J14j6q9R9m7r3J40J8j36J39P0m3o2J35
2809H7n9q1J31Pj56O1K01k66Q2J24q1j32J95L4l10J44J93k68JK35k36p2K51l5
2833E0k63J78J55k75M7L51l41o4L30j23k28K23J28l07P0L17k98n3L80j62k93L09
2855A31M6m14K72J78l21oL05k38j73L25L9l67K07J60l60R5L43l01j12L35n9l34
2877b49L23J81m09Q4L11k73j31L34o8k27K70L8l12J20K60l85oL36k18j88L41m5
2899H7l03J94K20l68rL64k46j45L48j15k47K54J32l31J20K18k68K5K11n4k47J65
2921EJ70l23J06K44k33LK50j97j13J97p3r3QJ44j94m3J69m1j39J22M4j22Q2P9
2945E2j00p7K03k0p2L2R1j82R3N9m6k1M6o8p%P8q2oJ12k7j15P4n2k8PN4k1r2Q3
$$ plain form
2975 -32 15 -144 -41 77 -115 -32 7 18 -74 8 61 -70 -2 126 -31 -26 122 43 -61 69 140 -23 -64 101 -88
3000 -88 -134 117 -7 -115 67 12 -192 -91 44 -96 -86 74 8 -182 40 55 -195 60 145 -77 -47 114 65
3023 65 -94 122 161 -80 45 143 -79 -53 149 -60 -151 92 2 -201 -15 91 -171 -101 111 -82 -197 79
3045 79 -4 -202 38 142 -47 -6 131 -8 -69 181 72 -118 156 197 -111 45 173 -73 -62 94 41 -169
3067 -169 -9 84 -219 -38 149 -129 -94 101 -91 -180 51 15 -135 -36 76 -83 -98 172 7 -88 175 98 -73
3090 -73 108 154 -13 35 209 35 -65 157 107 -115 37 107 -117 -76 72 -122 -166 29 -74 -225 -56 115
3112 115 -95 -22 118 -129 -62 97 79 -17 115 154 -47 71 257 4 66 194 28 -18 92 48 -70 50 96
3135 96 -102 -96 4 -76 -177 -42 -49 -140 -71 -65 -137 -84 24 -37 -91 73 52 -74 122 130 -32 113 171 22 91 143 70
$$ packed form
2975c2M7j59J03J18j92Q3L9J1r2Q2N3j31O8J28j57NJ48p9j04J30P1j63m1J65j89
3000h8m6K51j24j08J82n5k04J01J35j40J0J60o6j90K22J5k50K55Q5k22L0J61m9
3023F5j59K16L9k41J25R8k22K6K02k09r1K43r0k03J86J06k62P0K12j93j15K76
3045G9q3j98K40J04j89M1J37j39o1K50j09j90K74M1l08J56J28k46J1J56n3k10
3067a69J60R3l03J81J87k78L5J95j92q9K31l6j50R9J12j59j5K70j65r5K63p7j71
3090g3J81M6j67M8J74j74j00K22n0k22J52P0k24M1J48j94m4J95j03j51J69J71
3112A15k10P3J40k47O7J59j8r6J32L9k01J18J86k53O2J28j66m6J10m4j18J20M6
3135I6j98OJ00q0j01J35pr1O9Op2N3J08o1n4J64k1j26J96Qj62J45N8j49O9N2p3
$$ plain form
3162 70 17 13 70 -46 -37 33 -66 -31 -53 -108 -143 -54 -57 -69 -94 -82 -106 -63 74 29 -38 18 8 -11 84 58 105 69 10 64 58
3193 58 27 108 48 24 9 -25 31 -66 -34 -58 -81 -45 -82 -97 -32 -47 -79 -74 -45 12 -55 -61 78 -31 7 100 46 21 82 100
3223 100 6 85 120 62 76 93 29 -13 72 -60 -97 22 42 -83 -64 0 -75 -82 -52 -83 -98 7 -22 -113 5 -14 -28 13
3251 13 47 -6 58 102 154 28 114 135 55 92 131 -12 28 44 50 -25 -35 19 -93 -67 -32 -102 -66 -45 -40 -64 -52 -48 -21 -27 18
3282 18 -13 7 29 16 34 85 85 47 83 62 64 109 50 26 45 14 91 54 -31 43 -14 4 -48 -85 -46 -92 -41 -53 -70 -50 -30
3313 -30 -56 -16 -81 -23 9 -15 13 13 68 83 67 60 116 49 120 69 77 74 33 15 -44 -29 36 -32 -103 -37 -28 -91 -67 -7 -73 -48 -64
3346 -64 -49 -25 -32 -21 -91 35 -24 -2 67 49 27 53 73 50 6 50 141 17 77 123 2 105 5 -35 -16 -36 -20 -67
3374 -67 -42 -54 -61 -90 -45 -76 -38 -51 -70 -21 8 -43 51 68 60 111 42 54 104 64 36 -39 72 79 -17 63 77 -49 45 0 7
$$ packed form
3162G0n3mN7j16RP0r9L5k2n5l5Q9lj2k5J2k4M3J37m5o7N6j0j9R5k6M7l6n9N4o
3193E8l1Q1o0k4j5l4N6r7L2k4k3L6l7j5O5j5l2NK9N7o7oJ39j09L8R3n4k5O1J8
3223A00r4P9L5n8J4J7o4m2Q5j32l7J19K0j25J9O4p5pL0l1j5J05k9r1J18j9j4M1
3251A3L4n3O4M4N2j26Q6K1q0L7L9j43M0J6Op5j0N4j12K6L5p0L6K1Nk4J2MK7oM5
3282A8l1K0K2j3J8N1%l8L6k1KM5n9k4J9l1P7l7q5P4n7J8n2l7L9m6N1j2j7K0K0
3313c0k6M0o5N8L2k4K8%N5J5j6pN6o7P1n1Qlm1j8n9J5O5o8p1O6Ro3K4O0o6K5j6
3346f4J5K4pJ1p0J26n9K2O9j8k2K6K0k3m4M4R1j24O0M6j21J03j00m0J9k0J6m7
3374f7K5j2pk9M5l1L8j3j9M9K9n1R4J7qN1o9J2N0m0k8p5J11Pr6Q0J4j26R4m5P
$$ plain form
3405 7 -31 -20 -101 -120 -77 -104 -108 -78 -42 -45 -43 -28 -90 -52 -12 11 97 -17 134 55 46 81 53 16 147 72 9 81 35 15 29
3436 29 20 -49 -102 30 -49 -73 46 -63 -133 -41 -52 -63 -83 37 -42 -39 82 35 -13 87 105 -28 99 130 27 64 124
3463 124 58 -34 110 92 -34 28 69 -90 -62 4 -123 -91 -3 -39 -103 -26 15 -120 -58 58 -23 -86 38 33 -58 101
3489 101 36 1 47 157 51 9 109 70 -30 70 38 -35 62 35 -39 -43 29 -86 -83 24 -17 -185 7 12 -57 -36 59
3516 59 -82 -54 111 -2 -55 75 70 -20 -27 134 39 -10 135 58 12 104 66 -39 -51 15 -1 -12 47 -53 -115 -30 -73
3543 -73 -99 -55 -33 -40 -74 29 17 -47 -39 32 -34 16 19 28 68 37 32 88 111 13 32 21 92 -7 -42 14 -42 -20 2 -60 -51 -49 -73
3576 -73 -11 -47 -64 -40 -12 -54 -20 9 -8 -2 14 30 8 99 39 35 110 32 -28 84 47 -42 -45 37 -11 -70 0 -1 -83 3 40 -46
3608 -46 -3 -42 -65 -96 -28 16 -34 30 37 -81 -8 86 -15 1 117 48 11 23 62 -95 8 129 6 -7 107 -79
$$ packed form
3405Gl8J1q1j9M3k7mL0L6lKJ5o2L8M0K3Q6j14J51p9rL5k8l7J31p5o3P2m6k0J4
3436B9ro9n3J32p9k4J19j09p0R2j1j1k0J20p9LJ21m7m8J00J8j33J27L1j03L7O0
3463A24o6r2J44j8j26O2M1j59K8O6j27L2Q8l6o4P7M1j35O2J16q1o3J24nr1J59
3489A01o5l5M6J10j06m2J00l9j00J00l2p3R7k7p4mP2j15LJ07m1j68J92No9K1R5
3516E9j41K8J65j13n3J30nr0pJ61r5m9J45p7m6R2l8j05j2O6j6j1N9j00o2Q5m3
3543g3k6M4K2pl4J03j2o4QP1o6N0LRM0l1nN6K3r8J9j1P1r9l5N6n6K2K2o2RKk4
3576g3O2l6j7K4K8m2L4K9j7OJ6J6k2R1o0mP5p8o0J12l7q9lQ2m8n9P0jq2Q6L7q6
3608d6M3l9k3l1O8M4n0O4Pj18P3R4j01J6J16o9l7J2L9j57J03J21j23j3J14j86
$$ plain form
3634 -79 -64 52 -26 -99 19 2 -49 -80 70 -79 -90 57 12 -79 0 15 -98 -34 49 -47 8 115 32 -27 2 123
3660 123 -114 4 64 -96 43 65 1 -23 -16 13 -47 -25 45 -49 -12 4 -93 -63 51 -3 -49 10 33 -15 -39 46 22 -7
3688 -7 43 13 -31 30 11 -35 -35 13 -8 -48 -6 -28 -69 13 11 -9 -83 39 -13 30 20 -16 -14 7 53 -25 42 23 -61 12 79 -8
3720 -8 -12 31 13 8 -17 -10 -8 -1 11 -45 16 27 -22 -32 46 -47 14 19 6 -14 -4 -4 35 -12 9 78 32 42 72 -4 -41 31 -16 -54
3754 -54 7 -29 -46 -1 -61 23 -14 2 -20 -3 39 16 13 -61 35 26 0 -9 22 -28 3 -31 19 68 24 31 -5 -19 -10 9 29 18 16
3787 16 10 28 -6 6 -50 -12 39 -27 -12 38 2 96 -6 -16 -35 39 35 -9 -39 55 -18 -11 -9 8 -16 11 14 3 -14 -27 -25 -15 14
3820 14 10 -48 -60 -25 -51 -4 44 -2 -24 -17 -26 14 -21 -17 -29 6 -22 3 41 12 8 11 -49 70 38 61 59 24 -41 43 34 -50 4 -48
3854 -48 38 -13 0 8 -55 -14 22 -34 -31 -109 -30 29 -44 -20 17 -10 24 -6 1 -9 -5 73 37 36 46 43 26 3 42 46 -2 -37 0 -10
$$ packed form
3634g9J5J16p8p3J18j7n1l1J50j49j1J47m5r1P9J5j13O4Q3r6N5J07q3n9K9J21
3660A23k37J18O0j60J39K2o4k4PK9o0K2P0r4L7J6r7L0J14n4m6N9K3m8k4Q5k4k9
3688gN0l0m4O1j9m6%M8k1m0M2k2m1Q2kk0p4J22n2M3j0l6KK1M6p8O7j9q4P3O7q7
3720hmM3j8nk5PKPJ2n6O1J1m9j0P8r3O1Nj3k0J0%L9m7K1O9m6J0L0p6l7P2m7l8
3754e4O1l6j7M5o0Q4l7J6k2J7M2k3lp4R6rk6rL1n0L1l4N0M9m4Pl6j4RJ9K0j1k
3787A6oJ8l4J2n6L8N1o6J5N0l6R4j02j0j9P4mm4l0R4p3PKJ7k4K7Lj1j7j3KJ0K9
3820A4mn8j2L5k6M7M8m6k2PrM0l5Mj2L5k8K5L8k9mLo0J19l2K3kl5o5Q4rq4N4n2
3854d8Q6n1J3Qo3M1L6n6Lp8P9N9p3K4L7k7L4l0Pj0MP8l6jJ0lj7k3L9Mm8l5L7j0
$$ plain form
3888 -10 -36 32 -9 3 -32 4 34 -31 -30 -33 8 19 28 -13 17 -14 39 55 24 16 5 52 23 58 15 16 31 43 46 -40 -6 -13 0 -36
3922 -36 5 14 -47 -54 -29 -37 4 9 -73 2 -54 9 20 38 53 34 34 47 45 28 64 -2 38 -7 15 33 31 -52 2 -87 -16 -5 -33 -51
3956 -51 -38 -18 -71 -87 -60 -6 -26 -24 -33 -39 38 54 32 41 10 64 63 75 46 -29 23 68 24 63 36 -10 -39 -6 6 17 -24 -12 -73
3989 -73 51 -53 -31 -40 -16 -80 -19 -14 13 14 -23 11 -12 4 57 18 5 43 46 -2 71 45 36 48 -12 32 36 -31 -9 -49 -74 -58
4021 -58 -18 -18 -53 -41 -60 -13 -21 3 -23 6 -48 -30 61 16 29 0 20 -9 62 98 19 -30 46 -6 6 50 81 -2 35 35 13 13
4053 13 -66 -21 9 -44 -48 -55 -31 37 -61 -20 -1 -20 25 48 51 35 18 45 71 -27 65 32 25 32 57 30 38 2 13 -5 -20 -31 -56
4086 -56 -6 -41 -43 -33 32 -38 -80 21 28 -50 22 3 32 19 47 -30 4 45 37 17 50 30 13 15 46 5 -41 3 27 -40 7 -6
4118 -6 -28 11 -9 -14 -6 0 -16 -37 4 -7 24 74 35 -76 59 -27 3 48 44 -3 26 73 34 -8 -19 38 -32 36 -15 32 47 -5
$$ packed form
3888a0k6O8m1J2l5L6L0o5JlM1J1Rm1L0l1N3J6l1qj1M7k9L5m3JJ5J2Lq6L4pJ3l6
3922c6M1Ro1pK5qM1Nq2P5n6O3J1J8J5j9%J3kj7L6o6M0m5K2J8kq3N4q9P1J1k8j8
3956e1J3K0n3j6K7N4k0KroP7J6k2Rl1N4jJ2k9p5N2M5m4L9k7m6k9L3J2J1m1J2o1
3989g3J24j04K2rK4o4O1NK7Jl7L4k3J6N3l9j3L8Lm8P3k6rJ2o0M4Mo7K2m0k5J6
4021e8M0%l5J2j9M7qK4k6K9n4J8R1m5J3k9K0k9P1L6p9m9P6n2J2M4L1q3L7%k2%
4053A3p9M5L0n3mpK4O8r8M1J9j9M5K3Lj6j7K7K6r8R2l3pPK5k7Ql6J1j8j5j1k5
4086e6N0l5kJ0O5p0m2J01Pp8P2j9K9j3K8p7L4M1qk0L3k0j7KL1m1m6M4K4o7M7j3
4118fk2L9k0nQOj6k1M1j1L1N0l9j11J35q6L0M5mm7K9M7l9m2j1N7p0O8n1M7J5n2
$$ plain form
4150 -5 9 -50 -83 -35 10 -24 27 -9 -24 -5 -2 -32 2 -29 -55 24 -57 -43 -11 87 -20 -29 -16 59 -1 -24 -26 73 37 25 -20 4
4182 4 33 1 -23 11 1 -17 0 5 -58 14 -25 -11 39 -38 17 30 3 -16 2 -54 -31 -39 17 -28 57 22 11 -5 -10 -20 -46 20
4214 20 -12 -47 47 21 6 32 31 -13 -23 38 14 3 11 -24 -12 11 -43 31 -1 13 48 -41 -33 39 6 -29 4 -50 -1 10 66 19
4246 19 41 4 -15 -41 10 -47 -15 32 -1 32 -55 26 -18 56 1 -49 -12 36 3 -39 34 -3 -66 -8 25 19 45 -18 -2 1 3 7
4278 7 35 -19 -7 -10 18 53 -15 -19 -8 5 12 60 -24 -49 79 19 -67 -24 -26 -18 19 -45 -13 -10 35 -21 20 5 37 7 28 26 -21 -29
4312 -29 -23 71 22 11 32 -2 30 41 -14 -8 33 7 4 10 31 -5 -49 -10 -8 -22 25 6 -20 16 -23 -67 12 45 6 28 1 42 4
4345 4 0 94 32 23 20 -6 44 70 -29 16 3 39 5 35 33 49 12 3 -1 -53 -8 -3 29 -61 -58 10 -13 -24 38 43 2 25 -17 -56 47
4380 47 -5 10 -13 -9 5 19 22 16 -14 -17 -1 25 15 34 -24 40 -5 -12 9 29 -8 -84 27 -9 -3 6 11 7 49 -54 21 2 5 28
$$ packed form
4150eJ4n9l3M8M5l4N1l6j5J9Ll0L4l1k6P9q1J4L2R8j07rJ3P5o0k3kR9l6j2m5K4
4182DK9l2k4L4j0j8J7No3P2l9J4N0p7N5J3k7j9J8n6K3qN6m5Q5l5j1j6nj0k6O6
4214B0l2l5R4k6j5K6jm4j0O1k4j1Ql5J2K3n4P4l2J4L5q9QP2l3l5L3n4M9J1N6m7
4246A9K2l7j9k6N1n7L2M7l3L3q7Q1m4P4n5n0L7M8l3m2P3l7o3N8L3oK6o3J6LKM
4278GK8n4J2lK8L5o8mJ1J3PM8q4k5J28o0q6M3kQL7o4L2LM5n6M1j5L2l0K1km7q
4312b9OR4m9j1K1l4L2J1n5OM1k6lOK1l6m4L9Kj4M7j9k6L6l9m4P9L3l9K2k7M1l8
4345DmR4o2rlk6N0K6r9M5j3L6l4L0kJ6l7rmn2M5NL2r0LO8k3j1O2Nm1K3m2l9J03
4380D7n2J5k3MJ4J4Lol0lJ6K6j0J9n8O4m5pK1K0l7p6J11l6ORNmM2j03P5j9LK3
$$ plain form
4414 28 23 15 80 41 3 -39 -8 -30 -90 28 -7 -9 -13 15 -29 40 17 -3 -27 -36 51 22 -53 13 -13 33 -10 24 50 66 -8 12
4446 12 39 43 32 26 -22 9 24 60 41 -5 -28 -23 24 -61 -63 2 27 -32 10 -17 -55 -47 -9 -49 20 19 -4 8 4 -7 25 14 43 53
4480 53 23 43 66 -3 -9 18 31 9 31 21 45 23 -54 -27 32 1 -36 0 -16 -93 -27 -2 -22 17 14 -22 -33 17 -11 45 53 11
4512 11 10 13 22 -3 13 19 -37 53 11 111 35 -39 -25 26 -21 -42 3 16 87 -1 -13 -33 -21 -28 -21 -45 32 -39 43 22 -11 35 40
4545 40 32 2 -22 76 -4 -16 15 34 -11 -7 -8 -49 -5 31 -8 19 -60 -11 19 -51 14 20 -71 27 28 13 14 -1 43 -3 53 13 33
4578 33 34 32 7 45 10 44 13 17 12 -29 -34 -60 -16 16 -17 -14 -36 -48 -10 -20 9 -17 28 35 -18 1 -23 83 5 12 1 17 15 21 -21
4613 -21 35 28 -23 34 16 60 33 32 1 49 9 -40 5 8 14 -27 10 -4 -12 -44 -45 39 -12 -50 -24 -74 -1 6 -67 -51 -10 20 33 -12
4647 -12 3 22 -37 10 38 3 30 -2 5 51 -4 18 55 49 49 -16 -17 -54 -17 -37 2 -34 -60 3 -46 -57 17 -11 18 10 31 -17 -67
$$ packed form
4414B8nqO5l9l8m2L1k2o0J18l5kmK8m4O9k3k0k4rQ7k9p5O6k6M6m3L4K6J6p4K0
4446A2K7Mj1om8L1J5L6j9m6k3NM7q5kO5K5n9M2k7l8QL8m0O9jk3J2mj1L2j1K9J0
4480E3l0K0K3o9oK7J3k2K2j0K4k2p7K7N9l1l7L6j6p7O6K5k0L9ll6j1N0k8N6Qm2
4512A1jLRk5J6On6R0m2J00p6p4J4N1m7k1M5J3P1q8j2k0J2pPk4P7p1Q2k1l3M6N
4545D0ql0k4R8q0j2L1J9m5Mjm1M4L6l9K7p9M9L0p0O5Or1R8Jj5Jj5M4m6N6m0K0
4578C3Jkk5L8l5L4l1Mnm1nk6M4L2l3Lk2j2L8j0K9k6M5Pn3J9k4J06p8Pj1J6kOm2
4613b1N6pn1N7j8M4k7jl1M8m0m9M5LOm1L7j4ql2jQ4n1l8K6n0P3Pp3J6M1L0J3m5
4647a2J5J9n9M7K8l5K7l2PM6n5K2L7o%o5jl7L7k0L9l6k6O3m9j1P4k8K9qK1m8n0
$$ plain form
4680 -67 -34 -46 -60 -6 58 -25 45 32 22 -21 15 42 16 19 40 -78 -5 -2 27 -56 -24 -23 -30 -14 -23 6 33 5 -22 45 -73 -21
4712 -21 -15 -4 64 27 -6 51 -18 -9 45 21 1 25 -1 9 1 -49 4 16 -33 -17 64 37 -11 -41 4 -11 -26 1 7 6 -1 -17 3
4745 3 -4 -37 17 5 21 -22 5 39 72 -2 -41 3 -4 -1 33 32 -23 8 17 -12 -13 19 -36 51 -33 -25 -35 2 25 54 13 32 56 8
4779 8 30 12 32 21 -4 4 50 86 39 -67 -5 -18 14 24 -20 -6 -4 5 -5 -29 -22 -81 -10 -9 -14 -37 -20 21 -21 44 77 -20 0
4812 0 21 -3 -4 49 8 3 37 56 32 5 2 11 -6 -31 24 -4 4 -24 -1 -2 1 -5 -30 -15 -30 -56 -29 12 -15 -11 -40 -32 8 -34 -23 29
4848 29 -12 44 11 -21 -12 -37 95 -4 -17 -4 -20 -26 -43 -39 -45 18 -19 24 -12 5 -19 -10 2 -38 -39 -16 15 -21 17 5 24 -22 5
4881 5 -7 46 11 70 -20 -22 -11 63 -3 -25 11 24 -19 -67 -19 14 20 13 -7 7 6 28 14 55 5 14 55 23 48 11 47 -14 10
4914 10 47 45 35 -2 -18 -10 47 0 -16 11 7 34 -11 -24 22 -49 -23 -55 11 -30 3 -16 20 -35 -9 -21 -6 -32 2 7 -53 -12
$$ packed form
4680f7L3j2j4N4O4q3P0j3j0m3L6K7k6LK1j18P3LK9q3L2JpJ6rK9K7k8k7O7j18N2
4712b1OJ1O8l7l3N7o9RN4k4k0K4k6J0qn0N3J2m9J6Q1k7m8l0M5j5j5K7Ojpj6K0
4745Cpl3N4j2J6m3K7L4L3p4l9M4pLL4jn5L1Rk9jL2n5Q7q4Qj0L7K3K9m1J9K4m8
4779HK2j8K0j1k5QM6L6m7j06O2j3L2J0m4J4KRj0k4Pn9P1Jnk3J7M1m2O5L3r7K0
4812@K1k4jN3m1nL4J9k4k7lRj7k5N5k8Qk8K3jLok5J5j5k6K7M1k7Mk9QM0m2J1N2
4848B9m1N6l3l2Rk5J32r9j3J3j6oj7MoO3l7M3l6J7k4RJ2m0jK3L1l6L8j2J9m6K7
4881Ej2N3l5N9r0kJ1P4o6k2L6J3m3m8M8L3Opk0J4jK2j4M1n0RM1l2K5l7L6o1K4
4914A0L7kj0l7j6QN7m7j6K7mK7m5j3M6p1K6l2O6m1L3j9L6n5K6j2J5k6L4No0M1
$$ plain form
4946 -12 18 25 -5 18 5 6 18 -32 10 82 -37 38 16 0 -9 3 -20 -27 17 -60 -30 1 56 14 -26 30 16 1 -38 0 17 8
4978 8 4 35 -47 -37 25 32 34 10 27 -7 -19 -57 6 -17 -1 -12 -26 -3 25 -16 50 -61 -38 -4 -31 6 -21 57 -29 -24 -7 -5 21
5011 21 21 26 18 53 4 14 -31 22 -16 5 -10 -5 -52 4 5 -15 41 -36 -4 82 4 -1 1 -14 50 6 10 -28 -16 -25 -4 -31 12 -41 8
5046 8 7 -9 30 24 0 5 38 -3 5 3 21 5 -20 3 9 48 9 17 -8 48 26 16 -42 51 65 26 -44 57 36 6 11 -11 1 15
5080 15 -21 8 -17 -1 -1 -14 -50 -58 30 -4 7 29 -39 -11 10 0 -2 -36 20 41 8 17 1 5 -11 -13 -21 7 -33 34 -19 -7 60 6
5114 6 -8 -58 -3 -24 8 3 34 48 -31 -10 22 17 15 28 26 75 -7 11 -6 -6 15 -34 3 -19 0 8 9 -38 11 -14 0 36 6 -38
5148 -38 2 13 13 -1 -47 -9 -5 -31 -9 3 -25 -4 35 -9 -1 37 -12 12 12 23 -18 18 -20 19 -18 -12 -18 18 -1 -10 -26 -61 61
5181 61 7 18 -16 -40 27 2 -42 15 23 -11 -42 23 68 27 5 56 24 2 -13 -38 24 -35 -40 -26 89 31 4 -20 5 39 -7
$$ packed form
4946a2L0Pl0K3j3JJ2n0M2P2j19P5k2j6rJ2k3pM4p7L0L1N5m2m0N6j4j5l9L8J7r
4978HmL1q2J0O2PKk4J7l4j2l8O3k3J6j1j4K3K8m1O6j11K3L4k7L7k7P8q6NJ7KK6
5011B1%NqL5m9J0m5N3l8K1j5Nm7N6Jk0N6p7L2Q6p8nKj5O4m4Ml8J2rK1k7M3n3M9
5046Hjj6L9ok4NL3m1QkJ8j6k5K3OL9l9Qk5N6k2j0n8R3J4l9p0J01k1l0Nk2J2J4
5080A5l6K9k5J6%j3l6qQ8l4J1K2o8K8K1j0kl4N6K1l3Rj6Mj6kqK8m0O7n3J2O7n4
5114Fj4n0N5k1L2nL1J4p9K1L2nkJ3kM9q2J8j7%K1m9L7k2J9QJm7M9k5J4L6l0m4
5148c8M0J1%j4m6L8Mk6K2J2k8K1L9m4QL8m9K4%J1m1L6l8L9l7OoL6j9rj6l5J22
5181F1n4J1l4k4O7k5m4N7Ql4l1O5M5m1k2N1l2k2j5k5O2n9nJ4J15n8k7k4K5L4m6
$$ plain form
5212 -7 -12 11 8 -27 -47 -11 7 -7 62 17 17 -46 -51 -41 4 -2 5 52 16 -44 11 45 -14 14 0 18 17 13 -24 14 -8 9 -20 31 -24
5247 -24 31 13 26 -5 1 45 -29 -48 -3 -59 -17 21 -6 17 -5 53 -15 -38 1 -43 -14 -44 45 3 -4 -45 -43 -41 -67 -52 -8 -6 42
5280 42 -70 45 29 30 23 -14 28 42 38 25 20 6 47 17 32 -13 -26 -7 -16 -18 -9 -16 50 5 -48 -18 45 -28 5 5 -37 15 -8 32
5314 32 8 -21 -21 17 32 -45 32 -2 18 15 14 48 8 -34 -6 5 28 -16 60 -7 14 42 -11 7 6 -5 48 6 5 -2 -35 -21 4
5347 4 -22 -21 24 -1 -3 2 29 -52 30 27 -29 -6 50 33 17 14 4 29 27 5 38 5 -10 -26 -31 -33 -7 7 3 2 8 17 -23 1 3 6 -26 -12
5385 -12 1 6 0 24 -52 40 -46 -33 33 4 -34 50 35 -30 -10 -2 -38 -29 45 21 -9 -19 -24 24 27 16 8 -5 23 33 -21 -16 13 10 -5
5420 -5 29 24 12 24 -25 11 38 11 24 -3 -15 -40 -27 6 -12 31 18 -12 4 18 -37 -31 -23 2 -39 7 27 18 18 63 -9 12 -9
5453 -9 -4 -5 18 -9 6 50 -2 -59 17 0 27 29 26 -36 -32 0 -22 -20 18 25 -29 -22 -2 53 -28 -25 -37 -58 -13 38 18 -43 -13 14 12 -53
$$ packed form
5212gnK3ll5k0L6J8j4O9m5%o3nJ0M5oPM7l6o0N5L4n9K8j4J8jml7L8k2J7k9N1n5
5247b4N5j8J3l1OM4p4j9M5n6M2L8k7K3k2N8o8k3L9m4K9l0Q9m2pm1KKk6J5M4KM8
5280D2j12J15j6Jpl7M2J4mj3nj4M1l0J5m5j3J9rkRpO6m5n3L0O3p3L3%m2N2k3M0
5314C2k4k9%L8J5p7P7l4K0ljL4m0m2K8J1K3m4P6o7K1K8n3J8jj1N3m2jpl3J4K5
5347Dk6JM5k5kNK7q1Q2ln6K3N6j7j6lj0K5kk2L3l3j5j6nkK6J4mjORm0K4KLl2J4
5385a2J3NoK4p6R2q6J3O6k9l8Q4j5o5K0Ql6RP4k4l0j0nM8Lj1qj3K8J0n4NK9lj5
5420eL4nj2J2m9L6K7k7J3k7j2k5J3L3j8M3j3l0J6J4n5OQK5m1M6K0r%M5p2K1k1
5453iNjK3k7J5M4n2n7P6j7K7Klo2ML2k2KL8Pn4PK0N5q1Lj2k1M5N1k0o1L0K7ko5
$$ plain form
5489 -53 6 24 -8 46 -1 20 -5 15 30 -8 -28 -43 23 -20 9 -13 0 22 21 -15 -39 33 37 -25 -13 6 -17 7 -32 -14 52
5520 52 12 9 1 -25 -21 -37 -39 -8 8 28 2 13 -5 -38 5 46 -13 -5 -30 -14 -9 38 -40 20 -20 19 -39 -53 67 2 8 18 -82
5553 -82 -18 38 -21 -23 -14 -7 4 -23 -1 -31 -10 -22 -34 7 37 13 -10 -17 -25 -7 7 11 2 44 -20 -23 3 68 10 -7 1 -7 -29 9 11 13
5589 13 -92 -47 -6 -23 17 40 -13 -50 2 -31 -32 -21 -37 -60 -37 -2 20 17 34 -6 -15 22 -23 43 17 63 -49 -13 -6 0 11 -31
5621 -31 0 16 34 1 9 33 -4 -26 -9 9 -54 -33 20 -6 -5 -8 30 -16 -13 -12 28 36 -8 -22 2 -10 26 -20 -2 9 8 -45 59
5654 59 10 -19 -30 16 -40 10 32 13 -28 -33 16 -69 -24 7 61 34 57 38 -8 22 30 -3 55 17 22 25 69 27 -1 -20 25 15
5686 15 4 -6 -42 81 11 -15 -27 -4 4 -21 -28 -9 -41 22 -40 18 10 7 4 18 41 -38 9 36 -5 39 11 5 73 18 52 11 -1
5719 -1 29 19 -21 5 -15 12 24 -11 47 -56 -4 2 -8 17 11 1 64 -20 28 -38 -28 -8 16 0 3 12 9 12 10 0 30 34 -27 28
$$ packed form
5489e3N9J8l2N4m7K1k5K0J5l8k0j5O6m3K9k2J3K2jl6k4P2Mo2J2J9k3K4l9J8O6
5520E2m0lqk6Mj6kL1J6K0k6J1j8l3M3M1n9Qk5J6NM7p8O0m0L9n8j4J20o5OJ0j00
5553h2O4N6n9kRPJ1k7K2l0K1j2j2M1L0k4k3pqJ8J4MrM2o4lK6O5n8j7Qqk2L8KK
5589A3j05M5M1j7M0K3n3l7N2l3jJ1j6k3K3L5K2lJ7m0rL7m5O6k6M6j12L6POJ1m2
5621c1L1J6J8l3QK4l7k2J7J8o3K1N3k6JlL8m6LJM0Qm4j4K4j2L6m6J8J1jn3J04
5654E9m9k9j1M6n6N0K2j9m1nM9q5M5L1N4k7K3j9m6L0Ql3N8l8NLM4m2k8j9M5j0
5686A5j1j0l6J23p0k6j2K3Qk5pJ9l2O3o2N8qllJ4K3p9M7K7m1M4k8oO8n5L4m1j2
5719aL0j0m0K6k0K7J2l5N8j03N2Oj0K5oj0O3q4M8o6J0K0K4j6LRlLkj0L0Mo1N5
$$ plain form
5753 28 -4 -30 -24 -21 25 25 7 -6 42 20 -7 17 -51 13 -7 -13 -1 19 -55 -43 17 -2 -14 2 20 -63 14 -9 4 39 -4 28
5785 28 44 -12 -55 -13 3 1 -12 1 22 2 -45 16 -10 -6 -12 28 -31 22 57 -7 21 10 15 11 42 70 7 6 48 2 -26 -15 -33
5818 -33 15 -19 18 3 13 22 -41 3 -26 24 23 -28 -5 -17 11 12 18 -54 -13 -4 -28 -12 -5 -8 32 52 -23 26 7 7 34 -53 -19 -36
5852 -36 14 -21 -8 -20 30 -24 13 -3 25 2 -28 -15 -5 -21 -2 -18 -27 -6 -34 -12 -31 37 15 -15 -12 18 26 22 12 -13 38 -8
5884 -8 9 -21 5 14 33 14 7 45 -59 -10 4 1 -21 4 -1 41 19 -34 -21 -6 61 25 -25 13 39 -24 53 -19 -11 33 45 0 11
5917 11 0 -12 -12 -3 21 -44 -31 -24 -5 67 21 27 -67 30 -1 -5 35 -6 -64 41 35 -41 -23 -27 -49 -35 -3 -13 -13 -46 26 -2 -46 21
5951 21 -21 4 -23 11 -10 -38 47 -39 48 24 3 -20 -29 -40 25 -15 24 9 35 -29 2 -18 33 31 -59 16 -8 30 55 1 -34
5982 -34 70 -52 49 -12 -24 18 -2 59 13 10 -22 14 -18 -21 -22 22 37 27 19 -33 21 77 28 -21 43 -9 4 42 2 -20 -24
$$ packed form
5753B8l2k6OLM6%j8j3M8k2k7K4o8O4k0oJ2K0p4J2O0j9j2J6J8q3P7k3J3L5m3L2
5785B8J6n6m3M2J6kj3J3K1k0m7O1k6MoM0n9N3L5o4K8j1NmL1K8o3jM2m6k8J1j8
5818c3M8l4L7j5J0Ro3M4k9N0jn1K3j2K8JOp2M1Rk4J6PlM0K0p5M9j9%K7q7L4j7
5852c6N0l5J3j2N0n4L7j6K8k3l0J3J0j6J9j6rK1k8K2j9O8k2l0LL0Qmj0k5N1m6
5884hJ7l0K6RJ9j9pL8j04M9J4lk2K5nM2k2n3J3J5O7l6n0L8K6o3P7p2QM4J2m5J1
5917A1j1j2%RK4o5J3PJ9P2m6Or4R7l1mM0m1n8J05op6J8mk2J4L2j0%l3P2k8m4O7
5951B1m2K5k7L4k1k8Q5q6Q7k4k1k3rj1O5m0L9j5K6o4L1k0N1kr0P5k4L8K5n4l5
5982c4J04j22J01o1j2M2k0O1m6ll2L6l2ljM4J5j0qn2N4N6m9m9O4n2J3L8m0k2m
$$ plain form
6013 -24 -1 27 35 15 -4 26 33 -9 16 -20 47 -10 10 24 -45 -42 -58 0 -56 34 32 -16 -6 -34 -23 -18 21 4 45 -6 12 17 9 31
6047 31 -9 -8 -27 1 23 2 -4 -25 49 -22 -44 39 4 53 -20 12 7 -8 -9 -44 34 -20 22 -10 -1 -26 3 -34 -18 -7 -35 44 -28
6080 -28 20 -18 -3 -24 -30 -19 -26 -34 6 -4 -51 19 -13 -10 -6 47 19 9 -19 -2 -20 19 40 -15 13 -19 -6 -51 73 -9 14 -7
6112 -7 12 13 -9 -16 -13 59 13 -68 38 9 13 -45 -11 10 26 -5 14 -13 -2 -34 -24 -4 -17 3 -13 17 10 32 -19 -45 7 -1 12
6145 12 3 12 -11 12 -53 -35 -8 -7 4 -47 6 4 -1 -23 4 18 -21 5 -10 2 -14 27 11 -11 -42 -13 11 -21 11 48 -30 -10 -1
6178 -1 -17 -5 -9 -80 25 -19 25 12 -7 62 20 -11 10 71 45 6 -30 56 -13 -27 1 19 69 -11 26 -10 4 -32 24 19 43
6209 43 31 -57 20 -6 22 -27 -27 -57 35 1 4 1 50 -14 26 23 -2 23 25 -6 -46 29 10 32 -9 4 22 -31 -11 4 24 -3 13
6242 13 -18 -18 42 -1 38 -51 11 -22 -10 -21 19 15 -38 1 31 -20 -21 12 -13 -10 56 -7 1 -13 -67 -28 25 34 11 -2 -56 49 28
$$ packed form
6013b4K3K8Qk0j9L0Pm2K5l6O7n7K0J4o9Lj6N8n6R0km8J0k8J1NL9j7M1n1J8NqK2
6047C1m0Jj9K8K2k1ok1P4p1k2Q3l5M9p3L2nj5jl5P8n4M2l2Rk5K9l7J6J1k8P9p2
6080b8M8l8J5k1oJ1pqM0j0m7P0l2LMN3k8j0k8J7j8L9K1n5K8l2J3m5J24q2K3k1
6112gJ9Jk2pLP2m6q1J06k9Mn8L4K1J6l1J9k7J1l2J0K0j3K0j6L0pK2n1k6N2qJ3
6145A2rRk3K3o5J8K7JJ1n1N3knk2K7J4l9K6j5J2j6M1j6k2l1K9K4l2L2L7p8K0R
6178aj6J2mp1J05m4M4j3j9O9m2l1K1O1k6l9l6Q6o9j4K8J8N0q0L7l6J4l6N6nK4
6209D3j2q8P7k6K8m9%l0R2l4LlM9o4M0lk5K5Kl1m0P5j9K2m1J3J8n3K0J5K0k7J6
6242A3l1%O0m3L9q9O2l3J2j1M0mn3L9L0n1jL3k5LO6o3Qj4n4L9N3Rk3j3n4J05k1
$$ plain form
6275 28 15 23 29 23 -10 -4 -13 -31 12 -16 50 -26 21 -19 12 -6 -5 22 -89 14 11 -10 -22 23 0 8 -8 5 46 11 -36 15 -11
6308 -11 -5 4 51 -3 -25 15 14 2 -1 10 19 -15 -26 25 -1 -8 48 -12 -32 35 -11 1 20 13 -5 4 4 17 21 20 0 -1 42 -9 -64 20
6344 20 -8 -21 76 -10 18 -36 45 42 -24 -35 42 57 15 55 -22 -18 23 18 -44 -17 12 24 -13 20 -13 -32 -49 4 41 41 48 -19 11
6377 11 37 66 -40 7 2 5 -4 18 3 11 -11 -13 64 -5 -36 -63 22 44 21 -6 -35 -20 1 -27 -28 -64 2 -4 -20 -8 40 -3 0 6
6411 6 -43 -20 -21 -5 -24 -6 4 19 -23 -3 14 -9 -9 -42 -26 40 42 -36 3 27 1 3 1 -26 54 8 -16 3 -53 -18 10 51 -42
6444 -42 7 38 -15 0 2 -61 -1 -11 4 -1 7 -17 2 44 19 41 15 27 0 3 49 4 -24 -25 -27 33 -40 7 -37 -23 -27 -10 -22 -53
6478 -53 -67 12 18 8 -21 -14 -20 -18 -8 24 41 -19 -9 28 16 -8 9 32 -10 -13 -30 -12 -5 21 7 -7 17 11 -21 2 -30 8 6 -40
6512 -40 16 11 -37 9 -33 -3 51 8 -25 41 -35 -5 -4 -16 6 -37 12 -35 -3 -7 18 -59 18 53 43 -10 -70 -13 -9 -17 -35 -31 37
$$ packed form
6275B8j3QOol3Orj8M3k8O6p6M7m0L1j8JK7j11J03lk1j2M5k3Qj6J3M1l5m7N1k6
6308a1ORM7n4k2M0jj2lJ1Rl4j1N1k6pN6o0k0O7m6J2J9pj8R%J3Mjk0jM3n1n5Q4
6344B0k8j3R7q6K8n4Q1lo6j1P7J5m2M0p7MM1no2K7K9J2l7L3l3j9j7N3L7%Po7L0
6377A1K6K9j06M7nLrK2j5Qk2kP7o9l1k7Q5K2k3k7k9J5K1k8jl6O6oj6J2M8m3LO
6411Fm9K3jJ6j9J8J0J5m2K0J7k3%l3J6O6Kp8L9K4k6Kkk7Q0m6k4J9n6L5K8M1r3
6444d2M9L1n3J5Ko3O0j0J5nQk4J9M2k5K2k6J2k7LM6m5k8jkO0p3M7m4J4mJ7j2l1
6478e3j4P9Oj0k9PoKJ0L2J7o0J0L7j2k4J7K3m2lj7J8PK6j4j4K4ol2K3l2L8km6
6512d0N6nm8M6m2L0N4m3l3O6p6L0Jj2K2m3M9m7L2mK5p7P7L5j0n3o0N7Mqj8MO8
$$ plain form
6545 37 0 -15 -23 7 38 43 -21 20 -9 -50 -19 -6 -18 -16 23 -31 8 -25 -20 61 39 -3 -31 21 -4 39 -6 11 3 36 -42 -11 8
6578 8 -25 -26 -32 15 10 -63 -41 24 29 -5 11 13 36 31 -31 26 33 23 1 8 14 10 9 23 -14 24 5 26 3 -20 -30 -22 14 -1 15 19 -31
6615 -31 50 -57 -31 8 -35 9 -45 -18 11 26 -13 74 -32 -1 9 -44 11 -30 25 50 24 -4 -9 -13 -25 -7 10 31 8 55
6645 55 32 -16 13 35 -7 -21 41 -27 12 -5 26 17 29 -47 -23 54 -21 -2 -20 -21 -38 -32 -53 47 -33 -26 29 -32 -41 20 -11 -57
6677 -57 -36 36 11 -2 5 25 -40 65 11 7 0 10 12 20 48 -2 29 9 14 -7 -6 10 -9 28 14 5 -56 -16 -10 -11 -55 9 19 -1 2
6712 2 -6 21 -28 68 24 30 -1 -1 -10 6 29 30 -15 -8 -20 3 6 -40 9 22 -30 1 32 6 -26 -32 33 -42 11 10 -5 28 21 53 -26 12
6748 12 34 -29 -14 22 -30 -4 24 -30 2 -22 -14 -26 -21 23 24 -31 -5 -3 -40 -5 67 -80 -37 1 -46 45 -10 -21 6 -10 -7 9
6780 9 35 4 24 -30 -62 41 11 -20 -54 -21 -37 36 20 -49 -31 -3 -13 -23 -15 71 59 -10 21 39 24 -15 34 4 -37 9 -42
$$ packed form
6545C7l7j5qL0L1No4M1k9m1L1J3j2KL9n4L9l3NQ1k2m2k8N2k5M3m5J7qL3p8L1J9
6578Hl3joM7np3K2O5Nl4J6KK3no2N7Pj0k2POmjJ4l7L8j9K1k3k3j0QL6j5J6Mn0
6615c1Q1j07K6L9m3M4n4K7K9J5l9Q7j06L1J0n3N5m1N5K5k6k8nmj2J8J7K1k3M7
6645E5k3m8K9K2m2j4O2o8L9j7L1rJ2p6K4P7p5J9j8jj7Ok1J00q0PN5o1rO1l1m6
6677e7K1P2k5j3PK0o5J05n4mpJ0KQK8n0L1k0Nk1JJ6j9L7j4ro1M0Ojm4O4J0k0L
6712BqK7m9R6m4Ol1%rJ6K3Jm5Pj2K3Lm6M9J3n2L1L1k6l2oO5p5N3jj5L3pL2p9L8
6748A2K2o3J5L6n2K6K8n4L2k4Qj2NM4Jn5K6Kl7L5P2j47M3L8m7R1n5j1K7j6LJ6
6780IK6l1K0n4l2J03l0l1l4L3j6P3j6o9J8K8j0j0QQ6j2o9L1J8j5l9M9l0m1M6n1
$$ plain form
6811 -42 -34 23 6 1 -9 21 43 52 -25 -42 33 -32 13 67 -2 16 -9 -9 14 -19 -38 14 -15 -23 -5 19 -33 8 -18 39 -31 0 6
6844 6 59 8 50 -13 5 26 -35 -21 35 31 -5 41 34 -74 67 -4 -56 14 3 0 37 4 12 27 53 -10 42 24 -67 -12 28 -16
6876 -16 -17 42 0 10 43 7 -58 19 10 -40 -9 29 -2 -10 0 -42 -1 9 -50 12 13 -15 29 -44 -75 -42 11 -28 -26 14 -30 6 12
6909 12 -12 5 -20 -23 17 -23 12 44 15 22 -27 47 22 -44 43 -34 -21 4 17 -5 -38 18 -31 9 -13 -14 39 24 -68 -12 -31 -55
6941 -55 20 -40 9 -19 8 -13 34 -28 -4 -15 9 -7 -69 -16 -29 -15 7 -24 -33 -39 -8 4 0 -10 -20 -14 35 4 2 15 -42 16 16
6974 16 15 -44 -26 13 7 23 -17 5 -16 40 -51 20 -23 -61 21 -25 14 -25 31 14 -16 -15 57 19 33 -36 38 -35 -29 23 -1 -1 -56
7007 -56 -17 -15 -11 51 -5 -34 2 -7 16 -19 55 8 22 17 -2 -36 -25 -2 6 -41 -9 23 27 -37 40 10 12 14 2 -31 -28 50 27 13 -3
7042 -3 -17 20 -17 -13 -9 15 15 1 -58 38 -35 -77 -27 -23 2 -42 14 -29 10 24 23 -4 6 -12 -2 -20 -31 40 -25 16 -25 10 -13
$$ packed form
6811d2QN7j7nj0L0K2Rp7j7P5o5M5N4o9J8k5%K3l3j9N2k9qJ8K4n2M1k6N7p0L1O
6844FN3n1M2o3J8K1o1J4N6ml6M6pj08J41p1n2P0j1lL7l3QJ5K6o3N2j8r1N5M0m4
6876a6jN9m2J0L3l6o5P7rn0L1L8l1qJ0m2M1J0n9O2Jk8M4p3l1L3N3l9KM0m4L6O
6909A2k4J7k5lM0m0L5L2k9Pm9P4k5o6Q7p7J3K5J3k2l3N6m9M0k2jN3j5r2N6j9k4
6941e5P5o0M9k8K7k1M7o2K4j1K4j6o2N3j3J4K2l1roL1J2mj0j0OM9l1kJ3n7N8%
6974A6jn9J8L9oJ6m0K2k1N6r1P1m3l8Q2m6L9l9N6j7l0JP2l8J4o9P4p3ON2k4%n5
7007e6L9KMO2n6k9L6rK3l5P4m7J4nj9l4J1K3Qm7L2L2Mo4P7l0KKj2l3LP8k3j4j6
7042cj4L7l7MMK4%j4n9R6p3m2N0MK5m4N6m3L9J4jk7J0j8J0j8j1P1o5M1m1L5k3
$$ plain form
7075 -13 18 31 -49 15 -3 -55 -4 -25 -2 -32 28 -27 -22 -36 -3 14 13 7 -37 11 -17 -78 -50 5 2 11 -22 -6 0 -16 -15 15 -8 -19
7109 -19 -63 26 30 15 -15 -11 11 -28 35 6 8 1 11 -21 -2 20 30 15 10 -12 -39 5 -42 24 -39 23 -18 0 -18 32 -48 -52 -34
7142 -34 18 -49 -57 -8 18 4 28 21 -25 2 -55 -5 -9 32 -2 37 44 -24 -5 -32 69 -13 -10 -8 -17 -70 10 -8 -55 10 -18 -32 -16
7175 -16 43 -29 25 10 28 37 15 28 9 46 -31 -45 -18 14 42 24 -84 43 -23 -41 -10 23 -12 -7 -40 -25 41 38 32 -44 12
7206 12 68 -29 49 20 -7 -4 35 2 -3 41 4 -49 -22 49 -14 -24 38 -12 -63 -24 16 17 17 5 -27 -3 -26 25 3 31 -8 -24
7238 -24 -9 -22 -3 9 -8 10 61 0 6 -32 35 -19 -27 3 -59 27 40 17 58 -32 -16 -11 25 39 17 1 -28 15 0 20 35 -26
7270 -26 -26 -58 15 11 15 10 16 12 51 41 -17 35 35 -12 -4 -23 -25 -20 32 46 -2 -2 -7 56 -32 -25 6 -8 -38 -28 -12 -13 -67 -49 -5 -10 -15 -52
7308 -52 -65 -3 -30 -8 -5 2 -2 -5 48 -24 -54 -18 -26 -47 19 23 -46 24 -6 10 -19 3 11 -39 -11 -4 -2 -60 -13 19 9 -30 41 7 32
$$ packed form
7075a3L1J3q0O4j8n2N1k1K3l0O0n5Nj4L3J7jom4M8k8o1K8N5lRl3J6Oj6JL0k3j1
7109a9m4Q9Mj5l0MK2l9O3k9KpJ0l2J9K2J0j5nk2k7M4m7O6o3O2m1J8j8N0q0mJ8
7142c4N2o7qM9K6j4K4pm6K7n7N0mM1l4L9Po8J9k7J01q2LKrn3Q0j8m7O5k8j4J6
7175a6N9p2N4j5J8Rk2J3j9L7p7j4K7L2K8j8j08J27o6j8L1L3l5Nl3J5O6lop6N6
7206A2N6r7P8k9k7LL9l3nM4l7n3K7P1o3j0O2n0n1L9M0J%j2l2K4k3N1k2K8l9j6
7238b4J5j3J9J2j7J8N1o1Ol8O7n4qL0o2Q6J3k3M1r0J6NL6J4k2j6k9M3j5K0J5o1
7270b6%l2P3mMnOmL9j0n8N2%m7Qj9kNN2J4m8%nO3q8PL1j4l0J0J6jn4J8M4nnl7
7308e2j3O2k7K2LPmlN3p2l0L6qk1O6Mo9P0l0J6k9K2Qn0K8PKn8M7L2j0l9P1l4K5
$$ plain form
7343 32 28 -21 -48 -11 18 -32 30 -57 -4 -26 3 -26 -17 15 -56 2 10 18 10 -5 -8 -8 -10 -17 43 49 27 13 3 -5 -4 50 -6 -9 20 16 33
7380 33 -12 -13 44 39 -21 -30 23 6 -7 11 15 -32 28 33 10 49 -9 19 26 -5 -19 2 -6 34 -17 9 -55 41 58 -3 36 7 -91 -27
7414 -27 -44 18 -68 35 -2 15 -8 -24 30 33 -8 -3 40 61 -11 -9 -5 -6 -12 -64 6 13 -13 -45 -17 -79 -40 10 21 24 -44 -4 4 20
7448 20 -11 -48 22 -40 5 48 9 -22 0 43 -20 2 -41 5 10 -6 -23 7 26 13 5 -37 40 -4 -54 -15 9 -23 -45 -5 10
7479 10 6 -51 -37 14 -20 71 8 -24 -20 -44 -13 -46 13 33 -2 -4 -40 -29 35 -5 -30 -45 -9 -27 2 -11 -36 -20 -29 -27 -16 -29 -29
7512 -29 -7 -33 -13 20 -8 7 -45 -11 -24 -29 42 -3 23 -28 7 -18 30 -7 -22 37 6 38 0 21 24 -9 29 -18 36 -47 0
7543 0 -23 23 -21 -3 -31 -41 -9 -47 6 -17 20 53 15 -2 -3 -28 -4 10 -2 3 -23 -7 27 -26 2 12 -6 -4 -6 38 -31 31 -44
7576 -44 25 13 62 4 -14 -8 -30 15 -18 -11 11 -17 -18 51 -25 70 9 -13 16 38 -11 -46 -30 26 20 17 28 -40 22 37 -38 18 -44
$$ packed form
7343C2mm9k7L7K9n0O2q7N3k2K9k9RL2p1N8QQqj5l%kpO0Ok2j4j0qJN4n6lK9mJ7
7380C3m5jN7no0rN3j7j3J8Mm7O0Nk3L9n8K8Pl1j4K1qM0n1K6o4R6J7o1L9k9r8O4
7414b7j7O2q6J03l7J7k3j6N4Lm1NM3K1p2KMjon2P0Pk6l2K8o2L9N0J1Lo8M0QJ6
7448B0l1l7P0o2M5M3l9l1K2M3o3K2m3M6Nj6j7L0J9j3qm2P7m4n0L9K4l2k2M0J5
7479A0mn7J4N1l4R1o3l2Mk4L1l3N9K0l5kl6J1O4m0k5j5L6j8K9j3k5J6rKJ1j3%
7512b9K2k6K0L3k8J5n2L4j3nP1m5K6n1L5k5M8l7j5N9l1L2l8K1Ll3L8m7N4q3M7
7543@k3M6m4J8k8j0L2l8N3k3L7L3l8j7jk5K4J4j2Nk6J6L4n3K8J0j8KkM4o9O2p5
7576d4O9j2M9n8j8Ok2M5l3PK2k8jO9p6R5o1k2K9K2m9l5J6N6olJ1o8O2J5p5N6o2
$$ plain form
7609 -44 11 -53 -11 -7 2 46 6 15 16 51 -32 39 -20 -13 55 24 -17 41 8 -3 3 -23 18 -9 21 34 -28 -49 8 -58 0 -29 -44
7642 -44 -20 -75 -33 -17 -5 0 -22 34 -70 -29 -45 8 -12 12 59 4 -9 -51 10 -42 -1 30 53 -1 -66 -77 -32 9 -40 -43 -13
7673 -13 -35 54 -23 18 -35 -17 6 -14 56 -21 1 22 -21 -28 86 31 24 0 23 2 19 23 -10 -71 6 20 37 25 32 24 -1 -43
7705 -43 4 -5 11 3 -58 24 -26 5 -36 -13 -5 30 -29 1 26 10 -10 20 12 6 29 49 -1 -45 -36 -23 -14 -12 -36 -47 -11 -12 -32 16 32
7740 32 20 -30 52 -28 -6 -64 65 -16 -35 -13 32 78 -23 -44 2 -38 -6 -9 -7 1 -29 11 -29 31 -6 43 -15 -18 -12 -97 -11 18
7772 18 8 11 -25 26 -3 16 -8 -30 -24 -6 -102 9 25 19 24 32 -21 -14 -29 12 2 -9 -6 -55 21 -33 74 -21 13 12 -27 25 31 -79
7806 -79 -26 62 0 1 -13 -24 18 -11 59 4 -16 11 -5 -34 -62 27 -21 9 16 -31 24 -21 -6 -6 -27 -2 8 -18 11 -30 37 6
7838 6 -5 -1 -28 52 -42 -20 14 -3 -7 33 33 -16 -6 -49 -13 14 -8 27 5 77 22 -29 -25 -34 -2 50 -31 13 -39 1 -17 54 9
$$ packed form
7609d4N5o4M2MRM4m0RJL5q3P1n9PO8l1m1N8l3j1Ok6M1k7L0J3o2k1N7o6N8k9j5
7642d4K4n5M2J6J2Nk2N6j04M1j6N3k0K4M7n5j3m2O1n2M1L1K3n4o5j1M5M1m9lL0
7673a3k2Q9p7M1n3J8K3k0P0p7K2K1m3pJ14n5pk4K3k1J7Ml3o1P7J4J7j2Pqk5m2
7705d3M7rJ6qo1Q2n0L1m1K3QL5n9L0K5j6k0L0qoK3K0n0m4RJ3RKk4j1L6jk0M8J6
7740C2j2n0Q2q0K2n8J29q1j9K2M5M6j01k1M6m0L2lKQl0M0m0O0l7M9n8lOq5Q6K9
7772A8j0Ll6N1k9J9k4k2OJ8r6J11J6oNQn3Pj5M1j0j1Lm9P6n4J07r5L4jl9N2Oj10
7806g9N3Q8o2Jj4j1M2k9P0n5k0K7j6k9k8Q9m8L0Pm7N5m5J5%k1K5J0k6K9m1O7l1
7838Fj1Mk7Q0r4K2L4j7mM0%m9J0m3L6K7k2L5k2P2n5n1MrL2N2q1M4n2M0j8P1m5
$$ plain form
7871 9 -19 -11 -13 68 -30 -13 -7 -2 48 15 7 -5 19 -40 -29 -2 -5 -8 10 -18 5 6 -8 11 -4 -2 2 42 -44 28 56 35 83 8 -28 31
7907 31 7 42 62 44 -5 51 -24 16 32 -21 -21 -17 -38 5 40 7 -25 -31 9 -17 -13 -19 -33 -27 -11 -6 -16 24 -6 14 -16 -7 -14 24 2
7942 2 -13 42 2 21 48 45 -51 9 41 72 -65 -55 34 36 22 1 2 24 -22 -2 3 -22 17 21 -34 -23 14 18 -20 21 17 -14 28 31
7976 31 12 19 35 -46 51 28 -4 -12 -4 7 -30 -10 7 -2 33 54 -5 -14 -35 -31 7 48 31 -25 12 55 21 18 45 49 13 52 30 -2
8010 -2 13 62 37 30 31 17 4 -41 -11 7 -49 -18 19 -2 19 -22 21 59 9 27 4 -21 4 27 -59 -12 19 38 3 -18 -41 13
8042 13 39 28 -20 25 12 6 15 20 6 -31 7 -18 -42 -31 -10 17 -40 4 31 1 39 -39 -31 -16 21 10 10 -10 14 -20 24 6 -29
8075 -29 15 18 27 10 -9 -19 40 1 -18 -68 -41 15 13 -24 3 -9 7 5 13 24 -15 30 14 1 25 -52 14 15 4 12 -15 31 6 -12
8109 -12 -5 57 3 -22 24 -34 -20 -17 16 40 27 -38 -15 -7 -8 12 -8 44 -18 -12 -5 26 24 -45 -37 6 23 14 -7 -29 41 -3 35 -13 61
$$ packed form
7871Ik8QkQ1r8J7ONN0l3qj2K4n9J1K7llJ8k8K3Jj4J9j5KMM0q6P2K8k1M8p5l6N9
7907C1k4L5K0j8m9N6p5M0J6n3%Mk1M3L5l3l2oM0k6Moj4OJ6Nj0M0l0K0l0RpL8k2
7942Bj5N5m0J9K7lr6O0L2L1j37J0Q9Kj4k1JK2m6K0Nk5L9Mn5J1L7Ml8M1ml1M2L
7976C1j9PJ6q1R7k3l2qQJ1l7K0J7rL5K1n9rk1ML8M1j7n6L7M3l4lK7Ml6L9k2l2
8010bJ5M9k5pJj4j3m5L0J8n6L1L7k1K1m1M3L8n0J8k3k5K5K3q6M7L1J9l5k1k3N4
8042A3K6j1m8M5j3oRNj4l7L8k5k4J1K1K7n7M4K7l0L8p8QJ5L7j1%k0K4l4M4j8l5
8075b9M4LRj7j9j0N9l9j9n0K7N6kl7K7j2J6kQJ1l9M5j6j3K4p7O6Jj1Qk7M6k5j8
8109a2PO2n4k5M6n8J4LL3K4j3o5K3QjK0k0N2o2OPL1ko9QM3J7rk1k2P0m4L8m8P4
$$ plain form
8144 61 20 8 26 21 -13 -37 24 -2 -15 -57 -33 -13 -23 -16 -6 -3 -6 -3 12 -2 10 -23 13 3 -5 23 -21 -49 -20 8 38 -41 -50 -18
8178 -18 12 6 17 -34 54 -13 -35 62 -15 8 19 20 43
$$ packed form
8144F1m1j2J8nl4k4O1k6j3m2K4K0j0PJ0LlLJ5j4J2l3L6j0qK8m4k8K9K8L0p9rL2
8178a8L0oJ1n1Q8o7k2R7p7K3J1JK3
8191D3
$$ Imaginary data points
##PAGE= N=2
##DATA TABLE= (X++(I..I)), XYDATA
$$ plain form
0 0 0 0 0 0 0 0 0 0 0 0 0 0 -8 8 -8 8 -16 16 -24 24 -32 37 -40 51 -60 72 -80 96 -110 127 -144 164 -187 212
34 212 -240 270 -303 341 -382 425 -474 529 -586 650 -719 795 -877 967 -1066 1175 -1293
51 -1293 1425 -1570 1731 -1913 2114 -2343 2607 -2910 3265 -3688 4200 -4836 5654 -6744 8277
66 8277 -10611 14635 -23526 86559 -90727 -23674 231594 -103511 -41390 293399 73638
77 73638 -122336 160720 47050 -203536 33038 109445 -182390 -93095 62849 -146355 -159594
88 -159594 73328 -25067 -156866 4387 28373 -126792 -19449 119755 -16918 -56005 106091
99 106091 48780 -58681 108164 158068 -33531 15957 131733 -45506 -66412 142005 32084
110 32084 -109438 73868 45494 -151037 14919 104916 -119865 -66610 77450 -111577 -115699
$$ packed form
0@%%%%%%%%%%%%qJ6j6J6k4L2m0M8n6O9p7R1j11J32j52J76k06K37k71L08l51L99
34B12m52N10n73O44p23Q07q99J003j115J236j369J514j672J844k033K241k468
51a293K718k995L301l644M027m457M950n517O175o953P888r036J0490j2398J5021
66H277j8888K5246l8161J10085j77286O7053K55268l35105O2121L34789k19761
77G3638j95974K83056j13670k50586K36574P6407k91835Q9295J55944k09204j3239
88a59594K32922r8395j31799J61253K3986j55165J07343J39204j36673l9087J62096
99A06091n7311j07461J66845M9904j91599M9488J15776j77239k0906K08417j09921
110C2084j41522J83306k8374j96531J65956Q9997k24781N3255J44060j89027m122
$$ plain form
121 -115699 110641 9831 -94852 74245 12168 -148914 5088 67980 -66357 18395
131 18395 96035 -50967 -49647 58300 -8965 -29678 69813 36825 -27797 28423 39750 -7653
143 -7653 19142 46087 10062 -1843 24299 23379 -2097 1313 12800 -24625 -44670 -4889 -12301
156 -12301 -45871 -9705 -9670 -68009 -38321 375 -44253 -22264 31540 -21930 -30538 38150 8296
169 8296 -8745 66738 43108 -7284 52805 46485 -9949 45964 57214 -17251 9706 33551
181 33551 -36070 -16883 31173 -31032 -40409 6828 -45032 -65762 -2487 -21288 -48822 5312
193 5312 1122 -37103 2278 18919 -13661 7979 32514 6725 10215 36244 24952 14689 25646
206 25646 21993 6537 2479 11149 7492 -11029 -3544 5899 -22297 -20779 9613 -15611 -31358
$$ packed form
121a15699K26340j00810j04683J69097o2077j61082J54002O2892j34337Q4752
131A8395P7640j47002J320J07947o7265k0713R9491l2988o4622N6220J1327m7403
143g653K6795K6945l6025j1905K6142r20k5476L410J1487l7425k0045L9781p412
156a2301l3570L6166L5n8339K9688L8696m4628K1989N3804n3470q608O8688k9854
169H296j7041P5483k3630n0392O0089o320n6434N5913J1250p4465K6957K3845
181C3551o9621J9187M8056o2205r377M7237n1860k0730O3275j8801k7534N4134
193E312m190l8225L9381J6641l2580K1640K4535k5789L490K6029j1292j0263J0957
206B5646l653j5456m058Q670l657j8521P485R443k8196J518L0392k5224j5747
$$ plain form
219 -31358 8387 -7234 -41486 4164 14184 -32373 2675 32654 -23918 -10960 39046 -9480
231 -9480 -20633 38244 6323 -29048 26120 20490 -27383 12314 29096 -22263 -6207 27531
243 27531 -10962 -15618 22903 3275 -18443 10018 10948 -14318 -2709 12792 -5859 -14113 5634
256 5634 2727 -18478 -4858 10242 -14443 -16388 12545 -2945 -22531 10589 11710 -22583 3350
269 3350 24376 -14975 -4322 32773 -1747 -12107 30951 10416 -18285 20276 18680 -20821
281 -20821 4696 21208 -18413 -9983 18363 -12291 -21048 9634 -5421 -24731 -94 1908 -19202
294 -19202 -6202 7667 -8285 -8400 9514 3382 -6797 7249 12247 -1276 3035 15868 5576
307 5576 -1771 12920 10322 -5852 5378 12023 -7362 -3778 10283 -6354 -11802 5293 -3376
$$ packed form
219c1358L9745j5621l4252M5650J0020m6557L5048K9979n6572J2958N0006m8526
231i480j1153N8877l1921l5371N5168n630m7873L9697J6782n1359J6056L3738
243B7531l8493m656L8521j9628k1718K8461R30k5266J1609J5501j8651q254J9747
256E634k907k1205J3620J5100k4685j945K8933j5490j9586L3120J121l4293K5933
269C350K1026l9351J0653L7095l4520j0360M3058k0535k8701L8561j596l9501
281b0821K5517J6512l9621Q430K8346l0654q757L0682j5055j9310K4637K002k1110
294a9202J3000J3869j5952j15J7914o132j0179J4046M998j3523M311J2833j0292
307E576p347J4691k598j6174J1230O645j9385L584J4061j6637n448J7095q669
$$ plain form
320 -3376 -15593 74 799 -14445 -3732 4382 -10547 -6770 5528 -4982 -6698 6088 2097
333 2097 -3038 6336 6964 370 4081 7021 1236 971 5322 2832 1009 4275 4098 1108 701 926
349 926 -1568 -4104 -2911 -2522 -4534 -2396 -52 -2020 -1661 -72 -2314 -3730 -2832 -2582 -2840 -1018 1267
366 1267 1589 2117 3169 1876 544 161 -668 -1392 -854 1100 1956 2354 4297 3409 1199 1983 -237 -2690
384 -2690 211 -76 -1574 2932 3744 162 2660 3123 -3908 -3391 -112 -6952 -6298 2175 -3039 -5204
400 -5204 4652 -178 -7399 1343 -214 -9464 -805 4356 -4220 1333 10821 2346 795 10400 3705
415 3705 -3074 5375 4304 -3224 2574 6867 228 -736 4205 -394 -7916 -3535 -950 -9310 -7370
430 -7370 1887 -4419 -8694 3509 2190 -9444 1061 6890 -9302 -2981 12821 -2066 -3467 16753
$$ packed form
320c376j2217J5667P25j5244J0713Q114j4929L777J2298j0510j716J2786l991
333B097n135R374O28o594L711K940n785k65M351k490j823L266j77k990m07K25
349I26k494k536J193L89k012K138K344j968L59J589k242j416Q98K50k58J822K285
366A267L22N28J052j293j332l83q29p24N38J954Q56L98J943q88k210P84k220k453
384b690K901k87j498M506Q12l582K498M63p031N17L279o840O54Q473n214k165
400e204R856m830p221Q742j557r250Q659N161q576N553R488q475j551R605o695
415C705o779Q449j071p528N798M293o639r64M941m599p522M381K585q360J940
430g370R257o306m275J2203j319j1634J0505N829j6192O321J5802j4887j401K0220
$$ plain form
444 16753 4276 -8085 12075 8039 -10847 5954 11306 -11470 -2496 12288 -7421 -7129 11665
457 11665 -3565 -13130 4773 -505 -11981 2980 5483 -8086 -2571 4400 -4059 -3414 5244 2015
471 2015 -3442 -151 1881 -1397 -1408 4388 3822 -4112 -605 5372 -2841 -860 10565 1112 -6058 5965
487 5965 1885 -7313 6281 8552 -6107 131 6225 -7400 -3795 7355 -4074 -7613 1078 -6093
501 -6093 -8453 2037 -200 -3593 33 -3966 -4792 1001 -49 2371 6828 -1097 -960 8758 2421
516 2421 2540 16466 4996 -7145 7272 1876 -11253 8982 11636 -11160 -1454 6512 -16699
529 -16699 -10910 9295 -8855 -15086 5755 -4769 -16821 6028 7766 -9882 1388 8677 -7001
542 -7001 -2469 13576 6813 -599 9188 8862 -3098 2363 13507 3017 -5186 6042 2113 -13379
$$ packed form
444A6753j2477j2361K0160m036j8886J6801N352k2776Q974J4784j9709K92J8794
457A1665j5230r565J7903n278j1476J4961K503j3569N515O971q459O45Q658l229
471B015n457L291K032l278j1N796n66p934L507N977q213J981J1425r453p170J2023
487E965m080r198J3594K271j4659O238O094j3625L605J1150j1429l539Q691p171
501f093k360J0490k237l393L626l999q26N793j050K420M457p925J37R718o337
516B421J19J3926j1470j2141J4417n396j3129K0235K654k2796R706P966k3211
529a6699N789K0205j8150o231K0841j0524j2052K2849J738j7648J1270P289j5678
542g001M532J6045o763p412R787l26j1960N461J1144j0490q203J1228l929j5492
$$ plain form
556 -13379 111 11105 -10242 -9537 8998 -10769 -18944 11227 2614 -20251 4368 6376 -22837
569 -22837 -790 21734 -7218 -4157 20633 -7384 -18427 16432 9159 -9307 17364 15953 -14751
582 -14751 -1550 12496 -7658 -3266 15646 860 -10524 3689 2254 -10306 -2199 5477 -5685
595 -5685 -9188 2552 1965 -9558 -2601 5563 -9856 -10588 9923 2055 -9650 9915 7263 -15441
609 -15441 1118 15356 -6402 -89 20265 -2480 -11382 15002 6404 -9754 12300 10807 -14874
622 -14874 -2866 9717 -7291 -3542 11907 -3243 -15755 -3557 -2406 -10776 -603 8943 -2880
635 -2880 -10755 -1582 -1379 -10441 1764 15285 -459 -4486 13590 1692 -11791 12869 13803 -10707
649 -10707 6827 19776 -9713 -4784 19412 -6863 -17343 14446 2401 -19338 9478 9460 -23445
$$ packed form
556a3379J3490J0994k1347P05J8535j9767q175L0171q613k2865K4619K008k9213
569b2837K2047K2524k8952L061K4790k8017j1043L4859p273j8466K6671j411l0704
582a4751J3201J4046k0154M392J8912j4786j1384J4213j435j2560Q107P676j1162
595e685l503J1740n87j1523O957Q164j5419p32K0511p868j1705J9565k652k2704
609a5441J6559J4238k1758O313K0354k2745q902K6384q598j6158K2054j493k5681
622a4874J2008J2583j7008L749J5449j5150j2512J2198J151q370J0173R546j1823
635b880p875R173K03r062J2205J3521j5744m027J8076j1898j3483K4660R34k4510
649a0707J7534J2949k9489M929K4196k6275j0480L1789j2045k1739K8816j8l2905
$$ plain form
662 -23445 -6903 9513 -16755 -9637 17137 -3050 -15878 7981 2208 -15651 5700 15703
674 15703 -5920 -2085 13652 -895 -6958 13876 12099 -7043 2642 11320 -9266 -7091 15887
687 15887 2155 -12101 8730 3633 -20803 -1445 12064 -14346 -7545 14928 -10153 -17750 12937
700 12937 844 -17901 10451 10259 -16890 2525 15599 -10994 -3901 17519 -2731 -7527 16625
713 16625 5883 -9577 8139 6682 -11042 1061 10305 -3726 -1951 7568 -2955 -9122 838
726 838 615 -7034 -1546 2723 -5717 -6476 1930 -497 -5250 1932 3246 -5843 -2123 5411 -1917 -1418
742 -1418 8857 2297 -2996 6816 3829 -3663 5163 5593 -3882 1971 5389 -3975 -359 5176 -4009
757 -4009 -3298 3170 -5117 -5564 2599 -4309 -6310 2824 -2237 -6242 3298 422 -6397 2610 3101 -5372
$$ packed form
662b3445J6542J6416k6268P118K6774k0187j2828K3859n773j7859K1351J0003
674A5703k1623L835J5737j4547o063K0834j777j9142R685Q678k0586K175K2978
687A5887j3732j4256K0831n097k4436J9358J3509k6410O801K2473k5081p597L0687
700A2937j2093j8745K8352j92k7149J9415J3074k6593P093K1420k0250m796K4152
713A6625j0742j5460J7716j457j7724J2103R244j4031J775R519j0523o167R960
726H38k23p649N488M269q440p59Q406k427m753P182J314r089L720P534p328M99
742a418J0275o560n293R812k987p492Q826M30r475N853L418r364L616N535r185
757d009P11O468q287m47Q163o908k001R134n061m005R540k876o819R007M91q473
$$ plain form
773 -5372 2569 7080 -2877 1266 8521 -1254 -1405 7947 1274 -3247 5468 2932 -4782 1269 4025
788 4025 -4380 -2909 3629 -2803 -6285 1428 129 -6845 -1146 3190 -4976 -4246 5107 -710 -6298
803 -6298 5256 4514 -6767 2671 8634 -5330 -1516 10490 -1764 -5724 9784 2822 -8871 5917
817 5917 6522 -10035 -26 8676 -7964 -5224 9075 -3324 -8736 6905 1670 -10139 2336
830 2336 5589 -8431 -2001 7998 -3734 -4888 7665 1397 -6426 4120 5012 -5957 -547 7201
844 7201 -2765 -4225 7220 1650 -6539 3866 4775 -7127 -957 6589 -4692 -4914 7222 -228
858 -228 -7281 5190 3696 -8351 1082 6193 -6726 -2616 7597 -2539 -4966 6877 1466 -6630
872 -6630 3549 4120 -6358 -85 5778 -3793 -2553 5818 -570 -4160 3537 1624 -4912 443 3248
$$ packed form
773e372P941M511r957M143P255r775j51R352o673m521Q715k536p714O051K756
788D025q405J471O538o432l482P713j299o974N699M336q166P30R353n817n588
803f298J1554p42j1281R438N963j3964L814J2006j2254l960J5508o962j1693J4788
817E917O05j6557J0009Q702j6640K740J4299j2399n412J5641n235j1809J2475
830B336L253j4020O430R999j1732j154J2553o268p823J0546Q92j0969N410P748
844G201r966j460J1445n570q189J0405R09j1902O170P546j1281k22J2136p450
858b28p053J2471j494j2047R433N111j2919M110J0213j0136k427J1843n411q096
872f630J0179N71j0478O273N863r571J240Q371o388l590P697j913o536N355K805
$$ plain form
887 3248 -3307 -1581 4098 -757 -2878 3093 1252 -3193 1061 2458 -2604 -822 3278 -604 -1788
902 -1788 3050 755 -2973 1204 1218 -2919 -62 1773 -2021 -1276 1710 -848 -1745 1398 -28 -2150
918 -2150 563 548 -1370 882 1478 -539 719 1316 -250 555 1473 242 127 949 -215 -399 1109
935 1109 -18 -926 506 -640 -2025 -73 -87 -1641 -304 172 -1863 -1125 968 -631 -921 1603 178
952 178 -1677 1367 1564 -854 1538 2352 -943 2 2437 -119 -542 2580 354 -2317 995 643 -2452
969 -2452 556 1349 -2659 -1246 926 -2082 -1548 1721 -703 -2510 764 86 -2283 1247 2050 -1514
985 -1514 340 1918 -1096 20 3067 624 -668 1960 608 -1675 1545 2311 -1465 85 1848
1000 1848 -2296 -1620 2325 -753 -2608 1358 -519 -4164 439 1934 -3351 -524 3052 -3309 -2624
$$ packed form
887C248o555J726N679m855k121N971j841m445M254J397n062J782M100l882j184
902a788M838k295l728M177J4m137K857J835l794P45K986k558q97L143j426k122
918b150K713j5j918K252N96k017J258N97j566Q05R18j231j15Q22j164j84J508
935A109j127r08J432j146j385J952j4j554J337M76k035P38K093j599k90K524j425
952A78j855L044J97k418K392Q14l295R45K435k556m23L122k226k671L312l52l095
969b452L008P93m008J413K172l008N34L269k424j807L274o78k369L530Q03l564
985a514J854J578l014J116L047k443j292K628j352k283L220P66l776J550J763
1000A848m144O76L945l078j855L966j877l645M603J495n285K827L576o361O85
$$ plain form
1015 -2624 4165 -635 -3013 4485 1500 -4434 2773 4344 -3598 1100 6055 -3302 -2600 6170 -950
1030 -950 -4492 5438 1476 -6642 1948 3542 -6324 -1120 5397 -4616 -4938 5255 -1151 -6376 4389
1045 4389 2971 -6740 1011 5512 -4740 -1894 7515 -828 -4855 6276 2939 -6424 3287 6391
1059 6391 -5977 -1238 7676 -3543 -5528 7160 543 -8264 4134 4358 -9138 -484 7300 -6844
1073 -6844 -4420 8654 -2344 -7645 6927 2188 -8890 3822 6929 -7306 -716 8770 -4364
1086 -4364 -4646 8765 496 -6753 5670 3840 -7543 1071 6570 -4989 -3024 6745 -1729 -6308
1100 -6308 4811 2184 -6866 1143 4540 -5584 -2459 6226 -1601 -5056 4782 1395 -6788 2327
1114 2327 5364 -4723 -537 6263 -3291 -4184 5881 986 -4646 4101 3162 -5915 406 4974 -3409
$$ packed form
1015b624O789m800k378P498k985n934P207J571p942M698M955r357P02Q770p120
1030i50l542R930l962q118Q590J594r866N204O517j0013l22J0193o406n225J0765
1045D389j418r711P751M501j0252K846R409q343m027J1131l337r363R711L104
1059F391j2368M739Q914j1219j985J2688o617q807J2398K24j3496Q654P784j4144
1073f844K424J3074j0998n301J4572m739j1078J2712L107j4235O590R486j3134
1086d364k82J3411q269p249J2423j830j1383Q614N499j1559J965R769q474m579
1100f308J1119k627r050Q009L397j0124L125Q685p827l455R838l387q183R115
1114B327L037j0087M186O800r554q93J0065m895n632Q747r39r077O321M568q383
$$ plain form
1129 -3409 -1238 5042 -2252 -4419 2974 540 -3378 2266 2331 -3713 -1452 1814 -1885 -1251 2754 410
1145 410 -1844 508 668 -1062 121 1809 423 -910 787 1229 -810 148 1666 -521 -1016 1322
1161 1322 651 -1014 345 465 -2089 -1223 956 -202 -112 1102 -405 -1643 -990 -316 162 373 833
1178 833 886 -774 -935 1046 657 -465 1557 1277 -2182 -494 2210 -1087 -598 3423 -597 -3191 1745
1195 1745 164 -3596 1545 2583 -3134 -685 2878 -2480 -2428 3406 -86 -3232 2485 1633 -3329 623
1211 623 2967 -1915 -1056 3551 419 -2375 2039 1582 -3380 -292 3142 -1434 -1482 3440 -92 -4232
1227 -4232 1008 1778 -3970 -104 4398 -2630 -3030 3952 -794 -4401 3650 2704 -4436 1073 4136 -3870
1243 -3870 -1534 5624 -857 -3319 4754 1100 -5015 2120 3338 -4112 -343 4415 -2391 -3310 3481
$$ packed form
1129c409K171O280p294k167P393k434l918N644O5o044K261L266l699O34M005k344
1145D10k254K352J60j730J183J688j386j333J697M42k039R58J518k187m95K338
1161A322o71j665J359J20k554Q66K179j158R0J214j507j238O53O74M78K11M60
1178H33N3j660j61J981l89j122K022k80l459J688K704l297M89M021m020k594M936
1195A745j581l760N141J038n717K449L563n358N2N834l492l146N717q52m962L952
1211F23K344m882Q59M607l132k794M414m57m962L088L434m576m8M922l532m140
1227d232N240P70n748L866M502p028m00O982m746l607Q051r46p140N509L063q006
1243c870K336P158o481k462Q073l654o115P135J218p450L769M758o806r19O791
$$ plain form
1258 3481 11 -4610 1778 2631 -4155 -736 3771 -2419 -3113 3632 713 -3994 2270 3450 -3863
1273 -3863 -443 4932 -2036 -2576 5132 671 -4248 3177 2926 -4696 444 4714 -3439 -2520 4593 -1480
1289 -1480 -4774 3361 1091 -5126 1231 2865 -4288 -1356 3766 -1887 -2910 3540 773 -3580 1940
1304 1940 2785 -2644 245 3927 -827 -1455 3309 943 -2706 1513 2540 -2592 -574 3053 -1661
1319 -1661 -2676 2201 -312 -3687 793 1343 -3378 -762 2475 -2230 -2110 2652 -330 -2475 2223
1334 2223 1590 -1927 1188 2593 -1047 -34 2753 197 -856 2022 985 -1250 539 936 -1240
1349 -1240 -689 498 -575 -1385 -294 -41 -1580 -1090 310 -863 -1384 431 249 -1093 127 1175
1365 1175 -415 -265 1737 479 -500 1645 1242 -601 860 1527 -300 -15 1272 184 -897 452
$$ packed form
1258C481l470m621O388Q53o786L419M507o190o94O745k919m707O264J180p313
1273c863L420N375o968n40P708m461m919P425k51p622N140M270q153R19P113o073
1289a480l294Q135k270o217O357J634p153K932N122n653j023O450k767m353N520
1304A940Q45n429K889L682m754o28M764k366l649M219J027n132K018L627m714
1319a661j015M877k513l375M480N50m721K616L237m705J20M762k982k145M698
1334B223o33l517L115J405l640J013K787k556j053K878j037k235J789L97k176
1349a240N51J187j073q10J091K53j539M90J400j173n21J815j82j342J220J048
1365A175j590J50K002j258r79K145m03j843J461O67j827K85J287j088j081J349
$$ plain form
1381 452 354 -1262 -516 477 -1028 -1351 114 -336 -1550 -435 476 -1250 -1155 916 -318 -1213 1251 918
1399 918 -1138 709 1762 -712 21 2395 401 -797 2013 1034 -1370 1137 1636 -1323 -225 1494
1415 1494 -1127 -1557 998 -315 -2184 -59 305 -2288 -949 990 -1338 -1454 1022 -186 -1548 825
1431 825 1554 -792 172 2200 -7 -545 2433 1224 -773 1505 1477 -1263 114 1997 -764 -1324 1347
1448 1347 -530 -2528 427 438 -2422 -511 734 -2120 -1529 1184 -369 -1505 1157 692 -1705 535
1464 535 1989 -562 264 2220 60 -771 1737 1043 -776 986 1387 -1327 -640 1466 -575 -1128 1187
1481 1187 -278 -2151 -29 401 -1618 -365 1114 -1252 -1411 1012 -179 -1252 1176 717 -1479 192
1497 192 1127 -715 181 1822 34 -788 1144 448 -799 1107 1231 -921 100 939 -588 -143 1251
$$ packed form
1381D52r8j616P46R93j505l23J465m50j214J115R11j726R5K071j234q95K464l33
1399I18k056J847J053k474P33K374j994j198K810r79k404K507M99k959J098J719
1415A494k621m30K555j313j869K125L64k593J339J939k328j16K476j208j362K373
1431H25P29k346R64K028k207n38K978j209j997K278k8k740J377J883k761n60K671
1448A347j877j998K955J1k860J911J245k854N91K713j553j136K662m65k397K240
1464E35J454k551Q26J956k160q31K508o94j819J762M01k714O87K106k041n53K315
1481A187j465j873K122M30k019J253J479k366j59K423j191j073K428m59k196J671
1497A92R35j842Q96J641j788q22J932o96j247J906J24k152J021Q39j527M45J394
$$ plain form
1514 1251 -101 -1000 157 -224 -1331 96 595 -1097 -612 194 -1158 -727 685 -244 -785 289 -47
1531 -47 -780 580 1195 -10 400 1113 -344 65 1434 418 48 1057 204 -731 394 671 -575 -148
1549 -148 310 -1240 -1085 303 -626 -996 307 -377 -1413 -247 284 -620 -8 898 -376 -551 982 478
1567 478 -194 1303 926 -574 321 998 -147 158 1147 -93 -919 425 91 -914 297 406 -1153
1584 -1153 -626 242 -707 -557 561 -101 -915 42 202 -587 250 831 -192 -314 375 37 -107 536 697
1603 697 -56 -184 363 75 -138 604 531 -348 -194 294 -168 -299 552 325 -730 -145 305 -762 -265 721
1623 721 -325 -874 118 13 -916 135 871 -634 -575 770 -251 -779 1113 646 -879 341 1058 -719
1641 -719 -154 1653 98 -1132 1146 592 -1552 670 1425 -1444 -599 1452 -1063 -1617 1548 238
$$ packed form
1514A251j352q99J157l81j107J427M99j692M85Q06j352M31J412r29n41J074l36
1531d7p33J360O15j205M10P13j457M09J369j016l70J009q53r35J125K77j246M27
1549a48M58j550J55J388r29l70J303o84j036J166N31r04O12R06j274j75J533n04
1567D78o72J497l77j500Q95O77j145L05R89j240q26J344l34j005J211J09j559
1584a153N27Q68r49J50J118o62q14R57J60p89Q37N81j023j22O89l38j44O43J61
1603F97p53j28N47k88k13P42p3q79J54M88m62j31Q51k27j055N85M50j067M97R86
1623G21j046n49R92j05r29J051P36j505N9J345j021n28J892m67j525J220P17j777
1641g19N65J807j555j230K278n54k144K222P55k869Q45K051k515n54L165j310
$$ plain form
1657 238 -2243 634 1014 -2348 -231 2114 -1359 -1187 2093 -334 -1991 1803 1263 -1981 747 2175
1673 2175 -1680 -617 2629 -467 -1618 2125 629 -2292 939 1765 -2058 -598 2179 -1246 -1899
1688 -1899 2044 102 -2593 1170 1244 -2530 -154 2207 -1597 -1451 2341 -292 -2350 1816 1290 -2328
1704 -2328 706 2253 -1909 -605 2684 -616 -1563 2321 538 -2351 1075 1673 -2053 -76 2213
1719 2213 -1379 -1281 1869 -369 -1940 1178 794 -1958 58 1391 -1490 -891 1581 -566 -1334 1273
1735 1273 391 -1504 410 1094 -1061 -176 1546 -174 -746 1342 410 -1005 938 1028 -734 261 1014
1752 1014 -579 -475 817 -169 -829 465 -11 -1083 -89 -4 -984 -248 163 -667 -303 89 -396 -279 236
1771 236 -76 113 607 162 116 760 183 44 848 437 -85 746 427 -540 198 457 -644 -378 587 -676
$$ packed form
1657B38k481K877L80l362K117K345l473J72L280k427j657L794n40l244K728J428
1673B175l855J063L246l096j151L743j496k921L231Q26l823J460K777l425o53
1688a899L943j942k695L763P4l774K376K361l804J46L792k633k058M166n26l618
1704b328L034J547m162J304L289l300r47L884j783k889L426N98l726J977K289
1719B213l592R8L150k238j571L118l84k752K016J333k881N99K472k147p68K607
1735A273q82j895J914O84k155Q85J722j720n72K088r32j415J943R0j762R95P53
1752A014j593J04J292r86o60J294m76j072R94Q5r80P36M11q30L64L92m85J17N15
1771B36l12J89M94m45m6O44n77j39Q04m11n22Q31l19r67P38K59j101K66R65j263
$$ plain form
1791 -676 -986 328 -291 -1359 122 232 -1264 -267 746 -722 -666 1082 162 -988 995 1030 -1017
1808 -1017 558 1759 -549 -191 1874 -74 -1133 1351 680 -1622 516 1345 -1660 -688 1550 -1185
1824 -1185 -1739 1419 -120 -2197 775 995 -2192 -289 1753 -1356 -1147 2159 -33 -1763 1667 1092
1840 1092 -1851 599 1998 -1227 -489 2382 -210 -1505 1827 776 -2034 822 1739 -1739 -471
1855 -471 2084 -953 -1776 1581 117 -2493 719 1255 -2308 -514 1830 -1534 -1640 1904 -208 -2048
1871 -2048 1441 1225 -1936 408 2171 -1261 -547 2594 -7 -1341 2075 972 -1756 923 1726 -1469
1887 -1469 -369 1828 -936 -1618 1358 -16 -2215 431 709 -2081 -562 1239 -1217 -1280 1302 -64
1903 -64 -1709 901 1079 -1248 452 1909 -585 -280 1823 129 -826 1403 1051 -1052 396 1297 -1011
$$ packed form
1791f76l10J314o19j068J481J10j496R97J013j468N6J748r20j150J983L5k047
1808a017J575J201k308L58K065j948j059K484o71k302K138Q29l005R72K238k735
1824a185n54L158j539k077K972K20l187J903K042l109K09L306k192j730L430n75
1840A092k943K450J399l225P38K871k592j295L332j051k810K856R17l478J268
1855d71K555l037q23L357j464k610L212N36l563J794K344l364j06L544k112j840
1871b048L489k16l161K344J763l432P14L141k601j334L416j103k728K679Q03l195
1887a469J100K197k764o82K976j374k199K646K78k790J519J801k456o3K582j366
1903f4j645K610J78k327J700J457k494L05K103j694r55K229l52k103J448R01k308
$$ plain form
1920 -1011 -499 1203 -683 -1172 722 -40 -1337 49 361 -1223 -536 614 -621 -714 688 -17 -791
1937 -791 457 444 -468 222 817 4 -100 724 311 -229 580 634 -156 171 494 -63 -144 300 165 -312 -68
1958 -68 108 -459 -357 120 -273 -500 -227 -321 -500 -217 23 -174 -305 72 67 -240 54 462 83 108 492 390
1980 390 122 515 714 120 167 612 -23 -110 528 183 -459 -51 -68 -759 -474 141 -573 -783 -77 -529 -902
2001 -902 114 141 -543 34 385 -320 -84 835 454 62 777 614 -163 468 886 175 214 604 -98 -400
2021 -400 213 119 -507 -97 -47 -884 -635 5 -454 -486 17 -410 -767 -157 137 -158 73 458 -115 -185 474
2042 474 449 282 708 442 -17 190 420 299 229 393 68 -355 -115 -49 -169 52 -17 -418 -546 -484 -230 -148
2064 -148 -110 -49 -383 -478 -91 39 61 284 186 -120 -104 257 364 299 530 411 -42 87 360 258 321 406 34
$$ packed form
1920a011N12J702j886m89J894p62j297J386L12j584O87J150j235r3J402p05p74
1937g91J248j3r12O90N95q13j04Q24m13n40Q09N4p90L27L23n57q1M44j35m77K44
1958f8J76n67J02M77l93k27K73r4j79K83K40j97j31L77nl07K94M08l79K5L84j02
1980C90k68L93J99n94M7M45o35q7O38l45o42M08j7o91K85O15p14k10P06m52l73
2001i02J016K7o84N77L51p05K36R19l81l92P15j63p77O31M18p11L9L90p02l02
2021d00O13r4o26M10N0q37K49O40m59l2N03m27l57O10K94k95K31L85n73p0O59
2042D74k5j67M26k66m59K07K30j21p0J64l25m23K40O6j20K21o9m01j28O2K54Q2
2064a48L8O1l34r5L87J30K2K23r8l06J6L61J07o5K31j19m53J29K73j02O3Q5l72
$$ plain form
2087 34 -307 -130 66 -191 11 132 -506 -586 -185 -308 -285 46 -96 -510 -334 33 -183 -53 479 88 -305
2108 -305 187 177 74 511 588 117 53 377 177 53 546 205 -245 34 -47 -336 4 203 -271 -380 -237
2129 -237 -439 -464 57 25 -396 -223 -75 -386 41 304 82 3 204 34 71 402 394 170 286 225 -96 167
2151 167 375 80 186 185 -215 -169 -20 -87 -182 -52 -184 -473 -267 -62 -332 -119 48 -343 -247 109 -128 -52
2173 -52 267 171 -126 150 343 21 246 514 30 -77 386 98 -77 352 233 -229 -46 196 -258 -263 312
2194 312 -157 -518 50 -137 -541 5 106 -473 -305 238 -295 -393 311 137 -369 218 403 -284 160 661
2214 661 -72 -65 586 186 -227 420 480 -281 84 463 -325 -303 400 -129 -556 187 8 -666 -235 251 -495
2235 -495 -526 320 -281 -628 356 177 -523 130 500 -204 -72 770 163 -266 594 421 -390 373 634 -328
$$ packed form
2087C4l41J77J96k57K02J21o38q0M01j23K3L31j42m14J76L67k16J30N32l91l93
2108c05M92j0j03M37P7m71o4L24k00j24M93l41m50K79q1k89L40J99m74j09J43
2129b37k02k5N21l2m21J73J48l11M27K63k22p9K01j70L7L31qk24J16o1l21K63
2151A67K08k95J06jm00M6J49o7r5J30j32k89K06K05k70K13J67l91R6L56k37P6
2173e2L19r6k97K76J93l22K25K68m84j07M63k88j75M29j19m62J83K42m54nN75
2194C12m69l61N68j87m04N46J01n79J68N43n33r8P04j74n06N87J85o87M44N01
2214F61p33PO51m00m13O47O0p61L65L79p88K2P03n29m27P43j79o74M31M86p46
2235d95l1Q46o01l47R84j79p00O53L70p04J32Q42o07m29Q60j73q11P63K61r62
$$ plain form
2255 -328 16 601 -213 -521 346 89 -738 -31 209 -772 -357 447 -471 -561 348 -61 -606 191 440 -514
2275 -514 35 719 -208 -217 792 213 -350 621 485 -422 128 657 -304 -336 592 -117 -694 348 179 -770
2295 -770 -2 292 -664 -394 401 -251 -649 384 148 -582 182 560 -407 6 730 -113 -249 570 266 -349
2315 -349 362 536 -369 32 535 -223 -324 395 -19 -515 163 230 -515 -117 299 -303 -386 279 -150 -456 181
2336 181 147 -350 107 259 -156 -33 341 70 -205 326 253 -78 245 316 -48 -8 190 -1 -44 122 69 -136
2358 -136 -46 83 -156 -200 3 -145 -165 -53 -41 -114 -122 5 13 -131 -5 210 -12 38 181 65 -53 138 283
2381 283 41 52 312 14 -164 261 87 -163 101 169 -222 -140 214 -150 -341 153 83 -413 73 169 -411 -73
2403 -73 356 -149 -295 335 90 -430 230 370 -334 -6 521 -251 -249 510 69 -395 368 372 -441 -11 499 -331
$$ packed form
2255c28L44N85q14l08Q67k57q27P07K40r81M15Q04r18r0R09m09n45P97K49r54
2275e14N49O84r27rJ009n79n63R71j36r07N50N29r61l2R28p09n77J042j69r49
2295g70P68K94r56K70P95o52l98J033k36p30P64L78r67M13P24q43j36Q19l04o15
2315c49P11J74r05M01N03p58j01P19m14m96O78O7p45L98M16o02q3O65m29l06O37
2336A81l4m97M57J52m15J23L74k71k75N31p3l31L23P1l64M0J98j91m3J66n3k05
2358a36R0J29k39m4K03j48k0J12J2p3qJ27Qj44J26K15k22N0J43j16j18J91J45
2381B83k42J1K60k98j78M25j74k50K64O8l91Q2L54l64j91M94p0m96M86R6n80L38
2403g3M29n05j46O30k45n20O60J40p04L28N27p72KP59m41m64P63Mq13M30N10q30
$$ plain form
2425 -331 -305 607 -74 -465 375 196 -690 -10 410 -497 -294 597 -108 -619 399 122 -714 222 492 -484
2445 -484 -90 578 -196 -485 628 239 -529 422 600 -514 -4 774 -261 -329 657 33 -632 365 310 -667
2465 -667 -24 548 -533 -472 578 -318 -672 433 109 -683 48 445 -531 -230 699 -155 -441 643 254
2484 254 -520 418 588 -433 -6 669 -150 -298 616 75 -596 301 314 -632 17 439 -508 -443 304 -235
2504 -235 -586 270 151 -592 -9 296 -469 -147 545 -139 -205 476 102 -293 351 512 -165 129 482 -141
2524 -141 -141 535 58 -270 235 104 -395 1 235 -239 -192 115 -274 -375 132 -90 -345 46 -2 -324 -51
2545 -51 177 -41 -1 185 35 -157 243 254 90 291 188 -59 66 118 23 104 128 -14 -122 -68 -74 -154 51 -79
2569 -79 -240 -138 -138 -242 -5 -15 -220 -83 -28 -137 -64 221 45 -28 185 125 -82 284 289 12 153 217 -114 19
$$ packed form
2425c31K6R12o81l91Q40j79q86O80M20r07K03Q91p05n11J018k77q36R36K70r76
2445d84L94O68p74k89J113l89p68R51J78j114N10P78j035o8R86o24o65R97n5r77
2465f67O43N72j081O1J050q96l54J105l24p92P31L97r76L01R29q54k86J084l89
2484B54p74R38J70j021M27O75q19j48R14n41o71Q97J3r46O49M22r47O5P47n39
2504b35l51Q56j19p43N83L05p65L22O92o84o6O81l74l95O44J61o77K94L53o23
2524a41%O76m77l28N05j31m99L96K34m74M7L07l89j01N07k22k55L91m8l22K73
2545e1K28k18M0J86j50j92M00J1j64K01j03k47J25N2r5Q1K4j42j08N4oq0K05j30
2569g9j61J02%j04K37j0k05J37N5j09P3K85j76p3K13o0k07L66Nk77J41O4l31J33
$$ plain form
2593 19 301 87 -140 144 8 -351 -34 145 -262 -98 98 -302 -260 98 -97 -198 70 -5 -307 -8 212
2614 212 -159 15 361 -52 -163 284 168 -12 261 292 -119 -12 330 -32 -58 324 -30 -268 100 7 -280
2635 -280 -25 96 -257 -300 28 -87 -225 137 62 -304 77 87 -140 91 240 -30 -15 194 141 -24 264 260
2657 260 -65 62 178 -83 119 191 -53 -100 55 -30 -226 -62 2 -203 -179 -46 -267 -116 30 -73 -105 40
2679 40 -46 -81 52 74 102 72 121 67 83 219 124 167 130 49 -21 112 37 20 9 -22 -121 -104 -45 -193 -52 -10 -231
2706 -231 -186 -65 -179 -108 8 -97 -97 -75 74 7 82 143 27 50 191 83 34 216 178 63 77 112 44 26 115
2731 115 -6 -116 25 -98 -217 -10 -58 -217 -76 -70 -171 -147 -13 -52 -157 -4 14 -10 27 166 60 -8 122
2754 122 41 121 118 141 53 50 130 -30 42 42 -22 -27 -56 -74 -73 -31 -71 -77 -103 -102 -38 -107 -7 -44 -8 -10 -56 -13 68 -5 77 59 23
$$ packed form
2593A9K82k14k27K84j36l59L17J79m07J64J96m00M2L58j95j01K68p5l02K99K20
2614B12l71J74L46m13j11M47j16j80K73L1m11J07L42l62k6L82l54k38L68r3k87
2635b80K55J21l53m3L28j15j38L62p5l66L81J0k27K31J49k70J5K09n3j65K88m
2657B60l25J27J16k61K02P2k44m7J55q5j96J64O4k05K4J33k21J51J46j03l2J45
2679D0q6l5J33K2K8l0M9n4J6J36r5M3l7q1p0J33p5j7j1l1r9J7N9j48J41M2k21
2706b31M5J21j14P1J16j05%K2J49o7P5O1j16K3J41j08m9J82l8j15J4L5o8j8Q9
2731A15j21j10J41j23j19K07m8j59J41Oj01K4J34l9j05J53J8k4L7J39j06o8J30
2754A22q1Q0lK3q8lQ0j60P2%o4nk9j8JM2m0ok6JO4o9J00l7L6km6M3Q1p3Q2j8l6
$$ plain form
2787 23 60 14 69 75 99 62 -21 48 28 -68 90 25 -180 -39 19 -138 -88 13 -48 -161 -10 49 -189 -27 133 -155
2813 -155 -35 157 -54 -30 113 81 -114 32 139 -60 -20 210 -21 -47 193 62 -136 82 150 -121 -39 118
2835 118 -85 -211 179 -1 -272 51 69 -312 -18 132 -176 -128 177 -5 -195 64 42 -198 102 235 -147
2856 -147 -74 204 -24 -76 174 103 -224 37 177 -190 -30 231 -172 -142 186 -13 -226 91 114 -236 -19 162
2878 162 -172 -183 192 -17 -256 144 125 -231 39 187 -140 -62 243 49 -199 166 107 -192 99 255 -97
2899 -97 -42 238 -94 -159 175 64 -206 28 169 -162 -137 144 -178 -162 173 -25 -192 -6 46 -188 -56 149
2921 149 -93 -77 151 -9 -187 138 73 -169 37 134 10 -45 119 20 -83 82 56 -40 77 40 -59 -52 59 -62
2945 -62 -84 27 38 -80 -25 1 -133 -101 56 -9 -33 29 -2 -40 -5 60 48 -34 71 101 -7 44 55 7 -4 14 30
$$ packed form
2787B3L7m6N5OK4l7q3O9k0r6J58o5k05J41N8j57N0J01o1j13J51N9k38J62J60k88
2813a55J20J92k11K4J43l2j95J46J07j99M0K30k31k6K40j31j98K18O8k71Q2J57
2835A18k03j26L90j80k71L23J8l81K94J50l08M8L05j82j90K59k2k40L00J33l82
2856a47P3K78k28n2K50p1l27K61J40l67J60K61m03L0L28j99k13L17K3l50K17J81
2878A62l34j1L75k09k39M00j9l56K70J48l27P8L05j94k48L65n9k99K91J56l52
2899i7N5K80l32o5L34j11k70K34J41l31K5K81l22J6L35j98j67J86N2k34J32K05
2921A49k42J6K28j60j78L25o5k42K06R7j24n5J64r9j03J65k6r6J17l7r9PJ11j21
2945f2k2J11J1j18N5K6j34L2J57o5k4O2l1l8L5O5j2q2J05L0j08N1J1m8j1J8J6
$$ plain form
2972 30 -73 19 38 -78 -48 30 -21 -88 24 -3 -124 -88 65 -56 -99 83 -39 -129 122 19 -55 71 93 -70
2996 -70 -26 93 29 -65 129 103 -155 67 86 -91 -41 114 -22 -144 77 31 -201 -17 112 -103 -45 128 -97
3019 -97 -173 100 47 -138 38 122 -73 -94 215 -51 -73 209 29 -55 177 149 -91 58 154 -37 -118 119 23 -133
3043 -133 66 -3 -216 -5 78 -141 -157 25 -86 -234 53 103 -194 6 167 -44 -70 139 31 -1 170 198
3065 198 -76 33 166 -78 -20 205 21 -105 141 34 -174 25 95 -132 -142 22 -135 -214 30 -23 -208 -48
3087 -48 69 -192 -18 111 -31 -87 107 94 -87 117 208 -51 86 215 3 -18 221 60 -76 69 69 -97
3109 -97 -89 100 -100 -196 14 -123 -163 -30 -64 -143 -55 43 -157 -76 97 9 -92 151 103 -55 152 139 -25 91
3133 91 172 53 -19 54 82 -71 39 101 -135 -9 -2 -75 -88 -5 -76 -119 -70 -62 -109 -42 42 -149 -62 64 10 30 68 15
$$ packed form
2972C0j03R2J9j16L0P8n1o7J12k7j21L6J53j21m3J82j22r0K51j03p4J26K2j63
2996g0M4J19o4r4J94k6k58K22J9j77N0J55j36j22K21m6k32J84J29k15N8J73k25
3019i7p6K73n3j85J76Q4j95k1L09k66k2K82j80q4K32k8k40J49R6j91q1K37r6j56
3043a33J99o9k13K11Q3k19j6J82j11j48K87N0k97K00J61k11k6K09j08l2J71K8
3065A98k74J09J33k44N8K25j84j26K46j07k08J99P0k27j0J64j57p9K44n3j85J60
3087d8J17k61J74J29j42n6J94j3j81K04R1k59J37J29k12k1K39j61j36J45%j66
3109i7QJ89k00r6K10j37m0J33l4p9Q8R8k00Q1J73q8j01K43m8j58K07j3j64J16
3133I1Q1j19p2P3K8j53J10O2k36J26Pp3j3Q3p1m3M9Qm7O7Q4j91Q7J26n4K0L8n3
$$ plain form
3161 15 37 70 76 74 78 102 24 -62 38 14 -7 41 -2 -23 -64 -35 -80 -59 -38 -37 -139 -68 -106 -130 19 -5 -52 -58 -17 25 30 -59
3193 -59 26 72 67 70 34 165 49 83 95 -24 -38 90 20 -19 45 -54 -42 -93 -3 -123 -111 -40 -106 -161 -33 -93 -124 -30
3221 -30 -53 -38 -58 8 30 -11 112 61 20 79 124 13 56 122 13 57 52 6 -74 28 22 -104 -49 1 -135 -72 -22 -60
3249 -60 -91 -4 -49 -74 -27 -16 -89 -30 47 11 47 14 41 49 85 69 29 44 89 28 75 67 78 25 14 -28 -29 24 -44 -101 -47 -29
3281 -29 -80 -67 -90 -53 -83 -71 -11 -71 -27 3 -37 44 7 45 8 54 10 86 -13 75 128 63 70 35 31 -12 -14 0 -32 -36 20 -44
3313 -44 -57 -19 -105 -74 -89 -39 -30 -65 -6 -30 -74 55 -10 -7 46 22 38 48 7 33 14 96 28 24 39 58 29 23 47 7 -1 -38
3345 -38 14 -53 -52 -32 -62 -49 -16 -68 -23 -18 -53 -61 -23 -8 11 -5 22 5 -27 66 17 47 71 64 93 75 17 77 36 35 27 -14 -20 32
3379 32 -3 -68 -78 -54 -53 -67 -89 -59 -113 -27 -96 -24 17 -71 9 8 5 18 34 71 49 66 106 56 46 61 78 69 -8 39 62 -63
$$ packed form
3161A5K2L3OkMK4p8q6J00k4k1M8m3k1m1K9m5K1K1Jj02P1l8k4J49k4m7oM1M2Nq9
3193e9Q5M6nLl6J31j16L4J2j19j4J28p0l9O4r9J2n1R0j20J2P1o6n5J28o0l1R4
3221c0k3J5k0O6K2m1J23n1m1N9M5j11M3O6j09M4nm6q0J02oj26N5N0j36O3N0l8
3249f0l1Q7m5k5M7J1p3N9P7l6L6l3K7QL6j6m0J5M5o1M7qJ1n3j1m2jN3o8n7N4J8
3281b9n1J3k3L7l0J2O0o0M4L0m0Q1l7L8l7M6m4P6r9Q8N3o5Pl5mm3kJ4l2mN6o4
3313d4j3L8q6L1j5N0Rl5N9k4m4J29o5LN3k4J6J0m1K6j9Q2o8mJ5J9k9oK4m0ql7
3345c8N2o7JK0l0J3L3n2M5Nl5qL8J5J9j6K7j7l2R3m9L0K4pK9j8n8O0m1jqm1oN2
3379C2l5o5j0K4Jj4k2L0n4Q6o9P2M1q8Q0jlJ3J6L7k2J7M0n0j0J5J7rp7M7K3j25
$$ plain form
3411 -63 26 33 -49 -37 10 -63 -139 -23 -88 -128 -51 -44 -72 -126 67 -54 -43 12 34 -2 70 86 21 62 64 52 5 101 75 0
3441 0 84 79 -109 26 81 -88 -66 48 -56 -108 -50 -9 -144 -43 30 -153 -51 28 11 -85 81 7 -42 88 137 15
3467 15 59 95 52 -23 126 56 -93 120 10 -28 -43 73 -50 -70 64 -15 -151 -40 -28 -167 -1 3 -104 -53 48
3492 48 0 -77 93 68 -67 74 131 -27 28 146 16 3 79 65 -14 70 18 -5 -35 85 -111 -132 46 -29 -112 -20
3518 -20 -15 -88 -71 39 -70 -25 27 -45 -60 39 67 -17 80 113 -13 56 62 21 21 113 80 -32 55 41 -2 23 13 -42 -36 -46
3548 -46 -11 -74 -39 -29 -95 -68 -27 -41 11 25 -15 15 10 -21 32 0 17 87 43 56 36 37 128 15 46 85 -16 49 -9 -46
3578 -46 16 1 -40 -15 0 -57 -43 -7 -54 -80 42 -15 -115 -18 -6 -39 30 -32 -22 22 -5 31 -43 37 43 -6 47 63 -54
3607 -54 -29 58 -32 -55 26 30 -54 -24 42 -57 -80 83 -76 -91 13 -19 -111 13 38 -68 -29 47 13 -87 70 77 -55
$$ packed form
3411f3Q9Pq2J2M7p3p6J16o5m0P7Pk8n4J93j21J1N5K2l6P2J6o5M1Kj2m7R6k6p5
3441@Q4nj88J35N5j69K2J14j04n2N8M1j35J01P3j83J02P9j7r6J66p4m9J30M9j22
3467A5M4L6m3p5J49p0j49K13j10l8j5J16j23k0J34p9j36J11J2j39J66Mj07N1J01
3492D8m8p7J70k5j35J41N7j58N5J18j30j3P6j4p9Q4n2k3l0J20j96k1J78p5q3R2
3518b0Np3J7J10j09M5N2p2j5R9K8q4R7L3j26O9Om1%R2l3j12Q7j4m3K5j0n5Oj0
3548d6L5o3L5J0o6K7M1j4N2J4m0L0nl1N3l2J7P0m4J3k0JR1j13L1L9j01O5n8l7
3578d6O2j5m1K5J5n7J4L6m7k6J22n7j00R7J2l3O9o2J0M4k7L6p4Q0Om9N3J6j17
3607e4K5Q7r0k3Q1Mq4L0O6r9k3J63j59j5J04l2r2J24K5j06L9P6l4j00J57Pj32
$$ plain form
3634 -55 30 20 -17 0 61 -44 -113 54 -70 -79 60 24 -113 5 -5 -73 -81 43 -57 -58 28 -25 -72 -53 67 -27 -25 66
3662 66 -43 -27 103 3 -15 68 20 -22 7 54 -10 -47 47 -43 -63 -25 -2 -61 -66 -33 -25 -91 41 10 -35 42 28 -51 35
3691 35 49 -42 -6 84 -54 -20 62 11 -26 18 41 14 7 8 -67 -37 61 -38 33 8 19 -58 -40 80 -76 -15 -19 -13 -9 22 -24
3722 -24 27 -31 -37 -7 -13 48 22 -15 27 22 -11 64 29 -47 7 19 6 11 -1 30 -12 59 52 20 20 -25 -14 -3 -5 20 -25 -27 38 8
3756 8 -32 -63 0 -20 -27 -15 -61 9 -23 1 0 -34 -1 -20 -11 -1 29 -17 5 -24 47 35 20 46 5 49 -6 22 -53 30 -18 36
3788 36 -24 14 30 6 -12 -46 -19 7 -12 -18 19 28 -9 -22 -27 -27 -24 -32 9 9 36 -57 30 -5 17 45 17 -13 24 12 -18 11 -26 -7
3822 -7 9 -25 29 -13 9 23 -5 -15 -15 -14 -43 -42 7 -33 -28 4 -82 14 27 -4 5 -11 37 -45 17 46 15 29 10 2 20 3 22 0
3856 0 0 -30 -6 5 29 -70 27 -53 -57 6 -59 -9 -36 -13 16 -12 5 -22 -22 -27 -63 -2 0 37 18 17 54 31 -34 1 38 -44 9 -25
$$ packed form
3634e5Q5j0l7J7O1j05o9J67j24rJ39l6j37J18j0o8qJ24j00jQ6n3m7J9J20r4KR1
3662F6j09J6J30j00j8Q3m8m2K9M7o4l7R4r0k0L8K3n9nL3Qo6J32l1m5P7j4p9Q6
3691C5J4r1L6R0j38L4Q2n1l7M4K3k7pJp5L0R8r9P1k5J1p7J8J20j56O1mOML1m6
3722b4N1n8oL0oO1k6l7M2nl3P5l5p6N4J2j3Nj2L1m2P1pl2%m5J1J1kK5m5kO5l0
3756Hm0l1O3k0pJ2m6P0l2K4jl4L3j9RJ0L0m6K2k9P1j2j5K6m1M4n5K8p5Q3m8N4
3788C6o0L8J6k4j8l4K7K6j9oL7Rl7j3n%LqM1%K7r3Q7l5K2K8k8l0L7j2l0K9l7J9
3822gJ6l4N4m2K2J4k8j0%Jk9JM9m0NL2q6R6J3l1Rj6M8q2O2K9l1J4j9qJ8j7J9k2
3856@%l0K4J1K4r9R7q0mO3o5N0k7K3K9k8J7k7%nl6O1KL7j9jL7k3o5L5L7q2N3l4
$$ plain form
3890 -25 32 -35 -13 16 8 -70 3 2 1 -28 -84 -26 -28 -30 -42 -64 6 -17 5 -7 3 28 5 17 9 49 13 34 65 -19 44 12 -39
3923 -39 -20 4 11 13 -31 -93 -47 -3 -44 -98 -25 -79 -32 -6 -73 -42 2 5 11 -31 -37 57 38 38 13 16 55 48 24 86 22 33 29 -7 -22
3958 -22 2 -7 24 -40 -53 2 -29 -33 -47 -85 -74 8 -54 -39 5 -10 -3 -25 42 -21 40 58 37 33 67 43 72 57 -6 63 -24 64
3990 64 -3 -31 63 35 -45 -37 36 -26 -15 -34 -87 -38 -77 52 -40 35 -24 -9 13 -6 23 32 37 68 5 24 8 44 -3 10 35
4021 35 5 62 -9 -6 -38 -33 13 -62 -15 -13 -38 7 -62 -29 -30 -45 -57 -27 56 7 -13 -30 -8 -37 5 99 21 27 57 -15 13 67 -22
4054 -22 10 36 7 0 -12 8 -16 -99 -21 -34 -33 -31 -69 -3 -18 11 7 13 37 -27 -22 46 -23 30 68 63 35 20 4 -1 10 -30 41 -54
4088 -54 -25 20 3 11 -21 19 -26 -20 -13 -71 -53 -41 -22 -48 14 -37 3 7 -21 -11 -4 26 -9 -50 41 9 -13 14 -1 0 50 17 -6
4121 -6 -56 32 8 20 30 17 -7 -85 -1 -16 -29 31 -18 -60 28 -39 -30 -39 20 32 7 27 10 -28 25 31 -12 11 -1 24 -5 -31
$$ packed form
3890b5N7o7K2K9qp8P3jjk9n6N8kkj2k2P0k3K2j2J0K5k3J2qM0l6K1L1q4O3l2n1
3923c9J9K4PKm4o2M6M4m1n4P3n4M7K6o7L1M4LOm2oR4j9%k5LL9pk4O2o4J1ml6j5
3958b2K4rL1o4j3N5l1mj4l8J1Q2o2J5M4j5Pk2O7o3O1J8k1mL4k4K9j5o3O9q7Q8
3990F4o7k8R4k8q0QP3o2J1j9n3M9l9J29r2P5n9J5K2j9K9RNL1o3J9j6L6m7J3K5
4021C5l0N7p1Ll2NM6p5M7Kk5M5o9L3jj5j2L0Q3m9k0j7K2k9M2R4p8OL0p2K8N4q9
4054b2L2K6k9pj2K0k4q3P8j3JKl8O6j5K9mOK4o4NO8o9N3L8nk8j5j6nJ1m0P1r5
4088e4K9M5j7Ql2M0m5OPn8J8J2J9k6O2n1M0Mk8J0PL0l5m1R1l2k2K7j5JN0l3k3
4121fn0Q8k4J2J0j3k4p8Q4j5j3O0m9m2Q8o7RrN9J2k5K0j7l8N3Om3K3j2K5k9k6
$$ plain form
4153 -31 -27 -6 28 -21 -46 -4 -39 -42 3 9 -8 1 14 20 -32 -50 -29 32 8 19 -13 -6 1 7 48 35 33 -25 -8 18 25 22 -42 -26 -45 -32
4189 -32 -20 -33 -54 -2 -11 0 36 10 39 0 12 -13 9 -11 3 -7 -5 3 -1 60 21 20 4 61 13 -4 -6 19 36 -34 43 -17 6
4222 6 22 38 -43 9 24 26 -45 6 -12 -39 2 -20 -45 -27 -33 0 -14 4 36 -31 -3 -28 -25 20 14 3 31 59 1 -4 28 38 -24
4255 -24 -3 14 6 -8 19 7 -9 69 -24 32 20 -28 32 -19 31 2 -7 7 0 -21 -20 7 -12 91 77 -21 21 3 -34 -12 53 51
4287 51 -13 13 42 8 -15 17 -10 -15 0 13 23 -59 -44 -42 -31 -12 -46 18 20 -40 -50 -32 -53 -26 -12 -34 -17 3 50 9 -14 67
$$ packed form
4153c1MK1L4m9k5M2l5lM5Oj7RJ3On2j8K1O1k4J1l2PPOM1j3kn8J7K6Plo4J6j9J3
4189c2J2j3k1N2rJ1L6k6K9l9J2k5K2k0J4j0KQmO1l9jj6N7m8j7kK5J7p0P7o0K3
4222FJ6J6q1N2J5Kp1N1j8k7M1k2k5J8oL3j4J8L2o7K8k5LM5oj1K8K8n8nL2J0o2
4255b4K1J7qj4K7j2j6P8r3N6j2m8O0n1N0k9rJ4pk1JK7j9J03j4r8M2j8l7K2O5k
4287E1o4K6K9l4k3L2k7nJ5J3J0q2J5KJ1J9l4O4Ko0j0J8k1K7J4k2J7K0M7m1k3Q1
$$ [...]
8191G
##END NTUPLES=NMR FID
##END=
