##TITLE=1H_PhBDPS
 CDCl3,40 sc, 
 8.02.2021
##JCAMPDX= 6.0         $$ Bruker NMR JCAMP-DX V2.0
##DATA TYPE= NMR FID
##DATA CLASS= NTUPLES
##ORIGIN= UXNMR, Bruker Analytische Messtechnik GmbH
##OWNER= root
$$ XWIN-NMR		Version 3.5
$$ Mon Feb  8 13:41:44 2021 Russian Standard Time (UT+4h)  she@DPX200
##.OBSERVE FREQUENCY= 200.1315066352
##.OBSERVE NUCLEUS= ^1H
##.DELAY= (6, 6)
##.ACQUISITION MODE= SIMULTANEOUS
##.ACQUISITION SCHEME= undefined
##.AVERAGES= 40
##.DIGITISER RES= 18
##SPECTROMETER/DATA SYSTEM= spect
##.PULSE SEQUENCE= zg30
##.SOLVENT NAME= CDCl3
##.SHIFT REFERENCE= (INTERNAL, CDCl3, 0, 15.7039)
##AUDIT TRAIL= $$ (NUMBER, WHEN, WHO, WHERE, WHAT)
$$ ##TITLE= Audit trail, XWIN-NMR		Version 3.5
$$ ##JCAMPDX= 5.01
$$ ##ORIGIN= Bruker BioSpin GmbH
$$ ##OWNER= she
$$ F:/spectra/data/she/nmr/H-F/1/audita.txt
$$ ##AUDIT TRAIL=  $$ (NUMBER, WHEN, WHO, WHERE, WHAT)
(   1,<2021-02-08 13:40:43.39 +0400>,<she>,<DPX200>,
      <continue with go, POWCHK disabled, PULCHK disabled
       configuration hash MD5:
       00 E9 B6 7A A2 85 ED C7 34 08 36 98 17 FE 4E 26
       data hash MD5: 16K
       D4 86 D0 0F 83 BB 00 24 97 E8 82 6C 10 37 42 FB>)
$$ ##END=
$$ 
$$ hash MD5
$$ F6 E4 13 BC 9D 64 6D 64 D8 F6 5D 76 33 E9 87 55
##$RELAX= 
##$RELAX= 
##$RELAX= 
##$RELAX= 
##$RELAX= 
##$RELAX= 
$$ Bruker specific parameters
$$ --------------------------
##$DU= <F:/spectra>
##$EXPNO= 1
##$NAME= <H-F>
##$PROCNO= 1
##$TYPE= <nmr>
##$USER= <she>
##$AMP= (0..31)
100 100 100 100 100 100 100 100 100 100 100 100 100 100 100 100 100 100 
100 100 100 100 100 100 100 100 100 100 100 100 100 100 
##$AQSEQ= 0
##$AQ_mod= 1
##$AUNM= <au_zg>
##$AUTOPOS= <>
##$BF1= 200.13
##$BF2= 200.13
##$BF3= 200.13
##$BF4= 200.13
##$BF5= 200.13
##$BF6= 200.13
##$BF7= 200.13
##$BF8= 200.13
##$BYTORDA= 1
##$CFDGTYP= 0
##$CFRGTYP= 5
##$CHEMSTR= <none>
##$CNST= (0..31)
1 1 145 1 1 1 1 1 1 1 1 1 1 1 1 1 1 1 1 1 1 1 1 1 1 1 1 1 1 1 1 1 
##$CPDPRG= <>
##$CPDPRG1= <>
##$CPDPRG2= <>
##$CPDPRG3= <>
##$CPDPRG4= <mlev>
##$CPDPRG5= <mlev>
##$CPDPRG6= <mlev>
##$CPDPRG7= <mlev>
##$CPDPRG8= <mlev>
##$CPDPRGB= <>
##$CPDPRGT= <>
##$D= (0..31)
0 1.2 0 0 0 0 0 0 0 0.06 0 0.03 0 0 0 0 0.0002 0 0 0 0 0 0 0 0 0 0 0 0 
0 0 0 
##$DATE= 1612777087
##$DBL= (0..7)
120 120 120 120 120 120 120 120 
##$DBP= (0..7)
150 150 150 150 150 150 150 150 
##$DBP07= 0
##$DBPNAM0= <>
##$DBPNAM1= <>
##$DBPNAM2= <>
##$DBPNAM3= <>
##$DBPNAM4= <>
##$DBPNAM5= <>
##$DBPNAM6= <>
##$DBPNAM7= <>
##$DBPOAL= (0..7)
0.5 0.5 0.5 0.5 0.5 0.5 0.5 0.5 
##$DBPOFFS= (0..7)
0 0 0 0 0 0 0 0 
##$DE= 6
##$DECBNUC= <off>
##$DECIM= 32
##$DECNUC= <off>
##$DECSTAT= 4
##$DIGMOD= 1
##$DIGTYP= 9
##$DL= (0..7)
0 120 120 120 120 120 120 120 
##$DP= (0..7)
150 150 150 150 150 150 150 150 
##$DP07= 0
##$DPNAME0= <>
##$DPNAME1= <>
##$DPNAME2= <>
##$DPNAME3= <>
##$DPNAME4= <>
##$DPNAME5= <>
##$DPNAME6= <>
##$DPNAME7= <>
##$DPOAL= (0..7)
0.5 0.5 0.5 0.5 0.5 0.5 0.5 0.5 
##$DPOFFS= (0..7)
0 0 0 0 0 0 0 0 
##$DQDMODE= 0
##$DR= 18
##$DS= 0
##$DSLIST= <SSSSSSSSSSSSSSS>
$$ [...]
##$SUBNAM2= <"">
##$SUBNAM3= <"">
##$SUBNAM4= <"">
##$SUBNAM5= <"">
##$SUBNAM6= <"">
##$SUBNAM7= <"">
##$SUBNAM8= <"">
##$SUBNAM9= <"">
##$SW= 16.9725356469052
##$SWIBOX= (0..15)
0 0 2 0 0 0 0 0 0 0 0 0 0 0 0 0 
##$SW_h= 3396.73913043478
##$TD= 16384
##$TD0= 1
##$TE= 0
##$TE2= 300
##$TE3= 300
##$TEG= 300
##$TL= (0..7)
0 120 120 120 120 120 120 120 
##$TP= (0..7)
150 150 150 150 150 150 150 150 
##$TP07= 0
##$TPNAME0= <>
##$TPNAME1= <>
##$TPNAME2= <>
##$TPNAME3= <>
##$TPNAME4= <>
##$TPNAME5= <>
##$TPNAME6= <>
##$TPNAME7= <>
##$TPOAL= (0..7)
0.5 0.5 0.5 0.5 0.5 0.5 0.5 0.5 
##$TPOFFS= (0..7)
0 0 0 0 0 0 0 0 
##$TUNHIN= 0
##$TUNHOUT= 0
##$TUNXOUT= 0
##$USERA1= <user>
##$USERA2= <user>
##$USERA3= <user>
##$USERA4= <user>
##$USERA5= <user>
##$V9= 5
##$VALIST= <valist>
##$VCLIST= <CCCCCCCCCCCCCCC>
##$VD= 0
##$VDLIST= <DDDDDDDDDDDDDDD>
##$VPLIST= <PPPPPPPPPPPPPPP>
##$VTLIST= <TTTTTTTTTTTTTTT>
##$WBST= 1024
##$WBSW= 4
##$XGAIN= (0..3)
0 0 0 0 
##$XL= 0
##$YL= 0
##$YMAX_a= 60088
##$YMIN_a= -26143
##$ZGOPTNS= <>
##$ZL1= 120
##$ZL2= 120
##$ZL3= 120
##$ZL4= 120
##$ABSF1= 10
##$ABSF2= 0
##$ABSG= 5
##$ABSL= 3
##$ALPHA= 0
##$AQORDER= 0
##$ASSFAC= 0
##$ASSFACI= 0
##$ASSFACX= 0
##$ASSWID= 0
##$AUNMP= <proc_1d>
##$AZFE= 0.1
##$AZFW= 0.1
##$BCFW= 1
##$BC_mod= 2
##$BYTORDP= 1
##$COROFFS= 0
##$CY= 11.3945322036743
##$DATMOD= 1
##$DC= 2
##$DFILT= <>
##$DTYPP= 0
##$F1P= 15.9154993809931
##$F2P= -4.1035820241983
##$FCOR= 0.5
##$FTSIZE= 0
##$FT_mod= 4
##$GAMMA= 1
##$GB= 0.15
##$INTBC= 1
##$INTSCL= 1
##$ISEN= 128
##$LB= 0.24
##$LEV0= 0
##$LPBIN= 0
##$MAXI= 10000
##$MC2= 0
##$MEAN= 0
##$ME_mod= 0
##$MI= 1.114404
##$NCOEF= 0
##$NC_proc= 0
##$NLEV= 6
##$NOISF1= 3.799351
##$NOISF2= 2.8
##$NSP= 1
##$NTH_PI= 0
##$NZP= 0
##$OFFSET= 15.70392
##$PC= 1
##$PHC0= -10752.35
##$PHC1= 9.80094
##$PH_mod= 1
##$PKNL= yes
##$PPARMOD= 0
##$PSCAL= 0
##$PSIGN= 0
##$REVERSE= no
##$SF= 200.130013532006
##$SI= 16384
##$SIGF1= 3
##$SIGF2= 2
##$SINO= 400
##$SIOLD= 16384
##$SREGLST= <1H.CDCl3>
##$SSB= 0
##$STSI= 0
##$STSR= 0
##$SW_p= 3612.71676300578
##$SYMM= 0
##$S_DEV= 0
##$TDeff= 0
##$TDoff= 0
##$TI= <>
##$TILT= no
##$TM1= 0
##$TM2= 0
##$TOPLEV= 0
##$USERP1= <user>
##$USERP2= <user>
##$USERP3= <user>
##$USERP4= <user>
##$USERP5= <user>
##$WDW= 1
##$XDIM= 8192
##$YMAX_p= 0
##$YMIN_p= 0
$$ End of Bruker specific parameters
$$ ---------------------------------
##NTUPLES= NMR FID
##VAR_NAME=  TIME,          FID/REAL,        FID/IMAG
##SYMBOL=    X,             R,               I
##VAR_TYPE=  INDEPENDENT,   DEPENDENT,       DEPENDENT
##VAR_FORM=  AFFN,          ASDF,            ASDF
##VAR_DIM=   8192,          8192,            8192
##UNITS=     SECONDS,       ARBITRARY UNITS, ARBITRARY UNITS
##FACTOR=    0.0002944,     1,               1
##FIRST=     0,             0,               0
##LAST=      2.4114304,     0,               0
##MIN=       0,             -26143,          0
##MAX=       2.4114304,     60088,           0
$$ Real data points
##PAGE= N=1
##DATA TABLE= (X++(R..R)), XYDATA
0@%%%%%%%%%%%%%%%%%%%%%%%J0m6P6q0Q0q0Q0q4J01j33J56j62J76k03K33k58K84
$$ 0 0 0 0 0 0 0 0 0 0 0 0 0 0 0 0 0 0 0 0 0 0 0 0 10 -36 40 -40 40 -40 40 -44 57 -76 80 -82 94 -109 124 -134 150
40A50l19L53l92M36m83N32n85O48p18P93q68R56j056J164j285J417j571J750j956
$$ 150 -169 184 -208 228 -255 277 -308 340 -378 415 -453 503 -553 611 -674 743 -828 922 -1034
59a034K198k485K836l275L845m606N686p344J0240j6719N3465j569o7381O4965
$$ -1034 1164 -1321 1515 -1760 2085 -2521 3165 -4179 6061 -10658 42807 41238 -26143 38822
73C8822l4562R69K0534j6315m299K1742k2142R792J015j0397J6304j9937J5208
$$ 38822 4260 5229 25763 9448 5149 26891 4749 14541 15556 5159 21463 1526 16734
86A6734q354j777Q762j2914O551k896J986j0500J5923j8826P996O154k0852J9535
$$ 16734 8380 6603 15365 2451 9002 6106 8092 -2408 13515 -5311 2685 8839 -12013 7522
100G522r258m237P691n155q208J3147j1333o80J4177k3503K2178j3552p76J1686
$$ 7522 -1736 -5973 1718 -3437 -11645 1502 -9831 -10511 3666 -19837 2341 -11211 -11987 -301
114c01j6050R761n39n711M870K808j0891J5132j1085N17J2627j7162J6287p975
$$ -301 -16351 -6590 -7129 -12840 -7970 -5162 -16053 -921 -12006 -11489 1138 -16024 263 -7712
128g712J068L707l764J209M665J334p391J5151j4728J0366p67n727Q918n539M636
$$ -7712 -6644 -2937 -6701 -5492 -827 507 -6884 8267 -6461 3905 3138 -2589 6329 790 5426
143E426j04J0l352J1130j2002O556M555j2749J7337j3895N876K232p464M782j22
$$ 5426 5322 5332 1980 13110 1108 7664 12219 -530 16807 2912 8788 11020 3556 8338 8216
158H216k649K185K355r337J2857j1852M352L003j1276J1143q250J825n6n77k743
$$ 8216 5567 7752 10107 770 13627 1775 6127 9130 -2146 8997 747 2572 2516 1939 -804
173h04M149m618k179P745j3100J0955p356M64L665o764L624j955Q97m674P117
$$ -804 3345 -1273 -3452 4293 -8807 2148 -5208 -4744 -1079 -7843 -4219 -6174 -5277 -9951 -2834
188b834r910R307l684m135J0031j1745Q832l631J98J047M81k085L221j44n020
$$ -2834 -12744 -3437 -7121 -11256 -1225 -12970 -4138 -7769 -7571 -6524 -6043 -8128 -4907 -5051 -10071
203a0071J2431j2514R518k284l717R111p075M735j497L357l514O653n128K411
$$ -10071 2360 -10154 -636 -2920 -6637 2474 -4601 134 -1363 1994 -1520 5133 5 2416
217B416K737o383J0271r153N903P00k717K728J478j613j530M973q808J1070p940
$$ 2416 5153 -1230 9041 -112 5791 6491 3774 6502 7980 6367 4837 9810 1002 12072 4132
232D132K58N465p868Q659o568P23L65O68l359M361k789k999O768j0802R098p066
$$ 4132 4390 9855 1987 10646 4078 4801 5166 5834 2475 6836 4047 1048 7816 -2986 6112 -954
248i54M22K559m415J415j120J377m238N452p989O600l202k618N589q765O987l773
$$ -954 -532 2027 -2388 -973 -2093 -716 -4954 498 -7491 -891 -4093 -6711 -1122 -9887 -2900 -6673
264f673O10Q55O14k020J117J430o243R339q253N653K19m868O176m698L340j839
$$ -6673 -6063 -5208 -4594 -6614 -5497 -4067 -10310 -971 -9224 -3571 -3352 -8220 -2044 -6742 -3402 -5241
280e241L130l723O372l906J942L172o128R271p307M279j78J12M12Q10K74j241
$$ -5241 -2111 -5834 538 -3368 -1426 1746 -4382 4889 -2418 1861 1683 1795 2207 3017 3291 2050
296B050N144p002Q536m685N0L464n274N939m710L188j882K504l726L190j614k580
$$ 2050 7194 192 8728 4043 4093 7557 2283 8222 3512 6700 4818 7322 3596 6786 5172 2592
312B592O535q689O419m009J56J680k141P21j676J020l759N266p315N431k675l106
$$ 2592 9127 438 6857 2848 3004 4684 2543 3264 1588 2608 -1151 4115 -3200 2231 -444 -3550
328c550O198p168M144k678j18r45J725l054J018K121n545O860p111M013m58k203
$$ -3550 2648 -4520 -376 -3054 -3172 -4117 -2392 -5446 -4428 -2307 -7852 -992 -8103 -4090 -4548 -6751
344f751L465l260K188j113K221l864M925l630J827K512n263P426n421L993q94
$$ -6751 -3286 -6546 -4358 -5471 -3250 -7114 -2189 -5819 -3992 -1480 -6743 683 -4738 -745 -1639
359a639J72N86J281R6j873M564n268O614l950J057K866l625M967l836K367j539
$$ -1639 -1467 -881 400 496 -1377 3187 -2081 4533 583 1640 4506 881 5848 2012 4379 2840
375B840K032j387K376l40k956O036o417M539l448J462Q0r47L35q40J453l827N653
$$ 2840 4872 3485 5861 5521 2565 8601 2184 6723 3275 4737 4817 3870 4205 3365 4818 991 6644
392F644o133L504r67m154M828m827K589j792p4n02J626k584J69J285n110N711
$$ 6644 511 4015 3048 -1106 3722 -1105 1484 -308 -382 -884 742 -1842 -1673 -388 -5498 213
408B13o049L811j000k227L613l235J577j395K000l284L294k784q17L954n600O053
$$ 213 -5836 -2025 -3025 -5252 -1639 -4874 -3297 -4692 -2692 -5976 -2682 -5466 -6283 -2329 -7929 -1876
424a876l627L150n49o99M29Q23l07k81L970o212N709k354J018K331l510M659k877
$$ -1876 -5503 -2353 -2902 -3601 -3172 -2349 -2656 -2937 1033 -5179 530 -1824 -806 1525 -1985 2674 -203
441b03J801j321K941j333J808J06k345M671o297N682k636J659K14j614J998k89
$$ -203 1598 277 3218 1885 3693 3799 1454 6125 -172 5510 2874 4533 4747 3133 5131 4842
457D842M67l279L902l821K263m74l176N200m336K441k633J046j649K119k526m25
$$ 4842 5309 2030 5932 2111 4374 3900 724 5924 1588 4029 1396 2442 793 2912 386 -39
473c9J512l932N022n142K198r03j446K322k974J328j286J558m274N431l756m83
$$ -39 1473 -2459 2563 -2579 -381 -1284 -2730 -408 -3382 -2054 -3340 -1782 -6056 -625 -4381 -4864
489d864K904m252M295l640J979r4o05m06J502O05l445M884n192M326j383O66J590
$$ -4864 -1960 -6212 -1917 -5557 -3578 -3672 -4277 -4683 -3181 -2576 -6021 -1137 -6329 -2003 -3386 -2720 -1130
506a130j802L276l518K471j036K447k585K470M86k193M606l973L362k045J313
$$ -1130 -2932 344 -3174 -703 -1739 708 -1877 593 1079 -1114 3492 -481 2881 836 2149
521B149P12O11r70M64J289l904N778m465K588j50k345L090k384K042j073L12o07
$$ 2149 2861 3472 2502 2966 4255 351 6129 1664 4252 4102 1757 4847 2463 4505 3432 3744 3137
538C137j22k81j585K616l729L540l371J752j286o69J034k291J842k636K236k994
$$ 3137 3015 2734 1149 3765 36 3576 205 1957 671 2 1036 -1255 587 -2049 187 -2807
554b807L959l041r24K388l902L025k061N9M54r06l53J024k66j679M208o061N013
$$ -2807 1152 -1889 -2813 -425 -4327 -1302 -3363 -3304 -2850 -3756 -4109 -3085 -3351 -5030 -822 -6883 -1870
571a870j645j212K297k551L758k085R19j192L172l163J760o82Q69K281k832L507
$$ -1870 -3515 -4727 -2430 -4981 -1223 -3308 -2389 -3581 -409 -3572 -1812 -2494 -1625 656 -2176 1331
587A331j961N24J199j176J675j044K113k413K839k135K105K98j678K992k798K316
$$ 1331 -630 -106 1093 -83 1592 548 2661 248 3087 952 3057 3355 1677 4669 1871 4187
603D187j886J669j823K945j973j137K635l752N662n493K855r90j048P59j777J096
$$ 4187 2301 3970 2147 5092 3119 1982 4617 865 6527 1034 3889 2899 1851 2610 833 1929
619A929o86J073l161L650l087j19J616l132K360k439J099j272N1m63L50K44j466
$$ 1929 1243 2316 -845 2805 -282 -401 1215 -1917 443 -1996 -897 -2169 -2118 -2581 -2231 -1987 -3453
636c453K816l805K779k225M98J746j648P57k349K466j400J979j136O67R92l211
$$ -3453 -637 -4442 -1663 -3888 -3390 -1644 -3292 -2535 -4884 -2418 -3818 -1839 -2975 -2308 -1316 -4527
652d527L977l108K826j233J000J2K69K16r82K480k633L697k365K315n22q74K061
$$ -4527 -550 -3658 -832 -2065 -1065 -1053 -784 -568 -1550 930 -1703 1994 -371 1944 1422 548 2609
669B609k140K338j084J641j910J901j324K37J432l455M488l353K021l32k70J068
$$ 2609 469 2807 1723 3364 1454 3355 2031 2268 3700 245 4733 1380 3401 3069 2799 3867
685C867j303J364j517J637l114J585n57n44Q17k362K625k534J145p32L28p11l48
$$ 3867 2564 3928 2411 4048 934 2519 1962 1418 2235 -127 2498 -36 1109 377 705 -6 -354
702c54L14j992K912l480K460j903m70J441j726Q47j095J532k161J940k266J352
$$ -354 -40 -2032 880 -2600 -140 -2043 -2513 -1072 -2798 -1951 -3046 -1514 -3675 -1735 -4001 -2649
718b649N55k151L426l046K420k095J059j89N39J50l92J284j809L162k159J460
$$ -2649 -2094 -4245 -819 -3865 -1445 -3540 -2481 -2670 -2131 -1981 -2373 -1089 -2898 264 -1895 -435
734d35L57r38J711j776K257j155J354j120J496n32L5J974l103L809l047J598K35
$$ -435 -78 -1016 695 -1081 1176 21 1375 255 1751 1219 1254 3228 125 3934 887 2485 2720
751B720j245J872r50P59j590K347k279J707o48j61K63j888K737k123J105j696
$$ 2720 1475 3347 2397 3156 1566 3913 1634 3341 2693 2532 2795 907 3644 1521 2626 930
767I30J610j814N14Jj360K207k923K365j752R8M06j587J002j671J299j589J415
$$ 930 2540 726 1240 1241 -119 2088 -835 1530 -222 -124 282 -1305 -303 -1974 -675 -2264 -849
784h49j251M70Q6j698K401k920K287j406P58o42Q65l94o27J840k183L022k714
$$ -849 -2100 -1630 -1544 -3242 -841 -3761 -1474 -2880 -2122 -2764 -1899 -2293 -2920 -1080 -3263 -241 -2955
801b955K002j26j874K547k276K624k150K072j478J455O9n28J813k504L061j883
$$ -2955 -953 -1079 -2953 -406 -2682 -58 -2208 -136 -1614 -159 -90 -618 1195 -1309 1752 -131
817a31J587M04j180P19j91J363j210J778k208K252j456P9J893k135J566j658J517
$$ -131 1456 1860 680 1399 1208 2571 1361 3139 931 3183 1727 1806 3699 1564 3130 1472 2989
834B989j386J485j385L56N74j910K238k384J922j592M74J92j131M19j250J087
$$ 2989 1603 3088 1703 2059 2633 723 2961 577 2499 907 1381 1573 442 861 -389 698
850F98j784K198k459R67j5j321J478k490K001n35k99l03n17J162j216J537k643
$$ 698 -1086 1112 -1347 -380 -395 -1716 -238 -2728 -727 -1262 -1561 -1864 -2381 -1219 -2435 -898 -3541
867c541K362j658P44O10k136K394j668J603j608J259n08J232n01m98J667j874
$$ -3541 -1179 -2837 -2093 -1483 -3619 -1225 -2893 -1290 -2898 -1639 -2147 -915 -1416 -1914 -247 -2121
883b121K671j949N92O48k27Q51k60P95j764K492j206J150o60k58J386j478K091
$$ -2121 550 -1399 -807 -159 -386 465 205 1000 -764 1728 522 1672 1012 754 2140 662 2753
900B753j488J314j115O16n46N42L98j360K413k705K002r23m0O5r04M44r51J760
$$ 2753 1265 2579 1464 2080 1534 2076 2474 1114 3527 822 2824 1901 1861 1926 1022 1466 515 2275
918B275j740J763j983O71M95k127J769j896J706j627N24n30j06n22n15J652k024
$$ 2275 535 2298 315 986 1481 -646 1123 -773 933 -694 -170 -700 -806 -1328 -1843 -191 -2215
935b215J535k368J375m32o10K204j517J080j817R54j319J401Lj079J881k133K859
$$ -2215 -680 -3048 -1673 -2105 -2715 -511 -2028 -948 -2765 -1811 -3130 -1729 -1726 -2805 -924 -3057 -198
952a98k269R39Q86l15q4L11M24j400K069k012J450j000P22J658k372J853o70J145
$$ -198 -2467 -1528 -642 -957 -1041 -730 -306 -1706 363 -1649 -199 -1199 -477 1181 -1191 662 -8 1137
970A137L23k19m59L89J267j847K640k892K091j135M7P12m18L96j616K088j985
$$ 1137 1460 1241 782 1171 2438 591 3231 339 2430 1295 1342 2054 1636 2032 416 2504 519
987E19J564j273J023M35j688J979k353J463j327N58l61L34K52j460J540k681K278
$$ 519 2083 810 1833 2268 580 2559 206 1669 342 900 539 873 1125 -335 1205 -1476 802
1004H02k221J018k75p70O44j272J513j577R06p76J229p85r05J217j665K246j522
$$ 802 -1419 -401 -676 -1446 -802 -2074 -561 -2138 -1232 -2008 -779 -1564 -2469 -1252 -2917 -671 -2193
1021b193J210r90P2P42r28J779j813J579j672J917j11p92J219j812K024p06J212
$$ -2193 -983 -1973 -1901 -1159 -2087 -308 -2121 -542 -2214 -297 -408 -1200 19 -1793 231 -475 737
1038G37n40Q53m17n16N99q53K183j947K199j152P28j004P64L68j415J318j436
$$ 737 197 1050 633 117 716 -137 2046 99 2298 1146 1874 870 1634 2002 587 1905 469
1055D69K058p97j06L31j204J530r21P45q36N66l30l87l2o88J305j552J606k124
$$ 469 2527 1730 1624 1955 751 2281 1360 2105 1269 1835 1505 1118 1086 398 1703 151 1757 -367
1073c67O27k24m76J520k200J786j853M71j356J250J32p75J013j665J445j317R33
$$ -367 260 36 -440 1080 -1120 666 -1187 -716 -2072 -822 -690 -1465 -452 -2117 -672 -1989 -1056
1090a056m89j31j76n35J380q88K005k400Q15p71K82N35j11J141j001L41Q11k3
$$ -1056 -1545 -1676 -1852 -2387 -1007 -1895 110 -2290 -1475 -2246 -1964 -1429 -1540 -399 -1400 -1059 -248 -271
1108b71j423R27M35l6J109j063J426j291J55J367p09P47j530J974k509K134j399
$$ -271 -1694 -767 -332 -368 741 -322 1104 -187 -32 1335 626 1373 -157 1817 -692 1442 43
1125D3J256m19j63J002j170J950r32k17J070j436J364r18J119k849J684q70K43
$$ 43 1299 880 717 1719 549 2499 1567 1350 2420 984 2348 1430 2549 -300 1384 514 757
1142G57Q84p35P52j118J96j172J305j399J091r45L13K86j345K252k304k88O05
$$ 757 1641 906 1658 540 736 -436 869 -530 561 -384 -71 215 -1130 1122 -1182 -1470 -865
1159h65k22L29O2k91p2Q96j314L63l22k82J015n37L06p91M97J45j14L54p56J375
$$ -865 -1087 -758 -696 -987 -1059 -163 -1477 -1114 -1436 -1718 -703 -1240 -934 -1725 -1228 -1083 -1197 -843 -1599 -224
1179b24j414J286k592L232j179Q9M95N36n34p24K190j606P26P7m57J140q94L08
$$ -224 -1638 -352 -2944 288 -891 -802 -307 229 -305 -1029 1161 -445 281 358 -99 1041 147 455
1197D55Q21J108j686R26m65J26K46j021J326q71R05q79l01J120L9l0j508J85J22
$$ 455 1276 2384 698 1624 1159 1285 1531 510 1836 965 1870 991 690 1810 1849 1819 311 496 618
1216F18J195j172j38J127j071Q15k080O12m03O13K87r77N14r99J322j484J431
$$ 618 1813 641 503 1630 559 1374 -706 -94 -497 116 403 -574 -60 -1059 263 -1221 210
1233B10j654P78m58L78k22j09Q62j207Q19j739Q90K42Nk4l3Q03j252J85O21j46
$$ 210 -1444 -666 -1124 -746 -968 -1077 -215 -1422 -603 -2342 -1452 -1210 -1205 -1229 -1262 -459 -1711 -1526 -905 -1051
1253a051L71j243J370r0K92o54P65M1K82p42j9J962k014J412o69M21p4R96L37
$$ -1051 -680 -1923 -553 -643 -351 -1005 -240 -199 83 -659 -678 1284 -730 682 13 434 360 1356 1693
1272A693j398P16j04O43p97J179m52r26Q84m98P35n30L08o9Q07j056k23J188j486
$$ 1693 295 1011 907 1550 753 1932 1480 554 1438 940 1675 1145 1453 1384 2191 1135 912 2100 614
1291F14M47j227K044n75K79n75q42J32n56R16j186P68L79j818M48P25Q68j538
$$ 614 1061 -166 1878 1303 1582 1007 165 297 -259 657 -529 239 618 -1200 -752 -27 841 -697
1309f97o9l94J531k285J062O42j033R11j591N78J48m3k66n90L60R01p85L56J19
$$ -697 -766 -1160 371 -1914 -852 -210 -1243 -332 -1923 -1345 -1197 -1240 -1506 -2096 -1736 -835 -1620 -1264 -1145
1328a145l06N46L92q90J824j333J604j124L84J07L60n34k9Q49p18J411p35N86
$$ -1145 -1451 -905 -513 -1403 421 -912 692 -432 -48 59 419 -115 -144 705 -13 1398 663 1249
1346A249l39j30p4q01K188p91K15j311J054L14j98K42k039J869j478J367K7p98
$$ 1249 910 780 706 -95 2093 1302 1517 206 1260 1574 1376 1618 -421 1448 -30 1337 1364 566
1364E66J136p25L09j951J461q46J142j14n39M31j84lq26J66r88J426j010R40p40
$$ 566 1702 977 1286 -665 796 -50 1092 978 439 870 686 683 -143 23 -965 461 -549 391 -349
1383c49j345K090j751J419j577J216K88j395J155m67L15j075J138j354J070m82
$$ -349 -1694 396 -1355 64 -1513 -297 -9 -1404 -249 -716 -401 -1476 -338 -1692 -622 -1104
1399a104k47j42K05k6o1L62N02j01J12k30P42n15n8L14L76K05L06l89n58J335
$$ -1104 -1351 -1493 -1288 -1314 -1375 -1013 -511 -612 -500 -730 12 -503 -561 -247 129 334 640 251 -307 1028
1419A028j232J077o19L59M93j193J290o95Q48o29L01K43n25O25r13N31l33N63
$$ 1028 -204 873 254 613 1106 -87 1203 508 1356 727 1028 1271 746 1371 458 989 656 1219
1437A219r26P69l61j52P42j203Q75j161J458j097K65m47l5N23q92Q74m45M46p93
$$ 1219 293 1062 701 549 1291 88 963 -198 1260 163 428 -19 -54 469 -423 451 6 452 -341
1456c41J04r2k95N05j475R03o46P11k03M59m89j43N68j352Q46q37Q68l94O87K42
$$ -341 -237 -329 -624 -119 -1594 -691 -1337 -626 -829 -370 -859 -1002 -434 -1786 -940 -1777 -909 -1303 -616 -374
1476c74q33P47j365J598j078P99k38l75K55N8Q66n67O11n76K33L91q1N48j070
$$ -374 -1207 -460 -1825 -227 -1305 -506 -744 -1119 -864 -806 60 -507 104 -472 -239 152 71 619 -451
1495d51J289p82N87l72K38J03J28K21r93J758j831J140j19L78k28n10P43j53l46
$$ -451 838 56 643 271 509 612 740 961 -32 1726 -105 1035 916 1294 1066 556 1299 1146 800
1514H00k20N79n97K11L4n89K88m88P07r91K62N19m84L20j024M48m66K62M72k89
$$ 800 580 1159 562 773 807 218 506 18 725 -266 -4 515 31 351 -673 -225 -691 -429 43 -246
1534b46L79m18k48q89M35K11o41L18o47Q26K55k22r2J048j332L51J047j121M38
$$ -246 133 -285 -533 -1422 -987 -776 -1417 -1099 -1746 -920 -665 -887 -979 69 -1263 -912 135 -986 -548
1553e48q47M77M7Q67p69k88P31l01J045j802J793l2j35m92k76J272r20Q48j277
$$ -548 -1395 -918 -871 -4 -773 -1061 -330 -631 414 -1388 405 373 238 -254 -530 742 -178 670 -607
1572f07J888n49j74O61o86L21j324J602l99j42N93k55l41k6N10r5N96j129M45
$$ -607 1281 732 558 1219 533 854 -470 1132 733 591 1184 929 588 562 1072 977 1573 444 889
1591H89j53P15m55j046L28o20J953j726J454k173J71q96K049m43L27k52j28P91
$$ 889 736 1451 996 -50 278 -342 1611 -115 1339 -834 -663 -1559 490 47 374 122 -6 785
1609G85r97o55k33N8O50l09N80j529N57O59n87n1m63R78p06R56p94P44l22Q9P8
$$ 785 -212 -867 -1100 -1042 -392 -701 -121 -1650 -1093 -434 -1021 -1072 -1535 -557 -1263 -307 -1101 -357 -679 -590 -512
1630e12k33Q94j223J375m06j01J74o38J151r36R88o43L33l37o21J330o56J354
$$ -512 -745 149 -1074 301 -105 -206 -32 -670 481 -455 533 -110 223 -114 -735 595 -61 1293
1648A293r68R35j562P36O87p62m47O75J211k094J378k58l87K00r9J14m23O26O06
$$ 1293 325 1260 -302 434 1121 359 -88 587 1798 -296 1082 824 437 637 538 652 229 855 1461
1667A461j12j081j94l81k32J091p76J177j818K103j209j96R48j908M99j86j2J249
$$ 1461 1349 268 74 -307 -539 552 -224 953 -865 1238 29 -167 781 -1127 -628 -814 -826 423
1685D23l75o01m49M9K39N25j120P70k64M9P27p37R24p02K87j003R79q64k34Q43
$$ 423 48 -553 -1002 -953 -714 -189 -1309 -539 -803 -754 -27 -764 160 -542 -255 -1258 -279 -1143 -1377 -534
1705e34n11P77q08P24j62O00k79k14P44p26J045n15J20p9l47k22N10m01o1J255
$$ -534 -1045 -268 -1076 -352 -514 86 -193 -407 337 -389 656 141 261 182 -165 -387 123 -278 -339 916
1725I16q74Q53p74J419j546k40J231r46j80R47o93r3m61J432o14J62j650J131
$$ 916 42 895 121 1540 -6 -246 985 39 -141 806 113 20 -441 991 377 539 -1111 20
1743B0j65k07M40M33N7r34R55j536R31J57Q00j578L91M72j16J0J72L17j184J97
$$ 20 -145 -352 88 521 578 -356 599 -937 -6 151 951 -627 -236 236 120 130 302 619 -565 -368
1763c68M8l30QL69r78J79R27j214K82P89j859J652j009J851j545L00K74j6M94
$$ -368 -320 -650 -642 -273 -1251 -1072 -145 -1359 -1077 -288 -2147 -495 -1504 347 -1198 -898 -624 -640 -146
1782a46j13N48q49K49N38l17n32M74q7O39M2o95K019k524J122Q60n67j057O29
$$ -146 -259 289 -560 -311 227 -90 -622 -148 -235 404 446 -249 1770 -754 368 1228 661 -396 233
1801B33Q12j304J172p62P72j91o57Q92j103R82o17M37n58K5j4J63K42L12o9p84
$$ 233 1045 -259 913 151 923 732 75 967 -136 846 229 666 108 133 119 282 524 836 767 -17
1821a7n07j9O50P74o25n37K42P0l06N82J07j629J567p12K95l88P9R0R63m02j066
$$ -17 -524 -543 107 881 256 -281 -39 31 -275 307 414 -1215 352 -360 -65 -453 -374 -284 679 277 -789
1842g89J348j879J330o21N48j49l08L0K92O24j861L64J042M3l94m2J561k265R67
$$ -789 559 -1320 10 -611 -63 -212 -520 -490 -198 426 -1435 -1071 -29 14 -380 -422 1139 -1126 -159
1861a59q25J496r57M54J320j686N03j214J996j254P76n04k04J256p19J576j981
$$ -159 -984 512 -445 9 1329 -357 146 -1068 928 -326 450 -54 -258 998 279 1855 -126
1878a26O55L42j287J160M01j066M29j48o32J686j541J571p06j56p44n61P3M85
$$ -126 529 871 -416 744 1145 79 508 360 -272 1414 -127 1444 738 582 -162 -723 -650 -165
1896a65q5k33J09J187j216J100J85j753J805r06p61O65J249j026J007j517M47
$$ -165 -250 -483 -374 813 -403 697 882 -871 934 28 -733 -68 1181 155 1162 -355 92
1913I2j147J069L70p45J63m96J912l458K864q12J63L50j307J09J28j621J594J183
$$ 92 -1055 14 384 -361 -198 -694 1218 -2240 624 -188 -25 325 -982 -873 -745 -2366 -772 411
1931D11J59j405J540r41P87j012J137j178J649r19j071N19r54K379j066L35Q39
$$ 411 570 -835 705 -236 551 -461 676 -502 1147 228 -843 -324 -1278 1101 35 370 1209
1948A209j313l40l02J75P47P52j056n65L67j9N62j73J260j409K65R99j983J525
$$ 1209 -104 -444 -746 -571 176 928 -128 -693 -326 -345 217 44 1304 -105 160 1159 -824 701
1966G01j594O85O86j227Q59N75q86j288K165K88j615J546p33p23P61JR7m51Q14
$$ 701 -893 -208 478 -749 110 685 -201 -1489 676 964 -651 895 162 -561 200 201 298 -153 661
1985F61L73j797N13j117J446n13m30N67k35J26M6j118Q68J36j809K195K53j000
$$ 661 1034 -763 -250 -1367 79 -434 -864 -297 -532 -406 -360 -1478 -610 -474 -2283 -88 165 -835
2003h35O20j024N92j96n21J003P69L84Q44r99j521n1J680j095N64N23l92M26o91
$$ -835 -215 -1239 -647 -843 -1364 -361 408 792 1636 637 -884 -935 745 -350 214 737 345 771 80
2022H0Q72o31j72L63q18P43L3m95k04M61P34m01r47J531r65Pj3J116j788J161
$$ 80 952 321 149 512 -306 437 470 -25 -229 232 966 565 -382 1149 184 191 178 1294 -494 667
2042F67k65k12p14J187j417J8J532j294N41q61J007k24j183M23P94O25k185M61
$$ 667 402 190 -524 663 -754 -736 796 -498 43 -818 189 -35 -1218 -795 -1 624 -1561 -1100
2060a100J336j644J158o22K064j672O6k80J024j831N77J358r88N27j660K246k50
$$ -1100 236 -1408 -250 -872 1192 -480 -414 -694 330 -1501 -924 434 -554 -27 -1687 559 309
2077C09j069k63M69m16L12l17J37J084p31R64j070P78m23p73O30M53M16r14l88
$$ 309 -760 -1023 -554 -970 -658 -975 -838 246 -485 479 -591 187 -236 -1009 -379 74 490 -424 -812
2096h12J435j334L98K48J25m35k40P2K84m22P2J195J084k378J528j905J629J58
$$ -812 623 -711 -313 -65 60 -375 -615 -543 -259 -681 -609 586 1670 -708 820 -1085 544 702
2114G02j250J775p44j107J573j440N09k6q59K51P3J198p66o55P7L08j80Q75o44
$$ 702 -548 1227 483 -624 949 -491 18 -8 -867 -616 -543 655 -111 -766 -689 -381 -561 314 -330
2133c30j017N89O33J106k188J168n5q97P09l55n67M72N29Q60n99j352m28J278
$$ -330 -1347 -758 -125 981 -1207 -39 -94 -991 -282 -637 -1204 -732 -203 657 58 -1294 -1722 -444
2151d44q5Q99q79L4m97M28R66k151J696o2n5J02p77K172j776p2J136j72n85n85
$$ -444 -529 370 -509 -475 -972 -544 422 -1729 -33 -95 -150 -48 -825 1347 -429 -501 635 463 -122 -707
2171g07Q06K85k49p9O41j427O76k77N35K42k88j8O65p18N37j325R93j182J486
$$ -707 99 384 135 56 697 -730 -54 -331 204 446 158 140 805 87 624 -701 292 -890 596
2190E96L08p08J248j329N0K35m61K32Q06j182N74q07J113k93r38O67n84J25L92
$$ 596 904 196 1444 115 165 400 -61 171 977 -205 369 -438 675 382 -556 111 -473 -348 44
2209D4O87j668R14L4m80L58M07o90J405j505j79K81K92J08m38m96J154j126L9
$$ 44 731 -937 -23 11 -469 -111 296 -394 1011 -494 -673 -392 -100 8 -430 -926 228 -898 -859
2228h59K87L66k03j96J34o03J221J25M35p28k08k29K57K24J52l04q7N14q01N47
$$ -859 -572 -206 -409 -605 -471 -1074 147 272 707 -21 -229 -458 -201 23 175 -129 -216 298 -503 44
2248D4n7J20P2j12J73m85Q69m81M83k47k79M64k91r5qM25l02L93p1n42P48r78
$$ 44 -13 107 179 67 240 -245 624 143 626 379 100 564 273 178 170 595 293 686 615 73 821 -157
2270a57O77m20K80m44J92K11p57L72J14L76r35O37l6J92k26l53k39M38j72m45
$$ -157 520 100 380 -64 128 339 -418 -46 68 444 -491 146 110 302 76 -277 -516 -78 -250 -695
2290f95O05l02J324j022n56Q13O7p04N36r16M35l59L32N37QnJ52j467N26J039
$$ -695 -90 -392 932 -90 -646 167 234 -470 66 -850 -415 -774 -442 95 103 98 250 -1217 -691 348
2310C48p68L39j26K6K86l30L65k59J5k09J97J09L33J39p88R38ok46k86R37j97
$$ 348 -420 -81 -207 -181 105 -225 140 -119 -104 -313 -116 -7 326 465 -323 615 609 363 77 1014 817
2331H17n56Q72j774N88O48j78l96L68m64N68J02p99M18l73Q95p46O12J79j347
$$ 817 261 1133 -641 -53 595 417 21 389 -75 493 595 -204 214 -159 736 -10 602 781 -566
2350e66Q10k65N20l73n12P3J36P5J58J19r58J349o32m29K77J30N36r88J21k71
$$ -566 244 -21 499 126 -386 -313 -177 -102 56 175 -783 566 -66 -495 -218 -88 448 -540 -419 -690
2370f90N59L87J98j099L09n97R78k37m89J92N45N15q33j281K219r70O64l89M97
$$ -690 -131 256 454 -645 -336 -933 45 -192 -681 -489 56 571 -262 -1543 676 -294 370 -19 478
2389D78L24p98P15j024k86J203L64n45q71n04J373L63q05l63K340k781J962k96
$$ 478 802 4 719 -305 -591 612 976 431 -440 -944 429 792 -13 -376 1964 -817 1145 849
2407H49k28J506k140j814K114J273j051q43J58Q98m27K05o52P88K46j199r46K535
$$ 849 621 2127 -13 -1827 287 1560 509 -334 -176 722 295 500 -152 636 882 -317 -1263 1272
2425A272q71j560J371o91O72j480J899J71k29N26q92j9j03R7n58p09J240Q22p79
$$ 1272 401 -1159 212 -479 193 -1287 612 783 554 1080 188 169 66 163 -395 -1104 136 958 179
2444A79j12j58O42L17j130O76o63K09M12m31j08o08J079p13J041p93M25M00q81
$$ 179 67 -91 551 868 -262 414 -249 -40 372 -59 -167 -775 304 -409 632 -161 264 664 -217
2463b17j27L22N70n78m8k51m8M63P26j690J216J83r47J18P8J072q24M17o60P97
$$ -217 -344 -22 548 -30 -78 -329 -377 86 812 -878 338 521 -426 -308 -230 842 18 435 -225 572
2483E72O61j035L59k10K40L67p27q2r7K18K29m33l95Q70o07N81L93j436N44q9
$$ 572 1233 198 557 347 587 954 227 145 48 266 495 62 -333 537 -70 511 904 -532 12 -77
2503g7o1L59p32Q24o79p75Q69l27J070j342R03o93J600j183O61N88r17l58q1k98
$$ -77 -138 221 -511 313 -366 -1141 -272 -599 471 -871 32 -661 939 -244 417 1005 88 -270 -351 -649
2523f49N28M81j746O71J48J15P81l99N14p46M58m2q68L71J032J28r91L19n52Q92
$$ -649 -121 360 -1386 -715 -567 -452 329 -70 444 -302 156 114 -754 -383 649 777 -214 105 -447 445
2543D45j628J607l41M13r34P83J141j219M96m00J080j774M60L29p45p3M52N77
$$ 445 -1183 424 83 496 -438 345 1486 267 763 363 1443 -331 129 458 -287 -360 92 669
2561F69m44Q17l23n68r07Q79j549J457P25p44J241j388L85o58j45M61J81M68p56
$$ 669 225 1042 719 151 -756 123 -1426 31 756 12 1253 -135 250 -408 -553 -92 89 557 -199
2580a99N28N1n16M5P24r30J99O53p18P22j65K30r51o08J042K36j225Q62J81n28
$$ -199 329 380 -136 -91 633 -297 -98 555 -163 559 394 624 -327 -935 107 343 -882 -20 161 -367
2600c67m1N73j483K429j585L36m59J083j062lO67M01k25L46l00J09r95M58R03
$$ -367 -408 165 -1318 1111 -474 -138 -597 486 -576 -579 88 489 264 610 310 419 -576 -118 785
2619G85k99J25r13O91k79M02k23j17j43O64o6n01l16Q86l42J66r67k85L17R2J062
$$ 785 486 611 -302 389 110 512 289 172 29 693 627 126 -190 696 354 520 -447 -732 -415 -323 739
2640G39j68o78k15K83k16l3P21r10M99r6r95J289j09l20q20J477r51K74M26j167
$$ 739 571 -107 -322 -39 -255 -288 433 -477 22 -74 -1069 220 111 -209 -1029 448 -503 -229 197 -970
2660i70J492N54j014jM37k62r20J925k546J469l06O49j648J162M81j390O76m28
$$ -970 522 1076 62 61 498 236 -684 1241 -1305 164 -142 507 -1141 21 502 -888 -212 -640
2678f40K4N65m7k59j09j11J928k05p08N1j990K364j987J640L61r75k28O98p22
$$ -640 -616 -51 -98 -357 -466 -577 1351 1146 438 489 -1501 863 -1124 516 877 -98 -326 372 -350
2697c50Q78M09o87J04m19k6L01l31k2P50o78M96n42M68m55R12l04J097j509J63
$$ -350 528 937 250 354 -65 -91 210 -121 -143 607 -71 425 -117 351 -104 808 504 1601 92 255
2717B55j172N66L27K7O6l61N54n04M48q4k65L1N90o76P66j02j20L96j360O61n04
$$ 255 -917 -351 -24 3 69 -292 262 -242 206 122 -143 -112 478 -198 568 466 346 742 -618 43 -461
2738d61j83L77k61m83O12l00K78M62r7K42l99m8p1L43J20R2L3N6k48L75m92J62
$$ -461 -644 -267 -528 -1011 -399 -699 -421 41 -56 186 -213 -261 -332 11 131 223 256 312 64 439 -53 109
2760A09o75O76k3k46N61p05M3J48p0O57j32n47k90P23O6K48m93J56Q8K9R5M0j61
$$ 109 -566 110 87 -159 402 -303 -260 -112 -182 475 343 -204 -494 229 295 543 50 206 294 323 418 458 297
2783B97lL37r67P06K64J42p36k57M80q2J21m53q1L51l27O38L23p97L11o14J11
$$ 297 294 631 -336 370 634 776 40 -217 263 181 302 -151 -232 119 -208 430 753 -44 267 -347 -236
2804b36l1L83nj81j93M00r46R04J42n73L56p10P70N5j83m01M1O86q52N54m28k05
$$ -236 -267 116 111 -70 -263 137 -809 95 237 -336 20 -690 80 135 -48 -449 -408 278 -574 -20 -448 -653
2826f53P19n11K92M21L05j35l00L52m41o46Q35l79J022r27L87j70J5M23r14J35
$$ -653 66 -445 -153 268 573 438 138 490 49 -597 238 -141 881 -46 341 171 186 609 -305 -170
2846a70L49l1J88o98L83k12k7N43k6k49n05L58q17J521p25j13R65j303O36k90
$$ -170 179 148 336 -362 21 -191 -218 325 299 50 -455 -97 -914 607 -118 -231 734 -569 67 -223
2866b23J16q43J566L42j601n0r12J476J038o66k80L77P64j813J90M42p17k76R13
$$ -223 -107 -950 616 958 -643 -693 -1605 -129 909 243 -37 340 1104 -709 -519 -77 -794 -1070 -157
2885a57J237j700R53l43m79O39k53l17o18J290q45R18q95R42l96j43N88l83n88
$$ -157 1080 -620 333 -10 -489 150 -103 -420 -1038 252 -593 325 -570 372 -24 -167 421 38 -550
2904e50K79J7L70R07m45j529J356p54O65j125J277p81P12J6p15P63L31L43k075
$$ -550 -271 -254 116 1023 578 -951 405 -349 316 -809 468 -313 399 415 -300 463 794 1137 -938
2923i38O78J14Q63n75N24j010J268p36r80R28K03l71K81l85j34N72o02l95J654
$$ -938 -260 -146 717 142 666 -344 924 188 -792 136 339 -32 249 -136 -270 302 -300 -695 959
2942I59l77r54L4N91n58O26k08J45l67j27K70L56l74r0J02j79L24n00M9j93Q78
$$ 959 582 -372 -338 253 -305 321 113 258 -109 -236 34 390 16 -74 28 -151 173 -327 -278 -471 407
2963D07m69m66Q11o69R17r16r8J37l85J059k04l55M92n95K82k03P93r02L75K10
$$ 407 -62 -528 283 -386 531 -385 -483 -346 -731 328 124 -231 261 -334 -52 -255 538 -364 11 221
2983B21p30J0N11r5N4K7p8P6lj64M19o32J03o6M14K66J95l20m65N59K49J53o30
$$ 221 -509 -499 12 -83 -29 -2 -80 -4 -7 -171 248 -384 -281 -347 67 333 528 208 -257 302 551 704 74
3006G4M88K59q91j98M93l45K27L91o57N20m02J46p32P60K11n89L03j15M29p3m98
$$ 74 562 821 -70 -268 225 -120 107 498 -159 361 -41 105 -627 133 344 -245 58 -57 372 299 -199
3027a99l28qL84M93k29l15M28n15N98L03j042K18K34J23j13n35j71J465j614R87
$$ -199 -527 -535 -151 342 113 -202 226 -289 309 612 -430 -212 22 145 32 -503 -674 791 -823 164
3047A64L16n20J82N5q83J085p65n6n7R78pO32o93K55q20L49M43j143O63K22K51
$$ 164 480 -40 142 197 -686 399 -366 -422 -479 499 492 1124 431 686 -134 215 658 -485 178 400 651
3068F51R2j618J115K33o81N95o64J99k96K08J3P92j515N25j74J89Q66p43O30j010
$$ 651 743 -875 240 473 -208 387 -277 -78 -374 -166 -153 639 -876 -351 -525 -336 530 -213 417 -593
3088e93R81N81p34%j102J182p74L61R96j403J415j617J819j831K71p88J217L19
$$ -593 388 969 235 235 -867 315 -459 -98 898 -505 910 -707 1112 -719 -448 -1236 -19 300
3106C00k64k61j04R6k90K3K51M25j023Q27L88q64L98Q16j111R41J661j598j004
$$ 300 36 -225 -329 -233 -523 -500 -249 176 -847 -20 368 -496 -98 718 -393 548 2209 611 -393
3125c93J468j020L93p97k37o5J36j35K61Q94J07L78p92L42K40k29n40lJ69n1M79
$$ -393 1075 55 448 -349 -586 -651 -515 -650 -389 505 612 990 198 540 780 551 11 8 177 126 605
3146F05l8j97l12J243n10p36N7L76j032J087j112J552r8l30J14j211R56k18j10
$$ 605 567 370 58 1301 791 55 112 488 -544 543 -569 983 885 555 669 -542 414 196 86
3165H6p72r0j66J342p07J231o25K15o01j02Q84j099O79l98J7L09n22K53M32L44
$$ 86 -686 -776 -942 400 -307 924 299 514 -87 -189 695 -404 275 -123 -106 203 -319 -66 366 710
3185G10K38j478N89J86m06o81J776O1j603Q88k77N70k04p91L07j62K85j392J301
$$ 710 948 -530 59 245 -161 -842 934 995 -608 280 3 573 369 -422 -115 -277 8 -1384 -83
3204h3m1k99k27K58J112l98j611J677L04p46M27j89n67o7L37O80K00o07J099o69
$$ -83 -124 -423 -650 -392 720 322 -1289 388 692 -54 373 184 -383 -450 -113 567 767 160 1259 590
3224E90p44M74m09K75m4p43P58L13p30o8Q1k03l44O54j12R5P64j004J393j50l64
$$ 590 -154 320 -89 186 142 -601 157 470 -260 -328 -247 -450 -794 -140 -252 -157 607 -397 996 846 482
3245D82K59o34j92K88o57N59L22j400O46O86K27q89P00q88R25k49p80Q17p50N59
$$ 482 741 107 -85 203 -454 105 427 -973 -327 359 586 -303 397 -491 434 185 -595 222 -528 31
3265C1M06q26q9Q80l73n3l05M8P91j175P65r1RK41K55n77M52n78M06J70k47j0
$$ 31 437 -389 -478 402 29 -24 -329 -281 510 -665 100 9 18 259 514 -63 389 -189 217 387 140 130
3287A30o89R39m48n58Q68p31J45l46P57K23K65k59p18l23J115q20O51K9K33l14
$$ 130 -559 380 -68 -626 242 -489 -344 -690 67 290 555 296 -422 -745 370 -450 201 230 463 149
3307A49j45N49l09n00k1P5j20J38n11J513j130L02k09j41K24M6K8l68N4N79j01
$$ 149 4 553 244 -256 -277 -202 -322 -184 -695 818 -312 -10 -219 -360 -136 -90 -62 -430 -376 203 102
3328A02n72L76P62p16P4N3p4j18J03k08K61l24l48Q22l33J37R2K64p30L92N78
$$ 102 -470 -94 668 -48 26 79 5 -113 -10 -218 43 -281 -629 193 -140 -3 89 353 -377 15 593
3349E93n28j18n88M51J018p26J30n79O93n41N04K22m9j105K57L78K94q7m10J67
$$ 593 65 -53 -641 -190 828 102 232 -347 346 -195 309 531 482 -623 -366 12 306 219 -191 -24
3369b4n2L73o5K55R4n84l30K15J3J279j768L10P17q82M2O17k55l8J93J38n71M32
$$ -24 -76 297 232 487 581 -3 -333 -118 -105 1174 -594 -284 433 -449 -407 210 -45 -83 110 248 -323 109
3391A09p77P34k11L30k26O97r6p81M91j13Q3m63Q20j183P6L88K76J5m89M70J44
$$ 109 -668 66 -145 185 -41 656 560 -221 270 157 240 -223 597 -586 -510 -122 154 169 -320 150 294
3412B94J0j008P71j86K07m58L60m39N77L11j024N28O03k83P77j299J07P28j45
$$ 294 304 -704 67 -119 88 -370 -10 -449 128 439 -585 -57 546 263 1040 -259 -152 576 431
3431D31j93m43k29N06j15j71K92q62K03k52J510q95Q2j16k96J40K96J475j574
$$ 431 238 -205 -434 72 -43 -214 78 -784 -581 -833 677 -218 -136 -252 -548 -408 -112 1363 -211
3450b11M03p03M09J28m91Q07q94J404r63K49m1L12o68Q98o46l78J089q03l87L3
$$ -211 192 -511 -102 26 -465 342 -552 852 -111 138 97 409 -259 639 -7 -385 704 -99 -486 -453
3470d53J094o04l77l03N05n0m87L58j20O85M65j464L53J098o77o7J051j058J68
$$ -453 641 37 -340 -643 -138 -188 -675 -317 -437 248 713 -751 -398 700 23 -44 1007 -51 117
3489A17Q53q90K39p05K70M07O63o46r3l34j80L4o1j007J810j014P22n46Q90l63
$$ 117 970 80 319 -386 -116 291 954 308 215 -119 -299 -265 -326 -1333 477 -537 185 -361 529 166
3509A66N51r89M35l90L35k94M66m3k90P93j068N77k04q2m20J252j047O49j11M62
$$ 166 717 -272 163 -227 108 -186 280 237 -53 740 -328 249 45 -37 -457 795 -252 397 286 748
3529G48o08m59K89j91N05K55n04J01o87J90L91k77K49o29K90l37J495q05j33R3
$$ 748 140 -319 -30 -221 284 539 35 136 -551 -361 30 -247 2 -627 -337 -674 821 16 -117 -24
3549b4J35q17J291j169K86P76j09j008Q57N27n53Q5j647J510j198J17Q34j19O12
$$ -24 111 -706 585 -584 -298 478 369 -639 218 745 192 277 -1370 140 -1058 -941 -107 -226 386
3568C86j154J568m68r31n20J247K61j499J832o10M85j25n16K19J411q28r29L88
$$ 386 -768 800 332 -599 -1119 128 389 -1110 722 112 597 472 -44 175 1586 758 -171 217
3586B17M6M77m2J14o13p0N2P6L58r8q00R65p0p44Q72n20M12m93J52n91M42p47
$$ 217 263 740 698 812 199 129 181 257 615 517 -283 682 612 -132 740 220 632 139 291 -300 142 -605
3608f05J065m75P3M83j34p17LM74n59K48k00L45M9n24Q73n62J74Q4m15k16M01
$$ -605 460 -15 58 541 407 -310 -307 167 -392 -144 -344 1 50 -474 399 -163 11 95 -320 -536 -135
3629a35N09j132N80l8M26Oj77k32l51L91L21J92m42P4L34j42J23n46M7k43R02
$$ -135 374 -758 -178 -216 210 216 39 -193 -544 -153 168 360 -82 -8 326 184 307 -239 -192 -435 467
3650D67n01M23n10J15L67n74Q56p74K47N2P12o61k93O60l92Q6r50M52M46q30J269
$$ 467 -34 389 -121 -6 361 -213 643 -131 116 168 880 219 -74 586 194 280 -670 -218 228 -602 667
3671F67j89r10M69m0J58o33J2N1k01L02R4l93O95q18L24L53q6m74P48o66J281
$$ 667 478 -432 37 -3 155 -478 -466 -415 -616 -314 -220 -613 82 -736 -412 -59 -145 -619 129 -537 744
3692G44j344N09Q7K78n13M47o63N78n90m28J561k112J311N57p27l3L02O0L03n63
$$ 744 -600 -91 -4 274 -239 208 -455 123 -467 -895 666 -1446 -135 422 -305 -338 -36 24 327 -236
3712b36R3R15o26q35Q6J094j52J22q02O77L04O9J95o99o72j84O38K2k88O19j41
$$ -236 -143 772 146 -689 -603 491 339 461 -341 336 640 709 904 205 -467 -651 -13 9 -279 340 199
3733A99l77k87M69J60Jj9l18M40J62n03n7L62l38J0M72J81p70K86M44J9n56L24
$$ 199 -178 -465 4 164 165 146 -172 268 430 -73 -130 232 -106 -96 376 557 -213 73 517 536 -20 304
3755C04l76RpJ08K11n48N4J61k09N40j000Q98jo17O79m37L70m6l95M68K10o31
$$ 304 -72 -63 -70 38 249 -299 -245 -84 -293 247 -753 145 144 -473 206 -231 139 93 -302 166 376 -255
3777b55o1J38K83M05j2n04J23o91J181j086J077J52r78J35J82j44J52m01M04j15
$$ -255 -316 -178 105 510 498 -6 117 -574 607 -479 598 750 -228 -93 89 -55 97 -304 100 -15
3797a5l88O09l62L78l21k60P39n8k65J82P2j78K26q43L61M40M37o71p52P40l6
$$ -15 -403 206 -156 222 -99 -359 380 322 57 239 311 133 359 -484 -123 317 754 83 -669 71 35
3818C5L36m5r2K61j339J167k1k62mp88O37O50l53j51k87K82p9K62j76K71j070
$$ 35 371 326 234 495 -844 323 302 40 36 -752 -115 535 182 31 -256 26 -53 209 33 304 -766
3839g66j72J399n56j9P58n93P25m35l12j7n43Q98m06J44q01N41K10k07l56N53
$$ -766 -938 461 -95 -114 644 51 776 341 29 12 -531 367 -39 105 -696 -155 55 -152 -508 45
3859D5r07Q25J05L3L17n47O99r30N30p22O44J46k8M43o12j9o93J71R04n49O55
$$ 45 -862 -37 68 101 418 -129 570 -360 170 -552 92 238 210 653 41 22 -671 -500 404 -145 510
3880E10j448O32K02Q07n84L78j045J43O72J40L31q06K91j106J209p21J14M43k55
$$ 510 -938 -306 -104 703 119 497 -548 -405 267 407 738 -68 223 -883 326 -395 -281 162 -93
3899i3J023j058L27O66q33J15o89P85M75q10p64P00O97o86Q73n35J14m11K34r96
$$ -93 930 -128 199 865 32 147 -542 243 718 -92 -856 -156 541 -145 728 193 307 -104 130 -866
3919h66P91j88L41J25p05m5m02J084r43R27q16L43J36o0j46P13N9m73l57M59m36
$$ -866 -75 -263 78 203 -502 -547 -949 135 -808 119 -697 -354 -218 -278 -424 289 348 -125 -482 -23 -459
3940d59j49Q1N30l7L92o78R41j52r99P12m6M05o58N65m50J29n77J60j76k6R54
$$ -459 -608 -527 3 -34 358 -320 621 469 -530 182 136 541 -117 448 -2 127 -450 -290 -466 -492 462
3961D62j89K56p82R22k47k16l27N17p45L71j19J36l79L0N76L9l04K29K31o44o2
$$ 462 273 529 -253 669 422 206 -121 396 -349 22 -97 39 -340 -310 266 305 1 230 461 -183 -245
3982b45j64P35N84j148l06M65k08R03p69J73n23R75l84p23N02M64p29N57j91j21
$$ -245 -409 326 910 -238 -544 -79 -287 616 -153 20 -503 472 88 -635 -133 331 -398 159 -32 -153
4002a53R47q31j64L88k70j15O04L1Q5l95o13k96L53J15K79j72L54J24k50K53k10
$$ -153 794 -37 -201 187 -83 -198 406 437 522 127 -486 -782 -429 -314 -35 -207 147 271 21 274 64
4023F4N6N56k46K29r6m49J92m20j09j83R71O41r36k88M82m88L7j71K61N98r63
$$ 64 120 676 430 659 563 114 306 -114 -223 -406 565 1206 270 -18 464 -24 13 -158 103 701 -262
4044b62R9O17q72k37M80n80J126J49l94j30J34pk08K24N2m70L98m72J06j176J392
$$ -262 -163 454 -418 -655 -175 -755 371 520 126 -4 130 123 -85 139 191 -279 119 -353 -247 -1423 -31
4065c1p99j58N39o4L78N83q94o66Q32N78j73Q63n67n70N18r61K81N46Q0m01L16
$$ -31 -830 -988 -449 -513 -135 448 -446 -1112 -280 298 125 988 421 -149 369 -592 -311 235 315 -86 230
4086B30J62P61j641N89K12K24q78K76j1L71j63n00J048l18m12J156j533P53m81
$$ 230 392 1153 -488 101 313 537 -341 -65 -76 295 132 -368 680 362 -50 1106 -427 326 -155
4105a55O38o0R2p07l55QO19L02k98K64j35l0r2J6n74N08m3J41J97o29N04k80j65
$$ -155 483 423 515 -192 -547 -539 80 382 84 348 213 183 91 107 -467 41 -2 139 336 -293 211 -69 -234
4128b34O6K67j71q13O53L14N40p40K48l42P86j011Q15j454Q2O58L92m66L11O58
$$ -234 -168 99 -72 -885 -232 82 622 -118 130 -212 574 -437 378 -1076 -994 -336 56 -410 -99 559
4148E59m29j140J064j33L21o9o34K16m82O07M8M53m71o07J149j58l33j04L2P19
$$ 559 130 -1010 54 -79 242 173 -461 -245 -727 -120 -72 381 -90 -697 452 294 -39 -143 -111 608
4168F08p12k38k5O01J161p70k38J08o43NJ168l48j583J323m31M85q5j27J22j032
$$ 608 -104 -342 -367 234 1395 625 387 495 -148 -143 1025 677 -906 417 -14 471 386 259 381 -651
4188f51N30P75l13M6r54K00l7N07n7j18O56q01m02O2O15M16J53k67l44J584j799
$$ -651 -121 654 341 387 -567 -367 -404 103 46 -72 584 -217 -619 -557 58 474 627 360 16 1600 -199
4209a99M21N23j025P52k54K6j008Q04k25L43J86L93q41j033J016L59j520J470
$$ -199 222 745 -280 472 218 244 -764 40 -185 158 344 737 -104 -1137 -121 238 -1282 188
4227A88N25J53j494R8P09N49o31j12r13J136M54j050R46j87k43K05n70R65j497
$$ 188 713 866 -628 -530 179 728 97 -15 -928 208 662 -388 558 371 128 333 -237 728 -769
4246g69R51K63l01m29O50J42R85j948J493j782J565m32o32K43P74j572J772o84
$$ -769 182 445 144 -285 365 507 1492 -456 1037 -745 820 388 -244 -1 773 -799 973 289
4264B89j185J361j161k1Q67o9K45o20j54O46l58k53j96m91Q48M89k93J093n99
$$ 289 -896 465 -696 -717 150 81 326 -294 -448 198 -160 -413 -609 -1100 -252 237 -56 1037 438
4283D38j196R96q31j99J22pJ071m10p4j7K84l92P39q01%o8j87M41k00M89J96j87
$$ 438 -758 238 -593 -792 -670 -677 394 -16 -90 -107 177 -215 524 -277 -277 -345 -532 -91 -291 198 394 207
4305B07p01K67L03p68Q80j60j53K05O1K4q7k99M15N50p69k05M46p3J75p98K95
$$ 207 -494 -227 76 -692 188 28 -125 80 141 165 78 -221 194 744 -25 -230 216 143 318 -480 -185
4326a85K91K30L05k54m5k51J85M07j95l72o71K40L37L98rk68j41K55J98r23M94
$$ -185 106 336 641 387 342 91 276 683 488 116 -555 -315 22 420 411 143 2 257 455 -468 26
4347B6q01P25J80O2q98J511%r87n12J40M43J38p9j218J091m4O59m84J285j344
$$ 26 -775 -50 130 192 -706 805 805 -182 -694 -554 -111 27 -52 -1270 -179 -223 436 -48 1237 -107
4367a07l19P00j89j389J496o59J62P04j102R32j49k31K05q0n03J374n54p07J71
$$ -107 -426 274 85 -1304 192 -467 -305 399 -703 229 80 -151 54 -26 -529 845 291 -416 -245
4386b45m6O03o78j79J917k132J477q14M13l24M56m61o1O80p1r73k6N58j93K38
$$ -245 -291 312 -366 -545 1372 -760 717 -97 316 -8 448 -13 -74 606 535 -438 -464 94 -99 139
4406A39j062J006k41Q06n64N32p63K4K11k72K3L60k23k57p6Q65r72M63j22p5N65
$$ 139 -923 83 -158 648 84 616 -147 -123 88 -184 -161 199 -24 -281 -357 508 -464 -1 -123 -198 367
4427C67j54P4m60J78J07n70J034p45L38k39l14J058j189N95j53k54L54j41J38
$$ 367 213 287 -173 5 112 -458 576 -169 169 -70 -384 674 -515 80 -73 -327 27 -114 24
4446B4m20K12M05k77N72p97r9L48K5l98M03l35K2N6K84K57l63m31J52K12K2M5
$$ 24 -396 -184 221 -56 516 -281 -380 -32 -7 -405 -2 -337 -315 -259 25 282 -81 -512 -360 -148 -126 -81
4468h1M22O5L16m80j61J38p35Q00k50O31k90j32M51j145%R36l0J17M05j427P41
$$ -81 341 406 722 242 81 219 -516 284 34 665 375 243 694 -451 -451 485 455 572 977 -450 291
4489B91L88o50L85K73o29L52o97J87J16o62P12q60Q25k53K11k27k07J39P0O51
$$ 291 679 29 414 687 58 410 -287 -100 16 -646 66 -794 31 -222 -11 -238 -445 -306 -236 415
4509D15j70l92O19m85L52l39R2n9k35r8P94n58j07M15j022J774j237J46J4k78
$$ 415 245 -147 472 -13 339 0 92 33 -202 -300 494 -64 -171 244 -778 996 -241 -95 -81 -359
4529c59L86k96K91q3m43M53q02R56N8k5J10O1k20K42j19r16J321j413P85J87J31
$$ -359 27 -269 22 -61 -504 -51 -853 103 161 136 246 307 87 329 210 -706 615 -798 -13 174 305
4550C05p8J55o34O41p11J95K06O8J38j61J18n70O5m48k96J185p47J095o86J090
$$ 305 227 382 -252 389 -322 -127 79 147 285 124 242 -328 -263 -711 -1007 178 -569 526 -160 930
4570I30j168q08J110l56L56Q76r49k4L23N1P26o58n01R14r11n31N97K48m9m51
$$ 930 -238 -1046 64 -292 64 940 -9 -33 290 341 1067 409 -92 822 -89 -620 -23 225 176 -275
4590b75J78p99J872j600J29Q14m43k93P11n17J76J48L30r67L93k23k52M16J268
$$ -275 -97 -896 976 -624 -495 319 -124 -417 294 -223 -47 101 431 -536 -143 -366 -618 -202 1066
4609A066p43k19m63K30N3l38k08M81O72om03j99O78p89R1N62j21j095R21l27j71
$$ 1066 323 104 -359 -129 -76 -414 -622 -141 531 525 122 -77 601 -188 -97 465 344 -751 170 -157 -328
4630c28L17PM68o66R93n87k41O04Pj794J045J537j253R57j031N9J47l54R41n56
$$ -328 -11 -4 464 -202 791 204 -37 567 574 -1220 -175 1362 109 1066 35 94 241 -113 828 272
4650B72l03K5l8J099p39P98m41p38j50o22J088l21j16J116j200L76r7K71j266
$$ 272 -31 -6 -44 1055 316 1114 673 -65 -215 -837 251 -70 -186 930 -270 106 9 280 -986
4669i86J475q79N01j72P02k66q71O79n26l1k25Q72J42p76J060j84Q5n61o23Q57
$$ -986 489 -390 111 -61 641 375 -496 183 -343 -374 -599 273 415 -361 699 515 600 39 -584 273
4689B73o6m03L49J15q12N42K36K74m00J14N2k72N07n52j13N51j81N9j20L46k20
$$ 273 207 -196 153 268 -544 -2 234 508 108 222 274 2 509 -43 -156 395 214 273 153 499 279
4710B79p4J59p63O33n26J282r67M86m80j23J77n99J258q19p15R79m42j66J681
$$ 279 205 364 -399 234 -292 990 23 509 29 -94 83 -516 742 -77 -792 187 -255 -421 1260
4729A260r26L71r03N47q16Q93r81m16J857k466J921j052P50r26O68Q49p95L65
$$ 1260 334 705 -198 349 -467 426 -555 -971 886 -1580 341 -711 39 -887 -219 630 -165 200
4747B00K17r19L44N89m60L85r18N97l4rM70j68m61P58j507N5J669n56l71R04r48
$$ 200 417 -502 -158 431 -29 356 -562 35 1 -8 462 294 -167 591 -916 -861 808 252 -119 785 -163
4768a63q40P67K75O3p08l21J358l04l3N61o54P51o76M24k48R24j058J342q20M08
$$ -163 -1003 -236 39 102 -606 -927 431 127 94 655 1 752 76 500 252 1176 118 1460 640 1048
4788A048j165L42J94p63J853j699p45R17r17P15m25J774j943J864j644Q60j583
$$ 1048 -117 225 419 -344 1509 -190 -935 -18 -935 -220 -645 1129 -814 1050 -594 266 -1317
4805a317Q65O94j23k87k05J061j345J07J098M24j214P7P9r2N42p17j76J369j161
$$ -1317 -452 242 119 -168 -373 688 -657 -550 548 972 -242 -165 -86 -178 364 -353 -529 840 -321
4824c21J21Q21p80k07J9L79L66k00l92M53n83N90j64O34j017j2P75r38P1P48l47
$$ -321 -200 621 -159 -366 -347 32 398 198 -194 259 -324 266 102 736 -281 -293 482 -456 -385 363 16
4845A6P61J04p74L82Q0J56j398O93k76n45J604j68p12j67Q02j023J204r33j88
$$ 16 777 881 107 489 569 725 -673 20 -256 -801 803 635 -77 -244 558 -465 739 -194 -382
4864c82R33k53j50m56J422j272P80n22k6J50J131j246j1r3P78L10n47p73Q60j107
$$ -382 551 298 148 -308 1114 -158 622 100 74 224 1355 109 98 5 783 1093 546 -227 633 -474
4884d74J086j040J143r34J43J81o76K54j190R10R90J56p26l08O55M31r15O89m33
$$ -474 612 -428 715 -219 -76 105 -571 -317 -1507 -597 393 549 -177 -485 170 601 -314 375 -58
4903e8l46M76N75j230J30l29N04j60J016J88j065Q88j270M11J296n38K81p26L41
$$ -58 -404 72 647 -583 -453 -782 -278 -438 578 766 -299 589 -681 -270 1026 488 769 43 384
4922C84L84m17o68P13m20m47l44J039P0J04j033m64L17J474P72k221J926j418
$$ 384 768 351 -317 396 -24 -471 -815 224 294 398 -635 -1099 -782 692 1464 -757 1169 -249
4940b49p8j137J708K38p01p49J394j97O21q62Jo33P54N23j134J17J99j34r80K208
$$ -249 -327 -1464 244 482 -219 -968 426 229 850 -12 -11 -644 110 633 -501 -384 -185 -319 -1299 909
4960I09o08L94m96p66k65O44j15O22j2n13M45o6k18J11n19J071q69j8M8N8k71
$$ 909 301 695 199 -567 -832 -188 -303 319 307 -206 239 173 -45 66 -453 618 -251 -269 -221 -163 -434
4981d34l94J184o64K95K02n96J216l73l24l58l28J41j3Q72j299M47J007p09K75
$$ -434 -828 356 -308 -13 189 -407 809 436 112 -246 -574 -433 -446 426 -873 -426 581 -128 147
5000A47p65J161l34l34J43J95j7j41j37R0k09L56k55l67O29l86K03N61q93j28
$$ 147 -618 543 209 -125 18 213 196 55 -82 8 -201 155 -100 -467 162 -224 -21 540 -353 -481
5020d81L64M18p04L97m19J094m94Q34j394L46L03p33J062q52q47N69M81o3l81
$$ -481 -117 301 -403 -6 -425 669 175 1009 -385 -39 264 -469 593 -259 -1106 -537 -56 -119 -500
5039e00N36N22l88j564P64N29r19K18J502q32L07n42K98J45j89j09N19l11K83
$$ -500 36 558 170 -1394 -630 -101 -1020 -802 700 -132 175 -367 -69 76 -113 -222 297 -14 269
5058B69p4j93k89J184k169O25l5P14M13q7o20r4J430p04k67l53P39k12q61Q13
$$ 269 195 2 -287 897 -1272 -647 -682 32 445 358 -262 -356 1074 370 103 -250 489 277 -584 229
5078B29k09j34j04j33j088K042j107n11Q15l81k45R44J93j153J214O80n44m25
$$ 229 20 -114 -218 -351 -1439 603 -504 -1015 -200 -581 -826 118 311 -842 372 1052 508 83
5096H3r18J297j92q34Q10k99K31M2m28N22k35j09K34K33j227p47J746j60P68j362
$$ 83 -835 462 270 -564 246 -53 178 220 -208 314 79 -30 204 437 -790 -1537 209 49 817 -545
5116e45P59n78l8N57J54K9m41j00J07r5J167q46m42o73L36n7Q61K81R3k94m92
$$ -545 214 -364 -402 155 309 338 -103 -203 -96 -191 976 130 -312 -985 -649 -706 155 436 529 235 -257
5137b57P42r70Q0O15l33m56l07J421k01n96J263j430O47J99l53J83k43p62O93
$$ -257 485 -485 -405 210 -123 -579 -886 535 334 -262 1001 -429 218 417 64 247 4 -758 -65
5156f5J003n57o41Q81m15K75k76l55R81j060P9L5L11p8j99K37M13m79M71n75n87
$$ -65 938 381 -260 621 206 481 205 -150 831 -229 -150 -115 196 118 -81 156 569 90 561 -14 -601
5177f01Q09p56J576j67r62J120j020p78Q78j028J222l28n40P35k00m73J240o75
$$ -601 208 -548 1028 861 -101 1019 -1 -779 99 -929 293 -35 -575 160 -40 -513 727 52
5195E2J37J114j313J63J84j109K299p73p02N16k15J3r03R37n12M28q39R87P8o54
$$ 52 189 1303 -10 153 337 -772 1527 754 52 568 353 366 -537 400 -112 316 -523 464 542 -112
5215a12P51M15j667J300o52O66p87k02J524k149J655l60p75J662k99j464N07l71
$$ -112 639 1054 -613 687 35 701 -86 -288 1236 -913 742 382 -393 1269 970 -494 13 -358
5233c58J90J467o58k0j084L44j337J388k80R88q17K11N52n89L92r05k0K101j591
$$ -358 -168 1299 641 621 -463 -119 -1456 -68 -348 640 -177 34 586 -3 389 -516 -536 1565 -26
5252b6k72K12L83j440J376n68K01M14J43n73M39M53j06p97M48N3j192J400m00
$$ -26 -298 -86 297 -1143 233 -335 -134 280 423 -150 289 742 636 -161 287 340 -852 548 148
5271A48M3o97Q01o83L49k47P9N85n71J56j85j85M57N45q78P64j071N67j26L25
$$ 148 191 -506 295 -388 -39 -286 -207 378 -193 -37 -222 -407 50 595 -283 481 -590 -23 -149 176
5291A76m62J035o23N11j329P29J032j234K16j22M09l6J08l07N0j22m0k16L57J23
$$ 176 -286 749 126 637 -692 37 1069 -165 51 -71 338 302 410 103 153 31 -9 -225 132 255
5311B55K3LM80o24J74j82L79j249J314n87Q66p37J88k66p84J399r29L11K24n85
$$ 255 278 281 761 137 311 129 508 -741 573 -14 852 115 303 37 -747 652 -277 34 258 -327
5331c27K43n23L98l53J206j75p96Q9L88l26lK59J72p83N83l34J72k81N26j25l9
$$ -327 -84 -607 -209 -562 644 469 -327 -238 150 -176 -179 80 252 -531 52 -282 -110 -391 135 10 -29
5352b9J41j099K7J664m37L94R19k487J108r12J035O07j141O12L0j051N51K33j01
$$ -29 112 -987 -960 704 267 661 1580 -907 201 -711 324 931 -210 402 432 -619 -68 165 64
5371F4o15Q49R16r78j219J182k28N79N13q60K16J43l23l22P15j328R40k87q70
$$ 64 -551 298 1214 236 -983 199 -29 550 1063 203 419 562 239 -83 632 -696 244 -43 -913
5390i13K38J280j38j281J041K37p49o7lk24L81Q11q76j08O51m04L25k99O69k24
$$ -913 -675 605 467 -814 227 464 -285 -352 -355 -579 -198 613 -263 -371 280 -124 201 -98 571 347
5410C47k56j81j306J935j153R6K038k518J855q68M89m60P5L43j51L6j287J587
$$ 347 91 -90 -1396 539 -614 -518 1520 -998 857 -11 478 18 93 436 285 321 -966 621
5428F21J09j473M87J63J5k29k09M9K47O43K89j487K85L57O05j218J455n32k16
$$ 621 730 -743 -256 -93 -78 -307 -516 -467 -220 423 712 -775 -490 -133 472 -746 709 177 -39
5447c9l15j14J040j809K073j300K43m00J129R12j106q08J066m7m22o47J379r57
$$ -39 -354 -468 572 -1237 836 -464 -221 -621 508 1420 314 -494 572 525 103 -544 835 -122
5465a22K20k6j11K65K51q29J298j695J587j497rR79L74n1r42N40j253J239L7q44
$$ -122 98 72 -39 226 477 -352 946 -749 838 -659 -668 311 685 634 -308 232 -1021 218 255 -589
5485e89J485K01j303R4m81o7L77P92o16l33r7j61O45m94l56J17k1O96q63R29q59
$$ -589 896 1097 -206 -112 -593 -660 -283 509 -107 -440 -537 -698 -53 -547 -903 -786 -807 -111 -974 -45 -904
5506i04J492j463J413j548q3J200l28L02q68J424k643M7P09J64O28J293j007l44
$$ -904 588 -875 538 -1010 -1093 107 -221 81 -787 637 -2006 -1959 -1250 -1086 -458 835 -172 -516
5524e16O83n5N0m41J51J561j525m01J269o17o18q0P12o16J233p73N42r2n07M85
$$ -516 167 112 162 -279 -128 1433 -92 -493 776 159 -459 -539 173 -443 790 17 559 467 -40 445
5544D45o49q88J445j002J420j011K13p23J528q17j4m88O52k99N87L27j606J015
$$ 445 -204 -1092 353 -649 771 -240 -27 -750 778 -39 -53 -541 111 -188 399 726 -880 135
5562A35j016J53j87lJ250k17j364R13M95n32N30n21N30k86q69J060o34k97J274
$$ 135 -881 -728 -915 -918 332 115 -1249 -336 159 -373 157 -364 166 -120 -989 71 -563 -860 414
5581D14n05j75k27N23n41o3N45m25M58l5J047j410J008m16j46l02N46k74p35M28
$$ 414 -91 -266 -493 30 -511 -574 -29 -454 4 -31 1016 -394 614 198 52 -250 296 22 -713 -285
5601b85P47m28N08p95P57o86K28l59J44R4k67l3j97N86K0n23J52l87J051m71M55
$$ -285 462 34 542 -253 504 -182 46 -313 -169 -75 -342 -375 -572 14 34 -489 -337 -724 327 -144 311
5622C11r8j36J53P23r3n62o31K45k48M04J11k56L11k80j85L40o65l88L05J9P63
$$ 311 213 77 230 953 860 298 -333 -88 -336 68 179 -77 234 -46 -231 109 -556 -944 -639 -620 143
5643A43p21J145q37R06p68q33M95P18l71m33l3J119O50j38j066l79J153m32k8
$$ 143 -578 567 -270 636 -132 -965 -470 248 -123 -556 -589 530 1180 1042 -24 -403 750 318 290
5662B90K53n86j60m22R93k52r50N20l3j47L2R82m34K68o26Q23p23J644j665q6
$$ 290 543 -43 -203 -625 368 116 -834 -314 -347 -494 -462 520 86 354 -272 551 -172 1472 -193 -279
5682b79Q86R5r22q22M51n10J127j152K437k169J305K00l88r48M37k51J11L15n37
$$ -279 607 702 -220 -1042 -591 -1101 26 -1126 1311 -858 447 647 259 -689 -252 -503 -392 -77 -614
5701f14M05n24R75r88K40J317j184j85o97K384j866J950r07p71P32k52j2J294
$$ -614 -209 -733 242 -746 -506 811 -373 -558 -1255 1129 -737 1213 306 -465 267 15 3 1297
5719A297q31r20J75J141j295Q66o45O39k10O91m02n67J18p0m38M52R85j254l48
$$ 1297 466 -454 -279 862 -433 433 -212 427 217 908 506 -61 57 -13 -451 1 986 -268 -616
5738f16J95O64o04O33J298j076j716K154o90l84R93n0o12l34K41M3k36k29J800
$$ -616 -421 243 -361 272 1570 494 -1222 932 242 -142 851 801 189 -145 96 139 -97 -326 1474
5757A474j221K03j05n14j20J160n89m04L64k20o32J221l42j247M70J62L73J71
$$ 1474 253 456 351 -163 -283 877 288 -116 248 28 -604 617 275 -972 -502 -340 33 204
5775B04Q91l69j105R06j136O17j175R74q10J109n30Q86j099M42K8l63Q91r41M76
$$ 204 1095 726 -379 527 -609 8 -1167 -193 -1003 106 -424 462 -637 -195 -167 -530 361 -580 -104
5794a04Q00n38j054K40J256k66r0m23J97m8J62q05N00K06j50O33j40K3l20m0N60
$$ -104 696 158 -896 -656 600 334 244 -179 18 -30 132 -673 -173 33 -117 516 376 399 79 39 599
5815E99j102M93J94k88N86j08j022J546n34j346J212o29P2K65N32n82j72Q05p70
$$ 599 -503 -10 184 -104 482 374 -648 898 364 -982 230 -399 -327 -62 470 -112 -284 521 -249
5834b49L80N20l07j028J68M41KM93l55O54l06p18P54m68K40n79P77r19K33L38
$$ -249 131 651 344 -684 -516 -75 -73 420 65 719 413 -305 449 -19 221 -358 419 -500 -267 71
5854G1K3n58L95j94Q75r45M6k27J17N38j35m52K37l04J037n72k68M71K6l47M8
$$ 71 94 -464 -69 -263 612 -333 -287 -514 -397 141 6 -446 -209 -513 524 -48 -316 155 181 -166 -118
5875a18j15J66K82l91O9m23j18N99l03J21J27N42m03j41p5o7j69M50K96K5o37
$$ -118 -233 -67 215 -176 -107 -530 -648 -49 -352 -231 -104 438 35 -106 -181 -248 -417 33 329 354 -283
5896b83J211j402P52JJ67m77N1L9jJ99J87J23n79O61J70n83n22p0J396q23j98
$$ -283 928 -474 278 279 446 -31 20 59 58 257 444 567 -12 649 819 236 -286 -356 1040 217 19
5917A9nR04p78p32M34R0N32j523K96J448j662k3J186m64q2J007k118mO45k60J436
$$ 19 14 918 140 -592 -158 -68 464 -1059 -763 685 -977 -1000 186 -278 -360 647 -1471 -1475 -830 -1090 346
5938C46r49M13M30o13k5o06J25J69J093j3o91O83n81M83L14r56O80o11m0N81l45
$$ 346 -603 -190 240 -373 -398 -1004 -879 -710 383 370 -321 362 -219 264 578 -378 302 -309 -349 232 -113
5959a13M93p40P62L47r5m66K98k21J70m39k73j52M52P6j92l25J9Q91k37J20K27
$$ -113 380 -360 402 749 654 188 486 265 435 -4 -277 -429 23 99 -93 -418 -399 492 255 375 602
5980F02o92N39k99L68k10k94O22j138L50M20J41n57oj7J36KN85n44j6P35j458
$$ 602 -90 449 150 518 308 14 636 -502 -152 268 409 -148 -154 -171 -35 -33 552 8 -8 727 -731
6001g31P22n28O62J34m85K3O57q55M53J65r81J074m49o5m14Q0J03M22M67q75M38
$$ -731 -9 -537 125 259 -226 -203 454 -401 52 217 -764 310 -139 -204 -618 -538 -435 -13 454 -421 17
6022A7M28J43j173J149K55K4j178M36J52K61p61J2O19j63M23k55k08q57P53P16
$$ 17 445 588 -585 564 819 843 -335 101 253 514 -247 -235 384 221 644 389 181 -676 77 793
6042G93n13K2J49j007K45J105n25N1l23L50o60Q00j583P70K63J89k75N52j25k27
$$ 793 280 302 451 -556 -311 794 269 320 -3 347 -313 487 -1096 -326 -63 126 -149 403 278 51
6062E1N10j017K17n38J229p59M16l26M93j53k70j5L91m82J70q29K25N79k9K38
$$ 51 561 -456 -239 -777 452 -307 109 -217 276 123 -147 -162 229 -253 -83 -912 -687 -108 -137 101
6082A01J23L91p54L42M98n92k0m12K91N63o31k58R5M20l20O8n8j12j78j58L26
$$ 101 224 615 -139 203 701 109 89 -323 -32 531 -100 -358 -263 157 -163 -95 -153 -265 -443 -601 -275
6103b75K75L32R6n87j79L14l42Q71m05L4L71q30J51N0M2m64M41j86J288n24o91
$$ -275 0 332 428 -159 -338 -24 -366 505 100 134 505 -325 -174 -124 -82 -546 -105 -291 997 473 -218
6124b18Q89k98K54q17J7J035j514J399o06j53k91J194M60j294O7j614J469m65
$$ -218 671 373 627 -190 -173 862 -652 747 141 -12 -303 891 1351 57 124 -1490 -21 -486
6142d86J49N37M50j112J31N97k78L4k49N2lj19M57m56N00q24K82J2J86J36J37
$$ -486 -337 200 650 -462 -331 266 -12 22 -227 -175 -178 -297 160 -296 204 -620 -338 -326 -140 -4 133
6163A33l31o15P63kL82o40K64K26J33j37J68r70J15L8O78K83j162J248o09jQ67
$$ 133 -198 -813 -50 -52 330 -310 -46 180 313 176 344 -626 -511 -473 205 488 -674 574 -35 -36 831
6184H31j191L6K60J23K67p3P3p11P0M85k92J75P5K00l52J7P10n0j65j02J31j003
$$ 831 -360 -324 -64 59 326 253 326 -385 -315 170 -122 53 128 328 -24 -7 703 653 488 386 517 -486
6206d86L69M70l99J79l33K4k0K00o54N37M24p83N66j90J97l51N65j44j9j55N04
$$ -486 -117 353 -46 133 -200 -176 -196 4 -650 -113 311 -472 94 -96 101 -250 315 171 152 -3 501
6227E01N5m95o06O63L71j270J75Q06J37m80l74N70n10Q34k67j08K0Q14j335R76
$$ 501 556 61 -545 118 489 -781 -606 200 337 -143 -517 53 -457 377 110 2 22 836 -499 477
6247D77l28p75Q27o21n5J32J32m93O90J14n58N78q1M89q50K05j29p30Q99k39M96
$$ 477 149 -626 201 -420 -475 -343 -211 -704 -14 100 -458 120 39 528 -322 -117 -246 -976 -77 -316 180
6268A80l48l54Q32j33k48J84Q1l20m89O48J61m1l59J43M14j84j5J4o90P77m26
$$ 180 -168 -522 310 177 -71 113 194 -126 -615 33 194 153 -206 -63 351 167 152 166 -524 253 -173
6289a73M65R7k06m33R5R5o4L89J72m62K21k28l42K80k42P90l92K45J49m90N5J8
$$ -173 292 389 183 -250 -155 -60 -124 265 437 -25 196 -32 -374 -94 -336 454 62 307 456 -34 21 39
6311C9J36L27o86N66k29l07j98P43m89L76j066N82N2l01r0J193n89j45M08j078
$$ 39 175 502 -184 382 153 -154 -352 391 -98 278 -788 -206 -154 -455 -545 648 59 -86 322 -756
6331g56K001j126J28J52j017Q59m54p8K90K67J29J10O35j404j27p34M87O35J196
$$ -756 1245 119 247 399 -618 241 -213 -291 -1 266 395 505 1140 -264 -391 -1125 -638 -3 1193
6350A193j229M2L01o71N55J41p47R6N99O70j152L93J117q64j22Q89p96n26M10
$$ 1193 -36 6 307 -364 191 332 -415 -319 280 950 -202 191 1308 444 322 1211 415 -111 299
6369B99J32j273L1P55L08p37J081j134j095K488o24j503K337j194L98K62r24J51
$$ 299 431 -842 -811 -56 252 -485 596 -538 -1633 855 231 -1272 1065 -129 269 531 -393 -242
6387b42K64n77M54R2n04O22J87l97K51J69l9K66m96m3N77q70M90o9o2L89n77J29
$$ -242 22 -555 -101 -9 -513 109 296 -101 150 319 280 546 50 7 584 -286 204 135 73 462 -115 14
6409A4M9L32j338N72N60k48L7J52N11l92L39j21l01k35N90r01L43K31j203J460
$$ 14 63 395 -943 -371 189 -59 -22 130 641 249 588 467 166 -69 521 -380 -37 194 -1009 451
6429D51o27K84P46n33qj12m63p1j31J239M2l16r32K15L72m18P93l56k43J57O2
$$ 451 -176 108 854 321 313 201 -262 -333 -464 775 817 501 -431 -216 156 -262 531 175 -68 89 151
6450A51l78P2M75p01k90M18j5N10n48K24r1j38k3Q72n10l51J70J41L46m32k45
$$ 151 -227 -155 320 -381 -671 -253 -268 242 -306 -82 -173 -311 -334 538 28 -323 -153 -12 334 -98 -343
6471c43J62K93J41m17j5k42p4j02P93j12J95q6j040P30Q1o97M00M74K54p18K5
$$ -343 -181 112 253 -164 -179 -421 -495 -597 196 84 279 193 -847 -117 -36 -733 -333 141 395 -323 -298
6492b98n3L99L40N94j142J64N08R3r36O46m99L23j16P6l10N30N31j243L24l12
$$ -298 -351 48 388 982 -160 4 512 605 -331 315 -184 139 23 99 -211 319 850 -393 -69 -381
6512c81L08N76m43J12l08O67mj28n41K98m7N29l68j380Q62q26J026P00j426O09
$$ -381 -73 503 60 172 -136 531 527 399 -142 156 109 638 270 -1110 -248 -1074 -48 652 -774 -165
6532a65j37k5o5M24j79nJ094j153J36N12K66r15l11m26K015k484J332P01o01K13
$$ -165 -302 -327 -392 32 -147 -152 942 -211 -75 437 703 -212 -523 -949 1066 -1418 -86 615 14 227
6552B27r61Q12K28j42j446J546l6m6L37M10j490P39k38m8L82O7j87l02o9M35l4
$$ 227 -734 78 306 164 -1282 264 228 182 519 929 -561 178 -60 -108 274 341 154 -148 -217 218 184
6573A84o11J232j171J79K05n4k55L01M52O5n82k56N21n13L63MJ3m54Q0N01N55
$$ 184 -427 805 -366 -187 18 -36 -291 10 462 527 -55 -311 210 -303 60 64 77 -377 -297 204 759
6594G59l47l87K35K05m55K6L88m35j87j08J35K71K10m14p3J053p47k63r6L15j17
$$ 759 412 25 260 465 10 36 424 -11 -198 -306 -171 100 310 -104 -177 876 129 -134 -230 85 -32
6615c2L6m12k19j16P40j64j62J14N0l18L98m8k62M43o78J27M43n5K29o7l17M14
$$ -32 4 -408 -627 -743 -3 -167 -329 -215 -165 -483 -85 -133 -395 48 -630 -503 -60 -115 114 47 -270 144
6637A44K23n09j10M13k13L69k99N80Km81o9J53K34l38J20r1l40K71l14N58k67
$$ 144 367 -142 -252 161 -52 317 18 598 600 119 50 203 437 99 219 128 -212 59 -255 303 36
6658C6n22L05r8R0m84M15R25o20k2K22o38K95Q34l72l93j52P87o90l14Q12K42
$$ 36 -486 -181 -279 -189 -673 -258 667 47 25 247 -391 -96 738 366 -27 -179 608 -82 -396 416 658
6679F58k98k87k92J99m3j66j04L7J36Q65j068l27J549j068p3Pj4N38J05j62R7
$$ 658 360 73 -219 -20 -63 -229 -333 -296 -160 705 -363 -690 859 -209 -282 -275 -289 249 354 192 289
6700B89n16Q82r65L05k09k4J2L85j24j34l0K96K93j78N53j63q07K05L48L32l01
$$ 289 -227 655 -310 -5 -214 -238 -226 159 35 -99 -129 167 460 282 835 672 -135 70 418 750 449
6721D49J17o48J28J000o19j097O19J67m9o61P51J50J29j30l95N24K88r72j7K95
$$ 449 566 -82 46 1046 427 -670 -51 116 67 -594 157 307 436 306 -89 435 723 -249 -266 29
6741B9k5N10p41J00n42J5O34l53o29J191o02O53k41n9k15R99qn08K49j128J058
$$ 29 4 514 -227 -127 -669 -654 -20 -373 -1002 189 -413 240 -1 -60 -275 724 716 208 457 -671 387
6762C87n87O12m5p55J09j08R48q62O23j061O12O22o78R7M46o88M05J045j137O19
$$ 387 -200 412 367 -388 -279 -387 561 -301 322 -739 -127 495 -183 -86 360 -328 77 1122 -15 604
6782F04m73J60j709J769j031K52M47R79j869O85J523j206N93j172L5P85K49j074
$$ 604 131 291 -1418 351 -680 -428 19 998 -871 -186 1337 131 724 -448 -413 372 621 -453
6800d53J424j034n29O77r88K435j460n09J337j132L28O12j104m61P45N41J28j055
$$ -453 971 -63 -592 85 -903 1532 72 -437 900 -232 96 708 -396 -857 -112 429 557 -498
6818d98J070n49J95j3M96K94Qj437R41q23P3k18J059p74M22o33N87n74j04M77
$$ -498 572 23 218 205 701 995 1003 -434 507 -316 -243 -461 598 -176 246 -387 200 -374 -478 -1
6838aQ82j355J84l27j06J169l92q5J79m24k86J054p39K79M4j36J63L47K70o79
$$ -1 881 -474 -290 -617 -723 446 54 -31 148 -276 -562 492 -247 32 76 -60 103 450 720 41
6858D1N98l37n66r0P57J17j136J078j643J295j104J129J0l43PN69l86Q83j338
$$ 41 639 302 -264 -354 403 520 -616 462 -1181 114 -990 139 149 -194 -187 382 -4 879 -459
6877d59Q85j106o34J966r07N57L66j13n50o02R7J010o26p81J104q10K193j572
$$ -459 426 -680 -1314 652 -255 302 668 555 5 -597 -500 510 -116 -897 207 -603 1590 18
6895A8N05m43O67m69l20M16m11o20L38R64j672k6R22k87o22J438m66k30K74J08
$$ 18 523 80 747 278 -42 374 -37 -657 -319 645 -1027 -1053 -131 -418 -1040 398 -68 -298 -24 84
6915H4m73N07N90O45r83j028L01k11J662j344R8Q99r18Q32n66q4M23j011N2M25
$$ 84 -389 118 708 1353 370 -658 -357 -568 1094 -250 -152 747 -171 661 95 11 434 -577 -525 -100
6935a00k34J355m08m05L05k45j513N57Q76p17M42J28J054l40l83n62n77L38L57
$$ -100 -334 1021 613 208 513 268 -1245 -688 188 -529 -87 41 1095 755 372 -190 -767 -429 -72
6954g2l27m61J283k44K27n02J300q15n83P5o97J548j219N55k18j92K91K82j267
$$ -72 -399 -860 423 179 406 -96 1204 389 -194 -119 -816 732 -487 68 -150 -342 -51 231 -1036
6973a036P33K36M48j99J03J54K29o06j61J42O6k14l99R6J15K87l12M74q33K78
$$ -1036 -303 -67 381 182 285 439 668 62 -99 43 109 -105 -504 -408 -293 -6 -318 156 -677 -399
6993c99R39l35R7m15j296J706o27O35l00l54O71j483J532p30O29R20j193L90j020
$$ -399 540 205 302 -113 -1409 297 -330 305 5 -349 322 -1161 371 -359 270 1190 -3 387 -633
7012f33J342j86j21j20p36J217r82J07L52N82j010L12k86J98N30q52N44Qm39o04
$$ -633 709 523 402 282 -454 763 -219 -112 240 822 -188 124 -162 36 566 -286 258 266 -173 -777
7032g77J544j259K82j61K65N26m25J73j24Q7K86k21M36q08K14K5j54M17j60M65
$$ -777 767 -492 -210 -371 -106 420 -5 168 44 131 417 196 632 -176 38 63 -91 326 166 631
7052F31k43n51o7J34O50n24r7J66q8K43J45l25m6l44N12o39j7p1p58Q90K18j28
$$ 631 388 -163 -230 -96 554 30 -67 99 11 254 399 74 28 -316 196 -443 -460 -531 -1289 -399 -181 -309
7074c09M71o09k25J399q4l02p62J747j489N10q13m33J319P9pp06o94J255mk47
$$ -309 162 -447 -672 727 643 341 -421 1326 -163 347 -466 -899 420 499 492 -214 -908 347 343 96
7094I6O01p70M07o19L15J002j198J76m30R46m01L14L3r02M23P29p57J254j688
$$ 96 697 -73 334 -285 30 1032 -166 10 -420 526 125 439 472 -430 -7 722 -35 1219 -469
7113d69M25k06J050j661J100L3m60L06K09k40J16m9l71n62Q98l13N70q8m74K28
$$ -469 -44 -250 800 -861 239 272 -188 118 327 87 203 154 -217 -779 119 -194 376 288 -186 42
7133D2q21K60R25J3p07J670j441L92n92J075j073L93m56j07J249q79Q95q04m05
$$ 42 -779 -519 406 419 -288 1382 -59 333 -259 816 -257 136 -320 -427 822 -57 838 34 -371
7152c71Q48o62q33O95n15N39M15l68N93j05l40Q77j233K2R5R92k17j33l88r0M59
$$ -371 477 -185 -1018 -323 -838 -299 116 -252 341 236 -104 773 -460 -438 -343 649 432 299 -89 -179 280
7173B80l2L21m99kr0n50R68m40L5J4p7K37r12J127j085J363j61L78o23j5L65n04
$$ 280 248 569 70 68 -22 -572 396 -44 -9 5 -72 165 -747 380 -705 658 497 875 252 237 602 98
7195I8L08p91P92r01M39M94n69R12j436P80p30O58L33j984J437L90r36K27NR03
$$ 98 406 -385 407 -494 -55 439 -130 782 -654 126 -604 54 387 -1597 -160 230 -706 -479 -474 429
7215D29l70o10k71O76k33j72R39j037J352j466Q43M50n94l38Q0M98j38J41k80
$$ 429 59 -551 -822 -146 -379 -551 388 -649 703 -763 80 530 -64 -402 -322 176 38 179 -101
7234a01j332Q00O46N17rJ59m66l34Q37r79o82L69m08J748q84L33M16n23k48K06
$$ -101 -1433 -633 13 530 521 680 214 -120 717 -262 -944 -575 -983 765 -119 214 630 107 -141 65
7254F5k57K97L2k42J24L32q88O15O51k60m26k33J21P40j123R12Q07m23j072m37
$$ 65 -192 105 137 -105 19 351 -537 78 729 469 43 -190 -69 671 -452 460 1267 844 -228 -665
7274f65m39J196kj43M53K48n20L12l45L37k74l63l93N44K30m10Q88o11n0n88R32
$$ -665 -1104 92 90 -53 400 648 128 440 95 432 158 -205 -598 -54 176 -234 654 43 -7 -595 337
7295C37m81M58M16j581P87k03K97J375r00m86j62P71o15l79J31M15l82J8L09o54
$$ 337 -144 314 730 -851 -64 -267 30 1405 505 19 -143 628 13 -366 -235 180 -202 -184 125 -529
7315e29R79p8m75m89P13n59L99M07k45k69k34M82p3L17l04q2NJ75J96o88K7M84
$$ -529 450 372 -103 -592 121 -438 -39 368 123 -146 -380 102 29 346 42 -40 -35 140 336 -352 -325 159
7337A59J30j76j78K21j28N49q72J76j026J233J91Po87O80l05k28N16n04J50M21
$$ 159 289 113 -65 156 28 577 -295 -119 -1145 88 279 286 -401 279 -26 -254 262 -242 -92 329
7357C29k54N11k62L8l53Q4J6k53L31k89L50j058J667j309j0J092r59Q09o75m00
$$ 329 75 586 324 362 9 93 109 -144 187 -102 248 -810 857 -452 -462 630 -329 480 -195 -595
7377e95J63J217p77J48j358Q75J160Kj869K650j566n90J70j43J45L68K55m37Q9
$$ -595 -432 785 8 156 -1202 -327 833 835 -1034 1616 50 -540 -370 -513 -368 0 255 -182 -93
7396i3r10Q04P42J97k33m95K28R52j107J25O56m59r34L38l11J150R9R6j437R15
$$ -93 -1003 -199 543 740 507 12 240 1192 85 210 866 407 -527 -189 -500 650 749 845 -592 323
7416C23j067N47M46J3j38k30L0k50J004n24L1l85P5K19L5j09n3j64l55j16K78
$$ 323 -744 -197 249 262 124 -106 -76 -326 678 154 185 -200 -125 94 129 20 -33 -197 -552 -668 -390
7437c90J07P70p62P69j514J427o60n02P59L3j64n0P59j043M27n12k22N85L88l27
$$ -390 -283 487 -275 494 -1020 407 -253 -755 4 37 -127 -177 582 -461 -34 -546 -768 -183 205 -122
7457a22K71l51J12j37j82N40p4n1j3j38K2N30O5l1l61m17J20N8KJ79m4K11l35
$$ -122 149 -202 -90 -227 -409 131 57 6 -7 -145 -123 407 472 441 80 -337 -217 -159 -157 22 -22 189 -146
7480a46Q96l08l54L19q1K50m09K32j65k94j86M12J94m59L71n35J402j467O8L47
$$ -146 750 442 88 407 326 576 167 399 234 -60 -246 166 360 -99 272 -263 1139 -328 -260 87
7500H7m47J073j311J178n25q10J023N06j326J297j215l00N31p64L53J286p7j15
$$ 87 -360 713 -598 580 55 -755 268 774 -552 745 -470 -770 -239 -1003 -650 636 559 444
7518D44k21M24k33J8j567P60j99j56R31j39n74N3N29M77j254J257j40j085O02
$$ 444 223 647 414 432 -1135 -375 -574 -730 201 62 -512 -459 70 547 -707 550 410 -675 -73
7537g3R24k00l86N2o9o38K17O64n02K1jk71Q7P17m18n03J206n13n43R1L81J05
$$ -73 851 651 265 317 248 -390 -173 491 -11 10 9 -262 -175 542 124 -379 827 314 -229 -138 243 348
7559C48n75K60J7K37J15p68M16p43J454r39J28k67Q65o71K16l56M10l34L29O8
$$ 348 -227 33 50 287 402 -366 50 -693 761 -178 -50 -317 548 -123 93 -263 147 -187 142 210
7579B10p6M06r24M46j86Q83r45N50k3m56n16n6N79J60Q7p52J94N69j85K65Q9k37
$$ 210 134 540 -384 62 -124 759 -186 364 341 -115 -631 -687 -108 52 139 -613 -419 150 -35 230 319 82
7601H2L5Q6o61R2O83K87l87m26P87j012j90O29q27Q67M13m14k62N83L73j116M33
$$ 82 117 203 -458 -366 317 604 217 -209 578 -434 -624 5 -822 45 458 44 -218 365 738 -378 55
7622E5J4l03k91O33K26l79J78j97J2K64l22L5j20R4J05M76L75k80k64l41L52l16
$$ 55 69 -234 -525 108 334 -45 133 -64 -52 212 -110 -75 -195 -101 4 480 855 575 311 -30 322 6
7644FJ13o82Q20l65R93p51K13L3o17K21K61n57R10p79l7N04k78j51L47m7N5l6
$$ 6 119 -563 257 -108 885 134 347 380 -237 -16 245 -312 598 -181 -218 286 8 -143 204 157 212 176
7666A76j10K4P8j96m85O8j7mK27jR2K22o76N13J19L16oj51o98L50N49l86j01p48
$$ 176 66 90 168 -28 -513 -445 -462 -466 -239 -240 -148 74 -602 -89 30 346 340 189 -509 -159 390 4 -97 -845
7690h45N00M74n29N19r2j58L55r1n54k0M31L4K10o34L35m8N58m87j96M79o50%
$$ -845 -345 129 -400 119 27 -131 224 133 -421 -441 -10 24 234 -400 -65 -113 445 -42 -238 241 -409 -409
7712d09R31j335M27O21q36P83m70K31M5J6k9J72k87P50n90K44k38O48j174J549
$$ -409 522 -813 -386 235 -601 182 -288 -57 -12 4 -25 147 -140 610 20 264 26 674 -500 1049
7732A049k74p89j24L04k07L9K90K6O27l06j221j98n4J190j014R66K08j121Q23
$$ 1049 775 -14 -138 166 -41 -2 288 314 941 635 -586 -784 -838 352 -662 304 512 -609 214
7751B14R70o50o33n36J077k102K054l35p09J308k13j054J56K69L53q42J332m05
$$ 214 1184 534 -99 -635 442 -1660 394 59 -650 658 445 -609 -453 -184 169 -673 659 254
7769B54O3J16m73l10l92J465j027n25O39O69k13L98J62p27N16p92K60J57Ko83
$$ 254 317 433 -40 -350 -742 723 -304 -829 -190 479 266 664 826 99 615 -177 83 240 242 -441
7789d41P32J58m16k94N0J49R6R3J93m49o4J29P9J08M45o12r36m3J248k6m94M69
$$ -441 291 449 33 -261 -211 -62 34 127 320 -129 -193 -64 15 123 568 -44 -980 -1023 225 199 -295 174
7811A74j372J160m55J65R02j378Q38Q0j663J444Q09m75M13j127L05l90j59K84
$$ 174 -1198 -38 -493 -328 574 -804 34 114 -1549 -105 704 229 642 -485 -180 -570 -729 -445
7829d45O39q79P89j364J305q5m55J28M35j76J094j204n88P97M10No31j90P98J96
$$ -445 194 -685 104 -1260 45 -40 -495 -367 68 -108 986 -218 -806 -9 401 406 -225 -415 383 579
7849E79k87K21l81o12R4k6J39R89j189N72J23o2j15l79P72r7m01o39R35o96j45
$$ 579 292 513 132 -480 -386 -412 -273 716 -473 99 222 160 45 -334 438 341 -60 -699 236 -460 -605
7870f05J56N16P0m26Q23j078P79r04P19l81l76J140k15p1q82J66L16K99K33p94
$$ -605 -449 67 137 -289 534 -544 235 -669 50 -331 -707 433 218 147 -735 -569 -253 46 279 -515
7890e15Q57N79j550J086l28O98q01K21P44j697J357p97O96k70o61M47q02O97K
$$ -515 342 921 -629 457 129 827 26 247 991 -706 651 -146 550 280 -381 66 -736 -39 -37
7909c7J93n06P63n87O73p82J73K82r11J316m93m69J55J038p09j54m39M15M32k88
$$ -37 156 -350 413 -174 499 -283 -110 172 -739 577 84 -385 -230 808 99 -55 -494 -79 353 65
7929F5j23k13J16M77j017M67M6O34q2K18j30k24l2NM07j368j48J555k40m95P22
$$ 65 -58 -271 -155 322 -695 -228 -182 452 370 588 458 234 202 207 614 -754 -902 653 413 -82 640
7950F40L22r15l27j28Q09r56M82l76P09J88j020J145j591J418o84P4o54K94j37
$$ 640 962 47 -280 -408 401 -555 -73 -449 260 448 -572 573 -1018 400 -284 -210 -864 -570 -707
7969g07L02m36O54%J348j756J040l80k00L43k84M90j38J25j67O2P16j987J335
$$ -707 -405 -841 -187 -187 1161 -595 445 65 -135 208 -76 414 276 401 234 296 1012 -975 360
7988C60L7l97J642j545j066J670K76l73r95M94k41N14l26J67J58j57j28J60L82
$$ 360 397 0 1642 97 -969 701 977 604 -391 103 -138 376 50 217 375 218 90 250 632
8007F32j166N57J09m24O93q67J987j775l77O42J579j334j259J778k73J24L09j51
$$ 632 -534 23 132 -292 401 -466 1521 -254 -631 11 1590 256 -1003 775 502 626 935 784
8025G84j067N06j68m71J920j369N1m16m6R30j250J655j290j31O98k26k53K8J26
$$ 784 -283 223 55 -416 1504 135 186 -230 -276 654 -596 1059 -231 -362 336 110 -143 -115 11
8044A1R95o96o72m5Q28j65j387O3J211m76N18L75o29k59J093j822P69n09Q55N87
$$ 11 1006 310 -362 -407 421 256 -1131 -1068 143 -333 185 560 -69 -328 765 -1057 -288 -797 58 645
8064F45j388K88L75q48J68M97N88j31M67j03o48j72j9M65m23P9M13m93O22R0m49
$$ 645 -743 -455 -80 -928 -760 -263 325 194 661 558 -90 -262 -281 184 -239 -160 253 -240 382 472 23
8085B3p8K61P2J45j30l64k13K89K87j44k63l25L23L69n76J21J5K39l48o0O94k23
$$ 23 -55 206 278 423 293 -71 -284 5 292 148 -115 -440 -117 252 -324 -203 -188 51 -297 -357 337 114
8107A14n39N80q19P34j63p6N63j85n46P0R31q95k04M97o11Q98j601J448j6n39
$$ 114 -425 155 -664 70 -93 -169 394 209 -337 -267 664 -231 -435 62 -549 349 -1252 196 180 -359
8127c59l03R35j99K98j190O84M23J89j09k30k88R7j72j24J361k610J165J110o34
$$ -359 -662 273 74 372 -818 -134 289 478 369 139 -149 -52 -224 -348 1013 -1597 -432 678 44
8146D4r31J142o75Q51o9J3k08m10R87r31O8J92Q05q03P3p33P08m64j71Q86n72
$$ 44 -887 255 -420 431 362 375 167 -243 744 -187 -119 73 878 75 148 -585 123 -341 -512 374 -198
8167a98L58L8L88m99K57j84k9L12k75m98M73k01j10k35J66L20L15l5o45L18n71
$$ -198 160 198 586 87 344 160 131 443 168 -330 143 -58 -168 -403 -237 83 398 363 -282 36 -535
8188e35M53J11L14
$$ -535 -82 29 343
8191C43
$$ Imaginary data points
##PAGE= N=2
##DATA TABLE= (X++(I..I)), XYDATA
0@%%%%%%%%%%%%%%%%%%%%%%lL0o6P8p9Q0q0Q3j05J39j56J62j83K17k43K70l04
$$ 0 0 0 0 0 0 0 0 0 0 0 0 0 0 0 0 0 0 0 0 0 0 0 -3 27 -39 39 -40 40 -40 43 -62 77 -79 83 -100 117 -126 144 -160
39a60L39l79M21m67N18n74O36p03P77q57R45j038J142j260J389j534J692j870
$$ -160 179 -200 221 -246 272 -302 334 -369 408 -449 496 -542 600 -660 729 -805 887 -983
57i83K079k313K579k897L283l757M350n128O194p762J0388j6021P0076p1850K5413
$$ -983 1096 -1217 1362 -1535 1748 -2009 2341 -2787 3407 -4355 6033 -9988 60088 -11762 13651
72A3651J5148m4318M1781k1079q170J6187o458j4586K1681k3626J6030j1746R98
$$ 13651 28799 -15519 26262 5183 -2987 13200 6742 -7844 13837 -9789 6241 -5505 -4507
85d507O320j4867J4164j1203O03L982j865o436O552p25j1437K0028k0995J1127
$$ -4507 1813 -13054 1110 -10093 -9490 -5508 -7373 -13809 -7257 -7982 -19419 609 -20386 -9259
99i259M014j3407J1642j520o758P169L116j3466K2525j7984P020Q877j8840K3172
$$ -9259 -5245 -18652 -7010 -8530 -15288 -8119 -5003 -18469 4056 -13928 -6908 1969 -16871 6301
113F301j5998O024N680o456L962L581o545N895N500j3356J9954j5363N342P279
$$ 6301 -9697 -3673 2007 -4449 -487 3094 -3451 2444 7944 -5412 14542 -821 4521 11800
127A1800j1040J1286n457J686j53M649r815Q634k542l646J0166j3032R134n299
$$ 11800 760 12046 6589 8275 8122 12771 2956 11590 9048 5402 15568 2536 11670 6371
141F371R55J723j760j989K003q15p143J2358j5166J0623l571p824J2060j1908
$$ 6371 7326 9049 7289 5300 7303 6488 -655 11703 -3463 7160 3589 -4235 7825 -4083
155d083M568j112k848n76L903q543N620m67q774J4788j5714Q803j043n078O462
$$ -4083 485 -627 -3475 -4051 -148 -8691 -3071 -3538 -12312 2476 -13238 -4435 -5478 -10556 -4094
170d094n086J635l29K750p444J1043r474M246K606q314J0587p445M380M4J195
$$ -4094 -9180 -7545 -7874 -5124 -12568 -1525 -10999 -6753 -4147 -12461 -1874 -9319 -4939 -4895 -3700
185c700l532O492k194k204R316j2215J2247n724J13N931o490O881k749K11m31
$$ -3700 -7232 -740 -2934 -5138 4178 -8037 4210 -1514 -1401 4530 -1960 4921 2172 2383 1952
200A952O128q201R145l743k789Q836j0506Q854m510J008K150j716K15P35Q73o065
$$ 1952 8080 -121 9024 5281 2492 11328 822 9676 5166 6174 8324 6608 6823 7558 8431 2366
216B366R546j0554O601k115m079O274p180M190k704J590l407L625n530J652J932
$$ 2366 11912 1358 7959 5844 1765 8039 859 5049 2345 3935 528 4153 -1377 275 2207
231B207p841R929r839M617p53k319J636j030q35r08J875o371Q029n841R69L020
$$ 2207 -5634 4295 -5544 -927 -1680 -3999 -2363 -3393 -4228 -5136 -3261 -9632 -1603 -7444 -6475 -3455
247c455o913Q075n899K202N24J349k536K056k310p16O852p665Q710n129Q38L198
$$ -3455 -10368 -2293 -8192 -5990 -5466 -4117 -6653 -4597 -6907 -7623 -771 -8436 274 -4855 -4017 -819
263h19l606K908l1J788k934N710o725P456j678k500O593p013O943l517J429J463
$$ -819 -4425 -1517 -1548 240 -2694 3016 -3709 3747 2069 -431 6162 -851 6092 2575 4004 5467
279E467j41j125J146J484n501Q843p607M914o62l826O085n878L482k256J691l762
$$ 5467 5326 4201 5347 6831 1330 10173 2566 7480 6818 2992 9077 3199 6681 4425 6116 2354
295B354M073m304J251K983p527Q687q387L508k20k373P68j047l33j842L878p507
$$ 2354 6427 2123 3374 6357 -1170 7517 -870 2638 2418 45 813 -234 -567 -2409 1469 -6038
311f038P184n985O80L068n890O408n568J786p85M35j814J369j18k673O262p428
$$ -6038 1146 -4839 -4159 -1091 -6981 -573 -6141 -4355 -5140 -4705 -6519 -5150 -5268 -7941 -1679 -9107
327i107O847m063J075K292l099K976j764K466l314N471m841M506n17k672O014
$$ -9107 -2260 -6323 -5248 -2956 -6055 -3079 -4843 -2377 -5691 -220 -5061 -555 -1072 -3744 2270
342B270o057N571k387J261R98M34j101J147K562n110P108n621M522l74l093N029
$$ 2270 -3787 1784 -603 658 1656 2090 989 2136 4698 -412 6696 1075 5597 5223 2130 7159
358G159m036K675j805K385k655L183k819J62L216o671O862o004L373j160k107
$$ 7159 3123 5798 3993 6378 3723 6906 4087 4249 7465 794 7656 1652 5025 3865 1758
373A758J577r40M18k533L598n285M175l335k48K630m936L491k601Q08j114R09
$$ 1758 3335 2395 2813 280 3878 -1407 2768 -567 -815 1815 -3121 370 -2231 -1423 -2537 -1628
389a628l087K058n36l000N006o877O037l270J46K195l319K277j179J621l656M157
$$ -1628 -4715 -2657 -3193 -6193 -1187 -8064 -2027 -5297 -5151 -2956 -6275 -3998 -5177 -3556 -7212 -3055
405c055l705L839j01k493M993m579M451j412M68r24K042l81N26J580l513O823
$$ -3055 -6760 -2921 -3022 -5515 -522 -5101 -650 -2062 -1594 -2518 -476 -857 -331 1249 -2264 4559
421D559n023K953K59k481L100k215K870j516J574l460N496l447J519J773m651
$$ 4559 -464 2489 2748 267 3367 1152 4022 2506 4080 620 6116 2669 4188 5961 1310
436A310N616m923K140K011k794J032p36m91j510L990n405N149m096O04L35k871
$$ 1310 6926 2003 4143 6154 3360 4392 3656 3165 1655 5645 240 5389 1293 1897 2232 -639
452f39L316l647K657j752P57l492J890N44l033M732n536L050j478q27J452j950
$$ -639 2677 -970 1687 -65 692 -2800 -910 -366 -3399 1333 -4203 -1153 -2631 -3458 -2006 -3956
468c956K33j270K702l205L371m069K102N87k239M495m480L152j019k88n39J866
$$ -3956 -3723 -4993 -2291 -5496 -2125 -6194 -4092 -3505 -5744 -1249 -5729 -2577 -3596 -3884 -4423 -2557
484b557j250Q43K309n227P007m351L332p27k083K953r48J403j230L123k888L366
$$ -2557 -3807 -2964 -655 -5882 1125 -3226 106 -621 -2704 249 -699 704 -526 2597 -291 3075
500C075k101J011K551m356O422m345L44Q06p8n90J270n53j140L371l298L021k589
$$ 3075 974 1985 4536 180 6602 2257 2601 3407 3329 2739 4009 3456 2316 5687 2389 5410 2821
517B821p0K248l429L009l348J765j363J450k188J822j817j962M389n035K686j711
$$ 2821 2751 4999 1570 4579 1231 2996 1633 3083 895 2717 900 -1062 3327 -1708 978 -733
533g33j47J483k528Q86r17n4j857L268l148J233J1j909K556m056L618k541J130
$$ -733 -880 603 -1925 -1039 -1956 -2010 -3867 -599 -3747 -2514 -2503 -4412 -1856 -5912 -2294 -4835 -3705
550c705p23J005m2r42L319k931L316k988J382J82j848L141k023R42r76K521j569
$$ -3705 -4428 -3423 -3465 -4407 -1088 -4019 -703 -3691 -2309 -2127 -3975 -834 -2857 -1915 -2891 -370 -1939
567a939L363l052N49L102m560N386k483J582P08p22j81L16N69j500K704k028L336
$$ -1939 1424 -1628 -1079 2023 -2537 2849 366 1948 2656 1934 1753 2069 2638 1138 3842 1814 5150
584E150k071J03K052m032L613k669J528r39Q51j598L52J208k223L053m386L521
$$ 5150 3079 3182 5234 1202 4815 2146 3674 2735 3586 1988 2340 3548 1325 4378 -8 3513
600C513k560K70Q41k337K90j31J800l277L552l617Q91J51k730L382l187K776k499
$$ 3513 953 1223 2064 -273 17 -114 1686 -1591 1961 -1656 -765 -614 -3344 38 -3149 -373 -2872
617b872L42j29M23j009k87J810l577M731m310K153j78j145K362k132J969p72J334
$$ -2872 -2530 -2659 -2236 -3245 -3532 -1722 -5299 -568 -4878 -2725 -2903 -4048 -1686 -3818 -1849 -2621 -1287
634a287k513L271k154KL064l310K979j437J552r93J323m28k42J965j905L619l540
$$ -1287 -3800 -529 -2683 -2681 383 -2927 52 -1385 167 -826 497 69 -173 1792 -113 3506 -34
651c4L506j803J50J284j215J232j090J477j960L128k406J734k89j792L030m214
$$ -34 3472 1669 1819 3103 1888 3120 2030 3507 1547 4675 2269 4003 3714 1922 4952 738
667G38L522j709n02O91j210J179j238J255k624K254k567J331p43j022J923l343
$$ 738 4260 2551 2049 2740 1530 2709 1471 2726 102 2356 -211 1120 377 -645 1278 -2065
683b065K861k657K123k187N64r4j231K023l007L895m390J830k09q83J247l87J95
$$ -2065 796 -1861 262 -1925 -1361 -1455 -2686 -663 -3670 225 -4165 -2335 -2544 -3427 -2180 -2567 -2372
700b372j281K001k329K378j958R4K128l124L709j644J489m07l67N17K0P92j263
$$ -2372 -3653 -1652 -3981 -1603 -3561 -3467 -1339 -4463 -754 -2398 -909 -1316 -1683 -1166 -1146 -354 -1617
717a617K754l082L912j695N9J285j692K048j424K059j282J811j748J051Q31k091
$$ -1617 1137 -1945 1967 272 331 1616 -76 1972 548 2607 1325 3136 1388 2439 3270 1179
733A179L111l050K213q75J28l7j04L96j229K202k831L169l299J294K46k077K490
$$ 1179 4290 1240 3453 2578 2706 2669 2565 2961 1732 3934 1103 4272 973 2267 2513 436 2926
750B926k900J242o66J286k540J277p83m92J586k637L003l751J155M40j199L54
$$ 2926 26 1268 602 1888 -652 625 -158 -650 936 -1701 1302 -2449 -1294 -854 -2053 -1699
766a699r26J867l008K231j695J562j267N7J647k823K721j450P17r45P28k53M96
$$ -1699 -2625 -758 -3766 -1535 -3230 -1668 -2935 -2878 -1231 -4054 -1333 -2783 -2066 -3011 -2283 -2536 -2040
783b040K66j234K973l342L018j143JJ672j785J721j099K007j552K023j569N40
$$ -2040 -1774 -3008 -35 -3377 -359 -1502 -1501 171 -1614 107 -992 1015 -537 1486 -83 457
799D57J906k556K564j647J898j393N65L63K89L10q93J693k526K483k259J647l63
$$ 457 2363 -193 2371 724 2622 1229 1794 2157 2446 2756 1863 3556 1030 3513 1254 2901 2538
816B538j583K124j784J540j908J571j395J478q58o73R56k688K636k629J378p02
$$ 2538 955 3079 1295 2835 927 2498 1103 2581 1723 1050 2006 -682 1954 -675 703 1
832Ao96M21q50J386j406J013k528J447o28o41J495k047J876j847J106r07O68p10
$$ 1 -695 -274 -1124 262 -1144 -131 -2659 -1212 -1840 -2481 -986 -3033 -1157 -3004 -1898 -2805 -2137 -2847
850b847L16Q70j376K262k184J753r13M29M95q33J336j518K167j749J733o50j08
$$ -2847 -2531 -1661 -3037 -775 -2959 -1206 -2119 -1690 -1195 -2028 -692 -2210 -43 -1792 -59 -709 -817
867h17J084j391K622k744K079j203O56M28OR90j441K383k091K283j734J101Rj210
$$ -817 267 -1124 1498 -1246 833 -370 286 714 720 1710 269 2652 561 2844 1110 2211 2220 1010
885A010J925j676J589j395J403j356O73n79k41J622k334K088j823P64k69l58J90
$$ 1010 2935 1259 2848 1453 2856 1500 2173 1594 1353 2975 641 2729 906 1670 1401 1043 1233
902A233o82J118k210J950k197J088m83k57J184k538J768k068J628j684N54j75
$$ 1233 551 1669 -541 1409 -788 300 -183 -440 744 -1794 -26 -2094 -466 -2150 -1596 -1771
918a771l28J124j914J842j667J794j381K14N38j012R56j004J516k025J979j660
$$ -1771 -2099 -975 -2889 -1047 -2714 -920 -2301 -2087 -1549 -2561 -1605 -2609 -1093 -3118 -1139 -2799
934b799R45J413j456J341j658J689p33R74M40L42j57j108J943j592K370j974J804
$$ -2799 -1854 -441 -1897 -556 -2214 -525 -1258 -284 156 498 341 -767 1176 -416 1954 -20 1784
951A784j064k95J547r06M72p85J534j083P02N81j651K038k553L127k154J07P97
$$ 1784 720 425 1972 1066 1538 753 2287 1204 1906 2487 836 2874 321 3448 1294 1401 2198
968B198l41O88j341Q65j219K088l046J582j600L32R35j708K089k129J190o43N2
$$ 2198 1857 2545 1204 2069 850 2938 -108 1474 -126 206 1141 -567 1522 -607 583 -60 -8
985hn28p08R70j097J472k265K254k173P82q3j282J952j430Q58j162J007q10R38
$$ -8 -536 -1244 -274 -1371 101 -2164 90 -2083 -1301 -1384 -2666 -714 -2144 -1286 -2448 -1441 -2251 -1313
1003a313j36m69R94j449J530j369O28K5K45R90j537K018j718K367j270J052k0
$$ -1313 -1449 -1918 -924 -2373 -843 -2212 -1584 -1559 -1314 -324 -1861 157 -1561 806 -464 588 568
1020E68j609K566j952J452q50Q19j013J212K12j216K443j970J454j024M25J303
$$ 568 -1041 1525 -427 1025 175 994 -19 1193 1405 189 2632 662 2116 1092 1517 2820
1036B820j502j76L37N39J7M51j887J580n28o86N35m69J335j075O70j443P41j133
$$ 2820 1318 1142 1479 2018 2035 2486 599 2179 1651 965 1500 1031 2366 1291 1961 518 1259 126
1054A26J292l57j451K141k639J216q33L85m16j997K309j320J628j675N94r12O10
$$ 126 1418 1061 -390 1751 -888 328 -505 -120 -536 -2533 -224 -1544 84 -1591 -997 -1909 -1299
1071a299l44j047J755j369M73M61k84JP7N59p38P81r27J418q76J9P05q82K288
$$ -1299 -1643 -2690 -935 -2304 -1831 -1370 -1654 -1653 -1576 -1017 -1755 -974 -1901 -483 -1359 -1340 -635 -1517 771
1090G71k336J048o37J416j227J239J62p80N83j578K799r12M05r54N12M98l19J599
$$ 771 -1565 -517 -1154 262 -965 274 436 -344 239 -1339 1460 548 953 -1 511 1009 690 2289
1108B289j685R69o28J679j906O83K53j029J688j466P58j093Q00k06O77o8j395
$$ 2289 604 1573 945 2624 718 1401 1654 625 2313 847 1605 512 1312 1106 1783 1715 320
1125C20J104k304L131k445R28M85j092Q84j915K044k287P87j036Q18L12j803J218
$$ 320 1424 -880 2251 -194 734 1219 127 1011 -904 1140 -1147 -360 -1396 -578 -266 -2069 -851
1142h51j463K105j184M27j17o80K83m30J564j896K105j923O79O94j527J177K33
$$ -851 -2314 -209 -1393 -966 -1083 -1763 -1480 -1910 -346 -2242 -137 -2060 -1381 -687 -2214 -1037 -804
1159h04Q40j070N88r54J756k91j256R23n86J407j218P78N4l85R75q43J242n21
$$ -804 36 -1034 -446 -1400 356 65 -1191 -268 -854 553 -665 113 167 -218 757 -86 1156 635
1177F35J060j238J188m80r73J528j483J861k493K346k101J180J54r4O22m30K9
$$ 635 1695 457 1645 1165 192 1720 237 2098 -395 1951 -150 1030 1184 1090 1712 1282 1311
1194A311p96P41J16j482J076o44R34j643J465j144J101j258L20J038k312J645
$$ 1311 515 1256 1372 -110 966 322 1256 -387 1078 -66 1035 -223 97 1135 -1177 468
1210D68j869J250n40j01M12J56j29j902J927j692Q15r41J358K48j031L56l13M48
$$ 468 -1401 -151 -691 -792 -380 -224 -353 -2255 -328 -2020 -1205 -2146 -788 -540 -1571 -1215 -1528 -1080
1228a080p80P60j237J599m47j219L199k490K111j714N91M35J92o14P0N15j06J591
$$ -1080 -1860 -1100 -2337 -738 -1185 -2404 795 -1695 416 -1298 -707 -272 -80 -694 -624 -109 -215 1376
1246A376j944K147j741j85J633j230J077j571Q05K79O11k94k01J625j479J235
$$ 1376 -568 1579 -162 -347 1286 56 1133 -438 367 646 1257 963 762 2387 908 2143
1262B143k021J299l58O45j6j348J875j206N92k102J398q75O55K45j473J488q38
$$ 2143 122 1421 1063 1708 1692 344 2219 1013 1605 -497 901 26 681 926 -547 941 103
1279A03M4J31J58n44J98o72p61J879j132M31j301L62M23l29P66q85R53j417J657
$$ 103 147 278 436 -108 90 -582 -1343 536 -596 -165 -1466 -1104 -681 -1010 -244 -1129 -176 -1593 64
1298F4j011M38L50j440J192r59J095k312J595o38J70K08J23R42j641L053k446
$$ 64 -947 -509 -159 -1599 -407 -1366 -271 -2583 -988 -1626 -1456 -1248 -1125 -183 -1824 1229 -1217
1315a217M95L06N3L1r76M75N86O30j706K111j139Q30P77m93J83l66P29l42M1J91
$$ -1217 -722 -416 -363 -332 -1308 -833 -247 383 -1323 788 -351 479 1256 763 946 580 1309 967 1008 1199
1335A199M74l64o49J098n40p07M01O51j64j029J582n42j001j271J718n87M26l76
$$ 1199 1673 1309 660 1758 1218 511 912 1563 1399 370 1952 1410 409 -862 856 269 695 319
1353C19J52j57l07Q88j553N24P69j337J166j823P99n58Q84q24J6R55j011n01j78
$$ 319 471 314 7 895 -658 -134 635 -702 464 -1359 -560 -1118 -234 -1058 -1042 -87 -1098 -1599 -1777
1372a777J110p04N49k66l39L32j073J776j366P39K92n6q33P98L95J7J14r24J695
$$ -1777 -667 -1371 -822 -1088 -1427 -1095 -2168 -392 -1758 -1019 -727 -783 -1616 -818 -423 -406 -292 -1216 479
1391D79j534O66N2R1N62l88o7r2P83n72q0J006m41L27m49J644j636Q88r46Q50
$$ 479 -1055 -389 -337 -246 316 -72 -139 -231 552 -20 -100 906 465 792 343 1987 351 1239 293 1143
1411A143P99j560R34j99P76j141O14n20Pj85k03N80q15Q63o15J21K99j194J016
$$ 1143 1942 382 1316 1117 1893 752 1366 846 853 668 465 1045 230 1093 478 599 898 -296 720
1430G20o50P41j326Q21o12J28J9m06N79j187O68j27J25l63J7K1L8K23j125J438
$$ 720 70 811 -515 306 -306 -178 -159 -565 14 -1173 -505 -632 -507 -870 -853 -832 -794 -571 -1696 -258
1450b58o52P66l19j76j85K28J57q72M97k34O29k61p83J149q82J378p97n0K01J90
$$ -258 -910 -144 -463 -639 -824 -596 -439 -1311 -814 -1048 -419 -680 -1463 -314 -1196 182 -615 -665 -464 -274
1470b74K71j63J240j723R67n95J000k92K78k80n40J416l86M82o61L95k84l7L55
$$ -274 -3 -166 1074 -649 318 -277 723 431 709 429 -111 1305 919 1401 740 1135 851 814 1169
1489A169n80Q50j212J798j740N84l25l69J158p45M11o15O16o33K33o01n54N74
$$ 1169 589 1439 227 2025 285 869 544 175 1333 588 999 384 1000 367 600 -1 -555 19
1507A9m89K61l7N95p04M1K38j50N08q97L81l92k48K23n08Q54r41j03J92R72j362
$$ 19 -470 -209 -246 349 -355 -314 -76 -226 282 -615 -234 -626 -874 -651 -1159 -305 -1246 -1349 -1157 -185 -1547
1528a547O05K57o36J031j071J469r07Q5j47r5M02K07L77p09J172k97j97k00O60
$$ -1547 -942 -685 -1321 -290 -1361 108 -799 -714 -861 -956 -554 -347 30 -679 493 196 -1 -201 459
1547D59j44l5J74J27J023k069J478p77Q46O5j728K023j572J494n68O64n90q86
$$ 459 315 280 454 581 1604 -465 1013 236 1082 1147 -581 1442 -130 1364 796 1460 870 -16
1565a6J540l51J79m83J04k60M19o50j12O68K4M33j027m5n92P5O63r9m59l47P41
$$ -16 1524 1173 1352 869 973 713 1132 482 370 1038 1062 1495 468 423 -169 -94 569 470 11 -336 405
1586D05j053O45o03n76J849j042n42j00R61j114N06L28q84M73L19M31j072n31
$$ 405 -648 -3 -606 -1182 667 -375 -917 -1017 -56 -1170 -664 -336 -1220 -747 -428 3 -1069 -1600
1604a600J314m80O38n46J71m33R39o28J96m83K07J24J41P50m24L0p9N03q6p41
$$ -1600 -286 -766 -128 -674 -503 -936 3 -625 -429 -912 -705 -581 -440 310 -114 -84 -163 340 254 -487
1624d87M81K9M80k52L82R7o37L23K89K88l87J27l86M57k10P4N90o27O45l43M26
$$ -487 -6 23 503 251 633 730 93 416 705 993 606 733 347 804 594 668 1258 631 1276 933 1359
1645A359p10k48K60Q2l77L3K21j200J496o98n72L40L26N79J96j458M99n16K61
$$ 1359 649 401 661 743 366 399 620 -580 916 218 -354 -14 312 891 1087 -371 128 -388 -127
1664a27M3m29N39q9j185J441j224J643o65j157J172o5m91n1k04j213J784kl88
$$ -127 -84 -513 26 -63 -1248 193 -1031 612 -53 -1210 -38 -103 -594 -645 -849 -2062 -278 -280 -668
1683f68j91O06J58l68K82n79mM54j33P41j001J102l56m2N01p06M1L81M09n89N83
$$ -668 -859 -253 -95 -463 -181 -760 -764 -310 -443 298 -703 399 43 1 502 -204 -163 218 627 38 621
1704F21q08J262p73M35m95M14L40q88J440j173R05o30N65o25j72J54J1N54o02
$$ 621 -187 1075 302 737 242 656 996 108 1548 375 1280 650 1215 590 418 572 583 1137 535
1723E35m19J433j239M76m30K29m42qo19K23O59q16N3p33Q50o78P84Q89p98k1n18
$$ 535 116 1549 310 786 356 585 143 135 -484 -261 398 -418 -365 -1098 -248 -926 -142 747 -51 -72 -590
1744e90J61l91N47j308J135r99Q56k85r18K156j237M51j49o82j032K009N0n67
$$ -590 -429 -820 -273 -1581 -446 -1445 -589 -874 -1792 364 -873 -422 -571 -1253 -2285 -276 -226 -793
1762g93n18J818m0q68N87n20o8R97j194J024j006R20j34k31N83R8p80j93P16r20
$$ -793 -1311 507 467 -401 186 -334 -402 595 -599 425 -581 339 205 -26 557 655 -125 -318 398 -522
1782e22K28O81l0P71j004J299j056l09P4j60J439p63L79j616J340J34o83M10j25
$$ -522 -294 387 357 1128 124 1423 367 58 132 -28 1411 648 1027 -589 751 885 202 612 487
1801D87o57R96n89K60O90r02l52k4M83n82o1M28J38M5p24O1K52p05N52m23J769
$$ 487 -170 826 237 497 1187 285 -67 -91 392 -190 -251 177 315 360 -364 -303 -51 -756 -204 -627 1142
1822A142k392J371j058N83o05P55K61j045J268j391j35J078O00n7p67K28p99J210
$$ 1142 -1250 121 -937 -354 -959 -204 57 -988 280 -1111 -1246 -168 432 375 -392 -164 -963 247
1840B47j089K51j702K025m32J033l30M84p4j560Q26O0M74N30k41Q19j200O78j193
$$ 247 -842 -591 -2293 -268 -700 333 3 487 413 -1147 -321 -261 213 743 502 1321 121 799 -394
1859c94J255j3r61j09J100M4p82K70J26J133j932K081j280J32l83Q9n57L97N54
$$ -394 861 848 -113 -222 878 922 140 410 536 1669 -263 1818 538 670 287 376 -181 216 770
1878G70j44r1l70j335J110K7P46r11m28q54O58J212N57j492j45P69L9j091N33
$$ 770 626 535 165 -1170 -60 -33 713 -198 -626 -1480 -822 390 947 -545 -690 79 118 -973 -440
1897d40q97Q81l18N22r47k73J263J234k134J786R7k589J144k99J140R64j546Q94
$$ -440 -1337 -456 -774 -252 -1199 -1472 -209 1025 -1109 677 774 -1815 -671 -970 170 1134 -412 482
1915D82j084J59lo94Q47N45r13l90O04k37J97j80L41q66O87Q54k94J381k753K303
$$ 482 -602 -443 -446 -1140 -293 252 -661 -1051 -447 -684 -487 -667 -326 -1192 -505 349 55 1436 -1317 986
1935I86k98L58O84j354j056o2Q75r83J239J523k530J431L24k029L94N94l55n25
$$ 986 688 1046 1730 376 -680 -742 133 -850 389 1912 -618 813 1137 -892 -498 96 -259 -784
1953g84n49N54J981j636Q46j04m41o76J274k57O65j189r48L36k98J053L47r67
$$ -784 -1333 -779 1202 -434 412 308 -133 -809 465 208 873 -316 -1264 -928 -1226 -173 174 -793
1971g93J220j363K7N29j204J373r8N42O6r34R49O3o83J417q66q43K64j50M73o16
$$ -793 427 -936 -909 -380 -1584 -211 -309 233 299 -635 314 377 -306 1111 245 -598 -334 -484 -11 -627
1991f27M95p36J294l37l72Rj258J209N65NO36O34j762J759n52j736K067q06m95
$$ -627 -132 -868 426 89 -283 -274 -1532 -323 242 247 883 1517 -245 1514 962 -774 1293 487 -8
2010hl51j08J056l97N52L47p71k14R85j107l33K27k03O36j031K203j08j25j607
$$ -8 -359 -467 589 192 744 1091 320 106 1091 -16 -349 -122 -325 311 -720 1483 1375 1250 -357
2029c57Q21q8K30n71q13J301j95k09n43m5K80j17K27m02P62p65R94q21n69P90
$$ -357 464 376 606 35 -778 523 328 119 -424 -469 -189 -306 -79 -481 281 -484 510 -311 -880 -90
2049i0p6o29J26k34l00O20N01l6k4p06j88J020r49j76J049R4N68o45l87J065j574
$$ -90 -166 -795 -669 -903 -1203 -583 -82 -118 -142 -848 -1036 -16 -965 -1141 -92 2 570 -75 -462 603 -971
2070i71P45R13o23m30R85k93j5k28k05n97J032K71j22P21l08p06J56m39Q10k93
$$ -971 -226 687 64 -366 619 326 311 83 -122 -719 313 584 462 1183 875 169 325 -114 696 403
2090D03o56K68M11P21j011L87K61K14q23k69M82n1K176l071Q94r9J59J04m25r68
$$ 403 -253 15 426 1147 136 523 784 998 175 -94 388 337 2513 -558 336 237 396 500 75 -893
2110h93J234rq47O11j537J69P65m36k57R34J029q14r72P08l25O8Q67k41r11K32
$$ -893 341 332 -515 96 -1441 -1272 -507 -943 -1200 -266 763 -51 -1023 -315 -640 -572 295 54 -857 -625
2130f25P71j502J616m39L65j33l6o17N77J124j722R39p82K23o48J050q49O36P49
$$ -625 146 -1356 260 -179 186 53 17 -600 -23 1101 -621 318 -464 -241 -889 161 -688 -52 697
2149F97q43j07j404Q90J996j258N91O36q20M3k93R07m77q80J939j932R62j319
$$ 697 -146 -253 -1657 -767 1229 -29 562 1198 378 421 128 1035 558 -322 1617 -315 647 -672
2167f72O96K2o58j68N84P19n99J188J09q92m41k61K22N90P30j102n22J007j442
$$ -672 24 46 -612 -780 -196 523 -76 1112 1221 329 -112 -373 -151 439 1169 67 -455 552 -890
2186h90R44j467J225O7O76j455M2J350k93N92j105P43j060j92K86P03l36l29N76
$$ -890 54 -1413 -188 -121 555 -900 -858 492 199 791 -314 429 -631 -823 -537 166 -170 -499 77
2205G7l05j19J64n19qN48K38j96M46k85n83L73m72N31o44P49K80m74M93j030O82
$$ 77 -228 -347 -183 -702 -710 -162 76 -120 326 41 -542 -169 -641 -110 -754 -5 275 -199 294 -736 -54
2226e4N96k19r16J113o8k34J92L58l25J22j39q94O97q5M76p33J230r12K63l27
$$ -54 542 323 -593 520 452 218 410 768 443 565 426 -468 229 144 620 -113 1117 205 468 141
2246A41M05k45n22P44q66O22m66K28L85q59P21m48J70o16K85K15m9N67m72J82
$$ 141 546 301 -221 523 -343 279 -187 41 426 -433 288 -160 10 -606 -321 -106 -155 412 -60 122
2266A22n57Q89l12m54J97n87O75k00N54p85Q2j06L07m02J66J99k4jJ22j54J91
$$ 122 -435 454 142 -312 -115 -702 -27 -227 327 -458 -376 -482 -175 -577 -411 -212 -236 -237 -115 -269 -78
2287g8r20R38N1o90O98K58l24M06j8q49J136n33j95M13J80l31m18L83k17O5R38
$$ -78 -998 -60 -9 -699 -1 257 -67 339 321 -528 608 75 -120 293 473 142 -276 107 -110 -45 893
2308H93r97R16p81P48L1q88K24N69m13L02n16M24m16K66J011j276L74l43P19o13
$$ 893 -104 812 31 779 810 -78 146 715 302 604 88 512 96 362 1373 97 471 128 847 234
2328B34l97N28p08O20N3m47J03L48O8p93j82R56k58p43Q52j047J37R84r60J271
$$ 234 -163 365 -343 277 330 -117 -14 334 402 -391 -573 383 125 -618 234 -813 -676 308 -652 619
2348F19j275P91j90q28J285n31m62J74J002j557N12L66m52J99o51P77n41J296
$$ 619 -656 135 -55 -883 402 -129 -591 -417 585 -972 -460 -94 -546 -347 -998 -221 -762 534
2366E34j125Q90k58m12k93J501k20p7m51j353J522J30M56p54o90Q30o10l62J475
$$ 534 -591 299 41 -371 -664 837 617 540 89 -1264 258 388 844 90 -600 230 -380 -742 733
2385G33j251L12J830j556O1l0j231J616p73K90L95l54N8J071j743M12J028r81
$$ 733 -518 -206 1624 68 129 99 -1132 484 -289 1 396 42 100 1171 -572 -160 868 -113
2403a13j380K682j898r69J387j050Q28P89J274p00J51j618J429q44M22r16N85
$$ -113 -1493 1189 -709 -1678 -291 -1341 -513 276 1550 850 1001 -617 812 -32 390 -526 59
2420E9j90j369J422J04k1p8q83K24N73P83L75j794Q13p10P43k82J80p26J108J20
$$ 59 -131 -1500 -78 26 5 -73 -956 -732 -159 624 999 -795 18 -692 51 -231 -51 -777 331 451
2440D51o76m11m03J067k43O33m43R8r89Q67K71l4J55q09o34Q88J099j451J630
$$ 451 -225 -636 -1039 28 -215 418 -25 73 -916 -49 222 188 343 -466 -1100 -212 887 -564 1066
2459A066m90N97j506l27J201l00j018J423n69j75J202k248J393j119M37P15Q23
$$ 1066 576 1173 -333 -660 541 241 -777 646 77 -98 1104 -1144 249 -870 -433 282 1105
2476A105q89J07L23o37L40p23R33o06K00l1n77J109r06J8L94k97J4M07K03l57
$$ 1105 216 323 646 9 349 -374 559 -47 153 122 -455 654 -252 -234 160 -137 -123 284 487 130
2496A30J74j41o40L69O9j37J01M42p75K32n24M05M81m25N95l51P68j802Q34o22
$$ 130 304 163 -477 -108 -39 -176 -75 367 -408 -176 -700 -295 186 -239 356 5 773 -1029 -195 -817
2516h17K57J336N0j125M16K91j721K349o59o51M98N35q34O00M18p40L53J55l24
$$ -817 -560 776 826 -299 117 408 -1313 1036 377 -274 224 759 -75 525 943 203 556 711 387
2535C87l27j113J554p53m0L45J34Q4j86o6p39Q35k66j37Q82m90N01r67M13k61
$$ 387 60 -1053 501 -252 -292 53 187 271 85 19 -720 115 -151 -288 594 104 605 -362 51 -210
2555b10K63k01K38l46k69K44J318j216N64q61L42l22m69P50k64J095q81l27M60
$$ -210 53 -148 90 -256 -525 -281 1037 -179 385 -476 -134 -456 -925 -175 -439 656 -225 -552 -92
2574i2o86n3O30Q92j693M20L4L95m96M83k61m76R78P35j710m5N77k10J062m46
$$ -92 -778 -831 -201 691 -1002 -582 -548 -153 -649 -166 -427 -903 75 810 -900 -945 -368 -578 484 38
2594C8J83n90J78m63J198l81l39L18k94O2R95j66j87J4l77j25o06R61j016J269
$$ 38 221 -369 -191 -654 544 163 -176 142 -152 -90 905 739 552 566 189 64 -542 419 -597 672
2614F72n59L67j83j92O1j75o36J107n84L32j72Q77m88r4p01R44l1j145J108k04
$$ 672 113 480 297 105 166 -9 -645 462 -122 210 38 915 427 333 -368 576 545 -600 508 304
2634C04j73l55K01k37K15L44K10n85K18k46q16J166m70j94k61Q75k39o0O55r09
$$ 304 131 -224 -23 -260 -45 299 509 -76 142 -104 -920 246 -224 -418 -679 196 -43 -103 552 -357
$$ [...]
8191D12
##END NTUPLES=NMR FID
##END=
