##TITLE=1H_PhBDP4
 CDCl3,8 sc, 
 8.02.2021
##JCAMPDX= 6.0         $$ Bruker NMR JCAMP-DX V2.0
##DATA TYPE= NMR FID
##DATA CLASS= NTUPLES
##ORIGIN= UXNMR, Bruker Analytische Messtechnik GmbH
##OWNER= root
$$ XWIN-NMR		Version 3.5
$$ Mon Feb  8 13:53:44 2021 Russian Standard Time (UT+4h)  she@DPX200
##.OBSERVE FREQUENCY= 200.1315066352
##.OBSERVE NUCLEUS= ^1H
##.DELAY= (6, 6)
##.ACQUISITION MODE= SIMULTANEOUS
##.ACQUISITION SCHEME= undefined
##.AVERAGES= 8
##.DIGITISER RES= 18
##SPECTROMETER/DATA SYSTEM= spect
##.PULSE SEQUENCE= zg30
##.SOLVENT NAME= CDCl3
##.SHIFT REFERENCE= (INTERNAL, CDCl3, 0, 15.7039)
##AUDIT TRAIL= $$ (NUMBER, WHEN, WHO, WHERE, WHAT)
$$ ##TITLE= Audit trail, XWIN-NMR		Version 3.5
$$ ##JCAMPDX= 5.01
$$ ##ORIGIN= Bruker BioSpin GmbH
$$ ##OWNER= she
$$ F:/spectra/data/she/nmr/H-F/1/audita.txt
$$ ##AUDIT TRAIL=  $$ (NUMBER, WHEN, WHO, WHERE, WHAT)
(   1,<2021-02-08 13:52:43.35 +0400>,<she>,<DPX200>,
      <created by zg, POWCHK disabled, PULCHK disabled
       configuration hash MD5:
       00 E9 B6 7A A2 85 ED C7 34 08 36 98 17 FE 4E 26
       data hash MD5: 16K
       32 2A 1F 68 9F E5 84 00 DE D7 80 B6 02 E5 BA 01>)
$$ ##END=
$$ 
$$ hash MD5
$$ D6 FA 97 3C 78 83 1A 78 86 3E E4 A4 18 11 CC 4E
##$RELAX= 
##$RELAX= 
##$RELAX= 
##$RELAX= 
##$RELAX= 
##$RELAX= 
$$ Bruker specific parameters
$$ --------------------------
##$DU= <F:/spectra>
##$EXPNO= 1
##$NAME= <H-F>
##$PROCNO= 1
##$TYPE= <nmr>
##$USER= <she>
##$AMP= (0..31)
100 100 100 100 100 100 100 100 100 100 100 100 100 100 100 100 100 100 
100 100 100 100 100 100 100 100 100 100 100 100 100 100 
##$AQSEQ= 0
##$AQ_mod= 1
##$AUNM= <au_zg>
##$AUTOPOS= <>
##$BF1= 200.13
##$BF2= 200.13
##$BF3= 200.13
##$BF4= 200.13
##$BF5= 200.13
##$BF6= 200.13
##$BF7= 200.13
##$BF8= 200.13
##$BYTORDA= 1
##$CFDGTYP= 0
##$CFRGTYP= 5
##$CHEMSTR= <none>
##$CNST= (0..31)
1 1 145 1 1 1 1 1 1 1 1 1 1 1 1 1 1 1 1 1 1 1 1 1 1 1 1 1 1 1 1 1 
##$CPDPRG= <>
##$CPDPRG1= <>
##$CPDPRG2= <>
##$CPDPRG3= <>
##$CPDPRG4= <mlev>
##$CPDPRG5= <mlev>
##$CPDPRG6= <mlev>
##$CPDPRG7= <mlev>
##$CPDPRG8= <mlev>
##$CPDPRGB= <>
##$CPDPRGT= <>
##$D= (0..31)
0 1.2 0 0 0 0 0 0 0 0.06 0 0.03 0 0 0 0 0.0002 0 0 0 0 0 0 0 0 0 0 0 0 
0 0 0 
##$DATE= 1612777962
##$DBL= (0..7)
120 120 120 120 120 120 120 120 
##$DBP= (0..7)
150 150 150 150 150 150 150 150 
##$DBP07= 0
##$DBPNAM0= <>
##$DBPNAM1= <>
##$DBPNAM2= <>
##$DBPNAM3= <>
##$DBPNAM4= <>
##$DBPNAM5= <>
##$DBPNAM6= <>
##$DBPNAM7= <>
##$DBPOAL= (0..7)
0.5 0.5 0.5 0.5 0.5 0.5 0.5 0.5 
##$DBPOFFS= (0..7)
0 0 0 0 0 0 0 0 
##$DE= 6
##$DECBNUC= <off>
##$DECIM= 32
##$DECNUC= <off>
##$DECSTAT= 4
##$DIGMOD= 1
##$DIGTYP= 9
##$DL= (0..7)
0 120 120 120 120 120 120 120 
##$DP= (0..7)
150 150 150 150 150 150 150 150 
##$DP07= 0
##$DPNAME0= <>
##$DPNAME1= <>
##$DPNAME2= <>
##$DPNAME3= <>
##$DPNAME4= <>
##$DPNAME5= <>
##$DPNAME6= <>
##$DPNAME7= <>
##$DPOAL= (0..7)
0.5 0.5 0.5 0.5 0.5 0.5 0.5 0.5 
##$DPOFFS= (0..7)
0 0 0 0 0 0 0 0 
##$DQDMODE= 0
##$DR= 18
##$DS= 0
##$DSLIST= <SSSSSSSSSSSSSSS>
$$ [...]
##$SUBNAM2= <"">
##$SUBNAM3= <"">
##$SUBNAM4= <"">
##$SUBNAM5= <"">
##$SUBNAM6= <"">
##$SUBNAM7= <"">
##$SUBNAM8= <"">
##$SUBNAM9= <"">
##$SW= 16.9725356469052
##$SWIBOX= (0..15)
0 0 2 0 0 0 0 0 0 0 0 0 0 0 0 0 
##$SW_h= 3396.73913043478
##$TD= 16384
##$TD0= 1
##$TE= 0
##$TE2= 300
##$TE3= 300
##$TEG= 300
##$TL= (0..7)
0 120 120 120 120 120 120 120 
##$TP= (0..7)
150 150 150 150 150 150 150 150 
##$TP07= 0
##$TPNAME0= <>
##$TPNAME1= <>
##$TPNAME2= <>
##$TPNAME3= <>
##$TPNAME4= <>
##$TPNAME5= <>
##$TPNAME6= <>
##$TPNAME7= <>
##$TPOAL= (0..7)
0.5 0.5 0.5 0.5 0.5 0.5 0.5 0.5 
##$TPOFFS= (0..7)
0 0 0 0 0 0 0 0 
##$TUNHIN= 0
##$TUNHOUT= 0
##$TUNXOUT= 0
##$USERA1= <user>
##$USERA2= <user>
##$USERA3= <user>
##$USERA4= <user>
##$USERA5= <user>
##$V9= 5
##$VALIST= <valist>
##$VCLIST= <CCCCCCCCCCCCCCC>
##$VD= 0
##$VDLIST= <DDDDDDDDDDDDDDD>
##$VPLIST= <PPPPPPPPPPPPPPP>
##$VTLIST= <TTTTTTTTTTTTTTT>
##$WBST= 1024
##$WBSW= 4
##$XGAIN= (0..3)
0 0 0 0 
##$XL= 0
##$YL= 0
##$YMAX_a= 550096
##$YMIN_a= -133624
##$ZGOPTNS= <>
##$ZL1= 120
##$ZL2= 120
##$ZL3= 120
##$ZL4= 120
##$ABSF1= 10
##$ABSF2= 0
##$ABSG= 5
##$ABSL= 3
##$ALPHA= 0
##$AQORDER= 0
##$ASSFAC= 0
##$ASSFACI= 0
##$ASSFACX= 0
##$ASSWID= 0
##$AUNMP= <proc_1d>
##$AZFE= 0.1
##$AZFW= 0.1
##$BCFW= 1
##$BC_mod= 2
##$BYTORDP= 1
##$COROFFS= 0
##$CY= 11.3945322036743
##$DATMOD= 1
##$DC= 2
##$DFILT= <>
##$DTYPP= 0
##$F1P= 15.9154993809931
##$F2P= -4.1035820241983
##$FCOR= 0.5
##$FTSIZE= 0
##$FT_mod= 4
##$GAMMA= 1
##$GB= 0.15
##$INTBC= 1
##$INTSCL= 1
##$ISEN= 128
##$LB= 0.24
##$LEV0= 0
##$LPBIN= 0
##$MAXI= 10000
##$MC2= 0
##$MEAN= 0
##$ME_mod= 0
##$MI= 1.114404
##$NCOEF= 0
##$NC_proc= 0
##$NLEV= 6
##$NOISF1= 3.799351
##$NOISF2= 2.8
##$NSP= 1
##$NTH_PI= 0
##$NZP= 0
##$OFFSET= 15.70392
##$PC= 1
##$PHC0= -10764.26
##$PHC1= 24.60094
##$PH_mod= 1
##$PKNL= yes
##$PPARMOD= 0
##$PSCAL= 0
##$PSIGN= 0
##$REVERSE= no
##$SF= 200.130013532006
##$SI= 16384
##$SIGF1= 3
##$SIGF2= 2
##$SINO= 400
##$SIOLD= 16384
##$SREGLST= <1H.CDCl3>
##$SSB= 0
##$STSI= 0
##$STSR= 0
##$SW_p= 3612.71676300578
##$SYMM= 0
##$S_DEV= 0
##$TDeff= 0
##$TDoff= 0
##$TI= <>
##$TILT= no
##$TM1= 0
##$TM2= 0
##$TOPLEV= 0
##$USERP1= <user>
##$USERP2= <user>
##$USERP3= <user>
##$USERP4= <user>
##$USERP5= <user>
##$WDW= 1
##$XDIM= 8192
##$YMAX_p= 0
##$YMIN_p= 0
$$ End of Bruker specific parameters
$$ ---------------------------------
##NTUPLES= NMR FID
##VAR_NAME=  TIME,          FID/REAL,        FID/IMAG
##SYMBOL=    X,             R,               I
##VAR_TYPE=  INDEPENDENT,   DEPENDENT,       DEPENDENT
##VAR_FORM=  AFFN,          ASDF,            ASDF
##VAR_DIM=   8192,          8192,            8192
##UNITS=     SECONDS,       ARBITRARY UNITS, ARBITRARY UNITS
##FACTOR=    0.0002944,     1,               1
##FIRST=     0,             0,               0
##LAST=      2.4114304,     0,               0
##MIN=       0,             -133624,         0
##MAX=       2.4114304,     550096,          0
$$ Real data points
##PAGE= N=1
##DATA TABLE= (X++(R..R)), XYDATA
0@%%%%%%%%nNqJ6j6J6k4L2m0M8n6P2q8J04j25J49j76K08k40K75l17L65m16M73
32B52n37O09o91P79q76R83j100J228j366J517j682J864k065K283k519K778l061
49a604L372l714M090m509M975n495O081o745P509q395R432j0673J2188j4085J6544
64H971j9869K4636l2099M5537p7291K94068L06143j95614J30202m9155o2056L4918
76D08391k2777p7310N4339k2506n5952k6075n652n8552j9728M715l6743k0161
88A21989K0931n1478k5199J2464k9206k8064K1242k1564m561J7001k8435j3265
100h145J2041j7734o3J1091J80J5678l22j1613P266k176J831m066k505L265M753
115I481L688j8465n602R086j3109O403J6052j3989J7011R793k5562J3422M288
$$ y = [0, 0, 0, 0, 0, 0, 0, 0, 0, -5, 0, -8, 8, -8, 8, -16, 16, -24, 24, -32, 40, -48, 56, -69, 80, -96, 112, -128, 147, -170, 195, -221, 252, -285, 324, -367, 412, -464, 519, -581, 647, -719, 798, -884, 980, -1085, 1198, -1321, 1457, -1604, 1768, -1946, 2144, -2365, 2610, -2885, 3196, -3549, 3960, -4435, 4997, -5676, 6512, -7573, 8971, -10898, 13738, -18361, 27176, -50115, 243953, 550096, 354482, 484684, 435529, 373473, 408391, 385614, 308304, 362643, 340137, 284185, 258110, 252458, 193906, 174178, 178893, 142150, 121989, 142920, 91442, 66243, 78707, 49501, 21437, 42679, 21115, 16554, 33555, 5120, -8145, 3896, -13838, -13901, -2810, -2630, 13048, 12726, 1113, 8379, 6203, 8034, 3968, 1463, 4728, 9481, 13169, -5296, -10898, -1812, -14921, -8518, 7534, -6455, 10556, 20349, -5213, 8209, 12497]
128A2497j4808J3408P326n568J5764O371j5073K465L011j3977k933P526r792m5
142F172P929j8823j836J1611j3460m942J3488r014K230J6272j9155R91J4641j5935
156i831L931J2796j4610Q062J3871j5502N851J1915r368l672R721q510r790J4982
170I846j1421j5100J7387q392j6069J9915p954j6851K0628q554j1168K1974k060
183g819j3882J7052N398j3937J2791L666j3247J0706J0786j5658M243J5039j5299
196a61L028J3585j2013L232J6527j3690k845J4194j1168k529M749o842j809M145
210H403j632n887L606J564n515J395O661l766J824M533m985N233J916l312J461
225A1499j16R76r51m006K353l49p889M673k347o281Q206k583q466O481K808q134
$$ y = [12497, -2311, 11097, 18423, 12855, 28619, 34990, 19917, 22382, 25393, 11416, 8483, 16009, 6217, 6172, 14101, -4722, -6558, 5053, -8407, -13349, 139, -8875, -6645, 9627, -9528, -8537, 6104, -9831, -5900, 6896, -7714, 348, 14219, -1283, 4568, 16483, 7115, 3443, 13164, 4654, -5136, 9846, -1575, -16675, 712, -7680, -23749, -3834, -11788, -28639, -8011, -16565, -27733, -5759, -7819, -21701, -4649, 749, -13188, -397, 3269, -9978, 728, 11514, -4144, 99, 15138, -161, 2867, 16452, 4439, 7671, 24198, 10508, 7663, 21857, 10689, 8160, 12909, 6067, 4258, 8403, 6771, 884, 4490, 6054, 539, 1934, 8595, 4829, 6653, 11186, 6201, 11434, 13350, 10038, 11499, 11383, 12359, 11408, 7402, 9755, 9406, 1517, 6190, 3843, -2438, 5768, 3185, -5281, 1200, 4008, -4126]
241d126N598J276o179N227K173p256j35P808q274k464Q284n871j732P523p569
256e717k976J2896q048n020J1311o068l536Q227o466n600Q720n609o391Q782k189
271g684m831N853j189n257J0372j662o655J0485r32n183P752j073n592R661k092
286A973q682R768l44p410N893J311p308Q562J707j0248Q657M596q937L475O536
301I549r843M016N621j1988M990O999j0345J213Q583q087L342P165r686L035O158
316A0722o238k291P082l830k619N303m389j529L933k355n121L621r76j853J774
331A234l506J329K291l558o72L692l882J899J728n788N276R91n664L469K84l800
347d677L752J213o700O286L434o493J122N385m904K64O602q143K567R151r226
$$ y = [-4126, 1472, 2748, -3431, 1796, 3969, -3287, -3422, 4386, -3888, -6352, 1932, -3939, -5671, 1852, -5717, -8693, 4203, -3845, -8865, 2446, -3622, -7158, 1069, -5397, -10997, -2277, -7886, -14277, -5495, -7684, -12515, -6662, -7851, -13108, -2736, -4398, -11053, -568, -1500, -6683, 1069, -4, -5596, 4065, 1973, -6709, 3059, 2715, -4695, 1198, 2509, -4799, 3763, 5470, -4778, 3879, 8475, -462, 3013, 9549, -294, 3722, 9343, -2645, 2345, 9344, -1001, 212, 8795, 708, 4050, 11215, 1529, 4564, 10722, 4484, 2193, 9275, 5445, 2826, 8129, 3740, 2211, 6144, 3789, -1332, 2289, 1313, -540, 1234, -2272, -943, 1348, -2210, -2882, 810, -3072, -1173, 555, -5233, 43, 1034, -4630, -1161, -877, -4677, -925, 288, -6412, -126, 3308, -3185, -2063, 3322, -1582, -1318, 5284, -2859, -292, 8859, -367]
362c67j446J0151o549l056Q106p620j214R349p329k283Q535j478n773P193j399
377D820l545N746k571o987O482M19p980N783p21n010N573j824o575O724J041o049
393d674N393K58k468M541l268l785L750j084m253L037l16j152K820j634m089N108
409a816J625o283N395K226m701N151j969o855N016M10p411M522J072l438M221
424b835l78l728L191M226n423K071L638l123J602L042m890K133N313o482L482
439A839M590n285P75J543k834L243K866m821K262K611l350O37j312j823K384J419
455D744l415P90L022j928l78R64l005Q54N443p151l47N896p564K93L019o713K660
472b816M264o448J890M078n067o74J629j646j370K901k514l070O723j916o164
$$ y = [-367, -1813, 8338, 1789, -1267, 6839, -781, -1995, 7354, 25, -2258, 6277, 4799, -974, 6219, 4820, 1275, 7021, 4450, -2537, 3945, 4364, -3616, 2167, 1446, -3564, 2009, 185, -6390, 334, 1375, -4674, 719, 977, -1491, 3050, -218, -4003, -253, -1337, -5590, -2553, -2869, -4021, -1201, -2835, -6924, -1816, -191, -6474, -1079, 1147, -3554, 1597, -372, -7227, -2211, -1801, -9212, -4690, -3618, -7056, -2835, -3213, -6941, -3750, 476, -4947, -2876, 762, -2361, -759, 2283, -2607, -474, 4839, -1643, 1839, 6429, 1144, 1919, 3462, 628, 3871, 6737, 1916, 4178, 6789, 3439, 4076, 2764, 941, 3325, 4744, 1329, 2119, 5141, 3213, 2835, 3799, 794, 1648, 7091, -60, -407, 5489, -2075, -1782, 1237, -5476, -2816, 1448, -5000, -3110, 968, -4099, -4773, -3144, -4790, -6160, -3259, -5773, -8843, -2120, -4036, -10200]
487a0200N102J991m202O066j37n325P827L95o650L175J689k212L766j135j681
502a531M020m93r63r36J444P77j543J534l56p44J245k411r38K273l024J031J56
519d59j736M294l317j045M722j625N17K319l289J437L554l988j379J906Q57j064
535A704P35o6l105M290Q42n289J894L439m648J301K582o971K849K568p101K311
551b665L612n681K210L615n698J718J588l291J464K214j937k215M326j221k515
566d476L850k508j823O215k540l124N106k584K20K462l753L71L081q02k108K147
582b66k45j149K602L95k915L905J905l947L502j62l024L922L9l658L224M58m451
599A35L664m65l301K745j262j520K044o28k616J028P31n44j816J001K27j414L087
$$ y = [-10200, -5098, -3107, -7309, -1243, -1380, -6705, 1122, 1517, -5133, -1958, -269, -2481, 1285, 150, -1531, 2489, 1996, 1033, 97, 1541, 2318, 775, 2309, 1953, 1209, 2454, 43, -895, 1378, -1646, -615, -459, -2195, 2099, -1218, -2263, 2459, 834, 1351, 3670, 381, 1818, 5372, 1384, 5, 1911, 2768, 1704, 2439, 2373, -732, 3558, 4400, -889, 1005, 4444, -204, 1097, 3679, -3292, -443, 2125, -4976, -2665, 947, -4734, -2524, 1091, -4607, -2889, -1301, -4592, -3128, -914, -2851, -5066, -740, -1961, -4476, -626, -3134, -4957, 1258, -1282, -4406, 700, -1884, -1664, 798, -2955, -2584, 497, -305, -2413, -266, -511, -1660, 942, 1337, -1578, 2327, 4232, 285, 3787, 3625, 601, 4523, 4562, 904, 4128, 4586, 135, 3799, 3334, 33, 2778, 1516, -4, 2040, 1412, -1204, -176, 555, 11, -1805, -804, -577, -1991, 1096]
616A096l277q86L384j185o99J392j381J693R34k071J478n45n3J648k565J55J821
633I39j904r62J965j335q32K583k445m82K274j533l187L508m01l301L157m57k344
650d757M175N8n453N110J807o137M057J739m545L724K120n624L287M302m630R64
666A97L802l376j07M789m572r12O428m889r34N794l215j655M924l073j680N577
682G098l388k842L619j75l435L144r13j229K407j201k834P87J525l220J11J408
698H62k352J420L23k589P67J580k346J0J7p89J147j203j262J848op72K47L25K89
717b484J434j542k95J466m72p72M74m29L29J664j708L01K071j013k68P05o00J89
735i50J213j955l0J731j263J7J055j64m8J780k504j91K784j471j165K254l55j813
$$ y = [1096, -2181, -3067, 317, -868, -1567, -175, -1556, 137, 1071, -1000, 478, -67, -120, 1528, -1037, -882, 939, -965, -1927, 38, -1297, -2129, 454, -1991, -2473, -199, -1732, -4919, -1411, -1812, -5113, -1956, -2413, -4757, -582, -524, -5977, -867, 940, -5197, -1140, 599, -3946, -222, 1898, -3726, -439, 3863, -767, 197, 3999, 623, 516, 5305, 733, -179, 6249, 1360, 426, 6220, 3005, 1350, 6274, 3201, 1521, 7098, 3710, 868, 4487, 4312, 877, 4021, 3108, 1879, 4286, 3085, 251, 1038, 2563, -657, -546, 862, -1490, -70, 253, -2336, -1569, 11, -2335, -2325, -2308, -3097, -1950, -3153, -4415, -2567, -2573, -3345, -3098, -2773, -2484, -1050, -2592, -2887, -1421, -1893, -2665, -2191, -2620, -2291, -627, -2335, -2034, 37, -976, -1244, -539, -1139, -950, 263, -1692, -1722, 9, -1254, -1237, -182, -346, -394, 1386, -1118, -1309, 1475, 4, -1161, 1093, 738, -1075]
753a075L752j956k372M547j394l643M022m19l341M207j001l435M659J55l874K880
769A712J810l806K165J093m464K271K189m284N8M357m207M7L890l801NM271l819
786e13k255M989k809k464L992k105j958L782j332k945M175j65k922K169N65j353
802a149J368Q03k708K456J237k407M16J348q29k98J226j380N73J420r70r15J168
819A359M79j573L97J69noj86l96n20Q43j19j404R65J243j387J55P67j298J364
838H47r5k169M86J627j727l35J913j465O45P43j300l20K044j296j518J519q75
855a276r45J364l33k020K436N0k796K508j22j182J556j32j569K607m06l063K257
872a066K25j586J095L71j606J882J628l350J550J933k266Q32K027k683J093K478
$$ y = [-1075, 2677, 721, -1651, 2896, 1502, -2141, 1881, 1462, -1879, 2328, 1327, -2108, 2551, 2706, -1168, 1712, 3522, -284, 1881, 2974, -1490, 781, 2970, -1314, -1256, 3101, -1106, -1059, 2831, -970, -965, 3306, -513, -2768, 2221, -588, -3052, 940, -1165, -3123, 659, -673, -3618, 557, 392, -2530, -361, 204, -1149, 219, 1022, -1686, 770, 2007, -400, 16, 1364, 535, 237, 1463, 83, 656, 2076, 1106, 191, 1359, 1838, 265, 662, 831, 826, 820, 634, 238, -282, 561, 442, -962, 3, 1246, -141, 14, 781, -517, 847, 752, -1417, -931, 696, -1031, -1366, 547, -918, -273, 470, -830, -1150, 894, -402, -1920, -401, -1276, -2221, -857, -1190, -3210, -774, -724, -3520, -1012, -1134, -2316, -760, -892, -2461, 146, -260, -3323, -1066, -841, -2427, -1332, -961, -2567, -685, 943, -2407, -857, 1076, -1190, -358, 1669, -1014, 79, 2557]
888B557l600K55L017k316m70K665j957PL010k384m75L053j141j910K445l6k348
905C72K561q78k407K737O66l883K478J383k722J430J40j603J677K78j969LJ177
922A440p89o52K74Ko44J280p51j447K101m62r62N64m4k32O7P6l92K41l14J87j101
943a558J156Q48j819K37J245r82O1J078k384J374J547k376K37J362k39l68J037
960D56r92q27K542m49k607K270M15k490K756r89k046L164q30j943K223J16j951
977a182J641J44j125P03M85j404Q64J775k657K92J425j696O54J002k017O24J990
994A518k240L43J409j824J295L46k293P91J731j765J54M56q24N08K66l58j133
1011a620J714l09j301J968o55j285K179o56j084K584j931l33J820r13l11M50n13
$$ y = [2557, -1043, -788, 2229, -87, -557, 2108, 151, 158, 3168, 784, 309, 3362, 2221, 311, 2756, 2720, 372, 2933, 2055, -352, 2385, 3051, -832, 1646, 3029, 307, 1737, 1877, 274, 1951, 2229, 260, 263, 1440, 651, -1, 273, 275, -369, 911, 160, -1287, 814, 352, -610, -46, -90, -322, -255, -179, -571, -330, -644, -457, -1558, -402, 446, -1373, -1136, 109, -873, -812, 266, -2118, -744, 803, -1573, -1336, 26, -213, -581, 456, -536, -1363, 1179, 730, -1877, 393, 808, -1682, 1074, 85, -1961, 1203, 373, -1570, 653, 769, -1182, 459, 603, -522, 181, 666, -738, 126, 1901, -756, -464, 961, -735, -81, 921, -1096, -472, 1518, -722, -379, 1030, -794, 501, 847, -1446, -655, 1076, -689, -535, -79, -903, -395, -129, -487, -1620, 94, -215, -1516, 452, -203, -1488, 691, 35, -1049, 1535, -396, -729, 1091, 178, -133, 317, -196]
1028a96K42N91o58K06L37K73m4q48O59O4L49K20q42L72M24o9m66j53p7R29o89
1049F24m54J247j199R02P56j501K89J297j788P26R98j643O75j99p96M13M25r90
1067b18o57J775r53j032J589n54q90J887j335k119L265j229j238J009k83o75J354
1084c04q99p73J157j06r03N97L94m14N43P38j647J142O07j221K27J104j015j88
1102i61J062j152R93J85p79Q03L40Qp9j8j33P90l67k15p9O29K88r70M43l15N36
1123A009L63r89L16O98o79l8M52r77R39K07j005M67L17l56L8lk38J56j87l92P6
1144A74O98j47q99P83k24l2K62o97p3O38j40q76P01k37J01r2o55J23K89j21l47
1165g71M09k53K16Q7m71L81M79l34l76P17l15m89R41j189k18J360m76n26O58k25
$$ y = [-196, 46, 637, -21, 185, 522, 795, 751, -97, 562, 626, 975, 1195, 353, 725, 1149, 1080, 614, 461, 384, 1313, 624, 170, 1417, 218, 1120, 1876, 375, 664, 1961, 173, 899, 1897, 254, 929, 730, -66, 347, 772, -218, -875, 900, -53, -1085, 504, -50, -940, 947, -388, -2507, 758, -471, -1709, -700, -983, -1658, -304, -1203, -1976, -819, -925, -1828, -1231, -837, -1251, -708, 30, -1617, -475, 132, -1089, -862, 242, -773, -961, 101, -1051, -58, 127, -652, 151, 491, 499, 420, 402, 269, 1059, 692, 477, 398, 1027, 1315, 345, 788, 473, 1009, 1372, 383, 699, 1397, 718, 680, 1132, 155, 1094, 1301, 296, 763, 1080, 724, 762, 759, 521, 677, 490, 98, 174, 872, 725, -174, 609, 385, 353, 615, -82, -155, 483, 343, -533, 168, -69, 32, -60, -715, -592, -303, -424, -771, -362, -615, -399, -312, -783, -402, 77, -257, -633, 84, -231, -720, 221, -968, -1186, 174, -302, -828, -170, -395]
1185c95K6P88o77N9O58J19q12J79N72m73q0p9k14K76N45r40N01M34l43j43J80
1206A81j00P8O69q47k21O71m43k36j48J89j2m9l67o1L68J10n7k64K29L08%p21
1228g23L53o6o5j67jP4L48j2o29O77O2m25O99M4m38L96N12j323O94P86q14L22
1250C04J08k53k66N51p82N7J447l17j66n3O6m13O54o99m85Q60K7p65Q46P15q13
1271F23J57l11o26J166J86q55n89R51p97O49k12n39O90J23n02K26N05k71l08k57
1291Il50R10o27p14N46N22n19j88P0j31L23k6o27J82P44o23o14L14k28L64k38
1312i01o53N36P4l91L14n00J71P36k15k71N29J57p3l05j47M03M92k28n64Q28k12
1333b20O8L32j58j79J164n69m11J070n02l27M99k36m34R49n51o00J073l37n18
$$ y = [-395, -369, 419, -258, -199, 459, 578, -234, -55, 517, 44, -36, -115, -329, -53, 492, -448, 53, 487, 144, 1, 181, 81, 159, 828, -19, -240, 431, -12, -248, -396, -207, -219, -268, -635, -696, -328, -218, -275, -539, -310, -2, -2, -723, -370, -436, -501, -668, -669, -595, -247, -259, -888, -211, -149, -574, 125, 169, -269, 127, 639, -684, 10, 796, -18, 304, 412, 159, -107, 444, -338, -281, 1166, 849, 683, 630, 696, 283, 937, 238, -247, 613, 640, -125, 721, 1436, 623, 780, 469, -157, 1009, 1195, 340, -249, 702, -95, 554, 342, -197, 493, 616, 114, 340, 845, 574, 266, 9, -341, 569, -58, -772, -226, 296, -223, -411, -341, -472, -149, -175, -802, -620, 124, -499, -1113, -799, -1027, -663, -901, -1554, -1018, -944, -1335, -1021, -1521, -1350, -614, -829, -1100, -571, -414, -487, -792, -939, -536, -44, -272, -836, -8, -220, -152, 180, 22, -157, 1007, 438, 27, 1097, 595, 268, 767, 531, 97, 1046, 495, -105, 968, 631, 113]
1352A13L64K25p00P20j56p85N28P47j180Q3J140j395K19J172j480L88J141j521
1370c77J09O54l24k50R61o08l76P58p0j066J139L64j042K89k8n22O89R4j115N47
1390a74Q88j468O64J64l40Q6J52o76L78K68J88m96K10P3l76M7O8k52J96K03p17
1411i14P12L91q32J70L83RN26n17Qk73M21M56j061K85O81o26K70j04n93O60L9
1432I1k07l35O38l5k9k1l84K7J48k02k03L69j45o69P93m4n26Q88o02k21R75m04
1454i8q23R21l01K00K29m53r4K89O35r38M7L96k61l6O83j050O46O72q60j78R28
1475E54n41j7O09j091M44J028j229J81Q16n58j57J39J32l14N62k73q26J440K08
1494A107j703J066Q51j171Q48n83p44R88N62q96J15K41j47k59J15j22k46P93l64
$$ y = [113, 477, 702, 2, 722, 566, -219, 309, 1056, -124, -41, 1099, -296, -77, 1095, -385, 3, 1144, -377, -268, 386, 62, -188, 773, 165, -211, 547, 477, -589, 550, 914, -128, 161, 133, -389, 300, 394, -721, -174, 714, -754, -90, 74, -266, -180, -28, -704, -326, -58, 130, -366, -156, -83, -459, -412, -344, -596, -400, -197, -914, -202, 189, -643, -473, -90, -81, 445, -72, -64, -337, 84, 540, -521, -236, 445, -181, 89, -15, -608, 52, 91, -116, -451, 187, 152, 123, 102, -282, -255, -107, -309, -512, -143, -288, -957, -164, -208, -734, 154, -448, -669, 306, -98, -921, 0, -301, -101, 128, -325, -419, -130, 505, -433, -386, 10, -251, -287, 396, -654, -8, 664, -196, -374, 554, 13, -4, 605, -486, -42, 986, -243, -62, 754, 196, 39, 178, 310, -4, 558, 285, -541, 899, 1107, -596, 470, 1321, 150, 998, 415, -329, 659, 1221, 325, 440, 681, 534, 275, 390, 268, 22, 815, 451]
1513D51o05M41l33j41J090j450M34Q5M5j78l90N29k70m44Q00k52n1m2q7l06R23
1534B49n22n78L83N09o64j5k22R7L25K74j027M02R72n12j30N71j01j103J361j03
1554A66o97R32l45j448J719J13j270R30K68k87K56k55p95R00L15n46j73P26p25
1573b16M06M14j098N40J306j361J86N42q11M79K81r23L9P72k69k09N15l72J1K71
1593E03k58n05Q06j92o61Q09K9q20P87m72k26L95k8l46M28o5m65K43K64l96L31
1614A61K69q56L32K09j86j45N17m26k1M05n36J58L78j43k42N9L64l33K09K5j00
1635I8k22L48k24k46P15m91k07L62J23k49L19k20l94L22J38k92j5K70l17K8J76
1656B2m00J05Q51o28o51J032m99J8L68o30j3N84o1q58Q94L5o54L67J11k89M07
$$ y = [451, -154, 287, -46, -187, 903, -547, -113, -28, 17, -161, -551, -22, -292, -736, 64, -188, -239, -281, -368, -674, 249, -273, -851, -468, 41, -623, -638, -860, -763, -438, -164, -1191, -789, 183, -329, -459, 112, 11, -1092, 269, 166, -531, 401, 56, -1392, 327, 440, -830, 100, 368, 81, 337, 82, -713, 187, 502, -44, -217, 509, -216, 190, 604, -494, 46, 1352, -9, 177, 719, -92, 387, 668, -255, -216, 556, 287, 78, 593, 221, 232, 503, 245, -260, 546, 354, -307, 502, 531, -289, 498, 26, -200, 195, 167, -179, 249, 184, -281, -38, 226, -170, 161, 430, -426, -94, 115, -71, -216, 301, -125, -146, 259, -277, -119, 259, 116, -126, -67, 297, -36, 173, 198, 98, -124, 224, 0, -246, 469, -22, -229, 133, 256, 7, 326, 106, -288, 34, 172, -120, -135, 135, -182, -154, 22, -378, -273, 578, -50, -701, 331, -168, -150, 218, -412, -425, 159, 98, -760, 134, 169, -485, -118, -7, -296, 111]
1677A11l8n33K87L28n47l47Q93q44L58K90n29K60N02m81k94N00l30R3L14q1o3
1698a51L23k87j05J42L75l57p8p5j34O11j03l13L02L34o43M93p4OR3K01m47K30
1720C43J07j46j63N2J25J85k00j4J60p8N9j6L5J1K02o20J75j21K11N1o1k66K68
1743B99K17o45K72J24m56L68k24n0K03n8n21K18L54m99L25j98m15O75K4o19J04
1764e02K06lO8L1l55P4P53p29j45N24j55l35K68K84n27N68m98J51L13J29n36L77
1786c9Pk90K19J88k67J21K42k69p5L30L6j72J31k48j32N12k29o3L33k80k4J43
1808A74k63j44K60J7j49R0Q5j57M00n32K72K25m29J09o0L80q0k80J73M1o1qJ58
1831B21n7k23J4J85q9J00L2q0N7k00R5k6K32j23q1K62j69j59K8K72l68L7J52J84
$$ y = [111, 73, -460, -173, 155, -392, -739, 154, -690, -332, -42, -571, -311, 191, -290, -584, -84, -414, -321, -7, -88, -151, 172, -115, -220, -78, 297, -60, -138, -213, -347, 264, 161, -152, 150, 484, -159, 334, 260, 266, 359, 560, 113, 343, 450, 304, 141, 193, 318, 503, 303, 289, 449, 371, 430, 414, 449, 460, 662, 42, 217, 96, 307, 358, 297, 31, 299, 516, -129, 143, 267, -189, 179, -45, -95, 108, 50, -471, -253, 101, -398, -73, -271, -686, -11, 13, -606, -502, -296, -299, -231, -200, -555, -481, 272, -457, -602, -78, -233, -568, -300, -16, -543, 25, -473, -322, -9, 120, -416, -39, -32, -322, -103, 85, -182, -61, 181, -88, -163, 167, 203, 31, 162, -86, -218, 294, 65, 2, 335, 55, 31, 174, -89, -233, 27, 44, -105, -15, 70, -87, 313, -219, 53, 278, -151, -42, -102, 278, 198, -82, 91, 132, 71, 63, 221, 164, -59, -45, 140, 51, 151, 183, 103, 160, -40, 55, 29, 261, 138, 57, 319, 150, -9, 19, 291, -77, -40, 112, 296]
1855B96jl08O7o3L44j89k08J4k06N24l57J96K72j81m20M24j95R0J04j80L4L44
1877D01l18j70J91J65k6l51N21n48L25o1k04l6L19j60L7J67p75N19J0k95J16m4
1899b17P6k07L96p5k14J14l64M68K12k64m63L25r0k25L87l12j25M23J54m60L96
1920f5q1K18j54o0n1K26o7L45m87j1k0R2m7J40K92j4k4n9N3l3j94O6j17K02l4
1945A16j72L51j94q0K07k68J33M56l71j44K93L4k43K81l22K42R1m01J11k3K47
1966C44k04J98Jl51L90j06m29M68Kl86K77l51J03K48j00l98K40N7j90J76m4m1
1988i6J86k94m1j48L81L7l41K52n5J47n4l59J94K04l26J07J41l53K38M1j11J9
2010b31p0L05l86mN14p5k48J64J56J3q4k08p9K33k51J93j75K85%k86J99J14j88
$$ y = [296, 295, -13, 54, -9, 335, 146, -62, -48, -254, 270, -87, 109, 381, 200, -220, 204, 9, 99, 203, 23, 57, 401, 83, -87, 104, 269, 243, -108, 413, -135, 190, 129, -75, -111, 208, 48, 85, 252, -523, -4, 6, -289, -173, -217, -141, -348, 48, -27, -241, -127, -491, -23, 189, -75, -538, -213, -303, -528, -141, -453, -578, -155, -1, -461, -65, -146, 72, -82, -142, -193, 33, -34, 311, -176, -187, -207, -115, -162, -22, 270, 256, 232, 173, 226, 193, -1, 65, -52, 150, 116, -56, 295, 101, 21, 228, -40, 93, 549, 178, 34, 327, 361, 118, 399, 77, 319, 410, 9, 120, 97, 344, 140, 338, 339, -12, 378, 272, -157, 311, 313, -73, 204, -147, -44, 204, 104, -294, -54, 3, -187, -11, -55, -96, 90, -204, -245, -393, -12, 25, -316, -64, -119, 28, -26, -385, -191, 13, -313, -206, -65, -418, -180, -139, -250, -231, -301, 4, -382, -386, 128, 53, -195, -31, 125, 138, 54, -154, -233, 0, -251, -58, -233, 52, 52, -234, -35, 79, -109]
2033a09K74j75j36K44m2j52O2M8j37K55k18K5o3M55o69J17P3J18j1M8k53J32J71
2056E7j20j47L62j69j35J68l40j16N09l61jJ45J63j30l7L04l91K76J42m10N34
2077C03l49P0L3Q0k26j70L71n20N47k6j9j11L68n33M32j59n7m4K81R6n07L19m2
2100A37k36M65k65j52J11r8l65K90L59k5m16j55K1M0K93k40O77j98o97K68P6Q9
2122b1J97k65J33k46L12k71K31ml47K20K1nJ43nJ11n17j96M71nO0m36J34j11J90
2146b06J3N2M2M45p26M59j06j57K35k15j48K34k4m14M61L97k45j13l34M14J52
2167B16J88m85L10K8J3k82L44k86O3Kk27J46K00J82m62K12J77j77J11k84K99M4
2189C32m4k77q2J84j58L23N9l13P0J44m83K17j15j4j4M07k75j3J74k33j13K81
$$ y = [-109, 165, -10, -146, 98, 56, -96, -34, 14, -123, 132, -86, -61, -124, 331, -338, -221, -148, -30, -41, 7, -246, -114, 57, -63, -210, 152, -17, -152, 16, -324, -440, 69, -292, -293, -148, 15, -115, -152, 152, -239, 37, 179, -231, 303, -46, 24, 57, 137, -89, -259, 112, -408, 139, 113, 94, -17, 351, -182, 250, 91, 34, -10, 271, 367, -140, 179, 137, -99, 366, 101, -51, 60, -38, -403, -113, 246, 221, -195, -350, -329, -289, 4, -236, 441, 243, -454, -186, -110, -21, 176, -89, 44, -202, 110, -161, 70, 66, -281, -61, -40, -45, 98, 93, 204, -313, -509, -38, -43, 17, -419, -285, -396, -206, -193, -141, -99, 346, -380, 79, -27, -184, 51, -164, -312, -78, -102, -516, -55, 342, 97, -16, -350, 64, 216, 404, -81, 229, 257, 270, -12, 332, 46, 109, 111, -116, 30, 230, 412, -50, 162, 339, 162, 273, -11, 288, 332, 288, 11, -71, 113, -45, 278, 337, 24, 94, 238, -245, -28, -143, -157, -171, 236, -39, -52, 122, -111, -224, 57]
2211E7J21k66K3ol85M44P2l22J57J40K2j58K26K7l61K52l0M2OJ19m52N81m05p3
2235a69M5K77k96R8O7j97J93m3K60m20K04n5k5M17n01j1K91k91p0L3J90r6J70
2258G1o8j63K36K4k18K48Q3l85K68m1j01J95pk47J36J57l06J82ol04R3Q9J20l65
2282c09M44r7k35J56J0o2J24j21r5J71L5P9l08J90p7Pn2O3J28J9k62O8L69k67
2306b2N5O9j92mK09k72n2L20m5j49J33o9j75L83p6j54N9J3J4m03N06J35j77j04
2330BJ33j28M51n78K0J97L87l85J7L6j13K69l04j19J0M38m44K86j91L0q0P9m53
2353d40O30j38j06j4J30L8j53J06k81J25R5J80o99P13p5m48K55K35j83p3J58m03
2375c48L78L8k51MK58k67j79O49m67O9L59l34k11J94R8J97j99Oj05K00q8m62M53
$$ y = [57, 178, -88, -65, -71, -456, -12, 60, -262, -105, 35, 57, -101, 125, 152, -209, 43, 13, 55, 61, 180, -272, 309, -96, -169, -124, 153, -143, -45, 22, -175, 18, -25, 235, -185, 19, -36, -61, 356, -145, -156, 135, -156, -226, -193, -3, -99, 71, 3, -160, 76, 100, -118, 130, 213, -172, 96, 55, -46, 149, 142, -105, 31, 188, -118, 64, 58, -246, -153, -64, 56, -309, 135, 38, -197, -41, -31, -93, 31, -90, -185, -14, 21, 100, -208, -18, -95, -88, -140, -77, 51, 70, -192, -124, 245, -22, 33, 102, -90, -94, 115, -157, -209, 111, 66, -83, 50, -19, -194, 189, 113, -41, 18, 31, 45, -358, 148, 283, 106, 2, 135, 7, 458, -120, -100, 97, 484, 99, 116, 152, 39, 308, 4, -115, -105, 333, -111, 175, -16, 14, -66, 13, -440, 190, 52, -54, -68, 62, 100, -53, 53, -228, -103, -8, 172, -527, 186, 111, -337, -82, 153, -30, -103, 55, -348, 30, 68, -183, -179, 79, -188, -367, 282, -185, -116, 243, -91, -302, -108, -10, 187, -12, -6, -111, 89, 1, -461, -8]
2398hK32m50K89j21j72K18J03j77j47L82j2k22K74m77K99K10j27L4J10R6n10K63
2420H7l4k75L62j82P4L7k70L36o8k28K58k67L46j24J11j71J05n0j45K82k09O6
2442D1J21l72N7k6Q0O2j17n7R7L23l66L9j2J33j20M84l04j06L2%m0K61m61L11
2466F0j38j6j09L89%l19K93j09J5J04k23J32O5K04l36%K12k32J61j56L1P2K3j66
2490d3L11l25K66j35N0j11l71L85K2m9j23K53j72J76j43O0J16o0m48K17K68k52
2512a08J37o8o7J94m3r6k19L39j82k27K62jj07K56N3k66RJ21k70J60K5K43p2m67
2536c94J20J86P6K0n3J24K19m18R4j34K98l62K14j4%M4R4N1j78L2J00r2k8K03
2560B02l49M10m27M10k82M6R7j9M0L6j59R5j15k6J26j37N6j53K14M4n0J43j2l14
$$ y = [-8, 224, -226, 63, -58, -230, -12, 91, -86, -233, 149, 137, -85, 189, -288, 11, 221, 94, 128, 238, 334, -176, 87, 53, -222, 140, -42, 32, 69, -201, 135, 67, -161, 97, -170, 176, 52, 163, -8, 97, 47, -98, 184, -25, 41, 162, -210, -153, -179, -99, -37, -154, -211, -114, 209, -157, -118, -130, 3, -117, 367, 63, -43, -11, -11, -51, 210, -251, 60, -78, -94, -203, 186, 186, -133, 160, 51, 66, 170, -53, 79, 144, 348, 12, 12, 224, -8, 153, -3, 28, 100, 123, -43, 268, -57, 209, 74, 124, 13, -358, 27, 49, 0, -123, 130, -42, 134, -9, 51, 167, 107, -341, -124, 144, -108, 29, -39, -106, 88, 45, -51, -270, 69, -113, -340, -78, -79, -186, 70, 123, -143, -134, -13, -283, -123, -98, 145, 73, -394, -274, -88, -12, 8, -45, 79, 298, -120, -26, -160, 138, -224, -10, -24, -24, 20, 114, 165, -13, 19, 119, 27, -1, 202, -147, 263, -164, 246, -36, 10, 107, 88, 128, 164, 5, 100, -15, -41, 85, -52, 4, -149, 65, 109, 59, 202, 190, -124]
2584a24O1M55n19l36L64QK30R2l25J55m9p8N4l68N06j60l26O77q18N30J05k84
2606a50l4J31L8k79N94p64N11j01k08L38l70K89k36J87r4LJ02k33K88R9O4j75
2628@k04O82p26J88M00k82n00R98j3o55P1J05N32j21q97P4J8J63K86l94J69K83
2650A77K83j021J021l62K25o79M42m97N14L56q11J346j350O72j023M93Q01r22
2668c35MO90m85L17k81J20l54K84N06r61l4J090n07n14J128n18l05K76n34M44
2688C1l14JL61k1o25N32L77m18k98J309k72j80k59L32l31O6L53r79K0J03M04N7
2710B49k05J31j69N8J91l23J63Mj39P8K67j47k53J30J84o1m2l22K7K31r9mQ2Q8
2734A19k15j5Pj29L91k54J4N2J9l8M11m28j50J25l35M85K2l88K33j55Q6K4%J49
$$ y = [-124, -63, 392, -127, -463, -99, -91, 139, 231, -94, 61, 12, -66, -12, -380, 126, -34, -360, 317, -501, 29, 134, -150, -184, -53, -15, -294, 300, -464, 47, -54, -262, 76, -294, -5, -241, -54, -148, -145, -43, -276, 12, 111, 175, 0, -204, 478, -248, -60, 340, 58, -442, 556, 543, -112, -41, 64, 596, 475, -422, -348, -330, -167, 119, -275, -106, 177, 460, -561, 460, 98, 323, -356, 86, -411, 103, 459, -352, 994, -356, 316, -707, -214, 587, -335, -331, 359, -126, 191, -90, 30, -324, -40, 466, -495, -529, 561, 54, -460, 668, 150, -155, 121, -413, 31, -283, -282, 79, 58, -567, -35, 342, -76, -374, 935, 663, 483, 224, 556, 225, 291, 644, -335, -315, -212, 192, 249, 44, 175, 6, 64, 255, -68, 95, 99, -40, 38, 305, 158, -95, 35, 219, 158, 116, -206, -179, 52, -47, -51, 31, 119, -96, -111, -104, -233, 158, -96, -82, -30, -11, -49, 362, -66, -216, -91, -426, 59, 81, -307, -74, -229, -143, -119, -119, 30]
2758C0k65K58k23L22k27M6q9L8j13P6J27j33NJ12K09M2k16Q7R5j36M42j62j26
2781A99j00P0k69pM9J45KJ68j42j08J40n8q8J61j13j11%J50k13K46J5P6k26J2
2805bj7J11j07Q9p6j9R6k37J58O4J8j02p6nK19j73J8o7P9J4j48Q1J02M1n2m8o4
2832a03K50L69k90J9k93o85J017p08M17K31l93n1L77l70K44K3o1j19O6R9j71J86
2854E4J0m7J00Q3l65QJ64p1J01K19l67k1K31K27k8j90K8j17j67K35j15o7K23k47
2878a19K73n29M28l21M50j97r8K7r3J66J7k85K97j73n8jK40n3j56K18m7j4j47
2901a75M31m74K87j30m1K35o6j20n8K41J5l24L25l40N9M17n45J92J19N0j06L70
2923C62n54n5M21L44o46J10N25o32K39R3k55K02J65n2m1L11l02l09J21l3L32l9
$$ y = [30, -235, 23, -200, 122, -105, -59, -148, -110, -223, -147, -20, -153, -148, -36, 173, 215, -1, 86, 181, 45, 487, 325, 199, 99, 169, -100, -107, -58, 87, 89, 257, 115, 7, 147, 89, 1, 162, 49, -62, -62, 88, -125, 121, 136, 212, -14, -2, -19, 92, -15, 74, -2, -21, 75, -162, -4, 60, 78, -24, -100, -105, 114, -59, -41, -108, -29, -15, -163, -82, 20, 61, 9, -39, -103, 147, 516, 226, 245, -48, -733, 284, -424, -7, 224, -169, -220, 157, -213, 31, 54, -7, -126, -60, 39, -132, 54, 64, 17, 117, 200, -165, -157, 7, -64, 37, 256, -111, -132, 99, 326, 298, 108, 136, 19, -148, 87, -28, -95, 128, -119, 154, -375, 53, -268, 182, -15, -113, -86, -179, -13, 4, -281, 16, -157, -215, -216, 24, -29, -185, 33, -14, -28, -175, 256, -218, 69, -61, -102, 133, 67, -53, -111, 130, 145, -179, 146, -194, -135, 282, -263, -71, 48, 98, -8, 362, -192, -247, 174, 518, -128, -18, 507, -125, 114, 207, -48, 154, 319, 267, 226, 537, 235, -74, 47, 14, 346, 307]
2945C07l13L66l44r0J40j21k9L8n0K16o5Jl11J49m5J01R6r4j33J97m3K28l10m4
2969a53Q5J13k86K16R7j56l2j21j16o8L11J71k45J26l05L91j32O1k2J69j49ml08
2992c57L88r6j34M11k95K41m69L48r5Q37p17l5M98l97l12L19p9j55J50m08Q36
3013D79r21N26Q00j230j88J159j82O2n36M46r10O32J09m55O85j030L22M24K10
3032D02l30R3J45Qn38J010p00k79k32J064j37p46J54J55J62o12P86r33P50N2R7
3053C71k09l82M25k17M34p61J78j14J27k9l29L26K70K21o48K63OJ94J88j71k29
3074h6K64K1m93L17p5L16m61L38m3l14K13K2l04K69j37J98K70j2m44N24j52j55
3096G6m3l17N16m01N68p22K01O7K36k15m6J6n4L6j60J94K85m70j7J17J32j56j15
$$ y = [307, -6, 360, 16, -74, 66, -55, -84, -46, -96, 120, 55, 56, -255, -106, -151, -50, 46, -48, -181, 16, -27, 201, -109, -153, -68, 45, -241, -25, 72, -84, -116, -237, -353, -421, -110, 61, -184, -58, -363, 28, -104, -43, -65, 104, -45, -49, -357, 31, -65, -199, 212, -83, 158, -311, 37, -58, 779, 62, 27, 525, 128, -184, 135, 56, -99, 51, -357, 479, -442, 84, 884, -346, -534, 625, 443, 505, -31, 415, -495, 137, 246, -209, 476, -554, -232, 192, 402, 72, 165, 310, 318, -220, 790, 90, -189, -421, 643, 506, -240, -86, 69, 231, -381, 405, -528, 222, 274, 371, 162, -220, 205, -12, 422, -339, -161, -275, -148, -177, -506, -180, 90, 311, -337, -74, -68, 126, 314, 143, -86, 178, 199, -294, 23, -52, 264, -197, 141, 98, -216, -3, 19, -285, -16, -153, 45, 315, 303, -141, 383, 231, 76, 33, -284, 232, -169, 399, -323, -122, -55, 181, -34, -80, -64, -118, -82, -242, -48, 237, -233, -250, -133, -1, -157, -272]
3119b72P4J88j71R5R5j49Q0J2j26j26J43K23l4k67P1L99j42k08l9K80j34N5J61
3142B08l58N2J5K12P6j67P6J43j63m6J52k07j8J33j9M2j22J82N2k50L56l31k07
3165a89K96o4j99L53M8j96qJ55j25n4LJ59j7p6K19l37O5N2k35M75l65K2M4k66
3189b40J19J53k6p4J90j49k8j05Ol5K09k69O9L9K63k30LJ23N0l9kj28j22J64J28
3214F9j40P2j87R0J25J9kj9J97m66M91k48K9k30LP8l8K27j49J55j41K83k42J93
3238A69rj61L2j06N2Kj44L27Mj21l07K76J1m8J91j91M0L91k42k15lLn0N1J5O2
3264B9K4N9p4k12P8P6k3R9j11j03K49k30n3Q8J74l8p9k0j7R2M5j60L01k21K35
3289B08n08L79m4j73K23m4r1j17K39J0L2j75J57R3j62R1K67l24R6k52l6L46p3
$$ y = [-272, -198, -10, -181, -86, 9, -140, -60, -48, -174, -300, -157, 66, 32, -235, -164, 235, 93, -115, -154, 126, -8, 47, 208, -150, -98, -83, 129, 205, 38, 114, 257, 94, 48, 200, -7, -25, 108, 89, 131, 9, 191, 243, -7, 349, 18, -189, 107, 43, -156, 197, 245, 49, 41, 196, 71, 17, 20, 179, 162, 86, 305, -32, 33, 85, -150, 325, -40, -18, 26, -240, -121, 32, 6, -68, 122, -27, -55, -160, -154, -189, 20, -249, -180, -141, 122, -108, -105, 18, 68, 29, 27, -101, -223, -59, 69, -71, 1, -186, -96, 29, 48, 46, 27, 224, -242, 249, 1, 30, -200, -197, -119, -157, 70, -79, 76, -65, 218, -24, 169, 160, -1, 31, -75, -23, -21, -165, 162, 166, 45, -262, 14, 25, -23, 168, -23, 17, 408, 166, -49, -52, -49, -99, -48, -33, 29, 53, 112, 38, -174, -96, -20, -43, 56, -55, -158, 91, -139, -192, -104, 70, 32, -47, -67, -84, 8, 53, -107, 194, -27, 208, -300, 79, 35, -138, 85, 41, -50, -167, 72, 82, 114, -61, 96, 189, 27, 118, 385, 61, 157, -95, -131, 215, 142]
3312A42j66J07K36l15K60k3k21m2%J46j18j25K22k64K22P9j72J22j64r0J34k82
3334c12J99M3j84K82j59k6m2J6k2P8J72k69J65k2j9OJ1j67k8J1J34K46j39J34
3358A08j38Q3j79J51M7r3j56J78m8K29o7l3k97L58n8q1J42J80j92k77K04j28L00
3381B33L53m37Q9m8j7k01j57K51M8l7k51N18l36J58j8O3J57j98K08l59k2k09K08
3404dP6l3k50L65n7k08J05j5p1j06rK14j96K59l29M32l43L13k99M1p5K04j69m0
3428a95L28k64L23k77j04J68k53q4M53k81O24l67J25q27M84N55n17q7M24l31j70
3449b73k32M37K29l43m73O37r7M16N1p07M51n6m05N71l58L89o6J02o43M04j74
3470a40K19J42l65%L40m92M35n52L67l45N67q6l44q2M77q0oR5j21J7m19O40m47
$$ y = [142, -24, 83, 319, 4, 264, 241, 20, -22, -22, 124, 6, -119, 103, -161, 61, 140, -32, 90, -74, -164, -30, -312, -113, -70, -254, 28, -131, -157, -199, -183, -205, -127, 45, -224, -59, -81, -100, -94, -83, -250, -278, -267, -133, 113, -26, 108, -30, 53, -126, 25, 72, -21, -177, 1, -47, 182, 115, 82, -215, 143, 85, 4, 146, 326, 134, -143, 61, -67, 233, 586, 149, 238, 190, 173, -28, -185, 66, 114, 77, -174, 344, 8, 166, 148, 211, 368, 170, 378, 19, -3, -212, -4, 72, 39, -211, 154, 97, -111, -6, -21, -92, -198, -207, 7, -189, 70, -259, 173, -170, 143, -156, -115, -190, 14, -155, -195, 133, -131, 192, -85, -189, -21, -274, -358, 95, -186, 438, 71, 196, -631, -147, 408, -109, -196, 228, -103, -273, -505, -68, 161, -182, -655, -18, -115, 301, 352, -355, 96, 40, -365, 206, -152, 237, 171, 273, -370, 34, -140, 79, 221, -144, -144, 196, -296, 139, -413, -46, -391, 176, 90, -254, -336, 141, 61, 55, 150, 29, 46, -373, 267, -180]
3493a80J80o6l67J31N18Jm16m21M07L31r4k29j85k5M17K31P2m84L21l93M80p95
3515e66Q57n5k39J62m09N27M56q01P7k81k8M83M6j00m28J70P26l69j08j40N3m59
3537d26O25q2m5J91k72m99M18O8n7j02K63n58M90n9j38l6L1L78Q4m17j55r4N31
3560A39l35Q4J28O2j06k09M51j8k88L32j8q32M47L74k25p3j26l44M42k65L60%
3582b0J60l25J65k47J50k06L98n3Q5l26L79k03j21m5J70J72J35k40j23N06l70
3603D1L33m83K99j24k72L06Rm0L36r1k25K21l59j4M52n2l98J73j78m0M75Mk05
3626A68k1j90K65l9K5k74J57L5J57L9l39j10J88J54k27r8o6P2K7l04K30K8JL1
3650i1k8L12k17M1l8j8r4J45n6Q9K7l2J6j60k0n2J80r2R5J83j72j90l3m3M81j3
$$ y = [-180, 0, -66, -433, -302, 216, 217, -199, -620, -213, 118, 24, -205, -390, -415, 2, 233, 305, -179, 142, -251, 229, -566, 291, 236, -3, 159, -250, 277, 733, -68, 9, -272, -300, 183, 229, 129, -299, -129, 597, 228, 120, -20, 33, -426, 199, 117, 72, 263, -9, -508, -90, -22, -79, -181, 82, -476, 14, -45, -183, -219, -188, 190, 274, -143, -298, -392, 139, -196, -112, 16, 78, -28, -237, 214, 196, -92, 240, 222, -610, -163, 211, -14, -87, -213, -557, -115, -380, -20, -20, 140, -185, -20, -267, -117, -323, 75, 22, 107, -219, 160, -43, -164, -209, -39, 133, 268, 28, -95, 411, 41, 374, -109, 190, 66, -206, 100, 109, 69, 405, 314, 89, 310, -49, -63, 389, 337, -61, 112, -66, -106, 369, 373, 168, 147, -43, 222, 183, 208, -66, 91, 126, 283, 322, -17, -127, 61, 215, -12, -110, -176, -104, -77, -381, -151, -123, -122, -91, -119, 193, -24, 17, -21, -39, -133, 12, -44, 45, 72, 40, 56, -104, -124, -176, 4, -88, 7, 190, 18, -172, -205, -248, 233, 220]
3676B20l55J29k8L42k10j80J10j35J38N4k56K65j6k05J21J12J33O1k24j03p9K01
3698I5J36k36M3Q3j98K03j74j32J11N8J02j31J59j97j00J94j1J27j55p4LJ20L3
3721E9j65r2J07J33o2m6O2q3J36l0l46K27O2R6j20J28o4p9M4O9j63K01J08q3L3
3746A32J57j03j77M3k3L5L3j2Lj52J81RJ8J22K3k48R5j12J25k34o5L36j87J64
3770A63k41J16J14l10J16J4j35Q8J53j13k12K07m6R2L9k25J80J29k86L1K14j62
3792g4J14k62p3J20J88k48o2L57j10o4J38k50O0L94n64J99J39n1l3k14K1R0J55
3815c0j68J58q2K09j72%NL10m89K85J9k24K32l20M42k5m3j31j13K75j59k7K85
3838B37k27J52j28j3J14j68m7L55j15k95L53j43%J37j21J46k03J30k76N4K70P
$$ y = [220, -135, -6, -34, 308, 98, -82, 28, -107, 31, 85, -171, 94, 78, -127, -6, 106, 239, 300, 76, -27, -106, 95, 231, -5, 38, 121, -77, 126, -48, -180, -69, -11, 91, -40, 119, -78, -178, 16, 5, 132, -23, -97, -94, 26, 59, -106, -198, -91, 42, -20, -66, -4, -87, 49, 19, -327, -100, -38, 58, -62, 66, 2, -77, -33, 36, -127, 74, 182, 99, 132, 289, 186, 9, 52, 29, 64, 97, 85, 88, -64, 117, 126, 144, 266, 289, 41, 136, 24, 149, -85, -150, 186, -1, 163, -78, 38, 152, -158, -42, -28, -163, -75, 78, -35, -247, -40, -86, 6, 45, -180, 0, 129, -157, -126, 88, -74, 40, -222, -295, -175, 13, -235, -297, 60, -50, -114, 24, -226, -166, 228, -336, -137, 2, -49, -82, -296, -275, -185, -30, -198, -40, -122, 87, -85, -85, -80, 230, -259, 26, 45, -179, 53, -267, 175, 150, 107, -24, -137, 138, -21, -48, 237, 10, 162, 34, 21, 135, -33, -80, 275, 160, -135, 218, 75, 75, 212, 91, 237, 34, 164, -112, -58, 212, 219]
3860B19l02J33r2j14J42j93K23j11o5J31L55Q9o61L03k33J72o9PJ61l41q6N99
3882B67o81P3J66K84j08k64K38RK18l40M95m91L25J70j53m13M28n34K41N52p26
3903b44R17q84j11O46j17L51r37L76j77J64M34p10K97QKl00K78J8J44j2j51k7
3925c5N20q8q66N49L86o35J39k87N88k86k37Q17l50k66j96k27K65M92j74n85P1
3946d05K94L60l13M9K57m42J73k7K34j21m17K42J95j61M67o26K20K11P04j285
3966c91M83k51m46N94L82J55k53O61j68p46k73L3j9Q3L38j61O64m68M2j41NR6
3988B19k67K27q9j74M26j5m58M39m20K44J24k1n50j40N34K14n41N96m08K72j07
4009A05j20j65M14p7n6p6p0K8j28k30L78l47K46jp4l65L75K99j0n52o3L49n8M65
$$ y = [219, -83, 50, -42, -156, -14, -207, 16, -95, -160, -29, 326, 415, -246, 57, -176, -4, -73, -66, 95, -246, -332, 267, -414, -341, -175, 109, 1, -263, -25, -16, 202, -138, 357, -134, 191, 361, 208, -205, 223, -311, -70, 482, -244, 673, -211, -322, 324, 207, 558, -379, -3, -180, -16, 418, -292, 5, 13, 15, -285, -7, 11, 155, 143, -8, -35, 485, 397, -469, 80, 466, -169, -30, -317, 271, -15, -252, 565, 215, -51, -247, -474, -209, 283, 109, -476, -405, -111, 249, -64, -15, 242, -200, -27, -54, 180, 59, -358, -116, 79, -82, 385, -241, -21, 190, 894, -391, 92, -159, -605, -11, 371, 526, 273, 934, 766, 20, -253, -220, -239, -156, 182, 21, 685, 217, 259, 118, 123, 219, -48, 179, 90, -84, 342, 327, -131, 308, -112, 132, 256, 235, -315, -455, 79, 293, -248, 348, -60, 212, 105, -15, -180, 234, 157, 101, 25, -45, -17, -145, -375, 3, -344, -98, -99, -173, -538, -163, 136, 126, -426, -489, -140, -198, 267]
4033B67j56J24o68N10o97Q04k82K25k99k16N81J44p28K34R2J5P0%Q8l2J58n36
4055c02L79l33L69K19l70k39M1N83n51M26P4l49j1j02M60k56l31j57R44k27n93
4076c26O03n18O23o67O5K87O1k61J32l52K22O00q63L30K77k50J70m68P93o15L68
4097B11j083Q57M79p03P42j103M60M49r61O93M4m0L0q3L69p31J320m90n85L47
4117B22l77K81j49J17p8m7J42j06m9k2P1j5k65L93j68M49l37K8m7Q1k50J57J24
4140A55M2p5k04L6R2k53N5K52j29J4K7J51k25J12L1l81K78J17j08j23n6P4j05
4163b23O4J3n%j1J55J04j47L1R6J81k86Q0j15j76J17P9k4Jp0K34rk99J21N1q7
4189a25l9M9L55j76k89N25k65Q7o6n2K7q7J25r7P9j4k81N35n7k08J62K80l00k3
$$ y = [267, 111, 235, -433, 77, -620, 184, -98, 127, -172, -388, 193, 337, -391, -157, -65, -50, 20, 20, 108, 76, 234, -302, 77, -256, 113, 332, -38, -277, -236, 347, -204, 222, 296, -53, -64, -166, 294, 38, -293, -450, 494, 267, -326, 277, -241, 382, -285, -220, 67, 128, -133, -1, -353, -131, 469, -394, -64, 213, -37, 133, -335, 458, -157, 211, -872, -15, 464, -239, 503, -600, -140, 309, -652, 41, 85, 45, 75, -8, 361, -370, 950, 460, -125, 222, -155, 126, -23, 94, 16, -31, 111, 5, -44, -66, 5, -10, -275, 118, -50, 399, 62, 90, 43, 124, -126, 31, 155, 197, 122, -82, -46, 46, -207, -152, 100, -29, -15, 12, 163, -62, 50, 81, -300, -22, 95, -13, -136, -192, -118, -223, -159, -146, -151, -151, -162, -7, 97, -50, -19, 77, 258, -28, 52, -63, -239, -122, -43, -67, -66, -136, 98, 89, -210, -89, -38, -125, -164, -115, 240, 64, -225, 300, 35, 122, 56, 4, 31, -56, 69, -28, 51, 37, -244, 291, 234, 26, 188, 468, 168, 145]
4213A45k25M2K68m35M15j45J77k21K74k92j84J67pK06k62MJ22Q8k26L63o8j66
4235D0r4L15j65l38J70k71l4K23J73k02J22o9J6K19k10PN0pk49K48J83l68L08
4258F7l28K64o5j12L49l79o1L50k41M5j2L64q4K6k37j9o6K04j60J7J93l59J69
4281g5J16k61L41j96K13l02k26P44j56J1ql04K39l05k17O83p49J36O11m10J59
4302D4K0j77kj81m7L24K7O9k14J69k2J08j26L5Ll45K26K7j25K31n6Ro0K75l00
4327h8J21K25m79L43k11L8J95j96j17O1K88k48K78L7k25K25r6m7r1K76k24k09
4349a44L19k25J02K8MK8j11p4NJ08O2j71L46k34j9M9l36J49o9J76M1p0J57q0Q8
4374A29j07p6j07J13J01j47J05l00K02R6K15m17M80m99L47j81j85O0J34P4k86
$$ y = [145, -80, -38, 230, -205, 210, 65, 242, 21, 295, 3, -181, -14, -21, 185, -77, -73, 49, 137, -89, 274, 206, 40, -54, 261, 96, -242, -72, -343, -377, -154, 19, -183, -61, -130, -114, 105, -105, -98, -48, -55, -304, -56, 127, -241, 67, -261, 3, -62, -174, 175, -204, -265, 85, -156, -111, -123, 241, 157, 183, -54, -73, -139, 65, -95, -78, 115, -244, -75, 41, -220, 121, -75, 138, -164, -390, 354, 198, 209, 201, -103, 136, -169, -386, 297, -452, -316, 295, -115, 44, 64, -113, -115, -296, -343, -19, 8, 77, -137, 32, 10, 118, -8, 27, 30, -315, -89, -62, -187, 44, -12, -3, -63, 212, -88, 33, 258, -221, 122, -89, -51, 144, -52, -169, -108, 180, -68, 210, 247, 22, 247, 151, 104, 13, 289, 65, -144, 175, -50, 52, 80, 84, 112, 1, -73, -68, 40, 102, -69, 277, 43, 24, 73, -263, -114, -183, -7, 34, -36, 121, 41, 129, 22, -54, -161, -48, 53, -94, 11, -289, -87, 9, 224, -193, 287, -212, 135, -46, -231, -171, -37, 37, -249]
4395b49K80j44N1k7mJ54m04J94O4j75J70oK25k37K22k50P7j18M4K16j03K6j42
4418a36nL5J71jk08J61J13j43j2L13k82N5j18J38K9j17Rl2on1L22n9J86m65N79
4443D76m41j35K92k97L2J14m5j09J76j95L02j91J18n0J21l56q3R86n42r4j80J15
4465A4j96L13P2l51K81J57o06M3o88K76J295p42o2J07J82n05M92L66o25l3K69
4486E9J66l3n39M65l2k66l5K08K05k17J16j81n0o8K73NQ3n4j74J23J5j52M72l95
4510fP9n3r7K7%K45m17L80l19J51j2J32j67j46j02K32j23K96k65K75q5j7J55j8
4534A45m07N9L0K25p5j82K99nLj03P9lj43L31n56J82O7p9K86j20R1Q1j42j72Q7
4559b2J46n59O19j62k17J73K60L3k59K06j7l06Q8K88l79J65m69O10m44K0J11J98
$$ y = [-249, 31, -113, -62, -89, -93, 61, -343, -149, -85, -260, -90, -96, 129, -108, 114, -136, -59, -177, -133, 83, -20, 6, -136, -141, -106, 65, 64, -144, 17, 130, -13, -25, 288, 6, 61, -57, 81, 110, -7, 2, -30, -36, -87, 235, 176, 362, -103, 476, 35, -100, 192, -105, -73, 41, -4, -113, 63, -132, 170, -21, 97, 47, 168, -188, -271, 715, 173, 79, -101, 14, -182, 131, 203, -148, 133, 290, -316, -273, -961, -685, 610, -132, -194, -87, 95, -410, 82, 448, -177, -210, 59, 225, 192, -347, 118, 86, -180, -215, -7, 198, -19, 97, -84, -134, -202, 71, 76, 159, 105, -69, 54, 69, -83, 389, -6, 73, 20, -77, -50, -50, 195, -222, 158, -161, -10, -22, 110, -57, -203, -305, -73, -196, 100, -165, 110, 25, 8, 163, 145, -262, -203, -173, 52, -23, -205, 94, 89, 92, -11, 68, 65, -78, 253, -303, -121, -54, -133, 153, 33, 124, 205, 63, -109, -22, 124, -435, 184, 22, -195, -22, 238, 271, 12, 218, 201, -105, -17, 271, -108, 57, -412, 198, -246, -226, -115, 83]
4581H3r7K33l01MJ23K8m75J5M53R1m94r7M92n9J01M6j59K17k35l71L05q2J63L32
4605C16q64P96J1J2k52k73L71m48N37p96M99J3l85J36N44R2j95n19r7J13K06K07
4627B4l93n0J67J49m7k4N59m72J12q0P1m89J67K91r4l46J3M93k61M57j81J9m98
4650d13M27J93q12J269k47P5j59o18L08n2j72P0J082j292J8L75m06N99on94M00
4671D5K29L18k53o21R20p19j66M55L37j344J60R22p65N85o9l09k26L40L63j31
4691G1Rl55O11n02O95j029K60J127n45j125P90k44M62k71M20o0J74l40m00K04
4711d8K7l91L53J04j22O0k77K61k04L3J47j37K16N6j13J10K3j23j4j54N30m57
4733a20q5M8k19M25k16L10j12m08L54j56K13n39K4K53k29l37N26L95k2m13L33
$$ y = [83, -14, 219, -82, -78, 45, 73, -402, -387, 66, 157, -337, -434, 58, -1, 100, 146, -13, 204, -31, -402, -97, -179, -16, 316, -548, 248, 259, 271, 19, -254, 117, -331, 206, -590, -91, -78, -463, -327, 217, 309, 114, -405, -502, -389, -183, 24, -369, -419, -252, -103, -150, -174, 385, -87, 25, -55, 16, -473, -306, -15, -109, -455, -442, 51, -210, 247, 66, 85, -413, 14, 207, -605, 664, 417, 492, 333, -285, 23, -29, -201, -131, 951, -341, -323, 52, -354, 245, 239, -355, 45, 274, 592, 339, -282, 638, -81, -247, 208, 545, -799, -639, 283, -482, 103, 34, -275, -501, -161, 202, 71, 80, -275, 336, -166, 529, -500, -240, 887, 342, -783, 7, -237, 225, -46, 374, 314, 488, 148, -252, -48, -21, -412, -59, 45, -77, -17, -294, -33, -237, -204, -57, -194, 22, 78, -35, 75, 98, -25, -39, -193, 337, -120, -205, -157, -376, 49, -167, 143, 31, -377, -23, -179, 34, -505, -481, -228, -457, -794, -268, 127, 105, -308, 25]
4754B5M47m49k13L70j11Nm33P79p65K2K66k92K31J44J97k31j17K26m2m89K17O45
4776D32l53L92r99R88p79K11M61k56J2l2N24p83K84J97m06J60J45o5J92K33q03
4797b45O70l42l49P11k72k71l85K02k4K25L19l10M98o87K2k08j95Q93K15l26o1
4818H0K13q75j82P51p63P54l4P4j42M10o57N78n32K18M2j4nj74j15K92L19j08
4840A30j30J99k83l46K75Q2o2l4j07K5L37j6r8k76m7L4K37J10j78J76j8J08J60
4863B78l39K65k66K89m06l6J80%J41J0j4R3j45K2j54L93k00l18K46K01l91K02
4885E1K55r2k06k46N40n34R3K85m87L21M05m45n2Pp6K11K28j58o48M75J25l26
4907b74M9L67J48J37p91N25J06l77n40J110q69N77n1k11l40L54M30p50O52m91
$$ y = [25, 472, 23, -190, 180, 69, 74, -359, 420, -345, -323, -57, -349, -118, 26, 223, -8, -125, 101, 59, -430, -213, 432, 79, 471, -528, 460, -319, -108, 353, 97, 109, 77, 601, -182, 102, 299, -107, 53, 198, 133, 325, 558, -245, 425, 83, -266, 445, 173, -98, -483, -281, -305, -80, 239, -71, 427, -260, -238, -446, -641, 252, 467, 141, 80, 293, -582, -764, -13, -776, -22, -56, 18, -124, 286, -371, 207, -325, -107, -65, -79, -84, -258, -373, -81, 238, 130, 0, 199, -84, -430, -155, -73, -135, -169, -276, -251, 86, 70, -28, -304, -351, -317, -80, 30, -148, 28, 10, 118, 278, -61, 204, -62, 227, -179, -215, -35, -35, 106, 116, 102, 195, 50, 72, -82, 311, 111, -207, 39, 240, -151, 51, 306, 214, 8, -238, 302, -232, -139, 146, -341, -20, 385, -60, -112, -105, -181, 30, 258, 100, -548, -73, 52, -274, -225, 142, 290, 427, -364, 161, 267, -110, -650, 460, -409, 168, 117, -94, -434, -80, 350, -400, 252, -239]
4927b39Q29j430O73q6L59r5o53M12m27M52j72J66j58m55R60l31j34J12O02k85
4947A00k81m11k57Q71J0M2o91J212n12n26N86K74L78m72o07R1O1j45J84l20j00
4968e13J20M02J09l03j86K03M21j15k10N5J78m72Q22q6n35L32j16j63R9j26o5
4989a49J93l45P1J37QQ1J0R8P1j22j36p1qJ94k24K08j61K70j90J29k92J66L07
5012B45j75k37M8M40l33K78m25K6L74j28n51P86n79M73m64p5K16J89l07L02k08
5033a05k32L63l69j67M73J82k44N6m89P51K74m14j65l36Q23o36k74K09o87P69
5053b18j02J9Q14r51L57J81m52j34O8J194j180K32L3k09M09l55J5J4L56j09l63
5074c81L27q4l6m3k92L74L4L09J11r86J6P11L66p40L46j99k90M22J1m06j96r6
$$ y = [-239, 590, -840, -167, -253, 106, 11, -642, -230, -657, -205, -377, -211, -369, -824, 136, -195, -329, -217, 385, 100, -181, -592, -849, 22, 32, 74, -617, 595, 83, -443, 143, 417, 795, 323, -284, -193, -132, -277, -93, -413, -513, -393, 9, 118, -185, -371, -168, 253, 138, -72, -17, 161, -311, 511, 425, -110, 222, 106, -57, 42, -84, -149, 44, -301, -230, -93, -85, -4, 6, 104, 175, 53, -83, -154, -162, 32, -192, 16, -145, 125, -65, 64, -228, -62, 245, 70, -167, -119, 321, -12, 266, -159, -133, 241, 113, -438, 348, -231, 242, -222, -297, -81, 108, -199, 103, -105, -337, 26, -343, -510, -37, 145, -99, -43, -532, 219, 493, 79, -86, -422, 401, -235, -509, -300, -987, -218, -320, -301, 513, -438, -81, 100, -352, -486, -418, 776, -404, -172, -139, -348, 61, -294, -279, -265, 91, -18, -381, -54, -138, -174, -217, -509, -135, -101, 208, 319, -667, -651, 60, 426, -314, 32, -167, -457, -35, -24, -430, -626, -722]
5096g22J039l21O34n64o03N99q21R08r11R72M1L12p21k80N48j02J43k54Q0m2m0
5117a05K97k76k72N08J02j02J20Pm31M2n7l3L6K90j81K22l16J51K51k86J4L8q2
5140f3J59j44j50J85r6J82P0j03j86K23q0KL2j00k1K3K09k23L2Q6L5J48j74n5
5164ip1J96k25oK16L6J20j91O6L0j23J30k08n9M4Jr6L17j07j35j17J41J33k09
5188a26K94j29M1oR0j43o1N4j18J8N2N3m2r6P4M7L5j25n6J37P5q0q2K96m20J00
5214a18j6L37j64j98K40q2L25n47J52L37k15n7O5k50K11J31k27n2J65p9j27O9
5236a00m7K04l9M5j47K90K3k28nK09k32M9q0L06m56L06P0l9j45k2q7N8K24j82
5260b5R2o8J37q4k09J29L2j61P4J11k1k35K60r0k58L40m1j45K83n0nm9Pn0j11
$$ y = [-722, 317, -4, 630, 66, -537, 62, -759, 149, -762, 210, 251, 563, -158, -438, 110, 8, 151, -103, -23, -65, -105, 192, -84, -356, 152, 254, 152, 272, 279, -152, -110, -167, -200, -164, 126, -55, 167, -149, 2, 253, -33, -19, 19, -63, 96, -48, -198, -13, -109, 73, 143, 40, -146, 77, -3, -1, 31, -69, -90, -67, 142, -81, -49, 37, 72, 220, 46, -9, -80, 116, -109, -115, 101, 137, 257, 66, 132, 162, 39, 169, -39, -98, -54, -53, -149, 168, 61, -74, -191, -50, 83, -126, 168, 39, 80, 74, 164, 21, -40, 14, -104, -86, -34, 19, -23, -119, -45, 2, 37, -88, -144, -7, 68, -12, -94, 202, -218, -118, -134, 203, 39, -159, 81, -1, 324, -223, -71, 266, 51, -6, 59, -191, 20, 151, -76, -128, 37, -42, -169, -100, -147, 57, 18, 63, -84, 206, 229, 1, -4, 205, -27, 22, -58, 248, -208, 98, 168, 129, -16, -38, -125, -67, 157, -25, 67, -1, 136, 52, -157, -28, 4, -157, -83, 28, 7, -228, 32, -58, -316, 24, -17, -162, 121, 71, 66, 17, 24, -26, -137]
5285a37l5j7j3L07l0R9k20K01j88q1J73j81L2K57j73j95l8R2J15OL12J8m65L26
5309A65N8m40J60Lj27K70n5k95L24K21m47J28m6l2J59k0J0q7J39o2j84J81J21
5332A44j46L1j11k1mK6J25J94k28j86J61j49L01j40J27K1j19Q6k54K47l6j2K1
5355G8r3k89J32L22m4j56j11K39m6n0K03j51j05J86o5K4P9o7k89J18P5o3J06L5
5379F8J66l67J79l81N27m04J64P0j18K07k29M76k29q0o1N2O9k65J50%N5K12k45
5402A6j35J29q5n8J65mq8o5q6K25k2K8J1L2k5R4l7l48K84J11j74q5J81m7j75K05
5428D7R8q9M8k12J6J42l44P5L41p6n7k96J36mJ10QO8P9j98O4P3j19m6K04K31l94
5454i5p9L43Rk14J67J18l19j35J30J23j93K83j93R6k4oQ9P8p5K5r5n3j19M80k54
$$ y = [-137, -172, -189, -202, 105, 75, 174, -46, 155, -33, -114, 59, -122, -90, 167, -6, -201, -239, -147, -32, -26, 286, 304, -161, 165, 223, -217, -57, -54, -181, 89, 34, -261, 63, 284, -163, -35, -81, -113, 46, 26, 36, -51, 88, 26, -158, 23, 144, -2, 29, -82, -103, -107, -81, 44, 238, 10, -176, -15, -164, 137, -3, 124, 145, 26, 112, -142, 105, 69, 57, 78, -15, -304, -172, 150, 106, -50, -161, 78, 32, -18, 185, 34, -71, 115, 50, 74, 153, 86, -203, -85, -10, -73, 33, 68, 234, -133, 46, -335, 192, -212, -48, 22, -96, 111, -118, 358, 129, 49, -12, 40, 109, -156, -6, -6, 49, 261, 16, -119, 10, -75, -133, 32, 28, -60, -125, -211, 14, -8, 20, 31, 63, 38, 132, 95, -253, 31, 142, -32, -117, 64, 17, -158, 47, 145, 56, 104, -108, -92, 50, -294, -219, 122, 46, -11, -307, -171, -175, -65, -57, 11, 90, -108, -44, 29, -90, -136, 68, 299, -95, -174, 169, 178, -36, 131, 249, -70, -205, -75, 48, -145, 138, -55, 41, 17, 11, 100, 178, 103, 128, 33, -20, -139, 341, 87]
5479H7n4j40K50p9L5j6K63k83l3k38K62J1j44r1K7K85j92N5j6M2L8q8M6j43m0
5504a56J57k25J27K9K22j36q2J53q2J62J9q8p7oJ25J1K16m40N0Q5j40J49J6J0
5528I9j01J0p0l7J45p5J75j49r7J90J51j63j94J52J31k84N6MP0k1q3J3J14j19
5552h3O0R4k01K59k21J45m2J18j34J3J32k79J66J01o6j4r4l3J79k04J58Ok39J40
5576c9p8K07j71N65n49j2L3NL4J13J30j81j66j27L93j74M0M9l26j84O26L8Q6j53
5600A59j32j41J33M1o5n0K13j83J26O2j56M4O1J51j70j64O3O4j78N0L85j25m0
5623A48M0k13PJ22l09K32M4K36j78j47p5L6m3j48J10L66m47J09J06M3R3j09Q5
5646A08k49K68m3j12nK80m77K90O9m4m9M4jj39J47kj83P6k51L68j38J7K81m5m51
$$ y = [87, 33, -107, 143, 64, 99, 83, 346, 63, 30, -208, 54, 65, -79, -170, -143, 142, -50, 5, -11, 31, 69, -19, 27, -116, -156, 1, -224, -97, -68, 154, 18, -64, 89, 7, 169, 188, 100, 23, 17, 142, 153, 369, -71, -21, 64, -76, 73, 89, 99, -2, 8, -62, -99, 46, -29, 146, -3, -100, 90, 241, 78, -116, 36, 167, -117, -61, -57, 13, -8, -91, -78, 36, -83, -23, 71, -130, 129, -92, 53, 11, 129, -5, 8, 140, -139, 27, 128, 62, 48, -46, -79, 100, -104, 54, 60, -179, -39, -117, 90, -81, 484, -65, -77, -44, -39, -5, 108, 238, 57, -109, -236, 157, -17, 23, 72, -254, -438, 188, 226, 312, 159, 27, -114, 19, 60, -5, -55, 158, -25, 101, 163, 7, 51, 112, 263, 93, -71, -8, 56, -122, -72, 313, 188, 148, 188, -25, -18, 104, -205, 27, 71, 307, 129, -18, -93, -57, -100, -248, -138, 228, -219, -110, -4, 39, 132, 23, 108, -141, 127, 84, -28, -33, 247, -230, 60, 129, 85, 36, 80, 79, -60, 87, 85, -98, -22, -273, 95, -43, -26, 255, 210, -241]
5671b41L37j93J9P4k82N10k89l7J41qj64K2J11j18P6N7K21k01q2K09j45Q0j24
5694b7k07L8j2K40j23J91j10J30k02nK08j78J37j17M2j25O6j11J08J92l49L17
5716A03j81J38k90M75k89j51L59j27J76l24l1K50k77J30l0K88l6k98L38l34Q6
5737b5j44K80J38l07K9o7K08j92K33l5m4P6j30l5k2j99K25q9P6J34j51N7j36K
5761a18k7L60j65J47lR5m10L8J79j42j2n2N8k7K00J13n1j10k6Q0j07k10k7J33
5785h4N1j64O0N8R2j1J10k13J68j02k3kj67L52Rj21n0N8qo8j58J74K65m06N19
5810C39j49l41L78l83L41p1p0J06k16L7k40Q1J61j4J21K62n48M7L4J40J26l1k93
5833a83K0K29m50O91l16J19j28m64P20J35k71m80L49Q0l80N57j43r8M8k3j84K03
$$ y = [-241, 96, -97, -78, -4, -286, 224, -65, -102, 39, 31, -133, -111, 0, -118, -42, 15, 236, 35, -47, 162, 17, 97, -27, -234, -196, -208, 32, -91, 100, -10, 120, -82, -87, 121, -57, 80, -37, 5, -120, -54, -165, -57, 135, -214, 103, -78, 60, -230, 245, -44, -195, 164, 37, 213, -111, -142, 108, -169, -39, -69, 219, 183, -115, 223, -111, -25, -169, 111, 249, -58, -29, -96, 112, -80, 153, 118, 74, 150, 20, -15, -37, -236, -11, -100, -24, 110, -41, 16, -120, -118, -145, 215, 50, 197, 194, 289, -121, -83, 96, -46, -58, -110, -52, -79, 121, 234, 183, 73, 47, 127, 20, -190, -217, -84, -33, -197, -137, -79, 13, 2, 112, -101, 67, -35, -58, -60, -227, 125, 134, 13, -37, 21, 13, -55, -213, -39, 226, -180, 339, 190, -151, 227, -156, 185, 114, 44, 150, -66, -29, -269, -188, -27, -41, 80, 342, -206, -159, -125, 15, 141, 110, -183, -163, 66, -384, 307, -9, 110, -18, -482, 238, 373, 102, -378, -29, 51, -329, 228, 85, -13, 35, 12, -172, 31]
5855C1lMk37M21k08n2k4L79j29O9j96j43K20m59P58m83K0J0k12K61k98J86K91
5878B06l29N5jL8J74n29J29K47P2J24J51q68L44J34k74J09M34l3l23J53l99L70
5900a6l31L65J70k76J83m3r3k4N4Q5K98k46K8j14K8J39j23oN5k17J20p3j11J50
5924BJ22J8K7k61m30K51M6J28Q5J64K4m66L93l95J12M14m3l01j8J16L29m51J01
5947c3j28J62J81k7J20j70k02j32K64l42M90k84K37q7m36P56n68L26R9l66n0K37
5969D7q5m13O52J83q84P33K39l42r6L71k93m59l94M79R1Q25j72p94O76o6o63J36
5991b29J01J8K6p7k48M46j37P3Nj00J3J15r6K29Jq3n5j12J47N9k03j8M9Q7l45
6016c34J95K93k83R9r4j3QJ27n8p1J2J88Qr5k65M75n31K29J20k53K21Q6k10J99
$$ y = [31, 28, 32, -205, 216, 8, -44, -68, 311, 182, 251, 55, -88, 132, -327, 431, -52, -32, -22, -234, 27, -271, -85, 206, -123, -68, -69, -31, 143, -386, -257, -10, 62, 186, 337, -531, -187, -53, -327, -218, 216, 183, -140, 13, -386, -16, -347, 18, 188, -88, 95, 52, -41, -65, -11, 74, 372, 126, 154, 40, 68, 207, 84, 78, 133, -84, 36, -37, -148, 2, 124, 142, 169, -92, -522, -271, -225, -97, -12, 152, 176, -290, 103, -292, -180, 234, 191, -110, -128, -12, 317, -134, -33, -161, 1, 182, 155, 275, 105, -97, -229, 35, -307, 183, -101, 136, 49, -387, 369, -199, 127, 226, -140, -190, 47, -38, -451, 201, 384, -500, 233, 472, 130, 34, 405, 112, -347, -741, -262, -171, 654, 482, -312, 364, 298, -365, -229, -128, -110, -84, -161, -409, 37, -100, -27, -22, -122, -109, 6, -90, 139, 140, 57, 2, -110, 37, 96, -107, -125, -76, 11, -334, -139, 154, -129, -30, -124, -137, -129, -2, -60, -131, -119, 69, 77, -18, -283, 192, -339, -110, 10, -243, -22, 64, -146, 53]
6040E3J8l3J01k01L22k77nj59J34J79J83l02K35k49L6J34l7L9j09j05J49j36o
6063c6O3Q4J28l26K87k27n7k4L26k95k86M15j2O2pj00K9k72L73k63J4K84j9l9
6087A02j3p1Kj58NJ33L7k48J58Ql4m5p1K04OJ31k0j48k0K77l51K10j31J6n8L8
6113d1Q1P7q5K48l10L07j86j96J47j18L3J9m2rj84L73K1p2N1j65J00L4j26N7J4
6138B8o7j42K52l2n8J00j15j83L88l4j70O7qP4j77J19k41K03M1r1L5O7j60K99
6162A95k08p4P2J90j44l2o2R5m5N1r0K2O9j19m3O5k2J2p1K67k05K83j81j18K75
6187A82l86K73j34J92r4Mk27L00Q2P1j50J8k69K90j50Pj66J70Q0p3J73k00n5q8
6211a50K30j5m5r9J56k50J79l0k33K37J33l8k17J09M6K5j32J29l5j45J22rj57
$$ y = [53, 71, 38, 139, -62, 260, -17, -22, -181, -47, 132, 315, 13, 248, -1, 35, 169, 132, 171, 62, -43, 106, -30, -36, 27, 111, 239, -87, 200, -27, -84, -108, 218, -77, -363, 52, 40, 102, 95, -5, 24, -248, 125, -138, -124, 160, 141, 102, 89, 18, 20, -138, -133, 0, 37, -211, -53, -45, -79, -124, -195, 9, 15, 146, 126, -22, -42, 235, -116, 94, -37, -21, -79, -41, 40, 117, 32, 280, -30, 277, 91, -105, 42, -76, -43, -24, -66, -75, -259, 114, 135, 63, 114, -51, 49, 83, -43, 14, 28, -39, -181, 71, 39, -19, 81, -34, -217, 171, 137, -33, 34, 26, 100, -77, 42, -199, 4, 45, -46, -11, 56, -104, 195, -13, -87, -15, 175, 31, -1, -63, 32, -13, 38, -52, -30, 39, -80, -123, -58, -80, -68, -139, 128, -77, 206, 25, -93, 182, -204, 69, -65, 127, 33, 37, -190, 110, 192, 263, 113, 131, -138, 152, 2, 9, -157, 13, 93, 20, 193, -7, -62, -150, 80, 65, 20, -79, 77, -173, 6, -24, -257, -20, 113, 75, -142, -33, 13, 38, -94, 35, 0, -145, -23, -32, -189]
6234a89K60K44o53J62K10Kj60J90j6r4l6n2J96m7k7J92l09J99N1j15P2Qj31p6
6258a19K28m17K35J59k24L5J9M1m7J73r6J39j48J82p3M3j59r0L4N9K2q4J42J14
6282A68j87r7k59K16N3L6L61k22l7l9k86L11n5J53l01RR5P2k34K04lQ6J08j58
6306fj2M8pN9j8l33L71j25Q5j32q3R6j57L43j08q7K79l13j11M18j75r1q0P4O1
6331dj70J36j12j64L18P1R2Mr9K2j58j09o8L94j06j13k6J87j28K93r8k62M34l36
6355bK3j36j5J79p1K26l24o3J00OK43k37m3R7k89M40r5o0O9j55L36k40k83K17
6379g7L23l08r7OJ68k18K36K09m10K67j7Ok61N7Q9K28k37j66K24j40L46k34q8
6402i4Q7J10m4J34l07o0J01P6J4j12j6K41q6k28j6J05M67m40L00k50j79r6L60
$$ y = [-189, 71, 315, -338, -176, 34, 36, -124, 66, 50, -44, -80, -132, 64, 17, -10, 182, -127, 72, 123, 8, 80, 88, -43, -119, 109, -308, -73, 86, -138, -103, -84, -43, -90, 83, -13, 126, -22, 160, 87, 130, -29, -119, -85, -26, -4, -88, 54, 168, -19, -116, -375, -159, -106, -70, 291, 69, 32, -7, -293, 18, -37, 116, -185, -176, -81, -9, -243, -39, -42, 44, 152, -6, -18, 30, 23, 82, 64, -269, 102, -23, 62, -70, -153, -57, -214, 129, 21, -66, 213, -100, -211, 207, 32, -59, -139, -65, -4, -174, -38, -150, -314, 4, 75, 167, 171, 72, 94, -64, -173, -241, 153, 47, -66, -92, 95, -33, 260, 162, -100, 334, -2, 21, -115, -130, 49, -22, 204, -120, -183, -83, -77, 166, -71, -114, -17, -306, 134, 39, -21, 48, -107, 229, -11, -294, -77, 246, -62, -159, -153, 15, -203, 33, 242, -168, 99, 82, 88, -173, -116, -27, 201, -36, -202, 22, -118, 228, -6, -94, -7, 103, 59, 193, -114, -174, -73, 3, 17, -95, -111, 130, 44, -184, -200, -95, 372, -68, 232, -18, -197, -293, 67]
6425F7J1K12k74r4m7j23O5K33N04o83K35K96n36o54J184l95q25O42P58r11N28
6446A93L2j8m16J68o9p0J77O7J26Kl06L41M0m42L35k91N8l1q3M7K41k7k88K80
6470F6l68J28N58l38N5K40l47j60M23k61J73j27j82K9OK8K86j70L43l32m11J90
6492a71K64Q9k20j00J48n6K4M48m91Q2L87o40J50N0K48m78J67J96j29n1l08K09
6514a82J5K29R6j23L11n61L73k26J25k4k34K41p6O1P9L1O3n0j75J2J71m84K52
6537g6J38l16K72p9j26M4J82j79K39J4R2n06L01M1L03o13K78J68j46K78n69L22
6559F2Q9j20Q5l32L11J8l13L95l61P2J15R3J00j36km55Q8L67L8j78O9J55J1k42
6583g1mn7K79R6m37P6K15j13M85l51j77L6m97R17p19M38j18N10p9o41P7j55M55
$$ y = [67, 78, 290, 16, -78, -125, -248, -183, 50, 554, -129, 106, 402, -134, -788, 396, 1, -824, -182, 576, -335, 193, 225, 207, -209, -41, -110, -180, -3, 64, 190, 192, -114, 227, 267, -175, 160, -131, -73, -104, -187, -140, 101, 74, -214, 66, -302, -174, 384, 46, 101, 341, -6, -166, 257, -4, 169, 42, -140, -111, -105, -77, 209, 39, 382, 50, -361, -171, 93, 182, -38, -138, 10, -46, -22, 426, -65, 17, 404, -236, -86, -36, 212, -266, -99, 97, -32, -83, -391, -182, -167, 62, 158, 35, 346, -215, 158, -68, 57, 33, -201, 40, -36, 25, 104, 135, 198, 148, -27, -15, 156, -328, -76, 62, -254, 18, -61, -187, -143, 39, -140, 99, 113, 205, -301, 0, 41, 344, -269, 9, 177, 31, 309, -260, 62, 151, 31, 116, -216, 95, 113, -200, 195, -166, -94, 21, 114, 214, 78, 76, -379, -291, 76, 114, -64, 5, 160, 171, -71, -75, -132, 147, 243, -194, -118, 97, -16, 469, 118, -59, -23, -520, 397, -322, 116, -2, 508, 429, -212, -135, -290, 165]
6606A65l40L07l00L8K4K38k53M42j12l93L45k61L08l59p1J13R0O5p98N46K50j42
6628i8N83k83q7M52j320J274p44L95O9p08M97l43N1N10j92O08p99J65j10L41l59
6649i8Q0M52p5no50k02N12k06K32n07O13m68N04J29o68L20J16L61m81q0L43k58
6671c6L42j49P90n64m71J58m75l91J172j023L50R59j093J92k29J041m37J73j284
6690i75Q87m55P86k12k27J70M04n50M45j54o82P88L54p83P3J47J16p0j45K95l31
6711a19L42l01L21J44m46J9M68k97L7M9l6O1l02K5J21j85K1p0P1J24R3j81P4j33
6735a00J24k60L28J05l68O1N4J84j21J9j15J40j8J39k9j23J18O0k57mMP1R8j15
6759ek5j19R5N3O7q1m0o5p9M00l64J73O1M4k15J71Q0k81K28k63K9J55K3M2j69
$$ y = [165, -175, 132, -168, -130, -106, 132, -121, 321, 209, -184, 161, -100, 208, -151, -222, -109, -19, 46, -752, -206, 44, -98, 485, 202, 115, 567, -753, 521, -223, 172, 241, -467, 30, -313, -262, 248, 56, 664, -135, 30, -80, 261, -98, -18, 434, 359, 354, -296, -498, 14, -192, 40, -467, 146, -322, 182, 311, -357, -37, 79, 440, -41, -121, 222, -36, 306, 157, 947, 383, -88, 70, -405, -796, 376, -647, -297, 662, -431, -239, -468, 573, 136, 309, -975, -88, -543, 243, 31, -196, -26, 378, -172, 273, 119, -563, 225, 579, -204, -131, 16, 132, 62, -83, 212, -119, 223, -78, 243, 387, -59, -40, 428, 131, 168, 217, 181, 242, -60, -35, 86, -99, -78, -148, -77, 47, 140, -41, 33, -100, 24, -236, 92, 197, -171, -110, -56, 128, 7, 26, -89, 51, 33, 172, 143, 20, 138, 198, -59, -63, -59, 12, 110, -5, -30, -149, -54, -1, 66, -15, -55, -120, -199, 201, -163, 10, 71, 115, -100, 71, 151, -130, 98, -165, -136, 19, 42, 84, -85]
6784h5rJ41M0J44m13L55k9j80O2O5m57N12l69J02L22p3j31M8m6K8J43k10J29l8
6808E1k42N6K1K29N0r7l44N32m55M73k82j59L95o16L39j91K78K79J32n1k54j47
6830cK7l6j49K55l01L06k71M26k86j76M29l75N16j90j49j11K37q4q9o1J25o2q0
6853a02J37p5j02J94J60k34J94K45j60j25j23J1J30l0p0L7l05K74J38k75J6j00
6875a65K96j02P4j19K63j83q6J77j87j54J08j52N1J94k25L19l29L01l44L23j70
6896a10K48m8JM8M4k02o2K11j52P1j73M9r0K76n3j51p4K11j05J02P8J14j29m5
6920E9J57m08Q8L7J84k00N2K73M0k47o6J2j67K39L2o0Q6J54l07L50l46O9K82n38
6944b25L54k98J98Q7M5m49K76j32J3L64m19J10L48j98N9J54j13K3k67L9J79l7
$$ y = [-85, -94, 47, 87, 231, -182, 173, 144, -36, 26, 91, -366, 146, -223, -121, 201, 128, -3, 45, -1, 27, 170, -40, 89, 51, -191, -135, -114, 115, 165, 68, -276, 256, -199, 274, -8, -167, 228, -388, -49, -240, 38, 317, 449, 398, 144, -3, 24, -12, -161, 94, -207, 99, -172, 254, -32, -208, 221, -154, 362, 172, 23, -88, 149, 65, -24, -85, 40, -22, -102, 35, -40, -142, 52, 212, -22, 172, 417, 257, 132, 9, 20, 150, 120, 50, 87, -218, 56, 194, -81, -65, -165, 131, 29, 103, -16, 247, 64, -22, 155, -32, -186, -78, -230, -179, 15, -210, 109, -220, 81, -263, 60, -110, 138, 90, 91, 139, 183, -19, -81, 130, -22, 49, -124, -75, -165, 111, 58, -93, -167, 44, -61, 41, 119, 233, 104, 59, 216, -192, -104, -67, 117, -83, -31, 242, 282, 35, -31, -19, -186, 53, 85, 25, 111, 265, -42, 308, -38, 31, 313, -225, 129, -169, 29, 116, 161, -288, -12, -144, -131, 233, -186, -76, 272, 74, 133, 287, 174, 197, -70, -31, 148, 111]
6966A11j06Q4K7k35J4J83j84j2M5p6L03j80j64J51j3O1L1J02P6l91K81q3j89J82
6990A8M4k47L79j50J46ll72K35o2J74l93M67j74k48J30M4J48k91K70L4K23n82
7012b10J38P2j33K05Q0j72N1J53j18j06m4r1J39K35l43oL90m11O6J0J04oo2O3
7036Dj73J64q1j04J1J33kK02O0j52p6m3l2pJ68j51J90j28K1O0Jj80J69k51K32
7061C5n5J32j97J11K37l05o1J26J06j54m7Q0j11M22k52j14J78j33j68J98J60m1
7083A47k94L28r9k65L21l58m8L13m5j70K14k05J41J05r9r0N8K2k48M04k7j12K08
7106B01k32q3j42J00K01m3J31J05l49K51k43J54J08k64L99p68N19p6J88L2r6p8
7128A5L5j34j02L41k34j24L1K75l42j65O07l84N96l60j45J33k48j35k18R19N5
$$ y = [111, 5, 89, 116, -119, -105, 78, -106, -118, -73, -149, 154, -26, -190, -39, -52, 9, 40, 142, 218, -173, 108, 25, -164, 18, 62, -185, 194, 44, 190, 187, -185, 50, -12, 162, -231, 236, 62, -186, -56, -12, 136, -155, 115, 149, 372, -210, -72, 0, -133, 72, 152, -20, 31, 184, 66, -40, -84, -175, -36, 199, -144, -150, 240, -171, -105, -95, 9, 3, -59, 4, -169, -5, -86, -190, -179, -46, -48, 154, 214, 62, -14, -57, -89, -96, 72, -79, 111, -17, 4, 64, 65, -115, 54, -197, 35, -20, 112, -85, 26, 263, -42, -103, 23, 129, -25, -72, 8, -103, 319, 67, -47, 131, -2, -170, 28, 188, 147, -147, 181, 82, -183, 138, -220, -268, 45, 0, -170, 44, -161, -20, 85, -14, -104, -46, -24, -272, 132, 105, -7, 201, -31, -114, -256, -156, 45, 2, 133, 238, -111, 140, -103, 51, 159, -105, 294, -474, 45, -31, 157, 189, 93, 15, 50, -84, -186, 155, -79, -203, -172, 103, -239, -404, 203, -181, 415, 55, -90, 43, -205, -340, -558, 361, 416]
7149D16l41K03K08m34L7n3J47L05o76N46l14k54j00J04J81K68j84K85p50M82j00
7170b4m55j49N97m4L04o71J079j55l81L30q06J34K22r8L88j69n5j90J60j06k5
7191a14M37q84J411j108j37J84O6p89R17k63J40N90o45L48O5k69j46m57O49m66
7211d71p5L61K08q43J256q46M58N58q79L88r6k45L55j59m63j13O59K24p0o85K09
7232b69N77j59l04P34m04j166J481m76l43M28n74Q51k81o74K64j52r4K92Q72q08
7252b05K6j39J69L66j49K28q90k16M21N78l38j61O68l49l27K72k47J23K38O5k74
7273a41O4K7k43j8K30M65p04M10J68K0j24j34N1n53Q71j96J72j022P75l36KL22
7295A06n03N78j16l15M34n44J46L94k79J49O3j24j70L89m72K83J05k15k68M64
$$ y = [416, 75, 278, 486, 52, 89, 36, 183, 488, -188, 358, 44, -210, -310, -206, -25, 243, 59, 344, -406, 76, -24, -479, -628, -31, -75, 229, -442, 637, 482, 101, 431, -375, -241, -19, -117, 271, 102, 47, -143, 17, -89, -114, 323, -561, 850, -258, -395, -211, -145, -934, -17, -280, -140, 450, -195, 153, 218, -51, -197, -654, -5, -471, -546, -185, 23, -820, 436, -410, 48, 606, -273, 115, 19, -226, 129, -30, -493, -606, 53, 277, 207, -478, -269, 308, 149, -155, 579, 175, -991, 490, 14, -329, 99, -475, 376, 95, -579, -315, -467, -561, -269, 603, -205, -179, -318, -149, 217, 68, 296, -594, -810, -389, 189, -149, -310, 358, 9, -318, -46, -293, -170, 68, 133, -141, -77, -50, -293, -311, -81, 384, -320, 90, 258, 278, 154, 20, 71, -482, 389, 193, 365, -657, 118, -218, -216, 106, -397, 181, 65, -250, 184, -360, -214, 180, -99, 50, 113, -11, -181, 208, -264, 19, 124, -91, -359, 105]
7315A05l36K95O6l91M0J5K24K39m08N5n7o1M13m61K43L4m41M66m40M96P2l82k59
7338d73P15j62j53J45k09L77j27k56J26j06m6L42q6k19K66J67j84j36j15K76j73
7359c1R1R7o5k60J04K53o6k59J19R9j70l2OL0J80m0J14k91L17j56k11m4M28k66
7383e3j01J73K8j85K98j50Q5l44K05K31l81K77m2m9m0J05j51J40j85p4Q7R3k52
7406b85L91j68N3Q1q6r0K60j94K88m12K62k13J38j57m4K99j25J18j55L0p6K40
7428A55k20K01m9j41j14L01j02Kj22J46j00n9L09k38L11j20j98R3o5N6k12J22
7450d4K99m44J54K13j24m2K9n4L8j79N2J87K8n1O8k39L62m2j57j53L26j69O6k12
7474h8J0l1P6J49k21N0O3R0r2j68J04J9j37L9J43k03K71N0j63K8K3j35J97q1O4
$$ y = [105, -231, 64, 130, -261, -221, -206, 18, 257, -151, -96, -153, -214, 199, -262, -19, 15, -426, 40, -400, 96, 168, -214, -473, 242, 80, -73, 72, -137, 240, 113, -143, -17, -123, -169, 173, 87, -132, 134, 301, 117, -19, -134, 142, -31, 60, 157, 92, -168, -64, 189, 123, -136, -17, 82, -88, -120, -114, -84, 96, 56, 170, -121, 196, 40, -171, -215, 213, -53, -154, 19, 47, -138, 160, 10, 95, -249, -44, 187, -194, 83, 41, -8, -48, 57, -94, 46, -139, -213, -126, -33, -285, 106, -62, -9, 72, -14, -104, 156, -38, 250, -162, 100, -113, 25, -132, -176, 123, -2, 116, -39, -9, -85, 155, -65, 136, 87, -54, -168, 133, 31, 33, -89, 57, -43, -102, 207, -31, 280, 160, -38, 55, -10, 46, -166, -44, 255, -189, -35, 178, 54, 12, 41, -13, 25, -154, -102, 85, 113, 62, 130, -109, 253, 211, 54, -99, 227, 58, 124, -88, -78, -109, -33, 116, -105, -55, 8, 98, 6, -162, -58, -39, -176, -137, 6, -197, 74, 124, -39, -11, 12, -123, 74, -7, 57]
7499E7Pk34J60j05K94k17J23J33j12k05J70j28m3L43k89L30j96kL7r1J7K2n8l4
7523b1R5n0om1K35P6j64l7q2R3k28J42k7J14q6j18k1J16J8j50J25j72Q1K62k3
7548A31j73K0O5j03L0m6j12L06l26M30m16J56J08q8j07K62j34r0K01k04J84j58
7570f4J82l89J88Q7K5l94L85R0j47j16K37Nj69J82k24M3LK9J36J1M1j30j60J12
7594c7J10l5l8Q6K3R7k96R8j19K09R0%m28J20N7n3K06kj88K79l6p5p9l5J11J51
7620B16m21L57j46N0K2j95K30j48J8J6r9K19l77L39o4J12j3j24J7Q3K31k75n7
7643ik41L31P6k48n5L85k76k3J71j03p4M58m33NM9j4J21qj48J0K9qj2M7K1K03
7669B54l09R6j33N5N2L9L52k66j31K45l08J59P4o4k53K03J10o7k89J99J43m15
$$ y = [57, 64, -170, -10, -115, 179, -38, 85, 218, 106, -99, 71, -57, -100, 243, -46, 284, 88, 86, 123, 32, 49, 71, 13, -21, 74, 24, 18, -23, 212, 288, 124, 87, 5, 98, -130, 12, -15, 99, 13, -105, -126, -10, 8, -142, -17, -189, -108, 154, 131, -42, -22, 43, -60, -30, -76, -188, 118, -208, 222, -194, -38, 70, -18, -125, 137, 3, -87, 114, -90, 94, -64, 118, -271, -83, 4, 29, -365, 20, 110, -37, -153, 84, 89, -80, 102, -122, -79, -76, -47, 89, 100, 141, 11, -149, -37, 73, 38, 0, 86, 109, 206, -90, 8, -111, 98, 188, 188, -240, -120, -63, -116, 90, 88, -100, 179, 143, 68, -11, -46, 65, 216, -205, 152, 6, 56, 78, -117, 113, -35, -17, -1, -100, 119, -258, 81, 17, 129, 116, -8, 9, 92, 323, 48, -9, -250, 81, 157, -91, -146, 239, -37, -60, 111, 8, -66, 392, -41, -36, 13, -1, 120, 112, -36, -26, 3, -5, -17, 30, 51, 254, -55, 41, -92, -37, 15, 54, 406, 140, 9, 254, -54, 105, 179, 115, -138, 65, 175, 108, -181, 18, 161, -254]
7691b54L87Qk44J34m5r4J8J15j96K14j20J32m35K69L1j18K30J21m30L51J9k97
7713b04L2mK97k13nm9J99r4j01Q2J13J5p0k07K61j23k95N22k10J75j95J72o3l22
7737b87K33J28l2J76j95J04k02J22j29L59j02n15J95K41k57R4n5L36k91J13j64
7758a28K5J42R1k8j39j44K10Pj57K94k75k0J46K42k06J92o4j44r2O6J72l17k6
7781a53J09J15p2J0j04j04K96J18j83j07j35K91j33j57L70k98j27J09J87l28J62
7802a34L14l93J00m79N38M0j77J41M8K0j77Q4J28l88kL25k96J67K21l1k29L65
7824A85l59K19j95k7M33k03Ll47L12j51J38j88N0k55K53O9j36L8L25l11J45m32
7846d34L99K45J09n77l4K89k76O8N32m23K78q3j4N80r38l69O03l07l32J101n88
$$ y = [-254, 133, 141, -103, 31, -14, -108, -90, 25, -171, 43, -77, 55, -380, -111, -80, -198, 32, 153, -277, 74, 93, -204, -172, -176, 121, -92, -97, -146, 53, -41, -142, -60, 53, 68, -2, -209, 52, -71, -366, 156, -54, 121, -74, 98, 35, -287, -54, 74, 42, 218, 23, 127, -75, 47, -82, 277, 175, -340, -145, 96, -161, -67, -122, 214, -77, 36, -128, -103, 39, 130, 102, -37, -181, 29, 36, -121, 173, -102, -122, 24, 266, 60, 252, 188, 44, -48, 18, 190, -127, -153, -44, 71, -1, 9, -95, -199, 97, 215, 32, -75, -210, 81, -52, -209, 161, -137, -264, -155, 32, -296, -134, 180, -213, -113, -592, -54, -14, -191, -50, -2, 18, -159, -75, 53, -335, -337, -12, -308, -141, 80, 49, -180, 185, -174, 45, -150, -177, 256, 53, 56, -291, 21, -130, 8, -180, -130, -385, -132, -63, -199, -161, 164, -147, -2, -434, -35, 210, 319, -258, -292, -3, -279, -211, 321, -102, 176, 93, 79, 659, -279, -648, -45, -352, -684, 417, -171]
7867a71J3O48m67m28R42o89J91l0l56P9M26r18M67N79m72m29N0M89N80j015P12
7888B01n0n39J73p01J360m58L08l52k50L96j97L05k62r8j70R0l11lP03l2k59Q0
7910f6J90k54N2j8M8L17k08j34p5R6P8J7j59l6Q6kJ84m43K27r1M1J07J71o5M8
7935A11j89m8R6m3J54Q2m1J60l02J54k65L2J13k29L0m9L23j50J1J32J5p8j1j88
7959a80N29l69Q9O7k10K08k33J66Ko5J68k10L7M5J5l19K76J39o3j28j00J98k4
7982C8j39j00L29j60J6J5Rl9R0k15R9K64j91j06L20K9k35J45l44L0K05L4l13L54
8006A35Kn1j06j72k8L72l63K33n9j61J58j56L7J26L4P1r6J21m8k8j43J16l1M5
8030HJ6j93J39r7M02k19Po7Kp6J58j37Ol5K98o7J51m27K06J88j31k12J90j67l8
$$ y = [-171, -158, 490, 23, -405, 537, -152, 39, 9, -347, -268, 158, -760, -293, 286, -186, -615, -565, -76, 504, -511, 201, 151, -388, -215, -916, 444, -14, 294, -58, -308, 88, -109, 196, -66, -164, -334, -244, -555, -558, 145, 113, -146, -66, 124, -130, -78, -96, -48, 269, 61, -73, -148, -52, 26, 43, -116, -152, -66, -68, 116, -327, -100, -191, -150, -43, 128, 63, 111, -78, -126, -30, -73, 81, 163, 122, 282, -20, 134, -131, -99, 14, -215, -185, -234, 89, -61, -50, 82, 97, 19, 8, -180, 349, -20, 69, 136, -74, 134, -99, 67, 69, 4, 172, -38, -1, 44, 59, -260, 16, 155, 92, -36, -136, 62, 38, -101, -201, 128, -32, -16, -1, 8, -31, 59, -156, -57, 207, 16, -90, 230, 259, 24, 169, -175, -145, 60, 94, -219, 135, 137, 86, -20, -192, -220, 152, -211, 22, -37, -198, -40, -196, -159, -33, 1, 72, -24, 97, 49, 21, -122, -6, -37, 8, 24, -169, -30, -127, 275, 56, 63, -4, -2, -78, 80, -57, -51, -86, 212, 145, 296, -131, 75, 263, 132, -80, 110, -57, -95]
8055i5j00J40J87Rj55J68j77K22l04J31M5k08J20K2j94L26k1j73J09p7R0J7q4
8078bn7K97l61K39j49K80k20j02K94l30J99j76K03Pj04P0m4l0L3M4Q1m57J22K41
8102G8r1J06N7k93O9L48r7K7k50j00K32Mo1l0P8l7j56J94r0K44j61l4J4j29O9
8127ik61K37j26J41k9O7p1%K46k85n7K79k02o7J96j0Rk40K47j45J39j23O7J13
8151A16n9j44q8J15K27K0o5k29k0Oj4J04q7K80j09J14j33P6k37p7P3J40j54J31
8175a4P4j71Q8j91R9p6K71k32J30l5J24L17l92K09j96n3
$$ y = [-95, -195, -55, 132, 141, -14, 154, -23, 199, -105, 26, 71, -137, -17, 5, -189, 137, 116, -57, 52, -25, 65, 82, -2, -59, 238, -123, 116, -33, 247, 27, -75, 219, -111, 88, -88, 115, 122, 18, 88, 44, 14, 47, 91, 172, -285, -163, 78, -13, 93, 150, -143, -74, 274, 177, 204, -46, -146, 86, 90, 29, -1, 77, 40, -116, 78, -12, 232, 71, 37, 51, -78, -9, -270, -33, -159, -18, -47, 20, -51, -51, 195, -90, -147, 132, -70, -137, 59, 49, 58, -182, 65, -80, 59, -64, 3, 116, 57, -87, -175, -60, 167, 187, 122, -107, -127, -121, -135, -31, -118, 162, 53, 167, 34, 110, -127, -204, -131, 9, -145, -14, 60, -111, -23, -214, -115, -191, 80, -152, -22, -57, 67, 384, -8, 201, 5, -48]
8191d8
$$ Imaginary data points
##PAGE= N=2
##DATA TABLE= (X++(I..I)), XYDATA
0@%%%%%%%%qQqJ6j6K4l2M0n0N8p2Q8j08J32j58J88k22K57k97L45l99M60n27O03
32C22o87P78q79R91j114J251j400J564j744J940k157K390k643K921l225L558l921
49b055M321m762N247n782O375p038P785q629R592j0709J2016j3568J5452j7796
63i551K0806k4833L0535l9323N4815r0489L34661K36802r6467O1310j89604M5296
75C33958l7228p9117o448L163j09678k5189k2423m1706n0615J4544l4156k2719
87g7614J9199k4770m3636K6479j2757k0525K7610P666j8861L0676q054m913L1070
100f8430L813l725K4002N935J4501R922j0517R240Q945K910N323l049M668k70
114C268J719q243m71K1061j323m999J4248j3503j883J4482k9918j258J4888j6897
$$ y = [0, 0, 0, 0, 0, 0, 0, 0, 0, -8, 0, -8, 8, -8, 16, -16, 24, -26, 32, -40, 48, -60, 72, -86, 102, -120, 137, -160, 185, -214, 246, -281, 322, -365, 413, -466, 525, -589, 662, -738, 826, -918, 1022, -1135, 1255, -1388, 1533, -1692, 1866, -2055, 2266, -2496, 2751, -3031, 3344, -3694, 4091, -4538, 5054, -5655, 6361, -7207, 8245, -9551, 11255, -13578, 16957, -22366, 32449, -58040, 276621, 513423, 416956, 478266, 288662, 333958, 296730, 217613, 211165, 214328, 104650, 79461, 57038, 15332, -35283, -20739, -54895, -77614, -58415, -83185, -126821, -100342, -113099, -133624, -106014, -98348, -117209, -86533, -94587, -99500, -68430, -64617, -68342, -44340, -38405, -23904, -13982, -24499, -15259, -6314, -3404, 1919, -1130, 3538, 3268, 4987, -3256, -3727, 17334, 16011, 11012, 25260, 11757, 9874, 24356, -5562, -6820, 8068, -8829]
128h829O732Q372j5752n62L100j8190j726R087r400l813J0209l406m500J2299
142a6379r851l985K0804n96k870J8749k66p857J6503r850o401K2110r203n034
156E874J7995r736l270J4761j7647p185J3331r154p975P325m915j5312R205j440
170h143j7770J7100M015j8657J7061P183j9377J8011L894j8566J9846P678j5874
183c599J2114J1269j7422M909J0109j4748M001J2988j3749m054J8592r828p254
196C328J5344j0095n879J5995q927j2384J4543p188r643R479m141l351M707j97
210A591m786M484N057m398m14N775j882k478N932n654n73L060o621M50K32k168
226b393k437m132q0K646n906J829L159p851P131K514q392N236N597q194K245O519
$$ y = [-8829, -2097, 6275, -9477, -10039, -6939, -25129, -26855, -17768, -27168, -30981, -20772, -24178, -28678, -16379, -26230, -30215, -9411, -10007, -12877, 5872, 5606, -2251, 14252, 4402, -1999, 20111, 10908, 5874, 23869, 14133, 10863, 25624, 7977, 792, 14123, 4969, -3006, 4319, -596, -15908, -6703, -8143, -25913, -8813, -4798, -23455, -6394, 789, -18588, -577, 3317, -15249, 4597, 12275, -3599, 8515, 19784, 2362, 7271, 17380, 2632, 6633, 19621, 5872, 1818, 20410, 10582, 3328, 18672, 8577, 2698, 18693, 9766, -2618, 11925, 4737, -4906, 4573, 432, -2919, 1788, 1591, -3195, 1289, 6346, 1948, 1534, 7309, 5427, 2949, 8881, 3227, 2654, 5714, -907, -457, -225, -2393, -4830, -8962, -9042, -6396, -12302, -10473, -7314, -15165, -8034, -5520, -13912, -8676, -3079, -11273, -9028, -2509]
242b509p507K754M132o644j271Q440l686o200R596k166m526Q404k272o247J1049
257A347j829r757J2162j885q640P719j528o789Q951O96q944Q883K489o244O259
272B890L134n556O292L542r112P277L287q807M280K070p730N712K768j1041O523
287E529L442r977M048M733p517L952O125j0548M217P476r735j393Q301p386k280
302a013R431j0139p19J0930q770k541J0157n559l082R187p309k143Q532o227n803
317e068O035l71n363M763k697l123M848j954l808J849K726l917K712m18n58L201
333a143k327j777L353k321j208L762n027K245L721o149J679L270m379J313L922
348a066n297L247O177o374M26N838l575k307O560l780k060J0711n923n709J1512
$$ y = [-2509, -10016, -7262, -3130, -9774, -11045, -2605, -6291, -12491, -2895, -5061, -9587, -1183, -3455, -9702, 1347, -482, -10239, 1923, 38, -8602, -883, -2411, -9200, -249, 447, -8497, 386, 2875, -3369, 2890, 6024, 468, 6760, 10302, 1190, 8467, 11754, 2947, 7227, 9297, 1567, 7279, 10047, -994, 5529, 8971, -1006, 3042, 7775, 258, 4210, 10335, -213, 4004, 11480, 1745, 352, 8653, 1267, -1013, 8418, -1721, -2440, 8490, -280, -2821, 7336, 1777, -1305, 7882, 573, -1570, 6962, 735, -5068, 967, 596, -4767, -4, -2701, -5824, -976, -2930, -6738, -4889, -2163, -6080, -3368, -3786, -4344, -1143, -3470, -5247, -1894, -4215, -5423, -1661, -6688, -4443, -722, -6871, -5192, -1922, -6301, -4988, -1066, -6363, -3116, 3061, -3313, -2887, 2951, -624, -2931, 3629, -151, -2211, 8500, 2577, -3132, 8380]
363H380l247p658R215l400m737J0234n025n287Q583k5q352M418N19p436M424L74
379I80p014L293M000q511J824N043p594M012K528o234M832M648p086L706L751
394B178o085L110q21m427L710K505l955L062K221l172K203L96l105L583M223o242
410f16K150N070o701J985J323p042L597M504o891K849N045m693K490J878m004
425I44K143M332m030j090N288m482p86L976m043m73N321m539k219N759m473k131
441e03L159k339N37K233m568p60M065m504j379N53j622K236J460k475k18L504
457f21j481j541J237j014q17M674l531m087P891m275k911O276m077J8O238n072
473c093r18O453n270k155L471p75j404K491L18l300N306J031o456M145M873m542
$$ y = [8380, 5133, -2525, 6690, 3290, -1447, 8787, 3762, -1525, 7058, 7033, -1319, 3099, 3618, -3818, 606, 980, -6034, -2741, 1259, -7252, -5428, -385, -7979, -3967, -1439, -7673, -2841, 1807, -5279, -1573, 2178, -3907, -797, -1618, -6045, -2335, 170, -3785, -723, 1498, -1674, 529, 925, -2180, 1403, 5626, -616, 1534, 6604, -97, 1888, 3211, -3831, -234, 4270, -2621, 228, 5273, 580, 3070, 4948, 944, 3087, 7419, 3389, 2299, 7587, 3105, 2319, 6295, 2252, 1779, 7100, 2561, 342, 6101, 1628, -503, 2656, 317, 854, 3087, -1481, -2241, 1824, -2680, -4059, -3506, -5128, -2892, -1432, -3907, -4125, -621, -2102, -3643, -2406, -3420, -4237, 437, -3094, -7181, 710, -3565, -6476, -200, -4277, -4259, 1979, -3093, -4011, 2442, -2828, -4983, -1512, -2287, -3691, -1200, -882, -4182, 1124, 2155, -4301, -156, 4717, 175]
489A75K358K700o134M743K733p734K132M319l021J775J083l827L309n3k987K82
505A853P33J453k168K65k9j393N95j114j380K782j184j127K694k136K811o23l403
522a371N028q62k516K061k383j321M008l656k939L207O06j235o32P08k166J789
538a674K073n356N25M211l570j919L956m572k92N774n298j57N845l891n33N830
554I52m786l13M362l207N85K638q81k503L067J241l922K926K27l365M559K02n758
571c976M501l44l077L526k653r14L292j000k427J505J323j725J891O26k988K168
587b72K663m514R20K449m211K173J491l589J462K452m382J820K437m039J906J128
603a06k254J631O62k582R18J621p02j157L71J420j637J866j141j913L970k76k136
$$ y = [175, 2533, 5233, -901, 3842, 6575, -1159, 973, 5292, 2271, 4046, 5129, 1302, 4611, 4558, 1571, 1853, 2586, 4039, 1871, 2136, 2107, 714, 1309, 195, -1185, 1597, 413, -714, 1980, -156, 2655, 2032, -1371, 3657, 2795, 279, 2340, -43, -1364, 2644, -1012, -3951, -744, -138, -1373, -2005, -1297, -3463, -1674, 399, -4957, -4432, -221, -3791, -5710, -1754, -6326, -6618, -844, -6142, -6299, -454, -4345, -4878, 952, -3834, -4147, 215, -2992, -2407, 231, -650, -3153, -86, 1155, -2767, 159, 386, -2979, 1580, 1782, -3976, 525, 181, -2896, 630, -2023, -2937, 355, -645, -3072, -1567, -244, -1969, -78, 548, -2440, -272, 2391, -2123, -1203, 1246, -2965, -792, 699, -2890, -1428, 1024, -3358, -1538, 899, -3140, -1234, -106, -2360, -729, -67, -2649, -1731, -110, -812, -1969, -1598, -178, -1815, 51, -1090, -3003, 967, 691, -1445]
620a445J795n31K45J466k185L10J207j298J670j406o74K098j065j086J880N1j343
637c11K235p35j797K633m54k964K664J930l779K475J397k911K943J059n213K520
653A692M393o799J562M020m595J734L511n315P24N793m657j628M849k629k212
668D43M088j707l638O641k104m716N994j669l887M518j092m607M679j550m258
683b865L843P35m592J041J081l052K368K95l606J342J350j816q04K470j117l9
699c366J081k167O54K432j914k41J328j293J374J54j023J948L37l83o0J159l7
716a7P22q64p56J221J46j063M95O79NJ095q89p77K309r17r57R62n52n63J336j348
736B67m65K409q68r27J053L5o19J493j312j494K741l88k188J835R80k812K628
$$ y = [-1445, 350, -181, 64, 1530, -655, -345, 862, -436, 1234, -172, -846, 1252, 187, -899, 981, 1032, -311, 1924, 1189, -608, 2025, 1571, -1393, 1271, 3201, -578, 1897, 3294, 383, 3326, 4385, -828, 1692, 6085, -714, 848, 4868, 273, 2007, 5518, 203, 927, 6720, 2063, 435, 5284, 2655, 443, 4531, 2824, -814, 5827, 3723, -993, 5001, 3332, -555, 3963, 2871, -1736, 2943, 1393, -2865, 978, 1713, -2879, -1838, -757, -3809, -1441, -1146, -4752, -3410, -2060, -3876, -4680, -2210, -3327, -3366, -2285, -4452, -3798, -1366, -3280, -3521, -2193, -3486, -2112, -1958, -2981, -1033, -696, -1079, -1139, 20, -17, 705, -159, -915, 306, 452, -611, -116, 563, 568, 1663, 774, -3, 2306, 1389, 432, 1394, 842, 279, 1615, 267, -198, 2211, 1343, 416, 1469, 1504, 885, 2378, 1066, -428, 2313, 1925, -263, 1572, 2552, -260, 2368]
753B368p0m399M135N73m503K379K065l709K247J625m747L864J484m782J594K637
769B761l864p2L047m253M18L617l723r59M734k163k871M727k312k060M067j945
785h51l641M734k46m339M150J37k531K908N03l089K738J909l978J626J718j880
801a32N65J347j971P84K146k913j94J877q07q07J189o73o05J506q82j069N74Q34
819G69j650j19O28n46O14o50l59j50P39K65j302M96J536j182q19J585j514M0J080
838e39j699M2J903p15j155K078o96o38J756j566p40J801m32k121J882L12j225
855a752J236K70j214J371J508l126J831J534j861M70J439k217J663J112l715J905
871D54J285j608O89J104r92M70K130k758J67K926k262q10K592k072p17L007k429
$$ y = [2368, 2298, -2101, 2034, 2607, -1896, 483, 2548, -1161, 1086, 2711, -2036, 1828, 3312, -1470, 124, 2761, -1103, -1175, 1872, -2381, -1963, 1654, -2069, -3028, 1706, -457, -3328, 1399, -913, -2973, 1094, -851, -4492, 242, -4, -4343, -193, -56, -2587, 321, 824, -2265, 473, 2382, -1596, 30, 1748, -132, 433, 1780, -191, 593, 2739, -174, -368, 1509, 702, -105, 1084, 411, -194, 1312, 430, -639, -65, 769, -881, -1000, -372, -918, -304, -954, -1313, -1463, -724, -459, -1761, -1265, 271, -911, -1730, -145, -1659, -1619, -539, -2238, -2196, -293, -1008, -2163, -85, -781, -1419, 337, -1229, -1969, -168, -600, -2721, -839, -527, -1752, -516, -246, -1460, -89, 1419, -1707, 124, 1658, -203, 267, 1706, -511, 1152, 2264, -1451, 454, 1739, 131, 820, 1924, 932, 1402, 3532, 774, 941, 3867, 1605, 795, 3387, 1315, 598, 3605, 1176]
888A176j492L362j063j839K729q32j413K505j344j913K452m15k343J154O59k753
904a370J311P95k606J760J608l563P03K861l127N57J228k305J024Q26j806m3J610
921e37l54j018L53M90l53Q66J71j907J760N89j770O24M44m27J2K96m34L27J97
940f71j92m06N12J587j888j18J797j037n77J567j237K74K661k189l82J803m09
957A095p74Q33M9q79J454J3k570J034J979k837J200J093l038K475M28k792J746
974E09P80k062Q11J069j988L84R95j325l99K048j778m65K226j266o58J547j139
991g11r8K594k270p39K397j513k08J687k164M59J797j520p00J304m77k9L47n34
1009c78l07J067O99j894J293L80j880J821J99j972K065k47j852K230p46r82J107
$$ y = [1176, -316, 3046, 1983, 144, 2873, 2041, 628, 3133, 1789, -124, 2328, 1913, -430, 724, 1383, -1370, -59, 736, -1870, -110, 1498, -2065, -1362, 1499, -1628, -1071, 157, -2148, -1124, -298, -2104, -2147, -537, -891, -1909, -1556, -1066, -1419, -553, -382, -2289, -529, 60, -1710, -1086, -642, -1069, -1057, -761, -1195, -868, -671, -863, -1269, -757, 830, -1058, -1176, 621, -416, -993, 574, -663, -389, 2272, 83, -299, 1504, 1095, 321, 1154, 1203, 324, 1778, 1791, -779, 255, 2234, -603, 597, 1690, -1348, 1127, 1555, -1237, 509, 1289, -773, 38, 1107, -881, -497, 498, -827, -1226, 822, -956, -1421, 805, -461, -1119, 428, -711, -809, 1785, -485, -1224, 1173, -340, -548, 1139, -1025, -566, 1231, -289, -989, 315, -162, -191, 156, -378, -685, 382, 1081, -813, 480, 860, -1020, 801, 1000, -972, 1093, 846, -1006, 1224, 478, -504, 603]
1026F03j74J7K05j74m57R77K93k32p39J58O63o34K53j121O26O51j17p83k02J83
1046dM26m10n85Q96l81j96J216j709L48R43j669l63J523j755O0J273j737P51L14
1065a059k89o00J327J62j589R95Q06j625J372J81k558K644M61k416J413L85o72
1082a062J301l16j067J210P17j240L90Q78m59j68J403j693M16J123j333k39J609
1099A470o56n22J243p15L60M77j240N82P60j71n92J3m92Q41n29l97jJ78O80r37
1119C52J69K28k66N68j100j86R62k91p49J089q93J34N18j047J14M52l71m60N65
1138b12j89J52J13n93P1P61l44q37N78J20m16M81k36l29O03j06j063Q63k7j37
1158g47J43n67L38O79j55o68M11Q4K97K36l67J45M13J66q07J91Q23j015Q15m20
$$ y = [603, 429, 446, 651, 477, 20, 997, 1290, 1058, 319, 477, 1140, 506, 759, -362, 264, 915, 798, 15, -187, -4, 422, 12, -573, 323, -58, -254, 962, -747, -399, 544, -1125, -1488, 35, -1720, -1660, -387, -2124, -1373, -1059, -1348, -1948, -621, -459, -2048, -1053, -247, -1872, -500, -319, -2877, -233, 228, -2188, -775, -390, -1062, 239, -77, -1144, 66, 783, -457, -67, 811, 352, 184, 1587, -106, 310, 1433, 100, -139, 1470, 814, 292, 1535, 820, 1180, 1657, 417, 999, 1759, 1588, 996, 1009, 517, 1358, 829, 432, 431, 609, 1289, 352, 521, 749, 483, 1051, -49, -235, 727, 436, -313, 776, -117, 17, 535, -512, -398, 54, -317, -777, -212, -401, -249, -136, -729, -658, 103, -241, -1078, -500, -380, -796, -315, -551, -880, -277, -383, -1446, -583, -610, -747, -604, -1171, -833, -154, -309, -977, -566, -482, -185, 51, -316, -171, 242, 408, -399, -208, 615, -400, 415, -5]
1178en13J183j41p00N54N23n47L9J6l95N29J58p74m4Q88q49l15K87n3%P27p13
1200a45m32J406p11k25O12l42k67L80j049J42P65m78j34J0R7M01j83J39m20Q25
1220C91m93O6oK98J24k54j6m17P18j79LL35j41K18J50o95N79N89r95N4M46j16
1242F59j27N42n11l47Q70j324J31P98j3m64O89p12l60J609j201q26R38l5r47J656
1262A025j473m62K121l35k028J293N08p97l17P66j254Q53l82p85J162k2K8o35
1280g34N64p75Q49J68j219P87L05o07k09P3l48M49J73n45Q6L20J72m72M1P8L95
1301d49j1l41J00M49l97l92J79L26L0J29l20M02N04j36j47M96K09n8K70l60K71
1322G54J37l09J21J56p1K36k91k59O88k11jkQ8k8K62k74p65P95o0p83K98J69n71
$$ y = [-5, -518, 665, 524, -176, 378, 901, 354, 393, 409, 14, 543, 701, -73, -117, 771, -78, -393, -106, -159, -159, 568, -145, -577, 829, 118, -107, 505, 163, -104, 276, -773, -631, 134, -344, -478, -468, -371, 30, -153, -14, -434, 391, -102, -36, -42, 256, 380, 126, 110, -307, 411, 232, 235, 570, 429, 647, 797, 102, 681, 1270, 275, 329, 775, 659, 532, 1074, 563, 216, 1086, -238, -107, 691, 678, 214, 903, 191, -169, 1440, 239, -587, 351, 316, -631, 1025, -448, -910, 1211, 876, -1152, 141, 649, -148, -465, 301, -953, -100, -482, -1267, -105, -127, -99, -734, -170, -945, -96, 72, -1147, -360, -55, -662, -871, -798, -1146, -697, -524, -1069, -983, -663, -491, -963, -922, -844, -449, -460, -801, -701, -252, -649, -1041, -862, -536, -506, -377, -697, -295, 209, 73, -74, 422, 631, 573, 843, 483, 754, 891, 582, 703, 859, 788, 1024, 733, 474, 1162, 951, 950, 948, 1036, 1008, 1270, 996, 231, 1026, 966, 183, 481, 650, 79]
1345G9N18j05q90P57J89r94M15M29k96j86O39q39j10J141q81m44J329n86r41J308
1365E32j124k17J415j008l36J328k29j131J184n37m00J130m31r82O47M76j092
1382g75L21M56o95L28M52q59r5J410j123k72J081n29j53M86p40J36P18m50k67
1401e70K59K70l71l3M75m64L84L67p03P53K80o37k09M11L11j46m06N9j11K95L48
1422E62q74K56M63m48n3K82n46K12O15q84K90M17n02k43M67l21J68K0j32m02N41
1443a12L75p95N13M36p17N32l11l05J091J82j532J021J97p18R25p02l83Q50J15
1462F62m51J94L24n2r08J146q36k58J453r71m14J218j155j9J046p85j22O24l99
1481B97o59R05J25p95L85M37r68M25K39m06N03M4j063L63O57r95L33N20q65J40
$$ y = [79, 597, 492, -398, 359, 548, -446, -31, 398, 102, -84, 555, -284, -394, 747, -134, -578, 751, 165, -776, 532, -592, -809, 606, -402, -738, 590, 361, -770, 414, -123, -523, 607, 176, -806, -159, 317, -775, -454, 2, -693, -365, 87, -772, -867, 543, -580, -852, 229, -300, -453, 33, -707, -571, 147, -303, -570, -311, -41, -412, -445, 30, -434, -50, 317, -386, 367, 647, 10, -199, 212, 523, 377, -29, 30, -81, 214, 562, -312, -56, 407, -41, -94, 188, -358, -146, 469, -415, -125, 292, -210, -453, 14, -307, -139, -119, -251, -653, -112, 263, -532, -19, 417, -300, 232, -79, -384, 707, 889, -643, 378, 575, -143, 782, 80, -303, 547, 662, 211, 405, 729, 677, -231, 915, 79, -179, 1274, 303, -111, 1107, -48, -67, 979, 194, 72, 696, 297, -362, 543, 668, -127, 258, 695, -273, 152, 391, -15, 488, 532, -531, -168, 489, -506, -173, 347, -518, -378]
1501c78Q11m28m30N79l40l82M47l49L7N90j26o83N53j71o04K35K55l46K0L55l37
1522f92L23o84Q91n57L14L50m93n3O05m16l50L93q99Q02J062j365K99N67k07Q65
1542G55m89m69K26k6k1j87j1J321j481P1R75j349J197k11o46J218l33o22J79M18
1562E15r12J057j28o49N62N25n19k97N02n3k35M24r25MJ166q29m99R03m37m21
1582b46P43q67k12Q44k11n69N40K2l10R6J46l64M24Jp29N83L14m84J85N2o15P05
1604D8K28o50M76K43o33J53L00l26J4L50l77n5M51k4o85M62j9k78N47l24j47Q23
1626E77m16l08J50L12k07j15p8m4j7K00p4l32L69J41m74L51K31m41J98m1k28L14
1648F8J2l95j28K69J57k76L78l81M7L03J18j077Q21j6m81N44k87l71M56K47n02
$$ y = [-378, 433, 5, -425, 154, -186, -568, -121, -470, -433, 157, 31, -652, -99, -270, -874, -639, -384, -730, -710, -355, -692, -369, -1053, -162, -719, -405, -55, -548, -601, 4, -412, -762, -369, -1268, -466, 596, -769, -470, 97, -110, 755, 266, -203, 23, -3, -24, -211, -222, 1099, -382, -311, 664, -685, 512, 301, -345, 873, 540, -82, 97, 515, -397, 660, 532, -117, 445, 970, 451, 154, 656, 603, 368, 792, -133, -129, 1037, 208, -291, 612, 175, -246, 497, -370, -582, 262, 51, -518, 22, 44, -266, -170, -24, -388, 36, 37, -692, -109, 205, -279, -94, -42, -657, 48, 276, -374, 102, 345, -288, -135, 165, -161, -147, 203, -174, -229, 222, 198, -487, -25, -44, -322, 225, -99, -246, 577, 161, -147, 3, 315, 108, -7, -85, -129, -146, 54, -20, -352, 17, 158, -316, 35, 266, -175, 23, -18, -246, 68, 80, -315, -443, -174, -17, -293, 85, -296, -249, 54, 172, -905, -84, -100, -581, -37, -324, -695, -239, 8, -494]
1669d94M45L98r22K98L81m44J70M61o84K13L89n14k5N33m63R6L93n39L69M78l51
1690A88k44L40K55o59O20k38j42L10j12m32P78O3n23K05K24m16M67p1n69J39L85
1711E68j83m9j41K75K08m53m2J25l21Qj78L49J79k75j40j53J1J01l3j3K6j33J86
1734g8k51j34K38K22j83l62P5J94K01m07J52K11l31K03p1R8P2N7k45l8N45l69
1756b01p6j1J5J43L68o24j58N86o6o5K31j31l01N82k46p5L93k03n28L24K42j71
1778B8P9P3l75L27J86l55J25L15l99j9L55l87J67L43l52r1L54o5l04L43k26ML
1801A29p3j10K01j32j86K38J39m8r7R0l64M53J0k94j15J8K8J26l6J90oj33j09
1824h1M0K06K9k33l49L59j13K18j38j14R0K37J1o1m5l2J70l47K56r6j75M03p4
$$ y = [-494, -49, 349, -573, -275, 106, -338, -168, 293, -391, -178, 211, -303, -328, 205, -258, -162, 231, -308, 61, 539, 188, -56, 284, 539, -120, 500, 262, 120, 430, 318, -114, 664, 727, 204, 409, 633, 217, 684, 613, 44, 183, 568, 385, 336, 195, 470, 678, 225, 183, 308, -13, -5, -183, 166, 345, 70, -70, -223, -212, -111, -144, -157, -131, -264, -78, -329, -463, -225, -3, -186, -548, -473, -279, -78, -485, -333, -122, -453, -250, -321, -223, -151, -94, -339, -377, 168, -201, -277, -288, -273, -130, 238, -386, -544, 42, -24, -89, 142, 11, -290, 292, 46, -29, 364, 161, -367, -43, 199, 28, 107, 180, -195, 132, 318, -37, 88, 403, 4, -15, 340, -47, 120, 463, 111, 20, 374, 309, 5, 348, 122, 126, 129, 56, -54, 147, 15, -171, 67, 206, 158, 61, 151, -213, 240, 250, -44, -159, -141, -113, 13, -23, 167, 161, 28, -81, -41, 165, 194, -39, -388, -29, -142, 76, -62, -176, -86, 151, 162, 101, 56, 24, 194, -153, 103, 7, -168, 235, 161]
1847A61k90O32p07N2J62j33k0J93r1j9P7K88j44l30L59l69J54J52k20Q2J47m62
1869c26M10k01k89M86k67l2O2J3k26K74K1l1j43o5K77j69K83m92L58J19k91j55
1891c84N0J42m4L42k96j25L17k68L27jo68O44r2k34n6J79p3J21kK77k61j00K70
1914F5o7J43K54l65k3Q3K63p9j04o1K72J8k37J38J7N5p1r2L14r8j51j06qO1j10
1939A11K50j46L5Q2l35j52L67k52J1J86j73j64O48n01q4M39k26O7j99l59J66L17
1961H8J61p25L49K47l93J78J61m23L27P6k57p2L36k04k03L85o29P82m11n5L45
1982F3Q0l95J29l4rn7J3j07K30J43j39j89J03N5J07J1k3j34K50j63j55MJ70q5
2006a32O9L3m5K22j33k2j03J56J73j62r1J83k76J76l4j13K17OJ4k57M38j71l53
$$ y = [161, -129, 503, -204, -152, 10, -123, -143, 50, -41, -60, 17, 305, 161, -169, 190, -179, -25, 127, -93, -11, 136, -326, 84, -117, -406, 80, -187, -219, -157, -144, -370, -96, -75, -106, -249, -314, -37, -206, 77, -415, -57, 62, -229, -384, -334, -192, -236, 106, -190, -315, 2, -266, 61, 60, -608, 36, -56, -290, -346, -167, -240, -119, -121, 156, -105, -205, 65, -2, 141, 395, 30, 7, 90, 353, 274, 170, 109, 381, 399, 162, 300, 317, 372, 301, 209, 523, 425, 274, 168, 160, 221, 111, 361, 215, 250, 332, -3, -155, 212, -40, -29, 157, -16, -180, 468, -33, -117, 322, 96, 163, -36, -395, -229, 88, 249, -476, -127, 120, -273, -95, 66, -357, -30, 46, -211, -283, 53, -151, -354, 31, -598, 184, -227, -282, 63, 143, -252, -123, -157, -166, -223, -210, -317, -87, 56, -83, -272, -169, -114, -7, 4, -19, -153, 97, -66, -221, -217, -47, -132, -63, -30, -75, 147, 14, -8, -111, 45, 218, 56, -35, 148, -128, 48, 14, -99, 118, 124, 138, -119, 319, 148, -205]
2029b05J40J47j80L36l37j03K82J23m12K60K52m92K40J4j60K21M4l58K44%K0j34
2051e8O0n1p1M32l35j09L08l53k7N21l47K3M08n03j09K81m3J44j41J19j50M82
2073D81m68r9L56J1k56J09P1l68M7J69j78K27J71k03K87l51M75o14L81j3m33M43
2095B45k16m33M21k14j0QM08m23K78J88n6k73M32p02j53J18J33K8L2K19l19P76
2117D87n15j82J26K79k12j92J35m28Q3N76o22L01l05L32n79P87n03M08K62k07
2137C1n88P34k16J4K5k43L26k03J53j4J81k20q0NK24L14j73N0m98L26k90J98q4
2160b8O74k90m43M5l4M24J93m46j49J78P3j20M02k22j77L00m22N1L37j28j71K66
2182C13n3Q8l53k9q8j10L94k54p4K26k40K56j1k00l2J6l9J6L41o1j74J8J3m2J71
$$ y = [-205, -65, 82, -98, 238, -99, -202, 80, 203, -209, 51, 303, -189, 51, 65, -95, 126, 170, -188, 56, 56, 76, -58, 2, -49, -120, 312, -23, -132, 176, -177, -204, 317, -30, -7, 401, -102, -211, 70, 27, 171, 30, 149, -1, 481, 13, -86, 270, 281, 25, 134, 205, -163, -116, 53, -125, 102, 273, 70, 357, 6, 481, -133, 248, 235, -198, 245, 29, -404, 17, -197, -207, -199, 209, -214, 64, 252, 196, -77, 355, -347, -500, -382, -249, -221, -189, 30, -289, 487, -28, -210, -84, 195, -17, -209, -74, -502, -419, 157, -465, -164, -469, -137, -716, 71, -432, -24, 238, 31, -557, 177, -39, -25, 0, -243, 83, -120, 33, 19, 200, -20, -100, -95, 129, 443, 270, 320, -178, 148, -142, 56, -28, 646, 356, -87, -42, -76, 348, 541, 95, -54, 124, 197, 77, 479, 257, 80, 380, -42, 9, 346, 218, 47, 313, 260, 348, -5, -34, -122, -232, 162, -92, -166, 60, -180, 76, 65, -135, -167, -151, -190, -174, 167, 106, -68, -50, -37, -79, 92]
2207I2m23RJ59K81k22j17L80n17K45J09j16K08J87m55K0K06j47J56j46j79K28
2228d2Pl2j09K94R6l33J44jLn9K80k96m4K72j93O4P2q1q0J54k87j9M23j84o8m9
2254f8O7k02K00Ok44K95K8k78L1J98j85j11K89k8O3J54k93j86K20J53m05M22r4
2277C2j54K21J79m59J15K01k50J4K73k46J91J37k95p4J30l35K49J87j91o4K26
2298H7l02K07M20m03J89l5q9q2L6J67j23M7j55k6N22l05k24J13L19j90j42J71
2320B02k35j11K18j20KJ32q8l17K19r1K02J07j39L9l9O0j77n3J42l64L53r5r3
2343b46J57M6p7Q8j68PMJ83j05j5P0p5j22L17j57m9Q1k92J42J97O3k35O2r9K21
2368bj05K11O2k92L52n60K57K57l13r4J92K47k37K7j8J2J37p2j37K53J07j43j73
$$ y = [92, -331, -322, -163, 118, -104, -221, 159, -358, -113, -4, -120, 88, 275, -180, -160, 46, -101, 55, -91, -270, -42, -35, -67, -176, 118, 214, -119, 25, 24, 27, -32, 248, -48, -92, 180, -13, 51, 123, 42, -38, 116, -171, -190, 233, 49, -19, -68, -1, -203, -3, 3, -241, 54, 82, -196, -165, 33, -152, -263, 26, -2, 61, 215, -78, -264, -44, 109, -296, 126, 32, -122, 99, 278, -181, -66, 135, -115, -101, 172, -74, 117, 254, -41, -115, 15, -320, -71, 116, -75, -139, 87, -215, -8, 412, 9, 198, 163, 74, -8, 28, 195, 72, 119, -36, -62, 460, 155, -69, 44, 363, 173, 31, 202, -33, -144, 74, -46, -44, 88, 0, -317, -98, -189, 13, 120, -19, 20, -19, 41, -136, -189, -47, -411, -58, -153, -246, -89, -43, -120, -32, -200, -193, -189, -6, -111, -126, -56, -131, -253, 64, -93, -142, -61, -353, -211, -14, 49, -186, -124, -223, -2, -107, 104, 166, -126, 226, -334, -77, 180, -133, -227, -35, 212, -25, 2, -16, -4, 133, 61, -76, 177, 284, 141, -32]
2391c2N7P0J1J43j85R8L68n35lM11m71L09j33j84nK10Q6r1Np5j49K44j43k95M88
2416A99l6k03j19K44j98L24n0j23n6M1j98j89M95n9j51o8J36J14L9k88L6K79k60
2439i1O5Q8j83l1J47l29L17J35K05k03P5j39J9j0k4O3k19L22j5l3J43m37p2J21
2463h6r4R8K21k06q7L20j0m10K07kj3K7K64l43J97J86j56l4M1k50j20N10l54J82
2487H8j58O2p6J23k6j20J07O1l88L20K18n24K87P9k57j74N68j02o6J38l25M9J04
2510a2J18j74J06j58P1j65K33j33M9k6j7R0m3N9N8J60l01M14j48k90R3L67l43
2533HK2J22j62J66L3J19q8q0k59L11K35l47q7K25r3O5k9kJ7k81K43R4L6k98K25
2558A95m24L08jm84O49j26m6J44m07L23j80n1R8q3J31j85k22K40K42m51K85L1
$$ y = [-32, 25, 95, 106, 249, 64, 162, 530, -5, -8, 403, -68, 241, 108, -76, -81, 129, 215, 124, 129, 54, -95, 149, 6, -289, 199, 163, -40, -159, 85, -113, 211, 161, 38, -18, 23, -175, -364, 131, 72, -79, -147, -11, 103, 142, -146, -110, 169, -91, -26, 62, -121, -152, -5, -334, -17, 118, 323, 120, 195, 56, 75, 65, 41, 104, -115, 207, 192, 159, 302, -135, -207, -86, -180, -82, 139, -67, -154, 166, 156, -254, -47, -49, -62, -35, 229, -114, 83, 269, 113, 79, 120, -130, -250, 260, -94, 88, -70, -8, -84, 39, 13, -107, 0, 61, -327, -7, 211, -313, -26, 53, -204, -378, 190, 88, 22, 160, -165, -116, -12, 106, -68, 38, -120, -49, -214, 19, -114, -65, -91, -108, -18, -61, -2, 56, 216, -85, 329, 181, -109, -16, 351, 8, 30, 152, -10, 156, 189, 308, 220, 140, -119, 192, 427, 80, -7, 218, 125, 190, 161, 159, 176, -105, 138, 232, 268, -30, 195, -229, 79, 78, -406, 243, 117, 71, 215, -192, 131, -49, -100, -2, -85, 46, -139, -361, -121, 121, -330, -45, -14]
2580a4l74l5L39j47J16L5k10j0L75j01J51l03M7o6n4L55R4k74l0r4N01n44j62
2603d05o1L99j30L19O4l03R1J16k17K49o8j58K12k35m59M77lR4KJ36K82j34k29
2626C9o1q4L61m78M19J8j57M6k04j55K0O72k11J01L33l50q31O57m67Q9R36Q3r41
2649a65P89o24j75K58N16m83j17O51o37l03N51l06j83K71P1r2K8O50n63n5p7J9
2671B4j74j76O2K81J05O11l94N8m17j09k76m58J255j2K4m57K08l69k6P57q11n42
2693h36J128o38L80k85J17l18k82L80R79j031N84j16p1L48n55r2r6P31m41k51
2713c65K59J29j95K50j96J14j26j80L3P07n50K36m42L35j52Q4j08L1Q1P6m17L16
2735h0k8J69R6k72J35K7M2r2k46K11k0N3M6j00o0J73J0j0L5k00K62k15m0j31M83
$$ y = [-14, -388, -423, -84, -231, -115, -80, -290, -300, 75, -26, 125, -178, -131, -197, -251, 104, 198, -76, -106, -200, 301, -243, -405, -466, -67, -197, 122, 186, -117, -26, 90, -127, 122, 54, -104, 108, -127, -586, -109, -112, -18, -16, 120, 402, 268, 39, -22, -106, 255, -223, 196, 214, 57, 103, -101, -256, -236, 436, 225, 326, 659, 309, -522, 135, -332, -243, 693, 776, -165, 624, 0, -175, 83, 599, 116, -1, 650, 13, -290, 261, -45, -228, 43, 114, 22, 50, 700, 137, 82, 5, 24, -150, -326, -264, 17, 122, 733, 339, 397, -20, -129, -405, -863, 392, 380, 404, -53, 155, -214, -240, 517, -294, -836, 292, -346, 34, -251, -134, -452, -734, -354, 625, -406, 178, 62, -9, 339, -216, -308, -404, 327, -114, -365, -106, 23, -172, 78, -118, -4, -130, -310, -277, 430, -120, 116, -326, 9, -143, -59, -167, -136, -55, 21, -396, -80, -108, 61, 157, -115, 20, 47, 89, -3, -249, -38, -58, -5, 41, -59, -119, 54, 64, 54, 89, -111, 151, -64, -104, -235, 248]
2760B48j1j75K44P7rr8m52K25m5J49l26J49R7J76j27k13L40n0j42K11k02P9J11
2783B56m01N0PM3R1K02l24m6K4j9J92l6m2j21j7J38l3N9j20J37k32J31J07k04
2807a58n8R3Q6j19M8j01N4M05k74l2J51l8j31K2J24j71K8J98k86n9K76O4l29K59
2831E2rK89l42k29J14J70KL55p83J80N8k35L10M10m22k35k7M71j38Q8PK35q6k02
2855C3N7j8r5r6J09l04N35l4k30k17K72J48j73J90k58j9j33K32J03k47K18j74
2877a01j56R0J09J81K8l11Q9J48nk21J28M9j02o9O8o2N4K11m10K28J30j36n9K17
2901I8j06K68j58Mr2l7N0K05j78R6k55K87j0k43K97p2k94K97J00j80J61j93N4
2924I9J15l74J12KJ01J19l22K24K56M4k15k11N6K25l93r5K43k49N4Q9J40j26P3
$$ y = [248, 237, 62, 306, 383, 374, 276, -176, 49, 4, 153, -173, -24, 73, 249, 122, -91, 249, 199, 57, 268, 66, 145, 256, -145, -95, -88, -45, 46, 248, -76, -122, -98, -117, 75, 39, -3, -124, -141, -3, -36, 23, -97, 40, -192, -61, 46, -158, -216, -123, -37, -156, -108, -209, -155, 250, -24, -56, 95, 57, -74, -52, 72, -99, -71, 127, -159, -218, 58, 122, -207, 52, 43, 332, -10, -239, -125, 45, 47, 402, -381, -201, -143, -378, -68, 342, -80, -315, -342, 129, -9, 79, 86, 321, 235, 33, 90, 72, -23, -119, -10, -314, 221, 187, -43, -260, 12, 160, -13, 177, -81, -100, -233, -1, 102, -145, 73, -101, -257, -167, -58, 123, 151, -160, -71, 77, 72, -149, -21, 28, -74, -143, -75, -137, -83, 128, -282, -54, 76, -60, -119, 98, -8, 260, 102, 106, 14, -23, 27, 232, 54, 150, -105, 182, 172, -71, 226, 154, -140, 157, 257, 77, 238, 45, 99, 214, -160, -48, -46, 55, 174, -148, 76, 332, 376, 161, -50, 6, 231, -162, -257, -14, -263, -209, -120, 20, -106, -33]
2947c3J18k77R6p3K58m44L31mk03L37m65P0L66k87K50m60N13k14R7n8j46O4J39
2970b5k7k4j69J01L30m9k26j09K33K66k20J15J0l37K29P8J12k01l21K20J97O8
2992B51k5L12n89R3j44j27L65m80O04o57N51m8J1k27J15l73M28k15n53N47R42
3013G81k51n66M81j97n3n30J62M82J80k72n74j92N90l85L22k87j70L92K85k23
3033b5o12J78N93N8n98J61l45Q20r5r04QN93k98J27l97M79K98p20M38L03k10J79
3055C1L78o26L15k12K23k00k71M58q7K62K05n72M25j17l00J40L03m05qj8N2K20
3077A96k18k43L38J73j33m93L17L97l31K5j99K16K72Q6n07j27K40l60N9Q7P7K36
3099A08m04K72k08L72J59n33K12l8q2JJ92k42L62r2k03J74j97k11O23k83K78k17
$$ y = [-33, 85, -192, -96, -169, 89, -355, -24, -28, -231, 106, -359, -289, 77, -210, 40, -420, 93, -121, -24, -82, -228, -164, -25, -52, -76, -245, -144, 186, 137, -89, -198, 35, 301, 81, 196, 206, -131, 98, 176, 288, 87, -234, -14, 183, 251, 226, 538, -51, 42, -102, -229, 136, -344, 260, -397, 154, 106, 117, -110, 5, -368, 60, -155, -708, -161, 781, 530, -36, 445, 248, 195, -335, -173, 309, 489, 217, -357, -549, 41, -344, -22, -309, -479, -87, 198, -25, -637, -459, 134, 192, -406, -245, -590, 230, 135, -769, -761, -168, -466, -339, -736, -257, 41, -679, -241, 62, -148, 31, 409, -217, 98, -114, 109, -91, -362, 96, 9, 271, 476, -96, 329, 212, -88, 52, 355, -50, -58, -76, -24, 196, -22, -265, 73, 246, 113, -380, -63, 334, 3, 28, -171, 45, 317, 403, -104, -231, 9, -351, -292, -205, -128, 108, -296, -24, -232, 140, 299, -234, -22, -60, -142, -141, 51, -191, 171, 79, -124, 50, -147, -358, 265, -18, 260, 43]
3121D3k0K8j92K01n7n1R1n9k64L20m3J67l8J4K4k08M07j29m32M41k87J05K17m77
3145a99L41P2j80M24k90l14J27M80k84l36J87O6j70L84k51Rj25J90k09O4j63K31
3167E4K1J02j63Q1j54j15J4J47l5n9P9r0p2P4j22j49K16K10j81m1r7K2K18p9J29
3192A0N2n1j52j40J25J38k9J84k84J72Q2j48Q9N4j72j05J49J16q4N3j45R3L0J29
3216A66r0o7l0R7J47p1k16J59k58J47M54r94J35M99n1N9Q6J9j86n7P6j05P7%N6
3241E2m2J70j76P6l12L90k31k6J87n0j95J05%q5k3r9j4K70l23K63j08Jj33J95
3265a08j37J78K52m48j09M65R0k16k5N1m4r1M74m17j4J90m8J29M2j01q9K41q2
3288A83j21j69L79j69j71J14Qj09J39l6k1q6jJ55j64J3J96l01O8J59k51K07j24
$$ y = [43, 23, 51, -141, 60, 3, -48, 43, -16, -280, 40, -3, 164, 126, 140, 164, -44, 363, 234, -198, 243, -44, 61, 278, -199, 142, 214, 34, 458, 168, -146, -19, 461, 177, -159, 28, 94, -76, 308, 57, 66, -59, 131, -78, -14, -177, 54, 75, 177, 14, 95, -59, -174, -160, -13, -48, -107, -28, -118, -190, -116, -238, -387, -171, 39, -142, -183, -280, -258, -40, -119, 10, 62, 11, -141, -281, -156, -18, -47, 137, -147, 25, 107, -41, 48, 102, -70, -175, -26, 90, 6, 59, -86, 7, 37, 166, 76, 9, -21, 76, 223, 152, -64, 95, -163, -16, 438, -556, -421, 78, 27, 86, 172, 191, 5, -52, 24, -81, -4, -4, 52, 10, 180, 4, 80, -232, 158, -73, -99, 88, 38, -157, -52, -52, -137, -160, -259, -273, -3, -326, -63, -171, -170, -303, -108, -245, -67, 185, -263, -372, 93, 183, -33, -58, -7, -51, -142, 332, -85, -99, 91, 43, 172, 214, 113, 24, 265, 183, 62, -107, 272, 103, -68, 46, 54, -55, 84, 48, 27, -59, -60, 95, -69, -56, 140, -161, -93, 66, -185, 22, -102]
3311a02K15k26n2K58P3m71K81L7j2j6N8l18K69o0RJ14J8l52Q2L8K5o7kK75ll11
3337b40J43K73q6n1q5J92k91L32k57J18j9k9O6R8K2j6m3j6m12L45P9j48L95m13
3361d3J51r5R8K63q4k67J5N0l9J93k19mo9r6J77R3O5k27L48m62K08j02LL7j05
3386a11JJ32n1J06p5j35J05J25r8q3J41j48L88m60N6n8J85j69O8j11j41J48Q2
3409a03N2Mj00M2l1j29m2J83K6p0k06j9M64q7Q2Q3k77L61m58L46M3n05J98j00
3433b43M30k76K37j35J03l68K96pj89L84j98k28L74j59j57N95o10k47L42J13j1
3454D6j95L82L30n49k37K12Ql7o07O37o7J56l56M4R9P4K2K46K29r41N08k49N87
3477C42p59J39M42Q4k47L54j7n00J5O61l71n4k4o04J129o78K48j08L29o95L39
$$ y = [-102, 113, -113, -165, 93, 166, -305, -24, 13, 1, -15, 43, -275, -6, -66, -57, 57, 75, -277, -195, -157, -132, -199, -201, 74, 71, -240, -97, 176, 90, 39, -46, 146, -145, 187, -70, 48, 29, 0, 66, 164, 186, 170, 127, 111, -301, 44, 123, -25, 370, -43, 108, 13, 111, 374, 290, 23, 38, 88, 49, 242, 23, 19, -50, -146, 31, 124, 189, -38, 310, -152, 56, -46, -43, -6, -111, -110, 22, -29, 77, 2, -133, -28, 97, -1, -84, 57, -91, 297, -163, -107, -165, 20, -149, -81, -192, -333, -185, -103, -51, -47, -147, -105, -136, -265, -307, -124, -98, -168, -374, -393, 71, -16, 66, 149, -128, 233, -225, 121, 164, -341, -143, -243, 187, -89, 148, 13, 116, -252, 44, 37, -152, 232, 34, -194, 180, 21, -136, 459, -151, -398, -56, 57, 46, -149, 233, 563, 14, -223, -11, -3, -40, -647, -10, -77, 79, -277, -233, -134, -60, -38, 208, 437, -504, 4, -245, 342, -417, -278, 164, 248, 1, 355, 338, -162, -147, 514, 143, 89, 65, -539, 590, -88, 160, 52, 381, -314, 25]
3498B5J16M88o06L76m16R2J77m8N7K61m37p8n5K74m4j40J1j1j15j34j5j52O3L42
3522C1M74o14M23j99j09N78j35j70m59J04L70l35k75M34Q6p17K18q5K48k64k88
3543f84L06P21n93p00J025k45k18Q71n07m42M28p0n7l5L37q9J52l62j39M39k58
3564a20J73O1On35K36l20M79k92K0K54k66P07o16M00j99L49l68M47m55K10j32
$$ y = [25, 141, 629, 23, 399, -17, 75, 252, 204, 261, 522, 85, 7, -48, 226, 182, 42, 53, 42, -73, -207, -222, -374, -311, 31, 505, -109, 314, 115, 6, 584, 449, 279, -180, -76, 294, -41, -316, 118, 204, -513, -295, -380, -132, -396, -684, -378, 343, -250, -950, 75, -170, -388, 483, -24, -466, -38, -108, -165, -200, 137, 48, 200, -162, -301, 138, -120, 53, 114, 120, -415, -179, -499, -20, -312, -292, -38, -304, 403, -213, 187, -12, 337, -31, 416, -39, 171, 39]
$$ [...]
8191h7
##END NTUPLES=NMR FID
##END=
