##TITLE=1H_PhBDP0208
 CDCl3, 8 sc, 
 3.08.2021
##JCAMPDX= 6.0         $$ Bruker NMR JCAMP-DX V2.0
##DATA TYPE= NMR FID
##DATA CLASS= NTUPLES
##ORIGIN= UXNMR, Bruker Analytische Messtechnik GmbH
##OWNER= root
$$ XWIN-NMR		Version 3.5
$$ Tue Aug  3 08:55:46 2021 Russian Standard Time (UT+4h)  she@DPX200
##.OBSERVE FREQUENCY= 200.131506
##.OBSERVE NUCLEUS= ^1H
##.DELAY= (6, 6)
##.ACQUISITION MODE= SIMULTANEOUS
##.ACQUISITION SCHEME= undefined
##.AVERAGES= 8
##.DIGITISER RES= 18
##SPECTROMETER/DATA SYSTEM= spect
##.PULSE SEQUENCE= zg30
##.SOLVENT NAME= CDCl3
##.SHIFT REFERENCE= (INTERNAL, CDCl3, 0, 15.7039)
##AUDIT TRAIL= $$ (NUMBER, WHEN, WHO, WHERE, WHAT)
$$ ##TITLE= Audit trail, XWIN-NMR		Version 3.5
$$ ##JCAMPDX= 5.01
$$ ##ORIGIN= Bruker BioSpin GmbH
$$ ##OWNER= she
$$ F:/spectra/data/she/nmr/H-F/1/audita.txt
$$ ##AUDIT TRAIL=  $$ (NUMBER, WHEN, WHO, WHERE, WHAT)
(   1,<2021-08-03 08:54:11.75 +0400>,<she>,<DPX200>,
      <created by zg, POWCHK disabled, PULCHK disabled
       configuration hash MD5:
       00 E9 B6 7A A2 85 ED C7 34 08 36 98 17 FE 4E 26
       data hash MD5: 16K
       5F 33 14 5A 51 19 0E DF 78 50 34 58 8C E9 8E 31>)
$$ ##END=
$$ 
$$ hash MD5
$$ 41 44 95 E6 D7 90 3A 75 66 D2 FB AD B5 10 E7 60
##$RELAX= 
##$RELAX= 
##$RELAX= 
##$RELAX= 
##$RELAX= 
##$RELAX= 
$$ Bruker specific parameters
$$ --------------------------
##$DU= <F:/spectra>
##$EXPNO= 1
##$NAME= <H-F>
##$PROCNO= 1
##$TYPE= <nmr>
##$USER= <she>
##$AMP= (0..31)
100 100 100 100 100 100 100 100 100 100 100 100 100 100 100 100 100 100 
100 100 100 100 100 100 100 100 100 100 100 100 100 100 
##$AQSEQ= 0
##$AQ_mod= 1
##$AUNM= <au_zg>
##$AUTOPOS= <>
##$BF1= 200.13
##$BF2= 200.13
##$BF3= 200.13
##$BF4= 200.13
##$BF5= 200.13
##$BF6= 200.13
##$BF7= 200.13
##$BF8= 200.13
##$BYTORDA= 1
##$CFDGTYP= 0
##$CFRGTYP= 5
##$CHEMSTR= <none>
##$CNST= (0..31)
1 1 145 1 1 1 1 1 1 1 1 1 1 1 1 1 1 1 1 1 1 1 1 1 1 1 1 1 1 1 1 1 
##$CPDPRG= <>
##$CPDPRG1= <>
##$CPDPRG2= <>
##$CPDPRG3= <>
##$CPDPRG4= <mlev>
##$CPDPRG5= <mlev>
##$CPDPRG6= <mlev>
##$CPDPRG7= <mlev>
##$CPDPRG8= <mlev>
##$CPDPRGB= <>
##$CPDPRGT= <>
##$D= (0..31)
0 1.2 0 0 0 0 0 0 0 0.06 0 0.03 0 0 0 0 0.0002 0 0 0 0 0 0 0 0 0 0 0 0 
0 0 0 
##$DATE= 1627966451
##$DBL= (0..7)
120 120 120 120 120 120 120 120 
##$DBP= (0..7)
150 150 150 150 150 150 150 150 
##$DBP07= 0
##$DBPNAM0= <>
##$DBPNAM1= <>
##$DBPNAM2= <>
##$DBPNAM3= <>
##$DBPNAM4= <>
##$DBPNAM5= <>
##$DBPNAM6= <>
##$DBPNAM7= <>
##$DBPOAL= (0..7)
0.5 0.5 0.5 0.5 0.5 0.5 0.5 0.5 
##$DBPOFFS= (0..7)
0 0 0 0 0 0 0 0 
##$DE= 6
##$DECBNUC= <off>
##$DECIM= 32
##$DECNUC= <off>
##$DECSTAT= 4
##$DIGMOD= 1
##$DIGTYP= 9
##$DL= (0..7)
0 120 120 120 120 120 120 120 
##$DP= (0..7)
150 150 150 150 150 150 150 150 
##$DP07= 0
##$DPNAME0= <>
##$DPNAME1= <>
##$DPNAME2= <>
##$DPNAME3= <>
##$DPNAME4= <>
##$DPNAME5= <>
##$DPNAME6= <>
##$DPNAME7= <>
##$DPOAL= (0..7)
0.5 0.5 0.5 0.5 0.5 0.5 0.5 0.5 
##$DPOFFS= (0..7)
0 0 0 0 0 0 0 0 
##$DQDMODE= 0
##$DR= 18
##$DS= 0
##$DSLIST= <SSSSSSSSSSSSSSS>
$$ [...]
##$SUBNAM2= <"">
##$SUBNAM3= <"">
##$SUBNAM4= <"">
##$SUBNAM5= <"">
##$SUBNAM6= <"">
##$SUBNAM7= <"">
##$SUBNAM8= <"">
##$SUBNAM9= <"">
##$SW= 20.0188882624521
##$SWIBOX= (0..15)
0 0 2 0 0 0 0 0 0 0 0 0 0 0 0 0 
##$SW_h= 4006.41025641026
##$TD= 16384
##$TD0= 1
##$TE= 0
##$TE2= 300
##$TE3= 300
##$TEG= 300
##$TL= (0..7)
0 120 120 120 120 120 120 120 
##$TP= (0..7)
150 150 150 150 150 150 150 150 
##$TP07= 0
##$TPNAME0= <>
##$TPNAME1= <>
##$TPNAME2= <>
##$TPNAME3= <>
##$TPNAME4= <>
##$TPNAME5= <>
##$TPNAME6= <>
##$TPNAME7= <>
##$TPOAL= (0..7)
0.5 0.5 0.5 0.5 0.5 0.5 0.5 0.5 
##$TPOFFS= (0..7)
0 0 0 0 0 0 0 0 
##$TUNHIN= 0
##$TUNHOUT= 0
##$TUNXOUT= 0
##$USERA1= <user>
##$USERA2= <user>
##$USERA3= <user>
##$USERA4= <user>
##$USERA5= <user>
##$V9= 5
##$VALIST= <valist>
##$VCLIST= <CCCCCCCCCCCCCCC>
##$VD= 0
##$VDLIST= <DDDDDDDDDDDDDDD>
##$VPLIST= <PPPPPPPPPPPPPPP>
##$VTLIST= <TTTTTTTTTTTTTTT>
##$WBST= 1024
##$WBSW= 4
##$XGAIN= (0..3)
0 0 0 0 
##$XL= 0
##$YL= 0
##$YMAX_a= 26700
##$YMIN_a= -41928
##$ZGOPTNS= <>
##$ZL1= 120
##$ZL2= 120
##$ZL3= 120
##$ZL4= 120
##$ABSF1= 10
##$ABSF2= 0
##$ABSG= 5
##$ABSL= 3
##$ALPHA= 0
##$AQORDER= 0
##$ASSFAC= 0
##$ASSFACI= 0
##$ASSFACX= 0
##$ASSWID= 0
##$AUNMP= <proc_1d>
##$AZFE= 0.1
##$AZFW= 0.1
##$BCFW= 1
##$BC_mod= 2
##$BYTORDP= 1
##$COROFFS= 0
##$CY= 11.3945322036743
##$DATMOD= 1
##$DC= 2
##$DFILT= <>
##$DTYPP= 0
##$F1P= 2.36226072786647
##$F2P= -0.459571619588291
##$FCOR= 0.5
##$FTSIZE= 0
##$FT_mod= 4
##$GAMMA= 1
##$GB= 0.15
##$INTBC= 1
##$INTSCL= 1
##$ISEN= 128
##$LB= 0.24
##$LEV0= 0
##$LPBIN= 0
##$MAXI= 10000
##$MC2= 0
##$MEAN= 0
##$ME_mod= 0
##$MI= 1.114404
##$NCOEF= 0
##$NC_proc= 0
##$NLEV= 6
##$NOISF1= 3.799351
##$NOISF2= 2.8
##$NSP= 1
##$NTH_PI= 0
##$NZP= 0
##$OFFSET= 15.70392
##$PC= 1
##$PHC0= -13512.83
##$PHC1= 12.60099
##$PH_mod= 1
##$PKNL= yes
##$PPARMOD= 0
##$PSCAL= 0
##$PSIGN= 0
##$REVERSE= no
##$SF= 200.130013532006
##$SI= 16384
##$SIGF1= 3
##$SIGF2= 2
##$SINO= 400
##$SIOLD= 16384
##$SREGLST= <1H.CDCl3>
##$SSB= 0
##$STSI= 0
##$STSR= 0
##$SW_p= 3612.71676300578
##$SYMM= 0
##$S_DEV= 0
##$TDeff= 0
##$TDoff= 0
##$TI= <>
##$TILT= no
##$TM1= 0
##$TM2= 0
##$TOPLEV= 0
##$USERP1= <user>
##$USERP2= <user>
##$USERP3= <user>
##$USERP4= <user>
##$USERP5= <user>
##$WDW= 1
##$XDIM= 8192
##$YMAX_p= 0
##$YMIN_p= 0
$$ End of Bruker specific parameters
$$ ---------------------------------
##NTUPLES= NMR FID
##VAR_NAME=  TIME,          FID/REAL,        FID/IMAG
##SYMBOL=    X,             R,               I
##VAR_TYPE=  INDEPENDENT,   DEPENDENT,       DEPENDENT
##VAR_FORM=  AFFN,          ASDF,            ASDF
##VAR_DIM=   8192,          8192,            8192
##UNITS=     SECONDS,       ARBITRARY UNITS, ARBITRARY UNITS
##FACTOR=    0.0002496,     1,               1
##FIRST=     0,             0,               0
##LAST=      2.0444736,     0,               0
##MIN=       0,             -41928,          0
##MAX=       2.0444736,     26700,           0
$$ Real data points
##PAGE= N=1
##DATA TABLE= (X++(R..R)), XYDATA
$$ [...]
1001A354k503J364J468k497L59K246k074p46K641j280j665K356j06k316J682J102
$$ 1354 -1149 215 1683 -814 -455 1791 -283 -1029 1612 332 -1333 1023 917 -1399 283 1385
1017A385k478P36J934k243k65K398j572j267K434n75j952J940N14k285J131J443
$$ 1385 -1093 -357 1577 -666 -931 1467 -105 -1372 1062 487 -1465 475 989 -1296 -165 1278
1033A278k254K14K083j778q13K471r63j681K162L7k131J511J067k310O36J926
$$ 1278 -976 -762 1321 -457 -1270 1201 238 -1443 719 756 -1375 136 1203 -1107 -471 1455
1049A455k038l99K373j326j312K291l85j999J881O03k293J064J511k119J5K170
$$ 1455 -583 -982 1391 65 -1247 1044 659 -1340 541 1144 -1149 -85 1426 -693 -678 1492
1065A492j581j015K389q09j720K038J80k206J453J047k192N64J780j832n21K187
$$ 1492 -89 -1104 1285 476 -1244 794 974 -1232 221 1268 -924 -360 1420 -412 -933 1254
1081A254j078j437K188k44k019J755O30k186R54J423j954o0J975j406r71K158
$$ 1254 176 -1261 927 683 -1336 419 1049 -1137 -183 1240 -714 -774 1201 -205 -1176 982
1097I82o10j695J893L65k160J277J140k077M33J772j651n18K045r77j312J941
$$ 982 372 -1323 570 935 -1225 52 1192 -885 -452 1320 -331 -849 1196 219 -1093 848
1113H48r4j915J562Q21k172Q25J563j882j09J966j332j002J987m68j672J717M62
$$ 848 754 -1161 401 1222 -950 -125 1438 -444 -553 1413 81 -921 1066 598 -1074 643 1105
1130A105k148J129J243k052K45J755j592n41J909q65j384J851K8j882J323Q35
$$ 1105 -1043 86 1329 -723 -478 1277 -315 -856 1053 188 -1196 655 683 -1199 124 959
1146I59k072O86J537j814k29J940j246r83J873m41j574J568M20j989R95J293j923
$$ 959 -1113 -427 1110 -704 -933 1007 -239 -1222 651 210 -1364 204 624 -1365 -370 923 -1000
1163a000K28J786j515o36J960q54j207J691R6j753J205R04j876N01J579j635k92
$$ -1000 -772 1014 -501 -1137 823 -31 -1238 453 549 -1204 1 905 -971 -470 1109 -526 -818
1180h18J905j037j078J850k28j533J283O35j783P67J329j775K1J755j265q23J814
$$ -818 1087 50 -1028 822 594 -939 344 979 -804 -37 1292 -483 -462 1293 28 -795 1019
1197A019n20j395J586K35j811J114Q75j695K68J575j459n01J846j012j102J772
$$ 1019 499 -896 690 925 -886 228 1103 -592 -324 1251 -208 -709 1137 125 -977 795
1213G95k43j620J303O21j767P56J079j554j22J711j250p99J820n31j430J543K46
$$ 795 552 -1068 235 856 -911 -155 924 -630 -752 959 -291 -1090 730 199 -1231 312 558
1230E58j709R97R29j632J97J454j293n23J680o84j161J620l2j591J242O08j620
$$ 558 -1151 -154 775 -857 -660 794 -499 -1022 658 -26 -1187 433 401 -1190 52 660 -960
1247i60O30J145j366j57J602r69q57J627k83j449J393M63j711R79J023j700K47
$$ -960 -330 815 -551 -708 894 -75 -932 695 412 -1037 356 819 -892 87 1110 -590 -343
1264c43J431j239n01J580n91j217J611R1j636J132P03j670M96J255j403j70J475
$$ -343 1088 -151 -652 928 337 -880 731 822 -814 318 1021 -649 -153 1102 -301 -471 1004
1281A004q95r46J582j81j461J291L73j603P43J034j512P9J357j131n73J546n15
$$ 1004 109 -837 745 564 -897 394 767 -836 -93 941 -571 -492 865 -266 -839 707 192
1298A92j148J314J53j493R46Q00j588L60J275j313l15J528q20q54J419j43j290
$$ 192 -956 358 511 -982 -36 764 -824 -464 811 -502 -817 711 -109 -963 456 313 -977
1315i77J050N29j490N40J196j445r5J542j085o09J460m42j116J330J96j475P78
$$ -977 73 602 -888 -348 848 -597 -692 850 -235 -844 616 174 -942 388 584 -891 -113
1332a13R14j499L13J291j232l45J466p40r22J372j04j313J063N60j498N88J113
$$ -113 801 -698 -385 906 -326 -671 795 55 -867 505 401 -912 151 711 -787 -199 914
1349I14j440p6J479r76p22J478l83j138J197K58j341O69R35j416J40J259j112
$$ 914 -526 -602 877 -99 -821 657 274 -864 333 591 -750 -81 854 -562 -422 837 -275
1366b75m13J415n48r61J322n7j247R66N29j338L96J041j175j82J355p58p97J341
$$ -275 -688 727 179 -782 540 483 -764 202 731 -607 -211 830 -345 -527 828 70 -727 614
1384F14k56j153J146K94j332O71Q37j262N0J275j034n03J378n37j030J387k6j306
$$ 614 358 -795 351 645 -687 -16 821 -441 -391 884 -150 -653 725 188 -842 545 519 -787
1402g87R39N50j343L88J105j193k46J290p00q03J371k17j234J040L66j285N53
$$ -787 152 702 -641 -253 852 -341 -587 703 3 -800 571 354 -880 160 526 -759 -206
1419b06Q08j161J7J196q46n69J244m10j043J180J41j258P59O96j179K60J055j023
$$ -206 602 -559 -542 654 -192 -761 483 73 -970 210 351 -907 -148 548 -631 -371 684 -339
1437c39l68J300n84p65J157l1j159R12M93j314N30Q94j115l5J207q37n58J204
$$ -339 -707 593 9 -756 401 370 -789 123 616 -698 -168 726 -389 -424 783 -54 -612 592
1455E92j76j108J093K75j314P44P24j216K15J121j027l31J173n52q57J209L5j154
$$ 592 416 -692 401 676 -638 106 830 -386 -171 950 -77 -408 765 213 -644 565 600 -554
1473e54P60N95j291L47R80j110j24J160p74o25J188k83r59R30L05j228N40Q03
$$ -554 206 801 -490 -143 837 -273 -397 763 -11 -636 552 269 -690 240 545 -683 -143 660
1491F60j174J6J141q87m24J163l81r28J044J37j182P38N51j086K32R23r71k18
$$ 660 -514 -498 643 -244 -668 495 114 -814 230 367 -815 -77 474 -612 -380 543 -428 -646
1509f46J114n94o72J067j48r54Q76L59j103M41Q61j108J8J114q31m42J200m83
$$ -646 468 -126 -798 269 121 -833 43 402 -701 -260 601 -507 -489 625 -206 -648 552 69
1527F9p77J041R4j088P32O53j175K68R21r41k52J113m83p41J153j33r62Q01L93
$$ 69 -708 333 427 -661 71 724 -451 -183 738 -203 -455 658 175 -566 587 454 -508 293 686
1546F86j089M19P47j040OJ012o65n74J112l06q86R08J80j018O12N25r85J25R51
$$ 686 -403 16 763 -277 -271 741 76 -498 614 308 -578 330 510 -508 104 629 -356 -231 720
1565G20q41m09J057m55o97J040j13r48Q06K92j031L57P90r62p8J036o67n85J044
$$ 720 -121 -530 527 72 -625 415 302 -646 160 452 -579 -222 568 -394 -472 564 -103 -688 356
1584C56j73q90Q62K40j016N50N85j022P6R72p62l87J089l67p49R18M9j017P39
$$ 356 183 -707 155 395 -621 -71 514 -508 -432 540 -222 -609 480 113 -636 282 331 -686 53
1603E3M31r69L03P46q62j80R92n58n96R84j41r00Q75L30r92M48O25r29M1Q70p28
$$ 53 484 -485 -182 564 -298 -478 514 -44 -640 344 203 -697 178 508 -484 -36 589 -340 -299 571 -157
1624a57l56R75l37o93R02J05r90O11N21j019K64P77q42j27R49n50n51Q28N8r67
$$ -157 -513 462 125 -568 334 439 -551 60 581 -438 -174 603 -239 -366 583 33 -518 310 368 -599
1644e99P51L97j045M51O62q99rR29o62l84Q88k68p47Q44J15r02N17N47r06J19
$$ -599 152 549 -496 -45 617 -282 -291 638 -24 -408 480 212 -535 309 424 -478 39 586 -320 -201
1664b01P87o97l17R50m68o02Q99r6q09O17M48r78L39O53q56j2Q38n96m37R64l00
$$ -201 586 -111 -428 522 54 -548 351 255 -554 63 511 -467 -128 525 -331 -343 495 -101 -538 426 126
1685A26o67O83K03r06M80N57q99J39Q31p59l02R45m25n90Q38j2q76O40M22q71
$$ 126 -541 142 345 -561 -81 476 -423 -284 547 -212 -514 431 6 -584 254 242 -634 6 428 -443
1705d43K19P24p68j37Q46n15m49Q77k04p35P47K11q47M05N70q02P2P57o14l05
$$ -443 -224 500 -268 -405 441 -74 -523 354 150 -585 162 373 -474 -69 501 -301 -229 528 -86 -391
1725c91Q73k91o45Q04K8q37N55M28q29K15O70o17j78Q08m33n60Q29q2p61O63K53
$$ -391 482 191 -454 350 378 -459 96 524 -305 -90 580 -37 -215 593 160 -400 429 347 -414 249 502
1746E02q18L27N57q37N1P74n29n05R07k61p04P91J35q82M62M72q54J93O51o60
$$ 502 -316 11 568 -269 -218 556 27 -478 429 168 -536 255 390 -492 -30 442 -412 -219 432 -228
1766b28k32Q57m08m86P46o3p61O69K29p90K92N15o25o6O88m77l03O55o2o61O45
$$ -228 -460 397 -11 -497 249 186 -575 94 323 -467 -175 340 -285 -351 337 -140 -443 212 150 -511 134
1787A34J50p68L77N11p37P5P07n80k76P93l22n47P27L7o65M68L33p92K86O42o72
$$ 134 284 -484 -107 404 -333 -258 449 -131 -407 386 64 -483 244 281 -384 84 417 -375 -89 553 -119
1808a19j72Q06n14m16P85j72o21O82J94p83L93N02p90J03O82n76k61P04l19n11
$$ -119 -291 515 1 -415 370 198 -423 259 453 -330 63 565 -225 -122 560 -16 -277 427 108 -403
1828d03P10M0p42M49L83p41K40N99p09r0P63n15m13O89q3o11N25K58p16K67M81
$$ -403 307 347 -395 54 437 -304 -64 535 -174 -264 499 -16 -429 260 177 -434 91 349 -367 -100 381
1849C81o98K7P25n59l09P05j95o01P07O8p27M28L75o96J33O37n96k00P53m21m01
$$ 381 -317 -290 435 -124 -433 272 77 -524 183 251 -476 -48 327 -369 -236 401 -195 -395 358 -63 -464
1870d64P02n8o30N06K37o96L21N17o64p6P16m80l37P86k37o07O65O2o54M12L27
$$ -464 238 180 -450 56 293 -403 -82 435 -229 -305 411 -69 -406 380 143 -464 201 263 -391 21 348
1891C48o39R9O51o33j21O81k77m90O87m3o70N42K23o78K46M86n45j20O85m22l55
$$ 348 -291 -192 459 -174 -295 386 109 -381 306 263 -407 135 358 -320 -74 412 -133 -253 432 10 -345
1912c45P21j89n51N61J23o34L36L16n70K5O35m08l02P24l33n03O79l5n89M02K58
$$ -345 376 187 -364 197 320 -314 22 338 -232 -207 428 20 -282 442 109 -394 285 250 -339 63 321
1933C21o33K20N17n51j43O41l28l95O15p1o59O08J48o55L02M58o56K3O12m84k18
$$ 321 -312 -92 425 -126 -269 372 44 -351 264 193 -466 142 290 -365 -63 395 -261 -238 374 -110 -328
1954c28N90k00m68N19R3o42M10L31o23J14M86m72j05N95l43m03O17j00n17N31
$$ -328 262 62 -406 113 206 -436 -26 305 -318 -204 282 -190 -295 300 -43 -446 171 71 -446 85
1974H5J70o20K18N24o29K7N85m49k61O42k15m46N19J25o24L87L49o38J65M32m59
$$ 85 255 -365 -147 377 -252 -225 360 -89 -350 292 77 -369 150 275 -349 38 387 -251 -86 346 -113
1995a13j77O80l47l39N49jn84M48K79o38K18M89o03n8P11m85k33N57j18m47M48
$$ -113 -290 390 43 -296 253 252 -332 116 395 -243 -25 464 -139 -197 514 29 -204 353 235 -212 236
2016B36J44o40L20L56n76J3N76n42k10O43k60m14N38Jn30L85K27n95K22M25n29
$$ 236 380 -260 60 416 -160 -147 429 -113 -323 320 60 -354 184 185 -345 40 267 -328 -106 319 -210
2037b10r9N77k73l68M89q1m10L81K25o28K63L81n09l6O16m91k25O13k56l23M91
$$ -210 -309 268 -5 -373 116 35 -375 6 231 -397 -134 247 -262 -298 318 -173 -398 215 -41 -364 127
2058A27K5m99L07L10n31Q3N08m84n6N64l32l03N44r5n43M90J75n26K36L57m47
$$ 127 152 -347 -40 270 -261 -178 330 -154 -210 354 22 -281 263 168 -375 115 290 -236 0 357 -90
2079i0l5M64l50k15N00j14m11M65K2m54L07K98n80J64M25l70k54N74k66l42N05
$$ -90 -125 339 -11 -226 274 160 -251 214 236 -218 89 387 -193 -29 396 26 -228 346 80 -262 243
2100B43m0m87M15J53n28K34L42m32m3N31l88k65M85o9m33L85J00m91K87K88m60
$$ 243 203 -284 131 284 -244 -10 332 -100 -143 388 0 -265 220 151 -282 103 203 -288 -1 287 -173
2121a73L5M06l56k20N24k42l64M63jm50L56K65n46J90L57n02J4M97l04k44M73
$$ -173 -138 268 -88 -308 216 -26 -390 73 72 -378 -22 243 -303 -113 244 -258 -244 253 -51 -295 178
2142A78j02m65M65J14m89K36L43m94R6M36m39m7M17k15k80L47J04n24L45K37n19
$$ 178 76 -389 76 190 -299 -63 280 -214 -118 318 -121 -168 249 34 -246 101 205 -319 26 263 -256
2163b56J54L99m29l7M60k58k29M15q7l89L94J28n06K36L07m55K6M82l75k11M99
$$ -256 -102 297 -132 -169 291 33 -196 219 132 -257 137 265 -241 -5 302 -153 -127 355 -20 -231 268
2184B68j26l80L61J54m98K39L03m79J07L61l36j50M73k36k83M35p0m24M02Q2m20
$$ 268 142 -238 123 277 -221 18 321 -158 -51 310 -26 -176 297 61 -222 213 143 -281 121 203 -217
2205b17J86L10m47j3M51k90j94M51k01l42M08J00m23K06K18m05L4M14l92j26N52
$$ -217 -31 279 -168 -181 270 -20 -214 237 36 -306 102 202 -221 -15 203 -202 -168 246 -146 -272 280
2226B80k37k97M00n5m26L04K68m59J49K53l27r4M43k54j91M10m0l92L39R9l87
$$ 280 43 -254 146 91 -335 -31 237 -222 -73 180 -147 -241 202 -52 -243 167 127 -265 74 173 -214
2247b14J79K66m11L1M06k49j89L96j26k75L76nm76L09K28m14Q3L26k89j05M02
$$ -214 -35 231 -180 -149 257 8 -181 215 89 -186 190 185 -291 18 246 -168 -85 241 -48 -153 249
2268B49j89k38L79k7l87L06J43m71K08L20l66M3L54l40j45M22j50l65M05L2m28
$$ 249 60 -178 201 174 -213 93 236 -235 -27 293 -73 -30 324 -16 -161 261 111 -254 151 183 -245
2289b45K75K03l96J04L43l16j26M00k51k07L79o7l27K86J47m29J63L18m12l1M28
$$ -245 30 233 -163 -59 284 -32 -158 242 -9 -216 163 96 -231 55 202 -227 -64 254 -158 -189 239
2310B39l28j04K56m2k91L09O9m30K26K34l93J08L02k73j11L70j72k35L38J8l73
$$ 239 -89 -193 63 21 -270 39 108 -322 -96 138 -255 -147 155 -118 -229 141 -31 -266 72 90 -283
2331b83L04J61m04J73K79l67l6L89k54k06M66j03l05L15J03l91J71K80m13R0L00
$$ -283 21 182 -222 -49 230 -137 -173 216 -38 -244 222 119 -186 129 232 -159 12 292 -121 -31 269
2352B69l04j03M28k32j84L27l0l73K70J39l46R6K78k97l6L22j67k25L98r9l55
$$ 269 -35 -138 290 58 -126 201 171 -202 68 207 -139 -43 235 -62 -98 224 57 -168 230 131 -224
2373b24L06J03l27M9K96k71l7L27k85j31M29k32k20L34K2l37K32R0l10P7L44l28
$$ -224 82 185 -142 -93 203 -68 -105 222 -63 -194 235 3 -217 117 139 -198 34 124 -186 -109 235 -93
2395i3j15M09k37k13M08n9l02K31J05l35J34K78l37k9L38k73j41L42n4l44L04
$$ -93 -208 201 -36 -249 159 100 -202 29 134 -201 -67 211 -126 -155 183 -90 -231 111 57 -287 17
2416A7Q1l46K23J76l49J28K53k46j55M14j11l30L91n9l38K74J86l50J92J07k18
$$ 17 98 -248 -25 151 -198 -70 183 -63 -218 196 85 -245 146 87 -251 23 209 -141 51 158 -60
2437f0pK37j08k19L43n7k91K48J72m02J82K31l43K1K69k31n3L42k92j64L37L2
$$ -60 -67 170 62 -157 186 129 -162 86 258 -144 38 269 -74 -53 216 -15 -68 274 -18 -182 155 187
2459A87l13J83J30l26J65K25l35n1L68k23j77L20k4l35L16P9l56J19K83l91O3
$$ 187 -126 57 187 -139 26 251 -84 -135 233 10 -167 153 129 -206 110 189 -167 -48 235 -156 -93
2480i3K98l25n7L00j20j72K89k1k32J54R8k84Q7K53k88l9L10j96j42K75k2l06
$$ -93 205 -120 -177 123 3 -169 120 99 -133 21 119 -165 -78 175 -113 -152 158 -38 -180 95 73 -233
2502b33K31J30k98J29K09k74o2K68k12m4K66r4k07K69nk55K22N5k46N8K77k69
$$ -233 -2 128 -170 -41 168 -106 -168 100 -112 -156 110 16 -191 78 73 -182 40 95 -151 -93 184 -85
2524h5l0L16j68k17L18k3k74K34R9l60J75J83k28j9K91j58j71L24j26k33K38Q4
$$ -85 -115 201 33 -184 134 111 -163 71 170 -190 -15 168 -60 -79 212 54 -117 207 81 -152 86 170
2546A70l12K17J37k78PK98k75j22L34j23j90L22j05k45K82L6k78L3K77k72j1K53
$$ 170 -142 75 212 -66 -59 239 -36 -158 176 53 -137 185 80 -165 117 153 -125 -92 185 -87 -98 155
2568A55j17j86L03n1k67K73nk53O7K90k74m5K67j81j40L25j11k85L24nk53J83
$$ 155 38 -148 155 104 -163 110 105 -148 -81 209 -65 -110 157 -24 -164 161 50 -235 89 84 -169 14
2590A4O4k62P1K61k09j13K84j16k29K95rk11K00O4k81J28J66k76N4K75k27q7L01
$$ 14 78 -184 -113 148 -61 -174 110 -6 -235 60 51 -160 40 104 -177 -49 117 -159 -105 170 -57 -144 157
2613A57r8k13K39L0k92J30K30l20Q7K88k20p9K54j24j76K12L5k67J84J44l29K11
$$ 157 59 -154 85 115 -177 -47 183 -137 -50 238 18 -61 193 69 -107 105 140 -127 57 201 -128 83
2635H3J00k34J7K54k34k3J55rk34J75J49l31J55K47l71O4K11k30o4K06m9j81K09
$$ 83 183 -51 -34 220 -14 -37 118 109 -125 50 199 -132 23 270 -101 -37 174 -56 -120 86 37 -144 65
2658F5j4j95J31J62k97J18J72k66L5J71j29r4J88J0k33K38L5l40J51K24k79O1
$$ 65 51 -144 -13 149 -148 -30 142 -124 -89 82 -47 -141 47 57 -176 62 97 -243 -92 132 -147 -86
2680h6K31k20q7K58j02j82K51O9l03J92R7k51L3K55k22m2K42j98o5K10nk43J98
$$ -86 145 -75 -162 96 -6 -188 63 132 -171 21 118 -133 -100 155 -67 -109 133 -65 -130 80 75 -168 30
2703C0N8j48MK39k40MJ95j62o5K41j37j23K35J7k83J57K29k90K3J69j62o8K27
$$ 30 88 -60 -56 183 -57 -53 142 -20 -85 156 19 -104 131 148 -135 22 251 -39 -16 153 -9 -77 150
2726A50j11j62K12j7j93J87Q7k84J43J24j94J2J97j59j18K42p1k26K00P1k92J75
$$ 150 39 -123 89 72 -121 66 153 -131 12 136 -58 -46 151 -8 -126 116 45 -181 19 90 -202 -27
2748b7J35j91L1J77j45q5K13q3j64J43Q9k49J79M6k56Q6K15j80l3J63j17p7J75
$$ -27 108 -83 -52 125 -20 -105 108 25 -139 4 93 -156 23 69 -187 -101 114 -66 -99 64 -53 -130 45
2771D5L5k71K40N0k88J39J90j84l3K28j40j29K20j12k08K53K1k21J41J53k70L4
$$ 45 80 -191 49 99 -189 -50 140 -44 -77 151 11 -118 102 -10 -218 35 56 -165 -24 129 -141 -107
2793a07J69j17m4K53j39j67J93P0k46J50J40k36N9J90k76N3J64j22k6J20K3k38
$$ -107 62 -55 -99 154 15 -152 41 111 -135 15 155 -81 -22 168 -108 -55 109 -13 -39 81 104 -134
2815a34J30J16j56Q3J57k62kK16j72j8K56j70j26J38Mj94J62R9j91k2K25k20r
$$ -134 -4 112 -44 39 196 -66 -68 148 -24 -42 214 44 -82 56 60 -134 28 127 -64 -86 139 -81 -90
2838i0K66j86j09J88mk17K02R1k68J90J9k24Q0J49j91j6J89r5j54J99L1k23J57
$$ -90 176 -10 -119 69 65 -152 50 141 -127 63 82 -142 -62 87 -104 -120 69 -26 -180 19 50 -173 -16
2861a6P0j33j7K50k03p3K20j24j03J51N2k29J09J15j90Q5K15k50L2J48j50j02
$$ -16 54 -79 -96 154 -49 -122 98 -26 -129 22 74 -155 -46 69 -121 -36 179 -71 -39 109 -41 -143
2883a43K41m8j91K31Nj76O2J32j65K3J58j26j03K69q8j54K37o0k20K21k5j26P3
$$ -143 98 50 -141 90 95 -81 -19 113 -52 -29 129 3 -100 169 81 -73 164 104 -116 105 80 -46 27
2906B7J65k10l6K58j99r6K45q9j51J81M9k59J10J74j96l8J59j02j17K42l3k31
$$ 27 192 -18 -54 204 5 -91 154 65 -86 95 144 -115 -5 169 -27 -65 94 -8 -125 117 84 -147
2928a47J80M2k57J60J22k53J61J26j61o4J84j01j24J76l3j43J73N7k56J27J65
$$ -147 33 75 -182 -22 100 -153 8 134 -27 -91 93 -8 -132 44 11 -132 41 98 -158 -31 134
2949A34k24K9J58k05k1J44J3j64K25J0k32J53K0k06J08J47j85l3K08j18r9K46
$$ 134 -90 -61 97 -108 -129 15 28 -136 89 99 -133 20 40 -166 -58 89 -96 -129 79 -39 -138 108
2971A08q3j30J29J02k48N5K09j87k2K13j58q2K35j30j33J41J16k35J44J32k49
$$ 108 25 -105 24 126 -122 -67 142 -45 -67 146 -12 -94 141 11 -122 19 135 -100 44 176 -73
2992g3R6J34j73o1K52p7j59J13P1k23J57Q2k06Q6J59k42j1K09j34j20K26m0k64
$$ -73 23 157 -16 -77 175 98 -61 52 123 -100 57 139 -67 19 178 -64 -75 134 0 -120 106 66 -198
3015a98K18N0j70O2J49j85OJ43r3j06J83l7j91J93K4j76J12J26k24R0J24j67k4
$$ -198 20 70 -100 -38 111 -74 -68 75 -18 -124 59 22 -169 24 48 -128 -16 110 -114 -24 100 -67 -91
3038i1J59l8j58J47M0j81J20L6j37R8R5j66LK24k06NJ49j17q3J76k9j91J26J00
$$ -91 68 30 -128 19 59 -122 -2 34 -103 -5 90 -76 -73 151 -55 -50 99 -18 -101 75 46 -145 -19 81
3062H1j70N5J36j65n3K44j12j08J56m6j20J55J2j54J37j1r0L0J81j58r6K62j18
$$ 81 -89 -34 102 -63 -116 128 16 -92 64 18 -102 53 65 -89 48 37 -53 -23 158 0 -96 166 48
3085D8j45K03J2j82J26M9j17QJ20j25k6J11p9r8J95K6k33J54L5j95R8P3j00K0
$$ 48 -97 106 118 -64 62 111 -6 2 122 -3 -29 82 3 -95 100 126 -107 47 82 -113 -15 58 -42 -22
3109b2J07j05j32K21rk06J69M9j42K0R4j38K1J83j79k6J68o3j40J54J1j56J36
$$ -22 85 -20 -152 69 60 -146 23 72 -70 -50 44 -94 -73 110 -69 -95 73 10 -130 24 35 -121 15
3132A5J6j65P0J07j07r3K25j44k0J87l8j71J44N3j59M9J12j74L9J89j61o3J84
$$ 15 31 -134 -64 43 -64 -157 68 -76 -96 91 53 -118 26 79 -80 -31 81 -93 -54 135 -26 -89 95
3155I5n0j66K05j3k04J71L5j19L8J17j12p3K18j12j00J56l5j15J10N4j79P4J10
$$ 95 45 -121 84 71 -133 38 73 -46 -8 109 -3 -76 142 30 -70 86 51 -64 46 100 -79 -5 105
3178A05j03k2J07o5p4J44j35K4Q9M4j56O3O4j49NJ89j69o7J87j22l8J56r6j13
$$ 105 2 -20 87 22 -52 92 -43 -19 70 114 -42 21 85 -64 -59 130 -39 -106 81 -41 -79 77 -19 -132
3202a32J27R7j95N9J16j37OJ24j01o5K06j53m8J18qj35J50J2j86N9J16n7q0J72
$$ -132 -5 92 -103 -44 72 -65 -59 65 -36 -101 105 -48 -96 22 14 -121 29 41 -145 -86 30 -27 -107 65
3226F5j59j7J90p5j21R2J43j70K2O5q1P8O1j85P1N3J2r6J20k5j08J08Qj29P7R4
$$ 65 -94 -111 79 4 -117 -25 118 -52 -30 35 -46 32 93 -92 -21 32 44 -52 68 43 -65 43 51 -78 -1 93
3252I3q3p8R6n6p7J83O4j91O3O6j38O0R9j11j3J39q3r1R7P1j91J31N3k14J31Q0
$$ 93 10 -68 28 -28 -105 78 142 -49 14 80 -58 2 101 -10 -23 116 33 -58 39 110 -81 50 103 -111 20 100
3278A00j02q7K37r0j09J83p2j30J49j1j33O8O2j80K8K11j49J5Q7o7j53J90k6j12
$$ 100 -2 -89 148 58 -51 132 60 -70 79 68 -65 3 65 -115 -87 124 -25 -10 77 10 -143 47 21 -91
3302i1N7P3j29Q9O0j51O5J17j22j9K6kp3O8O3j24Q2K9r0M7J17j57m1J83m7j34
$$ -91 -34 39 -90 -1 59 -92 -27 90 -32 -51 -25 -27 -100 -32 31 -93 -11 18 -72 -25 92 -65 -106 77 30 -104
3328a04J69m0j29J44L6j64J19Q7j43oQ3p3j3Q4rj66J81k0p6N5R6j45L1J34j34
$$ -104 65 25 -104 40 76 -88 31 118 -25 -31 52 -21 -34 50 41 -125 56 36 -40 15 111 -34 -3 131 -3
3353cm5J38l8j06J42j2j10J00K2j17M9N6j24k2J51m6KR3r5j01R1P6j54R4Q5j61
$$ -3 -48 90 52 -54 88 76 -34 66 88 -29 20 76 -48 -70 81 35 37 130 35 -66 25 101 -53 41 126 -35
3379c5p7K36j40n6J88j40l0J37m3j77J12O8j77P2R4m4j04J81o7j50J86j2j95J62
$$ -35 -112 124 -16 -72 116 -24 -54 83 40 -137 -25 43 -134 -62 32 -12 -116 65 -2 -152 34 22 -173 -11
3403a1L6r7j2J41j91M4K27j78m0J13m2p6R8M8j55P0R0j16J8Q2o4n9J92j55n9J73
$$ -11 25 -72 -84 57 -134 -90 137 -41 -81 32 -10 -86 12 60 -95 -25 65 -51 -33 49 -15 -74 118 -37 -96 77
3429G7m4r3J26J0j23M8J44j31k0J39j75k0R4O4j36J20l2j12P5J15j40LJ83k16
$$ 77 33 -60 66 76 -47 1 145 14 -6 133 -42 -62 32 96 -40 80 48 -64 11 126 -14 -11 172 -44
3453d4K8J17o9j20J66l6j28J33Q6k14J13L5j05NJ02r6k9J88j43q3P6Q7j59J01
$$ -44 -16 101 32 -88 78 42 -86 47 133 -81 32 67 -38 -33 69 -27 -56 132 -11 -94 -18 69 -90 11
3477A1M1j02m2J26m1m5O1m2q0J70k5k46J82R1j49Q5M1j40M6Q7o3q6J08m2n3J13
$$ 11 52 -50 -92 34 -7 -52 9 -33 -113 57 32 -214 -32 59 -90 -5 36 -104 -58 29 -34 -120 -12 -54 -107 6
3503FK5j32R6P6j09M2O1r2j0J25n2o2P1l5r0R1L9r9j3J39j11j9J30r0NJ16k0j06
$$ 6 31 -101 -5 71 -38 4 65 -27 -37 88 36 -26 45 10 -80 11 50 -49 -62 77 -34 -53 77 -13 -8 108 88 -18
3531a8P8M3j67J26M5q9l8J76j96J8J50p3j66J90lj03J06N4j34OP8r2l8J18k6j09
$$ -18 60 103 -64 62 107 18 -20 156 -40 -22 128 55 -111 79 76 -27 79 133 -1 5 83 -9 -47 71 45 -64
3557f4J72j14n7J20mq7j9R6j22k2J86o8j08J42K0j97J79m3j21R6N8j50M0J23j16
$$ -64 108 -6 -63 57 53 -34 -53 43 -79 -101 85 17 -91 51 71 -126 53 10 -111 -15 43 -107 -67 56 -60
3582f0l6J26o0k4Q3k6p3R3m1j8n8J90j14o3J21L0p1M7k2j17J29q5K6L9N2q5J2
$$ -60 -96 30 -30 -54 29 3 -70 23 -18 -36 -94 96 -18 -81 40 70 -1 46 24 -93 36 -49 -23 16 68 -17 -5
3609eJ21j10rJ00l2q5Q5J4n9M6m2j1oR9j04K1O3m8n8M2O8j47Q0P4j37N3N2r0k8
$$ -5 116 6 -3 97 65 -20 65 79 20 66 24 13 7 106 2 23 86 38 -20 22 90 -57 23 97 -40 13 65 -25 -53
3638e3J70j20j4R0k8q1N4M6r3Q2Jr9M7J19j55MJ09o9l7L9M1j01P0O3j33L4O9j28
$$ -53 117 -3 -17 73 45 -36 18 64 -29 53 54 -45 2 121 -34 -30 79 10 -27 12 53 -48 22 85 -48 -14 55 -73
3666g3PR8o3m6J34q7q8J15O0j45M7P7j23J0J51j31J2R1m6j01Q9N8j40J00K6n9
$$ -73 -66 32 -31 -77 57 -30 -118 -3 57 -88 -41 36 -87 -77 74 -57 -45 46 0 -101 -12 46 -94 6 32 -27
3692b7K6J11k01N7J13m3l9N2l9p1J12J7p9O4M7j23l3J45j22o6K12j09o2P2O9j06
$$ -27 -1 110 -91 -34 79 36 -3 49 10 -61 51 68 -11 53 100 -23 -56 89 -33 -99 113 4 -58 14 83 -23
3718b3L8R8j12k7J22n4q7J61q2m8O4k7m4O7Oj22P8N7o5m6R1Jj22J55j04qO3M1
$$ -23 15 113 1 -26 96 42 -45 116 34 -14 50 23 -21 46 52 -70 8 65 0 -46 45 46 -76 79 -25 -33 30 71
3746G1j08L2O9j51O7P9o1p1R4l3m5R6q4o5J49j0j23Q9O8j25J2J44j41l8J31m1
$$ 71 -37 -5 64 -87 -20 59 -2 -73 21 -12 -57 39 -45 -110 39 29 -94 -5 63 -62 -50 94 -47 -85 46 5
3772Ej49J61P1j44P5K8j00j1J71j33NP9l3j09J26K9j27Q2J4l2JN3j40O1J50j22
$$ 5 -144 17 88 -56 19 47 -53 -64 107 -26 -21 58 25 -84 42 71 -56 26 40 8 9 62 -78 -17 133 11
3798A1j5M8m0m4P7M4j04O7P1k09L9J38j29O3N6o1m5N2J6o6P1J3n5p1J71j10k2
$$ 11 -4 44 4 -40 37 81 -23 44 115 -94 -55 83 -46 17 73 12 -33 19 35 -31 40 53 -2 -73 98 -12 -34
3825c4J12o8j01J29k6q5O8K9r7K7J08r1l9J37n7o1R7j0p3R5l4j31R3Q3j86R2J7
$$ -34 78 10 -91 38 12 -73 -5 24 -73 -46 62 -29 -68 69 12 -49 48 38 -35 60 26 -105 -12 71 -115 -23 -6
3852fp0N5P4m1p3M3L2j30R8mo0M3R1j36KJ63r9j13K14p6j35J94oj31P2J13j77
$$ -6 -76 -21 53 12 -61 -18 14 -116 -18 -22 -82 -39 52 -84 -82 81 -18 -131 83 7 -128 66 60 -71 1 114 -63
3879f3L4Q2o2L4Q9j29o8J78J2j78N2J31j51P3J0j3o4R8p6m7J75j26pR9l6m7O3
$$ -63 -29 53 -9 25 114 -15 -83 95 107 -71 -19 112 -39 34 44 31 -33 65 -11 -58 117 -9 -16 83 47 0 63
3906F3Op5m6J13n7n9Q7m9m2J40l1j19L9O1o8J1Q8p6LL9n0m7O2P0j54J11lj15J10
$$ 63 69 -6 -52 61 4 -55 32 -17 -59 81 50 -69 -30 31 -37 -26 62 -14 -11 28 -22 -69 -7 63 -91 20 17 -98 12
3935A2K2p0J2M8m3n9J46jj85J40M9j79J07K8j08P0M8j18M0Q6k1j08Q7j9k4J03
$$ 12 34 -36 -24 24 -19 -78 68 67 -118 22 71 -108 -1 27 -81 -11 37 -81 -41 45 24 -84 3 -16 -40 63
3961F3j1j29J39j5q7nJ33o6j02P9N6r9J02j6p5M8N7q8P0M1q5kJ46j06p4J29l7
$$ 63 52 -77 62 47 -40 -45 88 22 -80 -1 55 -44 58 42 -33 15 72 -16 54 95 10 8 154 48 -26 103 66
3988F6j18J74m4p6J7M5j17O2R7j07m6N6k2r5J70m5r1Q2M5j60J17R2j24M2M0o6
$$ 66 -52 122 78 2 19 64 -53 9 106 -1 -47 9 -13 -108 62 17 -74 8 53 -107 10 102 -22 20 60 -6
4014fp7Q5M6j04K4R8j51Q4M8j04rJ36j33RJ0P3j44J21j0o9Q6J9o3p3J52r1m7J25
$$ -6 -83 2 48 -56 -32 66 -85 -1 47 -57 -66 70 -63 -54 -44 29 -115 6 -4 -73 13 32 -31 -104 48 -43 -90 35
4042C5q9%Q2k4q5N0P2r2J1J22p3n2L7op2J00K0q2J4J30j56N2K9n8lJ67q5k2O9
$$ 35 -54 -54 28 4 -81 -31 41 -51 -40 82 9 -43 -6 -12 -84 16 36 -46 -32 98 -58 -6 23 -35 -38 129 44 22 91
4071I1m2o5N0M2n7K0om2oR8p1l1J13q8n5Q9Rp1L3O3j62J00J1Mj22J75q0l3M0L8
$$ 91 49 -16 34 76 19 39 33 -9 -15 83 12 -19 94 6 -49 40 49 -22 11 74 -88 12 23 27 -95 80 0 -33 7 45
4101D5j01Q8k4o1R8m3n9j5J52j62J0R7k4j22J36%q7J19j7j03J36J8j12k3J32j15
$$ 45 -56 32 8 -53 45 2 -57 -72 80 -82 -72 25 1 -121 15 15 -72 47 30 -73 63 81 -31 -54 78 -37
4127c7mQ7q6L5J3J4j24J23L6r9N0Nm0J3M9Q3j89Q3L1j59J21O2j42Q4O5j27N4O9
$$ -37 -41 46 -40 -5 8 22 -102 21 57 -42 8 13 -27 -14 35 118 -71 12 43 -116 5 67 -75 9 74 -53 1 70
4155G0m2o9J09m7r9J12L7r6K7J1k3M2K0k3k1M9j5j1L7k7j01P9%n4P1L1j05M7O9
$$ 70 28 -41 68 21 -78 34 71 -25 2 13 -10 32 52 29 8 57 42 31 68 41 -60 19 19 -35 36 67 -38 9 78
4184G8n5j04J05K4q5O2N2k08Q5J68j35l9P6Nj01J04k1r0O8k4k7R7p9l8J8R9m8
$$ 78 23 -81 24 48 -37 25 77 -131 -46 122 -13 -52 24 29 -72 32 11 -79 -11 -35 -62 35 -44 -82 -64 35 -13
4211a3m8J30p1j13J16K9q9N5k3k7N0K0m8m7J20o7l9J36n5o7N4J5k5j1K1o6P7R2
$$ -13 -61 69 -2 -115 1 30 -59 -4 -27 -54 -4 16 -32 -79 41 -26 -65 71 16 -51 3 18 -7 -18 3 -63 14 106
4239A06j26J6M7k8Jk4k2MJ8J7%j1R9q1q4J31p7k8J01j0j05J06l1m6J4Q1k2o1Q1
$$ 106 -20 -4 43 15 16 -8 -30 -26 -8 9 9 -2 97 16 -68 63 -14 -42 59 49 -56 50 19 -27 -13 68 46 -15 66
4268F6o6PO8k9r5J18k7j23R3Ol4M5L4q3PN2p1m3P7k3n4Q7J8j24P2K2j6k2O3n0
$$ 66 0 7 75 46 -49 69 42 -81 12 18 -16 29 63 -20 -13 39 -32 -75 2 -21 -75 12 30 -94 -22 0 -16 -38 25 -25
4298b5m9J34o0r5Q0m2pO2j9m6l6K00j95O4O7n4j9P8op4N1K0j25P4N9r8M1Q2n8
$$ -25 -74 60 0 -95 -15 -57 -64 -2 -21 -67 -103 97 -98 -34 33 -21 -40 38 32 -42 9 29 -96 -22 37 -61 -20 62 4
4327Dp7J00L1p4J8j0%N1j5p9M0J00r8j1Q0q3qP0O6j52R5J0r5Q7L7n2k4K6n0lJ30
$$ 4 -73 27 58 -16 2 -8 -8 43 28 -51 -11 89 -9 -20 60 -23 -31 39 105 -47 48 58 -37 50 87 35 11 37 -13 -16 114
4358A14o8m8K8L8p9nM9q2O1Q6j25j9N3oj03J63m6m4J2M3n7pQ4o5p2J20n5n0Q5
$$ 114 46 -2 26 64 -15 -20 29 -53 8 94 -31 -50 3 -3 -106 57 11 -33 -21 22 -35 -42 42 -23 -95 25 -30 -80 5
4387EKm0k1N9n8M8L6m6l3J06j04pO2N3j28J24k4j01M6Q1o5j6Q8q1J6Ll4RJ7Rp7
$$ 5 7 -33 -54 5 -53 -5 31 -15 -48 58 -46 -53 9 62 -66 58 34 -67 -21 60 -5 -21 67 -14 2 5 -29 -20 -3 6 -71
4418g1J08lm4K8K3n8j1Q6r2QJ28q2J1K2K5j21J05K4j25M5Kl4j6M8K3n0O8k4m7
$$ -71 37 34 -10 18 41 -17 -28 58 -34 -26 102 20 31 53 78 -43 62 86 -39 6 8 -26 -42 6 29 -21 47 23 -24
4447b4J09m5r0N3K1o1j3R1%j41J43Rj02P9jq0L4K4k1n1R1n9K1k6L3m2O6K0j10
$$ -24 85 40 -50 3 24 -37 -50 41 41 -100 43 52 -50 29 28 -52 -18 6 -15 -66 25 -34 -13 -39 -6 -48 18 38 -72
4476g2K2P1o6RJ26r1p5J40r2J5M0k4l9L8K3p6K8J2rJN5qq3J15l4J8K1p6j7K3L3
$$ -72 -50 21 -45 -36 90 -1 -76 64 -28 -13 27 3 -36 2 25 -51 -23 -11 -20 -19 36 28 -55 60 26 44 65 -11 -28 -5 28
4507B8r5Q1L3l0qM4o7PM0J3k4K4m2J2o5J18p5k5Q7km4P9o4m9M4P4j45J5Q3q7O5
$$ 28 -67 14 47 17 9 53 -14 -7 33 46 22 46 4 16 -49 69 -6 -31 56 54 10 89 25 -24 20 94 -51 -36 47 -40 25
4538B5J8k9m0Q9o5j6M1J4j05R0n1P2o1K8m9M5kj2m6R9q5j1N9K8j38R1K0mj17J18
$$ 25 43 14 -26 63 -2 -18 23 37 -68 22 -29 43 -18 10 -39 6 4 -8 -54 45 -40 -51 8 36 -102 -11 9 5 -112 6
4568Fl7l4J39n7p2M1L0o6jOO5l7O5j11L9N5qk9j2PJ5lj9L2n8Q0l9OmK1j3K8Mn7
$$ 6 -31 -65 74 17 -55 -14 16 -50 -51 -45 20 -17 48 -63 -24 31 23 -6 -18 -11 4 1 -18 14 -44 36 -3 3 -1 20 7 35 39 -18
4602a8Q8%j11N0M1n9K4N9m3K3j1o7M2J1l1k0K5O2k0l4J5l5nJ05p5pM5q5J4JR0
$$ -18 70 70 -41 9 50 -9 15 74 31 54 43 -24 18 29 -2 -22 3 65 45 11 26 -9 -14 91 16 9 54 -31 -17 -16 74
4633G4m1mmJl5L8lj26J38o0j4N3m1k1M0N5o5j6Oq9J07K5Mn2Rj1LL6J6l1j7Q1j19
$$ 74 33 29 25 26 -9 29 26 -100 38 -22 -36 17 -24 -45 -5 50 -15 -31 -25 -114 -7 18 22 -30 -21 -32 -29 7 23 -8 -25 56 -63
4666f3M3M2o1j8J11o5m8K6P1j29J67o3K1k2M3j14P2O4j25J2Q7K0j45J22ml3K5
$$ -63 -20 22 -39 -57 54 -11 -59 -33 38 -91 76 13 34 12 55 -59 13 77 -48 -36 51 71 -74 48 44 11 36
4693C6Jm3L4N4j15K0Q4J2o2M9n2LjL2o5l3Q4m1p7J20oj4N6r2j9K2N5j9j7M1j6
$$ 36 37 -6 28 82 -33 -13 71 83 21 70 18 21 20 52 -13 -46 38 -3 -80 40 34 20 76 -16 -35 -13 42 23 6 47 31
4724C1k2rJ0l6J12m5p5K8j8k1N3M5mo1Q2q9j5R2m9o6O7m6J5L8O7r8mK3m2M9l3
$$ 31 9 0 10 -26 86 41 -34 -6 -24 -45 8 53 49 -12 70 -19 -34 58 9 -57 10 -36 -21 17 84 -14 -18 5 -37 12 -21
4755b1L8j09O3j1QLL2o0M5L2n1m3R7o7k4O5mn9P6L1n1L0j3Jm1J05p5l9P2K2r1
$$ -21 17 -92 -29 -40 -32 -29 3 -57 -12 20 -31 -74 23 -44 -68 -3 -7 -66 10 41 -10 20 7 8 -33 72 -3 -42 30 52 -39
4786c9P1Km1N7M9r8K5j1k3L4Q7j44K5Q6o4o1Q9L9j33O0P9q7m3Q8j7l0R9o6k8L3
$$ -39 32 34 -7 50 99 1 26 15 -8 26 113 -31 -6 80 16 -45 44 83 -50 10 89 2 -41 47 30 0 99 33 5 38
4816C8o0j7P0K8q8jR1l2m8K4j01O3K8j2K6PK7o5l2L0n6Q8L3q6M5Q4j27l4R5K9
$$ 38 -22 -39 31 59 -29 -30 61 29 -19 5 -96 -33 -5 -17 9 16 43 -22 -54 -24 -80 8 41 -45 0 84 -43 -77 18 47
4846D7r5K9L3n8J7Oj0m2O6%j3R5j13M4L9r9M3K1P7r2K8M3r5n3J47r3nJ8K7m9N0
$$ 47 -48 -19 14 -44 -27 -21 -31 -73 -7 -7 -20 75 -38 6 45 -54 -11 10 87 -5 23 66 -29 -82 65 -28 -33 -15 12 -37 13
4877A3Ml0L6K5k8mJ5pm5L3j7K1J8L6p3K7k4q9N8O4J7l3J6%o7J6N3%o9O6K7r1L1
$$ 13 17 -13 23 48 20 16 31 24 -21 12 -5 16 34 70 -3 24 0 -89 -31 33 50 17 33 33 -34 -18 35 35 -34 32 59 -32 -1
4910a%m7J19j03j1K8k8j1J8jM2J4%k0K8qJ8j42J58m5p2P2J9n8K9P4j32K7J2j8
$$ -1 -1 -48 71 -32 -43 -15 -43 -54 -36 -37 5 19 19 -1 27 19 37 -105 53 8 -64 8 27 -31 -2 72 -60 -33 -21 -39
4940c9j6O3jn5N1K1p8P8m6jjK4mk8Q9p4RO2k9m8N2pj5%L5j04M3N9o2K2P4l7o0
$$ -39 -55 8 7 -48 3 24 -54 24 -22 -23 -24 0 -4 -32 57 -17 -8 54 25 -23 29 22 7 7 42 -62 -19 40 -22 0 74 37 -23
4973b3K9kLj7JJM2K3o5K5j6N3p8L3L1m0JL3p4J4O9j2k7k4J3n8J07m6m4J08o7n4
$$ -23 6 4 7 -10 -9 -8 34 57 -8 17 1 54 -24 9 40 0 1 34 -40 -26 43 31 4 -20 -7 -65 42 -4 -48 60 -7 -61
5005f1J7Q5o1j2Q4k7n6N4q1Q9k3k4j8k3L3j1l0OL1OK8Qk4l1M9o1P9n0j2pM7j9
$$ -61 -44 41 -20 -32 52 25 -31 23 -58 31 8 -16 -34 -57 -24 -35 -65 -59 -28 -22 6 14 -10 -41 8 -53 26 -24 -36 -43 4 -15
5037a5mM1n2J6J1Q1j14K5k2L5J1J3k6O4p4k1M7L2n1kJ6K4m7L3M4k1Kn0pJ3Q6j03
$$ -15 -19 22 -30 -14 -3 78 -36 -11 -33 2 13 26 0 64 -10 -31 16 48 -3 -5 11 35 -12 21 65 44 46 -4 -11 2 88 -15
5069a5lJ11q3mJ4OL9p8O5j09N0J5k3RK2j3j5N6k3m5JN5o8K2N5Op0K5K9m2N3p2
$$ -15 -18 93 10 6 20 26 65 -13 52 -57 -7 8 -15 -6 16 3 -12 44 21 -24 -23 32 -36 -14 41 47 -23 2 31 -11 42 -30
5101c0l6P4j4k4L3k4K8qL4k6o3LM1l6K8M3r5Q7M4p2j4M3m1M5J3m5j02Q1L3k8L9
$$ -30 -66 8 -6 -30 3 -21 7 -1 33 7 -56 -53 -12 -48 -20 23 -72 15 59 -13 -27 16 -25 20 33 -12 -114 -33 0 -28 11
5132A1k9n3K8Q7q5P9K7j2o8N5l6o8M3L9p2Q1O4r0L5K2r3O2J7n0k8M3Ll3N2jJ3
$$ 11 -18 -71 -43 44 -41 38 65 53 -15 40 4 -64 -21 18 -54 27 91 1 36 58 -35 27 44 -6 -34 9 12 -21 31 30 43
5163D3o3P6o3O8m1kn9N5lr5Q2jJ0RJ4n8J3okj1J05q8n4J07qm3lO1k6k6Oj8NJm7
$$ 43 -20 56 -7 61 20 18 -41 14 11 -84 -2 -3 7 16 30 -28 -15 -21 -23 -34 71 -17 -71 36 28 -15 -18 43 17 -9 -3 -21 -16 -15 -62
5198f2O1j4Q2o3j2L5k4J3rl1J0N6q0J5K8l5L8L9l9l6M2l6M5k8jml2N0l5qL9JR
$$ -62 -1 -15 67 4 -8 27 3 16 7 -24 -14 42 -38 -23 5 -30 8 47 8 -28 14 -22 23 -5 -6 -10 -42 8 -27 -35 4 5 14
5231A4oJ6p5P8j2o6J2O8k2m1P9pl6k2M5m2Q7q5M6p2N7l5J8L8K5j5J6p5j6J9nK6
$$ 14 8 24 -51 27 15 -51 -39 29 7 -34 45 38 2 -20 25 -17 70 -15 31 -41 16 -19 -1 37 62 47 63 -12 -28 -9 -14 12
5263A2l8K1kJ1j5kjJ59j56l8L2M3p6J7O0q6P6l6k1MJ09n1k4k6N6l7nK4o1L3j2
$$ 12 -26 -5 -7 4 -11 -13 -14 145 -11 -49 -17 26 -50 -33 27 -59 17 -19 -40 -36 73 22 -2 -28 28 -9 -14 10 -51 -18 -30
5294c0RPj1M1oL0q6N5jQk2K2j6q9N9K5m6L0l5K7J3O9m4jJ1J3l4J8jM9m3Pn0O0
$$ -30 -21 -14 -25 16 10 40 -46 9 8 16 -6 16 0 -89 -30 -5 -51 -21 -56 -29 -16 53 9 8 19 32 -2 16 15 64 21 28 -22 38
5328C8m4L7o7P6J8m1K3jj7o3M2K1l2J5PM2l7J4k3NRm3J12p8Ln5L2M%jk8J3Q3l8
$$ 38 -6 31 -36 40 58 17 40 39 22 -41 1 22 -10 5 12 54 17 31 8 13 22 -21 91 13 16 -39 -7 -3 -3 -4 -32 -19 64 26
5362B6k6j0J1m0J1K0j9K1l5K0qO6m0l3%O0m2M5J2r4N3mm3K2K9J8Jn3L4m7N4j7
$$ 26 0 -10 1 -39 -28 -8 -27 -6 -41 -21 -29 37 -3 -36 -36 24 -18 27 39 -55 -2 -6 -49 -27 2 20 21 -32 2 -45 9 -8
5394hjJ8k9m0L5O0p0MM9j7oO9p5L9n1J4Q0r8P3q0JJ24o5j7N4m1j2k4J4JN3Nm8
$$ -8 -9 9 -20 -60 -25 35 -35 -31 18 1 -5 64 -11 28 -23 -9 71 -27 46 -34 -33 91 26 9 63 22 10 -14 0 1 54 59 11
5427A1j9O4K0q3J10j33N5%j0o2Q8Qn2k8Q3l9n3M5k2j4L4n9M9j1N8o1L7Qrj6rL8
$$ 11 -8 56 76 -7 103 -30 25 25 15 -47 41 49 -3 -31 52 13 -40 5 -17 -31 3 -56 -7 -18 40 -21 16 24 15 -1 -10 28
5459B8n0O3n8o5P9k1qK8l9N0J2l5K3n5N8k7K4J9n7L2lK5m2M3Np4L8m0O9l8kJ7
$$ 28 -22 41 -17 -82 -3 -24 -32 -4 -43 7 19 -16 7 -48 10 -17 7 26 -31 1 -2 23 -19 24 29 -45 -7 -47 22 -16 -18 -1
5491ak0Q9o9L2o8j6K7RJ0N6l2K7j00M5L6j6%k9J2mM4L2j3jm7K2k8j0M8l7L5K5
$$ -1 -21 68 -1 31 -37 -53 -26 -17 -7 49 17 44 -56 -11 25 9 9 -20 -8 -12 32 64 51 50 3 25 -3 -13 35 -2 33 58
5523E8j3m3N5m4J5pj9kpL6l7J5M0r8J6J03o8Pk3k7N0J7Np6J1JPMK3nj3Mm0K4O6
$$ 58 45 2 57 13 28 21 2 0 -7 29 -8 7 47 -51 -35 68 0 7 -16 -43 7 24 29 -47 -36 -35 -28 -24 -1 -6 -19 -15 -55 -31 35
5558C5l7PRqQJ0O1j37N9M6n4J6O4r1J1k4J1L2m9L6k8NrOO3j9n1MJ0K5J5l8M3m1
$$ 35 -2 5 14 6 14 24 85 -52 7 53 -1 15 79 -12 -1 -25 -14 18 -31 5 -23 -18 -27 -21 42 23 -28 -24 -14 11 26 -12 31 -10
5592a0K2l0QK8k4K6j6L9J3m7K9k6j2J9n7M9j2KJ2K0L3p6L0l9J8k0J05r2m7O6K5
$$ -10 12 -18 -10 18 -6 20 4 43 56 9 38 12 0 19 -38 11 -1 1 13 33 66 -10 20 -19 -1 -21 84 -8 -55 11 36
5623C6l2L0M2j30O9o0L8j3NM3n3L8Nj7J1m4K3J3l5J7kN2j06P7L3oj7l6OKL9n4
$$ 36 4 34 76 -54 15 -45 -7 -20 -15 28 -25 13 18 1 12 -32 -9 4 -31 -14 -16 36 -70 7 40 34 17 -19 -13 -11 28 -26
5655b6mL3J5K5o1K4J0j5N1m8k3K4K1o4N9O9j00j0Rjj7M9o9K6Q5p2L0pj6mkN4m5
$$ -26 -30 3 18 43 -18 6 16 1 52 4 -19 5 26 -38 21 90 -10 -20 -11 -12 -29 20 -49 -23 62 -10 20 13 -3 -7 -9 45 0
5688@L2Qo9jO3k2pP3r7j3L6P3p7k1L4PK4j4J8j03P6j2j0O6n1J6l7L3J2j4N8o5
$$ 0 32 40 -29 -30 33 11 4 77 -20 -33 3 76 -1 -22 12 19 43 29 47 -56 20 8 -2 64 13 29 -8 25 37 23 81 16
5720A6M0o8N9p7O7p2N6o5Q5q6KO0j4m3oN0K7j1n0J0J3M6n6Mj2K6m9P2J2n8K7O4
$$ 16 56 -12 47 -30 37 -35 21 -44 41 -45 -43 17 3 -40 -46 4 31 20 -30 -20 -7 39 -17 -13 -25 1 -48 24 36 -22 5 69
5752F9p0Pj5L2NK8n5j0O3o0j3Q0r2j1M5m%J9m5j3K3KKj2l0P9p3O9K6l3mJ1O9j08
$$ 69 -1 6 -9 23 28 56 1 -9 54 -6 -19 61 -31 -42 3 -1 -1 18 -27 -40 -17 -15 -13 -25 -55 24 -49 20 46 13 9 20 89 -19
5786a9J3k6O0m7rqK7L8o6P4j6j5PJ8m6L8J2l7K8l5Nl0O8l1k2Ol1L5P4p8%OK3o3
$$ -19 -6 -32 28 -19 -28 -36 -9 29 -37 37 21 6 13 31 -15 23 35 -2 26 -9 -4 -34 34 3 -19 -13 -44 -9 65 -13 -13 -7 16 -47
5820d7L9O7q7QqN6o1L8j4Pl6KN2K1J4kn3L3Jp5P3om6L7mk5m6J22l2qL4k4Pn8L8
$$ -47 -8 59 -28 -20 -28 28 -33 5 -9 -2 -38 -36 16 37 51 49 -4 29 30 -45 28 22 -24 13 9 -16 -62 60 28 20 54 30 37 -21 17
5855A7nl5J14j35L6L2n1P7n8O4l9j6L9k5l5N7l8K3k4m9N9K1k1L1n4O9k5Pn6k1
$$ 17 12 -23 91 -44 -8 24 -27 50 -8 56 17 1 40 15 -20 37 -1 22 -2 -51 8 29 8 39 -15 54 29 36 -20 -41
5885d1M4J1J2L1m9L0k2m6P1j4j2L2r4Q1m8k9N5l9L9ljJ9J5p0J1J4m9Q0lj9j5Q
$$ -41 3 14 26 57 8 38 16 -30 41 27 15 47 -47 34 -14 -43 12 -27 12 9 8 27 42 -28 -17 -3 -52 28 25 6 -9 -1
5917an9N9m6N8j0n1N5rQOn0M1Mn8RP7o3Q6k8l5KK0n9L5N1k1Nop2L6O2kk8l6K5
$$ -1 -60 -1 -47 11 1 -50 5 -4 4 10 -40 1 5 -53 -44 33 -30 56 28 -7 -5 15 -44 -9 42 21 26 20 -52 -16 46 44 16 -20 5
5952EJ4mj8J8J7m5K3L5ok9K8l2J0l1N9Pl9k7m4O2JOL2m7R3q3l0J3J7J5j7L6l5
$$ 5 19 15 -3 15 32 -13 10 45 39 10 38 6 16 -15 44 51 12 -15 -59 3 4 10 42 -5 88 5 -25 -12 5 20 3 39 4
5985Dj8M8j13R4Ln5P7j7%n1rLJ2L2J7k5K6L5o8K3n9J5M7j8k5jK9j3J4M4l2ln9
$$ 4 -14 34 -79 15 18 -37 40 23 23 -28 -37 -34 -22 10 27 2 28 63 -5 18 -41 -26 21 3 -22 -23 6 -7 7 51 19 16 -43
6018d3J3N3l8J1oj8L4l8J9P0n7O4p1J1l3l1J3Qm3J47n8k5pQ8m9L5j11R6op1O7
$$ -43 -30 23 -15 -4 -10 -28 6 -32 -13 57 0 64 -7 4 -29 -60 -47 -39 -82 65 7 -18 -25 63 14 49 -62 34 28 -43 24
6049B4m0Q7n8l0K4K7J5n2J8Omkk9j7P1L6n9l2N1q1Q6J1m9p1Q9oo5J8O3m6J4N2
$$ 24 -16 71 13 -17 7 34 49 -3 15 21 17 15 -14 -31 40 76 17 -15 36 -45 41 52 3 -68 21 15 -50 -32 31 -15 -1 51
6081E1o6M0l6rK8M2m5Rm1L5ll7j6M9qL6mLRl2j2Knj6K7o1N6J7k1j1N0m8nL0M5
$$ 51 -15 25 -11 -20 8 50 5 14 -27 8 5 -32 -48 1 -7 29 25 28 37 5 -7 -5 -10 -26 1 -60 -4 13 -8 -19 31 -17 -22 8 53
6116E3p7j5M8j1j4N6l8k1Q7l0n1mJ05o0j5l5K0K2Ml8K5n4M1K4K9k4o9J06l6rm8
$$ 53 -24 -39 9 -2 -16 40 2 -19 68 38 -13 -17 88 28 13 -22 -2 20 24 -14 11 -43 -2 22 51 27 -42 64 28 19 -29
6147b9O6o3L9l0M1j2m1P9o2M5k4L0n6kk5KJ06m8k7jN0p8L5L6l8j9L4Mm8M5Qj2
$$ -29 37 -26 13 -17 24 12 -29 50 -12 33 9 39 -17 -19 -44 -42 64 16 -11 -12 38 -40 -5 31 -7 -26 8 12 -36 9 17 5
6179EN1q5lJ2j1K8j4M5q2K3P7n4l6O2rl6O6k9m9L5l7J3K6L3m2K9l9N1j7jLMl0
$$ 5 56 -29 -32 -20 -31 -3 -17 28 -54 -31 46 -8 -44 18 9 -27 39 10 -39 -4 -41 -28 -2 31 -11 18 -21 30 13 12 15 19 -11
6212a1n5L9L5m9N4n0J2K3l7O9k2k5O8m9l8MO9k6J8l7L0K9l3l0mJ2kJ7mJ4m0P7
$$ -11 -66 -27 8 -41 13 -37 -25 -2 -39 30 8 -17 51 2 -36 -32 37 11 29 -8 22 51 18 -12 -16 -4 -6 11 7 21 -19 58
6244E8m7m0L8K6oj3n4L3J5k9K4l9J2P1q6kK3n3J46p3k8Pmk7K5k9O5k2n2MP6n4
$$ 58 11 -29 9 35 29 16 -38 -5 10 -19 5 -34 -22 49 -37 -39 -16 -69 77 4 -24 -17 -21 -48 -23 -52 13 -9 -61 -57 19 -35
6276c5N2Kj6qK3J7k8pn4N8kq8L6K9n8M8N7m9J5J2Mk3Pj7J0L5K1m5j3K4oj1kJ7
$$ -35 17 19 3 -5 18 35 7 0 -54 4 2 -86 -50 -21 -79 -31 26 -23 -8 4 8 -15 -8 -25 -15 20 41 -4 -17 7 1 -10 -12 5
6310Ej6j3P4l2k0J2k9JL1pj4k1jj6N3M4l1L5k6m6J1j9lk0OM8k5K2l4L9L5k0k1
$$ 5 -11 -24 50 18 -2 10 -19 -18 13 6 -8 -29 -30 -46 7 51 20 55 29 -17 -6 -25 -28 -48 -42 6 -19 3 -31 8 43 23 2
6343BK3n6N2o3LO7k1jk1K0Lm5L9PN8k1r1Q8j4m7MM1m5l1L0J6m0P8n1k9K6K7Mm2
$$ 2 25 -31 21 -42 -39 28 7 6 -15 5 8 -37 2 9 67 46 -45 43 29 -18 -14 27 -18 -49 -19 -3 -43 35 -16 -45 -19 8 12 -30
6377c0l9O3j2k6O0o4J03m1j5n4N0K1j3qn9N2K9j9J5K3Kn0p1P6M6m1MK7m2L2j1
$$ -30 -69 -6 -18 -44 16 -48 55 14 -1 -55 -5 16 3 -5 -64 -12 17 -2 13 36 38 -12 -83 -7 39 -2 2 29 -13 19 8
6408HM2o0K0j7K4L1n5L9m5M2rl2%k7J46j15pL1J3m6J5m9K2L3Pp7P8L9p4ML6L0
$$ 8 50 -10 10 -7 17 48 -7 32 -13 29 20 -12 -12 -39 107 -8 -15 16 29 -17 -2 -51 -29 4 11 -66 12 51 -23 -19 17 47
6440D7r8Q2k8n9L6K2j0lMLJ4l0P3k7k0o7M5O8o7N2o8O1J0Mp5J1MjnK0Ko9J5O5
$$ 47 -51 31 3 -56 -20 2 -8 -11 -7 -4 10 -20 53 26 6 -61 -16 52 -15 37 -31 30 40 44 -31 -20 -16 -17 -22 -2 0 -69 -54 11
6474A1K4o7J1jj4M9m9J0N0k8L9l9K4M9p2N9m7l4J02o8j7J7J0JJPk8J1M6j0p8P8
$$ 11 35 -32 -21 -22 -36 13 -36 -26 24 -4 35 -4 20 69 -3 56 9 -25 77 9 -8 9 19 20 21 28 0 11 57 47 -31 47
6506D7nj4j3K9l3Ko3N2k3l0K9P2n2k1K0Qoo3O9j2k5L7Nl2P5n7%O1j7l7Qn1O8l8
$$ 47 42 28 15 44 11 13 -50 2 -21 -51 -22 50 -2 -23 -3 5 -1 -64 5 -7 -32 5 10 -22 53 -4 -4 57 40 3 11 -40 28 -10
6540a0k0k2J5L5N8q5L6k1KL2k2J5l0k9R7r3P0k4j6K6jj4j1lk2pK3K8o9N6l2K2
$$ -10 -30 -52 -37 -2 56 -29 7 -14 -12 20 -2 13 -17 -46 51 -42 28 4 -12 14 13 -1 -12 -15 -37 -44 -21 7 -62 -6 -38 -16
6572a6k4L4n2K5KlM7K5j2n%Rm3M4j2L1j9l7M7n5K7k2L6J7Jk0o2J04n4roK1lrJ
$$ -16 -40 -6 -58 -33 -31 -34 13 38 26 21 21 30 -13 31 19 50 31 -6 41 -14 13 -9 27 44 45 25 -37 67 13 4 -2 19 16 7 8
6607Hn9N7K5l7N9m1j2jN7p7kP8n6j1nl5Q0k3n9N8r6R5j3oO4n1L1m2m2K3M0J7l2
$$ 8 -51 6 31 -6 53 12 0 -1 56 -21 -23 55 -1 -12 -17 -52 28 5 -54 4 -92 3 -10 -16 48 -3 28 -14 -56 -33 7 24 -8
6640hJ8KMk0Jk8Q8n3L2j0m4M7r6J16j4k4j3L3m3l9P7l4l2M9K1m8K7m7P1k8J8k6
$$ -8 10 12 16 -4 -3 -31 57 4 36 26 -18 29 -67 49 35 11 -2 31 -12 -51 26 -8 -40 9 30 -18 9 -38 33 5 23 -3
6672cJ9qk3mM0M8m8k7o6P1PJ7j2l9J9mj7J8pL5j5M7p4M8m9M4m5R3l5q8N6LK6j02
$$ -3 16 8 -15 -19 21 69 21 -6 -72 -1 6 23 11 -28 -9 -13 -30 -12 -19 16 1 48 -26 22 -27 17 -28 65 30 -58 -2 1 27 -75
6706g5J28o7M6l0O1o5lLm6PQ0n8k5M4K%J2K8j07J11r3M5Jj2k7M8PK0r4K5L1J8
$$ -75 53 -14 32 2 63 -2 -5 -2 -48 -41 39 -19 -44 0 2 2 14 42 -65 46 -47 -2 -1 -13 -40 8 15 35 -59 -34 -3 15
6738A5j5j2kK5M2j01J00r3M7O3j06M1j4K1l8P5m8j3J6O5q7JN0l5Q%K5o3J3J6k2
$$ 15 0 -12 -14 11 53 -48 52 -41 6 69 -37 4 -10 11 -27 48 0 -13 3 68 -19 -18 32 -3 5 5 30 -33 -20 -4 -26
6769b6j3P5k2k9K8l3M4j2K4j6Qk5mL7j5J3qk8J2m2J7L2K7k3j2n5J2L9O2o7K3j8
$$ -26 -39 36 14 -15 13 -20 24 12 36 20 28 3 -1 36 21 34 26 -2 10 -32 -15 17 44 21 9 -46 -34 5 67 0 23 5
6801EM2prmj6m0L7J9o0K2j3J1k6L1%k9NK1k0M0ll7L4nK0K1n9N2m1m3R4j08P9j6
$$ 5 47 40 31 27 11 -29 8 27 -33 -11 -24 -13 -39 -8 -8 -37 -32 -11 -31 9 6 -31 3 -2 18 39 -20 32 -9 -52 42 -66 13 -3
6835cn3M4N7m7j2N2kn7Ppj6O6o5L3nk4O6n3k3J8K0N4L6j07M8o0L6l6M9K3l8m1
$$ -3 -56 -12 45 -2 -14 38 36 -21 -14 -21 -37 29 -36 -3 -8 -32 34 -19 -42 -24 -4 50 86 -21 27 -33 3 -33 16 39 1 -40
6867d0Nj3M2J5k0n0P3m8N4J8n1M3n3N2l2K2J0j7m1J1kL3nj6k6J6l9j1N8K8l0M3
$$ -40 -35 -48 -6 9 -11 -61 12 -36 18 36 -15 28 -25 27 -5 17 27 10 -31 -20 -22 11 6 -10 -36 -20 -59 -70 -12 16 -14 29
6899B9n1M6k0lkl6k1L4K4n0M0L1n6RlJ5j3K1j2n0M4M1oPM0j05J1O5k1k5PRJ9K5
$$ 29 -22 24 4 1 -1 -37 -58 -24 0 -50 -10 21 -35 -26 -29 -14 -27 -6 -18 -68 -24 17 11 18 58 -47 -36 29 8 -17 -10 -1 18 43
6933D3k1kL0j06J1M5K4QJm0N5k9P3j13K3K7n3Q0m3MQM7q5k0l1N2L5m6lM6k4N4
$$ 43 22 20 50 -56 -45 0 24 32 33 -7 48 19 92 -21 2 29 -24 56 13 17 25 72 -13 -33 -64 -12 23 -23 -26 20 -4 50
6965E0j09P9n6K9J4j3L9qk1j0k6M8K4j3j6ln2L7j1j2L3L3n3L2n2L2RmoM1n9KN7
$$ 50 -59 20 -36 -7 7 -6 33 25 4 -6 -32 16 40 27 11 8 -44 -7 -18 -30 3 36 -17 15 -37 -5 4 0 -6 35 -24 -22 35
6998C5j6qk8%K2n9N0J4rK0k5L4l9L0n7K8rpKJ8j8J1l2K3M9r5O2L6r0J01m5P4n1
$$ 35 19 11 -17 -17 5 -54 -4 10 1 21 -4 30 -9 21 -36 -8 -17 -24 -22 -4 -22 -11 -43 -20 29 -66 -4 32 -58 43 -2 72 21
7031B1k3N5k6J9l2M6o4K8oJ3m7q1N2O6j9j0M5n6PM9n1O3Ko6K7nL1Ro0J3M8pk9
$$ 21 -2 53 27 46 14 60 -4 24 18 31 -16 -97 -45 21 2 -8 37 -19 -12 37 -14 49 51 -15 12 7 38 47 -13 0 48 41 12
7064A2q9J48j15J8O9p0O2m8m9J18q4L4k6mO0pn8O6q0NM1k5ON9kp8L2l4L5k3J4
$$ 12 -77 71 -44 -26 43 -27 35 -13 -62 56 -28 6 -20 -24 36 29 -29 37 -43 -38 3 -22 -16 43 41 -37 -5 -39 -4 -27 -13
7095a3L5n0J1K9p5PJ01Qr4M0M1pk1j5J7pL2j7J3m2J5J8l1nl4M9j8P0qo3Lpj0j2
$$ -13 22 -28 -17 12 -63 -56 45 53 -41 -1 40 33 12 -3 14 7 39 22 35 -7 8 26 -5 -10 -44 5 -13 57 49 -14 -11 -18 -28 -40
7129d0M4K7k4p3L9L8kN6l9j5oK2kk6k0O7n2l0j9O1j1k3M0n2L0l8N9j1L3k1k2O0
$$ -40 4 31 7 -66 -27 11 9 65 26 11 5 27 25 -1 -21 46 -6 -36 -55 6 -5 -28 12 -40 -10 -48 11 0 33 12 -10 50
7161E0m6J0j0oLj0ql2J7L2lK1oJ4m7OP7n5oL6p5M0Nk9K6%m4O3k0OJ5k9J8N8p2
$$ 50 4 14 4 -2 1 -9 -17 -49 -32 0 -3 18 12 26 -21 -15 62 7 1 37 -38 2 7 -22 4 4 -40 23 3 9 24 -5 13 71 -1
7196aKk1P9o2L3l7PK8Pk9J8j8l5N2q1J1L6k6N1J7qM8j18L0MM6ol7m2L7L2nn1L7
$$ -1 1 -20 59 -3 30 -7 0 28 35 6 24 6 -29 23 -58 -47 -11 -37 14 31 23 71 -47 -17 -13 33 27 -10 -52 -15 17 12 -39 -2
7230bJ2RK1o3K8M7k3o5O3Nk5N6q3M9p5J6M7nj8L0o5K3P8q9M9lNL0l6Pl7J1qqL1
$$ -2 10 19 40 -23 5 52 29 -36 27 32 7 63 -20 29 -46 -30 17 12 -6 24 -41 -18 60 -29 20 17 22 52 16 23 -14 -3 -11 -19 12
7265A2j7M4j2j1l1j0M7l6L3j6n0M0k3N5n9k6O7k5j0P1m8PN3k8k5j0k2M0j6oK8
$$ 12 -5 39 27 16 -15 -25 22 -14 19 3 -47 -7 -30 25 -34 -60 7 -18 -28 43 -5 2 55 27 2 -8 -30 10 -6 -12 16
7296A6k8O8p1j5K3mN2q3j4M8k0O3j9J1j4K6q1O4PmoJ2m8N4j6K5k7m2mM6nM8m0
$$ 16 -12 56 -15 -30 -7 -11 41 -42 -56 -8 -28 35 16 27 13 39 -42 22 29 25 19 31 -17 37 21 46 19 -23 -27 19 14 62 22
7329B2nj4J6J9j7KJ2k5j7J0NN0m1L6q0l2O4N8k1m7m4N9o0O6K7p2RJ8K2l4p9Q7
$$ 22 17 3 19 38 21 23 35 10 -7 3 8 58 17 53 -27 -59 5 63 42 -5 -49 10 -50 16 43 -29 -20 -2 20 -14 -93 -6
7361fl2M5j7K7j0J5L3p5J6j4J29r3M3n8J6KJ5l5j9M9j16O8J5Jl6L1P2m4J9m3R
$$ -6 -38 7 -10 17 7 22 55 -20 -4 -18 111 18 61 3 19 21 36 1 -18 31 -85 -17 -2 -1 -37 -6 66 22 41 -2 7
7392Gj1L7o1M3Nk3OJM0p1N0l0N1j3J2j8JJk8l6N5Kl8K7%K0k9m0j0M2lqO0p3O2
$$ 7 -4 33 -28 15 20 -3 3 4 44 -27 23 -7 44 31 43 25 26 27 -1 -37 18 20 -18 9 9 29 0 -40 -50 -8 -11 -19 41 -32 30
7427C0o1k6J03p5JM1k5L1l4jKN5j3M2j33J9O4n2K7l1P3j16R2J2n2O3o2N6j7l2
$$ 30 -31 -57 46 -29 -28 13 -12 19 -15 -16 -14 41 28 70 -63 -44 20 -32 -5 -36 37 -79 13 25 -27 36 -26 30 13 -19
7457a9L5J4j00L3K1k3N1p0O1nQlJ2k8K6L6l2n0j0L1mn1N8J9J1k5L1k3m3P0K0n3
$$ -19 16 30 -70 -37 -16 -39 12 -58 3 -2 6 3 15 -13 13 49 17 -33 -43 -12 -16 -67 -9 10 21 -4 27 4 -39 31 51 -2
7489bj7Pj8J5KJ1L9n7J3jk9J32j04K3%K3k2m7MJ2L2J0k1j6RJ9J4mJ6ml9j8j0l4
$$ -2 -19 -12 -30 -15 -13 -2 37 -20 -7 -8 -37 95 -9 14 14 37 15 -32 -28 -16 16 26 5 -11 -2 17 31 27 43 39 0 -18 -28 -62
7523f2L8O0k7m3N8k2Pk4pQ8p7j1O0jm6Kk7L8kj9M7k4L2o3Q0p9M9lm6k0J1OoJK8
$$ -62 -24 36 9 -34 24 2 9 -15 -22 66 -11 -22 38 37 -9 -7 -34 4 2 -17 30 6 38 -25 55 -24 25 22 -24 -44 -33 -27 -33 -32 -4
7558dNj5NrJ9Q9k7o4J7k0L6m9K3o3O7J0j0KL6n5O9p4%K3l2K2l7P9m5%l3M6l8M7
$$ -4 1 -14 -9 -18 1 90 63 -1 16 -4 32 -17 6 -57 10 20 10 12 48 -7 62 -12 -12 11 -21 1 -36 43 -2 -2 -35 11 -27 20
7592B0j6pj1K9J0m7l1L5M2k5j1M4o2K6K1q6N4lLP9q9K1J4Lo7j9J14J9k8K5o8l9
$$ 20 4 -3 -14 15 25 -22 -53 -18 24 -1 -12 32 -30 -4 17 -69 -15 -18 -15 64 -25 -4 10 13 -54 -73 41 60 32 57 -11 -50
7624e0N0J5j9qmJ6ln6Q2Mj2k4K4oJ4k5Mj0j3K6k6l7N3mO6k6J1l1MK4J9p0K4n4
$$ -50 0 15 -4 -12 -16 0 -3 -59 23 27 15 -9 15 9 23 -2 2 -8 -21 5 -21 -58 -5 -9 57 31 42 11 15 39 58 -12 12 -42
7658d2l2O9L5or7R5PJ1l0nk3J2L6j4l5M0m7J2J00p9l6O1j0L7q2O4k7j3kj5K7K1
$$ -42 -74 -5 30 24 -73 22 29 40 10 5 -18 -6 30 16 -19 21 -26 -14 86 7 -29 32 22 59 -23 41 14 1 -1 -16 11 32
7690C2L0n6j7L3n8K4J8Kj2m2L5N3k9m8N0K4n8J8%n9J06p9nJ5ok5K0L0qMJ7l6m
$$ 32 62 6 -11 22 -36 -12 6 8 -4 -46 -11 42 13 -35 15 39 -19 -1 -1 -60 46 -33 -38 -23 -29 -54 -34 -4 -12 -8 9 -27 -31
7723c1O4m8R2j7o0N0l4Mj7nJ4J4K8m2k1j6L2J5mK4k2qk6pK7Mpj0P0Oj01P2n5j
$$ -31 33 -15 77 60 0 50 16 20 3 -2 12 26 54 12 -9 -25 7 22 18 42 20 12 -14 -21 6 10 3 -7 63 69 -32 40 -15 -16
7757a6K9M9n3l8M7J1l0j2j4K0L8m6J5j8K5l1L8Lk1L6l4J6oj8J9%L4rk7ll1nnL1
$$ -16 13 62 9 -29 18 29 -1 -13 -27 -7 31 -15 0 -18 7 -24 14 17 -4 32 -2 14 8 -10 9 9 43 34 7 4 -27 -32 -37 -6
7791fk0M2J5o8M8Jo5J1rP4j3LkL1q4K5J9j5j8P3j3j9o1M6j1O2l9m6K4K4k7l1K
$$ -6 -26 16 31 -37 11 12 -53 -42 -51 23 10 13 11 42 -42 -17 2 -13 -31 42 29 10 -51 -5 -16 46 7 -39 -15 9 -18 -49 -47
7824d7L7J0k4k6J6L9k2O1n4QnJ4J9Jj7nm5KR6o9N8r7pO4l3N0l0J8l5J4L0m3O5
$$ -47 -10 0 -24 -50 -34 5 -17 44 -10 -2 -7 7 26 27 10 5 -40 -38 58 -11 47 -50 -57 7 -26 24 -6 12 -23 -9 21 -22 43
7857D3k8n1J4N4J1k3Jm6pL9M3m5N7n5K9o2mM1j1j4oK9j0L7r9R2l0j4j7mO7o1K8
$$ 43 15 -36 -22 32 43 20 21 -25 -32 7 50 5 62 7 36 -26 -30 11 0 -14 -20 9 -1 36 -63 29 -1 -15 -32 -36 31 -30 -2
7890bN2%m2K0l6K9k4p3J29p9j5M9n8J1m0Q2J2l1K7m8jL9N0o6NM9m8k9L3KK6p6
$$ -2 50 50 8 28 -8 21 -3 -76 53 -26 -41 8 -50 -39 -79 3 15 -16 11 -37 -38 1 51 -15 -10 39 -9 -38 -5 -3 23 -53
7922e3j1J4J01j00P8l5L0J8l1m8Jk3N0M1m2k4lQJ5L8rJ9pn1L7L0p7j4N9oJ3m3
$$ -53 -64 -50 51 -49 29 -6 24 42 11 -37 -36 -59 -9 32 -10 -34 -37 -29 -14 24 15 34 27 -24 13 43 -34 -48 11 5 18 -25
7954b5K5j6l2P3nk4K0l0K0j2k3Q8j6k7m9L5J3k2M1l6N6qn4n0j0M5N5l7pm9jM4
$$ -25 0 -16 -48 25 20 -4 16 -14 6 -6 -29 59 43 16 -33 2 15 -7 34 -2 54 46 -8 -58 -68 -23 32 -5 -12 -61 -62 -18
7986a8J7qLL2p4N3M6j05qPQ7q3J4M0j4j4K2M6j9jk1lk6O3o7mK4O6p9L9K3o0M3
$$ -18 -1 -9 -6 26 -48 5 51 -54 -62 -55 32 -51 -37 3 -11 -25 -3 43 24 23 2 -1 -27 36 -31 -35 -11 55 -24 15 38 -22 21
8019B1m3k9J7K7Ok0m1J11o0rQPl5J03l8p5O1m5MJ1N1k3jL1n8J3O3On6PK3k9k2
$$ 21 -22 -51 -34 -7 -1 -21 -62 49 -11 -20 -12 -5 -40 63 25 -50 11 -34 -30 -19 32 9 8 39 -19 -6 57 63 7 14 37 8 -14
8052a4N0n7P7n8M1rk0k4K2K5m8nJ3k8K8O1r7L8K1n1K5K2k1J4j2k2J8KpJ7N2p9
$$ -14 36 -21 56 -2 39 30 10 -14 8 33 -15 -20 -7 -35 -7 54 -43 -5 16 -35 -10 12 -9 5 -7 -29 -11 -9 -16 1 53 -26
8084b6J5O7l5j4ll2K2RK4q3M0K1J2pk9j4Q7r2O5o4KQ5n7L3n1L5k9K7mN1n0RJ2
$$ -26 -11 56 21 7 4 -28 -6 3 27 -56 -16 5 17 10 -19 -33 54 -38 27 -37 -35 50 -7 26 -25 10 -19 8 4 55 5 14 26
8117B6k5O8r1n0P9K0n3L9Lj6LQ3j48Q9n4L5%ql5O4n5rO8l1J5%M9l8m9MK2K7q3
$$ 26 1 69 -22 -72 7 27 -26 13 16 0 3 86 -62 27 -27 8 8 0 -35 29 -26 -35 33 2 17 17 66 28 -21 -17 5 32 -51
8150e1L0P8m8K6j1K3np0O4j7LqNk2jl5M1j3J9j0qJ7L5o6o5Q0m1L9l5L4K2m6J04
$$ -51 -21 57 9 35 24 47 42 -28 36 19 22 14 19 -3 -4 -39 2 -11 8 -2 -10 7 42 -24 -89 -9 -50 -11 -46 -12 10 -36 68
8183F8l8m0M0o5N2n0M8p4
$$ 68 30 -10 30 -35 17 -33 15 -59
8191e9
$$ Imaginary data points
##PAGE= N=2
##DATA TABLE= (X++(I..I)), XYDATA
0@%%%%%%%%%%%%%%%%%%%%%%%%%%%%%%%%%%%%jLpJ1j3J4j4J5j6J6j6J7j9K1k4K8
$$ 0 0 0 0 0 0 0 0 0 0 0 0 0 0 0 0 0 0 0 0 0 0 0 0 0 0 0 0 0 0 0 0 0 0 0 0 0 -1 2 -5 6 -7 7 -7 8 -8 8 -8 9 -10 11 -13 15
52A5l1L3l5M0m7N3n9O7p8R2j12J40j81K45l60N98j241N004J6438k5369K805K4329
$$ 15 -16 17 -18 22 -25 28 -31 36 -42 50 -62 78 -103 142 -218 380 -861 4143 20581 -4788 -1983 22346
74B2346j9642r295K3394j0342j5536K3210L43k0706J9255J0762k5010Q470J9451
$$ 22346 2704 -6591 16803 6461 -9075 14135 14478 -6228 13027 23789 -1221 7249 26700
87B6700k1379l494K2796j1916j1375K0450m261j7494J6401L166k2167J1099J3631
$$ 26700 5321 1827 24623 12707 1332 21782 17521 27 16428 19594 -2573 8526 22157
100B2157k1861J652K0655j6290r592J9454q795j7029J5215n85j9667J2333Q945
$$ 22157 296 1948 22603 6313 -3279 16175 7380 -9649 5566 4981 -14686 -2353 6592
113F592k0605N885J7044j9223n233K0089j2122j3577J8601k103j6717J5048O177
$$ 6592 -14013 -8128 8916 -10307 -15540 4549 -7573 -21150 -2549 -4652 -21369 -6321 -144
126a44j8303R196J3206j8628R87J9536j3331p705K1073m768j4183J6365K728j6984
$$ -144 -18447 -9251 3955 -14673 -13686 5850 -7481 -15186 5887 1119 -13064 3301 6029 -10955
140a0955J0303R369j6749M736J5945j4142l283J9182q955j2068J6706j506j6312
$$ -10955 -652 8717 -8032 -3296 12649 -1493 -4776 14406 5451 -6617 10089 8583 -7729
153g729J1727O129j6018O354J1965j4759n50J5669j1631q595J6821m873j4171
$$ -7729 3998 10127 -5891 463 12428 -2331 -2881 12788 1157 -7438 9383 4510 -9661
166i661J3840L168j5798Q003Q817j5051J580J2923j2276m700J5888p041j1060
$$ -9661 4179 7347 -8451 -448 8369 -6682 -5102 7821 -4455 -9155 6733 -308 -11368
179a1368J5189k90j5424J0237O213j5642M127J1379j2856j568J4637q699q031
$$ -11368 3821 3531 -11893 -1656 4557 -11085 -6958 4421 -8435 -10003 4634 -4065 -12096
192a2096J5223l198j3586J2418L861j5269P235R935j3357J097J3164r853m981
$$ -12096 3127 -71 -13657 -1239 2622 -12647 -5412 4523 -8834 -7737 5427 -4426 -9407
205i407J4475n234j0225J3558J210j3592R735P269j3851L626J1167j1105k264
$$ -9407 5068 -166 -10391 3167 4377 -9215 520 7789 -6062 -2436 8731 -2374 -4638
218d638J2935o772p300J3007j767j1619J0553L868j3746N696Q735j2465M8J1618
$$ -4638 8297 1525 -5775 7232 5465 -6154 4399 8267 -5479 217 8952 -3513 -3465 8153
232H153q673n234J2152m196r768J0929J021j2797P545O645j3136K410J0752j0545
$$ 8153 -520 -5754 6398 2202 -7566 3363 4384 -8413 -868 5777 -7359 -4949 5803 -4742
246d742l189J2158o105p839J1521r46j1220R079M634j2598M743R327j1478n35
$$ -4742 -7931 4227 -1878 -9717 1804 858 -10362 -1283 3351 -9247 -4504 4823 -6655 -7190
260g190J1879p716n531J1901k811r078J0132K239j1131O679P076j1296K038J0610
$$ -7190 4689 -3027 -8558 3343 532 -8546 1586 3825 -7306 -627 6449 -4847 -2809 7801
274G801r049l028J1836m845p156J0586m2r912P863M703j0935L730Q755r972j102
$$ 7801 -1248 -4276 7560 2715 -4441 6145 6103 -3809 4054 8757 -2178 1552 10307 335 -767
289g67J0959o767n773J0789k324r071Q564K295j0674M948O621j0547M82R759q314
$$ -767 10192 3425 -2348 8441 6117 -2954 5610 7905 -2769 2179 8800 -1747 -1265 8494 180
304A80m197J0711m489q051R336L25j0299O402M783j0579K422Q327r125k141J0397
$$ 180 -4017 6694 2205 -5846 3490 3815 -6484 -82 4701 -5878 -3456 4871 -4254 -6395 4002
319D002n929o401J0315j645r150Q092K954j0111M433O868r429K12R574o845m208
$$ 4002 -1927 -8328 1987 342 -8808 -716 2238 -7873 -3440 3428 -6001 -5789 3785 -3060 -7268
334g268J0510l054p650R123J222r401O070N305r298K041Q263p346k264R834m294
$$ -7268 3242 188 -7462 1661 2883 -6518 -448 4857 -4441 -2400 5863 -1483 -3747 6087 1793
349A793o139R436l86q709P199L493r306L558O767q209n94Q767n664m645R230k155
$$ 1793 -4346 5090 4704 -4005 3194 6687 -2619 939 7706 -503 -1097 7670 2006 -2639 6591 4436
365D436p807P770J773r391M827N204r046R72P712o922l091Q785l786o627Q258
$$ 4436 -3371 4399 6172 -3219 1608 6812 -2234 -1262 6450 -472 -3563 5222 1436 -5191 3067
380C067M4q771N891L799r197K592O699p851j234Q245n087m767Q338j340p451O969
$$ 3067 3111 -5660 231 4030 -5167 -2575 4124 -3727 -4961 3284 -1803 -6570 1768 428 -7023 -54
396e4K381q749M150N460q232O98P581n918k907Q277k715n761P476P60p821N341
$$ -54 2327 -6422 -2272 3188 -5044 -4346 3235 -2683 -5590 2687 -28 -5789 1687 2447 -5374 -33
412c3M218q063K236O758o760j148Q015m186m415P773q34o930O239K741p941L435
$$ -33 4185 -3878 -1642 5116 -1644 -2792 5223 1037 -3378 4395 3561 -3369 2870 5611 -2330 1105
428A105N686p496L9P396n521l432P765k442n958O639J131p597M286M183p841J146
$$ 1105 6791 -705 -666 6730 1209 -2223 5542 3100 -2858 3781 4912 -2685 1601 5784 -2057 -911
444i11O338o494k131P490l902m831P067o68o860N290K528p619K494N408o891n58
$$ -911 5427 -1067 -3198 4292 390 -4441 2626 1958 -4902 388 2916 -4703 -2209 3199 -3692 -4250
460d250P226m913l503P357k031n989O225J314p017L858M429o871R03O574n682
$$ -4250 2976 -1937 -5440 1917 -114 -6103 122 1436 -5581 -1723 2706 -4165 -3262 3312 -2370
475b370k218P353l221m829O809R4o375N012L066o868K111N463o190j042O950m087
$$ -2370 -4588 2765 -456 -5285 1524 1618 -4757 255 3321 -3547 -1436 4027 -2163 -3205 3745 -342
491c42l750P118j294n762N658J512o707L270M209o414M60O135m870k511O846k551
$$ -342 -4092 3026 1732 -4030 1628 3140 -3567 -297 3912 -2502 -2042 4093 -777 -3288 3558 1007
507A007n034O173J53o490M388L063o592J795N230n611j341O433l631m151O460
$$ 1007 -4027 2146 2299 -4191 197 3260 -3332 -1537 3693 -1918 -3259 3174 -457 -4608 1852
522A852q89n926N291J932o474K858M202n955o4N804m292k834O452j780m874N753
$$ 1852 963 -4963 328 2260 -4214 -1356 2846 -3109 -3173 2631 -1661 -4495 1957 177 -4697 1056
538A056Q35o170L914L295o177J389N268m948j244O227k801l764N911l55n580M631
$$ 1056 1891 -4279 -365 2930 -3247 -1858 3410 -1538 -2782 3445 644 -3120 2791 2436 -3144 1487
554A487K258o129K616M367n395r3N581l911k689N780j631m775N102R95n890L372
$$ 1487 3745 -2384 232 4599 -796 -889 4692 781 -1908 3872 2241 -2534 2568 3563 -2327 1045
570A045L294n872R57M836m849j533N498k733l739N259j64n409L963K281o068J914
$$ 1045 4339 -1533 -576 4260 -589 -2122 3376 643 -3096 2163 1999 -3410 553 2834 -3234 -1320
586a320M227n329m44N402l632k664N429j297m611M499J192n586K869L472n437
$$ -1320 2907 -2422 -2866 2536 -1096 -3760 1669 372 -4239 260 1452 -4134 -1265 2207 -3230
601c230Q00M935m195j708N477k235l663M988K12m927L653K699n438J635M492m787
$$ -3230 -2430 2505 -1690 -3398 2079 -156 -3819 1169 1381 -3546 107 2806 -2632 -997 3495 -1292
617a292n76N341l104k803N380r26m394M312J444n165K541L379m911K49M810l850
$$ -1292 -1868 3473 369 -2434 2946 2020 -2374 1938 3382 -1783 758 4137 -774 -525 4285 435
633D35j914N298j978l697M552K47m871L076K463n031J023M171m334j198N009k769
$$ 435 -1479 3819 1841 -1856 2696 2943 -1928 1148 3611 -1420 -397 3774 -560 -1758 3251 482
649D82l104M756o38m535L660J563m965J823L430m510l66M642l264k406M877j417
$$ 482 -2622 2134 1496 -3039 621 2184 -2781 -958 2472 -2038 -2404 2238 -1026 -3432 1445 28
665B8l898M090P89m716K620K650m548O89M126l646j463M796k046l163M484r2m295
$$ 28 -3870 220 1009 -3707 -1087 1563 -2985 -2296 1830 -1816 -3279 1517 -529 -3692 792 700 -3595
682c595L589J731m546J728L339l997k60M398k720k276M723r57l712L966R62m479
$$ -3595 -6 1725 -2821 -1093 2246 -1751 -2011 2387 -333 -2609 2114 1157 -2555 1411 2373 -2106
698b106K475K692m229N53L879l199j407M373j707l154M068J57m228K964J897m395
$$ -2106 369 3061 -1168 -615 3264 65 -1342 3031 1324 -1830 2238 2395 -1833 1131 3028 -1367
714a367J274L350l730o61M052k423k488M097p51l814L555J118m421K004K718m140
$$ -1367 -93 3257 -473 -1134 2918 495 -1993 2104 1353 -2461 1094 2212 -2209 -205 2513 -1627
730a627K29L697l056j583M145j426l090L748L44m080K700K018m215J149L290l506
$$ -1627 -1398 2299 -757 -2340 1805 379 -2711 1037 1381 -2699 1 2019 -2196 -1047 2243 -1263
746a263o76M032k156k304L896n04l508L115J320m114J815K858l850J33L777k908
$$ -1263 -1939 2093 -63 -2367 1529 1025 -2483 632 1952 -2162 -347 2511 -1339 -1206 2571 -337
762c37j526L976j305l020L492N74l868K324K206l918O94L416l280j003L860j903
$$ -337 -1863 2113 808 -2212 1280 1854 -2014 310 2516 -1402 -708 2708 -572 -1575 2285 382
778C82k438L678k37l456K721J514l848J211K819l426m18L654k343j852L647r81
$$ 382 -2056 1622 1385 -2071 650 2164 -1684 -473 2346 -1080 -1498 2156 -187 -2039 1608 627
794F27k962L005O83l564J810K295l567L57L309k865j125L606j584k409L382p7
$$ 627 -2335 670 1353 -2211 -401 1894 -1673 -1316 1993 -872 -1997 1609 25 -2384 998 921
810I21l236K474J505l451J056K850l170m87L561k202j825L585o80k923K932Q64
$$ 921 -2315 159 1664 -1787 -731 2119 -1051 -1538 2023 -179 -2004 1581 901 -2022 910 1774
826A774l397J632K160l192J34L191k457j353L542j256k544L110J83l233K153J586
$$ 1774 -1623 9 2169 -1023 -889 2302 -155 -1508 2034 778 -1766 1344 1527 -1706 447 2033
842B033l318P65K650k723p60L277j671k149L216m52k965K555R70l264J363K153
$$ 2033 -1285 -520 2130 -593 -1353 1924 253 -1896 1320 868 -2097 458 1428 -1836 -473 1680
858A680k886j15K911k182j499L237r81k592K947L69l221K037J628l177P15K640
$$ 1680 -1206 -1321 1590 -592 -2091 1146 165 -2427 520 889 -2332 -295 1333 -1844 -1129 1511
874A511k541p57L117j442k088L081j92k789K327J205l231J387K223k840o1K988
$$ 1511 -1030 -1787 1330 -112 -2200 881 689 -2100 227 1432 -1799 -412 1811 -1029 -1090 1898
890A898k005j401L111p58k461K640O78l052J724J783k948N21K584k346q69K983
$$ 1898 -107 -1508 1603 845 -1616 1024 1702 -1350 374 2157 -791 -270 2314 -32 -901 2082
906B082j311k007K779j1k830K032J280l033R06K330k739l04K833j884j450K807
$$ 2082 771 -1236 1543 1532 -1298 734 2014 -1019 -113 2217 -522 -826 2007 123 -1327 1480
922A480o84k435K302O72k974J470J814k954L07K528k235q79K789j189j995K515
$$ 1480 796 -1639 663 1335 -1639 -169 1645 -1309 -1002 1526 -709 -1588 1201 12 -1983 532
938E32R8k647J785J306k912Q37K259k501l79K817j693j463K697m48k299K155P96
$$ 532 630 -2017 -232 1074 -1838 -1001 1258 -1243 -1622 1195 -498 -1961 736 288 -2011 144 940
955I40k688J262J921k597M9K594j926j039K815r90j969K411L14k535J675J360
$$ 940 -1748 -486 1435 -1162 -1113 1481 -445 -1484 1331 341 -1628 783 1097 -1438 237 1597
971A597k671P31K209k268n03K690j508j456K541m26k173K054P51k543J016J786
$$ 1597 -1074 -343 1866 -402 -905 1785 277 -1179 1362 936 -1237 817 1568 -975 41 1827
987A827k383q2K428j791j128K641q43k034K321J59k460J461J349k509M00K173
$$ 1827 -556 -638 1790 -1 -1129 1512 669 -1365 956 1115 -1345 116 1465 -1044 -644 1529
1003A529k079o75K605j336j591K411k13k319J886Q60k506R96J728k243q8K278
$$ 1529 -550 -1225 1380 44 -1547 864 651 -1668 218 1078 -1428 -432 1296 -947 -1035 1243
1019A243j571j205K512o41k029K230L16k394J442J331k327M02K067j863o89K422
$$ 1243 -328 -1533 979 338 -1691 539 855 -1539 -97 1234 -1093 -691 1376 -487 -1176 1246
1035A246j035j638K342o2k245J745Q97k401R48J659k010j91K189j430j211K335
$$ 1246 211 -1427 915 853 -1392 353 1250 -1151 -203 1456 -554 -745 1444 14 -1197 1138
1051A138n19k024K042M78k364J254J433k277K41K004j780o84K251r24j661K075
$$ 1138 619 -1405 637 1115 -1249 5 1438 -839 -598 1406 -374 -1058 1193 269 -1392 683
1067F83J24k198J507J062k364P58J735j905k79K021j266j126K040l02j847J722
$$ 683 807 -1391 116 1178 -1186 -428 1307 -598 -877 1144 -122 -1248 792 490 -1357 365
1083C65O14k237J077J464k192K53K009j655p80K177p44j639J934K05k044J344
$$ 365 979 -1258 -181 1283 -909 -656 1353 -302 -1082 1095 351 -1288 646 851 -1193 151
1099A51J127k265N53J829j929k22K035j156j243K007k44j847J554O75k039P85
$$ 151 1278 -987 -434 1395 -534 -756 1279 123 -1120 887 643 -1204 350 1025 -1014 -229
1115b29J582k062O9J943j448r00K011o71j537J710L28k002J116J134k023L47J752
$$ -229 1353 -709 -640 1303 -145 -1045 966 295 -1242 468 796 -1206 -90 1044 -979 -632 1120
1132A120j691n75K068j009j240J959k68j702J437P16k020P50J418j760o0J937
$$ 1120 -571 -1146 922 -87 -1327 632 364 -1338 99 815 -1205 -455 963 -797 -857 1080
1148A080j383r12K020n66j538J799J99j883J067J152j823K61J773j534n52K008
$$ 1080 -303 -1215 805 239 -1299 500 699 -1184 -117 1035 -788 -527 1246 -288 -840 1168
1164A168r31j324J920q7j684J352P67j860O21J389j589l04J872j107j035J924
$$ 1168 237 -1087 833 746 -938 414 1181 -679 -58 1331 -258 -562 1310 203 -832 1092
1180A092m08j551J503M37j863R40J093j668Q8J611j304p99J946o90j435J678O6
$$ 1092 684 -867 636 1073 -790 150 1243 -425 -337 1274 -30 -829 1117 427 -1008 670 736
1197G36j743J164P86j782M51J457j561l66J831j037j059J672k07j624J425M92
$$ 736 -1007 157 943 -839 -388 1069 -492 -858 973 -64 -1123 549 342 -1282 143 635
1213F35j733P79J208j643L7J627j259p59J839n67j343J601K01j739J121R00j778
$$ 635 -1098 -319 889 -754 -717 910 -349 -1108 731 164 -1179 422 623 -1116 5 905 -873
1230h73M68J406j402l46J636p91j004J618p1j537J223O66j676N61J296j628R6
$$ -873 -405 1001 -401 -747 889 98 -906 712 641 -896 327 993 -683 -122 1174 -454 -358
1247c58J480j022p74J636m26j344J348L55j635R27R25j635L10J395j377l77J546
$$ -358 1122 100 -674 962 536 -808 540 895 -740 187 1112 -523 -213 1182 -195 -572 974
1264I74p06j098J443J1j529J147O77j723N79J228j515j55J549r81q11J578m25
$$ 974 268 -830 613 624 -905 242 919 -804 -225 1003 -512 -667 882 -99 -910 668 243
1281B43j275J254L81j637Q92R54j606K30J412j281m75J562o52j051J434j0j404
$$ 243 -1032 222 603 -1034 -142 812 -794 -564 848 -433 -908 654 2 -1049 385 375 -1029
1298a029J064O87j559M77J240j394k08J532q92q44J507k51j339J236M36j425N84
$$ -1029 35 722 -837 -360 880 -514 -722 810 -82 -926 581 330 -1009 227 663 -762 -178
1315a78J094j448M5J398j067n87J562n71j110J357N8j366R30P41j446K91J248
$$ -178 916 -532 -487 911 -156 -743 819 248 -862 495 553 -813 117 858 -588 -297 951
1332I51j225l68J554q40r16J522k52j281J143M88j505O81R78j389K6J302r87o32
$$ 951 -274 -642 912 72 -844 678 426 -855 288 776 -729 -48 930 -459 -433 869 -118 -750
1350g50J504n10j137J342J54j373Q45O88j355K51J178j046m44J464o78r63J358
$$ -750 754 244 -893 449 603 -770 75 763 -592 -341 837 -209 -653 811 133 -830 528
1367E28j42j172J010M59j311M57R79j212q8J265q21o67J333l31j101J159K78j392
$$ 528 386 -786 224 683 -628 -171 808 -404 -492 773 -48 -715 618 287 -814 345 623 -769
1385g69P80P10j283J96J137j041m21J304n64r43J377o8j307R70N51j376M93J007
$$ -769 11 721 -562 -366 771 -270 -691 613 49 -894 483 415 -892 78 629 -747 -254 753
1403G53j250j59J315p73p37J381l16j222J209K91j332O97Q93j332J15J171r52
$$ 753 -497 -656 659 -114 -851 530 214 -1008 201 492 -840 -143 750 -582 -467 704 -248
1420b48m74J287n12q17J156Q6j207Q29O42j294L00J030j056j22J177p25o92J179
$$ -248 -722 565 53 -764 392 478 -729 100 742 -552 -252 778 -278 -400 777 52 -640 539
1438E39j14j101R54M78j305N41Q98j190J6J166r33m09J194m35r32J122P6j232
$$ 539 425 -676 278 756 -549 -8 890 -300 -284 882 -51 -460 734 299 -633 489 565 -667
1456f67P44P06j258K89J098j117l08J292o92p37J127j03j084Q57M54j269L85R73
$$ -667 77 783 -475 -186 912 -205 -513 779 87 -650 477 374 -710 147 601 -668 -283 690
1474F90j174n0J202q54o15J246l13j008J022J91j131O08P62j158J07J009q88l51
$$ 690 -484 -534 668 -186 -801 445 132 -876 146 337 -794 -186 576 -582 -475 534 -354 -705
1492g05J206n72p67J123j4j058P92M91j097L55R20j033j87J188o43o23J194k52
$$ -705 501 -71 -838 285 271 -787 5 496 -601 -246 674 -359 -546 642 -1 -624 570 318
1510C18r84R58K82j141N92P39j030O5R26p23m74J207m31q47J106Oj063O98N24
$$ 318 -666 292 574 -567 25 764 -266 -201 725 2 -472 735 304 -543 563 569 -494 204 728
1529G28j095L01Q49r08j96J106o10p29J169k11r78Q67K78j087M95P00j005K1R74
$$ 728 -367 -66 783 -125 -321 785 175 -554 615 404 -574 293 571 -516 -21 679 -326 -305 669
1548F69q04m38J099l98q53R80P9j018O23O15j034J93Q32q33k15R96n20o57R92
$$ 669 -135 -573 526 128 -725 255 334 -684 -61 554 -480 -287 545 -288 -503 493 -27 -684 308
1567C08p0j013Q12M16j131N34O75r48m7R87o94m46J022k90q11Q96J92j083O39
$$ 308 238 -775 37 453 -678 -144 531 -417 -464 523 -171 -617 405 115 -696 200 392 -691 -52
1586e2N76j030J83R49q80k32J012m80o27R65K8r96P25M67j124M78P55j032r9J091
$$ -52 524 -506 -323 626 -254 -486 526 46 -581 384 412 -584 141 608 -516 -38 717 -315 -414 677
1606F77p01m73R89k65q04Q24K66j025N53N80j011J38R12p93k95J000m32p28R30
$$ 677 -24 -497 492 227 -577 247 513 -512 41 621 -390 -252 660 -133 -428 572 140 -588 342
1625C42jq88O75M79j022J97R00r62j22R67o14m65R49j85q35P41K93r74M45O79
$$ 342 341 -547 128 607 -415 -218 682 -280 -402 565 -49 -514 435 250 -585 156 449 -525 -80 599
1645E99r58K5Q89o89l46R07k86o72P59Q9q08N17N29r61J62Q05q18k36R26n00n45
$$ 599 -359 -334 555 -134 -480 427 141 -531 228 317 -491 26 555 -406 -244 561 -257 -493 433 -67 -612
1666f12R34j07q08O62L30q61K41O96q56l5R17o91l36Q88k99o84P95J03q47N20
$$ -612 322 215 -593 69 399 -462 -221 475 -381 -416 501 -190 -526 362 63 -621 174 277 -570 -50
1686e0N25q94J69P54o69k96R37m33o31R28m2q43O69K89q49L52O19p05j16Q08n36
$$ -50 475 -419 -250 504 -165 -461 476 43 -588 340 298 -545 124 413 -436 -84 535 -170 -286 522 -14
1707a4l80Q69k36p38P80K05r00M96N05q73J69P02o80k81R73m24o09Q22kp87N82
$$ -14 -394 475 239 -499 281 486 -414 82 587 -286 -117 585 -95 -376 597 173 -436 386 384 -403 179
1728A79K87q24K57O16o96o9P55m84m08P53j31p69P26K11r27M59N60q71R0O87o08
$$ 179 466 -358 -101 515 -181 -250 505 21 -387 366 235 -534 192 403 -524 -65 495 -376 -286 401 -207
1749b07l19R05l66o36P86Q5p96N11M11q87K69P08q24n0P53m71l81P59r5p07O19
$$ -207 -526 379 13 -623 163 248 -548 -37 374 -513 -244 464 -360 -410 343 -128 -509 250 155 -552 67
1770F7K81q09L53N16p48K7P98n91l71Q55k85n22O49N1o30L88M74q01J42P10o69
$$ 67 348 -461 -108 408 -340 -313 485 -106 -477 378 93 -429 220 271 -359 29 503 -298 -156 554 -115
1791a15j30P53m43l48O59o6o81N52K92p37K30N80p20k4P52n03m32Q18k47n83O65
$$ -115 -245 508 65 -283 376 310 -371 181 473 -264 -34 546 -174 -198 554 51 -381 437 190 -393 272
1812B72J19p42L75M52p18J0P36n74l18P92l36n28P21o5o84N33K70p39K41O20o73
$$ 272 391 -351 24 476 -242 -232 504 -70 -388 404 68 -460 261 196 -488 45 315 -424 -183 437 -236
1833b36j55P34m37m11P52j75n96N96K00p34L45N11p17N2O74n65k89P78k72n73
$$ -236 -391 343 -94 -505 247 72 -524 72 272 -462 -117 394 -323 -271 403 -162 -451 327 55 -518
1853e18P23J4o65M16L86o90J51O58o59j47P48m31l71O94j25o45N92K44p48L37
$$ -518 205 219 -446 -30 356 -334 -183 475 -184 -331 417 -14 -385 309 184 -461 131 375 -373 -36
1873c6M81o56L6N95m19l58P30k60m83O64j9o76M44L49o57J64N69n38k58P90l86
$$ -36 445 -211 -175 420 1 -357 373 113 -370 294 275 -401 43 392 -265 -101 468 -70 -328 462 76
1894G6m85O23m4o10N68K22p35L36M97o51K5O16n07k82O47j26o58O97N0o54L90
$$ 76 -409 214 170 -440 128 350 -385 -49 448 -203 -178 438 -69 -351 296 170 -488 209 259 -395 -5
1915eL93o62M8N93m54j92O65l85m33O58J6o65M44L23o94K66M26n70n1O82m60l14
$$ -5 388 -274 -226 367 -87 -279 386 1 -432 226 242 -423 21 344 -350 -84 342 -228 -279 403 -57 -371
1937c71O30j39n04N08Q5o53L86M17o48L7N63m57k13O36k67m08N41N1n25L01L43
$$ -371 259 120 -384 124 209 -444 -58 359 -289 -252 311 -146 -359 277 10 -398 143 194 -331 -30 313
1958C13o22J20N66n64m7N41l25l35N61j2n48M66J89o09L22L85n93K8N71m86j38
$$ 313 -309 -189 377 -187 -234 307 -18 -353 208 196 -352 114 303 -306 16 401 -192 -164 407 -79 -217
1979b17O02k91l11M58K2n26L41L35n45J09M12m48j27N76k93m03N88o9n28M53J97
$$ -217 385 94 -217 241 263 -263 78 413 -132 -23 389 -59 -186 390 97 -306 282 213 -315 138 335
2000C35o15K46L74m66n6N07l55k79O46k76l85M72Q9o46M01L10n49O1N05n21j51
$$ 335 -280 -34 340 -126 -182 325 -30 -309 337 61 -324 148 237 -409 -8 302 -247 -186 319 -202 -353
2021c53O28k90l69N39m2n09L91K39n34J95L76m54q0N24l35k95O03j77m38N01Q8
$$ -353 275 -15 -384 155 113 -396 -5 234 -300 -105 271 -183 -263 261 -74 -369 234 57 -381 120 208
2042B08n61L17L21n49P3M91m59j53N79k36l90N71l4n01M25K07n19J72L86m17j24
$$ 208 -353 -36 285 -264 -191 300 -159 -312 267 31 -359 212 178 -323 102 309 -210 -38 348 -69 -193
2063a93N30k70l21N77j48m74M91J42n19J97L70m97O8M54m15j84N08j82m14N22
$$ -193 337 67 -254 323 175 -299 192 334 -185 12 382 -115 -47 407 -8 -192 316 134 -280 242
2083B42Jn15L00K41n16J86M36n10r8N15k75l41N53r3m94M26J89n91K29L61n02
$$ 242 243 -272 28 269 -247 -61 375 -135 -233 282 7 -334 219 126 -368 58 247 -344 -115 246 -256
2104b56P4M96m37j93N08j81m00M43J13n62L36L35o25J99M22m24q8M48k58k73N01
$$ -256 -182 314 -123 -316 192 11 -389 54 167 -395 -59 276 -349 -150 272 -152 -240 208 -50 -323 178
2125A78m2m58L99J88n89K55M26n63l3N39l45k26N16j45l71M20L5m78L34K56m65
$$ 178 136 -322 77 265 -324 -69 357 -206 -239 300 -45 -271 245 100 -271 149 184 -294 40 296 -169
2146a69P7M15m60n6N12k36l55M69J3m66L06K31n03J63M04m74n6M95k80k57N03
$$ -169 -92 323 -137 -193 319 83 -272 197 210 -256 50 281 -222 -59 345 -129 -185 310 30 -227 276
2167B76j87l96M45J57n31K03L29m36pM57l15j91M91k02l78M28L2m66K64K59l78
$$ 276 89 -307 138 295 -236 -33 296 -140 -147 310 -5 -196 295 93 -285 143 175 -291 -27 232 -146
2188a46J0L43l36j21M94k72k44M02l7m03L84J10m70K44L02m14j7L84k52k70M86
$$ -146 -136 207 -129 -250 244 -28 -272 130 93 -310 74 184 -286 -42 260 -154 -171 213 -39 -309 177
2209A77j21l66L99M5m42K87K54m85J65K94l27r7M38j84l37M61k2l74K06K18m08
$$ 177 56 -310 89 134 -308 -21 233 -252 -87 207 -120 -217 221 37 -300 161 139 -235 -29 189 -219
2230b19J89K65m30K7L96k17k54M80j34m57M53O0l37J69K41m07J00L49k58j32M18
$$ -219 -30 235 -195 -168 228 11 -243 237 103 -354 99 159 -178 -9 232 -175 -75 274 16 -116 302
2251C02k01k72L94km07K87K39m90J97K64m03JL85k98j89L66m2l47K89J77n21K83
$$ 302 101 -171 223 221 -186 101 340 -150 47 311 -92 -91 294 -4 -193 173 131 -216 73 250 -271 12
2273A2K41m23N7L72l72n9L24j01k71K96L2m06K15K84m52J69K99l63q5M29k25k89
$$ 12 253 -170 -113 259 -113 -172 152 51 -220 76 108 -298 -83 201 -251 -82 217 -146 -231 198 -27 -316
2295c16M27j03k82L40Q6m28J83K38l76K2M48l24k17M58j49k87L44J0l27K20K65
$$ -316 111 8 -274 66 152 -276 -93 145 -231 -209 239 -85 -302 156 7 -280 64 74 -253 -33 232
2316B32l64L3L77l61o2L92k26k89M20Mm08L39J12l87K01K63l98L5L69k57k42M57
$$ 232 -132 -99 278 -83 -145 247 21 -268 152 156 -252 87 199 -188 13 276 -122 -87 282 25 -217 240
2338B40j29k45K92L7l54K17K21m40Q1L66k80j36M02k88j64L86n7l50K60J00l21
$$ 240 111 -134 158 195 -159 58 279 -161 -80 286 6 -130 272 -16 -180 206 149 -201 59 159 -162
2359a62J35K29l23K0L36k48k52M18n6l50L20Ql51K04K46l21L1K65k65j43M25j68
$$ -162 -27 202 -121 -101 235 -13 -265 153 97 -253 67 75 -276 -72 174 -147 -116 149 -116 -259 166 -2
2381bk91L63Ol30K27J92l86J63K02l07j7K55q0k57M14q0k98K92J08m10J97J86
$$ -2 -293 70 76 -254 -27 165 -221 -58 144 -163 -180 75 -5 -262 152 72 -226 66 174 -236 -39 147
2403A47k86L6L19k66j59M39j40k66K96O5l54J82K22m55J33L30l11r0L75k07j88
$$ 147 -139 -103 216 -50 -209 230 90 -176 120 185 -169 13 235 -220 -87 243 -68 -158 217 10 -178
2424a78K99J0l34K96P0l47K37J25k95L0L27k81j40L67j53j87K78M3l57J99J97
$$ -178 121 131 -203 93 163 -184 53 178 -117 -87 240 -41 -181 186 33 -154 124 167 -190 9 206
2445B06l98J67K25k97LK58r6l06L53qk54J86L6k12O1K99l35k2L01k06j62L02j03
$$ 206 -192 -25 200 -97 -94 164 68 -238 115 107 -147 39 75 -137 -76 223 -112 -134 167 -39 -201 101 -2
2468bk67L36L8k86J14K24l26k5L37k11r6K64j14k05K83J0k47J91P8k42M4K46k56
$$ -2 -269 67 105 -181 -67 157 -169 -194 143 -68 -164 100 -14 -219 64 74 -173 18 96 -146 -102 144 -112
2491a12j3L06k11j37K91o0l14L51J9k63R9J97k16r0L28j98j75L70j22k66L25j4
$$ -112 -125 181 -30 -167 124 64 -250 101 120 -143 -44 153 -63 -153 175 -23 -198 172 50 -216 109 95
2513I5j98J72Q9k87J18K51k44n8K42j14k55L93q7k17K20O2l40J81K00l10L5K30
$$ 95 -103 69 158 -129 -11 240 -4 -62 180 66 -189 204 117 -100 120 182 -158 23 223 -87 -52 178
2535A78j57j18K47j07k35L20Kk77K09J00l08R3K22k57m1L14j51k51K86O2l73L20
$$ 178 21 -97 150 43 -192 128 130 -147 62 162 -146 -53 169 -88 -129 185 34 -217 69 131 -242 78
2557G8L2k87J35J60k53j0K41j22k00K93m7k29K77K3l25K20J64l47NL56k68q2K80
$$ 78 110 -177 -42 118 -135 -145 96 -26 -226 67 20 -209 68 91 -234 -14 150 -197 -192 164 -104 -186 94
2580I4q5j56K53J8l31K13J48l28J13K16j84j24L01j14j61K88j14j58J48O3k73
$$ 94 9 -147 106 124 -207 6 154 -174 -61 155 -29 -153 148 34 -127 161 47 -111 37 100 -173
2601a73J88K06l05pK59k30l3K25j0k33J73N7k46J63J97l02P0K03l01JK92j78q7
$$ -173 15 221 -84 -91 168 -62 -95 130 120 -113 60 117 -129 34 231 -71 -1 202 -99 -98 194 16 -71
2624g1K15J2k81K14R3l03J53J36k32m3K37j59j00K38m7k39K69lk56Q5K33k93L1
$$ -71 144 156 -125 89 182 -121 32 168 -64 -107 130 -29 -129 109 62 -177 92 89 -167 -82 151 -142 -111
2647a11K59j85n9K13j53j45K13L6k36J01J46k60J27K23l27l2L56k11r4K50j21
$$ -111 148 -37 -96 117 -36 -181 32 68 -168 -67 79 -181 -54 169 -158 -190 166 -45 -139 111 -10
2668a0j62K79o0j95J69J64k76NK40k21j08L32j36k08K55J2j97J28J55l02J17J76
$$ -10 -172 107 47 -148 21 185 -91 -86 154 -67 -175 157 21 -187 68 80 -117 11 166 -136 -19 157
2690A57j95n9L29k01j42K56j16j19J71J8j77J30J15j72r1L13k44q6L19j60j83
$$ 157 -38 -97 232 31 -111 145 29 -90 81 99 -78 52 167 -5 -96 217 -27 -113 206 46 -137
2711a37K45l6k68K53Q7k87J02K41k52o4L26k18j75K52l3k47K10J24l05J83J07
$$ -137 108 72 -196 57 144 -143 -41 200 -52 -116 210 -8 -183 69 36 -211 -1 123 -182 1 108
2732A08k17J6K16j96j20K90j00k36K63M0k33J35J45k63P4K17k21l6K33j14j94
$$ 108 -109 -93 123 -73 -193 97 -3 -239 24 64 -169 -34 111 -152 -78 139 -82 -118 115 1 -193
2753a93J89J24k88J89J46l36J13J58k07PJ90j39j46K82L3l03K26R3k73J54O2k05
$$ -193 -4 120 -168 21 167 -169 -56 102 -105 -98 92 -47 -193 89 122 -181 45 138 -135 19 81 -124
2775a24P0K09k27kK37j00j52K00l0j96J67J27k42KK38k46K1J75q6j54K34l5j62
$$ -124 -54 155 -72 -74 163 63 -89 111 81 -115 52 179 -63 -61 177 -69 -48 127 41 -113 121 86 -76
2798g6J57R7k72O5K21k59K4K24k01r8K76j07j35J71k2j72J72N3j54j6K47k14o6
$$ -76 81 178 -94 -29 192 -67 -43 181 -20 -118 158 51 -84 87 65 -107 65 118 -36 -52 195 -19 -85
2821h5K81k31r7K51j03j53J19J21k16JJ36j43k6K68j59j18K33q0k69K17Q2j79
$$ -85 196 -35 -132 119 16 -137 -18 103 -113 -112 24 -119 -145 123 -36 -154 79 -1 -270 -53 29 -150
2843a50J09K04k85M9K12k42p3K81r3k02K87k0k15J08J26j98L6K00j99l3K26j23
$$ -150 -41 163 -122 -73 139 -103 -176 105 12 -190 97 77 -138 -30 96 -102 -66 134 -65 -98 128 5
2865El1J28o9j69K47k6j89J32J22k11MK11j31j42K97l6k78K76l4k16J25J87k57
$$ 5 -26 102 33 -136 111 85 -104 28 150 -61 -57 154 23 -119 178 142 -136 140 106 -110 15 202 -55
2888e5J1J68j48k3J84n4j94J48Q6k76K09pj62N9K02k33K9J38p5j49K32n2k17J58
$$ -55 -44 124 -24 -47 137 83 -111 37 123 -153 56 49 -113 -54 148 -85 -56 82 7 -142 90 38 -179 -21
2912b1P9k14J20J02k08J15J03j15n5J64k02j5J53Q1k56J23J21k46M8K16k14qK03
$$ -21 58 -156 -36 66 -142 -27 76 -39 -94 70 -132 -147 6 87 -169 -46 75 -171 -123 93 -121 -129 74
2935G4j00j48K28o7j56J82O8j80K1K06j81J2J78j61m4K51j00j89J96j1j40K1J35
$$ 74 -26 -174 54 -13 -169 13 81 -99 -78 128 -53 -41 137 -24 -68 183 83 -106 90 79 -61 -40 95
2958I5j86M4J60j18p8K15j05j05K33q1j85J07P2j49P7J20j84L8J65j48o5J76o7
$$ 95 -91 -47 113 -5 -83 132 27 -78 155 74 -111 -4 68 -81 -4 116 -68 -30 135 -13 -78 98 31
2981C1j80J90M2k13J66J00j73M4J42k27O8J35j21j64K64l4j39J10N1j98R8J14
$$ 31 -149 41 83 -130 36 136 -37 7 149 -78 -10 125 4 -160 104 70 -69 41 92 -106 -8 106
3003A06j27o1J99j07j61K42p8j01J46l2j90J20J50j87o1K14j65l2J93r4j40K09
$$ 106 -21 -82 117 10 -151 91 13 -88 58 26 -164 -44 106 -81 -142 72 -93 -125 68 -26 -166 43
3025D3l6j40J87jj61P9J05j12k9J47p7j18J47oj46J95Ok00J72L7j87J21P5q2p4
$$ 43 7 -133 54 53 -108 -29 76 -36 -65 82 5 -113 34 28 -118 77 83 -117 55 92 -95 26 101 19 -55
3050e5J92p7j81K72n7j79J18O1j52J1J70j37o3J42k1r7J68o7j80J98J1j53P6J13
$$ -55 137 60 -121 151 94 -85 33 94 -58 -47 123 -14 -77 65 44 -53 115 48 -132 66 77 -76 0 113
3074A13j67K1J27j37j1J68m8j85K20l1j93J37O7j47J6J45j57nJ95j78l7J56j30
$$ 113 -54 -33 94 -43 -54 114 66 -119 101 70 -123 14 81 -66 -50 95 -62 -67 128 -50 -87 69 -61
3097f1k0R5O2j86J46M5k10N9J91j40k2J53j09j42J62L0k17J24J41j64%J57j93
$$ -61 -81 14 76 -110 36 81 -129 -70 121 -19 -41 112 3 -139 23 53 -164 -40 101 -63 -63 94 -99
3120i9J5J68j28n5J54m2j60J60l0j30O1K34j76j7J62r1r9J79q6j04J43K9j99P1
$$ -99 -84 84 -44 -99 55 13 -147 13 -17 -147 -86 148 -28 -45 117 26 -73 106 20 -84 59 88 -111 -40
3144d0J85k04J9J70j07p4J85r3o0J53j5j58J24N3k08L4Q4m2m6K01k09kJ94j25
$$ -40 145 -59 -40 130 23 -51 134 41 -19 134 119 -39 85 138 -70 -36 48 6 -40 161 -48 -50 144 19
3168A9p8O7Q8j82N2R6j11k2J26q1o8J84r6r0J43L5j74P4P9k12P1J93j87pJ85j76
$$ 19 -59 8 96 -86 -34 62 -49 -71 55 -26 -94 90 -6 -96 47 82 -92 -18 61 -151 -80 113 -74 -81 104 -72
3194g2n6J84q7j41J92O1j38M5N5j62M0J79j37j0J31n7j45Q8Q7j82J22N5j10M3
$$ -72 -128 56 -31 -172 20 81 -57 -12 43 -119 -79 100 -37 -47 84 27 -118 -30 57 -125 -3 52 -58 -15
3218a5Q5j84R0J09r9j6J44j17j41K10m3p6N6J37k19M6R6mj33J70p1r9J14N1j04
$$ -15 70 -114 -24 85 -14 -30 114 -3 -144 66 23 -53 3 140 -79 -33 63 59 -74 96 25 -74 40 91 -13
3243a3R2L9j63P8R9r6r9J39l1j58J73m4j05J45P2k11O8J24j79L2J52j07q3R1j3
$$ -13 79 118 -45 33 132 36 -63 76 45 -113 60 16 -89 56 128 -83 -15 109 -70 -38 114 7 -76 15 2
3268Bj03J69J4j55O7P7j98J09N3j33K9J52o8q1P8O6j55J18O2k07K9J91j60k7J17
$$ 2 -101 68 82 -73 -6 71 -127 -18 35 -98 -69 83 15 -66 12 78 -77 41 103 -104 -75 116 -44 -71 46
3293D6o2l9J33l5j26N9J06j91O6J19j85K0J61r5n6J96p0j30P6L6j58J51P9j50
$$ 46 -16 -55 78 43 -83 -24 82 -109 -43 76 -109 -89 72 -23 -79 117 47 -83 -7 29 -129 22 101 -49
3317d9KJ44r3m8J57r8r9J58J4j60J36M0j22L5R6j14l6J40j24K9N9o9r1J80j5j20
$$ -49 -47 97 4 -44 113 15 -84 74 88 -72 64 104 -18 17 113 -1 -37 103 -21 8 67 -2 -93 87 72 -48
3343d8J15M5j51L2J15q0m8J15p0p0J30q7q1O4M3o5o9J64r6j8J40p2r2J67n2j62
$$ -48 67 112 -39 -7 108 28 -20 95 25 -45 85 -2 -83 -19 24 -41 -110 54 -42 -60 80 8 -84 83 31 -131
3369a31J59oj41P0R2n2m2J63j30p3J66l2j99K12k0j46J33k3o7lJ50j30l9J37r9
$$ -131 28 22 -119 -49 43 -9 -51 112 -18 -91 75 43 -156 56 36 -110 23 0 -67 -70 80 -50 -89 48 -51
3394e1m2J56j16m1J50kj55O8J21j37K7J69j28j42K27n0j44J12P4j38J04M3j34
$$ -51 -93 63 -53 -94 56 54 -101 -33 88 -49 -22 147 19 -123 104 54 -90 22 96 -42 62 105 -29
3417b9Q9L7j10l1J37q3l3J47n4r2N9O6j75Q6O9j53P4J18q8r0J13j2o8R6n6r9J30
$$ -29 60 97 -13 -44 93 10 -23 124 70 -22 37 103 -72 14 83 -70 4 122 34 -56 57 45 -23 73 17 -82 48
3444D8K0j27K0J35j92QJ54q2m3Q4j1j30Q4P8j98J01J12j73O1P9p2m4R0Mo7K3O7
$$ 48 68 -59 -39 96 -96 -88 66 -16 -59 25 14 -116 -32 46 -152 -51 61 -112 -51 28 -44 -88 2 6 -61 -38 29
3471B9j27Q8M1j16M7J36j25q7J38l8n1J19o0m3O8J0p9L9J00j26l7J36%j02N7k3
$$ 29 -98 -10 31 -85 -38 98 -27 -114 24 -14 -65 54 -6 -49 19 29 -50 -11 89 -37 -74 62 62 -40 17 -6
3497fj02J60j5j15N6J15j55K9J31j09k4J63j40j00K15r8m9M1J36k64J18J39j46
$$ -6 -108 52 37 -78 -22 93 -62 -33 98 -11 -35 128 -12 -112 103 5 -44 -3 133 -131 -13 126 -20
3520b0l0J52j8j39R1m7o9J10K1j05K5J55j79j4J44r3j7N5K3p4P0r3m6P0O6n2j9
$$ -20 -50 102 84 -55 36 -11 -80 30 51 -54 -29 126 -53 -67 77 -16 -33 22 45 -29 41 -52 -98 -28 38 -14 -33
3547c3Q3q5k9J28l8j45J47k1j23K11m9j01P1J6r6k9J20p4K3R0o8r4J46j1j18P1
$$ -33 50 -35 -64 64 26 -119 28 7 -116 95 46 -55 16 32 -64 -93 27 -47 -24 66 -2 -96 50 39 -79 -8
3573hR1j45N3P8r2RM0m1p8J08Kp3N1N3q8O8L4j47M5J43j00n6J41n3r7J18Q3j57
$$ -8 83 -62 -9 69 -23 -14 26 -15 -93 15 17 -56 -5 48 -40 28 62 -85 -40 103 3 -53 88 35 -62 56 139 -18
3601a8L8Q0j04nP9p3l1J61r8o7R6k5r5J22j6n9k9J33r0m2R4n2k3M7jq0J38p5j02
$$ -18 20 100 -4 -9 70 -3 -34 127 29 -38 58 33 -62 60 44 -15 -44 89 -1 -43 51 -1 -24 23 22 -58 80 5 -97
3630i7O6J69k35M3O3k6k2R6o9p7O6%j05J07O6j50O0N8q9J5J33p2j07J71k2j17
$$ -97 -31 138 -97 -54 9 -17 -39 57 -12 -89 -23 -23 -128 -21 45 -105 -45 13 -76 -61 72 0 -107 64 42 -75
3656g5N9K8j20N1R1r2k2J31o6l4Q4k1r2R0m6j8M0O7j13L2J41j02l8P7qj22J57
$$ -75 -16 12 -108 -57 34 -58 -80 51 -15 -49 35 14 -78 12 -34 -52 -12 55 -58 -26 115 13 -25 52 44 -78 79
3683G9l2j00J42l6j25R4J03j80NJ28j08n7K51j60p4O7M9j41J15Q4j16k6J54j15
$$ 79 47 -53 89 53 -72 22 125 -55 -50 78 -30 -87 164 4 -70 -3 46 -95 20 104 -12 -38 116 1
3707Ap1J01or5J10Np2P6j6r1O1M0n4k0J1K8j16J75o8p6O6J3p9K7N9j03K7J12o4
$$ 1 -70 31 25 -70 40 45 -27 49 33 -58 3 43 -11 -31 -20 8 -108 67 -1 -77 -11 2 -77 -50 9 -94 -67 45 -19
3736a9n2N9Oj35K18l6j68J47L8j05pP8r1N1N5o0p3J76l0j29O2N4n7j4O7n7o2K01
$$ -19 -71 -12 -6 -141 77 41 -127 20 58 -47 -54 24 -67 -16 39 -21 -94 82 52 -77 -15 39 -18 -32 35 -22 -84 117
3764A17j39l5Q8m6l1R0nn0J8P3j19J7J65j84L9Q7m9j06J28Lj12J38q2p4O5Q1j21
$$ 117 -22 -57 31 -15 -46 44 39 -11 7 80 -39 -22 143 -41 -2 85 36 -70 58 61 -51 87 5 -69 -4 77 -44
3791d4L3J16j01k7P9l1m1M1R3j60K6J30j13k1N2q4K4N0l8m3J34m6q4R6jq6L9Q2
$$ -44 -11 105 4 -23 56 25 -16 25 118 -42 -16 114 1 -20 32 -52 -28 22 -16 -59 75 29 -55 41 40 -46 -7 75
3819G5j78M5J21j53M6Q6l3r3N4Q9j46O8R2j05JR4m9j02J38l9r7Q5k8p6O7J07o5
$$ 75 -103 -58 63 -90 -44 42 9 -84 -30 59 -87 -19 73 -32 -31 63 14 -88 50 11 -86 -1 -29 -105 -38 69 4
3846Dj8J4k0n8J52m0j18J55L1j84Q5Q6j26J18K3q7qR5m2j36J69o9p6Q8Jr7O4M4
$$ 4 -14 0 -20 -78 74 34 -84 71 102 -82 3 89 -37 81 104 17 9 104 62 -74 95 26 -50 38 39 -58 6 50
3874E0n1k9P7q5kQ3m7qP5n2k9N2K5q2mQ0q4M0M6p9rJ07j2o0O0jj37L7J04j24N2
$$ 50 -1 -30 47 -38 -40 43 -4 -12 63 11 -18 34 59 -23 -27 53 -31 9 55 -24 -33 74 62 2 62 61 -76 -39 65 -59 -7
3905gM6q9l5J07l7l9R8l1r8N6N2j16J06N2j56KJ10l9k3M9j0j28J16P5j44P0ql7
$$ -7 39 -50 -85 22 -15 -54 44 13 -85 -29 23 -93 13 65 -91 -89 21 -18 -41 8 -2 -130 -14 61 -83 -13 -21 -58
3933e8qJ57j73L0Q7n8m0R1N2j29Q2L8j04L5J15j44l3J71q1n7Q2L4j66P9J11j98
$$ -58 -66 91 -82 -52 35 -23 -63 28 80 -49 33 71 -33 2 117 -27 -60 111 30 -27 55 89 -77 2 113 -85
3959h5P1J43j68K9R1j34Q8J9mp0P2J1j01R3M4j47Q0M1o4j24J15M4j24J25pj14
$$ -85 -14 129 -39 -10 81 -53 35 54 50 -20 52 63 -38 55 99 -48 32 73 9 -115 0 44 -80 45 38 -76
3985g6O1O1j41P5Q1j26N3O6o9J6Q8k9q5L8J0q1K0J35j66N0j1J6j27K04o2q8R9
$$ -76 -15 46 -95 -20 61 -65 -12 54 -15 1 89 60 -25 13 23 -58 -38 97 -69 -19 -30 -14 -141 63 1 -87 12
4012A2l5o6N0L1q5N7M9j10Q6N5j1o5J3L3r5P7O3q4L0N8n9n3J23n2j02J42l7k4
$$ 12 -23 -89 -39 -8 -93 -36 13 -97 -11 44 33 -32 -19 14 -81 -4 59 -25 5 63 4 -49 74 22 -80 62 25 1
4040AR7k4j48J10J2n3N8J6k4r9J23m6n2J48p7r1J19k7n6Q2rq5L3Q5j23LQ0pj25
$$ 1 98 74 -74 36 48 -5 53 69 45 -54 69 23 -29 119 42 -49 70 43 -13 69 60 -25 8 93 -30 -27 53 46 -79
4069g9J23Pj66J96j8q6K3N7o9l4J01m4j35J57mj19Q7M9r2R8l4k6j4L2n0m0P4M8
$$ -79 44 51 -115 81 63 -23 0 57 -12 -46 55 11 -124 33 29 -90 -3 46 -46 52 18 -8 -22 10 -40 -80 -6 42
4097D2j05R4Qj86J12M5p8M0K5j3k7N6Jj02K3M4l9O5K6m0J6j1k7l3R9m9J8P7m8
$$ 42 -63 31 39 -147 -35 10 -68 -28 -3 -16 -43 13 14 -88 -65 -21 -60 5 31 -9 7 -4 -31 -64 35 -14 4 81 33
4126C3p3Q9K3j06L4J10j56M2J22j40J2O0m1k5O0Nr1M9R6j16oJ03o7m6J39r4l8
$$ 33 -40 49 72 -34 0 110 -46 -4 118 -22 -10 50 9 -16 44 49 -42 7 103 -13 -19 84 17 -29 110 16 -22
4153b2M9l0j0J6Mj11R5N8n4k9R4l6k5L6l6L2rl3j2L0J0k4p9J36o6k6K0nL5K2k3
$$ -22 27 -3 -13 3 7 -104 -9 49 -5 -34 60 24 -1 35 -1 31 22 -11 -23 7 17 -7 -86 50 -16 -42 -22 -27 8 30 7
4184Gr7J05K6j43O8L1o6J8J12j50M0J12q2j10J32M3j17M6Mk7K9M9q0J1R2Jj08
$$ 7 -90 15 41 -102 -34 -3 -69 -51 61 -89 -49 63 -19 -129 3 46 -71 -25 -21 -48 -19 30 -50 -39 53 54 -54
4211e4J18n3q3J24nq4K6Q3j09N9l8j5J0J26q4l7P7n6QNQ7j29kJ27j00p7J81j19
$$ -54 64 11 -72 52 47 -37 -11 72 -37 22 -16 -31 -21 105 21 -16 61 5 13 18 105 -24 -26 101 1 -76 105 -14
4239a4k7R8p8L5P2Nj32nQ1j02N3M7j2j8L4n6m3M7Q0j17OJ22r6k5J50p5r3J36m3
$$ -14 -41 57 -21 14 86 91 -41 -46 35 -67 -14 33 21 3 37 -19 -62 -15 65 -52 -46 76 -20 -45 105 30 -63 73 30
4268C0o8O2J8q5K5K6p9M0N0k1m6L3K0m2O3k2p9O8Q3j56O8L8j34J18M6j08K3R2
$$ 30 -38 24 42 -43 -18 8 -71 -31 19 -2 -48 -15 5 -37 26 4 -75 -7 76 -80 -12 26 -108 10 56 -52 -29 63
4296F3o8jPJo2M6J19j10QL6qk1Q8j36n3J10L0o7J18K7j75N7N5j01L6O4q5J7J02
$$ 63 -5 -6 1 2 -60 -14 105 -5 3 39 31 10 98 -38 -91 19 49 -18 100 127 -48 9 64 -37 -1 63 -22 -5 97
4325I7p8o2O4O9j08MR2p0k0L5p5PJ16k2j33O3O8p1L5K1n3L9J6j4k4N2l5j02Q4
$$ 97 19 -43 21 90 -18 -14 78 8 -12 23 -52 -45 71 49 -84 -21 47 -24 11 32 -21 18 34 20 -4 48 13 -89 -5
4354ek7n1J16o4M5KK3q1j2N9o7L5Q3mj39R8O4j09M0L8j01P2k3J7l6O9n6p4J16
$$ -5 -32 -83 33 -31 14 16 39 -42 -54 5 -62 -27 56 52 -87 11 75 -34 6 44 -57 15 -8 9 -27 42 -14 -88 28
4383B8k4r4Q3J02j45J1j3K9j0R1o6j1J15k4j44J12j3m6M6om3j2J00n2l0Q7k5j22
$$ 28 4 -90 -7 95 -50 -39 -52 -23 -33 58 -8 -19 96 72 -72 40 27 -19 27 21 -22 -34 66 14 -16 71 46 -76
4411g6J40m8j6Q9nr1K2O0l7K2j9m6mN8rq1OM1n2P2K1p8K8K9j6k6mJ2n8Q2L7j49
$$ -76 64 16 0 89 84 -7 15 75 38 60 41 -5 -9 49 40 -41 -35 6 -46 26 47 -31 -3 26 10 -16 -20 -8 -66 16 53 -96
4443i6J09Rr4M9J9MpN3j11MP8j4m5M3K1q5P3K4o8l1P9p0j0J31j45mJ16j1r3J4
$$ -96 13 22 -72 -23 -4 0 -7 46 -65 -61 17 3 -42 1 22 -63 10 34 -34 -65 14 -56 -66 65 -80 -84 32 21 -72 -58
4473e8J10j17K3K5n3M9O9j17N7J3ml5N1J4n0L4L9j23O1N6m6k1P5m2n7Q6k0jjP2
$$ -58 52 -65 -42 -17 -70 -21 48 -69 -12 1 -3 -38 13 27 -23 11 50 -73 -12 44 -2 -23 52 10 -47 39 19 18 17 89
4503H9q6L2j9J9j5K7k5m1M4k6m3M7Om9J3M2Mk3J8l6p5J50l4q7M4N9k0k3lj8l1
$$ 89 3 35 16 35 20 47 22 -19 25 -1 -44 3 9 -40 -27 15 19 -4 14 -22 -97 53 19 -68 -24 35 15 -8 -11 -29 -60
4534f0P0p5J9L8q0LJ09p9k5J03k9j1%J03j07m4O6k4k5L3l9L4k1N0l3M4M9j16P8
$$ -60 10 -65 -46 -8 -88 -85 24 -55 -80 23 -6 -17 -17 86 -21 -65 1 -23 -48 -15 -54 -20 -41 9 -24 20 69 -47 31
4563C1K9r4jQ2o9m2Q0Qj25J17L2p9J6N5kl9M7n2j0L6J0o5J49j06m6J00K9q7k6
$$ 31 60 -34 -35 47 -22 -64 16 24 -101 16 48 -31 -15 40 38 -1 46 -6 -16 20 30 -35 114 8 -38 62 91 4 -22
4592b2O5Jp1O9rp6rJ70j54O0J9o4P7jK4j03O1r3O9P4r5k3M4j4pk5O2n5J5L4o9
$$ -22 43 44 -27 42 33 -43 -52 118 -36 24 43 -21 56 55 79 -24 37 -56 13 87 -8 -31 13 -1 -8 -33 29 -26 -11 23 -46
4623d6L4N6n5m5L1jk4KM8l7k9Q0l5l6P4l7o2J37o4MmL2p5J2J12j32jJ44j04k8
$$ -46 -12 44 -11 -56 -25 -26 -50 -48 0 -37 -66 14 -21 -57 17 -20 -82 55 -9 -5 -9 23 -52 -40 72 -60 -61 83 -21 -49
4653d9P7m6j2NNp3R3k7j0k2O5j0M1j1k8l2O7j6Ql5P1p1O3n0p5M3R8nj34J38o9
$$ -49 28 -18 -30 -25 -20 -93 0 -27 -37 -59 6 -4 37 26 -2 -34 33 17 25 -10 61 -10 53 3 -72 -29 69 64 -70 68 -1
4684aNP1j4j12L0O5m6k4L3Mm0Q9l4n6J9K3l8lJ07j04NN9m5q5J21j3o3P1p3K9M3
$$ -1 4 75 61 -51 -21 44 -2 -26 7 11 -29 60 26 -30 -11 12 -26 -29 78 -26 -21 38 -7 -92 29 16 -47 24 -49 -20 23
4715B3op2M5Rn3kP9j5p7J23k8p2M0lk9R0p9J1k9J33q9q2J47m3o9N9J1q8J17r7
$$ 23 17 -55 -10 -1 -54 -56 23 8 -69 54 26 -46 -6 -9 -38 52 -27 -16 -45 88 -1 -83 64 21 -48 11 22 -66 51 -46
4745d6N1PP1j06K4M2o4NO2lj27P7M9n4%Q3j26O5Q2n0p0Q6p8nP3j5n3L1N9j02O2
$$ -46 5 12 83 -23 1 43 -21 -16 46 43 -84 -7 42 -12 -12 71 -55 10 92 42 -28 58 -20 -25 48 33 -20 11 70 -32 30
4776C0J5Pq6R6j6m2M6J2l0l2O5n5%L4m7k3R4q4o1J53m7j7J0mj01J06o8RM4k3q0
$$ 30 45 52 -34 62 46 4 50 62 32 0 65 10 10 44 -3 -26 68 -16 -77 76 29 12 22 18 -83 23 -45 -36 8 -15 -95
4807i5R3Rk9j7k9L7j3K1pKL9mq0M4Q9j20j2O8m9lP5l8k1M7j3m6kQ2q7N4L5o4l9
$$ -95 -2 7 -22 -39 -68 -31 -44 -23 -30 -28 11 7 -73 -29 60 -60 -72 -4 -53 -56 19 -19 -40 7 -6 -52 -54 28 -59 -5 30 -34 -73
4840g3J02k4q5J08J5m0k0J5k6JO4k8n0N3k3l3K8K1n7KR5Nn0J8k6k2P3m9Nj5J8
$$ -73 29 5 -80 28 43 3 -17 -2 -28 -27 37 9 -41 12 -11 -44 -16 5 -52 -50 45 50 0 18 -8 -30 43 -6 -1 -16 2
4871Bm9Q6j2mJ3L2o3L6JJm2Q8o9k3O7m1l1l7O7ro8P9K8j23P4N1q5J7L7q0R2j4
$$ 2 -47 39 27 23 36 68 5 41 42 43 1 89 20 -3 64 23 -8 -45 22 13 -55 24 52 -71 3 54 -31 -14 23 -57 35 21
4903B1r0P6J7o8l3L2J5KM0K3q9M9K5Ok5n3K6P4o4PnQj9L0M0n8lJ2j3%O0L0o2l4
$$ 21 -69 7 24 -44 -77 -45 -30 -28 12 35 -54 -5 20 26 1 -52 -26 48 -16 -9 -14 -6 -25 5 45 -13 -16 -4 -17 -17 43 73 11 -23
4937b3K7%k9O3m0m5M5J9kp0Q8n8l8J07k5J7m1P2n6K8j2k4K7j6k4O5o0L3j1K2P
$$ -23 4 4 -25 38 -2 -47 -2 17 15 -55 33 -25 -63 44 19 36 -5 67 11 39 27 3 30 14 -10 55 -5 28 17 39 46
4968D6p6Q3r0O7K0M3j01m8O0j1J3lL0k3Rk5m7P4L6j11L3L7l8l4M8K6n5Q0l4l8
$$ 46 -30 53 -37 30 50 93 -8 -56 4 -7 6 3 33 10 19 -6 -53 21 57 -54 -21 16 -22 -56 -8 18 -37 43 9 -29
4998b9kLL9j4k6K0o7O6m8N9Qm9j8R3n3j4J06o9o6P1j1j5N0M7j10pJ06p6QM6p2
$$ -29 -31 -28 11 -3 -29 -9 -76 -10 -58 1 9 -40 -58 35 -18 -32 74 5 -61 10 -1 -16 34 81 -29 -36 70 -6 2 48 -24
5029b4K7OK9q0M1Oj3L2Jm4m2J13m6RM0n7lk9N9m9K0K7%J5l5K3m8MM6n0qM9JL9
$$ -24 3 9 38 -42 -1 5 -8 24 25 -19 -61 52 6 15 55 -2 -5 -34 25 -24 -4 23 23 38 3 26 -22 -18 28 -22 -30 19 20 59
5063E9j1m4o3L7N8n9L3J1j4LK1l4l3N6Mo1O3n5o5R5j1n4N8N3j23M1L2k4M7%n2
$$ 59 48 4 -59 -22 36 -23 10 21 7 10 31 -3 -36 20 24 -37 26 -29 -94 1 -10 -64 -6 47 -76 -35 -3 -27 20 20 -32
5094c2POo5P1K3N1r2O1k8k7M6l2J7m7J15p4n9O9J9n8O1pqM8n1j9k3J9j3J7N9l4
$$ -32 -25 -19 -84 -13 10 61 -31 30 2 -25 21 -11 6 -41 74 0 -59 10 29 -29 32 25 17 65 14 -5 -28 -9 -22 -5 54 20
5126B0m4K3J2l6O0jr3M3K4j0K3K9o0K7kn3j9Q8J1m0oLl9M6J02j30P6k0p0N3j7
$$ 20 -24 -1 11 -25 35 34 -59 -16 8 -2 21 50 -10 17 15 -38 -57 31 42 2 -4 -1 -40 6 108 -22 54 34 -36 17 0
5157@J1Ql8L7m6M3J0n0q8J42r2Q8nm1Qm1K5M7l1K8q0j7L6K3kk2O7o6R4m1K1r2
$$ 0 11 19 -19 18 -28 15 25 -25 -113 29 -63 25 20 -21 -13 -54 -29 18 -13 15 -65 -82 -46 -23 -25 -47 20 -46 48 7 28 -64
5189f4P7m5M1O2q0QL7m3PJ7npO6l4o2M9Q0r2p3Q3l6j6Q7r6pJ01o9K8l5J04r7l7
$$ -64 13 -32 9 71 -9 -1 36 -7 0 17 12 5 71 37 -25 24 104 12 -61 22 -14 -30 57 -39 -46 55 -14 14 -21 83 -14 -51
5221e1R9p8J0kM3%K0j07Q6k6K6KL5l7k6k1K3J1NL6o0r1R5j0J2K4k4l3K3L5r7N1
$$ -51 48 -30 -20 -22 21 21 41 -66 20 -6 20 22 57 20 -6 -27 -4 7 12 48 -12 -103 -8 -18 -6 18 -6 -39 -16 19 -78 -27
5253b7N5p6QQ2n2n2L9L6n0JRj2n2L2L8k5M6n1J8jj9L1M0J0p1J8J1M2n8N6r6M2
$$ -27 28 -48 -40 42 -10 -62 -23 13 -37 -36 -27 -39 -91 -59 -21 -46 0 -51 -33 -34 -53 -22 18 28 -43 -25 -14 28 -30 26 -70 -28
5285b8M9rm5M7n3K7j7P4Pr2M7J8l5L6l8l8R2p0L7J1O7j17J1K8L6p4lL4Lj0J4m2
$$ -28 21 12 -33 14 -39 -12 -29 45 52 -40 7 25 -10 26 -12 -50 42 -28 9 20 87 -30 -19 9 45 -29 -32 2 5 -5 9 -33
5317c3J07Mj03k8P9l0jN2p2L1Q3p3jK9j5j06R9J4k3n1K9j9M3n8M9j2jJ1p3Q7J
$$ -33 74 78 -25 -53 26 -4 -5 47 -25 6 89 16 15 44 29 -77 22 36 13 -38 -9 -28 15 -43 6 -6 -7 4 -69 18 19
5348A9k4l2O0j3N2r4j7qN3N9r6M9m8M7j6j6mNL1n7k4N9J0l4N5l0L5p1L9l9K4J01
$$ 19 -5 -37 23 10 62 -32 -49 -57 -4 55 -41 8 -40 7 -9 -25 -29 -24 7 -50 -74 -15 -5 -39 16 -14 21 -50 -11 -50 -26 75
5380G5o1m4j1N5j7K2K0k8k0L3l0k1M9Po9P1K1j09J08l5J7m3M0o6L7o6O7KK1j7
$$ 75 14 -30 -41 14 -3 19 39 11 -9 24 -6 -27 22 29 -40 31 52 -57 51 16 33 -10 30 -36 1 -65 2 4 25 8
5410HrK3j8j8M1lkm4N7p5P3k0l0KN9k4k2R9n0m5K0l9j2P6n4NJ1J7o5L1O3o3rL
$$ 8 -1 22 4 -14 27 24 22 -22 35 -40 33 13 -17 -15 44 20 -2 97 47 2 22 -17 -29 47 -7 -2 9 26 -39 -8 55 -8 -17 -14
5444a4O9r2K8jk2P6k5n1M7k4J8n1O1kj02R2O3j05l6Q9j1l3N0j7m6M5k0J9J5j1
$$ -14 55 -37 -9 -10 -32 44 19 -32 15 -9 9 -42 19 17 -85 7 70 -35 -71 18 7 -26 24 7 -39 6 -14 5 20 9
5474Ij0J8k0m0P6k0l9M7Rnn5P2m6MM4j2l8j7R0k3m6L5n4PK0PLj0L3m9mK7p9N3
$$ 9 -1 17 -3 -43 33 13 -26 21 30 25 -30 42 -4 0 44 32 -6 -23 67 44 -2 33 -21 -14 6 13 16 6 39 -10 -14 13 -66 -13
5508a3oj1L9Kl9pL7K2l6J3K2jl9%k0k6Q0j8j8P7o8j0%l0L2n3N9J8J0J6l4O4q2
$$ -13 -19 -30 9 11 -28 -35 2 24 -12 1 23 22 -17 -17 -37 -63 17 -1 -19 58 -10 -20 -20 -50 -18 -71 -12 6 16 32 -2 62 -20
5541b0K3KN3l1m8k4M9j00P8K8k4j4pk2m3J17m6m6Q0M1r6M0N8n4M4j6l3l5P1qj8
$$ -20 3 5 58 27 -21 -45 4 -96 -18 10 -14 -28 -35 -57 -100 17 -29 -75 5 46 -50 -10 48 -6 38 22 -11 -46 25 17 -1
5572aQ2j39M8N3k9j7J8L7o8PL1j3N2j01R1o8M1k2j9Oj5QJ6K3k9M4l0jj6K3k0K3
$$ -1 81 -58 -10 43 14 -3 15 52 -16 -9 22 9 61 -40 51 -17 24 2 -17 -11 -26 -18 -2 21 -8 36 6 5 -11 12 -8 15
5604A5K9l8p2J10o1M0l9j4K7lm7M5J9j6J6J4J2o3j5M2L1o4L4L7j6K8o1K3l6J1
$$ 15 44 6 -66 44 -17 23 -16 -30 -3 -6 -53 -8 11 -5 11 25 37 -26 -41 1 32 -32 2 39 23 51 -10 13 -23 -12
5634a2N3m3ml5K4K2k7k0ML7Qj5j5O9q1J8N1o7j3M9Pj4N9m6K2k0l4l4J34m2n4N2
$$ -12 41 -2 -6 -41 -17 5 -22 -42 -38 -1 7 -8 -23 46 -35 -17 34 -33 -46 3 10 -4 55 9 31 11 -23 -57 77 35 -19 33
5666C3o5Qk6J45p5n1M0l7L6M5k5J4n4O0o9KM2M5n6k8M8j5nj4j3j9J3Jk2J9K6n3
$$ 33 -32 -24 -50 95 20 -31 9 -28 8 53 28 42 -12 48 -21 -19 23 68 12 -16 32 17 12 -2 -15 -34 -21 -20 -42 -23 3 -50
5698e0O4o9J07q2j2J8NN0r4R9Rn8k6N9r2J4N9j8ok1O1m4R7k1o6J0J2K4Pk0J3p5
$$ -50 14 -55 52 -30 -42 -24 -19 31 -63 36 45 -13 -39 20 -72 -58 1 -17 -23 -44 17 -27 70 49 -17 -7 5 29 36 16 29 -46
5730d6O9k5K4j4L7o0K6oj7JO3j7o1M8Ok4Rn4k9J6K0M3k0J02j35K8M7j6K3k8K1
$$ -46 23 -2 22 8 45 -15 11 5 -12 -11 52 35 -26 22 28 4 13 -41 -70 -54 -34 9 -11 91 -44 -16 31 15 38 10 31
5761C1j6J6k0j6K1K8o6M3j0M0p0L5k5kL8Oj00O5O5l8l8K0m8N6j7Rkol1J3j4j2
$$ 31 15 31 11 -5 16 44 -22 21 11 51 -19 16 -9 -11 27 33 -67 -2 63 25 -13 7 -41 15 -2 7 5 -1 -32 -19 -33 -45
5793d5J1m2M8J0k3M2l8k3L5N5l9NJ3l0PJ4oj4O6o7Q8o8J1Km0rJJ1L5m0Q0j2o2
$$ -45 -34 -76 -28 -18 -41 1 -37 -60 -25 30 -9 -4 9 -21 -14 0 -6 -20 46 -21 67 -1 10 12 -28 -37 -36 -25 10 -30 50 38 -24
5826b4K6lO7j24N2L2l7J2k2N4k0L0r1Q0j9L5k0m8J1M1l9J9L8k8Nm2L7N4p6K1J6
$$ -24 2 -1 66 -58 -6 26 -11 1 -21 33 13 43 -48 32 13 48 28 -20 -9 32 -7 12 50 22 27 -15 22 76 0 21 37
5857C7Lj8o2R3m6%J8%Lrj2MJ2q4N9j8Q1n3J0J0m7PL5k3j8J3qJ5n3J3J6j4k0l3
$$ 37 40 22 -40 53 7 7 25 25 28 19 7 11 23 -61 -2 -20 61 8 18 28 -19 -12 23 0 -18 -5 -13 2 -51 -38 -22 -36 -56 -89
5891h9J02m3n6R1l5N5j23N6K8n5O0l2Oj8P3n4J7L8j1k0J7K6q7J10m4L9n0J9Om7
$$ -89 13 -30 -86 5 -30 25 -98 -42 -14 -69 -9 -41 -35 -53 20 -34 -17 21 10 -10 7 33 -54 56 12 51 1 20 26 -21
5921b1pM6k5j0K7pO8l9m6K7L0Nl6K6n6K1L0k3J2Mj1L8j3j6M%m5K8j6K5m2N0L1
$$ -21 -28 18 -7 -17 10 3 71 32 -14 13 43 48 12 38 -18 3 33 10 22 26 15 53 40 24 28 28 -17 11 -5 20 -22 28 59
5954E9n1J8K3l5k3JOk7mJ01q8J6l1L1k8L3K9r9O6kj9J7Jm4nL7K4M1Lp7K8k1K3
$$ 59 8 26 49 14 -9 -8 -2 -29 -33 68 -20 -4 -35 -4 -32 1 30 -69 -3 -5 -24 -7 -6 -50 -55 -18 6 47 50 -27 1 -20 3
5987Co4R7m9Rm8N7L5l4K7ml0R3j27K2N4j6J5pL4j30O3k3l7J8M8MJ1LK3m3MOl3
$$ 3 -61 36 -13 -4 -52 5 40 6 33 29 -1 92 -35 -13 41 25 40 33 67 -63 0 -23 -60 -42 6 10 21 24 47 4 8 14 -19
6020a9nJ8N3j7l9K6m5J5k4O8p0K8O8q8Q9p9P3J9n0J0L0n0l2L3j7j3R3k6n7M2o7
$$ -19 -24 -6 47 30 -9 17 -28 -13 -37 31 -39 -11 57 -31 58 -21 52 71 21 31 61 11 -21 12 -5 -18 75 49 -8 34 -33
6051c3L7k1R0m9n4j8J8K4lm5O2L0Jj8rj5J4o9j6N8k7O7o7M8K2m6Lj7J1k2J8J1
$$ -33 4 -17 73 24 -30 -48 -30 -6 -9 -54 8 38 39 21 12 -3 11 -58 -74 -16 -43 24 -43 5 27 -19 -16 -33 -22 -44 -26 -15
6083a5k1L0M0l9RJ7r2Q4rK8n3k9M5M0l3K3lo6M7Rok6j3j6N4j5M3j6k4K3l5L2j8
$$ -15 -36 -6 34 -5 4 21 -71 13 4 32 -21 -50 -5 35 2 25 22 -44 3 12 6 -20 -33 -49 5 -10 33 17 -7 16 -19 13 -5
6116eP0ln4J3m6K2J4nK3k3J6mJ4m7M0j8n4K1J7K5k7L2On2P6p5k5QL9J1J7l6mP
$$ -5 65 62 8 21 -25 -3 11 6 29 6 22 18 32 -15 25 7 -47 -26 -9 16 -11 21 27 -25 51 -24 -49 -41 -2 9 26 -10 -14 -7
6150gj8j3K8O4m9L9n5k6KM7O1m5m9L4m9L8K1l9k5Rj3N2J7k6JK0n2L5J3J1m3jM2
$$ -7 -25 -38 -10 54 5 44 -11 -37 -35 12 73 28 -21 13 -36 2 23 -16 -41 -32 -45 7 24 -2 -1 19 -33 2 15 26 -17 -18 24
6183B4k7k0j5MK1M9lm3K9L2n7j6M2l2J4j3K4j8J7ll2K9k6j1pM4j5oJ4L2j00J10
$$ 24 -3 -23 -38 -34 -13 36 33 -10 19 51 -6 -22 20 -12 2 -11 13 -5 12 9 -23 6 -20 -31 -38 6 -9 -15 -1 31 -69 41
6215D1l1j2m0Q3p3K2K8M3q9%M7k9K3qOl2L3kk1L9m9P8o6j0L6J7j2k6N5k3p0N9
$$ 41 10 -2 -42 41 -32 -10 18 61 -28 -28 19 -10 13 5 11 -21 12 10 -11 28 -21 57 -9 -19 17 34 22 -4 51 28 -42 17
6247A7Ol8mN7k6m0O7r0L8j4L7l6Nk2M3K1K1o2J0l5kJ4qJ0oP0Pn3ok9K5J6PL2q
$$ 17 23 -15 -19 38 12 -28 39 -51 -13 -27 10 -26 -21 -43 0 21 42 -20 -10 -45 -47 -33 -41 -31 -37 33 40 -13 -19 -48 -23 -7 0 32 24
6282B4k5N4m1j7J0Rk6L7m6L0k0On5Q9k8M4j7Mrl1NL0l1L4p6R5m1k8pM7J3o3J18
$$ 24 -1 53 12 -5 5 14 -12 25 -21 9 -11 -5 -60 29 1 45 28 32 23 -8 -3 27 -4 30 -46 49 8 -20 -27 20 33 -30 88
6315H8p9K7q8M9J1m0L0m7K7L7J1j1p1P1q6O6L1o2NR2o2l3j0L4lj3N3p6M5kk7J00
$$ 88 9 36 -52 -3 8 -32 -2 -49 -22 15 26 15 -56 15 -71 -5 26 -36 -31 61 -1 -34 -44 -10 -13 -26 27 -49 -4 -6 -33 67
6347F7q5N6l8m7j8pQ6j2%NlM7n1qj0P4r4M0K2q1O4j5N5l0J1j4j3j5R0o6L0j3J9
$$ 67 -18 38 0 -47 -65 -72 14 2 2 7 4 51 0 -8 -18 56 -38 2 24 -57 7 -8 47 17 28 14 1 -14 76 10 40 27 46
6380D6j0j2km8L0k3O0j6k6J4k0K3%l6M0l7l9j4J08n7j6jM9r2J12n8J2Pj7K4KM8
$$ 46 36 24 22 -26 4 -19 41 25 -1 13 -7 16 16 -20 20 -17 -56 -70 38 -19 -35 -36 13 -79 33 -25 -13 -6 -23 1 3 51
6412E1l2%l0k0N1o0P7k4k6ql5J55r3L4r8L9J6l7L2m9K1LO8j3Pl9j4L8o7N4J7j8
$$ 51 19 19 -11 -31 20 -40 37 13 -13 -21 -56 99 6 40 -58 -19 -3 -40 -8 -57 -36 -33 35 22 29 -10 -24 14 -53 1 18 0
6444@j6KLjPj1J1l3M4J1k0L2Lj13P1l3P7r9R2k4k1O1o2J9M0l4m7P9l8qM1m4M7
$$ 0 -16 -14 -11 -12 -5 -16 -5 -38 6 17 -3 29 32 -81 -10 -43 34 -65 27 3 -18 43 -19 0 40 6 -41 38 0 -8 33 -11 36
6477C6r0R4lj8K1k6j5K7K1o8M6j4j9K1l5K9o1R0j7k7Ko4O2Ql3J0p%kJ1K2J9%n3
$$ 36 -54 40 37 19 40 14 -1 26 47 -21 25 11 -8 13 -22 7 -54 36 19 -8 -6 -70 -8 0 -33 -23 -30 -30 -32 -21 1 20 20 -33
6511c3J22j03K5L9n7j2qO2q7K7N5l2n1K5PJ5L8o7J2J2J3L9l3K5k4j3J4j0l8M4
$$ -33 89 -14 11 50 -7 -19 -27 35 -52 -25 30 -2 -53 -28 -21 -6 32 -35 -23 -11 2 41 8 33 9 -4 10 0 -38 6
$$ [...]
8191a5
##END NTUPLES=NMR FID
##END=
