##TITLE=1H_PhBDE3006-2
 CDCl3, 8 sc, 
 1.07.2021
##JCAMPDX= 6.0         $$ Bruker NMR JCAMP-DX V2.0
##DATA TYPE= NMR FID
##DATA CLASS= NTUPLES
##ORIGIN= UXNMR, Bruker Analytische Messtechnik GmbH
##OWNER= root
$$ XWIN-NMR		Version 3.5
$$ Thu Jul  1 09:41:11 2021 Russian Standard Time (UT+4h)  she@DPX200
##.OBSERVE FREQUENCY= 200.131506
##.OBSERVE NUCLEUS= ^1H
##.DELAY= (6, 6)
##.ACQUISITION MODE= SIMULTANEOUS
##.ACQUISITION SCHEME= undefined
##.AVERAGES= 8
##.DIGITISER RES= 18
##SPECTROMETER/DATA SYSTEM= spect
##.PULSE SEQUENCE= zg30
##.SOLVENT NAME= CDCl3
##.SHIFT REFERENCE= (INTERNAL, CDCl3, 0, 15.7039)
##AUDIT TRAIL= $$ (NUMBER, WHEN, WHO, WHERE, WHAT)
$$ ##TITLE= Audit trail, XWIN-NMR		Version 3.5
$$ ##JCAMPDX= 5.01
$$ ##ORIGIN= Bruker BioSpin GmbH
$$ ##OWNER= she
$$ F:/spectra/data/she/nmr/H-F/1/audita.txt
$$ ##AUDIT TRAIL=  $$ (NUMBER, WHEN, WHO, WHERE, WHAT)
(   1,<2021-07-01 09:38:56.96 +0400>,<she>,<DPX200>,
      <created by zg, POWCHK disabled, PULCHK disabled
       configuration hash MD5:
       00 E9 B6 7A A2 85 ED C7 34 08 36 98 17 FE 4E 26
       data hash MD5: 16K
       90 64 BD 3B EC 37 AB 84 95 C7 B0 A0 83 02 96 A0>)
$$ ##END=
$$ 
$$ hash MD5
$$ E2 08 DF 60 BE 82 C8 61 72 AC 30 55 EF E5 A1 3B
##$RELAX= 
##$RELAX= 
##$RELAX= 
##$RELAX= 
##$RELAX= 
##$RELAX= 
$$ Bruker specific parameters
$$ --------------------------
##$DU= <F:/spectra>
##$EXPNO= 1
##$NAME= <H-F>
##$PROCNO= 1
##$TYPE= <nmr>
##$USER= <she>
##$AMP= (0..31)
100 100 100 100 100 100 100 100 100 100 100 100 100 100 100 100 100 100 
100 100 100 100 100 100 100 100 100 100 100 100 100 100 
##$AQSEQ= 0
##$AQ_mod= 1
##$AUNM= <au_zg>
##$AUTOPOS= <>
##$BF1= 200.13
##$BF2= 200.13
##$BF3= 200.13
##$BF4= 200.13
##$BF5= 200.13
##$BF6= 200.13
##$BF7= 200.13
##$BF8= 200.13
##$BYTORDA= 1
##$CFDGTYP= 0
##$CFRGTYP= 5
##$CHEMSTR= <none>
##$CNST= (0..31)
1 1 145 1 1 1 1 1 1 1 1 1 1 1 1 1 1 1 1 1 1 1 1 1 1 1 1 1 1 1 1 1 
##$CPDPRG= <>
##$CPDPRG1= <>
##$CPDPRG2= <>
##$CPDPRG3= <>
##$CPDPRG4= <mlev>
##$CPDPRG5= <mlev>
##$CPDPRG6= <mlev>
##$CPDPRG7= <mlev>
##$CPDPRG8= <mlev>
##$CPDPRGB= <>
##$CPDPRGT= <>
##$D= (0..31)
0 1.2 0 0 0 0 0 0 0 0.06 0 0.03 0 0 0 0 0.0002 0 0 0 0 0 0 0 0 0 0 0 0 
0 0 0 
##$DATE= 1625117936
##$DBL= (0..7)
120 120 120 120 120 120 120 120 
##$DBP= (0..7)
150 150 150 150 150 150 150 150 
##$DBP07= 0
##$DBPNAM0= <>
##$DBPNAM1= <>
##$DBPNAM2= <>
##$DBPNAM3= <>
##$DBPNAM4= <>
##$DBPNAM5= <>
##$DBPNAM6= <>
##$DBPNAM7= <>
##$DBPOAL= (0..7)
0.5 0.5 0.5 0.5 0.5 0.5 0.5 0.5 
##$DBPOFFS= (0..7)
0 0 0 0 0 0 0 0 
##$DE= 6
##$DECBNUC= <off>
##$DECIM= 32
##$DECNUC= <off>
##$DECSTAT= 4
##$DIGMOD= 1
##$DIGTYP= 9
##$DL= (0..7)
0 120 120 120 120 120 120 120 
##$DP= (0..7)
150 150 150 150 150 150 150 150 
##$DP07= 0
##$DPNAME0= <>
##$DPNAME1= <>
##$DPNAME2= <>
##$DPNAME3= <>
##$DPNAME4= <>
##$DPNAME5= <>
##$DPNAME6= <>
##$DPNAME7= <>
##$DPOAL= (0..7)
0.5 0.5 0.5 0.5 0.5 0.5 0.5 0.5 
##$DPOFFS= (0..7)
0 0 0 0 0 0 0 0 
##$DQDMODE= 0
##$DR= 18
##$DS= 0
##$DSLIST= <SSSSSSSSSSSSSSS>
$$ [...]
##$SUBNAM2= <"">
##$SUBNAM3= <"">
##$SUBNAM4= <"">
##$SUBNAM5= <"">
##$SUBNAM6= <"">
##$SUBNAM7= <"">
##$SUBNAM8= <"">
##$SUBNAM9= <"">
##$SW= 20.0188882624521
##$SWIBOX= (0..15)
0 0 2 0 0 0 0 0 0 0 0 0 0 0 0 0 
##$SW_h= 4006.41025641026
##$TD= 16384
##$TD0= 1
##$TE= 0
##$TE2= 300
##$TE3= 300
##$TEG= 300
##$TL= (0..7)
0 120 120 120 120 120 120 120 
##$TP= (0..7)
150 150 150 150 150 150 150 150 
##$TP07= 0
##$TPNAME0= <>
##$TPNAME1= <>
##$TPNAME2= <>
##$TPNAME3= <>
##$TPNAME4= <>
##$TPNAME5= <>
##$TPNAME6= <>
##$TPNAME7= <>
##$TPOAL= (0..7)
0.5 0.5 0.5 0.5 0.5 0.5 0.5 0.5 
##$TPOFFS= (0..7)
0 0 0 0 0 0 0 0 
##$TUNHIN= 0
##$TUNHOUT= 0
##$TUNXOUT= 0
##$USERA1= <user>
##$USERA2= <user>
##$USERA3= <user>
##$USERA4= <user>
##$USERA5= <user>
##$V9= 5
##$VALIST= <valist>
##$VCLIST= <CCCCCCCCCCCCCCC>
##$VD= 0
##$VDLIST= <DDDDDDDDDDDDDDD>
##$VPLIST= <PPPPPPPPPPPPPPP>
##$VTLIST= <TTTTTTTTTTTTTTT>
##$WBST= 1024
##$WBSW= 4
##$XGAIN= (0..3)
0 0 0 0 
##$XL= 0
##$YL= 0
##$YMAX_a= 148101
##$YMIN_a= -187491
##$ZGOPTNS= <>
##$ZL1= 120
##$ZL2= 120
##$ZL3= 120
##$ZL4= 120
##$ABSF1= 10
##$ABSF2= 0
##$ABSG= 5
##$ABSL= 3
##$ALPHA= 0
##$AQORDER= 0
##$ASSFAC= 0
##$ASSFACI= 0
##$ASSFACX= 0
##$ASSWID= 0
##$AUNMP= <proc_1d>
##$AZFE= 0.1
##$AZFW= 0.1
##$BCFW= 1
##$BC_mod= 2
##$BYTORDP= 1
##$COROFFS= 0
##$CY= 11.3945322036743
##$DATMOD= 1
##$DC= 2
##$DFILT= <>
##$DTYPP= 0
##$F1P= 15.9154993809931
##$F2P= -4.1035820241983
##$FCOR= 0.5
##$FTSIZE= 0
##$FT_mod= 4
##$GAMMA= 1
##$GB= 0.15
##$INTBC= 1
##$INTSCL= 1
##$ISEN= 128
##$LB= 0.24
##$LEV0= 0
##$LPBIN= 0
##$MAXI= 10000
##$MC2= 0
##$MEAN= 0
##$ME_mod= 0
##$MI= 1.114404
##$NCOEF= 0
##$NC_proc= 0
##$NLEV= 6
##$NOISF1= 3.799351
##$NOISF2= 2.8
##$NSP= 1
##$NTH_PI= 0
##$NZP= 0
##$OFFSET= 15.70392
##$PC= 1
##$PHC0= -11915.25
##$PHC1= 12.40099
##$PH_mod= 1
##$PKNL= yes
##$PPARMOD= 0
##$PSCAL= 0
##$PSIGN= 0
##$REVERSE= no
##$SF= 200.130013532006
##$SI= 16384
##$SIGF1= 3
##$SIGF2= 2
##$SINO= 400
##$SIOLD= 16384
##$SREGLST= <1H.CDCl3>
##$SSB= 0
##$STSI= 0
##$STSR= 0
##$SW_p= 3612.71676300578
##$SYMM= 0
##$S_DEV= 0
##$TDeff= 0
##$TDoff= 0
##$TI= <>
##$TILT= no
##$TM1= 0
##$TM2= 0
##$TOPLEV= 0
##$USERP1= <user>
##$USERP2= <user>
##$USERP3= <user>
##$USERP4= <user>
##$USERP5= <user>
##$WDW= 1
##$XDIM= 8192
##$YMAX_p= 0
##$YMIN_p= 0
$$ End of Bruker specific parameters
$$ ---------------------------------
##NTUPLES= NMR FID
##VAR_NAME=  TIME,          FID/REAL,        FID/IMAG
##SYMBOL=    X,             R,               I
##VAR_TYPE=  INDEPENDENT,   DEPENDENT,       DEPENDENT
##VAR_FORM=  AFFN,          ASDF,            ASDF
##VAR_DIM=   8192,          8192,            8192
##UNITS=     SECONDS,       ARBITRARY UNITS, ARBITRARY UNITS
##FACTOR=    0.0002496,     1,               1
##FIRST=     0,             0,               0
##LAST=      2.0444736,     0,               0
##MIN=       0,             -187491,         0
##MAX=       2.0444736,     148101,          0
$$ Real data points
##PAGE= N=1
##DATA TABLE= (X++(R..R)), XYDATA
$$ [...]
1585A46O08n60l96Q86k4q87L02Q96m05p16O99K01n01j70N70l31l18M38K6j67k13
$$ 146 754 194 -202 684 660 -227 75 971 566 -150 549 750 249 79 649 318 0 438 464 297 84
1606H4%J89L42m43l49P26P4j009N62R55j182n17J541k99j197O64K09p28L72P53
$$ 84 84 273 615 172 -177 549 623 -386 176 1131 -51 -568 973 674 -523 141 350 -378 -6 747
1626G47j044oO20m47J30N39r98o8J226q16q09J460k89j543J255J262j955q4J370
$$ 747 -297 -303 317 -130 0 539 -459 -527 699 -117 -926 534 245 -1298 -43 1219 -736 -820 550
1645E50p10p29J516k95j203J144l41m33P99j32j007R62M60j424M31J322j273o85
$$ 550 -160 -889 627 332 -871 273 -68 -501 298 166 -841 121 581 -843 -412 910 -363 -1048
1663a048J805n98q78J031K29r60M04L31k81R0Ko95O45O16q37k1M74o02l09J378
$$ -1048 757 159 -719 312 541 -419 -15 316 35 125 127 -568 77 693 -144 -165 309 -293 -602 776
1683G76l44j291P78M70m16R8J50j21o97N37O78m17l64j44N7O55k87n63J36K69
$$ 776 432 -859 -81 389 -27 71 221 100 -597 -60 618 201 -163 -307 -250 405 118 -445 -309 -40
1703d0l10J60O28k72j241P62J024j064l72R44l06q09J100K51j281J63Q70m53K92
$$ -40 -350 -190 438 166 -1075 -313 711 -353 -725 219 -87 -896 204 455 -826 -663 207 -246 46
1722D6K11r46K67R94r48LR93j125o37K180o58j611J226P63j672O52J316j727K1
$$ 46 257 -689 -422 572 -376 -373 620 -505 -1142 1038 380 -1231 -5 758 -914 -262 1054 -673 -652
1741f52J264o80j19J021j112o10J912o12j326J574Q1j913J143J578k157mJ586
$$ -652 612 -68 -187 834 -278 -888 1024 412 -914 660 741 -1172 -29 1549 -608 -612 974
1758I74r52q08J734n54j100J027L2p36J181j32j529R73Q29j497N07J259j539o02
$$ 974 22 -786 948 394 -706 321 353 -383 798 666 -863 110 939 -558 -51 1208 -331 -933
1776i33K030n05j167P77L81j202L33J032r59o7M59l88K62L44n47l39P46j79m05
$$ -933 1097 592 -575 202 583 -619 -286 746 -213 -280 179 -209 53 397 -150 -489 257 78 -327
1795c27N92lr69K20J163q63o64R24R2q72M18O69n75m28P23j46k90K95K27m28J96
$$ -327 265 262 -707 -487 676 -187 -851 73 165 -707 -289 380 -195 -623 100 -46 -336 -41 186 -242 -46
1816d6O9o64O10L34j105O95O55p95n69J360r8j329Q64P81j396N03P25q33l6Q00
$$ -46 23 -641 -31 303 -802 -107 548 -247 -816 544 446 -883 -19 762 -634 -131 594 -239 -275 525
1836E25p21Q2O40p08j63J018l67q92J084L3j522J369P00j533J23J276q24n06J104
$$ 525 -196 -114 526 -182 -345 673 306 -586 498 531 -991 378 1078 -455 -332 944 120 -386 718
1855G18k40o42N31r6n57R11j72r60Q76J58j052O72Q68j387m0J156o38o89R44O4
$$ 718 478 -164 367 271 -286 625 453 -507 369 527 -525 147 1015 -372 -412 744 106 -583 361 425
1875D25q59M15M79o41K64J07o33N49J78n70K34K77l89l69R23l44p65P45K46n29
$$ 425 -434 -19 460 -181 83 190 -443 106 284 -286 -52 225 -164 -533 390 46 -719 26 272 -257
1895b57r8N62m03l4oJ96l9j06j34L80j45j33o5K57J01m39J97L88l58l98N67J56
$$ -257 -355 207 -196 -230 -236 -40 -79 -185 -319 61 -84 -217 -282 -25 76 -363 -166 222 -136 -534 33 189
1917A89o77L09M79n67j57N71J77o03J07M04K1k29p8m0L68j99l6J38J59m16k55
$$ 189 -488 -179 300 -267 -424 147 324 -279 -172 232 253 24 -54 -94 274 75 39 177 336 -80 -335
1938c35J002n03p58P04L31n15Q8K92j55m43O53j55k88Q5N2j63M09m48k27O31j73
$$ -335 667 164 -594 110 441 -74 14 306 151 -292 361 206 -82 3 55 -108 301 -147 -374 257 84
1959H4m59N61K10p26J43M81j24n72L30L40n16q8M43j73lj65J61K42k33k54L21
$$ 84 -375 186 396 -330 -187 294 170 -402 -72 268 -248 -336 107 -66 -69 -234 -73 169 -64 -318 3
1980CQ7l53n9L65n7m47K25M58n98o2L64J84l45l07M86J13l86Q6M78j19l77Q3K89
$$ 3 90 -263 -322 43 -14 -461 -236 222 -376 -438 -74 110 -235 -542 -56 57 -329 -243 235 116 -261 -178 111
2003A11j33l51L83K22l53P3J06K02n57K52L94o0l18P7K25q3l12K28L38k10l32
$$ 111 -22 -373 10 232 -121 -48 58 260 -297 -45 349 289 -29 48 273 190 -122 106 444 234 -98
2024i8M67K1m40J18K65J89n32R2L95m2l57K17K92l16k63L59P8l91J77K73l14j36
$$ -98 369 390 -50 68 333 522 -10 82 477 435 78 295 587 271 8 367 445 54 231 504 190 54
2046E4P6L11j94l32L31R3k58j58J01K17k97K8L58k12l45K13K63j74k65K60l2k77
$$ 54 130 441 247 -85 246 339 81 -77 24 241 -56 -28 330 118 -227 -14 249 75 -190 70 38 -239
2068b39j42L83O3j95k16L35J16l51l9L22k46k05L85Q8l11q6K57p0j00j94M24P8
$$ -239 -381 2 65 -130 -346 -11 105 -246 -285 37 -209 -414 -29 59 -252 -338 -81 -151 -251 -445 -21 57
2090E7n09J34M53m6o09L32M42m15l16N12J66n25J10K27J07n20L10K87k00o6Q4
$$ 57 -452 -318 135 89 -520 -188 254 -161 -477 35 201 -324 -214 13 120 -400 -90 197 -3 -69 15
2111A5K32k14k44J35M61l22k44L62p5k45J31K78r4l72K95J79l22j59L51K47l41
$$ 15 247 33 -211 -76 385 63 -181 181 106 -139 -8 270 176 -196 99 278 -44 -203 148 395 54
2132E4j05L53j83l02O4K33J8k85M6L97k32l91M13L34l19n52M06L52o49J11O99
$$ 54 -51 302 119 -183 -119 114 132 -153 -107 290 58 -333 80 414 95 -457 -51 301 -348 -237 462
2153D62m90j11J22P2k35l7n4K83o8k21J96L06l12l58M42L08o49O9N75m48k57M05
$$ 462 -28 -139 -17 55 -180 -217 -271 12 -56 -277 -81 225 -87 -445 -3 305 -344 -275 300 -148 -405 0
2175@K73p59J80L51l36K57r8J37J07k19k26L61K01n98K11N29m45l81N95J10n89
$$ 0 273 -486 -306 45 -291 -34 -132 5 112 -107 -333 28 229 -369 -158 371 -74 -455 140 250 -339
2196c39J32N13l09k32J53J07J12r5j64K68Ll14M04J50k52j32J11K38n32k2N35
$$ -339 -207 306 -3 -235 -82 25 137 42 -122 146 149 -165 239 389 137 5 116 354 -178 -200 335
2217C35j33l81L00Q7j31j22J47J48j74j13J75j6n2k15J61J17j33K4M97l88m27
$$ 335 202 -179 121 208 77 -45 102 250 76 -37 138 122 70 -145 16 133 0 24 521 133 -294
2238b94J18N46l69m37Q08j42n02K19N06n44k50M72o9p6P5k09L1J67j43q4O47m60
$$ -294 -176 370 1 -436 372 230 -272 -53 453 -91 -341 131 62 -14 61 -148 -117 50 -93 -177 470 10
2260A0p07Q19K51r48N04P53q73j93Q56l27l89K02P4j64Q1J73m04M34q9m81O27
$$ 10 -697 122 373 -575 -71 682 -191 -384 472 145 -244 -42 32 -132 -51 122 -282 152 63 -418 209
2281B09K07r32L03P12m33n47Q86o3q21O66k3j44L9J7j09K2K23m07M00K29p22K27
$$ 209 416 -516 -213 499 66 -481 405 342 -479 187 164 20 59 76 -33 -11 212 -195 205 434 -288 -61
2303f1L53k79l83L61N01p77J99M96n66j82N93r2l47J5J11J10m4j4l04L34qj85
$$ -61 292 13 -370 -9 492 -285 -86 410 -156 -338 255 163 -184 -169 -58 52 8 -6 -310 24 16 -169
2325a69K03J34n71p4Q49j86o54L17M04m55q1N54k97l96K50K67j48q0K9N1J87j15
$$ -169 34 168 -403 -477 372 186 -468 -151 253 -202 -283 271 -26 -422 -172 95 -53 -133 -104 -53 134 19
2347A9n9o9L08n43P1O79m94n52P07N9n48J64O23o37j76O76J3o05M88l0k70K75
$$ 19 -40 -109 199 -344 -273 406 -88 -640 67 126 -422 -258 365 -272 -448 228 241 -364 124 94 -176 99
2369I9k02j46N32l72k99P24O2q12L34N54n91n32J010R3o72K93O4k22R5K53k05
$$ 99 -103 -249 283 -89 -388 336 398 -414 -80 474 -117 -649 361 454 -218 75 139 -83 12 265 60
2390F0j0r8r1N91M4o05j28O33l98k21N85j04n02L11M47l63m71M37M7R0k14j0Q4
$$ 60 50 -48 -139 452 496 -109 -237 396 -2 -223 362 258 -244 67 514 151 -320 117 164 254 40 30 114
2413A14j83R3n0M02p41O0P06J4o02q4N20k29m10O29J62o55qK68O1j59j23L25n3
$$ 114 -69 24 -26 376 -365 -305 401 415 -187 -271 249 20 -390 239 401 -254 -262 6 67 -92 -215 110 57
2436E7l7Q4k69J54k90M1L30j31l82L69N10m95k71M79L9m43K47L97m99n3L13j14
$$ 57 20 104 -165 -11 -301 -260 70 -61 -443 -74 436 -59 -330 149 188 -255 -8 389 -110 -163 150 36
2458C6K6oj57L9J77k22J23K73o71j4P31O0p32J47N03l36k83P68q2o31K78J67j9
$$ 36 62 56 -101 -62 115 -107 16 289 -382 -396 335 395 -337 -190 313 -23 -306 462 380 -251 27 194 175
2481A75j52l0K32p6q7k30N98k8m73k1O51o65j28M82k2l24j06M46j47k42K87n9
$$ 175 23 -7 225 149 62 -168 430 402 -71 -92 559 -106 -234 248 226 -98 -204 242 95 -147 140 81
2503H1k11J5K11L1j70m10L82L89n18j7M79p3l99J09K33r9l88K72L34m02j45L84
$$ 81 -130 -115 96 127 -43 -453 -71 318 -200 -217 262 189 -210 -101 132 33 -355 -83 251 -151 -296 88
2525H8J0q6k85K88ok89J23K68J3k85J73N0q1l30L18J60m44J99K39M0l56Q0M21
$$ 88 98 12 -273 15 9 -280 -157 111 124 -161 12 62 -19 -349 -31 129 -315 -116 123 163 -193 -113 308
2548C08m23j29K45J42k06KJ22J54m07J12K73K0k15j15M07q4m12J77L99m43j33
$$ 308 -115 -244 1 143 -63 -61 61 215 -192 -80 193 213 -2 -117 290 206 -206 -29 370 -73 -206
2569b06K67K17l22j61M74n4n09M43J37k69j25J9J98P5n81M84J47k98P2M5K10j94
$$ -206 61 278 -44 -205 269 215 -294 149 286 17 -108 -89 109 184 -397 87 234 -64 8 53 263 69
2591F9k98M47j31k43J7L4J76l53L24P2p2k01l2K44l91O1M09L2j42m07P21l57l32
$$ 69 -229 218 87 -156 -139 -105 71 -282 42 114 42 -159 -191 53 -338 -277 132 164 22 -385 336 -21 -353
2614c53L07K6Ok08K60J32k92k36L21M7j07n1K63p3k70M2M34j32l19L08Mk28j6
$$ -353 -46 -20 -14 -222 38 170 -122 -358 -37 10 -97 -148 115 42 -228 -186 248 116 -203 105 109 -119 -135
2637a35K68J61m75J72K28j77p6Q3J85l21j6K85J59l07k88L13J54j15l12N20N3
$$ -135 133 294 -181 -9 219 42 -34 49 234 -87 -103 182 341 34 -254 59 213 98 -214 306 359
2658C59o10L64K89j40k54K03M9j75j46L25kk27j83L98N3l11J14K74j06l95K20
$$ 359 -251 113 402 262 8 211 260 85 -61 264 262 35 -148 250 303 -8 106 380 274 -121 99
2679I9M36n18k39L79L0l91k8M32j42k07LL49l15k42K65Q9L0j33Q7J16k90k64M32
$$ 99 535 17 -222 157 187 -204 -232 200 58 -149 -146 203 -112 -354 -89 0 30 -103 -16 100 -190 -454 -22
2702b2J97n02J58J93j18m2R7L5j53l19L28K41k25j79J93L6l4k20N38j87k81K10
$$ -22 175 -327 -169 24 -94 -136 -39 -4 -157 -476 -148 93 -132 -311 -118 -82 -116 -336 202 15 -266 -56
2724e6Q1k51l4L34Q4l18p3N29k58j78L1J27K2p7r9L66k31j17J42J65k21J6J51
$$ -56 25 -226 -260 74 158 -160 -233 296 38 -140 -109 18 40 -37 -136 230 -1 -118 24 189 -32 -16 135
2747A35J40l15j11M08k8k27J49j0p4j12P1J87l66J71L19K9m10N1O1J61j88j42
$$ 135 275 -40 -151 257 229 2 151 141 67 -45 26 213 -153 18 337 366 -44 7 68 229 41 -101
2769a01L34K3m20K87O8k00q8J84L2M3m3J23j46k27J2K81m2l25P0L94k49j95J92
$$ -101 233 256 -164 123 191 -9 -97 87 119 162 119 242 96 -131 -119 162 120 -205 -135 259 10 -185 7
2792GK74m98O0L42Oo61N02K02k54j51J30L5o9m3R5K38k59pn6J32j00j69M06j43
$$ 7 281 -217 -157 185 191 -470 32 234 -20 -171 -41 -6 -75 -118 -23 215 -44 -51 -107 25 -75 -244 162 19
2816A9m06J50M75m02o6M09K9m31J63M6Q6j8r3j0J84n01J76N19j48m48K00K64j38
$$ 19 -387 -237 238 -164 -230 179 208 -223 -60 -14 72 54 -39 -49 135 -366 -190 329 181 -267 -67 197 59
2839E9r5M04j50n57J87M38j04j84P9j47O7J4Q9J27k88j18L50o3N1m08J25K63m43
$$ 59 -36 368 218 -339 -152 286 182 -2 77 -70 -3 11 100 227 -61 -179 171 108 159 -249 -124 139 -304
2862c04J81L79j49k51Q0K43j80j90L53j88R8k83L04q0j60m6K12K0j18q6K77j32
$$ -304 -123 256 107 -144 -64 179 -1 -191 162 -26 72 -211 93 13 -147 -193 19 39 -79 -165 112 -20
2884b0m62N08K89m76j73M62j27k57K70R5j82m3Q8K26j89j76k5L05J71n62K45K73
$$ -20 -482 26 315 -161 -334 128 1 -256 14 109 -73 -116 -28 198 9 -167 -192 113 284 -278 -33 240
2906B40m12K21K85j73o29L23L26q9j81J72Q2m31M10J0k4m5j81R4K83k90p7K04
$$ 240 -172 49 334 161 -468 -145 181 92 -89 83 165 -266 144 154 130 85 -96 -2 281 -9 -86 118
2928A18J6j90K35R0l30l05N57P5k91r7K30j25l5J93k6j0k56J5N12k88m17L00L03
$$ 118 134 -56 179 269 -61 -366 191 266 -25 -122 108 -17 -52 141 115 105 -151 -136 376 88 -329 -29 274
2951B74l70j23M37k1m02P9R6j40r7J61L49j50j07l1R2j23j01J47L19l75j06J67
$$ 274 -96 -219 218 197 -205 -126 -30 -170 -267 -106 243 93 -14 -45 47 -76 -177 -30 289 -86 -192 -25
2973b5J10k16L7J37j05m21M99J1k68n7L59M0k90J73J48j95j16P4J62Q5m28Q9K41
$$ -25 85 -131 -94 43 -62 -483 16 27 -241 -298 61 101 -189 -16 132 -63 -179 -105 57 142 -286 -197 44
2996D4L1j56J41J35j86j94L75j2l46J60J01p8q3J99j1k79qJ54J55j22k1J35R1
$$ 44 75 -81 60 195 9 -185 190 178 -168 -8 93 15 -68 131 120 -159 -167 -13 142 20 -1 134 225
3019B25j36o6K44j16m14L16J84j40k76K35K50m74K94NQk45J90J12j1m25K82J93
$$ 225 89 23 267 151 -263 53 237 97 -179 56 306 -168 126 131 139 -106 84 196 185 -240 42 235
3041B35j04k41N4L03m01k9L26m2o2r1J34J49l57J5K13o5j50J55R7j99r7OL61k94
$$ 235 131 -110 -56 247 -154 -183 143 101 39 -52 82 231 -126 -111 102 37 -113 42 139 -60 -157 -151 210 -84
3065h4n9K58q9j22j7R1J41m72K64J4N5k13R2R9Lm9M1l9m7r9K93m6k01Q0L07p4
$$ -84 -143 115 26 -96 -113 -22 119 -353 -89 -75 -20 -233 -141 -42 -39 -88 -47 -86 -133 -232 61 15 -186 -106 201 127
3091A27l85L17R9k69o8N8K84k28L8K41k46k1J48J47k53j65J84Q4p4j08L53j91
$$ 127 -258 59 158 -111 -179 -121 163 -65 -27 214 -32 -53 95 242 -11 -176 8 92 18 -90 263 72
3113G2j06O2N4L8j39N5M1k9j32K06P1j47n0Q3K3k91o6K00J60j06m2K83n5l73K45
$$ 72 -34 28 82 120 -19 36 77 48 -84 122 193 46 -4 79 102 -189 -255 -55 105 -1 -43 240 185 -188 57
3138E7K79l24k30M46p8k49m0L85j77k25m2M14k31n6lJ36J9k85J28K18j89j37J54
$$ 57 336 12 -218 228 150 -99 -139 246 69 -156 -198 216 -15 -71 -74 62 81 -204 -76 142 -47 -184 -30
3161c0Q6q4j71L73k26k42J24J48R1k03J07J45k68p3M42j85j17O9j07O6j99J63
$$ -30 56 -28 -199 174 -52 -294 -170 -22 69 -134 -27 118 -150 -223 219 34 -83 -14 -121 -55 -254 -91
3183i1K76j47j97K20K71m98r5M10n2j24k4J23N5p8q2J41m2k62L57K03l35j03J54
$$ -91 185 38 -159 61 332 -166 -261 149 97 -27 -51 72 127 49 -33 108 66 -196 161 364 29 -74 80
3206H0J68l63K4K57N0n23L47J0q9r1J35K05j82k31L48M7l12J65J24j67k9n3K67
$$ 80 248 -115 -91 166 216 -307 40 50 -39 -130 5 210 28 -203 145 192 -120 45 169 2 -27 -80 187
3229A87j44j9N2R8j19j21J87J50k80m4R7J17k19j9K42j01j63Q5K77l28n6k2L55
$$ 187 43 24 76 174 55 -66 121 271 -9 -53 44 161 -58 -77 165 64 -99 -14 263 -65 -121 -143 212
3252B12k56Q5J41r4k29K01JK9k91l1M75k15j24J03K14k70k7J00J0k4l4P1%j94
$$ 212 -44 41 182 88 -141 60 61 90 -201 -232 243 28 -96 7 221 -49 -76 24 34 10 -24 47 47 -147
3276a47P8K61q6r1R1L3p4j47K18Mk43L1K4P5Op8K14n4j10M6J30l38n7J75K12q8
$$ -147 -69 192 106 15 106 139 65 -82 136 140 -103 -72 -48 27 33 -45 169 115 5 51 181 -157 -214 -39 173 85
3302H5k43J80k8k3o0J68q2l83K79J55j63r6K44J46l86J74j23J07l4m8J15j0k03
$$ 85 -158 22 -6 -29 -89 79 -3 -386 -107 48 -115 -211 33 179 -207 -33 -156 -49 -83 -131 -16 -26 -229
3325b29J49R8q9j22kP7K8j07K19j16j18K64J5j16n8J06K40k32k93J78M34m91j6
$$ -229 -80 18 -71 -193 -195 -118 -90 -197 22 -94 -212 52 67 -49 -107 -1 239 7 -286 -108 326 -165 -181
3348a81J17K99j86p0J4R7p9k1J80j70p2P6R9n0j61J73O7l12J64K33Nk08J36J71
$$ -181 -64 235 49 -21 -7 90 11 -10 170 0 -72 4 103 53 -108 65 132 -180 -16 217 222 14 150 321
3372C21k76j84K59M0r3m9J78J4k34M4J01Q9k04M0J12P2m06K36J3p2j07J27J44
$$ 321 45 -139 120 160 67 18 196 210 -24 20 121 210 6 46 158 230 -176 60 73 1 -106 21 165
3395A65O7l75J99L0j68O2J75j15j82J60K38l37K8o8j5J86k39L06l3l60J23K17
$$ 165 232 -143 56 86 -82 -20 155 40 -142 18 256 -81 -53 -121 -136 50 -189 117 84 -276 -153 64
3417F4k7k24J02K91j03m11J92J65k27J00j26J36j10m6L02J9k24K7J56J19m13J45
$$ 64 37 -187 -85 206 103 -308 -116 49 -178 -78 -204 -68 -178 -224 78 97 -127 -100 56 175 -238 -93
3439i3K40j48j68J31k2p3J1J03J53k32KM31k97k20J32J57k10JN3J78n6j72K16
$$ -93 147 -1 -169 -38 -60 -133 -122 -19 134 -98 -96 335 38 -182 -50 107 -103 -102 -49 129 73 -99 117
3462A17N5k66j35M66j07l24M01K32l36k7J24j75j49J08J50J91k62r5L62j64k43
$$ 117 172 -94 -229 237 130 -194 207 439 103 76 200 25 -124 -16 134 325 63 -32 330 166 -77
3483g7J11K68k36k60L42O4l13K4K06kk50P2J28k96oK97kk3m55L29J85j13j80J55
$$ -77 34 302 66 -194 148 212 -101 -77 129 127 -123 -51 77 -219 -225 72 70 47 -408 -79 106 -7 -187 -32
3507c2P3k01o9L49q1k24K36j2r0p0o8K23j75k5J46J01j59j05K82q5k36O4K15j8
$$ -32 41 -160 -229 120 39 -185 51 39 -51 -121 -189 34 -141 -166 -20 81 -78 -183 99 14 -222 -158 57 39
3531C9j47M7K62k98j36J23L59l30j33J30K42l08K65m0j69nJ31P6j38l02M17J50
$$ 39 -108 -61 201 -97 -233 -110 249 -81 -214 -84 158 -150 115 75 -94 -99 32 108 -30 -332 85 235
3553B35k11j92M5K76j96j1K81k12j31J90N1p5l22L47K07p7k04J41n2rr6L21k09
$$ 235 24 -168 -123 153 -43 -54 227 15 -116 74 125 50 -272 75 282 205 1 142 90 81 -15 306 97
3576I7j56k0K89K8j43p5J69k63J22Q2j75l6j06L19j40Ol45L81j45j33K77k0j12
$$ 97 -59 -79 210 238 95 20 189 -74 48 130 -45 -81 -187 132 -8 -2 -347 34 -111 -244 33 13 -99
3599i9k7J58J82m03L5J12J84k85N7L36k56ol0O8l6j38K33J9k21K4K29j86j60J25
$$ -99 -126 32 214 -189 -154 -42 142 -143 -86 250 -6 -12 -42 26 -10 -148 85 104 -117 -93 136 -50 -210 -85
3623h5J69N9k91J40Mj4k11K91J74l48J86Q5J46j88j95K58p3k99J02K36p7p6R6
$$ -85 84 143 -148 -8 -4 -18 -229 62 236 -112 74 159 305 117 -78 180 107 -192 -90 146 69 -7 89
3646H9M5k77J06K45n9l57P2K56J78m04L29j15l2mnJ33m8k21L60j03k47J9J54J08
$$ 89 134 -143 -37 208 149 -208 -136 120 298 -106 223 108 76 72 67 200 152 -69 291 188 -59 -40 114 222
3670B22l72J97n2j4j18K57R7j85j77J47J38j10j72J71M2k31M0j4J02j13J41R2
$$ 222 -150 47 -5 -19 -137 120 217 32 -145 2 140 30 -142 29 71 -160 -120 -134 -32 -145 -4 88
3692H8j99o4J76p0m1K1J31m1k50K68J64j77j11n2K03R9l29K50Mj20k95K03L81
$$ 88 -111 -175 1 -69 -110 -89 42 1 -249 19 183 6 -105 -157 46 145 -184 66 70 -50 -345 -142 239
3715B39j79j88L48k16k4J12p1Q7k34K83L5n9k86K03J16k13J18k5Qj39K1K23j53
$$ 239 60 -128 220 4 -20 92 21 108 -126 157 192 133 -153 50 166 -47 71 46 54 -85 -64 159 6
3738Fj04J05m4J86k33JK80k77M6K24l5k61J47R9j38O9j30J23O1j11L8J00l22K0
$$ 6 -98 7 -37 149 -84 -83 197 -80 -34 190 155 -106 41 140 2 71 -59 64 125 14 52 152 -170 -150
3762a50M24k93j37J16J09P4k62jJ94Oj11P9J38l25J63R1J18m50M6K92p5j14P1
$$ -150 274 -19 -156 -40 69 143 -119 -120 74 80 -31 48 186 -139 24 115 233 -217 -171 121 46 -68 3
3785CM2Q5m02K39Pj30M6J80j8k17K26j5k9k76K05J33l4j27J55J73k28j57K30J9
$$ 3 45 130 -272 -33 -26 -156 -110 70 52 -165 61 46 17 -259 -54 79 45 -82 73 246 18 -139 91 110
3809A10l21J97K7q1o9J98K39k70Rm8J10j74j40K79j6m8j60K80m0j02O4J6mj58
$$ 110 -211 -14 13 -68 -137 61 300 30 39 -9 101 -73 -213 66 50 2 -158 122 82 -20 44 60 56 -102
3833a02N2K68k14L3jJ81k94P4R6Lk28L5K54j06k27K89J30r1j26r5K60k44K8j27
$$ -102 -50 218 4 37 36 217 -77 -3 93 96 -132 -97 157 51 -176 113 243 152 26 -69 191 -53 -25 -152
3857a52K35k09o9K40l3q2j02K74jm12K51J11r7m1J56Q9k32QJ67j25o8J1L64m65
$$ -152 83 -126 -195 45 12 -70 -172 102 101 -311 -60 51 -46 -87 69 158 -74 -66 101 -24 -92 -81 283 -182
3881a82j01K95Jj4j34J17J76l56kK11j35o1K20r2P6j51L5K8J89k88K94O5r9k18
$$ -182 -283 12 13 -1 -135 -18 158 -198 -200 11 -124 -185 35 -57 19 -132 -97 -69 120 -168 126 191 92 -126
3905a26R8L7j7k4K56j69l08L51k8L3j29J12N1L9j96J62q2r3R3J82m00P8J3J65
$$ -126 -28 9 -8 -32 224 55 -253 98 70 103 -26 86 137 176 -20 142 60 -33 60 242 -158 -80 -67 98
3929I8J44l42O4J33r3o8o7J99l6J8N8j25J8K9J87j16m1J4K47l94Q6J45j8k76p
$$ 98 242 -100 -36 97 4 -64 -131 68 32 50 108 -17 1 30 217 101 60 74 321 -73 13 158 140 -136 -143
3954a43L24k59P9j68K06M9k98J57l3m1PJ22J44j53j19K64p1j27j60M40k68k57
$$ -143 181 -78 1 -167 39 88 -210 -53 -86 -127 -120 2 146 -7 -126 138 67 -60 -220 220 -48 -305
3976c05O7K70j64j68M04N9k32k3RM2r4Q4J34l9l43J18K99k99J27N8J46n0k08J95
$$ -305 -238 32 -132 -300 104 163 -69 -92 -83 -41 -135 -51 83 44 -299 -181 118 -181 -54 4 150 100 -108 87
4000H7jj91O0K96j38j73J33n2J8N9J0r0j27J28p6J69n9j01L46j61j91J24J15j50
$$ 87 86 -105 -45 251 113 -60 73 21 39 98 108 18 -109 19 -57 112 53 -48 298 137 -54 70 185 35
4024C5j52J09K2P6L0k9Rk03M9K2J51j80j1J34j58RM4K04l89K19N1R8k55O6LJ70
$$ 35 -117 -8 14 90 120 91 100 -103 -54 -32 119 -61 -72 62 -96 -87 -43 161 -228 -9 42 140 -115 -49 -46 124
4050A24k91J40K2j18J34K9P9j46n5P6O5k31M4lP6O8j03K35j52k62J30L26j69k17
$$ 124 -167 -27 -5 -123 11 40 119 -27 -82 -6 59 -172 -128 -131 -55 13 -90 145 -7 -269 -139 187 18 -199
4074a99K73k54J11j6J58O2k36P9J7J18l9j85K5N5m0J66P9j45m7K03o5k14K09Q5
$$ -199 74 -180 -69 -85 73 135 -101 -22 -5 113 74 -111 -86 -31 -71 95 174 29 -18 185 120 -94 115 200
4098B00j92M4K0K3j47p4K64M7j87J5j60L78k03k9J2j30N0K7R7j77Q4L3N0j01Q
$$ 200 8 52 72 95 -52 -126 138 185 -2 13 -147 231 28 -1 11 -119 -69 -42 55 -122 -38 -5 45 -56 -48
4123d8R6o2M5k67K34J14l11N5N1M4M0qO2L4k28J68j15k5j38K54J99m56J81K05
$$ -48 48 -14 31 -236 -2 112 -199 -144 -93 -49 -9 -17 45 79 -149 19 -96 -121 -259 -5 194 -262 -81 124
4147A24j65l9J72P9j76K4j40J64r3J5J03j25k0j77K04n7k9R5J10j32P7j21L56
$$ 124 -41 -80 92 171 -5 19 -121 43 -50 -35 68 -57 -77 -254 -50 -107 -136 -41 69 -63 14 -107 249
4170B49k91k40K75R6j89K57l2j0k31P5J79r6j45J79J44j75n1l0K69k67j01K78
$$ 249 -42 -282 -7 89 -100 157 125 115 -116 -41 138 42 -103 76 220 45 -6 -36 233 -34 -135 143
4192A43p5j23o3L05r3j41J7P9Jj77J02K57k72J4J38J5j40n3L01j50k11J59N5j08
$$ 143 68 -55 -118 187 94 -47 -30 49 50 -127 -25 232 -40 -26 112 127 -13 -66 235 85 -126 33 88 -20
4216b0%R4n2k33N5K46j2n2o3J62j30N1j11K58k04K3k59M23m41J35J46K1j57k3
$$ -20 -20 74 22 -211 -156 90 78 26 -37 125 -5 46 -65 193 -11 12 -247 176 -265 -130 16 37 -120 -143
4240a43R4M3j69K01m0p1K2J7K81k84J66L2k78RJ07j0P8k9k9Mj37Kj9K69rn5J1
$$ -143 -49 -6 -175 26 -14 -85 -63 -46 235 -49 117 149 -129 -120 -13 -23 55 26 -3 1 -136 -134 -153 116 107 52 63
4267F3nj26P5P6k9k87J48J45K6m0n8J09j69N9k2L6L1m3O5j23k22K95J07j51M5
$$ 63 58 -68 7 83 54 -233 -85 60 86 46 -12 97 -72 -13 -35 1 32 -11 54 -69 -291 4 111 -40 5
4292Em9J69n9k25K30M8j58j76L15j03j54O2J69l1j12K9O9M9j75M2o1mq0K55Jr3
$$ 5 -44 125 66 -159 71 119 -39 -215 100 -3 -157 -95 74 43 -69 -40 29 78 -97 -55 -116 -120 -200 55 56 -37
4318c7r6K59l22j05J95N9J47k04K6Q4j67p7L94p5k1j85K20j84J48m9J10l23J52
$$ -37 -133 126 -196 -301 -106 -47 100 -104 -78 6 -161 -238 156 81 60 -125 95 -89 59 10 120 -203 -51
4341e1M3J01r9l0J97j67J69k95M6P5K1p4J27m3Nj06J52j91j8J09K62l52R6q5J82
$$ -51 -8 93 -6 -36 161 -6 163 -132 -86 -11 10 -64 63 20 25 -81 71 -120 -138 -29 233 -119 -23 -108 74
4366G4j0r5J33K6j36Pm2N6R3nj10J39j6l1pj53k1J82l4Lo6J05rk97K96L2m6j41
$$ 74 64 -31 102 128 -8 -1 -43 13 106 101 -9 130 114 83 76 -77 -98 84 50 53 -13 92 83 -214 82 114 68 -73
4394g3J82L8k92l9K48J00j85n5N2k0j77K82j52j4j63K10K1O1j67J24ok23J20K43
$$ -73 109 147 -145 -184 64 164 -21 -76 -24 -44 -221 61 -91 -105 -268 -58 -37 24 -143 -19 -25 -248 -128 115
4418A15l0k43J42N7p6k06K36j04q6J56M7J40k89j79L75j02j66J60P2n7J4j92J59
$$ 115 85 -158 -16 41 -35 -241 -5 -109 -195 -39 8 148 -141 -320 55 -47 -213 -53 19 -38 -24 -216 -57
4441e7n3M9K62l32J39j39Q0N5r7J77R6j35n7P2J42k25j12K22l7Lk34P1J99j81
$$ -57 -110 -61 201 -131 8 -131 -51 4 -93 84 180 45 -12 60 202 -23 -135 87 50 53 -181 -110 89 -92
4465i2P7K49j35pj6J78k39n1K58j70q9R2N5j6j36mJ85j15n1K21k78J62o7P3q7
$$ -92 -15 234 99 92 76 254 15 -36 222 52 -37 55 110 94 -42 -46 139 24 -27 194 -84 78 11 84 -3
4490cj0k8J54j40p5K08j0m9j95jK6J37r8L33l68J31j29J89j37m0l0J44K3k79K01
$$ -3 -13 -41 113 -27 -102 106 96 47 -148 -149 -123 14 -84 249 -119 12 -117 72 -65 -105 -135 9 32 -247 -46
4515d6j8r7J11m4J30j44K95k24J29k07OL82j90k18Q2j3j2L7R8K0j12n0R4J63j40
$$ -46 -64 -161 -50 -94 36 -108 187 -37 92 -115 -109 273 83 -135 -53 -66 -78 -41 57 77 -35 -85 9 172 32
4540C2j09Q4J21k76J09J09j89N9M5P0j8Lj27J21M0k88K45R4k84J56K40j31k22
$$ 32 -77 7 128 -148 -39 70 -119 -60 -15 55 37 40 -87 34 74 -214 31 125 -159 -3 237 106 -116
4563a16J83Oj57P9J00j44j59L52j70r6K21p4J49J3l16K3J95j40%L6m2M7p2P7j17
$$ -116 67 73 -84 -5 95 -49 -208 144 -26 -122 99 25 174 187 -129 -106 89 -51 -51 -15 -57 -10 -82 -5 -122
4588a22J8r6J36%k4O0o4J7j83J00M53m11nK16p1j94M8K38k70J05K4J79j64k5r
$$ -122 -104 -200 -64 -64 -88 -28 -92 -75 -258 -158 295 -116 -121 95 24 -170 -122 116 -154 -49 -25 154 -10 -35 -44
4613d4P2j23O6l5L6J9o1K9J64n9r0J08L7j76n8P7J14J04j39l1J10%j32o5j22J15
$$ -44 28 -95 -29 -64 -28 -9 -70 -41 123 64 -26 82 119 -57 -115 -38 76 180 41 10 120 120 -12 -77 -199 -84
4639h4J56Pq9K0K03k48o7N9K31j82J35n2j2j88J93k7l0j15J47K6j10Q9K58k20
$$ -84 72 79 -10 10 213 -35 -102 -43 188 6 141 89 77 -111 82 55 25 -90 57 83 -27 62 320 100
4663A00l2l5k4P8j56j19J29M7p0N5R3j22r3K74j42K9KJ8O1r8j16K04o4R4j42m3
$$ 100 68 33 9 87 -69 -188 -59 -12 -82 -27 66 -56 -149 125 -17 12 14 32 93 -5 -121 83 19 113 -29 -72
4689g2J02k35J36K84l91L8K70k11kj01K71j31L6L7J98k56QM8l0O1j16O0Q7Lr9
$$ -72 30 -205 -69 215 -176 -138 132 -79 -81 -182 89 -42 -6 31 229 -27 -19 29 -1 60 -56 4 91 94 -5
4714eM8M7r2oK58k05j12J48QN1o5N4k4k54N6J84Oj62Q3K02j68M8j82Q8O3n4M9
$$ -5 43 90 -2 -8 250 45 -67 81 89 140 75 129 105 -149 -93 91 97 -65 18 220 52 100 -82 6 69 15 64
4741F4J67j52p7n4M6k07QL26q5j27k1K55k81Q8q0K06J1j18J13l7o6L9j8ro8n8
$$ 64 231 79 2 -52 -6 -213 -205 121 36 -91 -112 143 -138 -50 -130 76 87 -31 82 45 -21 18 0 -9 -77 -135
4767a35K57r3j24P5K02l76J53K21k48m1O1oLp4J33j02J49j56q0L22k21Q7n1J62
$$ -135 122 29 -95 -20 182 -194 -41 180 -68 -109 -48 -54 -51 -125 8 -94 55 -101 -181 141 -80 7 -44 118
4791A18j31n4j82L16o5L2M5Nk19L39L7m4l66J96N2L0q4j1J87k41L0N9J50j78r2
$$ 118 -13 -67 -249 67 2 34 79 84 -135 204 241 197 -169 27 79 109 25 14 201 -40 -10 49 199 21 -71
4816g1K78k28L9q8K15j37L2J76j30j25k1J51J1n3k00J79K15k58j10J96J6m3pK4
$$ -71 207 -21 18 -70 145 8 40 216 86 -39 -60 91 102 49 -151 28 243 -15 -125 71 87 44 37 61
4840F1k13J02J88k03J74r7L1J03k93J22O4j80L2J57j5p0K31j37k1k46P1L28j43
$$ 61 -152 -50 138 -65 109 12 43 146 -147 -25 39 -141 -109 48 33 -37 194 57 36 -210 -139 189 46
4863D6k45J65Rj41K20m3j2k10K26j13J47k07J90K6K0r4j68J16R8L8o9kN7j97K58
$$ 46 -199 -34 -25 -166 54 11 -1 -211 15 -98 49 -158 32 58 78 -16 -184 -68 30 68 -1 -3 54 -143 115
4888A15K4j24J04o2J12p8j07J53j38j17L02j10j56M3K37j9K7k40J13J51j78m6
$$ 115 139 15 119 57 169 91 -16 137 -1 -118 184 74 -82 -39 198 179 206 -34 79 230 52 6
4910FL3n3j33K27l4n8k6J32j15Q8j70K68j47k4J89l1j77j06K00j3j44j13K34O8
$$ 6 39 -14 -147 80 46 -12 -38 94 -21 67 -103 165 18 -6 183 152 -25 -131 69 56 -88 -201 33 101
4934A01q8o7J82j10Mj01J52j45J05q8N3J6l8o3J13l5q0Q6qj29J10k5j35K1P1M3
$$ 101 13 -54 128 18 22 -79 73 -72 33 -55 -2 14 -24 -87 26 -9 -89 -3 -11 -140 -30 -55 -190 -169 -98 -55
4960e5jJ24Jo1r9l3J42N3k37K3J65p5r9Q8J37r5QK9N7q6J4K06k70O9J57j19J71
$$ -55 -56 68 69 8 -91 -124 18 71 -166 -143 22 -53 -152 -64 73 -22 -14 15 72 -14 0 206 -64 5 162 43 214
4987B14j03P8j73J9j94J75P2k9j31K79j85Rj01J52J41j62q5K66j54nr0K2J06j32
$$ 214 111 189 16 35 -159 16 88 59 -72 207 22 31 -70 82 223 61 -24 242 88 83 -7 15 121 -11
5011a1L8n3J6j2K19j94q8O8K09j09k8o4j25M8J56j39l5K2p9L52j58q7j06K01j5
$$ -11 27 -26 -10 -22 197 3 -85 -17 192 83 55 -9 -134 -86 70 -69 -104 -82 -161 191 33 -54 -160 41 26
5036B6o0K5O7P3p8NQ9m3j85L8J05j60J20kj1MJno3J83j29N7j70l5K94k3k33O6
$$ 26 -34 -9 58 131 53 58 147 104 -81 -43 62 -98 22 20 9 13 14 9 -54 129 0 57 -113 -148 146 123 -110 -44
5064d4p9K69N9j43R3n6r9n9K63k22J04p2J2p0M4jKK1R2m5o9N9j05J51LK5j21L9
$$ -44 -123 146 205 62 155 99 0 -59 204 -18 86 14 26 -44 0 -1 1 22 114 69 0 59 -46 105 108 133 12 51
5092E1q7J8MK08q3n6J11j95J01%k09J30Kn4K89j45r1n7J03%j99L55j00m09K38
$$ 51 -36 -18 -14 194 111 55 166 -29 72 72 -137 -7 -5 -59 230 85 -6 -63 40 40 -159 196 96 -313 -75
5117g5J70k72RK46m0q4n6O8j6o2K07k22J71q7J25j48M2j7J28j21%r9J86j78K33
$$ -75 95 -177 -168 78 38 -46 -102 -34 -50 -112 95 -127 44 -43 82 -66 -24 -41 87 -34 -34 -133 53 -125 108
5142A08k62J23j3j00K5J36J37k78j5K32j12J00m3K6k57P1J86K22k88O9l5Rj69
$$ 108 -154 -31 -44 -144 -119 17 154 -124 -139 93 -19 81 38 64 -193 -122 64 286 -2 67 32 41 -128
5165a28K61j24Kl2Q1Or6J67j09K00j51j31J09k4p9J38L4j06M8J26k09r2J04K04
$$ -128 133 9 11 -21 60 66 -30 137 28 228 77 -54 55 31 -48 90 124 18 66 192 -17 -109 -5 199
5189A99j09o8p1oM2P3N2n2n9J26l40J19K03j47p3K21r8j09P8P2j53J23m0q4RJ23
$$ 199 90 22 -49 -55 -13 60 112 60 1 127 -213 -94 109 -38 -111 110 12 -97 -19 53 -100 23 -17 -101 -92 31
5215C1M5j46j59L04j81P0l4O1J26J2l71K56n5j07Q2Q1j99J18J21J9N3n9Q7j70
$$ 31 76 -70 -229 75 -106 -36 -70 -9 117 129 -242 14 -41 -148 -66 15 -184 -66 55 74 127 68 155 -15
5239a5q7Q7M4n2N6j3P2j05j75K62P0j29j2J08l3j04K1k6L1J8J26l7j19l2J85K3
$$ -15 -102 -15 29 -23 33 20 92 -13 -188 74 144 15 3 111 78 -26 -5 -31 0 18 144 107 -12 -44 141 164
5265A64j58p3q7L00j17p3J96j04k6j19K27r4m0J4p7L4P7M3K4j64lQ3j15J95j80
$$ 164 6 -67 -154 146 29 -44 152 48 22 -97 130 36 -4 10 -67 -33 44 87 111 -53 -56 27 -88 107 -73
5290g3J36K8j48k3K29k20j81J59P7n1l8J44j16j20J0K85j67K2M9Oj39R0NM7O1
$$ -73 63 91 -57 -80 149 -71 -252 -93 -16 -67 -105 39 -77 -197 -187 98 -69 -47 2 8 -131 -41 -36 11 72
5315G2k27J12P7j9pJ38k44o7J60J19n0j33K71j37j20L1K3p6P6R3l2J34l58J24
$$ 72 -155 -43 34 15 8 146 -98 -165 -5 114 64 -69 202 65 -55 -24 -1 -77 -1 92 60 194 -164 -40
5339d0R1N5n3J56M2l06j1L5M1Rq3J00L7j21M4J61j10k2J04M1j12k01L9K51k36
$$ -40 51 106 53 209 251 -55 -66 -31 10 19 -64 36 73 -48 -4 157 47 25 129 170 58 -143 -104 147 -89
5364h9pJ16j5M1K0j32J96j31J9M2J5j15l1J61o3KnN8j67j9J28R7j63R4j9j44j24
$$ -89 -96 20 5 46 66 -66 130 -1 18 60 75 -40 -71 90 27 29 24 82 -85 -104 24 121 -42 52 33 -111 -235
5391b35M06k06K7k7m5J58j38L6n1L02l35L6m4R8p6O4p4L3J31j98mP5L0N4j24K62
$$ -235 171 -35 -8 -35 -80 78 -60 -24 -75 227 -108 -72 -116 -18 -94 -30 -104 -71 60 -138 -142 -67 -37 17 -107 155
5417A55r9j36J85k30K74m4k4o7j0O6j08Q6j3J15j98L4J9o1R4p1N9m1j38K31l1
$$ 155 56 -80 105 -125 149 105 81 14 4 70 -38 48 35 150 -48 -14 5 -56 38 -33 26 -15 -153 78 47
5442D7m6J32nj03j87P5J06n3J60L3r3q9j97L39L5k72O9O0q3j4p8K06m5M3L1l9
$$ 47 1 133 128 25 -162 -87 19 -34 126 159 66 -23 -220 119 154 -118 -49 11 -72 -86 -164 42 -3 40 71 32
5468C2q3j28J76%J2o0Q8O2k18m0K57j08j1j25K95k58J02o5J8o8lJ8J63o3j36J93
$$ 32 -51 -179 -3 -3 9 -51 37 99 -119 -159 98 -10 -21 -146 149 -109 -7 -72 -54 -122 -125 -107 56 -7 -143 50
5494E0J07k78L1P6P5p6K9R2n5Kl4k3oj51L14k32M4K23m5j47j19K31j60J2LK78
$$ 50 157 -121 -90 -14 61 -15 14 106 51 53 19 -4 -10 -161 153 -79 -35 188 143 -4 -123 108 -52 -40 -37 241
5520B41j89n2J81j19j37PMLl4J30M2J99j44j40j11N3k4R6Q5J02l45J65N8j09j4
$$ 241 52 0 181 62 -75 -68 -64 -61 -95 35 77 276 132 -8 -119 -66 -90 6 91 193 -152 13 71 -38 -52
5545e2kK08j55L1k0J07n4k21L95q9j90MM0P2j00J63j34M1J23k74J32j35L8M0L7
$$ -52 -54 154 -1 30 10 117 63 -158 237 148 -42 -38 2 74 -26 137 3 44 167 -107 25 -110 -72 -32 5
5570ER0k44R4m2LL7k4N7J1o0N0M7j01P1L7j45J11j9Q1P3j32N7L2j67O2L34l52
$$ 5 95 -149 -55 -97 -94 -57 -81 -24 -13 -73 -23 24 -77 -6 31 -114 -3 -22 59 132 0 57 89 -78 -16 318 -34
5597c4QR8j96O3J07l4Q4j73K3J49j09nj53L12j43p1Q8j2P3j54J97j23m3Q8k2l9
$$ -34 -26 72 -124 -61 46 12 96 -77 -54 95 -14 -19 -172 140 -3 -74 14 2 75 -79 118 -5 -48 40 18 -21
5623b1k5K3P2j73J66J69r3j43K3j85K7K88j99N5J64J36j86n5j92K0l3J24P7k32
$$ -21 -46 -23 49 -124 42 211 118 -25 -2 -187 -160 128 -71 -16 148 284 98 43 -149 -129 -162 -38 39 -193
5647a93K41o9m3P8M0j1J15k37L4J08O9j82l2p0R7J14q0MMq9Q2k7M4m7j49K01J35
$$ -193 48 -21 -64 14 54 43 158 -79 -45 63 132 -50 -82 -152 -55 59 -21 -17 -13 -102 -20 -47 -3 -50 -199 2 137
5674A37p8j14m6N2P0J72l15K56o4l5j52J53k7k89L24P8j31l5J76j64n9J61r5N4
$$ 137 59 -55 -101 -49 21 193 -122 134 70 35 -117 36 9 -280 44 122 -9 -44 132 -32 -91 70 -25 29
5698B9j51J40K26k84j01K21j13K37n9j32K08k31q0l1K75j53j17J44q7p7K56n8
$$ 29 -122 18 244 -40 -141 80 -33 204 145 13 221 -10 -90 -121 154 1 -116 28 -59 -136 120 62
5720F2q5J51j2k69J39J30j36J77j03j49J83o1p9k0J61n6k07Q5Q5p7l5K76j17j85
$$ 62 -23 128 116 -153 -14 116 -20 157 54 -95 88 27 -52 -72 89 33 -174 -89 -4 -81 -116 160 43 -142
5744a42j20J77n0K02n0j73k2K71q4j07K6q8J52Q0j66K4J23p1j32L56j72R4k04
$$ -142 -262 -85 -135 67 17 -156 -178 93 9 -98 -72 -160 -8 72 -94 -70 53 -18 -150 206 34 128 -76
5767g6R5O9k40O5R8O5k4k0O2L5j98j3N4Qj68J97m1R1r5J39n1R0l03K95j40Q1j10
$$ -76 19 88 -152 -87 11 76 52 32 94 129 -69 -82 -28 -20 -188 9 -32 59 -36 103 52 142 -161 134 -6 75 -35
5794c5L4q1l5J73K6k3j45J19K2m6J28Rn5o6l0J56l06J80j54K63j47J48k79K27
$$ -35 -1 -82 -117 56 82 59 -86 33 55 9 137 146 91 25 -5 151 -155 25 -129 134 -13 135 -144 83
5818H3k18J31J20l3j45J37j89J11j40J97N1K4n6k08Q2P0o5L78j74k20L32l51M2
$$ 83 -135 -4 116 83 -62 75 -114 -3 -143 54 105 129 73 -135 -53 17 -48 330 156 -64 268 -83 -41
5841d1N7j8j01J56m1j07J58J7j35N3m6o6m7K52j87L9R9j32R6OJ29k30O1j6oM7
$$ -41 16 -2 -103 53 12 -95 63 80 -55 -2 -48 -114 -161 91 -96 -57 42 -90 6 12 141 -89 -28 -44 -50 -3
5867cJ41k06L1n0J54l3o1K3L8L7K7kn2j02J72j72l1J66j47K04k0k07J75o5K2L1
$$ -3 138 -68 -37 -87 67 34 -27 -4 34 71 98 96 44 -58 114 -58 -89 77 -70 134 114 -93 82 17 39 70
5893G0J51j54j32J64Km6n0J04q5p0Q4j58K27o6KL9j93R8P7r2J5Rq9J04O4k2K0
$$ 70 221 67 -65 99 101 55 5 109 24 -46 38 -120 107 41 43 82 -111 -13 64 -28 -13 -4 -93 11 75 53 73
5920G3j42N1M5j17K10k4%j05J2L5q6j03L34j95j46R2J29P2j96J06k20J98K5j0
$$ 73 -69 -18 27 -90 120 96 96 -9 3 38 -48 -151 183 -12 -158 -66 63 135 -61 45 -175 23 48 38
5944C8j12J60o6j37K3J27k15K75L9n2k06l6P4P8q7N4O6J1Q9p8q2P7p5J43n7L8
$$ 38 -74 86 20 -117 -94 33 -182 93 132 80 -126 -162 -88 -10 -97 -43 23 34 123 45 -37 40 -35 108 51 89
5970H9k6j4P2j87J44p3q1K15l32J78j8J37PN9k69K67j44J40j21j08P0j21P6J03
$$ 89 63 49 121 -66 78 5 -76 139 -193 -15 -33 104 111 170 -99 168 24 164 43 -65 5 -116 -40 63
5994F3RkR1j15pp0j74K28ql8J7j20N6q3J30L8Pj66K5N1p2K40j52L7o9K1ppJ8j5
$$ 63 72 70 161 46 39 -31 -205 23 15 -23 -6 -126 -70 -153 -23 15 22 -144 -119 -68 -140 100 -52 -15 -84 -63 -70 -77 -59 -74
6024g4J40n4j33RK94j76p4J32r8m2j88L29j97m6K68j16J05k0J9l8p4J15j3k18
$$ -74 66 12 -121 -112 182 6 -68 64 -34 -76 -264 65 -132 -178 90 -26 79 59 78 40 -34 81 68 -150
6048a50R6j0NJ56p5j42K55l95K57J4P5j83Q0j18J13O5pk8J1P3o5jQJ1l0J38j27
$$ -150 -54 -64 -59 97 22 -120 135 -260 -3 11 86 -97 -17 -135 -22 43 36 8 19 92 27 26 34 45 15 153 26
6075B6j06K60l3l8l5m8Qq6J87n8k14J66l0P4j96K77j49j01J14r6K9j75J16N9J
$$ 26 -80 180 147 109 74 26 34 -52 135 77 -137 29 -1 73 -123 154 5 -96 18 -78 -49 -224 -108 -49 -48
6100d8K09k41O8R3n9m9J1R6q1j07M4j26K70j21J55K7j03j77K8K24j71J6QQ6m3
$$ -48 161 -80 -12 81 22 -27 -16 80 -1 -108 -64 -190 80 -41 114 141 38 -139 -111 113 -58 -42 -34 52 9
6125IJ24r6j41J27J47k12m1O2l8K3m2J93k8n8k30o2L22N3l0j40J15l36J81J20
$$ 9 133 37 -104 23 170 -42 -83 -21 -59 -36 -78 115 87 29 -201 -263 59 112 82 -58 57 -279 -98 22
6149B2J8L6o9Nk2J14n4O4j60N8m2o0l7J34Q6j32P2O8r3j6K38j38m3l7k29L09j33
$$ 22 40 76 7 12 -10 104 50 114 -46 12 -30 -90 -127 7 93 -39 33 101 8 -8 230 92 49 12 -217 92 -41
6176d1j84J88K8n7L8L6N9m4r0M2m2k3K0oN1Q6o4N3O3q4j22R6k10J96o6Q7r3J90
$$ -41 -225 -37 -9 -66 -28 8 67 23 -67 -25 -67 -90 -70 -76 -25 61 -3 50 113 29 -93 3 -207 -11 -77 10 -83 107
6204A07j08L9j21M7J67k65K25J2n3J3r3N5k4Q4R2n7J6q3j35J19m2M3nJ04m6r4
$$ 107 -1 38 -83 -36 131 -134 91 103 50 63 -30 25 1 85 177 120 136 53 -82 37 -5 38 33 137 91 -3
6230cP7J6Pj00J46j88J23N8j42J25j00M4qK5L8k7j02L7m3O7K32k85Q1lj13J28
$$ -3 74 90 97 -3 143 -45 78 136 -6 119 19 63 55 80 118 91 -11 26 -17 50 282 -3 78 75 -38 90
6256I0j18n2J62K8j0L3r6L6M7R5l83K65L0j98JJ82j64R4o9J6J6O8p9j5R0j33j3
$$ 90 -28 -80 82 110 100 133 37 73 120 215 -168 97 127 -71 -70 112 -52 42 -27 -11 5 73 -6 -21 69 -64 -77
6283g7J40j53m6R5M6L5k56K20Q7k86K56m5L5j79J23M8j47J12j5J21M2j22r7L4
$$ -77 63 -90 -136 -41 5 40 -216 4 91 -195 61 16 51 -128 -5 43 -104 8 -7 114 156 34 -63 -29
6307b9J33m0N9Q0k67J6J71j03P4j33J21l7J8J0n3oN7j31QR9q8J72j16q7Q0J12
$$ -29 104 64 123 203 -64 -48 123 20 94 -39 82 45 63 73 20 14 71 -60 -52 47 -41 131 15 -72 8 120
6333A20k3l23J86J0J11q5P7J22k04J43n7j27R3m5kK5J31o5k01K19L4j82K21j51
$$ 120 97 -226 -40 -30 81 -4 73 195 -9 134 77 -50 43 -2 -4 21 152 87 -114 105 139 -43 178 27
6357B7om0L1j56J68J19L7j72J31j90j9L5P8j84P9J33p5o0m8N6l8K3o3J25l7l5
$$ 27 21 -19 12 -144 24 143 180 8 139 -51 -70 -35 43 -141 -62 71 -4 -64 -112 -56 -94 -71 -134 -9 -46 -81
6383h1J30p8k3J2j7J34k04J94k84K46K3k32K89j13j16J35j47J47j5o7LJ48k5p9
$$ -81 49 -29 -52 -40 -57 77 -127 67 -217 29 52 -180 109 -4 -120 15 -132 15 0 -67 -64 84 59 -20
6407b0p1o4M0J39N3k47J11J51J5j36J1Q7j68k0K09l1j23j10j0M06j11j40J2P5
$$ -20 -91 -155 -115 24 77 -170 -59 92 107 -29 -18 69 -99 -119 90 59 -64 -174 -184 222 111 -29 -17 58
6431E8k22K32q9J92p2r1l3K54l36J35j0j05O6j13J9N0P2k1M0k24J39P0k6o8j2
$$ 58 -164 68 -21 171 99 8 -25 229 -107 28 18 -87 -21 -134 -115 -65 7 -14 26 -198 -59 11 -15 -83 -95
6456i5Q1M5nq8J62j78J8J33m8M9K6M6n5q0k0j8j17Q5j1J5J76j86KQ0lk4l7J49
$$ -95 -14 31 26 -62 100 -78 -60 73 25 74 100 146 91 11 -9 -27 -144 -59 -70 -55 121 -65 -63 17 14 -10 -47 102
6484A02k83M8J54o9Lr2L0Q9j93R4K37k52J32J64j60q7J20R7K6k46J50l0R8k22
$$ 102 -181 -133 21 -48 -45 -137 -107 -18 -211 -117 120 -132 0 164 4 -83 37 134 160 -86 64 34 132 -90
6508i0PJ91J04j68%J8j07J62j62P6k03J31Q7lp6JJ41qo4j3j2q9O0J88o2k09O6
$$ -90 -83 108 212 44 44 62 -45 117 -45 31 -172 -41 46 43 -33 -32 109 101 37 24 12 -77 -17 171 109 -100 -34
6535c4J16Kr9O1j28K8m8J37q4J31k08K07j05J16%j51J19k06J58L1p8N5L2j89N0
$$ -34 82 84 -15 46 -82 -54 -102 35 -49 82 -126 81 -24 92 92 -59 60 -146 12 43 -35 20 52 -137 -87
6560h7K1J95j86k0J95j30J2m0r3oJ17j30J54r7O5J29n5J45l09J25J09J28k47j23
$$ -87 -66 129 -57 -77 118 -12 0 -40 -133 -139 -22 -152 2 -95 -30 99 44 189 -120 5 114 242 -5 -128
6584a28J32Q6j79K2K11j45k1r1J10n5J88l9K7j83N2kJ32j38J05p2p6J39l1k43
$$ -128 4 90 -89 -67 144 -1 -22 -113 -3 -58 130 91 118 -65 -13 -15 117 -21 84 12 -64 75 44 -199
6608a99K38m9l2P9j70J76J37k59M3Q6Q3j43q3J58L1j27L3K9l7rJ08j6j14m8kJ6
$$ -199 39 -10 -42 37 -133 43 180 -79 -36 50 133 -10 -93 65 96 -31 2 31 -6 -15 93 77 -37 -85 -87 -71
6634g1p4L4K9J04j48M7J30Ro7J71Pl6j82P8j94L60k11j48JJ10M6l0P0r8J22o3
$$ -71 -145 -111 -82 22 -126 -79 51 60 -7 164 171 135 -47 31 -163 197 -14 -162 -161 -51 -5 -35 35 -63 59 -4
6660dRK5K6JN4n1k49L34k57K9J23l8r6J10Q0j08qn9P6j1j04J89mq7j20J54P9n9
$$ -4 5 30 56 57 111 60 -189 145 -112 -83 40 2 -94 16 96 -12 -20 -79 -3 -14 -118 71 67 -20 -140 14 93 34
6688C4j22J32LJ8k71L58j02j6N2j09K19j14Rp0K1p8R8l0n8O4j03R3o3J03K3l4
$$ 34 -88 44 47 65 -206 152 50 34 86 -23 196 82 91 21 42 -36 62 32 -26 38 -65 28 -35 68 91 57
6714E7m2n8O2j18J3J41L5k58J09J03J6J12j82l7Q7k20K92j28r8J20q5J97J2j32
$$ 57 15 -43 19 -99 -86 55 90 -168 -59 44 60 172 -10 -47 40 -180 112 -16 -114 6 -79 118 130 -2
6738bK42k30J30j42J09q6m1L3m7K4J53q0j00p3J25k0j22M8n9K23j09m1M2m5j33
$$ -2 240 10 140 -2 107 21 -20 13 -34 -10 143 63 -37 -110 15 -5 -127 -79 -138 85 -24 -65 -23 -68 -201
6763b01J80K40k06p6J07j06K40l22L2L42l64P3K46l5k09n1J82N3k11k2K15j13
$$ -201 -21 219 13 -63 44 -62 178 -144 -112 230 -134 -61 185 150 -59 -110 72 125 -86 -108 107 -6
6785fJ50q9p9o9Q6M1O8k7k3J7P8q7l4j18J23M8j23Q0J2n8j82L11j14n5q1R2J79
$$ -6 144 55 -24 -93 -7 34 102 75 52 69 147 60 26 -92 31 79 -44 36 48 -10 -192 119 5 -50 -131 -39 140
6812A40k07J45l3j33J75k42L27l46J20k2k3J59j72K20j17jL8P0l4l1j79K67k61
$$ 140 -67 78 45 -88 87 -155 172 -174 -54 -76 -99 60 -112 108 -9 -10 28 98 64 33 -146 121 -140
6835a40Q7J25j05J13k25J28k4K6R9K2j36J05l4nO4O9k09K7Q5L1j69N6jK13p7K7
$$ -140 -53 72 -33 80 -145 -17 -41 -15 84 106 -30 75 41 36 100 169 -40 -13 72 103 -66 -10 -11 202 125 152
6861A52j82N7q4J8J64k8NJ4q8J47k25l0J49j3p2pK45j53j13r8Q9J16ko6L5l5m2
$$ 152 -30 27 -57 -39 125 97 102 116 28 175 -50 -80 69 56 -16 -23 222 69 -44 -142 -53 63 61 -5 30 -5 -47
6888d7k9Q0Mj38L7J22j20j9J23K6j26m6J94l9j36M6M9j00l5K6O0j32J13Q5k5j38
$$ -47 -76 4 8 -130 -93 29 -91 -110 13 39 -87 -133 61 22 -114 -68 -19 -119 -154 -128 -68 -200 -87 -2 -27 -165
6914a65L04j13k63Q5J27n7QM5k1M0q8J10j5p5M2k9O0n3L8j08J91J3j45J05j05
$$ -165 139 26 -237 -152 -25 -82 -74 -29 -50 -10 -98 12 -3 -78 -36 -65 -5 -58 -20 -128 63 76 -69 36 -69
6939f9j8N2J24j36l2J47N8k02J27n5J88r5j88kJ15M5O8k0k1J22k65J21n4q5J21
$$ -69 -87 -35 89 -47 -79 68 126 -76 51 -4 184 89 -99 -101 14 59 127 107 86 208 -57 64 10 -75 46
6964D6j60J41NJ25K7k73j4J47K2r2R1o8J40j93J43j90J62j40J31l4j18J59o6P6
$$ 46 -114 27 32 157 184 -89 -103 44 66 -26 65 -3 137 -56 87 -103 59 -81 50 16 -102 57 -9 67
6988F7j83K0N0O4N6o7n9M2O6j91J71p3N6O6q6Q5j44K24j02j66N3Q5o0N1q3j3R2
$$ 67 -116 -96 -46 18 74 7 -52 -10 56 -135 36 -37 19 85 -1 84 -60 164 62 -104 -51 34 -26 25 -58 -71 21
7015B1q3j18L68j37r5k2J32n9p0K29j67n4N7o8N2j7j79J24Q6m1L02k20m6R8k6
$$ 21 -62 -180 188 51 -44 -66 66 7 -63 166 -1 -55 2 -66 -14 -31 -210 -86 0 -41 261 41 -5 93 67
7040F7j15J24k30K83k98K70j11J15j97J8K08m5J45k18R6o5j17R3P4r9m7k1K14
$$ 67 -48 76 -154 129 -169 101 -10 105 -92 -74 134 89 234 16 112 47 -70 23 97 -2 -49 -70 144
7063A44k92K30O5j85L2l3J84M2j55j7K6j04P2l1K34k80J68r0M6k21K47j50O4m2
$$ 144 -148 82 147 -38 -6 -39 145 187 32 15 41 -63 9 -22 212 -68 100 10 56 -165 82 -68 -4 -46
7087d6R4m3J2j31K35j68R2k53J57J72j83L3J9J14j89J21K0Q0q2j05N9J56l03J35
$$ -46 48 5 17 -114 121 -47 45 -208 -51 121 -62 -29 -10 104 -85 36 56 136 54 -51 8 164 -139 -4
7111dJ5K8k04L32k3q8j76J56K4j91R8N6j21O5K7L3l2k57L25q3J08m4M8j12q1L6
$$ -4 11 39 -165 167 144 56 -120 36 60 -131 -33 23 -98 -33 -6 27 -5 -262 63 -20 88 44 92 -20 -101 -65
7137f5P4n6p6L23j35j03j27J34K80j82P0j46K7o0q7J69O7l01J43J01n7R8J04k95
$$ -65 9 -47 -123 200 65 -38 -165 -31 249 67 137 -9 18 -42 -129 40 107 -194 -51 50 -7 91 195 -100
7161a00R2k8J25r5r5J28n1L1j00J31j29L5M3P4K3j66K6K5o3J73j49J00J76k90
$$ -100 -8 -36 89 -6 -101 27 -24 7 -93 38 -91 -56 -13 61 84 -82 -56 -31 -94 79 -70 30 206 -84
7185h4nO1J11r2QK1n9n9J21L3j81J96q9k5M9J36j60p6K8o6J86l5p9J33k8n7q9
$$ -84 -89 -28 83 -9 -1 20 -39 -98 23 56 -125 71 -18 -43 6 142 -18 -94 -66 -132 54 19 -60 73 45 -12 -101
7212a01J82N9j12O0Pk2n2j5j03N3KN9J9j08K67l2j75J95m1j15k7J02q5K08k35
$$ -101 81 140 28 88 95 73 21 6 -97 -44 -42 17 36 -72 195 163 -12 183 142 27 0 102 17 225 -10
7237a0N7J56j62lj69J88ko1rp6j9m0J00n5J04J50o7m0j00J2l6J34l0Q5j43R0r5
$$ -10 47 203 41 38 -131 57 55 -6 -15 -91 -110 -150 -50 -105 -1 149 82 42 -58 -46 -82 52 22 107 -36 54 -41
7264d1Q0R0l31K26k6J6K4o1J18k43J65j52lJ74l8j34L73l01J2J52k34N1Mk8o5
$$ -41 39 129 -202 24 -2 14 38 -23 95 -148 17 -135 -138 36 -2 -136 237 -64 -52 100 -134 -83 -79 -107 -172
7289a72K03J24j37K7M8q2o8j75K54j22J75j57R2J20k81J06j19K61L3k04J69J7
$$ -172 31 155 18 45 93 11 -57 -232 22 -100 75 -82 10 130 -151 -45 -164 97 130 -74 95 112
7311A12P0j78J2j08K82k17qN5j15Q6N6m4P1Ll1Kj2rm8n5q9J68k6k04K55n1M1k4
$$ 112 182 4 16 -92 190 -27 -35 20 -95 -9 47 3 74 77 46 48 36 27 -21 -76 -165 3 -23 -227 28 -23 18 -6
7339fl9R3J5l3k0Q2k19J32Q6%M1j53j2PL0q5m5O5n5J14K1L7J0k07j58K07O2r2
$$ -6 -45 48 63 30 10 92 -127 5 91 91 132 -21 -33 -26 4 -81 -126 -61 -116 -2 19 56 66 -141 -299 -92 -30 -122
7367a22J08J14j33N0j09p0J57p7m9N6Q3L9r7P7l0K5j9j02Q5p7m7J55K1Q9j35J51
$$ -122 -14 100 -33 17 -92 -162 -5 -82 -131 -75 8 47 -50 27 -3 22 3 -99 -14 -91 -138 17 38 127 -8 143
7393A43J6j34j07J67j97M9K4J42j22o5K98j90R3p9r0j42J95l3J56p1j72Q0O2j35
$$ 143 159 25 -82 85 -112 -63 -39 103 -19 -84 214 24 117 38 -52 -194 1 -32 124 53 -119 -39 23 -112
7417a12N2J47J60j13k03J32J7r3O6nQ7K2l29K11K11j33j73J23Mm6K0j56R3L6j19
$$ -112 -60 87 247 134 -69 63 80 -13 53 48 135 157 -172 39 250 117 -56 67 71 25 45 -111 -18 18 -101
7442a01K58k08n9K35o9j44K88l1j05j39K2K44k39J01j76L38j97P4np0j72M5Q2
$$ -101 157 -51 -110 125 56 -88 200 169 64 -75 -53 191 -48 53 -123 215 18 92 87 17 -155 -110 -28
7465b8k8J21j74L14r6m4K4qj39P4j0M4m2k7J04nl3Q4j89J24rm2pJ63j51J4M6K
$$ -28 -56 65 -109 205 109 65 89 81 -58 16 6 50 8 -19 85 80 47 131 -58 66 57 15 8 171 20 34 80 82
7493H2m6K1O6j07J98j50Q8q6m9J33j31J1q0O0o9O2k6N4K3j13j2m8J97o5J39k22
$$ 82 36 57 123 16 214 64 152 66 17 150 19 30 -50 10 -59 3 -23 31 54 -59 -71 -119 78 13 152 -70
7519g0J15q1K54k71J13r6K2l3K25k03K09j48m3rM1o2k7P8p4M0O0j01O4j27R9Q3
$$ -70 45 -36 218 -53 60 -36 -14 -47 178 -25 184 36 -7 -16 25 -37 -64 14 -60 -20 40 -61 3 -124 -25 58
7545E8k72K61nj34J48j81M5J27k49J98J09o3j41P1l5o0j5J71k5J14j46J02j57
$$ 58 -214 47 42 -92 56 -125 -80 47 -202 -4 105 42 -99 -28 -63 -123 -138 33 8 122 -24 78 -79
7568g9M2N8L9j77J23J25K7m4k19J50L1k81L41qp5k92J74Mm6J78O6k27J9K94k80
$$ -79 -37 21 60 -117 6 131 158 114 -105 45 76 -205 136 128 53 -239 -65 -61 -107 71 137 -90 -71 223 -57
7593e7J51J2k18J47J86l83J54M2N2j37K37j14r9k4K47k19J50j16J12j47j17J58
$$ -57 94 106 -112 35 221 -162 -8 34 86 -51 186 72 -27 -51 196 -23 127 11 123 -24 -141 17
7615A7O6j05k1P8Q4j81N0KJ09o3Q0l6Jr8nK0J14k77K02P3k58J30K8O9k80M2J10
$$ 17 83 -22 -43 35 119 -62 -12 -10 99 36 116 80 81 -17 -22 -2 112 -165 37 110 -148 -18 10 79 -201 -159 -49
7642d9Q0J26k25K4r6n0J60K39k45k3j46K03J11j28K6jM6j89K54q8k5nN4q4n1O1
$$ -49 31 157 -68 -44 -140 -190 -30 209 -36 -59 -205 -2 109 -19 7 6 52 -137 117 29 4 -1 53 -31 -82 -21
7668b1o1j01J71R3k63L01k25J6K15j79J80k25R4M7Q0j60R0J01l7p2j57J52K2M4
$$ -21 -82 -183 -12 81 -182 119 -106 -90 125 -54 126 -99 -5 42 122 -38 52 153 116 44 -113 39 61 105
7692A05J14j97R1j28M5L4P0j55j06O3M0QR9j39j5j28M5P1K54j36r0K0m8J04k70
$$ 105 219 22 113 -15 30 64 134 -21 -127 -64 -24 -16 83 -56 -71 -199 -154 -83 171 35 -55 -35 -83 21 -249
7717b49L80j54P1n4r2J71j89J17o9r6K08q0p0P9j04J33l3j50J58q7J61k54J94
$$ -249 131 -23 48 -6 -98 73 -116 1 -68 -164 44 -36 -106 -27 -131 2 -31 -181 -23 -110 51 -203 -9
7740ik01J77k8K18j45K57k42n0k08K53j01l1N1J89J34k84J71n5r4N8j01J11K3
$$ -9 -210 -33 -61 157 12 269 27 -23 -231 22 -79 -110 -59 130 264 -20 151 96 2 60 -41 70 93
7763I3k51K02oJ11k31J47J46q6n5j94J76p1P3o4Q2O8k45J76k3q9J18l0j67O0M1
$$ 93 -158 44 38 149 -82 65 211 125 70 -124 52 -19 54 -10 72 140 -105 71 48 -41 77 47 -120 -60 -19
7788a9N7m1j81J38K10k79K14r0O1j86J39k28K11j5Q0l5r2J05j64Q2J5qQ1k03P8
$$ -19 38 -3 -184 -46 164 -115 99 9 70 -116 23 -205 6 -9 71 36 -56 49 -115 -33 -18 -26 55 -148 -70
7813g0N1q3J02o2J38K0j99J29j22K10q5n3mN3k9N7k28J06M9M2N0j66K0J27lo9
$$ -70 -19 -102 0 -62 76 96 -103 26 -96 114 29 -24 -28 25 -4 53 -175 -69 -20 22 72 -94 -74 53 50 -19
7839a9N7Q9n6Pp0o7j5J86KJ12k11j5J54j57J31m1r5N5o8l3n9pJ05N3k7j40l9Q0
$$ -19 38 127 71 78 8 -59 -74 112 114 226 15 0 154 -3 128 87 -8 47 -21 -54 -113 -120 -15 38 11 -129 -168 -88
7867h8j0J21j5n6P8K1m1j8j5j52L14l35R3J43J28k10R1m5J33j69j47Q2ML01l68
$$ -88 -98 23 8 -48 30 51 10 -8 -23 -175 139 -196 -103 40 168 -42 49 4 137 -32 -179 -97 -93 208 -160
7892a60J68k18O7K41j96N5J48j31K6o8p8K03j37J2J6J02Q1k50l3J22K23k84N7
$$ -160 8 -210 -143 98 -98 -43 105 -26 0 -68 -146 57 -80 -68 -52 50 131 -119 -152 -30 193 -91 -34
7915c4Q2N2p2qM0r4R5j90K97j60o0K25k42K4m9k0K15k20KK07j01k92L20j1M2p1
$$ -34 48 100 28 20 60 -34 61 -129 168 8 -52 173 -69 -45 -94 -114 101 -119 -117 90 -11 -303 17 6 48 -23
7941b3j8J2P8n4J17L5j80J05n1K0lm9J81j95O7j62K05j28K8J05jj46J45N9j81
$$ -23 -41 -29 49 -5 112 147 -33 72 21 41 38 -11 170 -25 42 -120 85 -43 -15 90 89 -57 88 147 -34
7966c4Q5o8j78M60j88j09J01j29JJ83q1j25O8K9N0o9k8QQ7j72J19q2M0j82K36
$$ -34 51 -17 -195 265 77 -32 69 -60 -59 124 43 -82 -14 15 65 -4 -32 -24 63 -109 10 -72 -32 -214 22
7991B2r3L9l5P0J15k09m8Q3%qJ23o9Q2l07K23M0Q3Jj79J83j33J4j42L14j97j88
$$ 22 -71 -32 -67 3 118 -91 -139 -56 -56 -64 59 -10 72 -235 -12 28 111 112 -67 116 -17 -3 -145 169 -28 -216
8017b16J48Qo5O5J30l8J8j08k7P5MKn8N5P3rp6K6r3L9k1J62k20J44NJ0MM6R4j15
$$ -216 -68 -60 -125 -60 70 32 50 -58 -85 -10 -6 -4 -62 -7 66 57 -19 7 -86 -47 -68 94 -126 18 23 33 37 83 177 62
8047F2j22p9O7r8J25K8jQ8j55J16r9L2l0o4R0k1O2Qj24N6j36n1J23K80j47Q1k7
$$ 62 -60 -139 -72 -170 -45 -17 -18 70 -85 31 -68 -36 -66 -130 -40 -61 1 9 -115 -59 -195 -246 -123 157 10 91 64
8074F4J2j66l8K55j85J9p9J0J13J86j71J35j79r8K67q8r5P3Q3r8N9j05j27K68
$$ 64 76 -90 -128 127 -58 -39 -118 -108 5 191 20 155 -24 -122 145 57 -38 35 118 20 79 -26 -153 115
8098A15k56J26j1r3k38K54J08L7K8n3P0p7rM4q7o0J36mj2l19J60K84j72K0J43
$$ 115 -141 -15 -26 -119 -357 -103 5 42 70 17 87 10 1 45 -42 -102 34 30 18 -301 -141 143 -29 -9 134
8123A34j38m6M3Q8J0k11J39k5n8j4K5J77j15k6J21q1p0j7j57J52p8J26J59j75
$$ 134 -4 -50 -7 81 91 -120 19 -6 -64 -78 -53 124 9 -17 104 23 -47 -64 -221 -69 -147 -21 138 -37
8147c7k47K57N1m4q3R3P0j51j10K49r4p4o7mJ94pR9R4Pj90j73K11k5q8P7J1ON3
$$ -37 -284 -27 24 -20 -103 -10 60 -91 -201 48 -46 -120 -187 -191 3 -4 95 189 196 6 -167 44 19 -69 8 19 25 78
8175G8M3K0k00J9M0l4J86k96K91m4r2l4N9j71K34J05
$$ 78 121 141 -59 -40 0 -34 152 -144 147 103 11 -23 36 -135 99 204
8191B04
$$ Imaginary data points
##PAGE= N=2
##DATA TABLE= (X++(I..I)), XYDATA
0@%%%%%%%%%%%%%%%qJ6j6J6j6K4l2L2m0M8n6O4p2Q7r9J12j28J45j64J83k05K33
$$ 0 0 0 0 0 0 0 0 0 0 0 0 0 0 0 0 -8 8 -8 8 -8 16 -16 16 -24 24 -32 32 -40 47 -52 60 -68 77 -87 96 -109 124
37A24k60K89l24L60m00M43m90N42n96O56p25Q01q82R69j067J177j301J440j592
$$ 124 -136 153 -171 189 -211 232 -258 284 -312 344 -381 420 -462 507 -560 617 -684 756 -836
56h36J769j977K216k498K840l263L800m507N485o922R238j3555K4106r2128j11259
$$ -836 933 -1044 1172 -1326 1514 -1749 2051 -2456 3029 -3893 5345 -8210 15896 -76232 -187491
71a87491K52475o0018j22970J74775j8098k03069J43120J08963j85998J3387J26017
$$ -187491 64984 4966 -118004 56771 38673 -164396 -21276 87687 -98311 -84924 41093
82D1093j41240p824J89500q5046j31070J29553O2j16496J07647O0824j53700J4661
$$ 41093 -100147 -107971 81529 -3517 -134587 -5034 -4972 -121468 -13821 47003 -106697 -92036
94i2036J23082p8232m8223J15725k3236r8728O8976M6406q2572J1689O4450n4051
$$ -92036 31046 -47186 -95409 20316 -2920 -101648 -32672 13734 -68838 -57149 7301 -46750
106d6750k7501Q0283j678o0996M1648J6872p8607K5398Q1165n2320l2312P6435
$$ -46750 -74251 6032 4354 -56642 -14994 1878 -76729 -51331 29834 -22486 -54798 21637
118B1637k5024o7341Q0754L0497j08024K3110Q7925o9145j7384R8971m9558p6085
$$ 21637 -3387 -70728 10026 40523 -67501 -44391 43534 -25611 -42995 55976 6418 -69667
130f9667Q7784J6623q1421N1113M0611q6902K0358P9211o5323k2562Q1818m2369
$$ -69667 18117 34740 -46681 4432 45043 -41859 -21501 57710 -7613 -30175 51643 9274
142I274n6800Q0834M905p5774M6449M0479p0217P198O6617l8540l5801M5690q136
$$ 9274 -47526 33308 38213 -37561 8888 49367 -20850 -13652 52965 14425 -21376 24314 16178
155A6178l6580L7207K0110l7282r59K0864j2409k790K0139j0632k6697J4499K2922
$$ 16178 -20402 16805 36915 -367 -1326 19538 7129 4339 24478 13846 -12851 1648 24570
168B4570j5855m443J9793j8867k3418L6966J5965m7381J843M0223l1215j4541
$$ 24570 8715 4272 24065 5198 -18220 18746 34711 -12670 -10827 29396 -1819 -16360
180a6360N6513j8079n6527M2680K3232n2299K0448L8061n3162m513N9133l3654
$$ -16360 40153 22074 -34453 8227 31459 -20840 -392 37669 -15493 -20006 39127 5473
192E473l2407N5998j6784n2012N8955J8207p0705K9242M7839o4793n251P0683
$$ 5473 -26934 29064 12280 -39732 19223 37430 -33275 -4033 43806 -20987 -26238 44445
204D4445l7755m5990O2913K027o0729L9529L1527n7520Q821M6064l9050j4234
$$ 44445 6690 -39300 23613 25640 -35089 4440 35967 -21553 -12732 33332 -5718 -19952
216a9952M6922k1300l3611M2969N883m4498K7463K7760m8796j12M7881k8615k9150
$$ -19952 26970 5670 -27941 15028 20911 -23587 3876 31636 -17160 -17272 30609 1994 -27156
229b7156M6047K171m5630K4503L0991m2543o273M2464k1133k5614L9237r03l7330
$$ -27156 18891 21062 -24568 -65 30926 -11617 -17890 24574 3441 -22173 17064 16161 -21169
242b1169K5395J7259l8409J0590L3231l4963j1458M5643j9507l5453M4544O869
$$ -21169 4226 21485 -16924 -6334 26897 -8066 -19524 26119 6612 -28841 15703 22572
254B2572n1551K6350L5475m7656n337M8722k5960l0885M4190J380m2209K7020
$$ 22572 -28979 -2629 32846 -14810 -20147 28575 2615 -28270 15920 17300 -24909 2111
266B111K0411m0276R181L1807l2211q182L7639j8363k5122L5800J718l8589K2753
$$ 2111 22522 -17754 -8573 23234 -8977 -17159 20480 2117 -23005 12795 14513 -24076 -1323
279a323K4710l8443n81L8408k2873k3081L4722R97l2778J7694J9395k7757n56
$$ -1323 23387 -15056 -15637 22771 -102 -23183 11539 12536 -20242 -2548 16847 -10910 -11466
292a1466K6736j7537j3404K5680n901k1728K1624O966k7012J1713K0772k5996
$$ -11466 15270 -2267 -15671 10009 4108 -17620 4004 10970 -16042 -4329 16443 -9553
304i553o413L1052j2999k4735K9124P781l3586J3016K4397k7256p408K9265j0931
$$ -9553 -15966 15086 2087 -22648 6476 14257 -19329 -6313 18084 -9172 -16580 12685 1754
317A754k0312K3589L803k4876J3876J3888k4565M266K1917k0277q029K7409j0021
$$ 1754 -18558 5031 8834 -16042 -2166 11722 -12843 -8577 13340 -6937 -14966 12443 2422
330B422k2356K4386Q515l0838J0087K5481k5530r814L0774r308k2882K2446P880
$$ 2422 -19934 4452 12967 -17871 -7784 17697 -7833 -17647 13127 3819 -19063 3383 11263
343A1263k4572P888J7592j8907l515K0912j1743j1633K1288l830j9640J8592Q093
$$ 11263 -13309 -5421 12171 -6736 -10251 10661 -1082 -12715 8573 4743 -14897 3695 11788
356A1788k4824P844K1357k0943r461K7540n855k4190K0859J1282k6290N046K0821
$$ 11788 -13036 -5192 16165 -4778 -14239 13301 7446 -16744 4115 15397 -10893 -5847 14974
369A4974j7122q028K1008n477j4781J5614L189j8368J0454J0997j9572L715J9217
$$ 14974 -2148 -10176 10832 5355 -9426 6188 9377 -8991 1463 12460 -7112 -3397 15820
382A5820j6742r102K3572n660k1642J8213J2046k5236L205K3785j7375j2949K3719
$$ 15820 -922 -10024 13548 7888 -13754 4459 16505 -8731 -5526 18259 884 -12065 11654
395A1654k956j9896J5560Q425j9092N018J3583j5447k819J7761j0412j0303J9924
$$ 11654 8698 -11198 4362 12787 -6305 -1287 12296 -3151 -5970 11791 1379 -8924 11000
408A1000l608j9396J5976Q705k2584N184K0237j6187j0448K1875l303k0438J4145
$$ 11000 7392 -12004 3972 12677 -9907 -4723 15514 -673 -11121 10754 7451 -12987 1158
421A158J0112j8597L287J5045j2308n856J3873n311r886J2502J660j3920R186
$$ 1158 11270 -7327 -4040 11005 -1303 -7159 6714 1403 -8483 4019 5679 -8241 945
434I45Q523j7235J653J6990j2988r260J9943j369j9151J1989J1318j9755j14K0475
$$ 945 9468 -7767 -6114 10876 -2112 -11372 8571 7202 -11949 40 11358 -8397 -8511 11964
448A1964j1066j1451J7255k024j5151J2983N091j6143O944J1189j4685R01J5598
$$ 11964 898 -10553 6702 4678 -10473 2510 7601 -8542 -1598 9591 -5094 -4193 11405
461A1405j4520r181K1780l196j7829J5827O054k0971O949J6585j5049o505J5608
$$ 11405 -3115 -12296 9484 6288 -11541 4286 10340 -10631 -3682 12903 -2146 -8651 6957
474F957m284r307J1619K08j1911O556M247p548N027M081r766J091Q212n636l893
$$ 6957 2673 -6634 4985 5193 -6718 -162 4085 -3463 1564 5645 -4121 -3030 5182 -454 -4347
489d347P491p14p639L986N867n066m166M301K109m921o09P257j814q802M501N162
$$ -4347 3144 2430 -5209 -1223 4644 -422 -4588 -287 1822 -3099 -3708 3549 1735 -7067 -2566 2596
505B596p022J391O603p273l109P938k445l702O890m218q437J1822L169j3971O995
$$ 2596 -4426 -3035 3568 -3705 -6814 1124 -1321 -5023 1867 -2351 -10788 1034 4203 -9768 -2773
520b773P737j6033K557J7613j1593j1221J5338K58j3402J0343O477j5051K795
$$ -2773 4964 -11069 -8512 9101 -2492 -13713 1625 1883 -11519 -1176 5301 -9750 -6955
533f955J0955q956j666R588p173l580J0338l713p629R253K733j1146L486R130
$$ -6955 4000 -4956 -6622 2966 -4207 -7787 2551 -1162 -8791 462 3195 -7951 -4465 4665
547D665q718k833J1886k837j1551N992R236o537l386P658l843p982J0869O429
$$ 4665 -4053 -6886 5000 2163 -9388 -3396 5840 -697 -4083 3575 -268 -8250 2619 9048
561I048j1915m98O997o652K908J1583j0906r702J4407L82j0686J4473J369k4157
$$ 9048 -2867 -3365 3632 -3020 -112 11471 565 -9137 5270 5652 -5034 9439 10808 -13349
575a3349J0916K0900j9309m799K0533j4776j2567K6774m21k4224J3500Q431j9966
$$ -13349 -2433 18467 -842 -5641 14892 116 -12451 14323 13902 -10322 3178 11609 -8357
588h357J1704J5610k4045p67K0720j5950n253K4604j2759j9271K3122L332k2750
$$ -8357 3347 18957 -5088 -5855 14865 -1085 -6338 18266 5507 -13764 9358 12690 -10060
601a0060J4486J2295k4766K346K1094j4222o650J7012r578j1016J6068J10j1583
$$ -10060 4426 16721 -8045 -5699 15395 1173 -5477 11535 1957 -9059 7009 7119 -4464
614d464R125R46j3638Q441R989j2928j435J0597q399m413J2583j351j0567K971
$$ -4464 4661 5607 -8031 410 10399 -2529 -3964 6633 -1766 -6179 6404 5053 -5514 -2543
628b543M827l613P3M092k401m826J782L522m92j378q8j354p13K819Q38k803J292
$$ -2543 2284 -1329 -1256 2836 435 -4391 -2609 913 421 -957 -1045 -2399 -3112 -293 545 -2258 -966
645i66L44n189M130O010p367k757P766m120n226R540J617j0618K848O145n877
$$ -966 -622 -5811 -1681 4329 -3038 -5795 1971 -2149 -7375 2165 3782 -6836 -3988 2157 -3720
660c720P13O379o221k496N545k089q6N094n690l883P609n25m746N731J55q426
$$ -3720 -3007 3372 -2849 -5345 200 -1889 -1975 3119 -2571 -6454 1155 630 -4116 1615 1770 -6656
676f656L958O389m958n93K704m252J605L828l336J438J214o681L303P836o744
$$ -6656 -2698 3691 -1267 -1860 844 -3408 -1803 2025 -1311 127 1341 -5340 -2037 5799 -945
691i45l426P940l974n515J0089K85j0167N436L406o916N318L372r465L394O577
$$ -945 -4371 3569 -405 -5920 4169 4454 -5713 -277 3129 -3787 1531 4903 -4562 -1168 5409
706E409r082J722J0002r701n497J4291l739j1503J2035K987j4154O714Q549j1433
$$ 5409 -3673 -1951 8051 -1650 -7147 7144 3405 -8098 3937 6924 -7230 -516 8033 -3400
720c400Q00R566p828l119R596m833n117J0133k976r267R646K933j1032N233P451
$$ -3400 -2600 6966 -862 -3981 5615 782 -4335 5798 2822 -6445 3201 6134 -4898 335 7786
735G786j1425p66J1361m442o984P158P25o901M146M455o104n86M191k496l65L507
$$ 7786 -3639 -4405 6956 2514 -4470 2688 3413 -3488 658 5113 -991 -1577 2614 118 -247 3260
751C260k766l022M097J025m361K531L310o222j195P764k041o653N309K923p260
$$ 3260 494 -2528 1569 2594 -1767 764 4074 -2148 -3343 4421 2380 -4273 1036 3959 -3301
766c301J432P092n332m550P115m78n669N301P44o326L950K848o412K600N070p113
$$ -3301 -1869 5223 -109 -4659 2456 1978 -3691 1610 2354 -3972 -22 2826 -3586 -986 4084 -3029
782c029j034Q828m830o310R165J1r263O084N196q622L59O830m739k310N605j818
$$ -3029 -4063 4765 -65 -6375 2790 2801 -6462 -378 4818 -3804 -3445 3385 -1354 -3664 1941 123
798A23l612M302m55l878M287L32n049L725L139n796N51N036l305l155M731P58
$$ 123 -3489 813 358 -3520 767 1099 -3950 -225 2914 -2882 -2331 2705 -600 -3755 976 1734
814A734m486J630L066k387j292J973J88j099L17N80K91p95l72Q73Q8j30m83J74
$$ 1734 -2752 -1122 1944 -443 -1735 238 426 -673 -356 224 515 -280 -652 221 309 179 -304 -130
832a30J123n20j528J506J440k673l71L397p68l755L015K308m336N6M077j870k515
$$ -130 993 473 -1055 451 1891 -782 -1153 2244 1476 -2279 736 3044 -1292 -1236 2841 971 -1544
849a544K597Q47k393N26J440j520L13J055j777R92J319k604k40L434k058k288
$$ -1544 1053 1900 -493 33 1473 -47 266 1321 -456 536 1855 -749 -989 2445 387 -1901
865a901L339Q59l874O99L971k903k701L882L89l490J305J951j735q81J531j45
$$ -1901 1438 2297 -1577 -878 3093 190 -2511 1371 1760 -1730 -425 1526 -209 -1090 441 296
881B96r90R26l15m31J096q56j278K178N48l046J197K626k553j839L693J91l966
$$ 296 -694 232 -83 -514 582 -274 -1552 626 1174 -1872 -675 1951 -602 -2441 1252 1443 -2523
898b523J724K879l108p36K879q50j721J406N68j143N62J49p51R13N61k152R25
$$ -2523 -799 2080 -1028 -1764 1115 265 -1456 -50 518 -625 -63 86 -665 248 809 -1343 -418
915d18K143k770o76L526q93l220K354K182l391m54L534j399k337K317J016k310
$$ -418 1725 -1045 -1721 1805 912 -2308 46 2228 -1163 -1617 1917 518 -1819 498 1514 -796
931g96L55J325j236J66M44l80J39Q29j482n16K549j029k224K447J062l173M87
$$ -796 -441 884 -352 -186 258 -122 17 846 -636 -1152 1397 368 -1856 591 1653 -1520 -1033
948a033K793j827j992K476Q57k637N75K176j818p94J428k19p32P07l10n9Q82n62
$$ -1033 1760 -67 -2059 417 1274 -1363 -788 1388 -430 -1224 204 -15 -747 -40 -350 -409 473 -89
966h9j416J653N84k408P59K699k524j588L372j73l166J575K202k281p77K304m94
$$ -89 -1505 148 732 -1676 -917 1782 -742 -2330 1042 869 -2297 -722 1480 -801 -1578 726 232
983B32j669J355L11q12P55l95n66J393l80j274J505R20k403K5K755j287k319K732
$$ 232 -1437 -82 229 -583 172 -223 -789 604 224 -1050 455 1375 -1028 -1003 1752 465 -1854 878
1001H78M78k284O55J426n62p82L58P37k72o76K31R47n31j024R67J051j414n79
$$ 878 1356 -928 -273 1153 591 -191 167 904 632 -44 187 1134 603 -421 546 1597 183 -396
1019c96J609j66r52N41J66J76o08o02J553K63k117K47K456j537j971K878M26l326
$$ -396 1213 1047 95 636 802 978 370 -232 1321 1584 -533 -286 2170 633 -1338 1540 1966 -1360
1037a360J356K089k415k84J905j117p83J437q30j28J056j173j056K297m15k655
$$ -1360 -4 2085 -330 -614 1291 174 -609 828 -2 -130 926 -247 -1303 994 579 -2076
1053b076K317J307l291M55L037j980j821K235M01k294N85J904j282j065J147R9
$$ -2076 241 1548 -1743 -1288 1749 -231 -2052 183 584 -1710 -1125 779 -503 -1568 -421 -322
1069c22m27K91k70l59P00k51k35N55L07j475n53K797n44k523K064J021l307J164
$$ -322 -749 -458 -728 -1087 -387 -638 -873 -318 -11 -1486 -2039 758 214 -2309 -245 776 -2531 -1367
1087a367L424k603k418L487K28k921K406R85l377J440K287k867R13K333l750J69
$$ -1367 2057 -546 -2964 523 751 -2170 236 1221 -2156 -716 1571 -1296 -383 1950 -1800 -1631
1103a631M643l012k887N142o26n277M794K508o292J231N065m536j096M845k628
$$ -1631 3012 0 -2887 2255 1629 -3648 1146 3654 -2638 -1407 3658 -878 -1974 2871 243
1118B43k199M403j481l057M056j86m158L911J372n921K815M590n234q95M980l140
$$ 243 -1956 2447 966 -2091 1965 1779 -2379 1532 2904 -3017 -202 4388 -846 -1741 3239 99
1134I9k413M954m68m252K309J328k211J735Q95l547J172K095k287R92J867l350
$$ 99 -2314 2640 2172 -2080 229 1557 -654 1081 1976 -1571 -399 1696 -591 401 2268 -1082
1150a082q44L622j49k704J378M86j962Q92K007j171j210J55O84L25k81k72K83
$$ -1082 -1926 1696 1547 -1157 221 707 -1255 -363 1644 473 -737 -582 102 427 146 -126 157
1167A57m54m29P84O45l98q56l38J032K07q38O87N71j834l90K785p3k672J128J096
$$ 157 -297 -726 58 703 305 -551 -889 143 350 -488 199 770 -1064 -1454 1331 1258 -1414 -286 810
1186H10k248J478J663j881r37J137n29J009J121k704n08K872j122j526L298j700
$$ 810 -1438 40 1703 -178 -1115 22 -507 502 1623 -1081 -1589 1283 161 -1365 1933 233
1202B33l593M105K015m389J219J831l023R32K970k659j161K489j700k66L330k562
$$ 233 -3360 745 2760 -1629 -410 1421 -1602 -670 2300 -359 -1520 969 -731 -997 2333 -229
1218b29k942M760k1m086L256J301n100K251M098m233j366L905j917j352L698j755
$$ -229 -3171 1589 1568 -2518 738 2039 -3061 -810 3288 -945 -2311 1594 -323 -1675 2023 268
1234B68l185L681m1k650L274k19m494K885L543m543k69L765k875j644M595p85
$$ 268 -2917 764 723 -1927 1347 1128 -3366 -481 3062 -1481 -1750 2015 -860 -2504 2091 1306
1250A306l793K205J059k115J891O70k830R31J525j498O31J749k511j115L155L3
$$ 1306 -2487 -282 777 -1338 553 1223 -1607 -676 849 -649 -18 1731 -780 -1895 1260 1293
1266A293k747J678J046k545P37K292j003j667R01Q48p93K27P32r09m88Q36MN3
$$ 1293 -1454 224 1270 -1275 -538 1754 751 -916 -15 833 40 267 999 90 -398 438 442 495
1284D95L55r83o73J761K15j628O26J540k437j72L235j378k730K789N95k517J176
$$ 495 850 -133 -806 955 1170 -458 168 1708 -729 -901 2334 956 -1774 1015 1610 -907 269
1301B69J371k295J41J909j253n55J657j368o90K545j483j848K769j68k972K410
$$ 269 1640 -655 -514 1395 142 -413 1244 -124 -814 1731 248 -1600 1169 1001 -1971 439
1317D39J437l252K69K967k117j234K469p19j753J939L8j381J389n08j237J572
$$ 439 1876 -1376 -1107 1860 -257 -1491 978 259 -1494 445 483 -898 491 -17 -1254 318
1333C18L66k245J259J278j974l00K317j496j184J897K56j499P93K71q55M21M0
$$ 318 684 -1561 -302 976 -998 -1298 1019 -477 -1661 236 492 -1007 -214 57 -798 -377 -337
1350c37j72P15l02j000R23O74j439L19J178r38p76J452J05j083L50L93J48m00
$$ -337 -509 206 -96 -1096 -173 501 -938 -619 559 -379 -1155 297 402 -681 -331 62 210 -190
1368a90r7K40K48n04j25Q63p4j226O89Q82r05k82Q78j10n58J49P31j87q88K96
$$ -190 -287 -47 201 -303 -428 435 361 -865 -176 706 -199 -481 397 287 -271 -122 609 422 -466 -170
1388a70Q17o13j61K37K63l94j82N38K19p03j25M39K57m94k73Q86j19r00M47P31
$$ -170 647 34 -127 110 373 -21 -203 335 554 -149 -274 165 422 -72 -345 541 422 -478 -31 700
1408G00j005k83R24K5q58J29P05j83l09K68r4N2j19k59M87J36q89M35Q35p98p04
$$ 700 -305 -588 336 361 -497 -368 337 154 -155 113 19 71 -48 -307 180 316 -573 -138 697 -101 -805
1429h05J346O4j414N36J049r70n12R06j4l13J2K37R9j92m8L3M72l42l43N29M48
$$ -805 541 605 -809 -273 776 -194 -706 200 186 -127 -115 122 221 29 -19 14 486 144 -199 330 778
1450G78r84j51J185m86p86Q59M73j135R6P39j74o46M85M08m52q2m2M42j26l94
$$ 778 -206 -357 828 342 -444 415 888 -247 -151 588 414 -232 253 661 209 127 85 527 401 7
1470GK02L87l41m30L65N09n01m57P64Q9j067L71Q54n43o55N96L99q26j48O97k16
$$ 7 209 596 255 -175 190 699 198 -259 505 594 -473 -102 752 209 -446 150 549 -277 -425 272 56
1491E6k31j75L32k0l26N9N18n09l16J96N97l96o59M79N55q77K4P44k25o43R6N42
$$ 56 -175 -350 -18 -38 -364 -305 213 -296 -612 -416 181 -215 -874 -395 160 -717 -693 51 -174 -817 -721 -179
1513a79k36l82J94N04m50q8K70J71k28l37M59K58o33k9Q15j77o18J44O72k82o14
$$ -179 -415 -797 -603 -99 -549 -637 -367 -196 -424 -761 -302 -44 -677 -706 109 -68 -686 -542 130 -152 -766
1534g66N90K97m66k4M99J03m28j95P12o6o61M37O28p50j78P03K27p05K5O33j27
$$ -766 -176 121 -345 -369 130 233 -195 -390 322 256 -405 32 660 -90 -268 435 662 -43 -18 615 488
1555D88k50q9L30K65n15k23P62Oq70O66L80p18l19J006j30q05L15O45n81j93M36
$$ 488 238 149 479 744 229 6 768 774 -96 570 950 232 -87 919 789 -16 299 944 363 170 606
1576F06k26o2M4r3N17j72m78j8P59m50n71N71K25r83L11P37m61p01N90M74p55
$$ 606 380 318 362 269 786 614 136 118 877 427 -144 427 652 -331 -20 717 256 -445 145 619 -136
1597a36k05Q27l18n35M70K55m11j34o5J65K75l40m56N79J85q72Q4J053p02q12
$$ -136 -341 486 168 -367 103 358 -53 -187 -252 -87 188 -152 -608 -29 156 -716 -632 421 -281 -1093
1617a093J539J65j586O43Q25q74j74J035o61o81Q78M3m70N78n27o21J543k02j284
$$ -1093 446 611 -975 -332 493 -381 -555 480 -181 -862 16 59 -411 167 -360 -981 562 360 -924
1636i24J016M38j686P21J570j413r47J866k66j285J355j45j114R39K06o91O03
$$ -924 92 530 -1156 -435 1135 -278 -1225 641 375 -910 445 300 -814 125 331 -360 243
1653B43J70j325R68P75j297Q2J365q63q62J684k52j666R88O37j183J43R91n75
$$ 243 413 -912 56 831 -466 -384 981 118 -744 940 688 -978 10 647 -536 -393 598 23
1671B3j65J35m23O28M04p21k80Q21l77o03J229j72j408M19J015m55l29K72R9o54
$$ 23 -142 -7 -430 198 602 -119 -399 422 45 -558 671 499 -909 -490 525 70 -259 13 112 -542
1691e42L61N84l38n82J08M51L00k45n09J62K93j98R4L33k11q43O59J085j003r24
$$ -542 -181 403 65 -517 -409 42 342 97 -412 -250 43 -155 -61 272 61 -782 -123 962 -41 -965
1711i65J343k09q89R85K70j103J35J132n19k77M92r04M85R60j002n08J296n00
$$ -965 378 169 -720 265 535 -568 -433 699 180 -97 395 -509 -24 936 -66 -574 722 222
1729B22j148J931mk026O55J691j580n6J314j026q15J737m20j002J088n78p86J527
$$ 222 -926 1005 1001 -1025 -370 1321 -259 -315 999 -27 -842 895 475 -527 561 -17 -803 724
1747G24k2j676J358O46k090R38J952k151o96J979n77j379J762j3j821R60O38j071
$$ 724 702 -974 384 1030 -1060 -122 1830 -321 -1017 962 385 -994 768 755 -1066 -106 532 -539
1765e39P08J80j089L59J251j240k51J486j127r81K044n7j765Q68O17j035O4J173
$$ -539 169 349 -740 -381 870 -370 -621 865 -262 -1243 801 744 -1021 -153 464 -571 -507 666
1783F66q35n83P20J21l54N24m97n25Q46l4n42L89M36q91R3J168o29r29J100J88
$$ 666 -169 -752 -32 89 -265 259 -238 -763 83 49 -493 -104 332 -559 -466 702 73 -856 244 432
1803D32q30K35P01m07o25P68K35q38L96K61m27J06L22n99N20M01r49M6J171q53
$$ 432 -398 -163 538 131 -494 274 509 -329 67 328 -99 7 329 -270 250 651 -298 -252 919 66
1823F6o96J233J23j432P80R43j336p7J247q66m91J072k31n23P36m37n23R87q7
$$ 66 -630 603 726 -706 74 1017 -319 -396 851 -15 -506 566 335 -188 548 111 -412 575 488
1842D88j060J026L79j501K80J579j536l61J565p05r41J144L57j189L29L87o91
$$ 488 -572 454 833 -668 -388 1191 -345 -706 859 154 -787 357 714 -475 -146 241 -450
1859d50M82L32r34M80M94j055J52R63q78l83J190q1j126O35N34q68J87M61l73
$$ -450 32 364 -570 -90 404 -651 -499 464 -414 -797 393 312 -814 -179 355 -513 -326 135 -238
1878b38j58L58k71K24J55n10J79L84n48M0N26M0q97M84M94n70j93P71k57m72L17
$$ -238 -396 -38 -309 -85 70 -440 -261 123 -425 -385 141 181 -716 -232 262 -308 -501 270 13 -459 -142
1899a42N43k63m15J81L19j51k59K0L57p2j52Q4L37m77j59L88K80n36j24P06j97
$$ -142 401 138 -277 -96 223 72 -187 -167 190 118 -34 50 387 -90 -249 139 419 -117 -241 465 268
1920B68o59M92L60o85J10K92k7k5Mk58L24l3l71L13J27l44k15O82m6q32M49O81
$$ 268 -391 101 461 -224 -114 178 151 126 130 -128 196 163 -208 105 232 -112 -327 355 309 -523 -74 607
1942F07q47P4M07p8m63L01M77o87N2O1J37J04l60o8L72J04o08L73M35o69j87O87
$$ 607 -240 -166 241 163 -300 1 478 -209 -157 -96 41 145 -215 -283 89 193 -415 -42 393 -276 -463 224
1964B24N9p71L60M81m15k15L26j87k4N2mK37k40j19M16J1k71j94N39L9n86K72
$$ 224 283 -488 -128 353 -62 -277 49 -138 -162 -110 -114 123 -117 -236 180 191 -80 -274 265 304 -282 -10
1986a0N71m36l52N12J27m03Q3K52O2o04K96M50k87k07O7K76j57j59Q7L79m87L5
$$ -10 561 125 -227 285 412 9 92 344 406 -198 98 548 261 54 121 397 240 81 168 547 60 95
2008I5K21K74n37j7M18L4n37J50K95k41r1K53L4k91j92M36J25m26N5K24j4m64
$$ 95 316 590 53 36 454 488 -49 101 396 155 64 317 351 60 -132 304 429 3 58 282 268 -196
2030a96J73K99j42k88J23K34k42k90K37K48k83m4M36l07k24p5L86j46k11J71K35
$$ -196 -23 276 134 -154 -31 203 -39 -329 -92 156 -127 -171 265 -42 -266 -341 45 -101 -312 -141 94
2051I4k18k15J98Q3m15M9L23R1m07J2K56r9j63J90J63p2k57K93J92n92K02K56
$$ 94 -124 -339 -141 -58 -473 -424 -101 -10 -417 -405 -149 -248 -411 -221 -58 -130 -387 -94 98 -494 -292 -36
2073c6P8l55j6N00n2m90M39K19n15j01M13J83k66l43K04J47j12m0L14j2m13N6
$$ -36 42 -313 -329 171 119 -371 68 287 -228 -329 84 267 1 -342 -138 9 -103 -143 171 159 -254 -198
2095a98N76k34m51M69J83l40R1K42j18l83J00N09l02j57J03J70j13k35J21K24
$$ -198 378 144 -307 162 345 5 96 338 220 -163 -63 446 144 -13 90 260 147 -88 33 257
2115B57l9k88L72q6k48j35M05l1n56J21N24l36m8J61M1k18j13K47J74l32o9J45
$$ 257 218 -70 302 216 -32 -167 238 207 -349 -228 296 -40 -88 73 114 -104 -217 30 204 -128 -197 -52
2137e2J10k02r4L15L4n48M69K32l48l25O51k00m36j8O49j96o16N73L0j33j96K17
$$ -52 58 -144 -238 77 111 -437 32 264 -84 -409 242 42 -394 -412 237 41 -575 -2 28 -105 -301 -84
2159h4J05M7k77R7J95j17l19K33M90o93K1P43n00l76N42L66o07p0M15Nk62J16
$$ -84 21 68 -209 -112 83 -34 -353 -120 370 -323 -302 441 -59 -435 107 473 -134 -204 211 216 -46 70
2181G0k11L04k0k34K59K83n53j15P04o7o63N02J01m90O5O13k18n24M06P2k39O8
$$ 70 -141 163 143 -91 168 451 -102 -217 487 420 -243 259 360 -130 -65 548 330 -194 212 284 45 113
2203A13O0M4m0j62q6N06l50k77L74K89m87k35N65O0o32K49L04j38l09L63M0n50
$$ 113 173 217 177 15 -71 435 85 -192 182 471 -16 -251 314 374 -258 -9 295 157 -152 211 251 -299
2225b99J18K93M2k50r0L74l0k65l7L93j3m97J35K64l3n61L16L60p06N22N50q51
$$ -299 -181 112 154 -96 -186 188 158 -107 -144 249 236 -261 -126 138 105 -456 -140 220 -486 36 586 -265
2247b65j48M74j57j5Q2j4r5J87k60R3M24l90n43P60M64r67J35O67n61l98Q21m4
$$ -265 -413 61 -96 -111 -29 -43 -138 49 -211 -118 306 -84 -627 133 597 -370 -235 432 -129 -527 294 250
2269B50m72J63L24m61Q9J90j0L0K17p60M56M87p96j16J018n55n31P46m0o33K62
$$ 250 -222 -59 265 -196 -107 83 73 103 320 -440 16 503 -293 -409 609 54 -477 269 229 -404 -142
2290a42N65n46m7L40j62j60L48m26K23K10k85j13O50k68o87M66L89o69m1P28m11
$$ -142 423 -123 -170 170 8 -152 196 -230 -7 203 -82 -195 455 187 -500 -34 355 -314 -355 373 -38
2311c8m68P49j49m39J35OL24j81p5j56K47Q1k63J00M05m79j82O11no50J26O03
$$ -38 -506 243 94 -345 -210 -204 120 -61 -136 -292 -45 36 -227 -127 278 -201 -383 228 223 -427 -301 302
2333C02m21k71N50j2o82L86O28m12k86R0jQ1K22k59r8L03k04O2M72k79n83M21
$$ 302 -119 -390 160 148 -534 -148 480 68 -218 -128 -129 -48 174 -85 -183 120 -84 -22 450 171 -412 9
2355IN94p78M2N26m40k74O12m8n26K55K32k25J21J40m14M85j29l67M07L91p53
$$ 9 603 -175 -133 393 -47 -321 291 243 -283 -28 204 -21 100 240 -174 311 182 -185 222 613 -140
2376a40J02O22o20k71O55n2o66L28N78n11k01M48m03J01J70q1M1J10m85j53R04
$$ -140 -38 584 -36 -307 348 296 -370 -42 536 25 -176 272 -131 -30 140 59 100 210 -275 -428 476
2397D76l19m82L66K52q22M29N67m56l87L46K78k75j5k2p5J22K8j65J53l2m23O70
$$ 476 157 -325 41 293 -529 -100 467 11 -376 -30 248 -27 -42 -64 -139 -17 11 -154 -1 -33 -456 214
2419B14J42p16J04L97j59j72L51J23n50k10O87j14k73L1J0J48j53q9K06O1j80
$$ 214 356 -360 -256 141 -18 -190 161 284 -266 -476 211 97 -176 -145 -135 13 -140 -229 -23 38 -142
2440a42J01K64o1m11J39M53m34k81M50k8k99K45L26l72j04K57J40k02j24J71O8
$$ -142 -41 223 162 -249 -110 343 -91 -372 78 50 -249 -4 322 -50 -154 103 243 41 -83 88 156
2461A56o3j55k4L41j70k99K83L60o70O1N52k29l89K83K21n44K43J62M5l00M3J59
$$ 156 93 -62 -86 255 85 -214 69 429 -241 -180 372 143 -246 37 258 -286 -43 119 164 -136 -93 66
2483F6pk82j2K13O8m69K88M15k55l01L82O2n86K99K62k58l25N12m9j93L1m4J53
$$ 66 59 -223 -235 -22 46 -423 -135 280 25 -276 106 168 -418 -119 143 -115 -440 72 23 -170 -139 -183 -30
2506c0N0j55k8L19k56l27L94K88l26q1O53n56k12L48L02l67j88L32p0k02p5K75
$$ -30 20 -135 -163 156 -100 -427 -33 255 -71 -152 501 -55 -267 81 383 16 -172 160 90 -112 -187 88
2528H8J1n13J93M36k29oj69M75k23l22K53J93k60qJ65K66m83lL26M0l43J05J82
$$ 88 99 -414 -221 215 -14 -20 -189 286 63 -259 -6 187 -73 -81 84 350 -133 -136 190 230 -113 -8 174
2551A74j47j28J46J83j54j64K27K55k84l17M08Q2l06l8M40k45k03J26K15m10m7
$$ 174 27 -101 45 228 74 -90 137 392 108 -209 199 281 -25 -63 377 132 -71 55 270 -140 -187
2572a87K28P3j20k70K12J08j53J15J37j87q1p5M36m05N8J33P3j77l4O8J15k66
$$ -187 41 114 -6 -276 -64 44 -109 6 143 -44 -125 -200 236 -169 -111 22 95 -82 -116 -48 67 -199
2594a99o1M99l48r5QK80p3j90K74K6k72j14J97K07k69m2K85m9l16K25K65k81r2
$$ -199 -260 239 -109 -204 -196 84 11 -179 95 121 -151 -265 -68 139 -130 -172 113 64 -252 -27 238 -43 -135
2617a35K23J3j20j77M98N1l73OK37m5k25n5L79k35k04L72Q0j87j18K14L4l22j30
$$ -135 88 101 -19 -196 302 353 -20 -14 223 178 -47 -102 277 42 -162 210 290 103 -15 199 233 -89 -219
2640b19M71o9k27J7J64K8j60P1K28m33O5L05lk06j09K95J7l38J80K12k19j76n
$$ -219 252 183 -44 -27 137 165 5 76 304 -129 -64 241 238 32 -77 218 235 -103 77 289 70 -106 -111
2663a11J84k17m2K38J17k35j06K49K5l17L4K17j30k97K66J09k35K5P9J82k95J9
$$ -111 73 -144 -186 52 169 -66 -172 77 102 -215 -181 36 -94 -391 -125 -16 -251 -226 -147 35 -260 -241
2685b41L33k26k45K27J34O5l38j22M51j66k30L24O5l8l03L26L8k53nL11j12k40
$$ -241 92 -134 -379 -152 -18 47 -291 -413 38 -128 -358 -34 31 -7 -310 16 54 -199 -204 107 -5 -245
2707b45J48J85k56k20L41L10k07k58K58J06l80J68K75J8l52%K71j23L0k2K56m45
$$ -245 -97 88 -168 -388 -47 263 56 -202 56 162 -218 -50 225 243 -109 -109 162 39 69 47 303 -142
2729a42j9N36M2m36LK17q5j93J32K81l51JJ18M35n23n0K46R4l38q5M69k65k36
$$ -142 -161 375 417 -19 -16 201 116 -77 55 336 -15 -14 104 539 16 -34 212 306 -32 -117 352 87 -149
2752a49q4M11k05o2P2L64n51J28K81J7k25k44K28K06k90N6J41p3l08L58K22k79
$$ -149 -233 178 -27 -89 -17 347 -204 -76 205 222 -3 -247 -19 187 -103 -47 94 21 -287 71 293 14
2774A4l42L89M9j63l8N3P1l24K51L1J68k95J17P2N7m11J17L72k63k77M81J28m28
$$ 14 -328 61 110 -53 -91 -38 33 -291 -40 -9 159 -136 -19 53 110 -301 -184 188 -75 -352 129 257 -171
2797a71R9J83j93QJ72R1k79j42M46l3l06k15L27L68j64m95L69M8m35M13J64k25
$$ -171 -72 111 -82 -74 98 189 -90 -232 214 181 -125 -340 -13 355 191 -304 65 113 -322 91 255 30
2819C0l30L02J21m5m06M46j04p5J42J7K2k08PK98j6m65J20L30o7k98K57L8l20
$$ 30 -300 2 123 78 -328 118 14 -61 81 98 120 -88 -81 217 201 -264 -144 186 119 -179 78 116 -204
2842b04p8M17P2l76K77o1j85M2K2J75j36k68L27K0r0k15K21K29m79J24L51L5n50
$$ -204 -282 135 207 -169 108 47 -138 -96 -74 101 -35 -303 24 44 -46 -261 -40 189 -290 -166 185 220 -330
2865c30J86L68k84k42J65J25j81J34K63j93j73o1J30K98k70j00L37n3l93K38L96
$$ -330 -144 224 -60 -302 -137 -12 -193 -59 204 11 -162 -223 -93 205 -65 -165 172 119 -274 -36 360
2886C60m24m25N95k1l32K98K5r7n8K06j09K2j52q3L88N8m3l71N51l55k08M87j20
$$ 360 -64 -489 106 85 -247 51 76 -21 -79 127 18 40 -112 -195 193 251 208 -163 388 33 -175 312 192
2909A92m13L82K42l10k86J54P5q7J20J82k24j27L5Q0L11l88k69N00J6k06o2K46
$$ 192 -221 161 403 93 -193 -39 36 -51 69 251 27 -100 -65 15 326 -62 -331 169 185 -21 -83 163
2931A63l57p8L78J23l69j33M16j27j33R2P8j73q4J58J04l1k77P5K45Jm22M36J5
$$ 163 -194 -272 106 229 -140 -273 143 16 -117 -25 53 -120 -204 -46 58 27 -250 -175 70 71 -351 85 100
2954A00m88K29L69k35j67J50J51j2k97J59K53k95k2J21J46l26q8K11J18k96L9
$$ 100 -388 -159 210 -25 -192 -42 109 97 -200 -41 212 -83 -105 16 162 -164 -252 -41 77 -219 -180
2975a80M46l0m90K31J68k82j53M54m3m14K97K35p4o7k33L13p7j22m2K52j79l13
$$ -180 266 236 -254 -23 145 -137 -290 164 121 -293 4 239 165 98 -135 178 101 -21 -63 189 10 -303
2997c03L65J70l65J28K79Mn01M39J60l93lK32P8k23j07j7K37n4j86K5K54k27J21
$$ -303 62 232 -133 -5 274 278 -223 216 376 -17 -20 212 290 67 -40 -57 180 126 -60 -35 219 -8 113
3020A13J82k48k91K77K25k41k45K57R9K4k61J39P0p5j98K26o2q5pJ17J99l18N0
$$ 113 295 47 -244 33 258 17 -228 29 128 152 -109 30 100 25 -173 53 -9 -94 -101 16 215 -103 -53
3043e3L15k89l76M10J46l61k6L45rk28J73K23k72k68J73L30k16p7j06K86k63n1
$$ -53 262 -27 -403 7 153 -208 -234 111 102 -126 47 270 -2 -270 -97 233 17 -60 -166 120 -143 -194
3065a94K63Qj82j62K11J27l01K37K11k20m9K86J06k85j10J84p4k06K03J98q9k12
$$ -194 69 77 -105 -267 -56 71 -230 7 218 -2 -51 235 341 56 -54 130 56 -150 53 251 162 -50
3087e0j28M32j88k28K48J14k94P0K08n2l06J67L25k07l30J96L27k27o2K34p7l35
$$ -50 -178 254 66 -162 86 200 -94 -24 184 132 -174 -7 318 111 -219 -23 304 77 15 249 172 -163
3109a63K01J27r0p6m2R8R8k97K6L91k87k50Q3L88k32j86K07K16k79k0K18L4l47
$$ -163 38 165 75 -1 -43 55 153 -144 -118 273 -14 -264 -181 207 -25 -211 -4 212 -67 -87 131 165 -182
3132a82K7L07j27k22K66K58m32l5P0J55k3k36J72O8m03K09K88q1j13j69L59p7
$$ -182 -155 152 25 -197 69 327 -105 -140 -70 85 62 -174 -2 66 -337 -128 160 79 -34 -203 156 79
3154G9k11L78nm23J68J21j69k5k9K01o0j37R7J10r0k09K81J3L0k28L17n0k98K29
$$ 79 -132 246 241 -182 -14 107 -62 -87 -116 85 25 -112 -15 95 5 -204 77 90 120 -108 209 159 -139 90
3178I0N2J36k76J20J66k14k84L05J07m23J01K09J49k53m9K83j55Q7j56K71k16
$$ 90 142 278 2 122 288 74 -210 95 202 -221 -120 89 238 -15 -64 219 64 151 -5 266 50
3199E0j90J40J43j85j75J84Q8n5m9J36J28k69ML52k96j55J81R6k15l23M28K5k08
$$ 50 -140 0 143 -42 -217 -33 55 0 -49 87 215 -54 -50 302 6 -149 32 128 -87 -410 18 43 -165
3222a65R6K54p3k23L2K59n2l93R2L14j94q2R8K06p7k79L94j08k26O6L28k96K4
$$ -165 -69 185 112 -111 -79 180 128 -265 -173 141 -53 -135 -37 169 92 -187 207 99 -127 -61 267 -29 -5
3245eK7M7n2l35K31J21po6L5J01m70L44L9J16j98OK83k77j05J65J70k38m3J57
$$ -5 22 69 17 -318 -87 34 27 -39 -4 97 -373 -29 10 126 -72 -66 217 -60 -165 0 170 -68 -111 46
3269D6K19m44Q5Q6J46j80J25J74l03l0MK06m0k25k5K45j69lK27j3j80o5L21j82
$$ 46 265 -179 -94 -8 138 -42 83 257 -46 -76 -72 134 94 -131 -156 89 -80 -83 144 131 -49 -114 207 25
3293B5r1K04m6o9k57N23k04j49j48M62Rl50J17j6j12j71L87J33l19j15L5K16m5
$$ 25 -66 138 92 23 -234 289 85 -64 -212 250 259 -91 26 10 -102 -273 114 247 -72 -187 -152 64 19
3316A9r1P7N8j65P1J64j76o6J64Q6j32p3q1J95k27K02m8J87j09j80J90J31k44
$$ 19 -72 5 63 -102 -31 133 -43 -109 55 141 9 -64 -145 50 -177 25 -23 164 55 -125 65 196 -48
3339d8M0K62q6j89RK81l01j13M47mk01n1K14k49l33L96J07mk98J11L74m00J07
$$ -48 -8 254 168 -21 -12 269 -32 -145 302 298 97 46 260 11 -322 74 181 177 -121 -10 364 -36 71
3362G1N6O6j67M6N9J06l62J12J05p8k09K12O4n3j19J98J16m68J31J03J58j28k64
$$ 71 127 193 26 72 131 237 -125 -13 92 14 -195 17 81 28 -91 107 223 -245 -114 -11 147 19 -245
3385b45L01k0k85J32K60j64k62K56J70k16j68K21j10r8J51K35k43p6J61J46j27
$$ -245 56 36 -249 -117 143 -21 -283 -27 143 -73 -241 -20 -130 -228 -77 158 -85 -161 0 146 19
3406A9j99J82n2j41o0K53J34j97k5K58q4l25M8K19n3o6J1K03l09J67k6K83j55
$$ 19 -180 2 -50 -191 -251 2 136 -61 -86 172 88 -237 -189 30 -23 -89 -78 125 -184 -17 -43 240 85
3429H5j59K02j22j88J25L27j22j53N1J72k59p2Q9J48j51PKK44k77J65J54j07k59
$$ 85 -74 128 6 -182 -57 270 148 -5 46 218 -41 -113 -24 124 -27 -20 -18 226 -51 114 268 161 -98
3452i8J51P6m9j45K20O1j96j9Q7L4j00j89K96L1r5j95K88l25P3L04l43p2O1L14
$$ -98 53 129 80 -65 155 216 20 1 88 122 22 -167 129 160 65 -130 158 -167 -94 210 -133 -205 -144 170
3476A70j91j25pL16r1k58k7K23jk87L01Q3m80J41K67p4q3J9J05l8j31J05K11k75
$$ 170 -21 -146 -153 163 72 -186 -213 10 9 -278 23 106 -374 -233 34 -40 -123 -104 1 -37 -168 -63 148 -127
3500a27l3J34K24k44k41M13n8l9j34L04j41k94K41K74k07j71J61K0j20k5J75J34
$$ -127 -160 -26 198 -46 -287 126 68 29 -105 199 58 -236 5 279 72 -99 62 82 -38 -63 112 246
3522B46m00j94N32P1k52j10K51j45l20K06J77L8J3P4J7j58j61K77M7l49MK80j03
$$ 246 -154 -348 184 255 3 -107 144 -1 -321 -115 62 100 113 187 204 46 -115 162 209 -140 -136 144 41
3545D1j76L44O8k57k36L08J45k23nL0J34q3m03L35J68m56L63Nn2k72J86K25j85
$$ 41 -135 209 277 20 -216 92 237 14 9 39 173 90 -313 22 190 -266 97 102 50 -222 -36 189 4
3568Dj69K21m8J2j18M3J60k14M8L8J22l86K53J83k60n3L03N1k91MK86j96j97M
$$ 4 -165 56 8 20 -98 -55 105 -109 -61 -23 99 -287 -34 149 -111 -164 139 190 -101 -97 189 -7 -204 -200
3592b00K50n5k08R1K38j14k33J73J94k68Q6K22l3k14Q2R3m6j53K3M02l66q3K97
$$ -200 50 -5 -213 -122 116 2 -231 -58 136 -132 -46 176 143 -71 11 104 58 -95 -72 330 -36 -119 178
3615A78J6k64o8K53j9k43r7L59L1k82J51P6Qj41m1K57j50p8J61pk66J08J43Q5
$$ 178 194 -70 -138 115 96 -147 -244 115 146 -136 15 91 99 -42 -83 174 24 -54 107 100 -166 -58 85 170
3639A70k23pJ08J47j21%O5j03q6K4J92j20p1R4J28l74R7K46q8m60L32K17l97M4
$$ 170 -53 -60 48 195 74 74 139 36 -50 -26 166 46 -25 69 197 -177 -80 166 78 -382 -50 167 -230 -186
3663a86K68O9k99p0L73m5j50r2K09k27r1K73l6k13l4K45J4J6j80J44J8j3l0K8
$$ -186 82 151 -148 -218 155 110 -40 -132 77 -150 -241 32 -4 -217 -251 -6 8 24 -156 -12 6 -7 -37 -9
3687iM6j17m3L39j28k20K07j50J82k14K50n8j07o3J62j26P3j6N0J26m16K38rP3
$$ -9 37 -80 -123 216 88 -132 75 -75 107 -107 143 85 -22 -85 77 -49 24 8 58 184 -232 6 -3 70
3711G0j89K10Ok48J22Q0j9j67M7K56r8o6K40j07j05j40J85m8N3J28k15J21j16
$$ 70 -119 91 97 -151 -29 51 32 -135 -88 168 70 4 244 137 32 -108 77 29 82 210 -5 116 0
3734@n7K59k12l8J86o6k5j08J13k9j94R2J08Q2k69J58O6p9r0j8KJ23p5j9K13k13
$$ 0 -57 202 -10 -48 138 72 47 -61 52 23 -171 -79 29 111 -158 0 66 -13 -103 -121 -119 4 -71 -90 123 -90
3760i0j01K53J1k89J29K55k96j52K91m4j7j11J80P2p6k43K47j33l3J09J36k1j17
$$ -90 -191 62 73 -216 -87 168 -128 -280 11 -33 -50 -161 19 91 15 -228 19 -114 -147 -38 98 77 -40
3783d0Q1Nq8o1J51j49J07m2Q6N8k41J42K5J32l26k2M17j67m3J67r9j35K6N4J83
$$ -40 41 46 -42 -103 48 -101 6 -36 50 108 -133 9 34 166 -160 -182 235 68 25 192 93 -42 -16 38 221
3808B21k54k07K31J10j54J16J61j65rm5J34q0j72M34j88j68j35L93n3j71p5J02
$$ 221 -33 -240 -9 101 -53 63 224 59 50 5 139 59 -113 321 133 -35 -170 223 170 -1 -76 26
3830B6m7J5l7mn2Q7J09j0k39j32L01O7k20j30M35k17j64P1L15j26j21n4K80k59
$$ 26 -21 -6 -43 -47 -99 -12 97 87 -152 -284 17 84 -136 -266 169 -48 -212 -141 174 48 -73 -127 153 -106
3854a06j13K12J35j47j56J19J4j84R6J22J8N8j3Qk82K54k29K72j94j6J38J94l56
$$ -106 -219 -7 128 -19 -175 -56 -42 -226 -130 -8 10 68 55 63 -219 35 -194 78 -116 -132 6 200 -156
3877a56J71J3P8k29L15o4k11k4K23j07L4o2O5J0k00Q0K02mk81K29Q0P8k97J64
$$ -156 15 28 106 -123 192 128 -83 -107 116 9 43 -19 46 56 -144 -64 138 134 -147 82 162 240 -57 107
3901A07J1j67K12Mk14NJ35n5j3j19K10j4j43K4J61j24j42OL46Rl28J92l6o7l7
$$ 107 118 -49 163 167 -47 -42 93 38 25 -94 116 102 -41 -17 144 20 -122 -116 230 239 -89 103 67 0 -37
3926c7P4J91k36j65K27K2j17J34j36K28j91l6L6j19k7M6R1P2q9o4K49k05r5K67
$$ -37 37 228 -8 -173 54 76 -41 93 -43 185 -6 -42 -6 -125 -152 -106 -15 57 -32 -96 153 -52 -147 120
3950A20j03k24Q6J70Mq1k14M91k74j34J83J7l10J93J18Kj99J27J17Kk46L1L02
$$ 120 17 -207 -121 49 53 -28 -242 249 -25 -159 24 41 -269 -76 42 44 -155 -28 89 91 -155 -124 178
3973A78q0k33K15J35l33l0j7K61j57P8j06J77j68J43J54j05l83L87j75M0j09J36
$$ 178 98 -135 80 215 -118 -148 -165 96 -61 17 -89 88 -80 63 217 112 -271 116 -59 -19 -128 8
3995HJ64j70j1J97j16r5J4K35n5k38Q1J03m0l18L15M7k18J81oJ77l33k07K41J24
$$ 8 172 2 -9 188 72 -23 -9 226 171 -67 14 117 77 -241 74 121 -97 84 78 255 -78 -285 -44 80
4019H0k74J03J59N0l84R2K29k28K16M2L2j55k5L00p5k72N2K61j52j74K67k16Q6
$$ 80 -194 -91 68 118 -266 -174 55 -173 43 85 117 -38 -63 237 162 -110 -58 203 51 -123 144 -72 14
4042A4j18M1K14m44K02K07m2j05Q1r9M1M4j56L80l86K4J31L5o9J29j29J25o1j6
$$ 14 -104 -63 151 -293 -91 116 74 -31 50 -49 -8 36 -120 260 -126 -102 29 64 -5 124 -5 120 59 43
4066D3J04m9j20J9J07K5k55J36J36k00J4K57j32j09qJ9J50n8o8P4j81M7M7RK0
$$ 43 147 98 -22 -3 104 129 -126 10 146 -54 -40 217 85 -24 -32 -13 137 79 11 85 -96 -49 -2 7 27
4091B7o0J80R7j40k09J50O8j91J04J30j70j3J09Q1k64l3J72J37j77l3M2N1j89
$$ 27 -33 147 244 104 -105 45 113 -78 26 156 -14 -27 82 163 -101 -134 38 175 -2 -35 7 58 -131
4114a31J43M0n3N3r5j03m0m3J82J77k36j00L01q1j9r0L8%q7n6J50j39LJ2K92j27
$$ -131 12 52 -1 52 -43 -146 -186 -229 -47 130 -106 -206 95 14 -5 -95 -57 -57 -144 -200 -50 -189 -186 -174 118 -9
4140ij73K12J28l26j3L90n3k23m8R4J03m6K10l81N4PJ7J74p2LM0jl04K88J08Q
$$ -9 -182 30 158 -168 -181 209 156 -67 -115 -21 82 36 246 -135 -81 -74 -57 117 45 48 88 87 -217 71 179 187
4166A87k27J43jj25JJ9J07o9j47K53n2l19K45J23O2j85j26K78p1K9j22p1M8oO7
$$ 187 -40 103 102 -23 -22 -3 104 35 -112 141 89 -230 15 138 200 15 -111 167 96 125 3 -68 -20 -26 41
4191D1j04p1J5K23k13K5L8J0L00l91N4M3k72K66K8j00M5Q2k7M0l8L9J28j95j25
$$ 41 -63 -134 -119 104 -109 -84 -46 -36 264 -127 -73 -30 -302 -36 -8 -108 -63 19 -8 32 -6 33 161 -34 -159
4216a59J55k3j6j47J20K85l59J36N3j13O0L7J17k54nR8J91j18j53K21j34K7j38
$$ -159 -4 -27 -43 -190 -70 215 -144 -8 45 -68 -8 29 146 -108 -113 -15 176 58 -95 126 -8 19 -119
4239a19J27J28j91P5J3L2j66M3K02q9N9O0Jm01J91Q8J35k68q8J38J01l6O3J00
$$ -119 8 136 -55 20 33 65 -101 -58 144 55 114 174 175 -226 -35 53 188 -80 -168 -30 71 35 98 198
4263A98k86K0O6J28l11j1J93l0k1R4N1l6k25J18K46m15J23P0K14m59J18Q3Pn5
$$ 198 -88 -68 -2 126 -185 -196 -3 -33 -54 40 91 55 -170 -52 194 -221 -98 -28 186 -273 -155 -72 -65 -120
4287a20qK90p8j63J67KM1j48n1J32j35j02K45J2k61K39j06P1j51m2Q6J60j65J43
$$ -120 -128 162 84 -79 88 90 131 -17 -68 64 -71 -173 72 84 -177 62 -44 27 -124 -166 -80 80 -85 58
4311E8l6j26R9Mj83K02j10J90J54k70l7P0Jk07J66O7m2rQ5j81P6l0J28J3K5j14
$$ 58 22 -104 -5 -1 -184 18 -92 98 252 -18 -55 15 16 -191 -25 42 0 -9 76 -105 -29 -59 69 82 107 -7
4337gLJ15k25P0J53o8J10j00J32q4p3O8j3j47J21K26j75j80L3J48p0pj57L72k31
$$ -7 -4 111 -114 -44 109 41 151 51 183 99 26 94 81 -66 55 281 106 -74 -41 107 37 30 -127 245 14
4362A4n0m6K87j91j04OJ77k50J41K30j09l57K84q7O9RM9P3j16n7k7l6P7J07k02
$$ 14 -36 -82 205 14 -90 -84 93 -157 -16 214 105 -252 32 -55 14 23 72 145 29 -28 -55 -91 -14 93 -109
4387a09J24p5Rk0J06k18J31M3p0j01K20l3r2l8N7Q4l7k3J43n5j63K65j93j23N3
$$ -109 15 -60 -51 -71 35 -183 -52 -9 -79 -180 40 7 -85 -123 -66 18 -19 -42 101 46 -117 148 -45 -168 -115
4412a15pM7l5M1J52M0m8l1J02j76O2j02K01m1j01J91j43Kl5J55q7j45J27J03j19
$$ -115 -122 -75 -110 -69 83 123 75 44 146 -30 32 -70 131 90 -11 180 37 39 4 159 72 -73 54 157 38
4437C8k9K34k05J27j38o5J33j09L4j6J21k32J99m3r9RQ9P0q6mK55k71Q8l86M39
$$ 38 9 243 38 165 27 -38 95 -14 20 4 125 -107 92 49 -50 -41 48 118 32 28 283 12 100 -286 153
4462A53j10q6m1P5ol93L59K07r3j37K03r7j95J33j32J36j6l9Q8m7j91J66K58j26
$$ 153 43 -43 -84 -9 -15 -408 -49 158 65 -72 131 34 -161 -28 -160 -24 -40 -79 9 -38 -229 -63 195 69
4486F9k08N6K03j32r9P9P2k20J03K05p1j85J85j00J1R4L2k17K29l4M7j22n2O9
$$ 69 -139 -83 120 -12 -111 -32 40 -180 -77 128 57 -128 57 -43 -32 62 94 -123 106 72 119 -3 -55 14
4510A4J36r6k28J50J15j63j3J01K32q5k28K35j16j74O6J19j9j2l8n9K02k68K01
$$ 14 150 54 -174 -24 91 -72 -85 16 248 163 -65 170 54 -120 -54 65 46 34 -4 -63 139 -129 72
4533G2J35k90RQ9K00j84%Lp1k8J47J35j07N4k23J23q5q8N5J34O4n6k0M5j77O3
$$ 72 207 -83 -74 15 215 31 31 34 -37 -65 82 217 110 164 -59 64 -21 -109 -54 80 144 88 68 113 -64 -1
4559ap6l8r3J94Q5N3l86J95J5J21m5Q6j51Q4k06n2L27o2j07J70J0l62P8K86k03
$$ -1 -77 -115 -208 -14 71 124 -262 -67 -52 69 24 110 -41 43 -163 -215 112 50 -57 113 123 -239 -161 125 -78
4584g8O4Q7p7j42R0J38k24J79m3M1q9L1o3J17L6k31J13J96k68J09J30j00j05K16
$$ -78 -14 73 -4 -146 -56 82 -142 37 -6 35 -54 -23 -86 31 67 -164 -51 145 -123 -14 116 16 -89 127
4608A27o1%m1J7J27o4j06J29J2j28L8M0J05k21K90l13K33m15K79LL3p7J59q6r7
$$ 127 66 66 25 42 169 105 -1 128 140 12 50 90 195 -26 264 -49 184 -231 48 51 84 7 166 80 -17
4633a7n6K02q6j14Q7l4O3j60L4J62r9j25O3R2j24J19L5k65K36j86L36j66j78J57
$$ -17 -73 129 43 -71 16 -18 45 -115 -81 81 -18 -143 -80 12 -112 7 42 -223 13 -173 163 -3 -181 -24
4657b4k9q0j7J50Pm6O6J03j05j14P3J0R0k87K24J9j50j10K55R6k04pK31j22kk92
$$ -24 -53 -133 -150 0 7 -39 27 130 25 -89 -16 -6 84 -203 21 40 -110 -220 35 131 -73 -80 151 29 27 -265
4683b65L34rq6RM2J33l12J03K29j36r6J81k10J01m8J86n9j05j26Q8j56J76K05
$$ -265 69 60 -26 -17 25 158 -154 -51 178 42 -54 127 -83 18 -30 156 97 -8 -134 -46 -202 -26 179
4706A79r6N4j93J66m7l9o8J77p7j33J04R4j51O2jK15l30J40K79l08K3j75l0J87
$$ 179 83 137 -56 110 63 24 -44 133 56 -77 27 121 -30 32 31 246 -84 56 335 27 50 -125 -155 32
4730C2K9J1j87J22m1l2J20q5K1l2nM4j17K80j30k19J49n1m3J24r7J94n6m2j7j05
$$ 32 61 72 -115 7 -34 -66 54 -31 -10 -42 -47 -3 -120 160 30 -189 -40 -91 -134 -10 -107 87 31 -11 -28 -133
4756a33J19R3m3o7j17J3J46J43k25J2K51j95o4j00L75k33N7MJ18j85P1q5J47k5
$$ -133 -14 79 36 -31 -148 -135 11 154 -71 -59 192 -3 -67 -167 208 -25 32 36 154 -31 40 -45 102 77
4780G7n3L5j56J47J6P6j37o4K47q1k22k6J23R1K2o5q9J73k23J72j58K44L6j63
$$ 77 24 59 -97 50 66 142 5 -59 188 107 -115 -141 -18 73 95 30 -59 114 -109 63 -95 149 185 22
4804B2J4r5O6kq5J39r0J21rj14mJ17n4J2o6P6m8m8%R8j09L1Q2n8j75J61J45j76
$$ 22 36 -59 7 5 -80 59 -31 90 81 -33 -37 80 26 38 -28 48 0 -48 -48 50 -59 -28 54 -4 -179 -18 127 -49
4832d9k0Q3J26l06J11j3O8j37O7J28J7k27J49N5j8j04K05q9o5rJ58r1j21K28k68
$$ -49 -69 14 140 -166 -55 -68 0 -137 -70 58 75 -152 -3 52 34 -70 135 46 -19 -28 130 39 -82 146 -122
4857a22p4N6M3j1L46k69k9J08r7Lk2K15j32k07M59j79j7l0J69j40j39J60M1o7
$$ -122 -196 -140 -97 -108 238 -31 -60 48 -49 -46 -68 147 15 -192 267 88 71 41 210 70 -69 91 132 65
4881F5L2j33O7Mk0J37k09j9P0J30J4k09j03n5L54j02l8N8j27J32p6p9J59p7N6
$$ 65 97 -36 31 35 15 152 -57 -76 -6 124 138 -71 -174 -229 125 23 -15 43 -84 48 -28 -107 52 -25 31
4906C1R7j10r1J09q5j22K2P4nOJ87q7r3J24K4j20p6L5Q4k20P8M9N0k16K61l8p1
$$ 31 128 18 -73 36 -49 -171 -149 -75 -80 -74 113 26 -67 57 81 -39 -115 -80 4 -216 -138 -89 -39 -255 6 -32 -103
4933a03M6j3J1l5p1P4p5K12k11J50J95l92p0K57J06nq0M3J9Q0o5J00k12J96k43
$$ -103 -57 -70 -59 -94 -165 -91 -166 46 -165 -15 180 -212 -282 -25 81 76 -4 39 58 138 73 173 -39 157 -86
4958h6Q6p7J58p7j3J09j8L2j19J92k43J74m2k38R8J30p3mm8P0rm6j49L13j52J1
$$ -86 0 -77 81 4 -9 100 82 114 -5 187 -56 118 76 -162 -64 66 -7 -11 -59 11 2 -44 -193 120 -32 -21
4984b1L33l98J21K4QP0j34k7N2l1%p2J80k38o9J63j4l5K4K69l37NK8n9K48q7l5
$$ -21 312 -86 35 59 67 137 3 -24 28 -3 -3 -75 105 -133 -202 -39 -53 -88 -64 205 -132 -127 -99 -158 90 3 -32
5011c2J10K0j54P3J55j11q4K86l08n7QJ18N7k09J63j58O2j13J68J04k42J44j08
$$ -32 78 98 -56 17 172 61 -23 263 -45 -102 -94 24 81 -128 35 -123 -61 -174 -6 98 -144 0 -108
5034a08R4m1j52L37q7j57PjP0r2K78J9n3k31J97o7P5n6J8K19k81O8j1j8j4J40
$$ -108 -14 -55 -207 130 43 -114 -107 -108 -38 -130 148 167 114 -117 80 13 88 32 50 269 -12 56 45 27 13 153
5060A53j00J96l39K0J22j61J16N4k3j35K60j65o1K2j7m6J51r8J53q7j39P9N1R5
$$ 153 53 249 -90 -70 52 -109 7 61 38 -97 163 -2 -63 -41 -58 -104 47 -51 102 15 -124 -45 6 101
5084A01k59J43O4M2l49J57J23K2j28K11k44M7J37K7k14O9J2j31J65j45K3M0J07
$$ 101 -158 -15 49 91 -258 -101 22 44 -84 127 -117 -70 67 94 -120 -51 -39 -170 -5 -150 -127 -87 20
5107B0j08QJ49k37Q9R4K7j68L8N1ko4RO6Q8j95J06J51k36J83m3L1j1k8k38K75
$$ 20 -88 -80 69 -168 -79 15 42 -126 -88 -37 -39 -103 -94 -28 60 -135 -29 122 -114 69 26 57 46 18 -220 55
5133E5k8J40M1k21j58K13o5p1J10J21m0j63K8J58j19m9o7K60k3j03o5J24P4k82
$$ 55 27 167 208 -13 -171 42 -23 -94 16 137 97 -66 -38 120 1 -48 -115 145 122 19 -46 78 152 -130
5157a30J94J03k12M6O5K7m4j48J61j04N7m4J50l09J49O4kP0o3qp0R9Q2p9J04l89
$$ -130 64 167 -45 1 66 93 49 -99 62 -42 15 -29 121 -188 -39 25 23 93 30 22 -48 51 133 54 158 -231
5183b31K39q0p6J67P3j69j68J91J08n5r7k6J4J92j94L5K69j66k42K54n9lm4R4
$$ -231 8 -72 -148 19 92 -77 -245 -54 54 -1 -98 -124 -110 82 -112 -77 192 26 -216 38 -21 -24 -68 26
5207B6O0o3n0L8ql2J14q3j60J85nJ07k26K0J37j4j6r8J00Mq5l3K5R5n4K2K04k76
$$ 26 86 23 -27 11 3 -29 85 2 -158 27 22 129 -97 -77 60 46 30 -68 32 36 -49 -82 -57 38 -16 6 210 -66
5235f6J46m5jl6p1J85j58K5k0J1J1j09K70J6j15J7rJ51j82J6J54q1j15r8K77l4
$$ -66 80 35 34 -2 -73 112 -46 -21 -41 -30 -19 -128 142 158 43 60 51 202 20 36 190 109 -6 -104 173 139
5261A39j87J13q9J44j80O0M6j16J00Pl6o3R1j58M7N8Q4n9J37k24Q1j3P0p8j44
$$ 139 -48 65 -24 120 -60 0 46 -70 30 37 1 -62 29 -129 -82 -24 60 1 138 -86 -5 -18 52 -26 -170
5286a70O7J46j01M2K2k78O8L66k00K0l9o0K05q5N2O0k41J45p8j9jR0j68J27P2
$$ -170 -103 43 -58 -16 6 -272 -204 162 -38 -18 -57 -117 88 3 55 115 -126 19 -59 -78 -79 11 -157 -30 42
5311D2j34J45K0j48J34j61J17j33J41J02j86M3J00Ln3n9Q7J03n4j62k9L41k41
$$ 42 -92 53 73 -75 59 -102 15 -118 23 125 -61 -18 82 85 32 -27 60 163 109 -53 -82 259 18
5334A8KQ9q6m4M2L5N1j22J59r6m0M9M7k91K64mj77J61m7L1j26Q2j7J82k64Q9N2
$$ 18 20 109 23 -21 21 56 107 -15 144 48 8 57 104 -187 77 73 -104 57 10 41 -85 -3 -20 162 -102 -13 39
5361C9o0j20J45J06j09j91J76p8L9o1j6J57j93R9J16k1q5k3K43j50k42J61k04
$$ 39 -21 -141 4 110 1 -190 -14 -92 -53 -114 -130 27 -166 -67 49 28 -57 -80 163 13 -229 -68 -272
5384b72L41q7k9R7Q4j90l9J80j19k9p9J15nK6k4q9J33q5K34j77r3J04Q0q3M6q3
$$ -272 69 -18 -47 50 134 -56 -95 85 -34 -63 -142 -27 -32 -6 -30 -119 14 -71 163 -14 -107 -3 77 -6 40 -43
5410d3P4K1j38O4J8K4o0Qo5o8j20L16J5k08J18J61p7m6pJ25n0Q9j50j8N4l4k9
$$ -43 31 52 -86 -22 -4 20 -40 -32 -97 -165 -285 31 46 -162 -44 117 40 -6 -13 112 62 151 1 -17 37 3 -26
5437b6N1O5j4j29J81N3j52J49j80q5K48k70Q1L6j8P2j41J24o9jJ50m0k09J10p0
$$ -26 25 90 76 -53 128 181 29 178 -2 -87 161 -109 -28 8 -10 62 -79 45 -24 -25 125 85 -124 -14 -84
5462h4J05J8k03J26p9J85j30L3j66J46Q6j01L6J03j10p2n6P3J26R1j65l2J9K15
$$ -84 21 39 -164 -38 -117 68 -62 -29 -195 -49 37 -64 -28 75 -35 -107 -163 -90 36 127 -38 -70 -51 164
5486A64j32j29K45k57L3k7J85m4o2J07j36O5N1%o7J74k57J1R9l9p5K2n3J32j0
$$ 164 32 -97 148 -109 -76 -103 82 38 -24 83 -53 12 63 63 -4 170 -87 -76 23 -16 -91 -69 -122 10 0
5511@On4LN9J94j19j43j5R6K5O5k09K42j49M2P2l6J0r4M65n15J93q3J69k33k1
$$ 0 6 -48 -45 14 208 89 -54 -69 27 52 117 -92 150 1 43 115 79 89 -5 460 -55 138 55 224 -9 -30
5537c0P2n1m7R0p2J23n7j76J27K2M7J07k50J40k92Q3J49j03r7K44j93N2O9Q9q3
$$ -30 42 -9 -56 34 -38 85 28 -148 -21 1 48 155 -95 45 -247 -164 -15 -118 -215 29 -164 -112 -43 46 -37
5562c7p6kK7M2j31J33K4J80k29J04NJ5k3l5J11j36k4l5K57j23j2Ll0j00J63J19
$$ -37 -113 -115 -88 -46 -177 -44 -20 160 -69 35 40 55 32 -3 108 -28 -52 -87 170 47 35 38 8 -92 71 190
5588A90l16J48L3m4J33k23L35j19Lk5k15N4J05L1r1Q4k04J31o6M5P3l3L3k6j9
$$ 190 -126 22 55 11 144 -79 256 137 140 115 -100 -46 59 90 -1 83 -121 10 -56 -11 62 29 62 36 17
5613A7K0K3p9L5O4Or8O1J8j52K2J20j14L4J86q7j45K35j77L0j28K7P9m7k1J75
$$ 17 37 60 -19 16 80 86 -12 49 67 -85 -63 57 -57 -23 163 76 -69 166 -11 19 -109 -82 -3 -50 -71 104
5639A04j75l7N3l7J01j14K2m0n6QR6k0K72j55lj34P3J54m4j12kQ8j53J81n7j36
$$ 104 -71 -108 -55 -92 9 -105 -83 -123 -179 -171 -75 -95 177 22 19 -115 -42 112 68 -44 -46 42 -111 70 13 -123
5665a23J33qj35l6L10j92j3J01O5j12on9J75j17p2J57L7m8m7k4M5o6P9J62j80
$$ -123 10 2 -133 -169 141 -51 -64 37 102 -10 -16 -75 100 -17 -89 68 105 57 10 -14 31 -35 44 206 26
5690B6j09J12m8Q0mj6N6r9L9j4O5L2r8L6j30J35j19O2K13k30Oj8j28J01J34n6
$$ 26 -83 29 -19 61 57 41 97 -2 37 23 88 120 22 58 -72 63 -56 6 219 -11 -5 -23 -151 -50 84 28
5716B8j42L2J48j34Q6k42L64j07jlj18P7Pj07J67j59j67M86j68p3n2k8J5P2L8
$$ 28 -114 -82 66 -68 18 -224 140 33 32 29 -89 -12 -5 -112 55 -104 -271 215 47 -26 -78 -106 -91 -19 19
5741A9p7r1L22j96J14p8Q2j48P4Jk94L89K7k78J46oJ3j04O2J27p1R0j97J87j65
$$ 19 -58 -149 173 -23 91 13 95 -53 21 22 -272 117 144 -134 12 6 19 -85 -23 104 33 123 -74 113 -52
5766e2J32J8r3O3jJ01m7l10J85J28k29j2M0Q9P8r0N4l3k8P8K4q1o2rk5J40j03
$$ -52 80 98 5 68 67 168 121 -189 -4 124 -105 -117 -77 12 90 0 54 21 -7 71 95 14 -48 -57 -82 58 -45
5793d5j12L04j28j28K18q5j20J1N5JK40k59q6J53m2q6O4K4j06O0rJ30oj08o5n
$$ -45 -157 147 19 -109 109 24 -96 -85 -30 -29 211 -48 -134 19 -23 -109 -45 -21 -127 -67 -76 54 48 -60 -125 -130
5819a30P2O1j14J51k14J53nP9P7j37J18k43K9O3J7K8J92k93J03Q0j53o2Q5j20
$$ -130 -58 3 -111 40 -174 -21 -26 53 130 -7 111 -132 -103 -40 -23 5 197 -96 7 87 -66 -128 -43 -163
5843a63Q2K4j09K07O6k73M8P5L2q3J99O0j70kQ1Q6j33J02k25P8J50k34L28l66
$$ -163 -81 -57 -166 41 107 -166 -118 -43 -11 -94 105 165 -5 -7 74 160 27 129 -96 -18 132 -102 226 -140
5867a40J20J87r2j71M7J80j53L0RL0J01j88P1J08n3k87N9J26j6L5N7j48k8J25
$$ -140 -20 167 75 -96 -49 131 -22 8 17 47 148 -40 31 139 86 -201 -142 -16 -32 3 60 -88 -116 9
$$ [...]
8191B18
##END NTUPLES=NMR FID
##END=
