##TITLE=1H_PhBC0404
 CDCl3,8 sc, 
 6.04.2021
##JCAMPDX= 6.0         $$ Bruker NMR JCAMP-DX V2.0
##DATA TYPE= NMR FID
##DATA CLASS= NTUPLES
##ORIGIN= UXNMR, Bruker Analytische Messtechnik GmbH
##OWNER= root
$$ XWIN-NMR		Version 3.5
$$ Tue Apr  6 10:33:02 2021 Russian Standard Time (UT+4h)  she@DPX200
##.OBSERVE FREQUENCY= 200.131506
##.OBSERVE NUCLEUS= ^1H
##.DELAY= (6, 6)
##.ACQUISITION MODE= SIMULTANEOUS
##.ACQUISITION SCHEME= undefined
##.AVERAGES= 8
##.DIGITISER RES= 18
##SPECTROMETER/DATA SYSTEM= spect
##.PULSE SEQUENCE= zg30
##.SOLVENT NAME= CDCl3
##.SHIFT REFERENCE= (INTERNAL, CDCl3, 0, 15.7039)
##AUDIT TRAIL= $$ (NUMBER, WHEN, WHO, WHERE, WHAT)
$$ ##TITLE= Audit trail, XWIN-NMR		Version 3.5
$$ ##JCAMPDX= 5.01
$$ ##ORIGIN= Bruker BioSpin GmbH
$$ ##OWNER= she
$$ F:/spectra/data/she/nmr/H-F/1/audita.txt
$$ ##AUDIT TRAIL=  $$ (NUMBER, WHEN, WHO, WHERE, WHAT)
(   1,<2021-04-06 10:31:41.21 +0400>,<she>,<DPX200>,
      <created by zg, POWCHK disabled, PULCHK disabled
       configuration hash MD5:
       00 E9 B6 7A A2 85 ED C7 34 08 36 98 17 FE 4E 26
       data hash MD5: 16K
       FD C1 18 B6 00 08 69 05 9D 7B AD C9 D3 CC 64 FC>)
$$ ##END=
$$ 
$$ hash MD5
$$ 1C 73 5E AE B6 FE F7 C1 29 9A AA 0B 9E 1D 46 A5
##$RELAX= 
##$RELAX= 
##$RELAX= 
##$RELAX= 
##$RELAX= 
##$RELAX= 
$$ Bruker specific parameters
$$ --------------------------
##$DU= <F:/spectra>
##$EXPNO= 1
##$NAME= <H-F>
##$PROCNO= 1
##$TYPE= <nmr>
##$USER= <she>
##$AMP= (0..31)
100 100 100 100 100 100 100 100 100 100 100 100 100 100 100 100 100 100 
100 100 100 100 100 100 100 100 100 100 100 100 100 100 
##$AQSEQ= 0
##$AQ_mod= 1
##$AUNM= <au_zg>
##$AUTOPOS= <>
##$BF1= 200.13
##$BF2= 200.13
##$BF3= 200.13
##$BF4= 200.13
##$BF5= 200.13
##$BF6= 200.13
##$BF7= 200.13
##$BF8= 200.13
##$BYTORDA= 1
##$CFDGTYP= 0
##$CFRGTYP= 5
##$CHEMSTR= <none>
##$CNST= (0..31)
1 1 145 1 1 1 1 1 1 1 1 1 1 1 1 1 1 1 1 1 1 1 1 1 1 1 1 1 1 1 1 1 
##$CPDPRG= <>
##$CPDPRG1= <>
##$CPDPRG2= <>
##$CPDPRG3= <>
##$CPDPRG4= <mlev>
##$CPDPRG5= <mlev>
##$CPDPRG6= <mlev>
##$CPDPRG7= <mlev>
##$CPDPRG8= <mlev>
##$CPDPRGB= <>
##$CPDPRGT= <>
##$D= (0..31)
0 1.2 0 0 0 0 0 0 0 0.06 0 0.03 0 0 0 0 0.0002 0 0 0 0 0 0 0 0 0 0 0 0 
0 0 0 
##$DATE= 1617690700
##$DBL= (0..7)
120 120 120 120 120 120 120 120 
##$DBP= (0..7)
150 150 150 150 150 150 150 150 
##$DBP07= 0
##$DBPNAM0= <>
##$DBPNAM1= <>
##$DBPNAM2= <>
##$DBPNAM3= <>
##$DBPNAM4= <>
##$DBPNAM5= <>
##$DBPNAM6= <>
##$DBPNAM7= <>
##$DBPOAL= (0..7)
0.5 0.5 0.5 0.5 0.5 0.5 0.5 0.5 
##$DBPOFFS= (0..7)
0 0 0 0 0 0 0 0 
##$DE= 6
##$DECBNUC= <off>
##$DECIM= 32
##$DECNUC= <off>
##$DECSTAT= 4
##$DIGMOD= 1
##$DIGTYP= 9
##$DL= (0..7)
0 120 120 120 120 120 120 120 
##$DP= (0..7)
150 150 150 150 150 150 150 150 
##$DP07= 0
##$DPNAME0= <>
##$DPNAME1= <>
##$DPNAME2= <>
##$DPNAME3= <>
##$DPNAME4= <>
##$DPNAME5= <>
##$DPNAME6= <>
##$DPNAME7= <>
##$DPOAL= (0..7)
0.5 0.5 0.5 0.5 0.5 0.5 0.5 0.5 
##$DPOFFS= (0..7)
0 0 0 0 0 0 0 0 
##$DQDMODE= 0
##$DR= 18
##$DS= 0
##$DSLIST= <SSSSSSSSSSSSSSS>
$$ [...]
##$SUBNAM2= <"">
##$SUBNAM3= <"">
##$SUBNAM4= <"">
##$SUBNAM5= <"">
##$SUBNAM6= <"">
##$SUBNAM7= <"">
##$SUBNAM8= <"">
##$SUBNAM9= <"">
##$SW= 16.9725357007746
##$SWIBOX= (0..15)
0 0 2 0 0 0 0 0 0 0 0 0 0 0 0 0 
##$SW_h= 3396.73913043478
##$TD= 16384
##$TD0= 1
##$TE= 0
##$TE2= 300
##$TE3= 300
##$TEG= 300
##$TL= (0..7)
0 120 120 120 120 120 120 120 
##$TP= (0..7)
150 150 150 150 150 150 150 150 
##$TP07= 0
##$TPNAME0= <>
##$TPNAME1= <>
##$TPNAME2= <>
##$TPNAME3= <>
##$TPNAME4= <>
##$TPNAME5= <>
##$TPNAME6= <>
##$TPNAME7= <>
##$TPOAL= (0..7)
0.5 0.5 0.5 0.5 0.5 0.5 0.5 0.5 
##$TPOFFS= (0..7)
0 0 0 0 0 0 0 0 
##$TUNHIN= 0
##$TUNHOUT= 0
##$TUNXOUT= 0
##$USERA1= <user>
##$USERA2= <user>
##$USERA3= <user>
##$USERA4= <user>
##$USERA5= <user>
##$V9= 5
##$VALIST= <valist>
##$VCLIST= <CCCCCCCCCCCCCCC>
##$VD= 0
##$VDLIST= <DDDDDDDDDDDDDDD>
##$VPLIST= <PPPPPPPPPPPPPPP>
##$VTLIST= <TTTTTTTTTTTTTTT>
##$WBST= 1024
##$WBSW= 4
##$XGAIN= (0..3)
0 0 0 0 
##$XL= 0
##$YL= 0
##$YMAX_a= 202528
##$YMIN_a= -155077
##$ZGOPTNS= <>
##$ZL1= 120
##$ZL2= 120
##$ZL3= 120
##$ZL4= 120
##$ABSF1= 10
##$ABSF2= 0
##$ABSG= 5
##$ABSL= 3
##$ALPHA= 0
##$AQORDER= 0
##$ASSFAC= 0
##$ASSFACI= 0
##$ASSFACX= 0
##$ASSWID= 0
##$AUNMP= <proc_1d>
##$AZFE= 0.1
##$AZFW= 0.1
##$BCFW= 1
##$BC_mod= 2
##$BYTORDP= 1
##$COROFFS= 0
##$CY= 11.3945322036743
##$DATMOD= 1
##$DC= 2
##$DFILT= <>
##$DTYPP= 0
##$F1P= 15.9154993809931
##$F2P= -4.1035820241983
##$FCOR= 0.5
##$FTSIZE= 0
##$FT_mod= 4
##$GAMMA= 1
##$GB= 0.15
##$INTBC= 1
##$INTSCL= 1
##$ISEN= 128
##$LB= 0.24
##$LEV0= 0
##$LPBIN= 0
##$MAXI= 10000
##$MC2= 0
##$MEAN= 0
##$ME_mod= 0
##$MI= 1.114404
##$NCOEF= 0
##$NC_proc= 0
##$NLEV= 6
##$NOISF1= 3.799351
##$NOISF2= 2.8
##$NSP= 1
##$NTH_PI= 0
##$NZP= 0
##$OFFSET= 15.70392
##$PC= 1
##$PHC0= -11031.45
##$PHC1= 13.40092
##$PH_mod= 1
##$PKNL= yes
##$PPARMOD= 0
##$PSCAL= 0
##$PSIGN= 0
##$REVERSE= no
##$SF= 200.130013532006
##$SI= 16384
##$SIGF1= 3
##$SIGF2= 2
##$SINO= 400
##$SIOLD= 16384
##$SREGLST= <1H.CDCl3>
##$SSB= 0
##$STSI= 0
##$STSR= 0
##$SW_p= 3612.71676300578
##$SYMM= 0
##$S_DEV= 0
##$TDeff= 0
##$TDoff= 0
##$TI= <>
##$TILT= no
##$TM1= 0
##$TM2= 0
##$TOPLEV= 0
##$USERP1= <user>
##$USERP2= <user>
##$USERP3= <user>
##$USERP4= <user>
##$USERP5= <user>
##$WDW= 1
##$XDIM= 8192
##$YMAX_p= 0
##$YMIN_p= 0
$$ End of Bruker specific parameters
$$ ---------------------------------
##NTUPLES= NMR FID
##VAR_NAME=  TIME,          FID/REAL,        FID/IMAG
##SYMBOL=    X,             R,               I
##VAR_TYPE=  INDEPENDENT,   DEPENDENT,       DEPENDENT
##VAR_FORM=  AFFN,          ASDF,            ASDF
##VAR_DIM=   8192,          8192,            8192
##UNITS=     SECONDS,       ARBITRARY UNITS, ARBITRARY UNITS
##FACTOR=    0.0002944,     1,               1
##FIRST=     0,             0,               0
##LAST=      2.4114304,     0,               0
##MIN=       0,             -155077,         0
##MAX=       2.4114304,     202528,          0
$$ Real data points
##PAGE= N=1
##DATA TABLE= (X++(R..R)), XYDATA
0@%%%%%%%%%%%%Qj6J6j6K4l2M0m8N6p0P9r2J13j34J57j82K10k42K79l21L66m18
34b23M75n37O04o78P61q51R50j059J177j306J448j601J768j953K156k378K618
51A371k881L173l496L857m258M707n216N798o471P256q190R325j0736J2548j4980
66h193J8449k3906L4365r0710J77593n8725Q213J8975k31138K33567p1947j39252
78a32709J34269n2068J23325J29711l28638R9613k2240k3286K16393k37040P2930
89a9740J27551j20928R2006j51498q0134K38935n8521P29L6131j92160K14269
100H6640m5729j33589J24657j23906J58965O3936k03726P0365k6964n049J43125
111A08725j75196K0780J28046j12249J22837j37191p1795J93888r2062N2210j4633
$$ plain form
0 0 0 0 0 0 0 0 0 0 0 0 0 0 8 -8 8 -8 16 -16 24 -24 32 -38 41 -51 62 -72 85 -97 113 -129 150 -171 195 -223
34 -223 252 -285 319 -359 402 -449 501 -558 619 -687 761 -840 928 -1025 1131 -1247 1371
51 1371 -1510 1663 -1833 2024 -2234 2473 -2743 3055 -3416 3840 -4350 4975 -5761 6787 -8193
66 -8193 10256 -13650 20715 -69995 107598 48873 57086 76061 -155077 78490 6543 -132709
78 -132709 1560 -50508 72817 202528 -126110 -26497 -48737 -72023 144370 -92670 -19740
89 -19740 107811 -13117 78889 -72609 -152743 86192 27671 28400 64531 -127629 86640
100 86640 40911 -92678 31979 -91927 67038 130974 -72752 -2387 -29351 -34400 108725
111 108725 -66471 -45691 82355 -29894 92943 -44248 -116043 77845 -14217 37993 23360
122B3360j17306J58951k8703r2196P8173r9377J05950P2776j71227Q8018n1057
133c2638R585J10432j51899M0669O0341n4934Q5713r1143n7185J35258o9531L8457
145B3125k632j01901J37838l9813m4375M6536q2132Q6249L8826j04611N5617l2782
157b0055K851Q7413j18959L4222L5624m2703Q0693q1533k3769Q0347m7191L2070
169A9010o691o9280R5767k5651l0793M0975p6456P3578J4930o3997M4876l7132
181b0864J5163M7724p0516J7209K5059l3547O1799n5183j7921N8220m6665M1266
193B1744j9964l4783N6880k0162q833J6509m0013L5020J9676m8604L8520l1594
205a5604J0366L6311n4936K8398n316o303K9969k9677p072K6469j9878J4818J330
$$ plain form
122 23360 -93946 65005 36302 -55894 22279 -77098 28852 101628 -69599 18419 -32638
133 -32638 -23053 87379 -64520 -23851 36490 -18444 67269 -23874 -81059 54199 -15332 23125
145 23125 20493 -81408 56430 16617 -27758 18778 -63354 22895 61721 -42890 12727 -20055
157 -20055 -17204 70209 -48750 -14528 21096 -21607 59086 -22447 -46216 34131 -13060 19010
169 19010 12319 -56961 38806 13155 -17638 23337 -53119 20459 35389 -28608 16268 -20864
181 -20864 -5701 42023 -28493 -11284 13775 -19772 42027 -13156 -31077 27143 -19522 21744
193 21744 1780 -33003 23877 3715 -5118 11391 -28622 6398 26074 -22530 15990 -15604
205 -15604 -5238 31073 -23863 4535 -781 -7084 22885 -6792 -13864 12605 -7273 7545 8875
218H875l4355M5386k2453J495J2988l4208L3946p482r410J0614j1247K898J6887
231A3934k2541N765R288j9232L1491k6796L900J1883j7829K0106j4018m87P542
244C006j238m747P708j2361O981Q685j8239K0432j8379R342M027j2204J1514q707
258d180N911j543J593o653Q377o024J801N308j2915J6054j3118P968k000l567
272b988O293o042N557o204O974p549P350m960R1M726q598J0743r928P920n019
287a634K018K13k796N365p214Q881q892P180m654P46K515m830O860p211P194p001
303c260N422l241N70L063n776P632q137O991n357L045m91j301L321n253O029o516
319c259O125m496K665m63j647L464n100O125o420O060m261J442Q60l348M771m401
$$ plain form
218 8875 -25480 19906 -2547 -1052 11936 -22272 11674 4192 -5218 5396 -5851 -2953 13934
231 13934 -8607 -2842 6446 -12786 18705 -8091 -4191 7692 -10137 9969 -4049 -4536 3006
244 3006 1768 -2979 4729 -7632 -651 8034 -10205 10227 -8152 1190 5217 -6987 4527 -4180
258 -4180 1731 188 1781 -4872 3505 -2519 -718 4590 -8325 7729 -5389 2579 579 -2988
272 -2988 3305 -2737 2820 -3384 3590 -3959 3391 -1569 -1478 3248 -5350 5393 -4535 3385 -1634
287 -1634 384 597 -2199 3166 -4048 4833 -4059 3121 -1533 -787 1728 -3102 3758 -3453 3741 -3260
303 -3260 2162 -1079 -509 2554 -3222 4410 -3727 3264 -2093 952 461 -840 2481 -2772 3257 -3259
319 -3259 2866 -1630 1035 572 -1075 2389 -2711 3414 -3006 3054 -1207 235 1095 -2253 2518 -1883
335a883L836l635L384l606L883l106l6M124p068Q755q410M185L43j888K689k167
351f00m18J111K220o563Q824r921P749K61q313J0608j0129P613k29m525J431K758
367A877m778O664m138o388J5818j6220J3043o548o854J6076j1983N227r40n906
381e050O619N336j4894J2900p960l42J7744k8108J9014o363k581J5751k0193M761
395c366Q368p281N482K86j9031K8528j4024k699J3286k9099L3192j0363j0268
408f989J2824j5990J2754R886k2553P509P525j5093L0847l2490K427K3102k5867
421a2108K9631k4485p473K7944j4576K615L290k3378K8134M469k9860K8501l0711
434a8007K2482J8366m4116K8078j3689M789K5185l6429K564K2323j9593K4977
$$ plain form
335 -1883 1953 -1682 1702 -1904 1979 -1127 -1163 2961 -4107 4648 -3762 423 766 -1122 1567 -600
351 -600 -1018 93 2313 -4250 4574 -5347 2402 2663 -5650 4958 -5171 2442 2213 -2312 -881 1877
367 1877 -2901 3763 -375 -6763 9055 -7165 5878 -670 -7524 8552 -3431 1796 856 -5050
381 -5050 1569 6905 -7989 4911 -3049 -3391 14353 -13755 5259 -1104 -3685 12066 -8127 -3366
395 -3366 5002 -2279 3203 3489 -15542 12986 -1038 -3737 9549 -19550 13642 3279 -6989
408 -6989 5835 -10155 2599 12485 -10068 -2559 4966 -10127 20720 -11770 -9343 13759 -12108
421 -12108 17523 -6962 -14435 13509 -1067 1548 4838 -18540 9594 14063 -15797 12704 -18007
434 -18007 4475 22841 -21275 6803 -6886 -2097 23088 -13341 -10777 11546 -8047 16930
446A6930j8498k6052N1487l0001J2427j78l7407N1581j2879j5392J5407k8395
458b0970K5832K0947m6441K2730p105l790M4174n7736J2754J8721k0547L9152
470B7721l8311j4459M3522k1100J0615k315m1568N5956p769k3504K4261m5849
482c2800M4219J5726m8346K6805k0041J1173L9387n6572Q181K0725k1485M6783
494C3755m4519j9181N2516l0992K6478j5158m1667O0660j2699j4115J6949m7164
506c5137M5554J9232n1344L0605k8669J6288M3952o3692J5759Q999j3461M8325
518C6411m8059j6943M7905k8413K9639j7354m5039O5209j7895n581J1533n0376
530c8963N1651J3012m3048K5887l0789J8516M4480o4303J8630L799j2600N4362
$$ plain form
446 16930 -1568 -27620 23867 -6134 6293 6115 -31292 20289 7410 -7982 7425 -20970
458 -20970 4862 25809 -20632 2098 -5007 -8797 35377 -22359 -9605 9116 -11431 27721
470 27721 -10590 -25049 18473 -2627 7988 5673 -35895 20061 12292 -11212 13049 -32800
482 -32800 11419 27145 -21201 5604 -14437 -3264 36123 -20449 -12268 8457 -13028 33755
494 33755 -10764 -29945 22571 -8421 18057 2899 -38768 21892 9193 -4922 12027 -35137
506 -35137 10417 29649 -21695 8910 -19759 -3471 40481 -23211 -7452 1547 -11914 36411
518 36411 -11648 -28591 19314 -9099 20540 3186 -41853 23356 5461 -120 11413 -38963
530 -38963 12688 25700 -17348 8539 -22250 -3734 40746 -23557 -4927 -1128 -13728 40634
542D0634n5912q089L8401k5631L4805k2756l9603N9086j6987k616J3000n5087
554d0755N5763P053l7399K8492m0524K8359L4069n4209J7089k123p627M9263m9714
567a2263r694L7019k8920M1374k8161l4067N4794k1554R748R02m3873M6095P361
580A8761l0149K2855l5851K2351L6276n4580K3669j2196j862M5923m9053O16J9974
593F734j7185L3089k1201l1221M5918j8361Q179P074m8169M9263l706j6925J9120
606A2609l7451K6722K1235l4963J3576p838n092M1064l9902j417J9723k2753L9519
619B5032k7603j7650L1860j6516J4525k683k9943K9741L581j6773J8845l2273
631a9857J9549K0761l3206K0917j8618M682K6532k8361K850P029j0709K3290j2832
$$ plain form
542 40634 -15278 -23367 15034 -10597 24208 1452 -38151 20935 3948 1332 14332 -40755
554 -40755 15008 22061 -15338 13154 -27370 989 35058 -19151 -2062 -4185 -11812 37451 -12263
567 -12263 -21957 15062 -13858 27516 -645 -34712 20082 -1472 8276 9178 -34695 11400 18761
580 18761 -11388 11467 -24384 -2033 34243 -20337 3332 -8864 -10726 35197 -13856 -13240 6734
593 6734 -10451 22638 1437 -29784 16134 -2227 5952 13026 -35143 14120 10414 -6511 12609
606 12609 -24842 1880 23115 -11848 1728 -6110 -11202 29862 -10040 -11457 8266 -14487 25032
619 25032 -2571 -20221 11639 -4877 9648 6965 -22978 6763 10344 -6429 12416 -19857
631 -19857 -308 20453 -12753 8164 -10454 -5772 20760 -7601 -4751 2278 -8431 14859 2027
644B027j9406K8248j7594J4060N99k8563L0208q749j229Q157k1615J4249J1018
657A1410j8094J0553q322l621K5543k5525O760L117j1039K3255j6956m238J1617
670D460q302Q282M83j6887J6552k220n499J1748k0487J4205L626j0810J0144j0843
684e548L435R810j0623J501L576q110J4027q671m999J0872j0764J0873m092p070
698e783R028l663K73L590q078M562M821r003Q600p809K017O850r081N719l117
713a074m88M485k926k499M973m463L165J185p221Q634n908L108N68m332M165j522
729a50K28p4N25k596N085m938K185P22l681O237o010L808k053N31O65p89O02j255
747i58K645l936M596m593L177n93j669L382m507M534l909L173k187J137J36j609
$$ plain form
644 2027 -17379 10869 -6725 7335 7934 -20629 9579 830 -399 7758 -13857 392 11410
657 11410 -6684 3869 -4453 -8074 17469 -8056 -1296 1821 -9218 14037 -2919 -7157 4460
670 4460 -3842 4440 4923 -11964 4588 2368 -3131 8617 -11870 2335 5961 -4849 5295 -5548
684 -5548 -2113 7697 -2926 -1425 2151 -5959 8068 -603 -5602 5270 -5494 5379 1287 -5783
698 -5783 3245 -418 -145 3445 -4633 -71 4750 -4253 4347 -3462 -1445 5405 -3676 2043 -1074
713 -1074 -1562 2923 -3 -2502 2471 -1992 1173 2358 -4863 3771 -2137 971 1539 -2793 1372 -150
729 -150 78 4 529 -2067 3018 -1920 265 987 -2694 3543 -2467 1341 -712 -181 484 -305 297 -958
747 -958 1687 -2249 2347 -2246 931 338 -1331 2051 -2456 2078 -1831 1342 -845 292 428 -1181
763a181K908m043M663m395L535k117L27J394k874M006m456M445l707K337r12p47
779h17K304l354M057m214L797k949J637o4j503L066m029M221m008L053j824N84
795d3R51k334L330l987M004l437K290o63p97J969k928L125k983K943k473J791
811G58q80o43K422l836M264l700K382m73j096J490j461J420j020J413k682L202
827A560k585J199J090l802N039l843J827O0k036K273r9j347R79k52j651M680n305
844b213K552O97l362N822n357R93K374k773K705o75l910N163j638j778M493p483
860d390O200L52n051N629n604K640M288o794K683Q03l864Q186o677j729P157p556
876c727P656l520n973R629m853R41K745r019P843K256q052Q034q574L536Q475
$$ plain form
763 -1181 1727 -2316 2347 -2048 1487 -630 -303 1091 -1783 2223 -2233 2212 -1495 842 -70 -817
779 -817 1487 -1867 2190 -2024 1773 -1176 461 397 -1106 1960 -2069 2152 -1856 1197 -627 -43
795 -43 908 -1426 1904 -2083 1921 -1516 774 111 -686 1283 -1645 1480 -1503 1440 -1033 758
811 758 -122 -765 1657 -2179 2085 -1615 767 294 -802 688 -773 647 -373 1040 -1642 1560
827 1560 -1025 174 1264 -2538 2501 -1342 485 545 -1491 782 683 -664 315 63 -1588 3092 -2213
844 -2213 339 1036 -2326 3496 -1861 -868 1506 -1267 1438 763 -3147 2016 378 -1400 3093 -4390
860 -4390 1810 2162 -2889 2740 -2864 -224 4064 -2730 -47 756 -3108 5078 -1599 -3328 3829 -3727
876 -3727 3929 409 -5564 4065 -788 153 2898 -6121 1722 3978 -4074 3960 -4614 -1078 7397
891G397j2863P008k606k029J0772j0429j258P451p142Q806l455j0819J5328p876
905a715K924L157j4667J4718j012o250O782j0587N471J0704j5117O511j755n142
919e978J8565j7774J337P441r431J5361j0019q749J4402o097K906L698j8510J7007
933D159J421j0367J2473j9274J2463R677j7013R349p619P94J6594j6137k473R846
947C893j0967J8476j0660j3709K1110j2767J0986k379j8497J9765j449n155O978
960E625j6930R787J4780k0895J1631r860n24K3636k4788N265K389o718K0069j4216
974g49j0710J6706q237Q431J528k4981K4882l790m538J0358k5512J9295P519j4947
988d745Q594j1717K851K1118k0954M81O176j1362K6431j8830r390J7535j2436
$$ plain form
891 7397 -5466 1542 -1064 -3093 7679 -2750 -4008 3443 -3699 5107 1652 -9167 6161 -1715
905 -1715 1209 4366 -10301 4417 3405 -2845 3937 -6650 -1179 9525 -5592 919 -836 -5978
919 -5978 12587 -5187 -3850 3591 -5840 9521 -498 -9247 5155 -942 1964 5662 -12848 4159
933 4159 5580 -4787 7686 -11588 875 10552 -6461 2888 -4731 -3937 12657 -3480 -5953 3893
947 3893 -7074 11402 742 -12967 8143 -4624 6362 3983 -14514 5251 3802 -1353 5625
960 5625 -11305 -1518 13262 -7633 3998 -5862 -6386 17250 -7538 -2273 116 -6602 13467 -749
974 -749 -11459 5247 -2990 5441 6969 -18012 6870 3080 -1458 8900 -16612 2683 10202 -4745
988 -4745 3849 -7868 -5017 16101 -4853 -4372 1804 -9558 16873 -1957 -11347 6188 -6248
1001f248J6786p183j8502J9660j545k586P638k3245J5442J1887j8676J3881j8186
1014a0877O772K0330k2351N843k515m138K1750j5245j0143J5491j1396J6403m669
1027E255k2226K3904p875M203M260k3527J8026O172j1311Q936j5577M669K0739
1040A5648k1624O601l273n961K4966j9268l856R233q912J6740o384j7323J7864
1053D451n106L001O352k4035J7820L593q838J0173j8245Q009J4341j5268N092
1066A340m178m942K1462j5426l928Q790j1117J8825q663j2595J4474o593O463
1079C912K405j8125J3078L711p811J0470j7432P458J2299j4783Q774q613m84J5637
1093A0496j2083j654M769p662J3969m831j2169J4010q927Q060J402j5558J3101
$$ plain form
1001 -6248 10538 3355 -15147 4513 2968 382 8020 -15225 217 12104 -6572 7309 -10877
1014 -10877 -4105 16225 -6126 -283 -2798 -6936 14814 -431 -10574 4917 -6479 9924 5255
1027 5255 -16971 6933 -942 3261 7521 -16006 2020 8192 -3119 5817 -9760 -5091 15648
1040 15648 -5976 625 -2648 -8609 16357 -2911 -6767 2466 -6446 10294 3910 -13413 4451
1053 4451 -655 2346 8698 -15337 2483 6076 -2762 7411 -10834 -2825 11516 -3752 1340
1066 1340 -2838 -7780 13682 -1744 -5672 3118 -7999 10826 2163 -10432 4042 -2551 3912
1079 3912 6317 -11808 1270 4981 -2830 7640 -9792 -2334 9965 -4818 3956 -4657 -5141 10496
1093 10496 -1587 -3241 1528 -6134 7835 3004 -9165 4845 -4082 3978 5380 -10178 2923
1106B923j763j293N110j1653M486R214j0218N984n059l536J5464j2905K739J068
1120E61n918J2611o995m683O216l903M152K534j1933R229n17l116P686j2973P522
1135D73L191n887N403o415Q43P240n632m74K684o008R514m276m695P289p132P226
1151C344j672n787N646j854N03K341n363J664M513n795N078m248p38O743o774
1166b399L631j799j414M717k732j310K129j890J553J794n541M912k058n4K988
1181B527n534L966o05p60J518k013N4K267j804L6J293k981M069k482l01J827k654
1198a577K920j389n41P87k10k25R64j331K97J308k111K300j986O55Q81j359J219
1215F02j031M61J5K55p34Q72o76K12N31j276J487j223Q75l41k01L80l96M76n95
$$ plain form
1106 2923 1160 -133 4977 -6676 -2190 7024 -3194 2790 -2269 -5805 9659 -3246 -507 561
1120 561 -5357 7254 259 -4424 1792 -2111 2041 4575 -7358 1871 1354 -1762 5924 -7049 473
1135 473 3664 -2223 3180 -3235 -2392 4848 -784 -1258 1426 -4582 4932 656 -4039 3250 -3882 3344
1151 3344 1672 -4115 1531 -323 180 2521 -2842 -1178 3335 -2460 2618 -1630 -2368 4375 -2399
1166 -2399 1232 -567 -1981 2736 4 -1306 823 -1067 486 2280 -3261 1651 -407 -461 2527
1181 2527 -3007 959 354 -406 1112 -901 -847 1420 -384 -348 945 -2036 2033 -449 -750 1077 -1577
1198 -1577 1343 -46 -587 200 -10 -235 729 -602 -305 1003 -1108 1192 -794 -139 742 -617 602
1215 602 -429 32 47 302 -432 440 -236 -24 507 -769 718 -505 370 29 -172 208 -188 288 -307
1234c07P28q55Q20o51K85J45m18O83q58R01r11P75n35K28J85n56Q11r69R03p58
1254c54O45m36K25N3m41Q09j128J278j164Q59l86j64M85p71J046j074J077j090
1272e31Q89n04m0O26j067J397j466J293j089P30k05k97Q64j433J732j690J352
1289E61q01J76L84o67Q63j198J391j520J750j420M77N25j534K335k346J624q43
1306b43K70J82k31j11j85J220j994K489k742J767J90j673K391k648J934m32j87
1323cl06N72q23J206n5k276L424l419K942r45j933L039k311J618n33j061N75J624
1341A335k376J899j420r13M327m975L188j522r01L777l469N48Q09j027J580M11
1357A271m164M353j717j74K961o312N255p96j582K669m026J816K943l545R64L38
$$ plain form
1234 -307 421 -434 386 -265 20 165 -253 430 -428 473 -438 337 -198 30 215 -341 470 -499 404 -354
1254 -354 291 -145 80 133 -308 501 -627 651 -513 346 -40 -204 281 -490 556 -518 559 -531
1272 -531 358 -146 -186 440 -627 770 -696 597 -492 238 33 -264 600 -833 899 -791 561
1289 561 -240 -64 320 -347 516 -682 709 -811 939 -481 -4 521 -1013 1322 -1024 600 -243
1306 -243 27 209 -22 -133 -318 902 -1092 1397 -1345 422 612 -1061 1330 -1318 616 184 -3
1323 -3 -309 263 -560 646 591 -1685 1739 -1680 1262 317 -1616 1423 -888 730 197 -864 -289 1335
1341 1335 -1041 858 -562 -1475 2852 -2123 1065 -457 -1358 2419 -1050 -502 307 -720 860 1271
1357 1271 -2893 1460 -257 -431 2530 -3782 1473 677 -905 1764 -2262 -446 2497 -1048 -84 254
1373B54k901O531m745q27L426m615O166k987l248M497k259J421J502o007M226
1388D34J697l953M971o675K663M845o331L938l128o76O652n302r61L059m232O723
1404C724k456n942P309m568L747R08q181O914j96j976L789p305K925O067p180
1419b421M292l791j502R662q091Q68J398m000Q448l930n524O537l822L888J748
1434C760j0505Q464p16j523M751j0082N319M797o015L904m738r83J0197p976J13
1449a233J956n624J1429o064m797O397n091O660o07r322P487j75j282N077j1154
1464f343N344N760p193O267p983J004R613q072J574o43l687J0257m681n738O557
1479B036n748P454K9j0737R044k772J688L462j0733N644M192m793M471o734l49
$$ plain form
1373 254 -2647 3884 -861 -1688 1738 -2877 3289 302 -2946 1551 -708 713 2215 -3792 434
1388 434 2131 -1822 3149 -3526 -863 3982 -2349 1589 -1539 -2215 4437 -865 -1826 1233 -2999 3724
1404 3724 1268 -4674 2635 -1933 1814 2722 -5459 1455 1259 -717 3072 -4233 -1308 4759 -2421
1419 -2421 1871 -1920 -3422 6240 -1851 -983 415 -3585 4863 933 -4591 1946 -1876 2012 3760
1434 3760 -6745 1719 1003 -520 4231 -5851 -532 4265 -1750 2154 -2584 -3567 6630 -1346 -1233
1449 -1233 723 -4901 6528 464 -4333 2064 -3027 3633 3026 -6296 1191 1016 -266 4811 -6343
1464 -6343 -999 4761 -2432 3835 -4148 -3144 6469 -1603 -29 -672 -4359 5898 1217 -4521 2036
1479 2036 -3712 3742 3771 -6966 2078 -694 994 4456 -6277 -633 3559 -1234 3237 -3497 -3846
1494c846J0563q523K321j137m502J1985o945k730L879m685P699j071q699O877
1508A186j579R19M634j1692O408L029m432N982r113K294P466o356K342k293l124
1523d329R951m997l451M385n917Q686j671p810O975l660L545K130r039M910K350
1538B058k921M536p239P22P778o711L590l225k586R305n715p83J586l820O882
1553C457j244o221N238k767K514L021r018N567K90j425M278p379K267M492m025
1568i55K619k769k295P584m453n46J682m546P227k423l749L744l003L325J209
1583B651n958L442N58j401L897o070J741L599l793L411l528o89N017l195J26N08
1599C16k827M752j129l237L442l235L113P45m549L344j039K65K063l864J022K383
$$ plain form
1494 -3846 6717 -1806 515 -622 -5124 6861 -84 -2814 1065 -3620 4079 3008 -5691 1186
1508 1186 -393 526 5160 -6532 -124 2905 -1527 4455 -4658 -2364 5102 -1254 1088 -1205 -4329
1523 -4329 5622 625 -2826 1559 -4358 4328 2657 -5153 1822 -1838 1707 3837 -5202 -292 2058
1538 2058 -863 3673 -3566 -2844 4934 -1777 1813 -1412 -3998 5307 -408 -1191 395 -3425 3457
1553 3457 2213 -4008 1230 -1537 977 3998 -5020 547 837 -588 3690 -3689 -1422 3070 -955
1568 -955 1664 -1105 -3400 4184 -269 -815 867 -3679 3548 1125 -2624 1120 -1883 1442 2651
1583 2651 -3307 135 693 -708 3189 -2881 -1140 2459 -1334 2077 -1451 -2140 2877 -318 -192 316
1599 316 -2511 2241 1112 -2125 1317 -1918 1195 1940 -2609 735 -304 -39 2024 -1840 -818 1565
1615A565k526K457k244j114M235l268J409m93j797L496j497j086J355j514J409
1630C87J150l434K567r25j37K164l516J940K13p63J232j434l24J930j188j3P33
1647E82k135K888j404m45J199j810J968o49p15N73m4k31J021j366J51J197j667
1664h87J933j729M36Q34j094R78q42K24K25K95q90R00p78M08O24j486J586j296
1682e59Q36j24m58N17l58M03m42N42q51J001p29K64K75q55J181j110Q31n34K28
1701E8J9j25K62n36P66q81Q72p28L70N2m13O68q09P99p07N91m15J86J21m35O69
1722C84q08P76o38M29k18J9J97l73N70p12P13o39M31j15j49L50m72N23n40M59
1742A87l31K40j09j17L11m38N33n66N01k93J31L9k24L48m19M53l83K92k04Q9N2
$$ plain form
1615 1565 -961 1496 -748 -1862 2373 -895 514 21 -1776 1720 223 -863 492 -1022 387
1630 387 1537 -1897 670 -255 -392 1772 -1744 196 409 -354 878 -556 -880 1050 -138 -151 582
1647 582 -1553 1335 -69 -514 685 -1125 843 194 -521 52 8 -223 798 -568 -417 780 -887
1664 -887 1046 -683 -247 587 -507 471 -371 -147 78 373 -517 383 -395 13 637 -849 737 -559
1682 -559 277 153 -305 212 -146 257 -185 357 -494 507 -222 42 317 -538 643 -467 364 -170 58
1701 58 77 -48 214 -322 444 -437 435 -293 77 129 -284 384 -425 374 -333 258 -157 29 150 -285 384
1722 384 -424 352 -286 143 -75 -56 141 -232 338 -374 339 -300 131 16 -133 217 -255 268 -272 187
1742 187 -144 96 -13 -130 181 -257 276 -290 211 -82 49 88 -136 212 -207 246 -137 155 -49 40 92
1763I2j44J95k67L61l86L57l26J50J52l43L81m10K85q9L5r6J17j66J38N5m32O52
1785C11o10M92j12l86M86l41J97L4k12MM25n83M77k79k38R25j012O25k94k34P66
1806D41n10j05K99k93K29L92j157J085m23j11Q53j541J132j24l54O07p97J24Q70
1825F17p53N6L27j079J835j117l32R80j397J719o91q32R80m64K64N97j562P52
1843a00P95j325J641j894M08J599j785J245j022k69J741j037n18Q26j168J569
1859G06Q9k305K250j392R61Q11k771K007j87k56R87j905L53J913j728Q47n73j309
1877a502L435k286Q5N71j761L011j185j457J420q80R62R59l128J846M37j028K286
1894A785l523J287J759j911J683j941l37K858j645m23P28k007L303p87k469K453
$$ plain form
1763 92 -52 143 -124 237 -149 208 -118 32 184 -159 222 -188 97 8 43 -53 64 -102 36 91 -341 311
1785 311 -299 193 81 -305 181 -160 37 71 -141 -137 288 -295 182 -97 -335 590 -422 203 -91 -325 441
1806 441 -69 -174 125 -168 61 453 -704 381 -42 -153 700 -841 291 167 -187 420 -377 -253 617
1825 617 -136 -80 247 -832 1003 -114 -446 534 -863 856 165 -667 313 -151 113 710 -852 -100
1843 -100 695 -630 1011 -883 -475 1124 -661 584 -438 -707 1034 -3 -521 305 -863 706
1859 706 795 -1510 740 -652 309 1120 -1651 356 169 -87 900 -1005 -652 1261 -467 380 -193 -1502
1877 -1502 1933 -353 -268 303 -1458 1553 368 -1089 331 -549 413 1372 -1756 90 527 -501 1785
1894 1785 -1738 -451 1308 -603 1080 -861 -1198 1660 15 -408 320 -1687 1616 829 -1640 813
1910H13k124K321L49l308K197k21J0J539l132O75K409k192J881k087q21L912k689
1927d68O77l27j659L585j187j860J665j628K073Q87l973K583n99K37K045m118
1943b067J638J416j381J755k424n38L576k250M45j10k241M320j736j391J467k065
1959a586K875J29l230J979l98K78K059m085J435J594j630K383l171J1L090j967
1975b34P26p27j663L690j130j643J568k388L070J35l139K200j242J225J313l419
1991a658J170J185j066J985k670m44L259k314J453j297j398L566j574m98M56j566
2007a411K372L49k760J811j052Q38J774l713J785J55l45J740k665J81J947j152
2023a46P10o51j647L210j295m80P49k156K928n24j516J065j018J087R71k351P88
$$ plain form
1910 813 -1311 1010 1359 -1949 248 27 37 1576 -1556 -881 1528 -664 1217 -870 -1691 2221 -468
1927 -468 209 -118 -1777 1808 621 -1239 426 -1202 871 1758 -2215 368 -231 6 2051 -2067
1943 -2067 -429 987 -394 1361 -1063 -1601 1975 -275 170 60 -2181 2139 403 -988 479 -1586
1959 -1586 1289 1418 -1812 167 -231 47 2106 -1979 -544 1050 -580 1803 -1368 -1357 1733 -234
1975 -234 492 -235 -1898 1792 662 -981 587 -1801 1269 1404 -1735 465 -777 448 1761 -1658
1991 -1658 -488 697 -369 1616 -1054 -1498 1761 -553 900 -397 -1795 1771 197 -301 155 -1411
2007 -1411 961 1310 -1450 361 -691 147 1921 -1792 -7 148 -197 1543 -1122 -941 1006 -146
2023 -146 564 -87 -1734 1476 181 -299 450 -1706 1222 698 -818 247 -771 316 1287 -1064 -276
2040b76O33q23J994k491K53J663j471J520j472n25J925p99k18L23j329J708J96
2057H11j706J409j403J175P43k010J153l84J58R29j453j1J164q64Q69o55r52J981
2075I54j163L72l0j056J595m01n55M20n78N36O91j407P10q3l02J226j540M55M13
2094B57m97P63p76k07Q42m03K0J86q65J099k09n32O50q64Q01O3o61M30k38J12
2114b9M62o80P6M23m99O23n14j62O30n32L81j72k83M78j09j93K30l19K32K33n59
2135b83M34k74Q8K78m21K04j3m5J24j09j63L24k09R8J2k63M01k47O6N6j46J45
2157E7k2o0J8M3j10K21k40R2O1j21J92k12J25o3J0j4L1rn6J48j97J71j59J21l4
2182gl3Q3j27J64j68J33r4O7J2j01J43j81J93j20P6m3K6L1j24J79k22K62k40J66
$$ plain form
2040 -276 357 -466 1528 -963 -710 953 -518 1002 -470 -995 930 131 -87 236 -1093 615 811
2057 811 -895 514 -889 286 1029 -981 172 -212 -54 875 -578 -589 575 -289 580 -75 -1027 954
2075 954 -209 163 133 -923 672 271 -284 136 -442 94 785 -622 88 5 -297 929 -611 -156 257
2094 257 -240 523 -253 -460 382 -21 -1 185 -680 419 210 -322 328 -536 265 328 -333 97 -141 -29
2114 -29 433 -247 -171 252 -247 376 -138 -300 330 -202 179 7 -276 202 93 -100 130 -189 43 276 -283
2135 -283 151 -123 -35 243 -178 26 13 -32 92 -17 -180 144 -65 33 45 -218 183 -64 2 58 -88 57
2157 57 35 -25 -7 36 -74 147 -93 -1 60 -61 131 -81 44 -19 -9 -23 8 -1 -57 91 -106 65 -94 27 -7
2182 -7 -40 43 -84 80 -88 45 -49 18 30 -71 72 -109 84 -36 40 -3 23 54 -70 109 -113 149 -91 75
2206G5m0p4J42k04K07j63J53j51J03n0k2J20k31K58k50K23j04k5J11j49J67j81
2228h5J98k02J35n5k0Q6j74K24k60K40j39N1J8r7J85k17K32k48J97j06M5J3j22
2251a01J71j81K39k54K07j05QR1k19K93k68J52q1L0M2pj1o6J63k27K85k65J37
2274C3L4j58K56k84J65j1Qn9N3j09J31O0k76L39l41K77l5k16K08j77J65L6j62
2297f3l1K19k44K61j91j55M46l96K85j76j25L48j84m3J01j96J61K17m95M17k39
2318h3QL76n88L28j3p1K32k96j20M71l11J27K1m70P25l44j10K18m43N75p1l81
2340b20K55j30M1M70p21K15K36l56O43p12N8M88l72L24k54l40O64j61k48L14o57
2361d63P26Q6p01N61n42M55L32p89K70J01j28N38o39j83P65n84N22l88m86J012
$$ plain form
2206 75 35 -39 103 -101 106 -57 96 -55 48 -2 -24 96 -135 123 -127 96 -8 -33 78 -71 96 -85
2228 -85 113 -89 46 -9 -29 57 -117 107 -153 87 -52 -1 17 -80 105 -112 120 -128 69 -37 8 21 -101
2251 -101 70 -111 128 -126 81 -24 -16 75 -144 149 -119 33 -48 -18 24 17 6 -60 103 -124 161 -104 33
2274 33 67 -91 165 -119 46 35 43 -16 37 -72 59 119 -157 182 -159 118 83 -133 75 -102 63 99 -63
2297 -63 -94 125 -119 142 -49 -204 242 -154 131 -45 -170 178 -6 -49 52 -144 17 234 -261 156 -83
2318 -83 -75 301 -287 41 28 -43 189 -107 -227 244 -67 60 81 -389 336 -8 -118 100 -343 232 161 -220
2340 -220 35 -95 -54 416 -305 -90 146 -210 433 -279 -221 267 -105 219 -35 -375 289 128 -120 194 -463
2361 -463 263 349 -352 209 -333 122 454 -335 -65 36 -92 446 -193 -376 389 -195 327 -61 -547 465
2381D65n09R6K1n39P07R4o21L79l69K53O86j134M51k8p0P65j003N5N05k82M24
2402C46l48n93J000l00j11K28r50J113o3n62M19o50N82M20q48K38M6j21Q41r80
2422b93r9O99n75Q11o53m70R95m21J91r3p14Q72J56o18M40p13N37O22j057M68
2442H5k95P1Q47j006MM18k93O47m59o59R99l84J88M4r67J054l8l80L10p28O15
2463G3N08q60K83j70n1R06r69OM38m14Q22o31m49P78l19K95o9q17Q38P1l88M20
2485C01q55N89M65p66L94l69J08P56q23rK73l18P44m70n23P59l86L76m9p83P97
2506B11n7j95K83p00M34M59o62L99m10K6P61p43J22J00k71P12m73l54N49k88K92
2527A95K6p46O79q6j08L21p32M83K41l81K11k91RN97n04KJ48l47P03m49k23L89
$$ plain form
2381 465 -44 52 73 -466 241 335 -286 93 -276 -23 663 -471 -20 -48 -118 647 -356 -301 204 -78 346
2402 346 -2 -595 405 105 -6 222 -728 385 322 -240 179 -471 111 531 -317 -79 -33 -154 687 -293
2422 -293 -392 307 -268 543 -110 -580 415 -6 185 92 -622 250 406 -212 228 -485 52 674 -383 85
2442 85 -210 -139 708 -298 -294 124 -169 478 19 -640 359 -25 163 207 -760 294 256 -124 186 -542 73
2463 73 581 -279 4 -166 -217 689 -280 -274 164 -250 572 -59 -508 270 -49 246 177 -640 198 269 -119 301
2485 301 -554 35 500 -266 128 -241 -133 623 -200 -209 64 -254 490 20 -503 256 -130 246 197 -586 211
2506 211 154 -41 242 -458 -24 435 -227 172 -238 -212 549 -194 -72 28 -243 469 -4 -358 191 -97 195
2527 195 221 -525 154 68 -40 281 -451 32 273 -108 103 -188 -179 418 -86 -84 64 -283 420 -29 -252 137
2549A37l11L94r3m22L77K6j35K33m67K45K91m16L36l75Q1M25m45J18Nj22L06j45
2571D3k55L44k72K49N6m89M65k01R9R2l31J97O9j04Q6q3j07L79l46J23N0k51M29
2594B42k90KO2p8J30j4j29Q6P0j52K31l34J94O6j81K23k41J09N2m3k7L5q0R9J6
2619D8j69K29k31K04j5j55J63j36J00n0Mn4J41j11O9j5r0J78j71J17p9k1O9j5
2643A0j1k1O5q6R1j03P5j3o1J34j31R6p1K0j3L0j7jJ5o6J13j04J12q3jK2m0R0
2671E1o6M6l2N2q4N5j3l3O3r9J01n4M4jk9Km5N5o7J03r4P7l3l2M5o1R5n2J7j6
2701eK3n2J4M4r2J32j28J34r7J9L1m5O0n9M2rL7q6Q3n3J8L8j05J49j58J11j7k8
2729AM0o3O9p2N3n5M2n7N8j3p8J76j71J28n7m5J31j40R0m7J4PM6j21J06m5j7J18
$$ plain form
2549 137 -174 220 127 -295 82 108 -27 206 -261 -16 275 -141 195 -180 -99 326 -119 -1 4 -118 188 43
2571 43 -212 132 -140 109 165 -324 141 -60 39 131 -200 -3 66 -38 48 -35 -142 237 -109 14 64 -187 242
2594 242 -48 -46 16 -62 68 54 -75 11 81 -71 160 -174 20 86 -95 128 -113 -4 48 5 -22 13 -67 32 48
2619 48 -121 108 -123 81 66 -89 74 -62 38 -12 -8 -62 79 -32 37 22 -68 110 -61 56 -23 -44 25 10
2643 10 -1 -22 43 -43 48 -55 20 7 -54 80 -51 45 -26 -6 -19 11 -6 -7 8 -58 55 -49 63 -20 -21 1 -39 51
2671 51 -15 31 -1 51 -33 22 9 -24 39 -60 41 -13 31 30 1 3 -42 13 -54 49 -45 32 -1 -33 12 -49 46 -6 11 -5
2701 -5 18 -34 -20 24 -68 64 -64 70 -27 -8 23 -22 38 -21 21 12 49 -37 46 -7 11 49 -56 93 -65 46 29 1
2729 1 41 -22 47 -25 28 -27 15 -42 16 3 -75 101 -70 58 1 -44 87 -53 37 -10 4 11 57 -64 42 -3 -20 98
2757I8k39K32j06K1P4j80J17%qqRj19K33j78OJ12k22L09k01l7J47j55J88p0j31
2782a08J47rq4J86l08J61J60l04L40l20R6K10k38Q5j9j22L13j53k09L22k79K75
2804A42j6m03M29k26J32Q4l77K69J06k13K03k76k0M79m40J89o4k22O00m50n0K13
2826H9k88M39p7m49M10j64O5K81p28M80R1k71M13n76J54M75m24J69j32k76P37
2847D18m36j61L21m98P26k51n10N41l20L11J62p34M11J67k33M49p34J95O00o11
2867a87M16m33j05P57m77p6J76l99P24j64o37O25m73M76J71r34O22k8p3L92p61
2888c88K11N95n67L96m31k66J078p53Q3Q4n06R80l80m59M30l54M73K23j027O39
2908F1Qj25O17j135M58M55m76M95o62n5Q77n27j1O7n93J106l92n63O17o94Q65
$$ plain form
2757 98 -141 91 -15 6 80 -100 17 17 9 1 10 -109 124 -54 -48 64 -158 151 -50 -87 60 -95 93 23 -108
2782 -108 39 30 -54 132 -176 -15 145 -159 181 -139 -43 167 -71 14 -5 -127 186 33 -176 146 -133 142
2804 142 126 -277 152 -74 58 142 -235 34 140 -73 130 -146 -166 313 -127 62 -2 -224 376 -74 -124 89
2826 89 -199 240 163 -286 124 -40 25 306 -422 58 149 -122 291 -285 -131 344 -80 89 -43 -319 418
2847 418 -18 -179 142 -356 370 119 -391 150 -170 141 303 -431 -20 147 -86 363 -371 -176 424 -187
2867 -187 229 -204 -309 448 -29 -105 71 -328 396 232 -405 220 -253 223 394 -540 82 54 -19 373 -388
2888 -388 -177 418 -149 247 -184 -450 628 -125 -42 42 -464 516 136 -323 107 -247 226 449 -578 61
2908 61 69 -56 561 -574 -116 339 -137 358 -304 -359 518 -9 -20 47 -546 560 168 -395 222 -472 393
2929C93k6q87O08j30P9M52r63K43O13n96O52p85p2J033p89L43k60l70R38l19m32
2950b75L61m53O62K25j107P60l25K04N12j136N35J87j88M17o67r5Q68n56J51m1
2970C9o35J180n78j79L12o04Q49j16o64M62j87J46M72r78M13K83l94O88r12J51
2990b52O35m78K98k94l10P78k49l12L80o43P36K7p29O21m65L91K32p22L20J33
3010I7j99M50o05l8O62n72M40l04l05P88m63L6N0l50N49j6m85L91k96K14L39p67
3032c84M69n7j25M60n94J41K77k63K20j44l08O21l23l0J54m61O05k14j85K19k46
3053a68K40J33m19K15N3j75M14m83J25K49l25L68l09n7K83j54K8J5j83K49Nk47
3075a43K83l05K23P8k94K66j88O2J25j69j8J78j56J36p1j87L61k64J39k5j37K37
$$ plain form
2929 393 367 -520 88 -42 37 489 -474 -231 382 -214 438 -347 -419 614 -175 168 -92 -462 476 157 -275
2950 -275 86 -367 295 520 -587 173 -152 52 564 -572 -37 150 -38 379 -288 -383 485 -71 80 39
2970 39 -596 584 6 -173 139 -465 384 268 -396 66 -121 25 497 -481 -68 215 -179 509 -403 -252
2990 -252 383 -95 203 -91 -401 377 128 -184 196 -447 289 316 -413 208 -257 134 366 -356 -36 97
3010 97 -102 348 -257 -295 367 -205 235 -69 -374 414 -49 -13 37 -313 236 220 -265 126 -170 44 383 -384
3032 -384 85 28 -97 363 -231 -90 187 -76 144 0 -308 313 -10 -40 114 -347 258 44 -141 78 -168
3053 -168 72 205 -214 1 54 -121 293 -190 -65 184 -141 227 -82 -139 144 -10 18 33 -150 99 104 -143
3075 -143 140 -165 58 136 -158 108 -80 -18 107 -62 -80 98 -58 78 7 -180 181 -83 56 31 -106 131
3097A31j47mL6l6k9J64j81P7J3r7K33k99J98m4n3J15j19L6K0O4j26J26j86J40
3121C2j0r6J69j73J35o4k9L6k6L2MK1j26J88j62J00Jj09J39j36J11m7K6l5M7j4
3147A4n2J19j36J35j69J28l0j4O6j25J10q8R0r8R7p1L8K4j11J58j62J25r8J8M6
3172A4o9R4q9Q6p4J23r1J1J6n6J20j63J46j04N9j5k5N8n2K8n5J02j06J01o7OP4
3199G2j50J62j35R3m0j4L5j5Jk3M4q1J28j57R4J8j06J86k09J26K2o2J6j0m2R8
3225E1l7j01J74k22K69j31j04J78j99J95m6r9O6P1j12J33j73J1K39l13K97k48
3247a01J0K33k19J16r0l5J58lk22K88k69J92J19m21M07k48J04J60l51J62J03j23
3269c0J42j44j98N37m47J95ol03N72l99M7O8k04L23Qm23L51r5p7M57p60M28N9
$$ plain form
3097 131 -16 -20 16 -20 -49 115 -66 11 24 -73 160 -139 59 15 -38 77 -42 -6 14 78 -48 78 -108 32
3121 32 22 -74 95 -78 57 -7 -36 0 -26 6 10 31 -95 93 -69 31 32 -77 62 -74 37 -10 16 -19 28 14
3147 14 -38 81 -55 80 -89 39 9 -5 61 -64 46 -42 48 -50 47 -24 14 38 -73 85 -77 48 -50 -32 14
3172 14 -55 39 -50 36 -38 85 -6 5 21 -35 85 -78 68 -36 23 8 -17 41 -11 17 -38 64 -42 59 -8 -2 72
3199 72 -78 84 -51 42 2 -12 23 8 9 -14 30 -51 77 -80 14 32 -74 112 -97 29 51 -11 5 -5 -47 51
3225 51 14 -87 87 -135 134 3 -101 77 -122 73 27 -72 -6 65 -47 86 -87 -76 163 -150 147 -101
3247 -101 -91 142 -77 39 -51 -86 72 69 -153 135 -134 58 177 -244 163 -85 19 179 -172 -10 93 -30
3269 -30 112 -32 -230 307 -140 55 49 -254 318 -81 -34 34 -170 153 161 -262 89 -6 -83 374 -386 42 101
3292A01k51M67n90J59L40k77R8k0l57O70k84k72M48o46P38j65m70M67l58L17J88
3313C03o49K76K57l67N65o63j9P25o74N45m39k46Q23m72j1Q6m36O84Op35O35m75
3335b81L66M18j056O60j11k3M58q12J55N85m90L79l29m48J120o83N9J66p22J091
3355E02l43m93M73m86N30L47j062N91j9j66P83j208L36N78n79O89p55k12J021
3374E27n71J6Q4o97J185l17o38O59p59Q39J52j040O58j86Q0O28j119K60N91n54
3394b02P33q12k61J145p55L47k36o06J174l54m56M34o50P59K83j155P50l49K23
3413A2O71j298M78L51l57P02q72j89J033o30L07j82p69J343n03k62L53p84J016
3432D20j9q43N47l04K10O29j170M27K84l99Q60j037L2Q04o09M75l85m94J030l47
$$ plain form
3292 101 -150 317 -273 -114 226 -51 47 27 -330 340 56 -216 232 -414 324 159 -311 156 -202 115 303
3313 303 -346 -70 187 -180 385 -278 -297 428 -246 299 -140 -386 437 -35 -46 40 -396 288 294 -441 194 -281
3335 -281 85 503 -553 107 -4 -27 431 -381 -226 359 -131 248 -81 -529 591 -92 -33 133 -589 502
3355 502 159 -334 139 -347 183 530 -532 59 40 -126 657 -551 -215 363 -216 473 -282 -494 527
3374 527 -44 -28 56 -641 544 227 -411 248 -511 328 480 -560 98 -88 -8 620 -499 -239 352 -202
3394 -202 531 -281 -542 603 -152 195 -41 -647 527 173 -283 151 -499 260 543 -612 138 -211 12
3413 12 683 -615 -137 214 -143 559 -313 -502 531 -99 208 26 -743 600 97 -165 188 -596 420
3432 420 401 -442 105 -199 11 640 -530 -103 181 -218 642 -395 -363 441 -168 307 -78 -572 458 111
3452A11k71L70q03R61J7q43O89n90M68M46j043M37J18j89O11p77q4Q00o04N12
3472C36l80n08J063n75R6L8n63P62j0n83M26l34K35N39j015N24n0j56P18r35K28
3493a44L40l01L72l08l67P35k91q1K16o66Q36j88l67L89n06M91J19n44K69Mr6
3514h8M57n48k2M60m94N65m50j50N66l87J95n9l11M07J5l51L37l64K58K83o39
3535c20N03l08Q7L25m96J64J26j19J62j12k46M80l07R8N5l61N16k78J0P9j93J68
3557C3R3k41J39Qj55L71m35J74P3j54K72k85M9J25q2M9J8j86J92kj53K27k84K50
3581I6l3j25J23j32O8L5l6o3J68j98J84r7r6K29k13J79j39J3M4nm6PL8o5J92k44
3607a16J88p8l2R5j29J32j14J02p3O4p6O4J4j02J78k33K34j49O9mq0J03j11J07
$$ plain form
3452 111 -160 210 -593 368 385 -458 231 -359 109 555 -488 -51 67 -122 489 -288 -372 428 -176 336
3472 336 -44 -552 511 -64 32 70 -493 269 259 -324 102 -232 3 542 -473 51 1 -155 563 -372 -144
3493 -144 196 -105 267 -41 -408 327 36 -45 171 -495 341 153 -214 175 -331 160 279 -265 4 8 -88
3514 -88 369 -179 -201 259 -235 330 -120 -270 296 -91 104 45 -266 141 156 -195 142 -222 36 319 -320
3535 -320 183 -125 -38 287 -209 -45 81 -38 124 12 -234 246 -61 37 92 -269 247 -31 -21 58 -135 33
3557 33 126 -115 24 32 -123 248 -187 -13 60 -94 178 -107 -58 67 -15 34 52 -134 58 56 -97 130 -154 96
3581 96 63 -62 61 -71 -3 32 -4 -67 101 -97 87 -10 -106 123 -90 89 -50 -37 7 2 -44 -37 1 -64 128 -116
3607 -116 72 -6 -38 57 -72 60 -54 48 -25 39 -37 27 41 -61 117 -116 118 -31 38 34 -46 57 -54 53
3631E3j01J41j65J16l5m7J13j82K11j87J31o2j2N4n5O5j23J76j82J62r3LP8j53
3655i4J92k02J58j09O8KpJ7p3J22j86K10j70J06%j18J81k14K03j26N5pj4k7M4
3680A1M7j68K31k51K21j15m4J48j82J94j02k9NP6o7N1m3n7K29k91K40j50J2J38
3704A04j77J35q9j8J00j3j37J82j62O2J53l29L18k15J02J23k81J68J2n9P9r2j21
3727a55L32k78J21ok43M47k64m4J58k12K49k1k62K20p5k0L00n39L08N2j82L37
3749B23m04P5L05k99J81j03k37N34k75j21K99m97N49r3m05M33l72K98J75n53K62
3770b5J10k27N08o09L4N29n25M54l84j92P17m64M5Q9m24O31l2n82N23m37L28L76
3792D43r31O08j42l4M92q09J86M36m03M37l77l93R87o01Q8J28o90J069l83l66
$$ plain form
3631 53 -48 93 -72 44 9 -38 75 -107 104 -83 48 -14 -26 28 -27 38 -85 91 -91 71 -22 -19 59 -94
3655 -94 98 -104 54 -55 13 15 8 25 -48 74 -112 98 -72 34 34 -84 97 -117 86 -40 15 8 -6 -33 11
3680 11 58 -110 121 -130 91 -24 -68 80 -102 92 -10 -39 -34 42 -25 26 -17 -74 155 -136 104 -46 -34 104
3704 104 -73 62 -27 -45 55 42 -95 87 -75 -13 140 -189 129 -86 16 139 -142 26 38 -21 58 -34 -155
3727 -155 177 -101 20 14 -229 218 -46 -90 68 -144 105 84 -178 42 -33 -53 247 -292 16 68 -114 223
3749 223 -181 -106 199 -100 81 -22 -259 275 0 -121 178 -319 230 137 -268 165 -207 91 266 -287 -25
3770 -25 85 -142 366 -243 -209 320 -205 249 -135 -327 390 -74 -29 60 -364 267 235 -347 176 -261 67 443
3792 443 -488 120 -22 -56 436 -373 -187 249 -154 283 -94 -487 500 -101 -13 115 -575 494 111 -255
3812b55L90m76N21K51q88M97j8j48P41j129L37M60n18P21p79j05Q41m86J10l2
3832C5o46J090k18o37O53q36Q51J75j010P14l86K63N15j034K29N47n20P18p41
3851b38l49J236q67M96l46n55J201n02k51K65n67P50K82j097P05l81J77Q17j451
3870f75O23J54k31P67j027m7Q72n12K76j79p69J365n33k57M20j010J216o3q12
3889d22N54m35L74N71j151L43L51m56J013j203L9R14p75P17o11m24J119m34j60
3908g6K35q02R84J16r68P86p34N90M92j194N66k6l2O62r21r3Q32o25O01m90n81
3929f78J271o84J72no89R97j08n55M28m83L69O19j168N68j11j25Q57j101K20M22
3949B16l64N17m40m25Q85m00k4K46q56J044k16m03M06o37O15K25p09K88J2j32
$$ plain form
3812 -255 135 -341 180 431 -457 40 22 -126 615 -514 -177 283 -235 486 -293 -398 443 -43 67 35
3832 35 -611 479 261 -376 277 -559 292 467 -543 171 -215 48 563 -471 -242 305 -215 503 -238
3851 -238 -587 649 -218 278 -68 -623 578 76 -175 90 -477 273 555 -542 163 -218 -41 776 -675
3870 -675 -52 102 -129 638 -389 -436 436 -76 200 21 -748 617 84 -173 247 -763 453 390 -422
3889 -422 132 -303 71 642 -509 -166 185 -271 742 -461 -422 492 -283 434 -177 -601 518 84 -76
3908 -76 159 -643 341 457 -511 275 -459 131 623 -571 -5 -31 -63 599 -322 -415 417 -208 393 -97 -678
3929 -678 593 -91 81 76 -613 384 276 -279 149 -334 35 654 -514 54 -57 -182 675 -426 -206 216
3949 216 -148 369 -71 -496 389 -11 -35 211 -645 399 183 -220 186 -451 164 389 -320 -32 -20 -152
3969a52O81q02M3N13n64P51o49j52O51m16K34r8m31N85K5m52M59o07M47L25p38
3990c47N18l63J66L73n74J28J93k04L26k20l92P11m92L18l2n06P12l38jQ9k70
4011b05K51J73l92J84pj40N02o17K67P6k57M29m20O8J52p6M8K3k97L63k4k50L55
4034B06m91L96qk69K60k16J79K6j20k4J45j99K43j50j74M10l80K70j24j17K23
4055H6j05J3Ln3L7J58k53J84j29QJ89k73K06j19K8Q9j04J2J4j3m5J39k07K11j06
4080c0k2J27j60J58r4K6j6L3n3O8o0qJ10j78J75r8kP9j34J24o7L9l6P0r3O4m8
4107b6KJ09j66J60j39R8j4n2M1j1K9o9O9r2J23j20M3O3j22J60j49Q3m6K0J4m4
4133c6K5nQ2j29J46j55J09k6q0J51k03J83p6L8o0Q1m6OJp7J94k36J75r0m3J56
$$ plain form
3969 -152 529 -273 -230 283 -281 470 -179 -331 320 -96 138 40 -391 194 219 -233 226 -381 66 391 -347
3990 -347 171 -192 -26 347 -227 -99 94 -110 216 -4 -396 315 -177 141 109 -397 315 -23 -24 65 -205
4011 -205 46 219 -173 11 4 -136 366 -251 16 92 -165 264 -156 -88 64 -12 36 59 -238 125 101 -149 206
4034 206 -285 111 103 -166 94 -122 57 83 -37 -61 84 -115 128 -22 -196 214 -166 104 -20 -137 86
4055 86 -19 -6 -3 -56 -19 139 -114 70 -59 -51 138 -135 71 -48 -20 69 -35 -23 -9 -22 -67 72 -135 76 -30
4080 -30 -52 75 -85 73 -21 5 -11 22 -31 37 -23 -31 79 -99 76 -22 -24 55 -79 45 -22 17 -19 51 -42 22 -26
4107 -26 -24 85 -81 79 -60 38 24 -28 13 2 31 -38 31 -61 62 -58 -15 48 -74 86 -63 20 -26 -6 8 -36
4133 -36 -11 -16 66 -63 83 -72 37 11 -69 82 -121 62 -14 24 -36 45 -1 5 6 -71 123 -113 62 -28 -71 85
4159H5j60J68j47L3J6N5j25J04n6m0K14l34L15j85Q1N8k26K04p6M0m0M5j48K54
4183A35j96O4J03l28M49l27Q0N6j83K32n0p5MJ15j74L17m20J89J28k97M83n24
4205b19J94J45j70J21j08q7K37k4k47L37m65M49k9m09M96m44L50L8l47J81P1j48
4227g8K77l01j63N99n68M34k76k62O79m78J87n4k29L79O0m85L77k55J54M22q85
4248d66N98j65k4M80p44K36K43k39K56k09l49P57m01j1K34p34R61l33k87L57n14
4269c54N13J83o92L60Pj81P36r86K32M71n32P17p45j02P37m19J30m1n66R16j43
4290B41n57N94q40Q01J86q96O05l45K42N23r40J60M82m71P32p08l24J065p82N14
4310B82k93o23J106l62k28K76o76P19L73j103P03m40J72Q40j314N09J38k70Q00
$$ plain form
4159 85 -75 93 -54 -21 -5 50 -75 29 -27 -67 147 -187 128 -57 24 82 -144 60 -16 24 -16 29 -119 135
4183 135 -61 3 106 -222 227 -100 -20 36 -147 85 35 -40 -36 79 -95 222 -198 -9 119 -178 305 -219
4205 -219 -25 120 -50 71 -37 -124 113 89 -158 179 -286 163 134 -275 221 -223 127 165 -182 -1 70 -78
4227 -78 199 -102 -265 334 -234 200 -76 -338 341 -137 50 -4 -233 146 206 -279 98 -157 -3 419 -466
4248 -466 132 -33 -57 423 -321 -85 158 -81 175 -34 -383 374 -27 -38 196 -538 423 90 -197 160 -354
4269 -354 159 342 -350 10 17 -164 572 -414 -182 289 -243 474 -271 -373 364 -55 75 34 -532 384 241
4290 241 -316 278 -562 239 425 -471 134 -211 31 554 -386 -226 256 -215 517 -191 -515 550 -232 282
4310 282 -11 -634 472 110 -118 158 -518 201 574 -529 174 -266 -94 746 -568 -59 79 -191 609
4329F09r12j82Q90n09L43j57q72J387n32j94M30j064J189Jq10N22m73L34P12j167
4349d55K87L20m64J122j199o9Q44o19P07n73n52J078l26j57K91r40R79K14r57
4368d69P70q39O22O34j252N15m7n9P54r30j38Q12n78O60m62p56J336o73K14N6
4388A70r12J118o9n61L91n60M11O92j181M99p2j83J037j195J43N01m43P01n59
4407g2m56Q97l36J3K11r53J031n7n40N72q62P16L29q55M14j95kP28q34l8N58n79
4429c10Q13n94m55R66n70L51j39o12Q18p2l85L90o05M33M57q87N47l68Q4O85q65
4450c18K49J41k32N23m08l44O79l65J80N3o99Q46k43j45K76n96N08J56m51K42
4470E2j78l6O05o76J50J83l57O48n45l7L61k66K39r8l60M51k7k67L57n50M35J39
$$ plain form
4329 609 -303 -485 405 -104 239 82 -790 597 65 -129 301 -763 426 427 -383 139 -334 0 712 -455
4349 -455 -168 152 -312 810 -389 -458 386 -233 474 -99 -651 427 101 -56 235 -705 274 488 -469
4368 -469 301 -538 84 718 -534 -19 -66 -125 629 -301 -439 373 -205 455 -7 -763 573 -100 114 170
4388 170 -742 376 307 -254 137 -423 -12 680 -501 -2 -74 -257 780 -415 -272 229 -214 487 -72
4407 -72 -528 369 33 46 257 -696 335 278 -262 310 -552 164 493 -362 52 -143 -145 583 -251 -289 269 -310
4429 -310 503 -91 -546 420 -150 201 62 -550 268 196 -189 201 -404 29 486 -401 146 -222 -138 547 -318
4450 -318 -69 72 -160 363 -45 -389 290 -75 105 158 -541 305 62 -83 193 -403 105 261 -190 52
4470 52 -126 -162 443 -233 -83 100 -257 391 -154 -191 170 -96 143 45 -315 136 109 -158 199 -351 84 223
4492B23m53M14l62J86K33l61N6J17j77L10j88k43M81m27L37j38k64M26k32O9M1
4513D8j58J24J40k94K11j31o3L53m21K65j10j4J98k32P4M3m2QJ08l01L18j13q3
4536g2J91l39L80j63JN2j03L7R5q1q8K05k85L09j93k5J84k30K43k04R7j5M9q0
4560c5P5n0o2J92k90L14k29P5M8j35J54j22J01j21J55j52J33p2kJ19k46K70k34
4583a14J72n5n1O5m8P1p6J23k00K12j51L1Q6j87K11j82J39r3M4J4rL5q7J19j89
4608a20K23j88J05l7p2K07j99J27r5O1m4O2l8mN8j38K08k32J84r4NJ00j58J23
4632D4o4J6l0N3j01J31n7m5J45k17K12j43M5L6j08J68p7m8J6M5j01J97k07P8R4
4657H2k13K91k63O2J01j15Q0l4r4J59J5j60K05k97K85k0k49K82k34J72M7k01O8
$$ plain form
4492 223 -230 184 -178 8 241 -120 -64 53 -124 186 -2 -245 236 -191 146 8 -256 170 -62 7 48
4513 48 -110 14 154 -140 71 -60 -123 230 -191 74 -36 -50 148 -84 -10 33 -9 -1 107 -194 124 11 -72
4536 -72 119 -220 160 -3 -2 50 -53 -16 79 -2 -90 115 -170 139 -54 -79 105 -125 118 -86 11 -4 45 -35
4560 -35 40 -10 -72 120 -170 144 -85 -10 38 -97 57 -65 36 -85 70 -82 51 -21 -23 96 -150 120 -114
4583 -114 58 3 -48 17 -31 40 -36 87 -113 99 -52 -21 65 -122 89 -93 46 -47 -3 11 2 37 -50 69 -120
4608 -120 103 -85 20 -17 -89 118 -81 46 -49 12 -32 30 -8 -12 46 -92 116 -116 68 -26 -21 79 -79 44
4632 44 -20 -4 -34 19 -82 49 -8 -53 92 -125 87 -56 -11 25 -83 85 8 -40 -24 21 -80 117 -90 -12 82
4657 82 -131 160 -103 -41 60 -55 25 -9 -103 56 71 -89 116 -181 104 84 -165 117 -117 55 102 -99 -31
4680c1P9j56K46j97j01L45l57K87j58j52L99k62R1mj81K20R8l56K77k12P3L76
4702C24o26M03j36m4L77n04J20K26j86J72j00l46N89k77l3J74n17O52j71k29K50
4723A18l57L19J74m76K06M2j83N42o34P1M13m50N71m97j65N71l26J54j2m66N78
4744A93K2m57M74o12M31L64q04N33l12J03N04p26J23K95k95N08l73m40Q40n11
4764a40L27l0p59R72l07j34K33n93N21L25p02L58k12l6Q06r77K57J98l47P85p55
4785b10j34O31l87L12j11o95Q91j32l35M73r17Q25J75p09N06n19K94N98q23J08
4805a59K54l82Q89p73k91Q30o21O57l94o35R76k87o7K03p73O95L33q12O06o09
4825c60K93P39j103M57j13r8P94q05j91O15m09N28k50p91J105m21P9J52q85R72
$$ plain form
4680 -31 48 -108 138 -59 -160 185 -172 115 -43 -195 204 -58 33 29 -152 68 166 -190 87 -125 -52 324
4702 324 -302 101 -35 -79 298 -206 -86 140 -46 126 26 -320 269 -8 -41 133 -384 268 97 -132 118
4723 118 -239 80 254 -222 -16 26 -157 385 -249 -178 235 -215 356 -141 -306 265 -61 93 81 -385 193
4744 193 215 -242 232 -380 51 415 -389 144 -168 -65 439 -287 -164 131 -164 344 -29 -469 371 -140
4764 -140 187 157 -602 370 63 -71 162 -431 90 415 -287 71 -141 -177 629 -348 -91 107 -240 545 -210
4785 -210 -344 287 -100 212 101 -594 297 165 -170 303 -614 211 386 -323 183 -336 -42 556 -267 -159
4805 -159 95 -287 602 -171 -462 368 -253 404 10 -625 351 64 -3 200 -573 122 455 -357 249 -360
4825 -360 -67 672 -431 26 -87 -185 609 -196 -387 228 -181 347 97 -694 411 -10 69 221 -664 308
4845C08m5m43L46n11K82O69r34L15kl19J063j011K4M57m37P25n20m84P60j94r
4866D0K12q89Q41R4n40N60q43O08L91p59L57k22k5P14o72j98N50n18P64m70m89
4887d94Q26m90M12j75n78O44N6l28L37n74K94N74q58N41l93K8P29q14J86O1j19
4908a35M84l13m52O62l31J74J70q69Q95k42r6K37o01M80K16m07J47r1j25O63o51
4929a85O2K53m22P19n57r6L67k34K70r1l91L81R2l15L89n81L88K24m94M21m44
4950b44K11K70l34N3O5j63L44j93l01M98l86L41j11l44M80k32R5J3k31J58J86
4971A75k97J73j08p1M18m82K39m6j31L44k91QR6q1O5P7k81K97p5p5J87l63L28
4994A06o7r3R0j50P6J45j47kJ13j89K74k11l4J99k23K06j11l2P1k1k7P2j16M2
$$ plain form
4845 308 263 -180 166 -345 -63 606 -328 -13 -15 -334 729 -282 -258 199 -238 487 -33 -517 243 49 40
4866 40 252 -637 204 298 -242 318 -525 83 474 -285 72 -150 -175 539 -133 -331 219 -299 465 -5 -494
4887 -494 332 -158 254 79 -499 145 201 -127 210 -364 -70 504 -354 187 -206 -178 551 -263 -77 -16 -135
4908 -135 349 36 -416 246 -85 89 259 -610 285 43 -53 184 -417 63 279 -128 19 -72 -197 466 -185
4929 -185 -123 130 -292 427 -130 -226 141 -93 177 86 -305 76 168 -147 242 -339 49 273 -221 200 -244
4950 -244 -33 237 -97 -44 21 -142 202 9 -292 206 -180 161 50 -294 186 -46 49 62 -169 -11 175
4971 175 -122 51 -57 -128 290 -192 47 1 -130 214 -77 -69 27 -54 11 88 -193 104 29 -46 141 -222 106
4994 106 39 -54 36 -114 -38 107 -40 -42 71 -118 156 -55 -89 110 -113 93 -18 -50 21 0 -27 45 -71 -29
5018b9J43k41K27j86P4P7j59J25m9LM1k5o5J16p5L5N8j90K39j62M5J1o2O4jk5
5044a1j2M5o7J19j12J1P2j19J41j36R5l4pM0l2K5k3P6j44J63j54O6M1j34J63j39
5070f7J01n5K6m5O1k0m9J09j42J59j61J07k0q0J49j63J34r7Q0n5N6p0K4Q2j57
5095i3J81j78J42n3pO9j32J36r8M5m7N9o4P4k8j00J89j83J74j40PJ25j67J41j06
5120e4M5l2Q7j14J24j02JJ76k79K32j69Q8P5j61Q1j0L4j8M2j68K30j60P1M6k55
5145a90L62k20P4k6r4J63k0r0L0L6j27K85l04J29L0j75L29l30J07M0n4J03o1j39
5169a42K28p7r1K15l89L72l4k13K66l12K24M5j49M1L7r7K87k98o3K95l46M25k89
5192f5j33L37k24J52m2k49K81R0l02L06l37J79K80n33L97k77P8L24m01O0J43j28
$$ plain form
5018 -29 114 -127 100 -86 -12 65 -94 31 -18 -15 26 1 -64 52 -23 12 70 -120 119 -43 2 13 -49 15 14 -11
5044 -11 -23 22 -45 74 -38 -27 45 -74 67 -69 26 -8 -15 25 -7 18 -5 71 -73 90 -64 2 43 -91 72 -67
5070 -67 34 -21 5 -40 21 1 -48 61 -81 78 -83 24 4 -76 73 -90 44 -53 27 -28 28 -42 -18 64 -93
5095 -93 88 -90 52 -1 -8 61 -71 65 -33 12 -35 24 -40 34 6 -94 95 -88 86 -54 -47 78 -89 52 -54
5120 -54 -9 -41 46 -68 56 -46 -45 131 -148 84 -85 3 78 -83 -2 -12 22 4 46 -122 108 -52 19 65 -190
5145 -190 172 -48 26 0 -94 69 49 -41 -11 25 -102 183 -121 8 38 -137 192 -138 -31 9 -45 58 -3 -142
5169 -142 86 9 -82 133 -256 116 82 -131 135 -177 47 92 -57 -16 21 -76 211 -87 -150 145 -201 224 -65
5192 -65 -198 139 -85 67 25 -224 57 147 -155 151 -186 -7 273 -260 137 -140 -62 262 -139 -79 64 -64
5214f4K37j21l82N67l61K19Qm72O16k30nQ5l41K41K70m75K57j22j03O18p13K47
5236b4O4k17N37m71p9K99j62J53pn11O11r6k16L63o96O12P0l83K86l50K11L68
5258C62m95JK11k95O31m96k34N91m97N48l28m29O12j55LJ13n02M04L02n67M34
5279B14n11K12N62p59L28j45k0N26m87k02M21k80L81j13o53P88l01P4J85p41O91
5300A70J9k82K38m03J70N28o49J96mk23P89p21l9L61l71N87l83l26N16j54L2J78
5322B29p14O14R5l85L94o24L78L90n77K59j96j3N74n24j35L75l84N80k92m55O39
5343B28l60L14l1n74N60Pk17K81n14K72M18o09L45k62j4O03o19J18O1j93N12l20
5365Fl01M61k61K02M9n96N95r8j00K65n62L55K07l33J56j90k0N30m80L9J63l03
$$ plain form
5214 -64 173 52 -330 237 -124 95 103 -369 247 17 12 97 -244 -3 267 -208 49 -73 -176 442 -271 -24
5236 -24 40 -177 360 -111 -190 109 -53 100 93 -418 193 97 -119 244 -452 160 230 -153 133 -217 -6 362
5258 362 -133 -132 79 -216 415 -81 -315 276 -221 327 -1 -430 182 27 30 143 -359 45 347 -220 214
5279 214 -297 -85 477 -282 46 -99 -119 407 -80 -282 139 -141 240 127 -526 262 -39 35 220 -521 170
5300 170 189 -93 145 -258 -88 440 -209 -13 -17 -240 549 -172 -211 150 -221 366 -17 -343 173 19 51 229
5322 229 -485 129 224 -161 233 -391 -13 377 -200 59 -137 -150 424 -100 -235 140 -244 336 44 -411 228
5343 228 -132 182 151 -423 137 144 -73 208 -306 -34 384 -225 120 -142 -156 447 -172 -54 7 -186 326 6
5365 6 -295 166 -95 107 156 -440 155 57 -43 222 -340 15 222 -111 45 -145 -165 365 -115 -76 87 -216
5387b16N58l92j44L17k74L19q7l64L63n8q9K52m80L03K21l80L10l61J38L30l88
5408a22Q4L4j15L13j75k25L55l13L11k7l91M51k08N4N9l12K78P7k14J41j20m0
5430a05L60l93J65k4j32L58l22L2R4q1J40l4k04K28l7r6J98l67K77Oj53K01k39
5453a28J39J04j04o9J31j47K24j52j10K26k33K45j33p7J61j06O9j1o3JJ27j75
5475h1J59j29KJ84k50J91j39O3Q3j17NK7K3l4R8k07K17j53N3O7j93K04j07N8n7
5500c3L4k7O8m7k7J06j80J92j50N0N5r1J23j15N6n2O5q0Q9n6JO9j38J82j42P3
5526B5k7j4L9n5N1m4P3j13J03p5N9K1j14J45j21J10q3L1j4Mk0rP6j20J15j18Q7
5553A2j2l2P1j03Q1o1M3j8K9m8L7Rn8J08j28J08r2L7N0p8P8m6K7m6O4j02J03o3
$$ plain form
5387 -216 342 -50 -194 123 -151 168 81 -283 80 22 -67 185 -295 8 229 -151 159 -202 -64 266 -122
5408 -122 -38 -4 -119 194 19 -206 149 -164 147 120 -271 180 -28 26 85 -227 51 128 -86 55 -65 -105
5430 -105 255 -138 27 3 -129 229 -93 -61 33 -48 92 58 -146 82 45 -51 147 -220 57 63 -90 111 -128
5453 -128 11 115 11 -58 73 -74 150 -2 -112 114 -119 126 -7 -84 77 -29 40 29 -34 -33 94 -81
5475 -81 78 -51 -49 135 -115 76 -63 0 83 -34 -29 -2 21 -13 85 -122 95 -58 -5 62 -131 73 -34 24 -33
5500 -33 1 -26 42 -5 -32 74 -106 86 -64 -14 41 -50 73 -42 14 -38 27 -53 36 -20 -19 50 -88 94 -48 25
5526 25 -2 -16 23 -32 19 -25 48 -65 38 -37 22 43 -71 74 -47 63 -20 11 -3 1 -19 -28 48 -72 43 -75 12
5553 12 0 -32 39 -64 17 -44 -1 -19 10 -38 -1 8 -50 58 -70 38 -54 -17 33 -45 33 -13 14 -32 32 -70 33 -30
5581c0j9J35j87J69j11L6K5n4M5k9K6l7P2j35J69j38O2J7r5J87j50N5k0j4N5K
5607C6o2J2K2r3J91j86Q7K3q5J62j74P7j1NNJ4r7J24k3p6J44k06J87l2j06J32
5633G0j76J52k9o3kP7j09J71j29l6J80k12K17j63p8K21j29R2k9j33J30L7j25J43
5657G7j65Q7J79l08K07j63N8J67k23P3L2o0J15l8k10K84j72R1Q5l30L33j29k9
5680c9J00k49K40P2k00J27q4p5L42l48P7P3j78L49k49p6K16j32J34m8k89L29l2
5703F0j01K00m09K96R3k60K13k39Q2K78l19M4O2j33L71k62j81L16k58K91j24l07
5725b87M24j50L1R6l38K51J43k78K19k82J03L72m73K17j05o6M12l73m1J90j83
5746a18L15j24l78M46j77Q1J24n07M37J7j85K00l58J73L41m14J47q4j00N16m31
$$ plain form
5581 -30 -49 86 -101 68 -43 -7 18 -36 9 -20 6 -31 41 -94 75 -63 -1 16 -79 108 -42 13 -7 -21 34 36
5607 36 -26 -14 8 -85 106 -80 7 30 -55 107 -67 10 -1 4 9 23 -74 50 27 -49 95 -111 76 44 -62 70
5633 70 -106 46 17 -46 -48 29 -80 91 -38 -74 106 -106 111 -52 -130 91 -38 54 25 -108 22 59 -66 77
5657 77 -88 -1 178 -130 77 -86 -28 139 -84 -11 21 -39 76 38 -172 112 -60 31 116 -214 119 -10 -39
5680 -39 61 -188 52 124 -76 51 -33 -108 234 -114 -37 36 -142 207 -42 -118 98 -34 100 52 -237 92 60
5703 60 -41 159 -250 46 139 -121 92 -147 -65 213 -106 -62 0 -133 238 -24 -205 111 -147 144 20 -287
5725 -287 137 -13 18 114 -224 27 170 -108 111 -171 -68 304 -169 48 -57 -123 289 -84 -125 65 -118
5746 -118 197 73 -305 141 -36 45 169 -338 99 116 -69 131 -227 -54 287 -127 20 -64 -164 352 -79
5767g9m6K33k93M26k40k04K97j27R7P0m33L58J07k77L15n04K70L05m19K38k10
5788a16K4L62l43n2J68k26M34j82l77M94l13K71o5l96L81rp5J46l33J65L18m20
5810a44K30j80n7N18m98J13jj40M04k47j82K64j32J22R6m91M31q7p5K13m83L79
5832E3R8k11J17j80%L70l25k2J74k93N10l22j45K66k17K90j30k14K38rp5J81l52
5855a98J88J97l37K88l04R0L11l27Q9l0l9K32j29k16K74j92K26k1l34L66j79Q2
5877C7M7k53J95M6j13R9j38l0L18l26J30lj25L14k79O7K4p8J37k6j93J93k8n1
5901c6J58l32K47J9r9J42k08P3J27j30L2j6p6K32j37o7J44j99K40j29o7J38p2
5924a6M7J0j20O9P2j29J47j54K8J59k00J29j11P0P2j06K0L6k6L3M8j72J82j22
$$ plain form
5767 -79 -125 108 -185 241 1 -203 94 -33 64 134 -299 59 166 -111 204 -300 -30 275 -144 94 -116
5788 -116 -92 270 -73 -125 43 -183 251 69 -308 186 -127 144 79 -317 64 55 -20 126 -207 -42 276 -144
5810 -144 86 -94 -151 367 -131 -18 -19 -159 245 -2 -184 80 -52 70 166 -325 106 19 -56 157 -326 53
5832 53 151 -60 57 -123 -123 247 -78 -100 74 -219 291 -31 -176 90 -127 163 33 -181 57 48 -27 154 -198
5855 -198 -10 187 -150 138 -166 -76 235 -92 -3 -33 -72 160 31 -185 89 -103 123 102 -232 134 -45 37
5877 37 84 -169 26 72 -41 58 -80 -110 208 -118 12 9 -116 198 -81 -14 10 -68 69 43 -150 43 15 -36
5901 -36 122 -210 37 56 -43 99 -109 -36 91 -39 -7 -23 -99 133 -4 -71 73 -126 114 -15 -82 56 -16
5924 -16 31 41 -79 -10 62 -67 80 -74 -46 113 -87 42 -69 1 73 -33 -13 23 -3 30 78 -94 88 -34
5948c4L9M4j41J55q8K7j4k7L1P5r4J7K1j00J73j23J4Oj4P3p2J7J1K8n5Q3j09Q2
5976B5M5j17J03j08P4%m4N2l7k2J8Om1J03r0N3jq0R6p7O1k5j5J4K1k3lL7q8P7
6006A4o4P5k5m3Q8r6Q1m2J1k1K1j3J2M3r6J09j20O7Kk6N4p0O0k1J8k3J1Kj4L1
6036B5n0O4j00Q0n6JO0p7O4n1P2n3LmP2l2n7Q0r9Q6j6rPm5O5k6k4j5M1l2M4n5
6068c7J3M5p1Q3r2O2J6n2K3j7K0L9J2q7Q3n7PM1o8Q2p6L9opJJ8j9M1k9n4Q8j17
6100g6J11k8q4J19o2P5o7m5O9ln7O4n8K7J22j83J06q6K8J17j39M4k7K6M2m5q0
6127i0J72j09N1K8j70K29j16pL0j16J53j0r2K1lj8J55j75M5Q1j54K48j98J6P2
6152D3q9Q6m2j00J50rj22K03k83K26K0j79J61j82J38O7j52J5O4o3J61j16j14K21
$$ plain form
5948 -34 5 49 -92 63 -25 2 -12 -39 -8 67 -27 -10 11 -89 84 -39 -25 -19 -33 40 -32 -15 -4 24 -31 52 -57 25
5976 25 70 -47 56 -52 22 22 -22 30 -7 -29 -11 -5 -46 57 -33 20 19 -61 35 -42 19 -6 -21 -7 14 -9 -12 25 -63 14
6006 14 -50 25 0 -43 45 -51 30 -12 -1 -22 -1 -14 -2 41 -55 54 -66 1 3 -23 31 -39 21 0 18 -5 6 8 -6 25
6036 25 -25 39 -61 19 -37 -36 24 -53 11 -40 32 -21 -18 -22 50 18 -39 41 -58 28 12 3 10 -35 30 4 -20 -35 6 -26 18 -37
6068 -37 -24 21 -50 33 -59 3 19 -33 -10 -27 -7 32 44 -43 40 -17 -10 31 -37 45 -31 8 2 -5 -4 14 -5 36 7 -47 41 -76
6100 -76 35 7 -77 42 -20 55 -12 -57 12 9 -48 16 -42 -15 107 -76 30 -56 -28 89 -50 -6 -33 -7 35 -10 -90
6127 -90 82 -27 24 52 -118 111 -5 -12 18 -98 55 45 -47 -26 -29 -47 108 -67 -22 59 -95 153 -45 -29 43
6152 43 -46 40 -2 -102 48 39 -83 120 -163 63 83 -96 65 -117 21 88 -64 -49 15 -48 113 -3 -117 104
6176A04k05K16j28j44K60j35P8k2j46J14J06j81J51j94O8K31l05J87j18j2K42
6197A67k43J7O3l1J02k0k37K96j54P3R3l51L10m6p8J01k10J20J64k02O6J7j33
6220a16L59l22KJ37j94L25k49p6J80q1P8L7l05K46P4j72J99l30K00J33k54K13
6242H4k14O1K53k36rJ08j54K61j20j99K73j95J95o8k26K63p8J7N8k19J08J92k55
6265a00J55j67mL44l18P3k6n3K81j93j16J79r5J18Mk84K64o9k5J58l12K06P1j61
6289g0J22j70O2K55k78M5M1j33L32k36o5J90j82K25j00j86J69k9MJ10k85J67J18
6312A06k09K18k79J13J92k18J07o8o7K32j33j06J87j52J71j6k42K55j45R9J9k28
6334a64J96K4q9J09j65J6J92j77Q4n6p8K68k23L9M5q4J52p9j31J45l0J6Q4k52
$$ plain form
6176 104 -101 115 -13 -157 103 -32 46 24 -122 -8 98 -83 68 -126 -58 173 -132 55 -63 -75 167
6197 167 -76 -59 4 -27 75 55 -182 114 -40 33 126 -225 85 39 -39 62 -148 -28 136 -66 0 17 -116
6220 -116 243 -79 -77 60 -134 191 -58 -134 46 -35 43 80 -225 21 95 -77 122 -208 -8 125 -129 84
6242 84 -130 -69 184 -52 -61 47 -107 154 34 -165 108 -87 108 40 -186 77 -1 16 74 -145 -37 155 -100
6265 -100 55 -112 -116 228 -90 -17 -43 -96 185 -8 -124 55 -40 78 82 -202 62 -7 -32 126 -186 20 91 -70
6289 -70 52 -118 -56 199 -79 -34 7 -126 206 -30 -95 95 -87 138 38 -148 21 -8 -4 106 -179 -12 106
6312 106 -103 115 -164 -51 141 -77 30 -38 -105 127 -6 -112 75 -77 94 78 -164 91 -54 45 64 -164
6334 -164 32 56 -33 76 -89 -73 119 -58 26 -30 -108 160 -63 -24 21 -63 89 10 -121 24 -6 10 94 -158
6358a58J80J9q0J12j92J10Q3r4L3m4j2J31r7l2O3j09J89j22o6J48j14R5lj46P3
6383c3M5m4P1j02K2J53j83J17q0JR8r8K2pjK1K3p9Q3o6J6R9j65J20l2NK0r9O5
6412hJ3l2L7k4l0R0q5K7L8q1J13q1k0M4j4LK5k9J6M4r6P5q1M3N6j01R0r4O1Oj3
6443hJ7j2k4L6L0q7Q5n1K7Np0P9k9L0l1J3j9L2n1K7L0n9O7p5K8k4K7K3j9k4L2
6474EOm3O3o8M8j5j2M9p1O3l5Qj0MQOJ1m8Q5r7J15r5NL9o5N1k2L7l8N4n8J5Kl2
6508c5N3p3R0o4K0%qK7k4J0m5P0o3P2l0j6L4o2J16r4N7j7k8J2jlj1J8m0P1o5L8
6540IJ6m9M6n8O9n6MJ0NQj8L6o2P7j03R3n7j2P1n9O7n8j0K8Lk1J0rj4P9r1O3m3
6573b6J6K4m5L4oMjJ4m3P8p0K4J1o2R7l5k7K2q4P9J9l5j6K1m6J51j39L7J0m8R7
$$ plain form
6358 -158 22 41 -39 73 -119 -9 74 -20 13 -31 -43 88 -9 -41 22 -87 102 -20 -86 62 -52 43 40 -106 -33
6383 -33 12 -32 39 -63 -41 112 -71 46 -34 -33 65 -33 -11 -18 -19 2 25 -54 29 -37 -21 78 -87 33 1 6 26 -73 -8
6412 -8 5 -27 10 -14 -44 46 -39 -12 26 -55 58 -23 -43 1 -13 -10 15 -14 2 46 -50 25 -56 -13 43 -58 32 -62 -1 5 -8
6443 -8 9 -3 -27 9 39 -48 37 -14 13 18 -52 27 -2 28 -3 10 -9 23 -28 -1 29 -30 37 -38 -10 -34 -7 16 -3 -27 5
6474 5 11 -32 31 -37 11 -4 -16 33 -38 25 -10 -2 -12 -8 0 6 17 -31 54 -43 72 -23 -18 21 -44 7 -15 22 -16 38 -20 -5 -3 -35
6508 -35 18 -55 35 -29 -9 -9 -17 10 -14 -4 -49 21 -42 30 0 -16 18 -44 72 -22 35 18 -10 2 1 -2 -13 5 -35 36 -29 9
6540 9 25 -24 22 -36 33 -23 -19 -9 -4 4 -14 22 -40 37 -66 27 -30 -42 29 -30 37 -21 -31 -3 0 -21 -11 -20 -34 45 -46 17 -26
6573 -26 -10 14 -31 3 -3 1 0 14 -29 49 -21 3 14 -48 49 14 -13 9 -75 4 23 -12 -28 -7 -53 98 -41 -4 6 -42 55
6604E5j08L6O2o2O0m3m2O7Nm5N9j08Q9Kq6Q0q1P3N3r9L3Om7J06j10j6Q5q6J19
6633E7m6j17J65p1M2nj20J20J4p7Q0j00L9J26j92J15m1k6J54j36k9P9m5P2n8j07
6659a07J54o6L9M1j99J88k3o9J07j69J09Q0j59P3j4m2J74j84K5O1q8J83j22n9
6683f7P0k3R4j7j88J54J9o4J00k28J40J00j42R7r8MJ60j49oL5p4J77q6j20J85
6708G3j30J35p0j66K53j21N3K6j76J11J05j56J17j13j3K58k59P6j4n5K10j80j5
6731e1R4q7R4Qj94J80l0j6R2k77K38j4n5N8j60R0J38j59MK6p1K32j72p4J70j46
6757h2J96j10r4J40p3P4Mj92J53N4j28J29j82Q7J35j85J45q7n9J94j16n0P1r2
6781f8J48k9j76J94r6L0N6k43K08qm2O2j22N8J22j52O8Jr0K29k18O8J4q5J47o0
$$ plain form
6604 55 -53 -17 45 -17 43 0 -42 25 30 -15 44 -64 25 27 -59 21 -60 13 66 -33 0 6 -41 65 -45 -61 24 -62 57
6633 57 11 -106 59 -12 30 25 -95 25 39 -38 42 -58 -19 107 -85 30 -11 -37 117 -19 -48 31 -14 58 0 -107
6659 -107 47 -19 20 61 -138 50 27 -42 65 -104 5 85 -74 -1 -15 -57 117 -67 -42 19 -69 114 -8 -67
6683 -67 3 -20 74 57 -131 23 42 -22 78 -150 -10 90 -52 45 -53 -49 111 -38 -44 -9 -83 94 8 -112 73
6708 73 -57 78 8 -158 95 -26 27 53 -123 -12 93 -63 54 -59 -72 186 -73 3 -11 -66 144 -36 -51
6731 -51 43 -44 50 58 -136 44 14 -2 90 -187 51 37 -18 40 -120 -30 108 -51 -47 -21 -92 140 -32 -106 64 -82
6757 -82 114 4 -90 50 -23 51 55 -137 16 70 -58 71 -111 -24 111 -74 71 -16 -75 119 3 -47 24 -68
6781 -68 80 51 -125 69 -27 3 59 -184 24 16 -26 36 -86 -28 94 -58 10 11 -79 150 -68 0 14 -71 76 16
6807A6r3J15p6N8O5k22J93l6q4J45k12J36O9j17O8q0J5J01n5n4P1j41K14j27m6
6832g7J11j05R6j9r3Q6J5l5R2j26M4J09j51J16j41O6N6o9M0k5rN5k7r1J10p0N1
6859IK1j55J86q3J5K2p8M6L9o8L8%o2J56j02jJ0o4J47j01J4J2oL4J1q2O3K4o4
6888a9Q1j10P9Kn2P5o0oK0rl0M2m9P0m0l6O1m7M6k1j5N2m8M1l3j6RN7q7P7l9l7
6920d2R0r1P9n0oK2l4L6lJ3pJ5n2L1j1J0J7l9M4qk3oj4K7Qpj8M2o8O9l3pL9o5
6954d2O9n1K1l1M4j6J8k7JM7r0Q4m8L2K5q3N7j7pJ6k1kRJ6J6j0p5P8l3nQJ5kl7
6988d1K5RLk8N7l6M2j6l6L5j0J0k5JK0%NKj3nL2l8K4j3k1M3o6M6m0JM5K3l0j1
7022fJ2n2O6m0L2nm5P6q4K9K0J0k0K1m6M9k9ML7o5P2o7M1J5m1M5l3j2lL8k2M4
$$ plain form
6807 16 -77 38 -38 20 85 -137 56 20 -64 81 -131 5 74 -43 25 -55 -40 61 6 -48 23 -118 96 -31 -77
6832 -77 34 -71 25 6 -87 -1 14 -21 71 -55 -11 98 -53 63 -78 -12 44 -25 15 -10 -19 36 9 -82 28 -42 9
6859 9 30 -125 61 -22 -7 15 -63 -17 22 -46 -8 -8 -70 86 -16 -17 -7 -71 76 -25 -11 1 -5 29 40 -42 21 45 -19
6888 -19 62 -48 31 33 -19 56 -4 -10 10 1 -29 13 -36 34 -6 -42 19 -28 18 -3 -18 34 -14 27 -6 -22 -13 44 -43 34 -5 -42
6920 -42 48 -43 36 -14 -20 2 -32 4 1 14 7 22 -30 1 -10 0 17 -22 22 14 -9 -15 -29 -2 6 -1 -19 23 -45 24 -9 -16 23 -42
6954 -42 27 -24 -3 -34 10 -6 12 -15 -14 33 -57 27 -21 11 36 -47 10 -7 -14 2 -19 -21 -12 4 20 10 -65 13 -20 -25 -17 -2 -4 -41
6988 -41 -16 -7 -4 -32 25 -11 31 15 -21 14 4 14 -11 -10 10 10 15 17 4 -1 31 -7 17 4 -17 26 -40 6 -34 -33 12 35 5 -6
7022 -6 6 -46 20 -20 12 7 -38 38 -46 -17 3 13 -7 14 -32 17 -12 -8 29 -36 36 -31 10 25 -16 29 -4 -16 -19 19 -3 41
7054D1o2K9%n2R6q8J2M6q0Q3m7JK4J7l7L8o1M4L3q6J03j34Q3J5m6J4K0j7J6pm4
7085d6P7n8O5k6r6J46q6L4Pp6O3K8n1K9k1l1J04r6Q7j02MJ02j02K9LON0k4m2K7
7115DnJ5M2j77J73m5k5O0j20R0J9m9M3Kp6R9q5LM2r9J63r1l1R0q3Q9m5j02J14
7144A5jn5R8j47R2O4j45J26j19M6R7r2L3mo3J38p1r4J30r6J26m7j39J62q0P6k0
7171C0j02O6Q4j11M8m0l9J61j47M2nm5J45j08l6P5l5N8J3j76J80l2j8P3j96J25
7197A0L8q2P9j04M9J04j15pL5q5K12j49l1Q4j20J77r7o5Q7m8M9K5j24O9O2r7J13
7224F9j65N7J19j58J00q3K5J06p5n3P1p4J26mj55J62r2N4J3j23J14k6l3O3r4K6
7250c0J10j31Q8o0n1J66j23J6K0m7J17q8o1P7k6L7L7j62J34j1l5J04j61Q4M1o1
$$ plain form
7054 41 -21 8 8 -44 52 -36 -24 22 -58 25 -22 -21 3 20 -17 21 -40 4 37 -49 54 -80 3 18 -28 -14 6 -11 5 -2 -46
7085 -46 31 -27 38 12 -84 62 -24 10 17 -59 4 32 -19 10 -11 -42 62 -34 53 -49 -45 57 -45 -16 -13 -7 43 19 -23 4
7115 4 -1 14 56 -121 52 7 -18 42 -78 12 31 -18 25 27 -49 50 -35 -32 10 -89 74 -17 -48 42 -41 48 3 -99 15
7144 15 14 -41 57 -90 2 66 -79 47 -72 -26 71 -21 12 8 -55 83 12 -82 48 -48 78 31 -108 54 -26 50 30
7171 30 -72 -6 78 -33 15 -25 -64 97 -50 -8 -13 -58 87 -21 -57 18 -17 41 54 -122 58 26 8 81 -115 10
7197 10 48 -34 45 -59 -10 94 -21 -28 7 -78 134 -15 -46 38 -82 95 -2 -67 20 -28 21 46 -78 -9 53 -44 69
7224 69 -96 -39 80 -78 22 -61 -36 70 -5 -58 13 -61 65 61 -94 68 -24 30 43 -80 34 8 -25 38 -56 -30
7250 -30 80 -51 37 -23 -74 92 -31 -15 5 -42 75 -13 -74 3 -23 14 51 -111 23 12 -23 81 -80 4 45 -16
7276a6N1o6j9J33q3k2L5q2J60p7n9R9j15J22k0j21J13k7rM4q5mR6q6O5o6j5J14
7304F0j12M3Qk9R0o0n8Q5o1N5J0j00Q9j9k3P9r0L1M1p1N8m9j1Q3q7O3J2j00J15
7333E2p1NK5m2N6j1p0L9J4KL6r4O7J3n8O8o9L8L6n1J2j5J2L5Np1Q8o5M1l2l6Q3
7365D2o0M7Jn0J9K7m4M7l0m5O4o1M1J0m4P5n4J5rkJM7m4pL6n8P9r2O6Pk6K0k9
7398a1J9J0pk7M1m6K5K8o0O6m2L4l8jJ6k1j0J4pk0M8m3L4k4LM6n8L6j6Pj5NJp
7432b0O1n9L9m3O8p4M7k2J2Kj6K7l2L1m7M5l7J9K7n3N7n8K6J4k7qrK5Rqk3M5n9
7465d1M9Pm5O3p0L8l1K7J8k2M0l7Nj1J6l1O2m0j0M7n4L1k7L5j5kj0K5j1k0M8o7
7497c3N0m9RJ3k1J4J9ooJ7qMm6K2L8n0P2m3RJ5l5L0Plqoj1O8q3J5J8m6O2m4L1
$$ plain form
7276 -16 35 -31 -50 83 0 -22 13 -69 91 14 -45 54 -61 61 41 -80 33 6 -3 41 -44 -48 48 -38 27 -39 -54 60
7304 60 -52 -9 -1 -30 60 0 -58 27 -34 21 31 -69 20 1 -22 57 -33 -2 39 -32 26 -23 -34 49 -38 25 37 -63 52
7333 52 -19 -14 11 -31 25 14 -56 -17 -3 -1 35 -59 8 21 -37 31 -38 0 36 -15 -3 -18 -6 29 34 -37 51 -14 27 -5 -41 42
7365 42 -18 29 30 -20 -1 26 -18 29 -1 -46 18 -43 -2 8 -36 39 -15 0 -9 -11 -10 37 -7 -14 22 -36 43 -49 17 24 -2 18 -11
7398 -11 8 18 11 -16 25 -21 4 32 -28 38 -4 30 -8 -9 7 -14 -24 -10 -17 -37 11 -32 2 -22 -19 27 -31 5 -11 -4 -19 -14 -13 -20
7432 -20 41 -18 21 -22 46 -28 19 -3 9 11 -5 22 -10 21 -26 19 -18 1 28 -25 32 -26 0 14 -13 -21 -30 -5 4 -4 -27 18 -41
7465 -41 8 15 -30 33 -37 1 -30 -3 15 -7 33 -4 1 -10 6 -25 37 -3 -13 34 -20 11 -16 19 4 2 -8 17 6 -14 34 -33
7497 -33 17 -32 -23 -10 -31 -17 2 -4 -10 7 -1 3 -43 -21 17 -33 39 -4 5 20 -15 15 22 19 11 5 -6 62 -21 -6 12 -34 28 -16 15
7532A5Prj0k8L7J0l5k3N6l6J6j2lM9k7J4k7k5M1Ml1L2k0OP2j00K4jpO2l9Lj3J
7566CJ1Km8M2j7j3L7q9J09k9k2K0m2K7K7l9J4j9MP5m0m3N2o8R3l9k5N3n6O4l4
7597A0m7L7K6m6N9j03M9M8o8L8l9K0O6o2rJ8k8N7Pq3R8o5M2j8n1N0qK9J8p5K2
7628hK2m6O0m8J3P5p3JJ8o8J37o8k4M7q7Q2pr3Q3K9n9N5j16P2L3n4O3q1K2N0m5
7659a5J6Op2J42p4n8P7n4R8k0r7P1l6L7J3o3K4M6m6M3o0RP7r3P0m8l6J07o3kK1
7690B0q6Q6om8N9n1L2L8j07O5Mk2O4p2MO3p8N1l6j8J16r2j2M5p1J07n2k2NlL7
7721B0K4j07O1K8l2O8j29L6Q5q9O8q2J1Q9m0m0K1m1P2K2r8O8o9P5K3j08N6J3%
7750EM1p2NN2n3O2n0m3J05o2J3Ml4P7l1o6O1l7M5Mq4O0J2m1P5j07N0L9n6K7j2
$$ plain form
7532 15 22 13 3 -25 12 22 -13 -36 20 -16 0 -12 -15 34 7 21 -6 -31 10 14 -17 15 -5 1 73 -27 -3 -4 -11 51 12 15 2 3
7566 3 14 16 -32 10 -7 -20 17 -72 37 8 -14 6 -36 -9 18 -21 -7 -26 -22 53 13 -30 22 -46 47 8 -17 36 -20 44 10
7597 10 -37 0 26 -20 39 -64 -15 33 -35 3 -36 -16 50 -12 -21 -3 -31 26 33 -50 48 -17 25 7 -44 6 -2 27 45 -30 -8
7628 -8 14 -32 28 -20 -7 68 -5 -4 14 -54 83 15 -9 38 -49 33 26 -67 16 45 -14 41 -75 -3 30 -24 39 -42 -20 30 -15
7659 -15 1 7 -65 77 3 -55 22 -32 66 46 -51 20 -16 21 34 -29 -5 41 -5 38 -22 -13 64 -29 41 -7 -43 64 1 -1 20
7690 20 -66 20 14 -34 25 -26 6 44 -63 2 6 -16 48 -24 -20 43 -35 16 -20 -38 78 -14 -26 19 -52 55 3 -19 -14 -17 20
7721 20 44 -63 -2 26 -6 62 -67 -31 54 -35 33 -49 -38 51 11 -29 -8 -49 23 45 -53 15 -54 21 44 -64 -8 5 5
7750 5 46 -26 -21 31 -22 40 -10 -53 52 -10 3 7 -27 50 19 -47 14 -23 22 26 -58 2 14 -27 48 -59 -9 30 -26 1 -11
7781a1l1P1m6NK9p5J16m9l2L6j2L6j6k4j1M8o4N0l4pM4k9K0m8L3K7m0J0rkK2O
7813A3l1K3j3nN0q3P3o6M9J1m4k0M2j4L3j9j5L9m8M8j8rN5o4K0j3j8jL0m8K6L1
7845A4m5N5m8K3K3m4L5k8kJ2K8j8j0l7O1k2m6O4n8M0Kj1K1k0L1kj3kJ7KOk0j9
7878a1Pk8L7k3%K9rOpPl1L7k4K2l3J1Lj2K4k0J7k6M0m5K6qML1m1L5l3K1Nk2M2
7913C1j4kK6l7mJ1joLj4J9k5jK7l5JK0j9JJ7m9M1j6L9k1j4L2m4KL2kNkkj7L5j3
7950DqKk1L1oK3m0J5mJ6l0J8lPnJ4j7k6N4k9j8L3j9J3k5L8l5K7orKj9K9k6K9o
7986CjJ5j6JqJ4l0K9k0J2j1K2J6l0K2l1J3PlLpk0K6nlj4j1LQj3K8j7J0j8j5N1
8022A0k2pQJ2k5K8l7K9K9n7L6j1J3Rl4NOk5P4m0j7L1n0L8K3n1L8m6K4J8l9J9%
$$ plain form
7781 -11 -42 29 -17 -12 17 -58 58 9 -23 13 1 37 21 -3 -14 34 -30 20 -14 -21 23 -6 14 -34 -1 26 -14 -4 -13 -15 7 13
7813 13 -18 5 -8 -13 37 -46 27 -39 10 21 -23 -43 -1 -15 18 -1 -16 23 -25 23 5 -4 51 -13 7 -6 -24 -25 5 -43 -17 14
7845 14 -31 24 -24 -1 22 -22 13 -15 -17 -5 23 5 -5 -42 19 -3 -49 15 -43 -3 -1 -12 9 -11 20 18 5 3 20 22 28 8 -11
7878 -11 -4 -32 5 -18 -18 11 2 8 1 8 -23 14 -10 12 -21 -10 -7 -19 5 -15 2 -24 16 -29 -3 -11 -7 24 -17 18 -15 6 11 -11 31
7913 31 17 15 41 4 0 11 10 4 7 -7 12 -13 -14 13 -22 -21 -1 -20 -19 -2 -51 -10 -26 13 -8 -22 10 -34 -32 0 -2 3 1 -1 -18 17 4
7950 4 -4 -2 -23 8 2 25 -15 0 -4 12 -18 0 -3 4 -1 13 -4 -30 24 -5 -23 10 -9 4 -21 17 -18 9 3 -6 -4 -23 6 -20 9 3
7986 3 2 17 1 2 -6 8 -22 7 -13 -1 -12 10 26 -4 18 -13 0 7 4 7 0 -20 6 1 -2 -16 -27 -24 -16 -29 -1 -18 -8 -26 -41 10
8022 10 -12 -19 -11 1 -24 4 -33 -4 25 -32 4 -7 6 15 -19 -14 -8 -33 41 1 -16 15 -35 3 26 -25 13 -33 -9 9 -30 -11 -11
8055a1j0Kj6lO3m6K9k5j4O1k3k5K2lNLk9O0n7L6J1p3O2j6lL2o8L3J6j7K4kn8N4
8089A4k9J0J8p5Q0k9j1K8n6N5J1m9MM6k6M8n1j1N0n0P8p7NO0k5ORq2Q2k3m6P2
8121C6p5N0K8j27Q1LpK7n2MP9q1P2m3p4J11o2L7j8k4N0Nm8L6k2K5K7p5O6n1K9
8152GN6j11O5rrK5j4n7O8ll5M3p0P9l4l6N1o5O9J9l9pj5mP0m4Pj1j2P8q4J2M0
8185C0m5N9l1l3O1k9
$$ plain form
8055 -11 -21 -19 -35 -38 25 -21 8 -17 -31 30 7 -18 4 1 6 9 -20 40 -17 19 30 -43 19 3 0 32 -36 -3 13 -4 20 18 -40 14
8089 14 -15 -5 13 -62 18 -11 -22 6 -50 5 16 -33 -29 17 -9 39 -12 -23 27 -23 55 -22 -17 43 18 24 33 -49 33 10 -36 36
8121 36 -39 11 39 -88 -7 -4 -11 16 -36 -32 47 -34 38 -5 -79 32 -30 7 -11 -35 15 20 -28 8 -14 11 38 -37 29 -22 7
8152 7 63 -48 17 8 -1 24 10 -47 21 18 -17 26 -44 35 1 -35 16 -49 20 39 0 -7 -22 -26 44 0 7 -4 -16 62 -22 -10 30
8185 30 -15 44 13 -20 41 12
8191A2
$$ Imaginary data points
##PAGE= N=2
##DATA TABLE= (X++(I..I)), XYDATA
0@%%%%%%%%%%%Qj6J6j6K1k9L2m0M8n6P2q8J04j20J36j54J78k08K39k71L07l47
33a84L93m46N00n58O28p03P83q69R63j067J179j303J439j586J748j928K122k335
51a224K571k831L124l454L822m241M725n287N951o746P720q943J0532j2686J5764
66H797k0536K8951m7891J58421N2278k28730J19459k20793J50101Q1803k07992
77a26132J43553N4801m3201J39659k87135j8552J98392j22117J92839j29497r4250
88i1640K33649j62913M973j2902j12421K35653J5472j51797R1902j45995R3705
99b314J06289k33643J49106j7142R032J32562k35238K0349R7057o4083J19056
110H1031q8238q7835J98506j12411O773P644j45229K23287l3816p6745O7517j24283
$$ plain form
0 0 0 0 0 0 0 0 0 0 0 0 0 8 -8 8 -8 13 -16 16 -24 24 -32 40 -48 56 -64 72 -82 96 -112 127 -144 163 -184
33 -184 209 -237 263 -295 333 -370 413 -456 507 -560 619 -684 755 -831 917 -1011 1111 -1224
51 -1224 1347 -1484 1640 -1814 2008 -2233 2492 -2795 3156 -3590 4130 -4813 5719 -6967 8797
66 8797 -11739 17212 -30679 127742 180020 -48710 70749 -150044 57 81860 -126132
77 -126132 17421 72222 29021 168680 -118455 -137007 61385 -60732 132107 2610 -91640
88 -91640 142009 -20904 -15931 -28833 -141254 94399 109871 -41926 49976 -96019 -2314
99 -2314 103975 -129668 19438 2296 11328 143890 -91348 -70999 26058 -38025 81031
110 81031 -7207 -95042 103464 -8947 -2174 5470 -139759 83528 49712 -27033 40484 -83799
122h3799J04727N3193j55196Q3863r213l972J26337j82687K3159P2971p3662J23093
134G8814j04634l7319J31423p6011K4636j1113r8862J43304j5037o1977O5090
145C8314j05968Q9618L5672j17747P2886l5471J9850Q0582j19909J6876M4315
156A9018n0455Q7552p4406l3447J03386o7546M0167k1523o9226J04127k3308k6303
168a1964L5515p0327O0359K9469q5556N8270l7477J5892O3174r3020L0985J0139
180E459k3311N7210n1777j8786O1617m0560K5873n539n8418P9184k9583o262K3313
193A8420n4579N2682L034l8005K5901k0264N912M1936n4813J5883J2495k8454
205a9852N2152m7702J124L0338k7526K7571j6998k0686L2172p286r798K0649l5394
$$ plain form
122 -83799 20928 74121 -81075 2788 -6425 -10397 115940 -66747 -43588 29383 -44279 78814
134 78814 -25820 -63139 68284 -7727 16909 5796 -93066 50238 35201 -26776 38314
145 38314 -67654 21964 57636 -60111 12775 -22696 -2846 77736 -42173 -25297 19018
156 19018 -31437 56115 -18291 -51738 51648 -15898 24269 2746 -66480 37647 14339 -11964
168 -11964 23551 -46776 13583 43052 -42504 15766 -21711 -5819 57355 -35665 -4680 5459
180 5459 -17852 39358 -12419 -31205 30412 -10148 15725 10186 -48232 30952 1369 -4893 18420
193 18420 -36159 16523 19557 -18448 7453 -12811 -6899 35037 -19776 -3893 8602 -19852
205 -19852 32300 -15402 -14278 16060 -11466 16105 -893 -21579 10593 3307 -6491 14158 -21236
218b1236K8079Q231l3152L2411l0698J7823J4365k7671J4933n024l245J5206j1404
231a382j0681K4598k1516J6293k713k1461L1176k1806J1449p87j2039J3872k658
244B345m568L037j039o139J8103k0110J0677K72j0423J9448k0002J0780k491r23
258a033M006l106j319O44M093r099J2703j3482R671r86p071J0710j2449J0792
272D074o184L604k374J241j95k324N624q983J1237j0131O888k764k165N435p136
287d153Q095p806P503o474M217j286k077N716p949Q771q209O389m029J584P28
302A020l064N354p419Q241p868O260l070o6K835n215O318o475O410n483M010k137
318c49l71K485m554N968o072N970n247L396j775m94L284n297O496o415N048l069
$$ plain form
218 -21236 6843 15074 -18078 14333 -16365 1458 15823 -11848 3085 -1939 -5184 10022 -1382
231 -1382 -12063 12535 -8981 7312 4599 -16862 14314 -7492 3957 3170 -8869 5003 2345
244 2345 -2223 814 -225 -6364 11739 -8371 2306 2578 -7845 11603 -8399 2381 -110 -1033
258 -1033 2973 -133 -1452 -808 3285 -5814 6889 -6593 3078 2092 -4979 5731 -6718 4074
272 4074 -2110 1494 -880 361 166 -2158 3466 -5517 5720 -4411 2477 -287 -2452 2983 -4153
287 -4153 3942 -3864 3639 -2835 1382 96 -1981 3735 -4214 4557 -3652 2737 -1292 292 1020
302 1020 -2044 3310 -4109 4132 -3736 2524 -546 -612 2223 -2992 3326 -3149 3261 -2222 1788 -349
318 -349 -720 1765 -2789 3179 -2893 3077 -2170 1226 -549 -1043 2241 -3056 3440 -2975 2073 -996
334i96Q48J80m34J249j961K969n950P766o976M823r43l944P151o601M266k469
350a022O77k22L393o122M227q89l558J0556j3888J0168l900j482O726q482L098
365g20K454j754o75M203j1772J5051p053k790J0089j7612J8302p215m061O723
379C170o915M361O127j1648K214Q530j4228K1542j9981J286J5496j8975J9477
392A0456j4396l547J5288p074k842O855j5686J5116P182k5267K5001k2737J3575
405A924J2782k9907K0558q706J706J3941j8912l467K1166j7675J5102o248k4208
418b1944M1438k6022R127K529k6159L5367r256j2433J1499j4722J0578K1542l9261
431a7717J8662k6j1542L8984m7275J2364J6475j9151K8302k6296j2098L4998j4993
$$ plain form
334 -996 -148 32 -402 847 -1114 1855 -4095 3671 -3305 1518 575 -3369 3782 -2819 1447 -1022
350 -1022 -345 -567 2826 -3296 931 42 -3516 7040 -6848 3320 -580 -2062 4664 -3818 -720
365 -720 1734 -20 -695 3508 -8264 6787 -266 -3056 7033 -10579 7723 508 -3553 3170
379 3170 -3745 616 6743 -4905 -2691 5839 -8389 13153 -6828 -5542 9954 -9021 10456
392 10456 -3940 -7487 7801 727 -2115 4740 -10946 4170 11352 -13915 11086 -11651 1924
405 1924 14706 -15201 5357 -3349 -1643 12298 -6614 -10081 11085 -6590 8512 2264 -21944
418 -21944 19494 -6528 2599 5128 -21031 14336 5080 -7353 4146 -10576 2 21544 -17717
431 -17717 945 919 -10623 28361 -18914 -6550 9925 -9226 19076 -7220 -19318 15680 687
444F87j55Q157l7812M5696m192k6905K8803l9585L4861J2674m1672K3219j1147
457g371L640L1921m3624J114K7767k6165L8377l2645k1027N1638l1048J8991r148
470B420l4626N1242p989k0058J7951l5571L2908K3809n3831K9887j8705P453M2732
483C7622o0999J4316J5131j5911M0404m0389j9467N0265k6372J8955p660m6549
495d0654O4305j4897j4556J8253m7905M7698J5474m7488K6274k3311J2181M5382
507D0756o3135J3550J3593j8463N1658n0915j4166M6378k7252K8273j7305m2752
519c9780O1669j3130j1398J6408n2827N2269J4016m5928K8835l3189K1982M0301
531C9228o0585J4536P187j2973N1731n1571j4419M5551l0825L7563k4346m0106
$$ plain form
444 687 532 8689 -29123 16573 12381 -14524 14279 -25306 9555 22229 -19443 3776 -7371
457 -7371 -3731 28190 -15434 -14320 13447 -12718 25659 -6986 -28013 23625 -7423 11568 2420
470 2420 -32206 19036 11047 -9011 8940 -26631 6277 30086 -23745 6142 -12563 -5110 37622
483 37622 -23377 -9061 6070 -9841 30563 -9826 -29293 20972 -5400 13555 5895 -40654
495 -40654 23651 8754 -5802 12451 -35454 12244 27718 -19770 6504 -16807 -4626 40756
507 40756 -22379 -8829 4764 -13699 37959 -12956 -27122 19256 -7996 20277 2972 -39780
519 -39780 21889 8759 -2639 13769 -39058 13211 27227 -18701 10134 -23055 -1073 39228
531 39228 -21357 -6821 366 -12607 39124 -12447 -26866 18685 -12140 25423 1077 -39029
543c9029O1607j9582K00Q157m9386N0562J2179m1162K8566l7095K2738M1645o2657
556b3257K3462n503o123N0100n2906n837L2689k2675L4292k1890l9321N7857k0134
569G54M162Q470n2829N5258J305k7439K1464l6864K6545L1205m8536J4913l039
582d631q409N0237n0336l783K8498k6058M2303l0398k5771M3949j7337R613J841
595I718m1578M1474O660k7125K5581m0256K5664K8006m5445K3591j7115L116L6630
608B8921l8873j524J7576j6870L1658j8404k8932M2192k1861J5177P26l8584M1042
621A2244n882q699J1434k8188J8562K0885l0603J3452q883n507L7698l7314N636
634e165Q857j5170L1636k2892j1452K1365j0524R398K227k8535K6762m64j1627
$$ plain form
543 -39029 22578 2996 3196 11353 -38033 12529 24708 -16454 12112 -24983 -2245 39400 -23257
556 -23257 205 -5298 -11421 38679 -14227 -20064 12625 -10050 24242 2352 -36969 20888 754
569 754 4916 13386 -39443 15815 17120 -10319 11145 -25719 826 32031 -16505 -1592 -4631
582 -4631 -13040 37197 -13139 -16922 11576 -14482 27821 -2577 -28348 15601 -1736 7877 9718
595 9718 -31860 9614 16274 -10851 14730 -25526 138 28144 -17301 6290 -10825 -7709 28921
608 28921 -9952 -11476 6100 -10770 20888 2484 -26448 15744 -6117 9060 9786 -28798 12244
621 12244 6362 -2337 9097 -19091 -529 20356 -10247 3205 -5678 -11185 26513 -10801 -5165
634 -5165 3692 -11478 20158 -2734 -14186 7179 -3345 6053 8280 -20255 6507 6043 -5584
647e584J8227l1292K1093R870k0824J4988j5084M137J9249j9526J07Q140j3260
660i759K3273j3463j2300K1375j7029J5905m535j6563J8899m963j293O309j5346
673i490Q551J0504j6436J2636j0704K95J6655j8600P941j796m182J2769q743m825
687e425R266p062O002J945j4089J4785o434O26N403j2521R893K37m619M348m577
702b222o92R155r394L192J482o530J1461r119J323L101m331N199k065l651M101
717A010l12k567N676q261N623L67m323O045o577M218l0j377J84N79j630K477k95
734H07l466N607o159N398k552j062L219l567L437k911J966k023K772k490J421
749C97J78k477M548n401N049l679J952n7j508K408l189L863l995L833l207J919
$$ plain form
647 -5584 12643 -18649 2444 12314 -8510 6478 -8606 -4469 14780 -4746 -4639 3501 -9759
660 -9759 13514 51 -12249 9126 -7903 8002 3467 -13096 5803 840 -453 5856 -9490
673 -9490 -939 9565 -6871 5765 -4939 -4644 12011 -6589 1352 -444 -4626 8143 -600 -5425
687 -5425 3841 -3221 2781 4726 -9363 5422 -1012 -386 5017 -7504 2389 2626 -1993 2355 -2222
702 -2222 -2914 6241 -3153 39 1521 -5009 6452 -2667 -1344 1757 -2574 2625 560 -3091 1010
717 1010 698 -1869 3807 -4454 1169 1536 -2787 3258 -3319 899 869 -508 -324 255 -1375 1102 807
734 807 -2659 2948 -3211 2187 -365 -1427 1792 -1775 1662 -1249 717 -1306 1466 -1024 397
749 397 575 -1902 2646 -2755 2294 -1385 567 510 -998 1410 -1779 2084 -1911 1922 -1285 634
765F34l41j502L184m145M636m461L503k284O98J094k585L787m375M262l732K601
781I74j176k37J805l157L880m325M110l158J805j48j467K671l546L922l870L380
797A463k203P90O42k295L418l849L765l018J895p99j94J051j940K803l406L840
813A963l488J903j3j739L238l576K758j725J008n94O05r83O78J080k875L988m632
830b404L532l69k184L241l455K186K70j328J21J417k401L228j925k229N159n215
846b356M429j664l087N142l161P52J304l718K925J978n293M836l843M71N972q332
862c645M739j112k259O545n954o90M966m822M386p38p291R979m914L99L745r802
878f468R120k68n261N642o310K371P544j0702M539L09m849J2457j1475N5O734
$$ plain form
765 634 293 -1209 1975 -2170 2466 -1995 1508 -776 -78 1016 -1569 2218 -2157 2105 -1627 974
781 974 -202 -439 1366 -1791 2089 -2236 1874 -1284 521 373 -1094 1577 -1969 1953 -1917 1463
797 1463 -740 50 692 -1603 1815 -2034 1731 -1287 608 -191 -385 666 -1274 1529 -1877 1963
813 1963 -1525 378 365 -1374 1864 -1712 1046 -679 329 -265 340 -643 35 1115 -1760 2228 -2404
830 -2404 1128 759 -1425 1816 -1639 547 817 -511 -390 1027 -1374 1854 -71 -2300 2859 -2356
846 -2356 2073 409 -2678 2464 -697 55 1359 -2359 566 2544 -2749 2087 -1756 -1285 4687 -3645
862 -3645 1094 -18 -2277 4268 -1686 -2376 2590 -2232 2154 1416 -5875 4104 -810 -411 3334 -6468
878 -6468 2652 2384 -2877 2765 -3545 -1174 6370 -4332 207 516 -4333 8124 -3351 -3296 3438
893C438p486R521n205p200J1251m502J69M439j3565J2317J562r244R979j3004
907g530P621Q207j3635O822l245j960J3403j2494k672J0252j0567J4119p366j1696
921a0741J7980j0343O688L59j5319J5455L37p565Q132j3298O529J3919j9751J0455
935B837o347k203K0117k0620K994M996p106J5342r649j1683J7147p340M351L877
949F713k2841K2334k261o706J0227k0883J4953Q652j5323P205o778q13K0641j9741
963d621r66R281j2799K4113j6393j0140J8328j1734J2909m159j8332J8927M43
976D857o928J0001k2044J3805J3914k1703J4538j5678M950K0721k2825M262J350
989g80n504K0005j3327j3322J9523j1668J3220j980k4506K5934o749P61N604k2741
$$ plain form
893 3438 -4048 5473 268 -6932 4319 -183 -14 4425 -9140 3177 4739 -4505 5474 -7530
907 -7530 91 8298 -5337 1485 -1760 -3720 9683 -2811 -5483 4769 -5798 8321 955 -10741
921 -10741 7239 -3104 3584 3943 -11376 4079 4416 -3149 4983 -8315 -1786 12133 -7618 2837
935 2837 -3510 -5713 14404 -6216 -3222 1774 -5332 10010 361 -11322 5825 -1515 2836 6713
949 6713 -16128 6206 3945 -2761 7466 -13417 1536 10188 -5135 2070 -4708 -5521 15120 -4621
963 -4621 -5587 3694 -9105 15008 -1385 -11525 6803 -4931 7978 3819 -14513 4414 4857
976 4857 -2071 7930 -14114 -309 13605 -8098 6440 -9238 -4288 16433 -6392 -2130 -780
989 -780 -6284 13721 394 -12928 6595 -5073 8147 6167 -18339 7595 846 1607 7211 -15530
1003a5530J7105Q647j4344Q163j2003J760K3747k3874M680R36q568K6605k0204
1016b880o011J2575r205J5388n548j9738K0138k796j196Q675k6591J9405P007
1029I223j3867J2123j9199Q667J7309j8917M142j779n690K3551j6757p994J3897
1042D709j2710J9651q214j7460J9385o751N143L307k1219J5199O752j1344J0936
1055G384j7806O306J7729j9124Q149o788k826K0540j5211m062P971q856J5987
1068I393n300j6597J7675q029O667L418k0684J6117J144n126P563j5247N857J3700
1082A0551j4767O621n415m409K0390j6145L97M076q045J5994p694r595J1011n146
1096b176M751L917j7499J3186P19n142R633j6713Q635P129r455O117o639r26J2618
$$ plain form
1003 -15530 1575 10222 -4122 4041 -7962 -6202 17545 -6329 -1649 -713 -9281 17324 -2880
1016 -2880 -8891 3684 -5521 9867 4319 -15419 4719 1923 727 9402 -17189 2216 9223
1029 9223 -4644 7479 -11720 -3053 14256 -4661 -519 -2298 -7988 15563 -1194 -9188 4709
1042 4709 -8001 11650 3436 -14024 5361 -1390 3753 7060 -14159 1040 7792 -3552 7384
1055 7384 -10422 -4116 13613 -5511 2638 -4150 -6976 13564 -1647 -5709 2262 -6594 9393
1068 9393 4093 -12504 5171 -2858 3809 7227 -13457 2660 3804 -1322 6241 -9006 -3149 10551
1082 10551 -4216 2405 -3010 -7419 12971 -3174 -2777 1299 -6746 9248 1554 -8041 2970 -2176
1096 -2176 2575 6492 -11007 2179 2898 -2244 7389 -9324 -689 6440 -3015 3102 -3537 -4463 8155
1111H155r209j861N091q732J4181o320p884J0566q411Q705j076j0107Q535m41
1125A192j766M937r723L416Q085r921P657p031n90J0895j0088L667j218k906Q009
1140D615l773m658N841m130L538K642j0427R033l169J06M447r109N810R76k721
1155i79K657l113j041O410m985M01K014n402Q351m916j132L404m278M889j573
1170G07k865K618j19r97L005m709J820K711m327M717m479J151K832l424K183j259
1186d35m77K072o76j867K536k389J793Q08l492L700k561J323O03k124J636k98
1202A52k17L54k48r84K198j885Q33K19j539K390j945R45k32k89N67k58k19J9N22
1221C83q98J306j447R00j19m65Q93j096J001p09M96m71L55j80l0L88p26Q99r70
$$ plain form
1111 8155 -1054 -2915 2176 -6556 7625 1305 -6579 3987 -4424 4281 3205 -6902 1633 1192
1125 1192 -574 4363 -5360 -1944 6141 -3780 3877 -3154 -3744 7151 -2937 730 -488 -3394 4615
1140 4615 842 -3816 2025 -2105 1433 4075 -6352 2681 -488 -382 4065 -5044 766 1742 -979
1155 -979 1678 -1435 -2476 3934 -1051 -650 1364 -4038 4313 -603 -1735 1669 -2609 2280 707
1170 707 -2158 460 341 -656 2349 -2360 -540 2171 -2156 2561 -1918 -767 2065 -1359 824 -435
1186 -435 -912 1160 484 -1383 1153 -1236 557 1365 -2127 1573 -988 335 938 -1186 450 152
1202 152 -65 289 41 -943 1255 -630 203 422 -1117 1273 -672 273 41 -248 319 61 -158 -139 383
1221 383 -515 791 -656 244 125 -340 553 -543 458 -251 245 -226 129 -51 -81 307 -419 480 -490
1240d90Q66o21L81k2k79N04q06R61r61Q73n73J88J29m09N94p40Q93r40R63q31
1260c20M18O5n73J031j201J195j057P81n08J95J69n26R61j307J400j312J008m52
1278c3r0N12r07J233j461J491j362J013k84m88J007j456J606j358J089q95O11
1295B28l25n9P30j654K271k263J872r76l78J248j403J363j107P51r08J486j581
1312g05R96j15j253K852l344K460j358N7J426j575N99k15M09o10J574k950K721
1329I69r06q14K505m160L676j250l06J021j728P85J274j282m71J688l048M479
1345B432l029p14K914l720M395k463j326K318r95L05J210l353J918K194m086M359
1361B359m612J631L659n113L311k243k38L903k981j330K949l111L687m00n420
$$ plain form
1240 -490 376 -245 136 114 -165 339 -467 494 -467 406 -167 21 150 -259 335 -405 488 -452 511 -320
1260 -320 98 163 -410 621 -580 615 -442 339 -169 26 195 -331 630 -677 723 -589 419 -33
1278 -33 -123 389 -518 715 -746 745 -617 396 112 -376 631 -825 781 -577 512 -383 228
1295 228 -97 -156 574 -1080 1191 -1072 800 -176 -554 694 -709 654 -453 298 -610 876 -705
1312 -705 291 176 -1077 1775 -1569 891 -467 -410 1016 -559 40 -175 234 -376 1198 -1752 969
1329 969 63 -751 1754 -2406 1270 20 -286 735 -993 -208 1066 -216 -687 1001 -2047 2432
1345 2432 -597 -1311 1603 -2117 2278 -185 -1511 807 -188 117 1327 -2026 -108 2086 -2000 2359
1361 2359 -2253 -622 3037 -2076 1235 -1008 -1246 2657 -324 -1654 1295 -1816 1871 1471 -3949
1376c949O418l763K127J383o282N275j63j778K647m317J038N295n953K855j354
1391e21k538Q166o718M74K041l669O380k851m556N507k647J760K360q696O929
1406A421J28k827M833q271M204M498n912L376l142j359Q610o727o66L139n362
1421d057R213m493n167O745m432M655M57q668O762N79k529N034r387M173O095
1436D980p547N363n851L3R337p688M23J161m138R328m044o420P588n422O050M94
1452C647j0688R116j796J22L716j0045N035N354o252M539n745j029J1259r264
1466b031J870l9m740J1714o501m002N061m368O542P7j0114P833q60n58N432j2266
1482f950O546M185n538N631q238J431Q802o980J066m10m385J1052n334m958O150
$$ plain form
1376 -3949 2469 -1294 833 2216 -4066 1209 1046 -732 1915 -2402 -1364 3931 -2022 833 -521
1391 -521 -3059 5107 -1611 -1137 904 -2765 3615 764 -3792 1715 -932 828 3188 -5508 1421
1406 1421 1549 -1278 3555 -4716 -512 3986 -1926 1450 -1692 -3051 5559 -1168 -1834 1305 -4057
1421 -4057 5156 663 -4504 2241 -2191 2464 2921 -5747 1015 1594 -935 4099 -5288 -1115 4980
1436 4980 -2567 2796 -3055 -3022 6315 -1373 -950 211 -3927 5401 1357 -5063 2525 -2897 3153 3647
1452 3647 -7041 2075 279 401 4117 -5928 -893 4461 -1791 2748 -2997 -4026 7233 -2031
1466 -2031 -161 -200 -4940 6774 273 -3729 1332 -3036 3506 3583 -6531 1302 442 -116 5316 -6950
1482 -6950 -404 3781 -1757 3874 -4364 -2933 5869 -1111 -45 -455 -4840 6212 878 -4080 2070
1497B070o381Q815j516r102P836k721K367K869j0060N070M125m880N403p823N17
1512c411R718q377L592k925l091J0711o232k167K976m387P369o42q576P017k762
1527a187K090L968j1072O541J483k632M769q086J849O663n426K099j964l464R790
1542E421n373k077L222n420Q470k376n875N231k968L196K052q062M344J879k736
1557a072M943p572J678N889n535L875l926j414P300m399n74J288l781O372j213
1572A859n315M983l638L504J718p167M715m54m06L128n744J470L984l735K790
1587A692k653j933O554m371O59L59l148N601j955k629K618k211K274J545n300
1602b898L432l71p03L259n290K155J789k174K340k534o85L764k414J44P40k938
$$ plain form
1497 2070 -4311 4504 2988 -6114 1722 -999 1368 4237 -5823 -753 3372 -1508 3895 -3928 -3411
1512 -3411 6307 -2070 1522 -1403 -4494 6217 -15 -2182 794 -3593 3776 3134 -5442 1575 -1187
1527 -1187 903 4871 -6201 340 1823 -809 3960 -4126 -2277 4386 -1040 1059 -905 -4369 5421
1542 5421 48 -2029 1193 -4227 4243 1867 -4008 1223 -1745 1451 3503 -4559 -215 1664 -1072
1557 -1072 3871 -3701 -2023 3866 -1669 2206 -1720 -3134 4166 -233 -807 481 -3300 3072 1859
1572 1859 -3456 1527 -2111 1393 3111 -4056 659 205 -201 2927 -2817 -1347 2637 -1098 1692
1587 1692 -961 -2894 3660 -711 -52 307 -2841 2760 805 -1824 794 -1417 857 2402 -2898
1602 -2898 534 163 -540 2719 -2571 -416 1373 -801 1539 -995 -1680 2084 -330 -186 554 -2384
1618b384M484j762j643K285k737K877q7k584J814l60k34J969l067Q80J787k348
1634a110K642k523P4K329k045J129o46q18J793l46j395J647j642J278P40k552
1650a445K337j527Q15O56j682R39R7l06M26k40j005K024j586P13Q7j335K151j573
1668d54O58j75l27N41pm36J73L39q23J409j636R40k1o00J129j334R31m51K97k90
1688a37K63k91J46L51r11J193j226R98m34j78N17o86P61o88O23o43O18m03P9K99
1708B51o73R20r64Q27o04L16qk23M79o55P46p84O98m90K02J37m02N50o33O23o05
1729b92N30l62J28J50m10N77p01P09n10K68p1j01K33l49M68n39N38m47K98j24
1749gr4K70l91M47m86M51l32J93l1j53K87l31L75l93L12k21J97j04n0J81l81N33
$$ plain form
1618 -2384 2100 338 -1305 980 -1757 1120 1033 -1551 263 -97 -331 1638 -1429 -549 1238 -1110
1634 -1110 1532 -991 -917 1412 -633 496 -150 -968 825 479 -916 731 -911 367 1107 -1445
1650 -1445 892 -635 180 836 -846 93 190 -116 310 70 -935 1089 -497 216 303 -1032 1119 -454
1668 -454 204 29 -298 243 236 -200 -27 312 -511 898 -738 202 181 -419 710 -624 307 -144 153 -137
1688 -137 126 -165 -19 332 -579 614 -612 386 -48 -226 291 -395 366 -322 301 -342 276 -127 -48 251
1708 251 -422 498 -466 361 -243 73 65 -158 321 -334 412 -372 326 -164 38 175 -227 323 -310 313 -292
1729 -292 238 -124 4 154 -256 321 -380 329 -181 87 16 -85 148 -201 267 -272 266 -181 117 -7
1749 -7 -101 169 -222 225 -261 190 -142 51 20 -133 154 -177 198 -195 117 -104 93 -11 -61 120 -261 272
1771B72n35L94j75m0J90k03R7p2J59j79L40n77M68j28j77M96p42N66j40q7J77
1792A04k12l6M05k91r6L84p64R99n79j65N45p29Q28l82l10L91n7j16M88q62L29
1813a26O38j049J148j104K74Q66j072O79m37j80R24m53o01Q68r03Q95K06j648
1831a075J748j066N50N22j679J246j2l68O17r25j49J645j500O33j19j204K550
1848A414j802J27N45j186J846o11j239J155m02J40J153k581J526M96j189J964
1864A356k669R73J426j584J043j026m56K234j185p86J178j868K598n55k181K329
1880H27j794J726L11k720J811Q3l56J327k411L13K447k327J659j504r36L602k516
1897d58M56l1j407K977q85j929J692j205J280J222l871K520k20l56K071l793J494
$$ plain form
1771 272 -263 131 -44 -84 106 -97 0 -72 87 -92 248 -329 139 11 -166 330 -412 154 14 -73 104
1792 104 -108 -144 261 -30 -126 258 -506 493 -86 -251 294 -435 393 11 -299 92 35 -81 407 -455 -126
1813 -126 512 -537 611 -493 -219 647 -425 254 -183 -363 561 108 -493 375 -528 367 573 -1075
1831 -1075 673 -393 157 679 -1000 246 234 -134 483 -442 -591 1054 -446 187 68 -1136 1414
1848 1414 -388 -261 284 -902 944 333 -906 249 -153 -13 1140 -1441 85 581 -608 1356
1864 1356 -1313 -340 1086 -498 545 -481 -937 1297 112 -674 504 -1364 1234 679 -1502 827
1880 827 -967 759 1070 -1650 161 244 -112 1215 -1196 -883 1564 -763 896 -608 -1544 2058 -458
1897 -458 -2 -33 -1440 1537 652 -1277 415 -790 490 1712 -2159 361 141 -215 1856 -1937 -443
1914d43J591j503J353j782p78L534k068j37N43k353M063j448j876J909k000K531
1930A136K75l274J947n6j18K045l838J142K125k098K345k890k16L437k263N84
1946B83m68j673L693j111j999J901k207K766M06l687K558r78Q23J555l751J315
1962e74J594j429J926k566o15L728k554J001p46j775M027j632j113R81j741K566
1978A078M96l411K164q27N99K062m219J817Q06q68J983k933j0K741j641O73n94
1995h4j953L880j516r68J184k389L244l89k276J502r57J048J344l136R77J147
2011F58j238K332k969J21K436j853J480j502q98K701r33p10O26j699K281L47k529
2028a349J910j549J358J120k855J358j5l2J276j980k00J971j390J109q36j413
$$ plain form
1914 -443 1148 -355 998 -784 -1562 1972 -96 -233 310 -2043 2020 572 -1304 605 -1395 1136
1930 1136 1411 -1863 84 28 -90 1955 -1883 -741 1384 -714 1631 -1259 -1475 1962 -301 283
1946 283 -185 -1858 1835 724 -1275 626 -1581 1185 1591 -2096 462 -516 307 1862 -1889 -574
1962 -574 1020 -409 1517 -1049 -1664 2064 -490 511 -235 -2010 2017 385 -728 253 -1488 1078
1978 1078 1574 -1837 327 -500 99 2161 -2058 -241 565 -303 1680 -1253 -1263 1478 -163 510 -84
1995 -84 -2037 1843 327 -641 543 -1846 1398 1009 -1267 235 -722 326 1670 -1466 -489 658
2011 658 -580 1752 -1217 -1096 1340 -513 967 -535 -1433 1268 335 -375 251 -1448 833 1180 -1349
2028 -1349 561 -988 370 1490 -1365 -7 -22 -54 1222 -758 -958 1013 -377 732 -104 -1517
2044a517K931j587K52J02j473K214l88j151P87p47O61J165k319J068R5m84J728
2061A337k272N56Q69p66R73j020m99J493n57k62N20j461J759k20j060J073j279
2078h16J164K96j244O07r1l8Q46j120o5R52q93J016q25m75J334q73M52k36n80
2097e89R44j34n10M97o07M60N46j177Q06m02Q3O75j028L94J67k19M13l97k90P17
2117C49m20J19J43o73Q32l37j02K53m80M40P3m12K34m9j02M55n38J23K14l21M65
2138B66m15K6K40k04J44l2k03K65j0k11K60k83K45%k34K60k09J05N8q5qO9r2R7
2162D9k9j27K70k78K04j09j8R0q8N4q3J13j04J40j48P7J8j02J71k25J98j09R5
2185E9o2ON8j56K12k56K41j45O8K2j14J22j36J71j67J52j12O3k5r3K07k61K30
$$ plain form
2044 -1517 1414 -173 79 181 -1292 922 534 -617 170 -577 84 1249 -1070 -2 93 -391 1337
2061 1337 -935 -379 490 -276 697 -323 -822 671 114 -148 372 -1089 670 450 -610 463 -816
2078 -816 348 644 -600 7 -84 -122 724 -396 -461 491 -402 614 -211 -686 648 -225 227 -9 -589
2097 -589 355 221 -289 208 -399 61 607 -570 236 -166 -83 592 -436 -42 125 -94 319 -78 -368 349
2117 349 -71 48 191 -482 350 13 -89 164 -316 124 197 -215 19 -30 -132 323 -215 -92 122 -199 266
2138 266 -149 -123 117 -87 57 25 -178 87 77 -134 126 -157 88 88 -146 114 -95 10 68 -17 -25 44 -48 49
2162 49 20 -107 163 -115 89 -20 -38 52 -36 18 -65 48 -56 84 -64 13 31 -71 100 -125 73 -36 59
2185 59 -3 3 61 -95 117 -139 102 -43 25 47 -67 55 -81 90 -77 75 -37 26 1 -92 115 -146 84
2208H4j50P8l1k9J07j46J76k13K44k18J33j6j12J99k55K72k20J57r1K6L4j20J90
2231I9k16K49k56K18j28QJ00j61K13k57K52k00R6K2p1J21k22K56k20J53j32J01
2253B5k6m7J83k84K77k34K00j01p1J25j08J30j15J08j51J83j22N1Kj83L51l35
2275a42K40j29l0J62j15Ok1M3o9K15l21K06l3j10L00l99K59n0k7J14j65m4K16
2298A06j29n2J61l90N23k25q2K16l69M02o4k14J21k9kK90m53J27K27l54M88m82
2320a84OL68k91K21j75j78L96o2k46L06m88M84Q5n46M80l71K60K24n44J91J71
2341A07j87L80m03k26O82n06L48k11m10P87l46k5N8m00N35J14o23M06k49J45N56
2362E32j012M70K9j48N78p70O4M95k97K61k13n39R38l16j68L08q36R71r5n29M04
$$ plain form
2208 84 -66 12 -19 -48 59 -87 89 -124 120 -98 35 19 -93 106 -149 123 -97 60 -31 -5 29 -91 99
2231 99 -117 132 -124 94 -34 -26 74 -87 126 -131 121 -79 17 39 -32 89 -133 123 -97 56 -76 25
2253 25 -1 -48 135 -149 128 -106 94 -7 -78 47 -61 69 -46 62 -89 94 -28 23 25 -158 193 -142
2275 -142 98 -31 -61 101 -14 -8 -29 14 -55 160 -161 45 12 -98 202 -197 62 12 -15 99 -66 -110 106
2298 106 -23 -75 86 -304 219 -6 -88 128 -241 161 97 -117 4 -25 -27 263 -190 -63 164 -190 298 -184
2320 -184 -178 190 -101 120 -55 -233 163 101 -145 161 -327 157 242 -304 176 -195 65 289 -255 -64 107
2341 107 -80 300 -103 -329 353 -153 195 -16 -426 361 15 -10 48 -352 183 297 -326 80 -169 -24 532
2362 532 -480 -10 19 -129 449 -321 -257 238 -59 202 -11 -550 388 72 -96 212 -624 347 252 -277 127
2383A27m86M81L59q20J79K45k56P93q93j12P44n94O76n56m12R44l64lK5o22P78
2404B33J97p59N37o40M95O01j131N16j98O4O89q91p8N94l42N21m16o58J117m54
2424cJ41N8r49J134j00m54L29o41N24N71r71L10m9j22R86j072k5N45m43P94o73
2445a10m63Q55k73J45Oq65R58J02n68M61q31O21N65r47M20l01Q5Q14r04q9M67
2466A48l67P63n59n71R51m64L51o7q63R64p3k84K96p31M89N77q49L55k94K0Q78
2487F70r28P0K09k88P77n25m39O94l19K97Rq77Q79l1k73L71q03N43L85o24L08
2508A05l18J4P56p11j3K67l91Q04n17l85N80l54M18j13o14N84J5j98L07o99M17
2529d6L82n62M23m48J14N59n82J03M0j59N26k97l72N03l31L23j1o04O20j98N0
$$ plain form
2383 127 -359 122 481 -339 -160 85 -171 622 -271 -383 361 -233 443 -113 -525 419 55 52 77 -545 233
2404 233 430 -329 208 -432 63 664 -467 49 -149 -85 604 -287 -365 229 -113 408 -8 -666 451 -3
2424 -3 138 196 -753 381 281 -173 156 -485 39 610 -361 -51 -100 -222 764 -308 -333 212 -231 563 -110
2445 -110 -573 282 9 154 160 -705 253 355 -213 248 -583 38 603 -344 76 -225 -140 674 -230 -319 148
2466 148 -219 544 -15 -586 365 -99 252 185 -678 286 213 -71 225 -506 -17 560 -289 66 -228 -208 670
2487 670 -258 -188 21 -267 510 -15 -454 240 -79 218 227 -650 229 198 -75 296 -507 36 421 -203 105
2508 105 -213 -199 557 -154 -167 100 -291 513 -4 -389 191 -163 255 142 -472 112 127 -71 236 -463 -46
2529 -46 336 -226 197 -251 -137 422 -160 -57 -17 -176 350 53 -319 184 -147 176 165 -439 181 -17 33
2550C3J49m88K79K45l17J83j86r5N63n10J11N3k39N47l98m9J78j61K27k4l44K74
2572C1M4j69L10n00K80J42k68K92l30J39J94j74%L4j74L12j09k43L15k91K88o7
2594E6k38K58j31O7N3j39K5J58j87J30j14q3L31k99J68r4p5K21j56K1K9ll0J22
2618I0k07J65m1m1J55k35J65m4OL7p8RN2j7o8J19j45J52q4oR0j25J14j06L8nO2
2645E2p6L0j3l0J01j71J65p7J2J7o1O7l7M1o3R6r0M0J2l5Q2j28J32j02N2m7L0
2672aNKLn3R6j36J31r1J6N7r7Q1m6P6p6L4jjpj9O8j11R7p5O0Qm9M7l0M0o5J02
2704F5j21J07q8L6L1p6J28j17Q4q0L6kk3M7n5O6o9O2r3O5k8oR0j32J27q3L8j5
2732fk0L3k8M9p4J07j26J29q2qR9j56J62j05J5M4o3L9K0o7MR1j29J74j81R0P3
$$ plain form
2550 33 182 -306 -27 218 -99 84 -102 -197 366 -144 -33 20 -219 328 -70 -119 59 -102 125 101 -243 31
2572 31 75 -94 216 -284 -4 138 -130 162 -168 -29 165 -9 -9 25 -149 163 54 -189 126 -165 123 56
2594 56 -182 76 -55 12 65 -74 -49 109 -78 52 -62 -145 186 -113 55 -39 -114 107 -49 -28 1 -2 -32 90
2618 90 -117 48 7 -34 121 -114 51 7 13 50 -28 -19 33 16 -52 67 -78 74 -10 -16 74 -51 63 -43 -5 -10 52
2645 52 -24 6 -7 -37 64 -107 58 -19 -7 10 -51 16 -21 20 -43 53 -37 3 15 -20 62 -66 66 -36 16 -31 -1
2672 -1 4 6 9 -44 52 -84 47 -44 -28 29 -68 13 -33 43 -33 1 0 -1 -8 -27 41 -70 27 -48 12 20 -29 18 -12 28 -37 65
2704 65 -56 51 -37 -1 30 -46 82 -35 49 -31 5 3 -20 27 -28 38 -31 31 -62 3 -25 -31 59 -73 54 -29 9 -6
2732 -6 -26 7 -21 28 -46 61 -65 64 -18 -26 73 -83 79 -26 -11 33 -30 9 29 -38 -34 57 -72 102 -79 11 84
2759H4j92J97j73O9J05j23j4P6j00J06K0k20K71k06J68Nk60L13j77O0P3j81R4
2782eR7j51J18o5j37L78l37J27Qj77L83k62m3J33j38J50L8l42K73n7l2K59m96
2805b78L16O7k29L04l62J27K48k63O9J1k17N15k94k03L73m11M58j29l78M15k31
2826i2J71J42n40L00K23k89L15m65O0N66n77L07k10j75O20l78q8J66l21N22q1
2847A76n72N83l59K48K81q52N50N9j51L34n96J25N55n13K58k15k96R19n89p7J91
2868E9m34Q18l15m91M95k98L05K54r21N81Q4k53N66r55L81M85n30L97m27j68Q74
2889E07n29j23K30n84R84k99n94O31n64O38N2r06O05pm0M67r39K33P06o77N70
2910C61o80p9J007p58J93j18l87R39l20n54N49m79N54K77j125P70k23R3N14j096
$$ plain form
2759 84 -108 89 -84 -15 90 -33 -47 29 -71 35 55 -165 106 -100 68 73 -187 126 -51 9 82 -99 -5
2782 -5 92 -59 59 -6 -143 235 -102 25 33 -144 239 -23 -66 67 -71 79 117 -225 48 -9 -41 218 -278
2805 -278 38 105 -124 180 -182 -55 193 -70 -1 10 -207 308 14 -189 184 -227 231 102 -276 139 -92
2826 -92 79 221 -319 -19 204 -85 230 -235 -175 391 -186 121 -89 -264 356 -22 -110 56 -265 257 176
2847 176 -396 187 -172 76 357 -495 55 114 -37 297 -299 -174 381 -132 126 -89 -385 534 -55 -132 59
2868 59 -375 443 128 -363 132 -166 139 393 -528 53 137 -116 450 -505 -124 361 -169 228 -199 -367 507
2889 507 -22 -145 85 -499 485 186 -408 223 -341 297 349 -557 48 41 1 468 -471 -238 468 -209 361
2910 361 -319 -398 609 -149 44 -74 -461 478 158 -396 153 -326 228 505 -620 150 -73 20 534 -562
2930e62M82L50l37L84n64j98J038o65P7O1o66J235n44l33L89n68P72nq28N38p4
2951a8NN95j117L97M83n67P28r03P2P95n70K56k65l39Q85k80m48M59o50Q19M6
2972C83r52P74m30L38L20q96L73K67k44M67o36j30Q63o93M12k74m71J052n29o4
2992g0J27m39O44N2o89M60k39J41N21r99N34L2j88N61p71J39M41l48K41j68l98
3013d16Q01l88j00K68n96P81j63m61M25l72L27K27o17K63R9j95N23o60O8M53m36
3034a69M28l75j68N60k93k1J17l82M76Jm26M04l99K99K31n80L84j20MK32l19O
3056a10L16l30K70j60k41M96l45J59mk60L97j37j37J65j67J16J88m09K25l9q7
3077i4L38m61K15O4j34J80j61p6K16q4o2J51k78L18q2j41K11k53K02%j78J11j3
$$ plain form
2930 -562 -80 270 -67 317 -247 -445 593 -72 5 66 -600 635 91 -242 147 -421 351 346 -482 56 -18
2951 -18 -13 582 -535 -138 345 -222 506 -397 -325 470 -100 156 -109 -448 437 157 -291 168 -482 337 383
2972 383 -569 205 -225 113 433 -463 -90 177 -67 400 -236 -366 497 -196 216 -58 -529 523 -6 -70
2992 -70 57 -382 262 314 -375 85 -154 -13 508 -491 43 75 -113 448 -323 -184 257 -91 150 -18 -416
3013 -416 385 -3 -103 165 -431 350 187 -274 151 -221 106 333 -284 -21 78 -117 406 -254 -186 267 -169
3034 -169 259 -116 -284 276 -17 -38 79 -303 173 174 -252 152 -247 52 283 -297 87 -33 -29 203 -116 -110
3056 -110 206 -124 146 -14 -255 241 -104 55 51 -209 188 51 -86 79 -88 28 216 -193 32 -7 -94
3077 -94 244 -217 -2 62 -72 108 -53 -129 87 3 -59 92 -186 132 50 -91 120 -133 69 69 -109 2 -11
3100a1j6J08q7o6J95j90J57j19n2J76j78J47o6j5K3Rq8O4Lp0K05k53J79r9J1J20
3126H7j39J09q6O2p5P2p9O4Ko9J51k02J71j01M0M3o9O2p2P3r6J25j36J07l5m8
3152c9J23j78J59j16M1K9k6J7k8Q9j61J43j29J26m6m2R0j47J75j17O5o2L3K7l9
3177a3N8r1J25j40J19r7L0N2j10J30j27R8n3M4n2J9Rl8Q5j25J63j78J23j9q5J55
3203H2j54J03m8K4l0N7p0P4l3o8J61j97J73r5k2J18j18L3qLL3N6j93K06r1J4Q5
$$ plain form
3100 -11 -27 81 -6 -72 123 -67 90 -29 -81 95 -83 64 -2 -17 6 15 -73 -9 -6 -76 129 -124 55 -44 -33 87
3126 87 -52 57 -29 33 -42 30 -49 15 17 -52 99 -103 68 -33 7 50 -19 43 -29 44 -52 73 -63 44 9 -39
3152 -39 84 -94 65 -51 -10 19 -7 10 -18 71 -90 53 -76 50 4 -38 52 -95 80 -37 28 -34 -1 26 -13
3177 -13 45 -46 79 -61 58 -39 -9 43 -67 63 -64 34 -19 25 -27 -8 1 -37 48 -77 86 -92 31 12 -73 82
3203 82 -72 31 -17 7 -23 34 -36 38 5 -63 98 -99 74 -21 -43 75 -43 -10 -18 -15 18 74 -119 87 -4 10 95
$$ [...]
8191a6
##END NTUPLES=NMR FID
##END=
