##TITLE=1H_PhBBCO604-4
 CDCl3
 8 sc, 
 7.04.2022
##JCAMPDX= 6.0         $$ Bruker NMR JCAMP-DX V2.0
##DATA TYPE= NMR FID
##DATA CLASS= NTUPLES
##ORIGIN= UXNMR, Bruker Analytische Messtechnik GmbH
##OWNER= root
$$ XWIN-NMR		Version 3.5
$$ Thu Apr  7 10:27:56 2022 Russian Standard Time (UT+4h)  she@DPX200
##.OBSERVE FREQUENCY= 200.131346
##.OBSERVE NUCLEUS= ^1H
##.DELAY= (6, 6)
##.ACQUISITION MODE= SIMULTANEOUS
##.ACQUISITION SCHEME= undefined
##.AVERAGES= 8
##.DIGITISER RES= 18
##SPECTROMETER/DATA SYSTEM= spect
##.PULSE SEQUENCE= zg30
##.SOLVENT NAME= CDCl3
##.SHIFT REFERENCE= (INTERNAL, CDCl3, 0, 15.7039)
##AUDIT TRAIL= $$ (NUMBER, WHEN, WHO, WHERE, WHAT)
$$ ##TITLE= Audit trail, XWIN-NMR		Version 3.5
$$ ##JCAMPDX= 5.01
$$ ##ORIGIN= Bruker BioSpin GmbH
$$ ##OWNER= she
$$ F:/spectra/data/she/nmr/H-F/1/audita.txt
$$ ##AUDIT TRAIL=  $$ (NUMBER, WHEN, WHO, WHERE, WHAT)
(   1,<2022-04-07 10:26:51.39 +0400>,<she>,<DPX200>,
      <created by zg, POWCHK disabled, PULCHK disabled
       configuration hash MD5:
       00 E9 B6 7A A2 85 ED C7 34 08 36 98 17 FE 4E 26
       data hash MD5: 16K
       3E 3F 69 5B 3C 48 6E B0 0B 18 0A 6C BF 6F 5F E6>)
$$ ##END=
$$ 
$$ hash MD5
$$ DC A9 B2 C1 97 5B 13 59 E9 4A 7F 49 E0 51 48 3C
##$RELAX= 
##$RELAX= 
##$RELAX= 
##$RELAX= 
##$RELAX= 
##$RELAX= 
$$ Bruker specific parameters
$$ --------------------------
##$DU= <F:/spectra>
##$EXPNO= 1
##$NAME= <H-F>
##$PROCNO= 1
##$TYPE= <nmr>
##$USER= <she>
##$AMP= (0..31)
100 100 100 100 100 100 100 100 100 100 100 100 100 100 100 100 100 100 
100 100 100 100 100 100 100 100 100 100 100 100 100 100 
##$AQSEQ= 0
##$AQ_mod= 1
##$AUNM= <au_zg>
##$AUTOPOS= <>
##$BF1= 200.13
##$BF2= 200.13
##$BF3= 200.13
##$BF4= 200.13
##$BF5= 200.13
##$BF6= 200.13
##$BF7= 200.13
##$BF8= 200.13
##$BYTORDA= 1
##$CFDGTYP= 0
##$CFRGTYP= 5
##$CHEMSTR= <none>
##$CNST= (0..31)
1 1 145 1 1 1 1 1 1 1 1 1 1 1 1 1 1 1 1 1 1 1 1 1 1 1 1 1 1 1 1 1 
##$CPDPRG= <>
##$CPDPRG1= <>
##$CPDPRG2= <>
##$CPDPRG3= <>
##$CPDPRG4= <mlev>
##$CPDPRG5= <mlev>
##$CPDPRG6= <mlev>
##$CPDPRG7= <mlev>
##$CPDPRG8= <mlev>
##$CPDPRGB= <>
##$CPDPRGT= <>
##$D= (0..31)
0 1.2 0 0 0 0 0 0 0 0.06 0 0.03 0 0 0 0 0.0002 0 0 0 0 0 0 0 0 0 0 0 0 
0 0 0 
##$DATE= 1649312810
##$DBL= (0..7)
120 120 120 120 120 120 120 120 
##$DBP= (0..7)
150 150 150 150 150 150 150 150 
##$DBP07= 0
##$DBPNAM0= <>
##$DBPNAM1= <>
##$DBPNAM2= <>
##$DBPNAM3= <>
##$DBPNAM4= <>
##$DBPNAM5= <>
##$DBPNAM6= <>
##$DBPNAM7= <>
##$DBPOAL= (0..7)
0.5 0.5 0.5 0.5 0.5 0.5 0.5 0.5 
##$DBPOFFS= (0..7)
0 0 0 0 0 0 0 0 
##$DE= 6
##$DECBNUC= <off>
##$DECIM= 32
##$DECNUC= <off>
##$DECSTAT= 4
##$DIGMOD= 1
##$DIGTYP= 9
##$DL= (0..7)
0 120 120 120 120 120 120 120 
##$DP= (0..7)
150 150 150 150 150 150 150 150 
##$DP07= 0
##$DPNAME0= <>
##$DPNAME1= <>
##$DPNAME2= <>
##$DPNAME3= <>
##$DPNAME4= <>
##$DPNAME5= <>
##$DPNAME6= <>
##$DPNAME7= <>
##$DPOAL= (0..7)
0.5 0.5 0.5 0.5 0.5 0.5 0.5 0.5 
##$DPOFFS= (0..7)
0 0 0 0 0 0 0 0 
##$DQDMODE= 0
##$DR= 18
##$DS= 0
##$DSLIST= <SSSSSSSSSSSSSSS>
$$ [...]
##$SUBNAM2= <"">
##$SUBNAM3= <"">
##$SUBNAM4= <"">
##$SUBNAM5= <"">
##$SUBNAM6= <"">
##$SUBNAM7= <"">
##$SUBNAM8= <"">
##$SUBNAM9= <"">
##$SW= 18.0517287032376
##$SWIBOX= (0..15)
0 0 2 0 0 0 0 0 0 0 0 0 0 0 0 0 
##$SW_h= 3612.71676300578
##$TD= 16384
##$TD0= 1
##$TE= 0
##$TE2= 300
##$TE3= 300
##$TEG= 300
##$TL= (0..7)
0 120 120 120 120 120 120 120 
##$TP= (0..7)
150 150 150 150 150 150 150 150 
##$TP07= 0
##$TPNAME0= <>
##$TPNAME1= <>
##$TPNAME2= <>
##$TPNAME3= <>
##$TPNAME4= <>
##$TPNAME5= <>
##$TPNAME6= <>
##$TPNAME7= <>
##$TPOAL= (0..7)
0.5 0.5 0.5 0.5 0.5 0.5 0.5 0.5 
##$TPOFFS= (0..7)
0 0 0 0 0 0 0 0 
##$TUNHIN= 0
##$TUNHOUT= 0
##$TUNXOUT= 0
##$USERA1= <user>
##$USERA2= <user>
##$USERA3= <user>
##$USERA4= <user>
##$USERA5= <user>
##$V9= 5
##$VALIST= <valist>
##$VCLIST= <CCCCCCCCCCCCCCC>
##$VD= 0
##$VDLIST= <DDDDDDDDDDDDDDD>
##$VPLIST= <PPPPPPPPPPPPPPP>
##$VTLIST= <TTTTTTTTTTTTTTT>
##$WBST= 1024
##$WBSW= 4
##$XGAIN= (0..3)
0 0 0 0 
##$XL= 0
##$YL= 0
##$YMAX_a= 210603
##$YMIN_a= -197242
##$ZGOPTNS= <>
##$ZL1= 120
##$ZL2= 120
##$ZL3= 120
##$ZL4= 120
##$ABSF1= 10
##$ABSF2= 0
##$ABSG= 5
##$ABSL= 3
##$ALPHA= 0
##$AQORDER= 0
##$ASSFAC= 0
##$ASSFACI= 0
##$ASSFACX= 0
##$ASSWID= 0
##$AUNMP= <proc_1d>
##$AZFE= 0.1
##$AZFW= 0.1
##$BCFW= 1
##$BC_mod= 2
##$BYTORDP= 1
##$COROFFS= 0
##$CY= 11.3945322036743
##$DATMOD= 1
##$DC= 2
##$DFILT= <>
##$DTYPP= 0
##$F1P= 2.36226072786647
##$F2P= -0.459571619588291
##$FCOR= 0.5
##$FTSIZE= 0
##$FT_mod= 4
##$GAMMA= 1
##$GB= 0.15
##$INTBC= 1
##$INTSCL= 1
##$ISEN= 128
##$LB= 0.24
##$LEV0= 0
##$LPBIN= 0
##$MAXI= 10000
##$MC2= 0
##$MEAN= 0
##$ME_mod= 0
##$MI= 1.114404
##$NCOEF= 0
##$NC_proc= 0
##$NLEV= 6
##$NOISF1= 3.799351
##$NOISF2= 2.8
##$NSP= 1
##$NTH_PI= 0
##$NZP= 0
##$OFFSET= 15.70392
##$PC= 1
##$PHC0= -18046.31
##$PHC1= 35.20078
##$PH_mod= 1
##$PKNL= yes
##$PPARMOD= 0
##$PSCAL= 0
##$PSIGN= 0
##$REVERSE= no
##$SF= 200.130013532006
##$SI= 16384
##$SIGF1= 3
##$SIGF2= 2
##$SINO= 400
##$SIOLD= 16384
##$SREGLST= <1H.CDCl3>
##$SSB= 0
##$STSI= 0
##$STSR= 0
##$SW_p= 3612.71676300578
##$SYMM= 0
##$S_DEV= 0
##$TDeff= 0
##$TDoff= 0
##$TI= <>
##$TILT= no
##$TM1= 0
##$TM2= 0
##$TOPLEV= 0
##$USERP1= <user>
##$USERP2= <user>
##$USERP3= <user>
##$USERP4= <user>
##$USERP5= <user>
##$WDW= 1
##$XDIM= 8192
##$YMAX_p= 0
##$YMIN_p= 0
$$ End of Bruker specific parameters
$$ ---------------------------------
##NTUPLES= NMR FID
##VAR_NAME=  TIME,          FID/REAL,        FID/IMAG
##SYMBOL=    X,             R,               I
##VAR_TYPE=  INDEPENDENT,   DEPENDENT,       DEPENDENT
##VAR_FORM=  AFFN,          ASDF,            ASDF
##VAR_DIM=   8192,          8192,            8192
##UNITS=     SECONDS,       ARBITRARY UNITS, ARBITRARY UNITS
##FACTOR=    0.0002768,     1,               1
##FIRST=     0,             0,               0
##LAST=      2.2672688,     0,               0
##MIN=       0,             -197242,         0
##MAX=       2.2672688,     210603,          0
$$ Real data points
##PAGE= N=1
##DATA TABLE= (X++(R..R)), XYDATA
0 0 0 0 0 0 0 0 0 0 0 0 0 8 -8 8 -8 15 -16 16 -24 25 -32 40 -48 56 -64 79 -88 104 -120 136 -157 179 -204
33 -204 231 -260 292 -329 368 -412 461 -511 571 -630 700 -773 855 -943 1040 -1146 1264 -1392
51 -1392 1533 -1689 1865 -2060 2280 -2529 2816 -3149 3539 -4009 4582 -5300 6232 -7498 9318
66 9318 -12183 17359 -29740 127673 41223 -66249 210603 58218 -120102 33163 93716
77 93716 -113172 -72631 65966 -15536 -88640 33453 26164 -71039 -30326 41934 -16973 -57445
89 -57445 4323 41376 -34047 -20783 84630 37108 -43195 61926 90181 -29130 -11988 65463
101 65463 -19139 -80405 -1057 7261 -64017 -26978 19976 -18054 -10625 24590 7174 1058 3276
114 3276 -4711 3612 -2961 -3042 20597 5806 -3664 28575 18354 -12567 11905 15166 -33136 -17374
128 -17374 24718 -21890 -37262 29377 6098 -38417 23578 28230 -31713 2743 30195 -20518
140 -20518 -15382 30053 540 -30074 16002 29224 -19588 -6002 36031 -676 -28784 11760
152 11760 18116 -30104 -24476 26184 -1474 -44235 18802 40924 -38321 -15808 55225 -9369
164 -9369 -50506 30759 28742 -48448 -4510 56089 -10890 -30366 49518 26139 -40812 7908
176 7908 34482 -29460 -32967 17591 0 -38187 -1884 29521 -14430 -19610 33898 14888 -31703
189 -31703 5144 30813 -19567 -28342 24531 15041 -30127 5170 38844 -5410 -11981 28111 9743
202 9743 -21422 -2243 8578 -16361 -22870 1737 2407 -17408 161 20278 193 -4985 17643
215 17643 9867 -13084 97 13256 -14264 -18912 16015 4124 -23199 8876 20627 -12685
227 -12685 -3911 19127 -1864 -12926 7995 4503 -14553 1720 13850 -10515 -5496 19377 -586
240 -586 -12865 12249 7433 -16764 -3746 13017 -9453 -19066 12312 8074 -24117 1088 23302
253 23302 -13633 -13101 23035 4501 -19606 11620 21562 -16059 -7150 29148 -1851 -24820 18956
266 18956 15786 -27455 -6049 21591 -9759 -21952 11210 10714 -21049 -4850 21365 -7384 -17795
279 -17795 15450 9183 -18276 -630 19070 -3620 -15096 14219 15019 -17168 -1252 22973 -6955
292 -6955 -16775 14772 8589 -18576 -4482 17483 -3905 -18948 10011 12467 -16936 -4584 15125
305 15125 -5413 -12719 8223 6652 -12577 -2685 15647 -4441 -14013 14988 8653 -17467 3064
318 3064 16928 -8437 -9845 13268 5064 -15768 2670 15309 -11764 -9392 16355 -1251 -14591
331 -14591 8501 7599 -10967 -1539 10433 -5181 -10228 9774 2973 -16287 4348 13010 -12521
344 -12521 -5305 15519 -49 -11100 7237 10210 -9504 -3908 13169 -4802 -12061 11355 4525
357 4525 -14065 3995 12350 -6947 -6682 10429 4000 -12417 457 10848 -10046 -8734 11724
370 11724 371 -11498 4417 9487 -5767 -6715 8579 2391 -12236 1356 7906 -9407 -3157
383 -3157 10860 -681 -6784 7498 9694 -6284 -4555 11890 2000 -13064 3583 9635 -8530
396 -8530 -6358 9064 2536 -9773 -118 8800 -7997 -10280 7865 -1889 -13595 4346 6669 -8313
410 -8313 1127 12353 -78 -4764 11873 7742 -12097 1909 13984 -9185 -10101 11916 3063
423 3063 -12043 1672 9502 -5606 -8061 6277 -577 -12371 1881 3447 -11358 -191 9685
436 9685 -4467 -3695 11770 4855 -7935 5255 11526 -8605 -6939 13018 10 -13184 5754
449 5754 8947 -8611 -4487 9012 600 -9366 1708 5227 -8774 -3133 8405 -3927 -6329 9027
463 9027 4715 -7940 1392 10069 -4858 -10029 7594 3048 -13301 300 10331 -5689 -5166 10003
477 10003 4836 -6377 1041 9486 -2124 -8175 5327 4230 -9116 -857 8561 -3089 -6184 7337
491 7337 4963 -11218 -1348 10916 -9119 -12543 11187 1774 -14945 4951 11656 -7643 -3109
504 -3109 12934 684 -9806 6895 7950 -11208 -2161 11404 -3248 -8174 7150 7106 -6920
517 -6920 -3075 10362 -669 -12939 4767 7059 -13873 -4024 12510 -5411 -10626 10237 5257
530 5257 -12126 2250 10896 -9441 -5474 13343 -2989 -10091 11682 6749 -9288 3111 11078
543 11078 -2580 -6612 3744 3309 -8270 -5504 4118 -2046 -7551 1652 5199 -3371 -3193 7940
557 7940 2054 -8229 5105 6394 -10006 597 10388 -7447 -4685 11194 -1 -9608 5314
570 5314 7441 -8989 -5680 8528 -1409 -8886 2636 4850 -2292 -1037 4150 4454 -2888 -939 7465
585 7465 -2458 -7555 6939 1226 -11829 2738 7585 -10428 -5387 11150 -3572 -12947 9668
598 9668 6610 -15272 2169 14922 -8075 -4890 14286 2922 -7106 5778 7914 -5502 -4107
611 -4107 6589 -1384 -9598 2190 4225 -7911 -4570 6554 219 -9614 1761 8897 -8985 -6820
625 -6820 12365 -1609 -11343 10585 8141 -10294 2701 13791 -3694 -6822 10603 3700 -11558
638 -11558 2016 8222 -8584 -5385 6704 -1181 -6921 845 5005 -3264 -7105 4643 4026 -8662
652 -8662 -909 8171 -3740 -5284 7724 3976 -7333 2910 9507 -5935 -4924 11356 -438
665 -438 -10761 6239 6072 -8717 -1668 7433 -1632 -7067 3031 4573 -6834 -3133 6532 -2015
679 -2015 -6426 4125 3613 -5216 -1007 6363 -1089 -5687 6100 3643 -9334 2162 8527 -7840
693 -7840 -4132 10389 -337 -8974 5162 6984 -7161 -2441 9326 -2613 -7794 7173 2816
706 2816 -8346 1893 6829 -4695 -4431 6316 1675 -8653 1235 7803 -7081 -5722 9398 -198
720 -198 -10344 4726 8198 -7704 -3775 10720 835 -9717 5563 7975 -8968 -1604 10575
733 10575 -3170 -7531 6874 4307 -8898 -1753 9210 -2985 -9799 6589 5942 -10115 -2319
746 -2319 9464 -2767 -8620 5857 6062 -8911 -2352 11236 -2619 -9656 8358 5819 -9512
759 -9512 1156 9838 -3723 -6693 8039 4588 -9862 418 10664 -5839 -8056 8693 3112
772 3112 -10572 -654 8477 -4218 -8623 5986 3539 -9786 399 8328 -5579 -3845 8260
785 8260 680 -6068 4658 6640 -5084 -2065 8693 -929 -6713 6055 3967 -7759 94 6172
799 6172 -3374 -5590 3332 2366 -5981 -1824 4553 -2884 -3810 4159 -949 -4206 3256 2151 -4011 599
815 599 5570 -1086 -4019 5828 4222 -6420 992 6959 -4032 -3815 5610 732 -5649 601 4713
830 4713 -3425 -4665 4937 277 -6941 1878 3335 -5430 -2137 4928 -897 -5548 3403 5848 -5294
845 -5294 -2535 9572 -23 -7598 5020 5954 -6306 -2857 7180 35 -7794 3442 6703 -7101
859 -7101 -2707 8738 -2292 -7433 4598 4107 -7551 -2905 7445 -1681 -8524 5858 5763 -8907
873 -8907 -230 9538 -3348 -6219 6698 4384 -7442 -756 8469 -3231 -6452 7152 2390 -7251
887 -7251 2379 5518 -4895 -2854 5148 133 -6477 1684 5554 -4933 -3621 6256 -279 -5189 2551
902 2551 2984 -3603 -1347 4059 79 -4511 2473 2778 -4454 589 3886 -2869 -1517 3793 -561 -3019
918 -3019 2458 3249 -3053 -1382 5336 -698 -4413 3136 1738 -3746 -404 2355 -1304 -2734 1067
933 1067 1526 -3521 -850 3800 -2538 -3482 4204 838 -4721 1222 4669 -2305 -3060 6392 2597 -5967
949 -5967 3312 7355 -4940 -2836 7121 -154 -6317 1660 4194 -4994 -3750 5270 -1038 -6673 2768
964 2768 3278 -5734 -1673 5316 -927 -5623 3190 5764 -4827 -1800 8704 -181 -6071 6248 4968
979 4968 -6846 -664 7301 -2769 -6144 4927 2914 -8098 -320 6390 -4869 -4245 5195 -309
993 -309 -5542 1400 3667 -3000 -2901 4250 1356 -4335 1803 4303 -2306 -1722 3996 1238 -2908 1380
1009 1380 3913 -2822 -2118 5000 -561 -5312 2925 2431 -5257 -870 3593 -2562 -3714 2407 1382
1024 1382 -4120 369 3519 -2387 -1737 3382 47 -1787 1418 1411 -936 -586 2485 1073 -2708 1294
1040 1294 3036 -3036 -1670 4111 -631 -4645 1700 3515 -3644 -2622 4943 -231 -5270 3389 2307
1055 2307 -5376 288 4157 -3226 -2788 3856 454 -4420 1296 4293 -3323 -1473 5466 32 -4045
1070 -4045 2744 3364 -3020 -1755 4310 707 -4612 1590 4539 -4073 -2210 4792 -1444 -4128 2659
1085 2659 1671 -4352 -559 4289 -2448 -4070 4723 1283 -5494 1749 4086 -3458 -1420 3805 336
1100 336 -2782 1297 3098 -2084 -1466 3851 73 -2870 1633 1768 -1864 -997 2333 249 -3301 872
1116 872 2868 -3728 -2081 4156 -1275 -4320 2715 2048 -3719 -961 3909 -402 -3304 3169 2166
1131 2166 -4111 1216 4294 -2398 -1133 4066 385 -2850 999 3472 -2469 -2879 4440 58 -5599
1146 -5599 1477 2933 -4145 -2492 3501 36 -4875 1000 3936 -3860 -1803 5273 -837 -3565 4334
1161 4334 2320 -3890 1152 4951 -2002 -3379 4538 2019 -5766 1371 4962 -4185 -3123 4075 268
1176 268 -4737 474 3169 -3177 -3470 4068 557 -4611 1876 2709 -3502 -658 3838 -282 -3179 3015
1192 3015 3271 -3784 -202 5743 -1689 -4187 4727 2186 -4566 -9 4127 -1866 -3848 2960 1687
1207 1687 -4984 -229 3584 -3249 -2615 3342 261 -3587 850 3376 -1970 -2155 4347 830 -4112
1222 -4112 2487 4018 -3412 -1694 4625 291 -4099 1434 3902 -3479 -2512 4843 -588 -4803 2795
1237 2795 2542 -4430 -617 3923 -1507 -3800 3037 2833 -4532 -322 5058 -2123 -3381 3729 1496
1252 1496 -3655 974 3992 -1769 -2903 4017 1635 -4315 1572 4150 -3536 -1737 4274 -593 -3650
1267 -3650 1961 2637 -3895 -1286 4623 -1256 -4476 3108 2329 -4207 -235 3379 -1485 -2715 2611
1282 2611 1431 -3103 352 3391 -2267 -1705 4180 394 -3117 1730 2885 -2446 -1444 3521 585
1297 585 -4024 1827 3194 -3940 -1258 4173 -975 -3631 1775 1948 -3304 -1711 2940 -849 -3677
1312 -3677 2355 1941 -3697 242 3708 -1307 -2206 3090 2180 -3357 -98 4581 -1193 -3736 4208 1772
1328 1772 -4777 558 4112 -2340 -3300 3050 1307 -5031 12 3723 -3598 -3146 3833 -139 -4139
1343 -4139 1993 3159 -2633 -1287 4511 560 -3192 2663 3446 -3473 -406 4052 -1011 -2897 2107
1358 2107 1676 -3360 -1048 3201 -1949 -3441 2536 850 -4255 588 2346 -2494 -1612 2341 516
1373 516 -2625 1325 2824 -2143 -773 3749 -553 -2093 2600 1370 -2167 196 2492 -882 -2017
1388 -2017 2329 1274 -3363 418 2624 -2488 -2327 2261 294 -2978 21 2968 -1993 -2552 3609
1403 3609 867 -3559 2038 3322 -2820 -1043 3818 23 -3459 1788 3523 -3605 -1511 5055 -786
1418 -786 -4353 2989 2710 -3845 -1036 4100 -748 -4622 2405 3343 -4640 -1351 5246 -1442 -4074 3076
1434 3076 2667 -4178 -795 5192 -1592 -4915 4278 2777 -5801 1009 5257 -2866 -2884 4411 1232 -3992
1450 -3992 978 4275 -2852 -2936 3967 482 -4408 1135 2664 -2179 -1922 2284 910 -3126 298 3225
1466 3225 -2183 -2227 3479 -24 -3215 1936 2107 -2549 -1012 3277 181 -2362 2354 1714 -2507 905
1482 905 2320 -1908 -665 1865 -276 -1103 520 1098 -1267 -1029 1356 -449 -1894 719 532 -1524
1498 -1524 -699 1358 250 -2155 754 2334 -2069 -338 3630 -813 -1966 3213 836 -3057 1114
1513 1114 2844 -2707 -1686 3825 -128 -4040 2156 2336 -3929 -1415 3133 -1138 -3322 1297 2007
1528 2007 -2540 -1894 3455 397 -3520 2392 3587 -3137 -569 4324 -608 -3391 3142 3124 -4530 -514
1544 -514 4986 -2367 -4018 4142 1335 -4562 267 3271 -2557 -2801 2359 636 -3726 -96 2934
1559 2934 -1414 -1701 2409 953 -1839 238 2707 -633 -2067 2398 1215 -3069 845 2621 -2287
1574 -2287 -1376 2610 114 -2295 821 1771 -1873 -1550 1726 -438 -1876 836 624 -1069 -97 843
1590 843 32 -543 848 978 -975 -179 1896 -849 -946 1877 196 -1770 779 1321 -1464 -1216 2371
1607 2371 -85 -2503 1544 1268 -2732 128 2254 -1910 -1355 1980 36 -2514 623 2312 -2239
1622 -2239 -1643 2901 132 -3054 1587 2374 -2411 -862 2748 315 -3063 1434 3050 -3127 -1142
1637 -1142 4140 -751 -3259 2519 1906 -3155 -546 3254 -1035 -3264 2209 2002 -3397 -384 3221
1652 3221 -1579 -2624 1887 1490 -2782 -513 3080 -501 -2781 2827 2027 -2990 265 2999 -1445
1667 -1445 -1752 2376 1396 -2391 123 2414 -1493 -2123 2454 450 -2623 538 1537 -1391 -1495 1517
1683 1517 600 -2140 -327 2487 -1338 -1408 2462 410 -1718 712 2130 -929 -556 2504 300 -1976
1699 -1976 1645 1687 -2676 230 1934 -1773 -1319 1700 -108 -2113 208 1242 -1802 -1472 1877 -333
1715 -333 -2306 1082 1490 -1666 -284 2065 241 -1724 1480 1987 -2277 232 3227 -1406 -1717 2652
1731 2652 499 -2761 619 2268 -1951 -1932 2431 -70 -3314 898 1381 -2706 -881 2246 -58 -1823
1747 -1823 554 1926 -1025 -923 2306 631 -2053 1334 1730 -1652 -685 2282 -34 -2249 1044 1922
1763 1922 -2139 -838 2596 -782 -2354 1419 825 -2001 -384 1713 -653 -1761 1132 1093 -2080 -228
1779 -228 2276 -547 -1391 1561 974 -1674 -10 2035 -555 -1700 2051 889 -2511 999 1995 -2090
1795 -2090 -806 2125 -204 -2152 1218 1404 -2171 -559 2213 -1006 -1747 1910 433 -2090 626
1810 626 1507 -1163 -1305 1389 485 -1999 752 2087 -1747 -873 2483 40 -1956 1419 1880 -1859
1826 -1859 -848 2408 -540 -2240 1804 1104 -2713 281 1792 -1537 -1686 1395 468 -1991 108 1893
1842 1893 -1144 -1449 1906 485 -1970 495 2042 -931 -1167 1823 943 -1876 207 2447 -1103 -1443
1858 -1443 2283 400 -2343 552 1701 -1681 -1379 1937 -127 -2859 1004 1611 -2348 -904 2328
1873 2328 -155 -1903 700 1584 -1386 -663 2469 171 -1958 1714 1640 -2090 -220 2413 -653 -1338
1889 -1338 1368 947 -2336 -36 2237 -1695 -2007 2365 251 -2748 925 1621 -1972 -1094 1803 124
1905 124 -2176 1198 1647 -1754 -179 2276 -435 -1137 1342 1086 -1103 120 1818 -692 -1765 1620
1921 1620 823 -2355 76 1794 -1380 -1325 1390 556 -2078 26 1779 -1073 -1198 2192 292 -1544
1937 -1544 1083 1447 -1397 -175 1763 155 -1582 836 1433 -1565 -673 2055 -528 -1805 938 545
1953 545 -1543 -645 1404 -287 -2160 1103 1268 -2253 -204 1952 -927 -1696 1451 589 -1706 88
1969 88 2192 -650 -1747 2437 301 -2196 1218 1804 -1304 -936 1736 316 -1738 742 1681 -1836
1985 -1836 -959 2007 -566 -1952 1288 1092 -1803 -435 1956 -453 -2182 1234 1165 -2367 17 2336
2001 2336 -1306 -1263 2108 602 -2080 686 2032 -1066 -1284 2271 70 -1863 1249 1186 -1567 -434
2017 -434 1143 -55 -1551 509 1055 -1184 -822 1382 -254 -1729 892 842 -1093 -640 1247 -57
2033 -57 -1560 1001 1511 -1539 -280 2126 -565 -1063 1713 707 -1189 283 1419 -531 -1145 904
2049 904 418 -1431 366 895 -1144 -562 869 -189 -1205 43 974 -1064 -1073 1781 431 -1365 833
2066 833 1271 -1233 -168 1842 -264 -1241 1652 1223 -2031 161 1790 -1671 -994 1874 -378 -1976
2082 -1976 1021 1097 -1747 -813 1537 -282 -2312 776 1371 -1863 -373 1943 -123 -1288 1326 1730
2098 1730 -1257 -384 2296 -467 -1690 1799 1008 -2385 171 1916 -880 -1720 1560 625 -2506 -75
2114 -75 1924 -1104 -1917 1706 428 -2066 -76 1783 -342 -1199 1746 1136 -1660 106 2038 -696
2130 -696 -1298 1447 690 -1500 219 1968 -906 -1139 1380 696 -1861 257 1460 -1330 -837 1249
2146 1249 261 -1426 -167 1344 -856 -1106 1828 38 -1413 904 1015 -1130 -93 1223 -195 -1099
2162 -1099 782 698 -1370 32 1386 -802 -693 1177 -142 -931 803 244 -990 -49 831 -474 -969
2179 -969 707 379 -1346 520 1093 -1002 -499 1170 199 -1374 174 1689 -881 -1120 1776 85
2195 85 -1416 1185 1390 -1224 -206 1566 -148 -1592 839 1094 -1841 -405 1787 -962 -1571 1206
2211 1206 575 -1605 -306 1514 -167 -1933 698 1151 -1891 -308 2111 -382 -1277 1237 1136 -1195
2227 -1195 -263 2237 -312 -1827 1293 997 -1994 146 1709 -806 -1037 665 639 -1218 -160 1652
2243 1652 -534 -1499 1058 252 -1996 -435 1514 -482 -1000 1125 1061 -1170 415 1737 -666 -532
2259 -532 1271 51 -1323 613 603 -605 -246 898 -674 -1047 798 116 -1049 47 158 -716 -432
2276 -432 318 127 -323 123 628 -428 -7 1377 108 -274 930 483 -803 216 469 -863 -748 868
2294 868 -27 -1380 447 950 -1284 -381 1341 -728 -1127 588 509 -1193 -343 1071 -377 -1334 923
2311 923 1152 -1014 -194 1299 223 -948 245 1396 -1057 -702 1943 -194 -1768 905 1390 -1404
2327 -1404 -341 1818 -371 -1765 895 1238 -1525 -576 1910 -515 -1795 1307 783 -1326 -270 1522
2343 1522 -87 -1637 798 1069 -1775 -369 1977 -694 -1291 1173 666 -1408 256 1710 -603 -1153
2359 -1153 1439 359 -1681 394 939 -1115 -629 634 168 -606 404 989 -538 -416 544 -108 -747
2376 -747 321 442 -246 -108 338 -237 -464 436 551 -507 238 962 -753 -327 682 -646 -782 378
2394 378 77 -769 -141 883 -242 -722 661 205 -1048 170 783 -472 -587 633 306 -714 136
2411 136 1399 -297 -544 1292 645 -1184 440 1068 -921 -905 1086 -66 -1561 200 1358 -1011
2427 -1011 -989 1531 -433 -1395 682 816 -1348 -392 1398 -26 -1590 817 1100 -1113 -363 1812 52
2444 52 -981 788 1283 -812 -669 1409 -191 -1580 768 798 -1543 -174 1292 -712 -1096 589 272
2461 272 -1457 -13 1106 -1085 -878 1022 93 -744 470 675 30 62 600 488 -559 155 703 -655
2479 -655 -92 596 -259 -363 334 259 -595 -244 687 -536 -905 617 139 -811 185 527 -557 -162 553
2498 553 32 -497 237 726 -553 -227 1001 113 -493 525 165 -716 112 955 -235 -899 725 709 -1203
2517 -1203 -141 1218 -508 -1112 724 391 -926 -137 875 -279 -1205 870 648 -1367 296 1233
2533 1233 -955 -676 1190 243 -1486 478 1368 -874 -866 1472 129 -1362 752 995 -940 -549 943
2550 943 161 -981 17 956 -1163 -528 1136 -508 -1223 706 312 -834 -252 1091 -163 -852 670
2567 670 931 -944 134 1183 -393 -385 748 220 -513 -235 923 -211 -686 428 92 -775 -189 399
2585 399 -624 -436 220 -229 -811 74 584 -508 -346 1026 -200 -475 572 394 -271 319 864 -135
2603 -135 -813 650 839 -1032 236 786 -883 -537 703 -24 -887 381 661 -690 -425 997 -246
2620 -246 -1113 180 581 -887 -246 1001 81 -739 571 928 -770 -400 1223 -140 -899 1117 517
2637 517 -1271 -26 865 -412 -975 668 362 -1080 70 935 -909 -941 685 160 -1066 272 842
2654 842 -306 -530 717 404 -736 549 781 -414 -360 1075 227 -678 366 385 -461 -349 910 -62
2672 -62 -830 422 338 -1063 -231 530 -255 -456 125 358 -565 -288 691 -64 -495 465 404 -499 135 596
2692 596 -252 -525 645 66 -586 278 608 -559 -121 736 -38 -775 91 354 -580 -507 975 -189 -894
2711 -894 599 361 -848 -13 819 -329 -542 555 242 -669 -85 847 -367 -350 920 412 -831 462
2729 462 675 -395 -438 619 -53 -834 412 452 -609 -271 954 -440 -521 434 187 -765 -169 709 -203
2748 -203 -763 606 584 -756 173 741 -486 -236 627 349 -844 26 1135 -421 -552 954 -30 -936
2766 -936 603 504 -534 -633 699 142 -594 49 481 -539 -495 887 -143 -788 308 612 -525 -543 1146
2785 1146 348 -742 718 779 -861 -71 1048 -370 -690 444 512 -793 -317 943 -412 -876 686
2802 686 176 -1004 215 622 -570 -293 436 293 -808 376 985 -544 -400 1157 103 -611 377
2819 377 579 -634 -306 748 204 -631 474 382 -782 -44 524 -303 -524 338 -25 -521 -52 417 -114
2838 -114 -338 258 192 -536 216 676 -341 -238 715 161 -283 -47 490 -249 12 871 -36 -410 403 313
2858 313 -589 8 298 2 -516 546 258 -643 109 690 -372 -573 717 300 -561 -27 582 -186 -606
2877 -606 609 498 -743 266 761 -781 -154 794 -136 -818 590 728 -902 -512 1016 -25 -829
2894 -829 338 567 -777 -150 670 -387 -805 699 563 -1094 -118 764 -334 -583 582 340 -809
2911 -809 71 760 -402 -745 948 508 -1209 92 864 -452 -392 642 180 -621 -343 585 -265 -321 445
2930 445 -329 -683 10 323 -483 -280 231 117 -331 10 493 -227 -83 332 -15 -647 190 238 -290 -390
2950 -390 382 -88 -256 304 189 -613 127 239 -500 -160 380 -259 -398 67 -3 -53 -267 527 51 -509 517
2971 517 399 -327 181 544 -295 -242 404 200 -423 -157 809 -387 -683 562 -203 -743 174 158 -914 -388
2991 -388 354 -111 -995 490 712 -725 -226 860 -267 -712 453 437 -499 -219 1012 57 -628 518
3009 518 505 -623 -129 579 -391 -886 650 494 -742 -365 731 -376 -1103 408 492 -1060 -170 723
3027 723 -532 -286 440 458 -645 -15 844 -266 -512 425 316 -515 -36 622 -142 -408 569 228 -597
3046 -597 146 614 -618 -424 257 4 -336 57 -32 -265 -270 517 -63 -341 167 313 -418 168 428 188 16
3067 16 229 100 -581 -84 735 -190 -317 393 -21 -557 -71 92 -325 187 307 -33 -387 506 222 -448
3087 -448 119 618 -440 -260 463 218 -244 152 629 -291 -143 739 323 -737 218 470 -554 -281 487
3106 487 -52 -511 286 592 -750 -162 700 -173 -756 474 444 -922 -214 368 -278 -708 166 460 -573
3125 -573 -114 694 -186 -592 452 611 -619 99 723 -319 -648 355 732 -653 102 495 -175 -536
3143 -536 243 42 -410 38 413 -264 -477 29 134 -676 -60 290 -166 -88 411 347 -391 262 488 -200 -115
3164 -115 610 -143 -455 491 232 -250 -202 266 -153 -423 254 187 -241 66 339 -258 -258 547 260 -288 56
3185 56 263 13 -145 631 -90 -478 409 171 -381 -104 707 -128 -234 512 113 -606 -186 572 -289 -542
3205 -542 598 -58 -810 149 237 -390 -330 506 191 -674 83 725 -203 -244 492 -18 -399 112 490 -475 -335
3226 -335 618 125 -597 -28 450 -541 -415 320 -188 -623 61 378 -539 -500 373 -127 -578 273 283 -351 -166
3247 -166 207 -254 -377 333 656 -418 -49 641 84 -365 385 0 -627 -27 424 -108 -171 357 318 -679
3267 -679 -16 556 -560 -432 533 -117 -539 57 202 -285 -501 480 5 -647 394 524 -358 157 557
3286 557 -434 51 655 225 -563 97 624 -12 -72 409 -74 -323 258 449 -346 -301 284 -110 -586 117 463
3307 463 -560 -325 672 -60 -335 539 396 -476 -288 686 4 -264 277 415 -354 -114 547 -216 -225 76
3327 76 442 -461 -390 660 -291 -360 307 202 -583 -8 518 -537 -176 381 17 -356 244 510 -294 -146
3347 -146 564 71 -738 96 435 -162 -233 372 -305 -318 82 203 -236 237 137 -96 -357 70 -153 -747 -182
3368 -182 185 -288 -297 254 382 -399 186 447 -67 312 612 -61 -213 222 239 -418 -323 371 -372 -627 139
3389 139 -46 -332 -94 -116 -75 -299 258 -69 -307 4 255 -333 -238 132 171 10 -56 296 -51 -410 263 259
3411 259 -286 280 314 -265 -265 211 -87 -350 -4 163 -252 -166 651 78 -434 62 110 -350 24 320 199 -233
3433 -233 140 282 -268 -201 337 -279 -415 470 145 -346 -119 469 -310 -579 518 70 -445 62 227 -368
3453 -368 -105 337 -35 -287 30 368 -299 -525 421 3 -315 428 299 -328 71 233 18 -204 -39 201
3473 201 -224 -174 165 -229 -451 392 236 -220 250 255 -126 -528 98 -167 -431 115 279 -377 -145 86 -169
3494 -169 -310 -114 283 -66 -502 322 95 -255 322 114 -267 -345 126 -85 -136 -159 214 -45 -142 673 -308
3515 -308 -250 238 210 -361 -12 169 -377 -335 130 163 -496 -32 383 -356 -35 582 -11 -238 118 348 -30
3536 -30 185 644 -7 -464 407 188 -381 -66 343 -96 -129 158 348 -336 -97 265 -430 -426 340 73 -290
3557 -290 74 2 -304 -95 365 95 -220 135 358 -366 -252 429 -17 -248 228 106 -296 -274 347 -52 -570
3578 -570 30 73 -407 13 287 -227 -221 218 408 -237 -35 467 -115 -237 399 393 -397 -105 598 -154 -380 377
3600 377 -155 -212 65 546 -112 -120 320 75 -244 -54 372 1 -197 158 -40 -401 318 318 -338 77 247 -83
3622 -83 -247 -136 300 -19 -150 476 -9 -237 420 81 -300 275 364 7 -6 301 -14 -318 238 259 -155
3643 -155 -111 -45 -281 -385 226 -21 -375 -219 157 -74 -177 305 127 -143 181 491 -98 -89 340 -259 -140
3664 -140 270 268 -52 -31 629 -215 -413 229 35 -363 17 284 -81 -159 144 293 -329 -225 502 -120 -270
3685 -270 239 238 -327 -190 476 -86 -413 341 390 -383 172 545 -251 -270 340 315 -211 -199 328 -147 -350 56
3707 56 361 -423 -14 370 -171 -167 83 100 -154 -51 603 -369 -310 289 225 -486 150 292 -124 -77 71 203
3729 203 -141 -35 404 -124 -285 200 -49 -526 -134 67 -226 0 289 -116 -68 308 111 -163 230 83
3749 83 -223 -333 229 10 -146 152 258 52 198 257 -52 -201 -161 18 -416 81 -40 200 -79 57 261
3770 261 -29 116 326 -525 -237 437 -131 -152 227 266 -113 -78 398 192 -381 -94 286 -114 -135 170 -37
3791 -37 -309 110 282 -293 -421 443 -44 -304 98 232 -537 -257 345 -9 -231 -6 477 -127 -37 391 -20
3812 -20 -188 310 236 -286 -45 499 -92 -352 236 118 -359 44 365 -108 -195 210 158 -351 -74 325 56
3833 56 -250 171 14 -483 -93 373 -131 -187 300 107 -128 -236 151 -207 -191 124 83 -151 433 -114 -256
3854 -256 158 124 -186 -219 122 -56 -122 95 130 -242 -192 31 6 -219 85 16 -271 0 -39 -77 -144 147 149 -121
3878 -121 -32 341 76 -308 278 45 -8 -98 73 -64 -436 75 74 -467 243 124 -52 -179 156 130 -629 79
3900 79 104 -125 -205 329 158 -471 107 457 -138 -118 332 183 -302 168 221 -232 -172 372 116 -208 291 301
3922 301 -171 -240 256 1 -359 126 118 -378 15 306 -225 -7 211 210 37 88 206 -114 -55 140 333 -321
3944 -321 -11 111 0 -456 8 158 -163 126 73 -142 -150 214 -103 -171 -120 63 53 -343 70 16 -2 305 -32
3967 -32 -62 55 -23 -139 -438 227 55 -109 151 217 -52 -123 90 120 -305 169 38 -397 61 130 -192 -221 156
3990 156 264 -108 49 278 -146 -323 81 277 -455 -3 271 -64 -221 63 339 -388 132 331 -99 -240
4010 -240 44 69 -64 -159 369 -40 -384 250 240 -266 -73 36 15 -296 122 57 -191 -3 36 30 -85 211 5
4033 5 -139 42 206 -47 89 261 72 -75 44 137 -279 -173 237 -222 -34 -50 85 62 -33 49 -65 -224
4055 -224 251 3 -153 21 8 -47 156 14 -7 88 281 116 -188 8 447 9 -181 225 51 -15 197 213
4077 213 -112 -263 1 213 -475 -161 164 110 -68 230 -226 -215 104 148 68 60 380 -93 -120 456 429 -270 38
4100 38 263 -236 -266 267 418 -184 -94 406 -110 -532 194 23 -250 -88 345 87 -431 116 442 -192 -40
4121 -40 336 -146 -288 298 92 -320 181 158 177 -222 -80 -13 -239 135 408 -442 -331 184 -189 -69 -92 247
4143 247 19 -286 316 88 -328 91 216 -112 -107 7 170 -243 48 253 187 -121 90 -154 -101 21 -52 -94
4165 -94 -52 123 2 -107 -156 16 -284 116 321 108 -12 117 -19 -148 167 50 77 -199 83 -25 -210
4186 -210 27 125 -94 -253 310 -287 -114 184 183 -292 -14 321 -240 -169 -63 -9 -118 34 302 -229 -138 -78
4208 -78 -206 -229 -58 287 -78 -40 136 -14 -129 24 -39 142 15 84 -138 -419 -80 57 11 -322 224 -153
4230 -153 -50 112 186 -168 12 235 -116 -56 160 114 -297 -20 269 -24 -42 43 -7 -313 29 221 -56 67
4252 67 270 59 -120 -18 110 64 -172 257 -44 -81 6 266 -270 -236 393 -25 -315 221 -156 -402 18 261
4274 261 55 -193 517 50 -263 29 296 15 -84 281 309 83 116 263 -397 -351 345 194 -437 273 218 -97
4296 -97 -181 4 -180 -175 -160 18 -218 47 33 -140 -25 154 129 25 -4 -7 95 112 -22 417 106 -214 146 -86
4320 -86 -256 210 92 96 80 -22 -376 -217 83 -59 -79 176 230 -203 -51 0 102 -230 254 212 -222 -47 200
4343 200 -72 -55 210 1 -111 -24 198 24 -215 161 161 -99 -59 384 -320 -208 158 250 -169 -212 226 -7
4365 -7 -139 175 141 -386 193 28 -279 -187 -15 -53 -139 290 -133 -97 -303 84 -54 -149 -19 267 -379 -89 24
4388 24 -211 -262 -166 -6 39 -191 55 -270 -88 -12 -203 -183 -230 -30 -76 -288 -25 69 -253 -200 164 -22 -233
4411 -233 34 42 0 -2 -33 -61 -204 278 4 -174 -118 21 -165 4 -141 138 -105 -67 97 126 -202 22 17 -88
4435 -88 271 129 -279 -171 -83 165 196 160 -114 54 428 57 -275 27 77 -348 30 213 -187 -247 24 195
4457 195 -49 293 175 -163 72 147 456 78 -208 444 37 -26 272 34 -108 -109 201 -345 -256 78 163 -46
4479 -46 57 -9 69 -235 -104 132 -4 -18 350 219 -242 9 118 -62 -13 261 -305 -154 322 82 -7 -106
4501 -106 343 -86 -221 -78 369 22 -9 132 -86 -96 206 -26 -188 -108 489 303 -71 156 99 133 -72 33
4523 33 -92 -120 -21 148 -2 273 157 -109 -122 64 58 -304 57 -102 -3 -241 271 211 -359 -67 213 -185 89
4546 89 184 -357 20 64 -43 -112 39 10 -178 -101 269 4 -174 -185 150 -81 -46 221 -50 -27 254 248 -81 17
4570 17 68 -108 -189 38 169 -261 -3 142 -58 -188 -179 -26 22 -285 114 -17 13 72 -3 -217 98 150 36
4593 36 -110 140 57 -227 -94 100 -25 103 392 -110 176 -174 430 -36 -69 98 -91 -121 67 -85 -309
4614 -309 -182 160 23 -128 115 -194 -111 32 102 -45 -98 172 -48 152 -45 -182 -41 -7 -144 320 -80
4635 -80 -170 14 -143 -142 27 201 -146 -11 -55 -78 -72 82 -46 -138 -22 98 -74 98 114 -113 38 201 -179
4658 -179 -76 225 78 -148 -80 77 66 -126 -56 -26 -113 -21 96 -60 -30 -172 293 41 -172 71 38 -223 -38
4681 -38 -16 -32 96 126 72 -119 60 50 -35 -213 247 -68 -301 257 -33 -172 -113 425 -153 -170 126 73 1 6
4705 6 215 29 -161 179 66 -84 -55 -84 -116 -76 112 -111 -77 147 17 -216 27 194 62 -302 115 -113
4727 -113 -247 60 164 64 -68 158 73 -277 -21 -77 -209 -12 193 133 -170 -32 12 295 -77 -68 -94 -130 151
4750 151 52 34 138 -228 267 -140 135 -26 67 124 13 156 -16 -41 73 -243 -90 -4 -230 185 50 22
4772 22 -181 72 100 -77 20 161 138 -6 -102 131 -100 -44 31 69 -128 219 21 -154 39 334 143 -63 95
4795 95 173 -173 182 195 23 -210 -262 223 42 -271 145 11 23 225 193 0 215 76 -95 -77 -111 137 -354
4818 -354 -153 157 -128 -206 170 89 224 97 131 13 -198 131 84 -172 86 374 -71 -230 -61 85 -57
4839 -57 372 178 233 259 133 6 -41 286 9 87 77 -57 -153 152 65 187 -181 31 -131 -75 -85 13 -211 -69
4863 -69 -65 29 -60 179 9 43 -238 76 63 72 161 142 -154 -100 53 -106 -41 1 86 -152 -196 -349 194 175 146 -14
4889 -14 -67 -28 49 44 -314 98 34 -24 -10 -244 272 -81 218 -70 4 157 -130 -14 -186 180 55 -272 165
4912 165 57 -34 4 7 29 -149 -78 -38 -124 -111 -26 198 -208 -159 273 -21 -128 -7 -5 -190 -255 -56 -311 -47 127
4937 127 184 41 50 64 -256 150 -5 -4 85 38 17 -78 25 -33 5 -34 97 387 -209 -92 -16 -117 27 68 253
4962 253 109 -62 66 -146 44 88 -31 -103 -157 149 43 -28 195 -46 312 88 -32 45 108 150 69 92 -218
4985 -218 -5 -58 -74 -38 17 -52 47 103 -31 -28 184 62 -6 108 -1 -322 -169 236 -78 7 -132 -79 -283 243
5009 243 70 -30 -48 192 50 -269 120 50 144 86 196 1 77 73 177 -293 -202 -58 -165 -12 -22 146 -17
5032 -17 278 -23 -34 -73 191 279 -27 -9 9 -183 -84 341 285 -163 -53 82 -177 -150 -18 -95 -15 132 141 -14
5056 -14 -82 59 40 -142 130 16 -190 2 41 158 -159 3 105 17 -56 182 -46 -157 82 244 57 -7
5078 -7 61 7 -223 144 106 -196 -9 196 -97 -11 319 302 -86 -150 -5 -339 88 -45 43 -102 -16 -9 15 -153
5102 -153 76 -33 -34 93 -287 19 -137 -247 -137 -4 11 232 4 190 196 -103 14 -122 -100 -87 -65 -21 25
5125 25 -104 -76 221 -357 200 -144 27 -20 262 96 -174 -223 18 -29 -188 -48 76 170 -52 -69 -90 130 -14
5148 -14 -61 -36 -90 -190 -130 -48 -80 91 -163 135 176 -155 24 267 -69 -131 86 40 -110 -29 17 -219 17 86
5172 86 -42 -206 7 197 -174 -18 92 184 -46 -49 107 4 -130 222 -351 -110 -198 252 3 -83 200 -144
5194 -144 -271 -106 -222 16 -39 -17 31 84 61 -84 -23 -153 286 196 -76 -64 -45 -3 95 63 91 60 183 27 -37
5219 -37 78 -24 -115 -49 16 -38 10 252 -8 181 220 327 161 -50 -102 165 177 -70 176 234 67 -34 -11 168
5243 168 -9 268 -141 -11 85 -107 -408 -56 -173 24 227 27 1 -215 -21 84 -22 18 103 -208 -178 -2
5265 -2 93 -139 -42 69 -106 -80 -162 -82 -29 25 -132 16 20 -9 -188 -32 211 -36 -59 -266 296 -171 89 96 147
5290 147 -86 -88 114 -70 -25 -143 162 19 105 -21 -48 8 71 -66 -34 -7 -271 -20 90 15 35 -130 -63 -165
5314 -165 -85 -27 38 87 46 -193 158 -216 -134 -85 162 -78 177 22 -225 167 26 116 -135 -48 0 -46 -29 -198
5338 -198 240 102 -111 -23 -22 38 -1 -106 -110 -117 -68 -165 -116 250 46 107 -65 163 -169 148 -40 310 28 225
5362 225 -152 88 241 -89 -33 38 47 7 60 16 -15 138 61 49 134 79 97 -87 -206 -63 252 -6 -85 164 104
5387 104 -17 51 33 19 -152 103 37 13 185 6 -3 -112 19 -182 -222 161 -9 108 -55 21 13 -201 205 -8
5411 -8 182 3 273 -157 -116 4 154 -57 145 104 -155 -252 211 -9 24 72 36 -62 -71 239 -45 83 30 218
5435 218 -8 65 -68 -74 -26 314 135 -99 397 277 -179 -61 153 -16 -24 155 118 12 -120 125 124 70 -11 -213
5459 -213 -83 28 225 96 228 -216 206 131 94 136 14 -160 103 244 -52 -65 28 78 -62 150 276 -185
5481 -185 -160 57 66 -340 191 -2 -119 76 -145 -93 -81 -76 323 -183 -29 16 9 -199 100 108 -44 -8 113 -132
5505 -132 -99 89 205 -4 96 192 -45 107 141 -54 14 -92 -9 -87 55 130 -210 165 -34 100 -14 113
5527 113 -103 191 51 -3 -50 -113 23 228 -159 149 -106 66 -115 59 -146 -20 -91 -62 -6 -105 17 80 35
5550 35 37 166 -130 93 43 26 -31 97 225 87 -96 -162 182 -222 327 59 -76 -139 -1 -137 59 34 -25
5573 -25 184 -352 41 -206 -35 250 -38 -80 -206 -100 90 -107 134 -234 -34 -121 -62 90 -162 -7 97
5594 97 55 272 96 -4 -248 -83 -156 -261 234 170 91 61 63 76 -203 -260 4 -68 -242 -130 87 -97 34 8
5618 8 276 -224 4 -31 -243 -158 -45 -83 21 60 105 140 98 166 -122 -7 56 -161 -83 -69 -23 -211 -65 70 -37
5643 -37 -35 120 -8 14 -155 -67 87 -206 -61 -44 159 390 111 -45 216 252 61 -77 121 172 -4 -62 97
5666 97 30 -28 27 100 21 -52 -32 -251 -125 73 233 -203 -154 -38 178 162 110 163 17 -40 184 193 -53 153 -46
5691 -46 137 98 140 -173 43 -9 -38 -107 -22 213 -322 -57 200 1 31 -15 124 -50 165 -7 -32 62 54 110 3
5716 3 195 22 -118 -29 -12 -143 -64 83 203 55 -105 -103 44 26 -96 65 -16 -3 -97 -103 -58 85 -147 -63 50
5741 50 132 -91 -46 203 -53 -43 -73 87 -227 -98 114 151 -1 -47 131 -176 -212 -57 -193 -245 38 23 -11 20
5765 20 -62 -132 -127 -7 201 -28 -82 90 -35 149 118 -51 56 -161 66 -43 -189 178 195 3 -10 72 -23 59
5789 59 -42 140 -168 115 -94 164 -89 147 267 -29 131 89 81 -28 23 -76 106 -90 22 20 123 82 115
5812 115 -50 -5 75 -118 97 97 37 -234 277 68 -269 20 3 -120 -281 -1 -27 150 -130 35 -170 -7
5834 -7 0 -148 -46 154 -135 -76 89 81 -160 -36 6 21 -201 90 35 -81 46 -83 -10 -80 -75 25 86 180 -52
5859 -52 146 195 -255 -129 -48 -171 232 24 35 -157 80 83 -145 -149 -185 -207 -130 48 -122 -211 -103 157 107 150 38
5884 38 -86 -20 -78 -20 101 14 -104 -119 175 -57 148 -58 235 -65 -17 152 228 -107 -4 268 280 -98 -113
5907 -113 100 -276 62 21 -75 -203 -34 -33 -61 -126 148 -205 203 -25 156 -129 193 -96 -66 -149 -34 -23 -114
5930 -114 227 -77 23 -128 138 -155 -24 262 -57 -73 -98 190 25 -44 221 13 -83 88 125 -115 24 -162
5952 -162 139 -314 -182 67 36 -2 -137 314 -44 -4 292 28 -36 -92 -276 -157 26 162 -20 66 -258 63
5974 63 35 75 144 -124 -106 -132 -62 -153 -113 156 -156 -67 106 -46 159 -258 -25 -132 95 -126 38 -368 -214
5997 -214 244 5 57 311 0 14 -126 -34 -16 -73 70 -37 34 -159 108 -216 70 -83 -198 -122 312 -151
6019 -151 73 -27 -154 14 -37 218 83 -5 -36 -131 23 53 65 93 -49 -109 26 40 72 253 25 -52 274 -68
6043 -68 -94 124 350 40 19 46 60 -120 -104 -7 94 96 71 76 -165 -39 64 -36 -90 61 0 -190 173 39 -122
6068 -122 -102 312 18 73 15 271 141 -259 -160 79 -122 0 -39 97 27 -71 24 -239 58 49 111 193 37 -98
6092 -98 -64 0 159 -67 -83 13 50 7 -91 -202 -42 -150 37 -85 207 61 -161 -17 127 119 -71 -16 54 -9
6116 -9 109 -58 -90 -232 62 142 -253 232 54 -125 72 1 -219 31 -77 -28 -130 78 60 -435 -48 -80 -23
6139 -23 -137 124 104 40 -44 1 -3 287 -80 37 156 -61 26 -30 -29 -199 0 28 -58 -62 130 35 -153 -144 221 16
6165 16 251 0 120 -164 -66 55 -78 35 -96 107 45 143 139 -1 96 -44 -75 136 14 -282 12 42 -74
6188 -74 -131 -61 -127 -88 -341 -30 -54 -19 -301 -7 -66 -152 -136 -84 -253 15 22 -12 94 6 51 -153 -96 4 -174 132
6214 132 138 260 10 16 181 -286 15 69 -54 -86 -58 -119 -20 -31 39 125 -126 -82 73 114 -106 -158 -104 -155 163 -38
6240 -38 -87 185 -98 66 183 124 70 -158 -50 96 -58 228 235 -49 -56 108 -90 -190 129 -101 -129 -168 91
6263 91 142 54 -202 -111 -113 -19 84 -52 -88 101 261 -61 302 -33 -1 -72 88 59 318 -257 -15 -79 165 49
6287 49 7 -33 43 54 59 100 87 374 102 -49 -189 -214 96 -85 -182 -170 155 3 -33 -5 -149 9 -56 -13 -307
6312 -307 192 115 242 103 -73 -94 -141 -39 118 -88 119 207 111 256 -57 -162 -166 180 -41 -139 -9 125 -170
6335 -170 -104 18 57 -12 -13 70 84 -192 130 36 30 85 78 23 115 -101 -130 84 -164 4 242 187 -133 -130 -38 -51 -38
6362 -38 35 99 194 -180 12 -94 -88 -69 100 33 -178 6 190 80 189 -27 138 205 89 99 -129 13 -30 16
6386 16 -20 9 276 22 273 57 34 -202 -186 62 187 57 -88 -85 61 -67 150 167 26 104 -56 -4 57 -37
6410 -37 -9 5 -106 -47 84 -52 67 81 221 -147 -26 117 134 -185 -74 -19 -4 318 148 145 -150 -219 196 -138
6434 -138 52 -127 168 70 138 35 -11 132 91 -178 72 19 -2 149 -142 -132 85 -12 -158 149 -51 26 62
6457 62 -152 -7 80 -245 145 -6 190 3 -131 247 -22 51 -116 166 -66 -174 -75 142 -2 23 -14 -139
6479 -139 -19 143 23 -4 -34 241 -128 -148 188 -276 3 62 66 -93 106 94 -323 -30 -236 55 -70 101
6501 101 -115 -215 -75 156 243 -175 -98 67 -122 149 144 -298 39 -16 -54 -97 40 -12 193 -177 19 37 -51
6524 -51 -32 -146 156 197 34 123 -67 -137 312 27 217 -120 0 -90 5 55 267 64 -77 166 -21 -32 -6
6547 -6 30 5 32 27 -281 200 81 -13 -229 240 15 -48 -68 10 199 -71 103 9 -231 196 -20 -38 -56 46 -80
6572 -80 -20 19 255 6 -66 -135 -12 -131 -73 -131 56 222 -165 -20 -45 287 67 -152 68 -316 -183 26 -74
6595 -74 1 27 89 -76 -104 169 -81 50 -10 -153 -50 -165 -37 -71 -24 -188 -18 -245 173 275 122 67 -30
6618 -30 30 -76 159 171 3 -128 69 177 -151 -127 -40 186 56 61 -10 -56 23 81 -16 -138 -106 -10 -223 -66 33
6643 33 -144 -28 31 372 -128 -89 99 -182 -22 -169 -5 -138 -83 186 257 -25 180 -70 -43 -319 94 -174
6665 -174 -111 100 90 30 -49 -290 4 -187 81 -39 -20 61 82 -38 -162 28 -37 -113 -34 258 183 63 42 -25
6689 -25 49 -159 136 -108 -85 200 -66 129 -142 -96 -238 -141 232 102 29 -110 -53 26 -107 53 -67 17 -152
6712 -152 102 81 -139 -172 -194 -102 -76 67 188 83 -18 -22 -203 63 -48 -144 -42 -129 -35 -57 141 -140 149 -28
6736 -28 -21 107 62 184 10 -330 4 117 -112 -40 94 -103 -45 148 -20 -58 48 89 53 -200 71 18 -71 30
6760 30 173 11 -79 -26 3 -112 -149 191 126 37 115 -196 -11 -30 88 -100 29 9 194 93 74 -100 -391 172
6784 172 -109 -27 148 -2 67 -109 46 -14 -206 -68 -3 -172 -83 8 88 -28 112 240 -110 19 -88 -42 -62
6807 -62 31 -57 -132 120 73 283 -91 -175 86 46 110 -77 103 -89 -97 335 9 42 86 -114 -90 -25 -40 97 -138
6832 -138 136 -40 -115 104 -54 24 34 -121 -50 -142 -102 99 -249 -23 39 3 -119 -13 124 198 -124 238 93
6855 93 -297 26 152 13 17 163 -182 -225 285 -36 -59 -111 218 193 64 76 -27 104 54 172 87 -84 135
6878 135 57 -255 70 161 -187 -87 -116 89 73 251 3 63 -222 -68 -20 102 -216 -1 34 -242 -46 3 77
6901 77 5 -94 -63 33 -145 41 -100 75 121 -43 -41 283 -31 19 -104 -132 -64 -25 151 10 211 -117 68 77 -151
6926 -151 -29 -40 9 -150 56 -37 -57 50 -33 218 -332 151 22 149 -179 -64 -37 95 95 -275 224 16 -51
6949 -51 -123 24 200 67 109 54 -248 -67 169 121 -196 12 7 -22 -177 41 -133 10 58 94 -131 -61 -92 -240
6973 -240 141 -108 255 -263 -12 112 74 -163 -93 -117 30 -1 -200 -32 -199 -251 33 -60 -215 69 122 112 51
6996 51 21 -8 83 54 84 56 2 -25 187 23 -134 -12 -94 47 125 -45 -66 -46 57 57 -3 -93 -159 -70 -11 -78 56
7023 56 255 29 253 40 32 85 -24 87 -130 325 83 25 -86 28 -52 -186 -45 35 -64 132 166 27 -181
7046 -181 124 -2 -195 -79 248 41 -265 39 -19 53 143 137 -166 41 -164 167 -45 31 244 -216 50 -62
7068 -62 141 -86 -19 108 110 -166 101 7 -75 58 201 -31 -83 -82 20 -2 -65 65 66 -30 278 70 -119 11 -59
7093 -59 -278 -30 157 10 78 48 47 19 -11 -64 -63 -31 185 60 100 -42 -10 -114 -117 24 401 -144 2 53 -161
7118 -161 -108 14 20 150 -293 -238 252 357 33 33 101 386 60 -24 98 180 -150 -358 40 -14 72 -6 226 28
7142 28 57 95 103 59 74 138 -65 63 66 187 -136 10 -18 -124 -147 43 228 100 67 42 156 22 86 -231 207
7167 207 177 78 96 -235 -208 -86 -67 30 135 86 -163 -186 2 98 -39 142 131 -250 -42 97 -204 54 168
7190 168 -7 83 18 32 -129 -62 46 -211 -201 78 72 -144 34 -130 8 194 132 160 18 -140 93 -21 -30 3
7214 3 61 -33 65 4 -141 -13 179 -23 -165 -2 140 275 241 87 -43 269 165 12 -51 -134 27 11 29 -92
7238 -92 20 80 73 -61 1 -119 9 -1 242 4 -62 -206 222 272 27 7 -56 39 127 39 -110 39 345 128
7262 128 19 -116 120 10 -137 -10 -73 15 -118 -22 77 136 -117 -298 -47 45 188 172 -52 -164 -78 -261 -331
7285 -331 398 222 -50 -40 -4 193 -104 -195 -98 -205 36 19 -10 -199 140 -20 34 78 179 -42 50 244 207
7308 207 -188 -19 101 -80 -140 140 -201 108 83 -80 -34 151 145 -389 77 22 170 -87 -182 -71 14 42 -42
7331 -42 -242 -162 160 201 -63 -52 -71 -129 6 58 -266 61 144 156 178 -95 206 -4 -23 193 150 140 -102 309
7355 309 249 190 78 -36 63 -24 41 90 -70 -103 -174 41 -2 -142 226 160 -123 110 191 264 145 52 110 24 54
7380 54 -92 220 -94 -31 -5 119 -249 -6 -63 16 -56 -87 156 6 -101 39 128 93 93 18 -18 155 178 -21 -135
7405 -135 -146 -125 -27 -60 98 -36 -3 -103 -73 40 -82 -148 5 -224 113 -50 83 5 -92 -59 -51 211 115 -89
7429 -89 -66 117 -20 -191 40 270 -132 -14 200 -9 -43 28 -15 -138 -208 -35 205 81 48 245 -199 35
7451 35 -43 -109 -128 66 -66 -66 -35 -147 64 80 -197 183 -11 48 174 -50 -64 -93 247 -36 146 98 -8 135
7475 135 198 7 -175 -98 0 78 -96 129 -35 -85 -128 -156 -8 -34 -57 217 -93 -57 74 -88 -83 -5 102 -57
7499 -57 -187 20 -469 16 125 64 164 -29 248 -23 -135 123 -108 -23 330 13 -99 194 -88 -126 126
7520 126 -109 246 54 -57 -183 -57 -21 54 -17 -37 94 26 -77 -7 122 177 296 151 -101 43 -238 -160 -18
7543 -18 -93 1 73 -34 -61 -103 -85 203 -16 -100 323 -7 -48 172 -87 30 -8 -181 32 -117 35 117 111 63 165
7568 165 83 -158 -178 -215 95 74 -158 40 38 -251 121 -35 -9 -101 45 11 -23 36 42 128 10 -111 24 100 306
7593 306 152 11 82 -132 200 -98 -112 -59 -63 4 -186 89 -152 84 70 70 19 49 -32 -205 188 -70 -233 120
7617 120 50 -131 -124 65 133 7 208 68 205 93 119 -115 17 66 38 -89 -137 -105 1 -162 -2 34 35 -37
7641 -37 54 14 75 207 -167 350 -164 -338 -178 -156 -165 46 -162 1 27 147 114 -143 -209 105 9 -78 36 43 211
7666 211 -131 160 -158 -177 -333 29 10 -56 -156 28 -173 204 125 -81 -12 -135 -130 -5 -171 122 19 18 -29
7689 -29 111 86 30 102 30 203 7 -38 -20 -154 33 -161 56 79 -68 -15 202 186 171 46 100 238 -109 -19
7713 -19 -48 -160 77 133 135 91 -139 -140 49 11 -200 187 -19 -202 -9 -54 -35 26 187 -120 -96 -73 79 -400 51
7738 51 -139 134 -96 -17 225 -190 95 -146 12 176 -111 -203 -107 -59 254 172 127 63 -47 116 24 67 14 -30
7762 -30 148 1 -60 -70 84 185 103 -49 -399 3 52 -56 210 167 167 192 223 127 30 -133 24 79 232 62
7786 62 -216 -139 184 339 -85 7 -136 18 -269 4 -256 -110 44 122 199 -17 71 107 51 -163 90 153 146 63
7810 63 95 133 -29 -261 28 -189 22 -8 72 -94 90 135 -70 142 -243 -10 331 -187 -196 -233 -174 53 -102
7833 -102 122 -185 134 -156 86 58 150 -59 31 -22 85 234 -64 96 122 170 -113 118 83 -32 -21 106 135
7856 135 149 -73 52 -187 137 -279 37 -98 -68 127 -15 -211 -99 185 123 96 -98 -23 258 -120 150 146
7878 146 45 80 287 -58 -177 -141 -166 -52 -4 7 -13 -111 15 -94 -7 213 -93 216 126 36 -225 56 -12 29
7902 29 44 50 76 -16 258 -31 -16 -11 -83 -145 -270 -11 -34 -220 -173 -27 78 -36 -33 11 198 0 252 -17 83
7927 83 -4 340 -147 -162 -55 -108 -82 213 -26 -172 -33 -187 142 -52 18 128 -13 -49 157 65 -52 -156 -41
7950 -41 222 -135 203 -123 87 60 -25 -104 94 48 105 -83 -27 -43 4 -306 -56 -195 29 180 -173 81 -8
7973 -8 164 -344 -215 -178 77 66 55 54 86 66 -55 35 -103 62 13 70 132 91 81 -51 17 358 176 -113 22
7998 22 65 -65 143 -53 16 -89 81 -39 -97 128 35 137 -33 -243 -102 -25 295 154 -144 33 56 -176
8020 -176 -177 185 224 156 144 -196 -185 50 299 20 79 -122 -84 -100 295 208 -163 103 -32 150 250 117 259
8043 259 187 60 35 68 -211 -92 -202 133 -281 -53 -140 -239 -44 333 -241 -202 -10 94 1 40 155 -401 -104
8066 -104 220 224 93 117 -105 31 -113 -19 -42 -32 213 -161 52 -17 122 -288 -44 198 -117 20 -49 72 7
8089 7 239 104 144 48 53 68 -54 -221 86 -41 0 211 -107 93 155 157 133 75 21 -144 -29 -73 17 -18 86 -1
8115 -1 189 120 82 -62 10 0 71 -68 5 56 -55 -6 -95 141 -71 140 -162 13 166 52 155 88 -166 -150
8139 -150 -87 -4 -224 376 -137 -37 -242 87 77 -21 -49 83 -59 -23 -242 158 182 -52 238 -83 101 -146
8161 -146 83 40 114 -2 -52 142 129 -61 -247 -223 -70 -4 11 -117 135 -53 -186 -249 78 -110 -111 63 -164
8184 -164 9 -34 -195 167 -80 181 146
8191A46
$$ Imaginary data points
##PAGE= N=2
##DATA TABLE= (X++(I..I)), XYDATA
0 0 0 0 0 0 0 0 0 0 0 0 0 0 0 0 2 -8 8 -8 8 -8 16 -16 16 -24 24 -32 34 -40 48 -53 61 -69 77 -88 99 -111
36 -111 125 -139 156 -173 191 -213 235 -260 287 -318 349 -386 425 -467 514 -567 625 -690 764
55 764 -848 944 -1055 1188 -1344 1538 -1776 2087 -2504 3095 -3993 5507 -8514 16645 -80899
70 -80899 -197242 118633 94297 -109374 54755 181758 -18236 -32912 125001 47557 -74884
81 -74884 25761 49834 -63447 -36919 49081 -7252 -65208 -13956 19085 -53438 -68707 27336
93 27336 8433 -77371 18056 90044 -14344 -12132 90487 31372 -47558 26836 51312 -36714
105 -36714 -27237 31209 -9435 -25254 18289 3945 -15347 -4068 -11442 -10368 -12152 -21699 -4351
118 -4351 -7870 -20717 12944 22264 -3096 20117 39806 -104 -936 37592 -4208 -45428 8237
131 8237 2684 -55622 -4484 29420 -27812 -4079 45777 677 -12907 31390 5528 -39513
143 -39513 -5726 15733 -30949 -25792 28227 9577 -19746 24064 41817 -5160 -10942 31886
155 31886 9807 -44922 -2937 31411 -41454 -38947 44140 2566 -52343 24723 43780 -38795
167 -38795 -18207 50600 -8131 -49600 27800 28276 -44153 -1708 48967 -8365 -22422 33904
179 33904 22016 -26720 -4023 28020 -14581 -34487 17011 12030 -37164 -5901 32009 -12394
191 -12394 -29883 21020 19284 -31946 -9203 33095 -6085 -23607 24073 19157 -15617 4788
203 4788 23431 -1973 -14077 6696 7525 -17197 -9340 12304 -5268 -15382 9216 10007 -11299
216 -11299 -1317 16546 -5270 -17509 13183 9274 -24043 -277 21595 -11290 -10286 20010 3599
229 3599 -14299 6038 7863 -13971 -5351 11230 -9558 -12051 16356 5490 -11844 13050 16131
242 16131 -9867 -1755 16559 -3266 -19060 6532 9733 -23171 -7337 22854 -9085 -19386
254 -19386 19162 8435 -23366 1624 18700 -16310 -16807 22474 3528 -25746 15106 26872
266 26872 -18068 -4732 30456 1208 -20086 10642 14418 -19545 -12374 17704 -5013 -23491
278 -23491 10124 12571 -18353 -4821 18756 -2099 -18053 7383 14798 -16405 -9239 20735 -2467
291 -2467 -18728 13742 15233 -14330 -3825 20636 2152 -17473 7449 16314 -14849 -9670 15725
304 15725 -1949 -15532 5921 8363 -11091 -5472 13573 -1156 -16354 9694 11371 -17651 -3238
317 -3238 17211 -6441 -13563 11234 8032 -13735 -348 17581 -6116 -11772 15791 4577 -16061
330 -16061 5324 10970 -10718 -4445 10964 -1225 -10068 7982 7752 -13314 323 14484 -10485
343 -10485 -11482 12454 506 -14854 2969 10740 -7521 -6029 13573 1227 -12394 8884 8770
356 8770 -14258 -1013 12604 -6449 -9166 9604 6426 -10043 -246 13818 -4242 -10203 11133
369 11133 3684 -13287 1163 9728 -5237 -7922 7551 6100 -9834 -362 10309 -7084 -7700
382 -7700 8367 -1635 -11124 2975 7208 -6360 -6049 10885 5862 -11103 2410 12745 -5893
395 -5893 -7430 9469 5193 -8317 308 11553 -1861 -8392 8737 3767 -13339 219 5763
408 5763 -11691 -7191 6852 -3415 -10117 6456 8265 -9787 -151 16497 -3497 -10491 12367
421 12367 6972 -11668 169 11868 -2033 -6567 8435 5735 -8521 1730 7243 -9924 -5640
434 -5640 6598 -6903 -10735 5450 3052 -10060 873 12434 -4371 -7664 13091 4654 -13265
447 -13265 3544 11252 -7270 -5879 9605 3626 -7479 2051 8498 -5145 -5169 7651 -2693 -9804
461 -9804 4970 3961 -8892 -735 10501 -782 -8139 7872 7894 -11147 -3179 9784 -6419 -10476
475 -10476 6180 3360 -8576 -1174 9749 907 -6976 5688 7673 -7151 -2936 8192 -1781
488 -1781 -7992 5562 6943 -7420 -1493 13721 -2177 -12048 10183 5843 -16394 -1248 9991
501 9991 -9611 -9349 9679 1968 -10664 4510 10968 -8217 -4747 12070 -1191 -10936 5149
514 5149 7490 -6644 -3923 10260 3885 -9755 4190 11799 -9158 -6206 12591 -2466 -13470
527 -13470 6923 6869 -12041 -1783 11604 -6071 -9287 10987 -445 -14549 6341 7289 -12107
540 -12107 -1160 12070 -702 -5330 6920 8523 -3243 -2668 6747 1060 -7660 -561 3660 -4853
554 -4853 -5975 4333 3051 -7982 1985 8456 -7789 -3490 10405 -4974 -8515 9354 2501 -10456
568 -10456 4319 10138 -5755 -5291 9944 2136 -9973 610 4810 -5031 -4353 1887 2125 -2554
582 -2554 -1886 7277 1893 -5535 6826 6716 -8761 1420 10043 -7320 -7372 10372 532 -13625 5314
597 5314 9086 -14708 -4502 13638 -8124 -12235 10425 2862 -10693 3256 9546 -2712 -2776 9331
611 9331 4473 -5829 3369 7775 -4975 -4961 6381 1439 -9112 -652 8678 -5942 -9693 9559
625 9559 1043 -14743 4323 7966 -12629 -3836 12344 -3108 -9131 9532 7745 -9135 1557
638 1557 12385 -4344 -5992 8619 2020 -6833 1031 5473 -2332 -6524 3363 5384 -7447 -4019
652 -4019 7364 -2927 -8431 4609 3715 -8393 -717 9059 -3687 -6838 10156 3357 -10853 4377
666 4377 9434 -7529 -3443 8783 376 -6676 3241 6523 -4529 -3880 6794 180 -7487 2463
680 2463 4080 -5617 -3212 5225 -46 -5917 3841 5444 -7660 -629 9470 -5543 -6846 9252
694 9252 1481 -10234 2971 8218 -6012 -4685 9035 593 -8421 5208 5899 -8223 -473 7908
708 7908 -3312 -5170 5838 3605 -6947 -24 8471 -4018 -7592 7884 2149 -11307 1890
721 1890 8745 -7194 -6974 9013 2410 -10952 2701 9839 -7345 -4519 10581 -620 -8539 6059
735 6059 6769 -7307 -2462 9838 34 -9419 4881 8127 -8842 -4444 9853 -925 -10019 3822
749 3822 7044 -7857 -4914 10017 -621 -11555 5344 7375 -9736 -2725 9788 -2468 -8187
762 -8187 6556 6388 -8399 -1448 11506 -2223 -8447 8664 6423 -9293 -1154 10130 -1939
775 -1939 -8779 4616 5454 -8858 -2809 8227 -4203 -7549 6271 1512 -8086 1544 6141 -5041
789 -5041 -4456 7424 1122 -7261 4510 7005 -5834 -866 8408 -758 -5060 4168 4463 -4567 -2260
804 -2260 4938 -1194 -5030 2915 698 -4956 1563 2594 -4497 -1554 3974 -1417 -5449 2758 4193
819 4193 -6341 -1226 7987 -1866 -4766 5993 3323 -4791 708 6085 -1336 -4325 4324 2527 -6243
834 -6243 691 5032 -4416 -3348 4667 -70 -6087 1333 4741 -4948 -4764 7328 1081 -9200 2567
849 2567 7120 -5279 -3765 7301 2039 -6992 2007 7789 -5136 -4295 8637 763 -7983 3903
863 3903 5776 -6053 -3558 7160 233 -8461 2953 6752 -8038 -3393 9078 -2267 -8490 4933
877 4933 4898 -7379 -2775 7793 -855 -7658 5699 5067 -7202 1028 7243 -3323 -3721 5391 1803
892 1803 -5900 248 5930 -3433 -4731 5893 1834 -5791 1764 4265 -2919 -2461 3452 886 -4590
907 -4590 562 3486 -4103 -1545 4628 -2112 -2464 3723 433 -3481 1634 2881 -2928 -2499 4261 831
923 831 -4705 2557 3846 -3172 -332 3643 80 -1972 1026 2141 -2372 -1817 3410 -1224 -4380 2781
939 2781 1583 -5564 -397 3839 -2410 -4645 3679 2520 -6091 495 7517 -3816 -4201 7526 2137
954 2137 -5577 2659 5969 -2378 -3265 5597 1618 -6230 1561 4894 -5509 -3392 4744 -748 -6747
969 -6747 780 4674 -5036 -4940 6486 1201 -7624 3836 6713 -5795 -1685 8056 -260 -6152 4793
984 4793 5451 -6288 -978 7847 -2660 -5505 5400 1642 -6060 731 4054 -3097 -4022 2852 1464
999 1464 -5104 -547 4235 -2416 -3275 3571 1189 -3110 407 3618 -1690 -2804 4646 1636 -4632
1014 -4632 2676 4625 -3962 -963 5074 -651 -3595 2174 1990 -3905 -1216 3319 -1915 -3235 2708
1029 2708 246 -3083 440 1734 -1264 -1298 1526 1147 -2338 42 3334 -1905 -2115 4269 931 -4082
1045 -4082 1422 4257 -2600 -3211 4866 1465 -5535 2150 4635 -4739 -995 5206 -2342 -3623 3575
1060 3575 1207 -4513 -214 3936 -2634 -3516 4165 556 -5278 1753 3689 -2959 -2307 3846 1664
1075 1664 -4040 529 5130 -2520 -3131 5129 702 -4740 2393 3032 -3677 -1361 4225 -938 -4719
1090 -4719 3234 2835 -5784 -242 4867 -3308 -3252 3500 284 -3373 642 2950 -1928 -2429 3158 1277
1106 1277 -3396 1434 2949 -1788 -1083 2463 1040 -2270 486 3378 -1991 -2757 4460 585 -4617
1121 -4617 1952 2882 -3484 -1903 3232 -168 -4222 1307 2634 -4084 -859 3996 -2176 -2635 3560
1136 3560 902 -3085 820 4185 -1080 -2695 4095 2239 -4202 1513 4481 -2859 -2523 3651 1064
1151 1064 -4587 -235 4107 -3276 -3987 4190 -52 -5303 1888 2467 -4111 -638 4507 -1178 -3698
1166 -3698 3891 3411 -4620 70 6124 -2145 -3434 4515 2014 -4110 225 4089 -1853 -3702 3392
1181 3392 1833 -5186 214 3199 -3654 -2304 3148 -444 -3728 1054 3075 -3497 -1987 5220 -224
1196 -224 -4958 3907 3728 -4241 -253 4712 -421 -3414 2783 3132 -3809 -1050 4617 -1554 -3457 3108
1212 3108 1060 -3932 59 2968 -1733 -3463 2850 1594 -4608 719 4401 -2859 -2457 4486 1079
1227 1079 -3800 1009 4380 -2130 -2960 4513 1038 -4954 2301 3760 -3761 -1384 4137 -372 -4086
1242 -4086 2182 3078 -3947 -1772 4741 -1310 -4653 3294 2004 -4248 -403 3582 -1359 -3390 2911
1257 2911 2381 -4307 152 4769 -2612 -2617 4365 777 -3592 1616 3613 -2620 -1963 4346 399 -4502
1273 -4502 2165 3332 -4116 -1343 3679 -906 -3227 1853 1643 -3130 -1023 3167 -1430 -2900 3099
1288 3099 1031 -3752 894 2993 -2220 -2051 2984 1316 -3483 1332 4434 -2597 -2103 4438 303
1303 303 -3868 1620 2911 -2518 -2084 3028 251 -3711 1378 2610 -3740 -1254 3351 -1425 -3383
1318 -3383 1877 2379 -3462 -1534 4526 -456 -4078 3563 3300 -3870 216 5163 -1096 -3254 3442
1333 3442 2879 -4236 -849 4388 -1979 -3941 3473 760 -4571 485 2763 -2611 -2787 3243 409
1348 409 -4297 997 3692 -3090 -1553 4391 338 -2957 2428 3196 -2183 -649 3923 -75 -3371
1363 -3371 2475 2342 -3769 -392 3164 -2130 -2562 2158 585 -3138 -110 2331 -2136 -2340 3044 -417
1379 -417 -3290 1817 1775 -2288 -185 2748 -72 -1936 1933 2541 -2680 -317 3645 -1459 -2659 2485
1395 2485 981 -2745 -301 2717 -1276 -3196 2525 1596 -4048 378 3370 -2682 -2207 3435 604
1410 604 -3771 794 3940 -2498 -2581 4800 475 -4541 2720 3637 -3566 -1411 4084 52 -4427 1293
1426 1293 4262 -3586 -2450 5240 -150 -4756 2209 3266 -3932 -1778 4526 -368 -5623 2600 3823
1441 3823 -5448 -1149 5577 -2138 -4061 4114 2218 -4205 55 4624 -1579 -3530 3667 2070 -4079
1456 -4079 831 3662 -1534 -2184 2116 1472 -2832 -679 3014 -1563 -2870 2832 637 -3791 793
1471 793 2983 -2142 -1812 2829 588 -3081 1159 2480 -3025 -321 2867 -1170 -1024 2234 545 -1019
1487 -1019 1107 1338 -433 -476 1543 515 -1799 175 1026 -1527 -1276 1346 96 -2424 -66 1768
1503 1768 -1665 -2046 2779 -380 -3021 2366 1766 -2851 429 3385 -1534 -1670 3845 1298 -3530 1681
1519 1681 3782 -2845 -1907 3749 -253 -3433 816 2323 -2277 -2623 2739 395 -4124 553 3447
1534 3447 -3109 -2354 3722 393 -4040 2016 3759 -3399 -1528 5560 -515 -4053 3964 3070 -4345
1549 -4345 -161 4403 -1303 -3372 2241 1749 -3418 -815 2701 -1063 -2874 1844 1205 -2393 -613
1564 -613 2040 -504 -2239 1549 1935 -2590 -417 3024 -1185 -1722 2807 898 -2224 713 2608 -1236
1580 -1236 -1466 2073 634 -1988 753 1125 -1478 -396 963 -655 -1046 121 462 -888 -721 1488
1596 1488 -248 -1668 1468 821 -1691 756 1980 -866 -1137 2155 508 -2220 904 2193 -2221
1611 -2221 -269 2826 -1130 -2041 2389 669 -2327 294 2533 -1381 -2367 2536 988 -3395 604
1626 604 2863 -2268 -2008 2740 930 -2998 701 3263 -2435 -2237 3866 590 -3821 1752 2795 -2884
1642 -2884 -1155 3516 100 -3287 1639 2788 -2876 -1178 3572 -886 -3335 1974 1583 -2627 -1231
1657 -1231 2463 -178 -3193 1313 2453 -2822 -868 2978 -857 -2133 1799 1443 -2283 -327 2951
1672 2951 -306 -2451 2090 1414 -2313 249 2580 -932 -1782 1357 1191 -2147 -1001 2234 -799 -2339
1688 -2339 1453 740 -2543 30 1965 -1226 -1349 1805 491 -1931 989 2239 -2213 -131 2964
1703 2964 -833 -1434 2113 836 -1748 48 1693 -582 -2009 1615 140 -2834 175 1315 -1795
1718 -1795 -1377 1585 9 -2066 410 1672 -1927 -1148 3038 -567 -2262 2471 1507 -2226 681 2758
1734 2758 -722 -1927 2133 1045 -2587 423 2508 -2156 -1182 2013 17 -2373 111 1516 -1276
1749 -1276 -1906 1522 668 -2247 286 1996 -1512 -1007 2147 755 -1771 774 2464 -1649 -1169 2800
1765 2800 62 -2702 1469 1637 -2056 -715 1805 -270 -1753 816 1465 -1539 -1005 2114 -142 -2193
1781 -2193 1101 881 -1423 -560 1614 -272 -2047 1343 1308 -2298 229 2704 -1415 -1569 2469 390
1797 390 -2106 519 2009 -1764 -909 2442 -172 -2063 1474 1328 -2204 -106 1636 -974 -1540 1029
1813 1029 694 -2075 -177 2201 -1289 -1695 2028 252 -2109 891 2076 -1568 -965 2446 633 -2197
1829 -2197 1406 1967 -2179 -192 2677 -717 -1945 1440 918 -1886 -353 2186 -692 -2076 1270
1844 1270 740 -2082 -76 1863 -905 -1369 1263 746 -1603 -529 2119 -374 -1647 1869 1158 -1987
1860 -1987 570 2183 -931 -1236 1714 538 -2283 127 2201 -1714 -1618 2038 -102 -2524 442 1489
1876 1489 -1682 -1475 1403 294 -2319 581 1603 -1790 -671 2536 -279 -1610 1471 1559 -1550 -500
1892 -500 2706 -585 -2112 2530 933 -2744 332 2172 -1686 -1630 1657 280 -2349 206 1751 -1746
1908 -1746 -1340 1759 -294 -2058 1191 1116 -1329 -238 1903 123 -1287 1367 1709 -1783 -93 2582
1924 2582 -839 -1557 1583 864 -1726 -295 1685 -760 -2068 1338 454 -2191 384 1624 -1435 -908
1940 -908 1430 158 -1380 542 1658 -1044 -748 1876 451 -1463 965 1301 -1203 -499 1543 383
1956 383 -1777 409 1623 -1538 -1103 1911 -449 -1712 931 887 -1515 -384 2068 -423 -1875 1464
1972 1464 933 -2359 381 2141 -1340 -1095 1799 436 -1728 313 2045 -1072 -1349 2140 251 -2082
1988 -2082 1079 1688 -1598 -758 2034 -185 -2092 728 1539 -1967 -986 2313 -887 -2015 1749 863
2004 863 -2045 -200 1863 -792 -1590 1732 896 -2181 682 2049 -1455 -813 1695 83 -1114 172
2020 172 1454 -744 -1086 1608 443 -1746 393 955 -1316 -742 936 100 -1577 253 1449 -1490
2036 -1490 -721 1979 -282 -1665 1075 757 -1022 296 1623 6 -817 1309 993 -1174 326 1580
2052 1580 -711 -990 1161 385 -1267 262 818 -500 -1195 1094 370 -2019 410 1276 -1632 -772 1754
2069 1754 -221 -1853 942 1483 -1499 -228 2378 -732 -1606 2113 636 -1757 747 1536 -1172 -926
2085 -926 1500 263 -2125 310 1519 -1650 -1326 1610 19 -2006 599 1436 -1342 -1212 1765 254
2101 254 -1926 1328 2109 -1747 -306 2135 -200 -1663 1766 1504 -1764 -718 2140 -562 -2214 1291
2117 1291 1005 -2129 -273 1913 -363 -1628 848 1042 -1723 -946 1846 -538 -2001 1560 876 -1721
2133 -1721 -28 2016 -160 -1305 1491 1222 -1801 107 2058 -1045 -1404 1289 233 -1583 -2
2148 -2 1446 -627 -1229 1210 527 -1699 225 996 -1149 -636 1106 -73 -936 503 1085 -879 -80
2165 -80 1536 -451 -856 1262 160 -1196 255 802 -920 -336 1049 233 -891 695 967 -1068 -27
2182 -27 1259 -697 -1007 1045 51 -1264 255 997 -613 -1102 1532 667 -1685 554 1446 -1272 -755
2199 -755 1739 -191 -1415 465 1521 -1234 -636 2251 -202 -1525 1265 880 -1444 -366 1159 -88
2215 -88 -2051 152 1665 -1436 -1022 1935 -367 -1967 894 1259 -1100 -912 1615 404 -1796 1027
2231 1027 1664 -1674 -273 2085 -41 -1156 1141 1235 -1171 -631 1632 -167 -1953 637 1016 -1875
2247 -1875 -440 1332 -255 -1208 923 1221 -1387 -310 1750 -623 -1309 1260 497 -1221 728 828
2263 828 -538 -191 1378 300 -623 394 501 -1078 -107 470 -1026 -487 342 -232 -466 -180 540 -305
2281 -305 -428 382 -188 -906 604 194 -1211 407 917 -97 -480 1076 620 -993 482 1125 -765
2298 -765 -724 1419 -109 -1264 684 576 -784 -784 829 328 -1237 516 1173 -1120 -746 1249 187
2315 187 -1167 279 1001 -922 -1023 1794 479 -1951 980 1427 -1350 -1055 1926 18 -1641 561
2331 561 1224 -1387 -936 1736 -30 -1682 948 1257 -1217 -705 1392 15 -1689 411 1431 -1376
2347 -1376 -749 1550 -144 -1452 1061 1200 -1368 -189 1692 -128 -1517 1185 732 -1431 45 1199
2363 1199 -713 -510 949 150 -714 370 771 -142 -680 541 141 -890 255 354 -530 -145 325 139
2381 139 -670 233 595 -685 -203 900 -211 -572 1086 -47 -630 764 594 -518 -243 874 117
2398 117 -817 594 394 -925 -135 617 -685 -390 497 171 -886 -170 773 -43 -993 878 1131 -951
2416 -951 -281 1372 -409 -843 1039 861 -1244 101 1710 -365 -967 1608 411 -1671 396 851
2432 851 -1188 -967 911 34 -1550 124 1168 -1107 -991 1532 149 -1591 325 1013 -745 -743 1233
2449 1233 351 -1221 1001 1470 -1234 -222 1367 -212 -1175 786 548 -1092 -418 1057 -656 -1316
2465 -1316 744 272 -926 -100 815 -512 -746 396 555 -643 -120 820 -321 -425 741 139 -377
2482 -377 558 341 -104 -310 743 42 -819 478 519 -970 -266 652 -409 -377 436 -58 -742 49 521
2501 521 -346 -670 687 87 -933 448 820 -549 -190 892 26 -589 310 1169 -807 -573 1425 -377
2519 -377 -1017 459 789 -1083 -452 974 9 -1267 764 915 -1326 -173 1317 -849 -812 1172 437
2536 437 -1065 -112 1231 -547 -969 1118 338 -1453 30 1208 -690 -690 1147 430 -1159 107 998
2553 998 -383 -697 1280 113 -1337 313 556 -983 -317 1037 -40 -1002 398 849 -811 -429 832
2570 832 -326 -747 641 488 -624 -101 805 71 -570 514 662 -504 242 769 -293 -356 496 68
2588 68 -485 19 580 -524 -765 736 -80 -940 349 680 -508 -495 841 -230 -411 305 823 -491
2606 -491 -140 1005 -201 -411 764 286 -773 99 1081 -603 -841 678 409 -1012 152 1123 -1142
2623 -1142 -812 1089 179 -1169 158 745 -736 -800 1035 95 -1051 937 858 -933 11 856 -393
2640 -393 -1076 756 895 -1077 -307 1099 -422 -980 873 81 -1043 -37 679 -295 -912 218 492
2657 492 -872 -131 1010 -327 -586 1140 405 -793 119 842 -225 -430 651 569 -954 213 741
2674 741 -573 -197 366 -121 -457 225 306 -461 -448 639 -34 -648 449 467 -603 251 410 39 -370 306
2694 306 524 -613 148 1141 -271 -422 595 249 -418 202 524 -382 -328 768 -36 -981 522 324 -736
2713 -736 -220 888 -262 -639 249 616 -669 -13 910 -178 -712 583 239 -967 249 536 -255 -456
2731 -456 645 177 -773 89 956 -645 -334 1057 28 -622 287 721 -662 -451 794 -51 -959 196
2749 196 682 -891 -204 700 -354 -718 605 602 -325 -17 724 -244 -723 779 410 -688 398 1040 -375
2768 -375 -440 682 500 -811 -135 892 -222 -647 635 -52 -708 -5 528 -565 -485 624 39 -1127
2786 -1127 348 960 -628 -261 946 10 -826 614 925 -557 -390 920 83 -640 655 585 -822
2803 -822 -245 469 -216 -592 193 178 -620 -310 697 -511 -954 863 202 -703 288 670 -641 -296 863
2822 863 278 -640 134 843 -325 -203 777 -247 -424 330 -2 -341 -378 317 -66 -632 336 229 -855
2841 -855 -222 499 -473 -450 435 424 -295 -66 341 -116 -312 532 75 -423 399 451 -610 71 399 -54 -275
2862 -275 472 256 -474 -259 417 -325 -574 310 223 -764 -234 506 -343 -632 767 528 -800 -142 830 -303
2882 -303 -378 604 -1 -649 185 735 -669 -729 954 108 -1024 559 725 -789 -182 1055 7 -784
2900 -784 276 591 -823 -523 722 72 -764 242 312 -730 -138 733 -100 -1012 793 605 -879 -41
2918 -41 1011 -251 -873 741 360 -669 -7 848 -131 -663 654 406 -583 93 379 -425 -431 97 -82
2937 -82 -293 -239 540 -273 -393 335 173 -604 133 549 -71 -45 605 168 -163 180 500 -270 -225 590 -74
2958 -74 -432 442 -15 -265 102 52 -149 -429 223 21 -367 42 31 -353 -229 423 -254 -411 273 336 -276
2979 -276 121 517 -1 -573 676 196 -984 415 661 -628 -440 742 -15 -832 161 504 -695 -603
2997 -603 940 -138 -1111 282 498 -651 -132 1013 169 -727 582 956 -521 -244 744 -23 -759 463
3015 463 444 -707 -185 950 -145 -848 436 471 -769 -99 752 -237 -552 163 388 -491 -179 833 -198
3034 -198 -541 418 116 -711 91 679 69 -569 241 425 -530 -304 640 -212 -410 291 -75 -519 -234 310
3054 310 -184 -318 361 313 -434 -147 406 -305 -117 337 30 -239 312 199 -97 -450 376 -179 -543 257
3074 257 -134 -399 230 453 -264 89 412 27 -434 112 291 -490 -142 421 -146 -461 293 -68 -516 36
3094 36 604 -254 -520 524 190 -717 153 497 -610 -316 516 -211 -321 119 518 -390 -372 840 120 -416
3114 -416 233 400 -439 -551 589 104 -483 93 844 -422 -438 426 -191 -716 154 455 -679 -362 702
3133 702 -19 -663 368 401 -342 -283 605 -61 -416 350 196 -204 -153 485 -213 -533 185 21 -257 -173 233
3154 233 -319 -433 319 47 -315 -42 324 -298 -171 478 3 -511 72 460 -331 -91 381 -35 -381 203
3174 203 324 -354 -28 253 -476 -212 168 -182 -421 63 216 -230 -109 353 78 -541 128 435 -344 -222
3194 -222 437 -10 -566 400 444 -138 -12 507 -117 -572 449 32 -481 -21 733 -485 -200 362 29 -481
3214 -481 -77 526 -528 -326 643 72 -464 90 607 -252 -369 239 296 -368 -243 437 -364 -512 552 361
3234 361 -443 19 359 -314 -380 563 256 -793 276 417 -342 -255 616 -31 -423 -160 371 -175 -257 692
3254 692 -86 -490 428 120 -470 57 480 -54 -304 107 53 -419 -12 531 -240 -191 595 74 -410 252 359
3275 359 -471 -423 430 121 -442 152 313 -377 124 598 -13 -315 324 25 -144 1 500 -287 -381 306 257
3296 257 -502 199 401 -236 -44 386 270 -189 -32 585 -505 -508 534 -140 -616 85 259 -391 -365 133
3316 133 86 -291 121 425 -619 -359 581 -104 -152 377 231 -150 -98 518 181 -307 454 435 -422 -134 437
3337 437 -219 -451 237 365 -675 -132 591 -130 -420 304 99 -509 248 278 -142 -536 378 191 -199 198
3357 198 610 -441 136 341 -100 -60 140 93 -378 -95 308 -104 -452 375 88 -749 143 502 -350 -56
3377 -56 67 -28 -155 279 419 -195 -114 560 -4 -255 270 171 -279 -65 456 -46 -242 235 234 -657 -7 370
3399 370 -251 -302 353 194 -186 28 47 -193 -278 519 92 -305 42 651 -122 -147 487 -5 -362 -70 460
3420 460 -137 -276 332 231 -563 16 317 -314 -340 149 27 -258 -16 227 -355 -366 395 -59 -550 278 226
3441 226 -362 -54 408 -137 -423 167 280 -492 -70 735 -453 -437 626 354 -421 50 4 -95 -350 561
3461 561 -9 -492 196 296 -188 -231 456 5 -360 -8 482 -354 -340 511 -26 -496 207 11 -315 -102 271
3482 271 -70 -215 272 42 -224 6 472 -337 -196 275 -76 -176 -59 228 -156 -277 232 -190 -514 152
3502 152 176 -389 -103 248 141 128 295 365 -95 -253 342 -120 -143 288 431 -439 65 319 -112 -463 18
3523 18 120 -128 -220 149 -432 -446 448 -182 -288 192 247 -81 -188 446 -35 -336 172 302 -336 -132 539
3544 539 -58 -207 220 129 -252 -210 360 25 -409 140 -87 -284 -234 207 -251 -175 116 -140 -350 42 204
3565 204 -217 -449 475 134 -416 163 111 -356 -93 407 163 -667 148 502 -323 -453 176 -101 -328 239
3585 239 346 -60 -117 532 -225 -553 118 5 -211 -22 1 -4 -290 281 229 43 -208 531 -25 -206 468 159
3607 159 -159 -154 142 -118 -317 267 212 -488 177 249 -172 -229 264 91 -326 -121 -139 -358 -120 107 65 -556
3629 -556 343 40 -211 -97 199 -156 -159 16 53 50 -195 114 -221 -10 243 34 -284 370 215 -233 -300 240
3651 240 167 -29 -67 217 -383 -356 271 -303 -75 255 -89 -413 90 636 -224 -207 252 140 -610 41 317
3672 317 -342 31 164 82 -320 139 524 -254 -395 450 -58 -388 113 85 -450 -293 272 -23 -221 189 315
3693 315 -410 -248 647 -109 -437 443 374 -495 -215 320 147 -481 104 379 -365 -155 303 175 -378 -40
3713 -40 180 -381 -96 394 -7 -284 193 302 -466 0 475 -174 -334 -151 337 -240 54 289 -192 -69
3733 -69 206 125 -155 84 104 -251 -183 -39 -6 -201 75 192 -105 -34 346 -76 -107 180 -261 -155 264 57
3755 57 155 -264 258 -91 -227 38 101 -120 -103 88 73 -142 277 239 -177 27 154 -174 -259 217 -75 -496
3777 -496 -119 88 -183 -176 131 221 -201 -197 121 -85 -254 349 261 -247 24 320 -66 -298 117 389 -535 -38
3799 -38 211 -485 -398 241 -137 -428 115 289 -111 -399 488 244 -205 156 -66 -359 -187 366 -190 33 311
3820 311 499 -15 -263 310 34 -192 199 356 -268 -12 208 171 -155 149 -73 -60 -3 144 -209 -299 203
3841 203 167 -70 -191 58 207 -74 29 -9 -333 -124 261 22 -49 189 79 -84 -4 157 14 -110 315
3862 315 73 -349 302 51 -108 55 115 -257 -233 323 71 -105 342 200 -81 -41 467 7 -123 185 148
3883 148 -132 -1 316 -122 -262 112 290 -346 -114 394 -135 -309 166 -42 -314 -158 177 -158 -491 269
3903 269 104 -181 310 182 -260 -4 322 178 -354 -152 272 -445 -48 295 -85 -163 146 281 -207 -245 193
3924 193 80 -251 201 202 8 -335 236 121 -287 129 53 -33 -135 126 27 -89 196 138 -175 22 415 -158
3946 -158 -41 331 153 -211 -42 -6 -369 -294 168 71 171 84 127 80 -111 78 -314 -79 142 94 -181 47
3968 47 76 -86 -169 150 43 -203 134 195 -63 -243 107 159 143 13 173 -324 -421 409 125 -325 161 323
3990 323 26 -331 384 -196 -269 -85 367 -331 -47 271 -307 -332 136 246 -347 -193 297 350 -254 416 275
4011 275 -23 -19 264 189 -225 25 388 -83 50 178 -94 -138 193 10 -43 112 229 -191 -263 90 90 -276 -14
4034 -14 172 142 -175 197 -105 -145 52 54 -100 -126 340 -153 -179 295 293 1 31 77 249 -48 69 370 -270 -2
4058 -2 218 104 -322 -249 458 -77 47 144 113 -218 121 -68 3 171 150 -307 -22 339 -224 -368 21 234
4080 234 -352 -54 205 -114 -427 192 106 -281 96 -55 149 43 243 161 -105 -33 387 -336 -51 50 110
4101 110 7 27 133 -56 -86 379 30 -259 -156 102 -93 -61 141 114 -72 -16 -141 -315 -75 -21 -234 -395
4123 -395 -103 56 -353 162 364 -235 -247 129 183 -279 -263 237 -215 -12 105 27 24 99 168 156 -104 -50 27 -312
4147 -312 30 23 30 -32 50 -16 47 -101 114 -59 254 201 159 105 35 102 -39 24 202 -288 -126 103 299 -14 -214
4172 -214 56 -93 -225 181 19 -275 190 69 -68 135 281 2 -152 85 244 -284 -26 176 -49 -286
4192 -286 49 -167 -125 -102 372 -38 -15 57 112 101 149 321 90 -37 374 417 -205 -42 361 -33 36 79 -118
4215 -118 -313 -39 123 -167 86 203 214 -206 -46 264 -329 -135 149 -57 -304 -121 242 -116 150 137 29
4236 29 -259 202 66 -135 -177 284 -66 18 -82 141 -10 11 -106 -125 -255 343 102 -319 -46 247 41 -108
4258 -108 258 -102 -69 193 137 -36 -200 237 47 -231 -72 43 -81 89 75 4 -274 37 -44 -38 -98 208 5
4281 5 -100 136 104 -119 89 95 -25 -221 -89 -178 -38 -130 144 -113 -140 129 15 -76 24 100 -127 220 64
4304 64 142 -349 140 151 -118 -65 73 59 -50 50 89 -111 94 117 231 -70 78 10 88 119 154 137 -205 127
4328 127 41 80 98 -126 -223 160 269 59 -168 -123 249 -165 -174 370 -102 -144 50 -35 -185 -37 326 25 57
4351 57 200 120 -102 -42 409 -123 -85 144 154 -226 52 113 35 -349 442 295 -121 133 66 29 80 341 -140
4374 -140 -45 -103 49 -100 -116 500 -96 -176 69 49 -314 -30 -32 127 -43 247 164 63 -67 205 67 -299 -13
4397 -13 140 -157 -54 206 -43 -204 -89 161 153 -204 208 -81 -19 19 83 -102 25 177 6 -92 181 233 -187
4420 -187 -1 138 -118 -6 81 168 -88 115 114 237 -214 -7 80 171 204 57 79 -217 46 -134 187 67 -141
4443 -141 69 -17 128 42 155 349 30 -82 50 259 -126 -155 217 -212 -207 -51 188 -343 63 33 -175 -111
4465 -111 24 -96 -17 164 119 -129 -68 349 119 -307 176 241 160 -16 -45 139 -209 115 33 -160 -290 78
4487 78 0 -283 -55 -39 -68 -38 198 106 -67 -37 330 -115 47 301 58 21 -116 245 63 -20 81 136 -369
4510 -369 67 136 74 142 4 35 -229 261 153 -119 148 73 -7 -214 199 -84 -122 -120 40 -65 -92 -52 91 -122
4534 -122 76 -42 94 -362 39 67 76 80 59 -90 -5 137 106 -58 -33 295 -359 285 159 -58 -142 311 -190
4557 -190 -31 149 -235 -92 42 156 -28 -198 -21 -33 -162 54 2 -63 -170 141 113 212 161 184 -179 -244 102
4580 102 -80 -163 -4 92 -22 112 182 -86 -165 -212 223 -118 -206 10 103 -111 -273 207 -212 -156 -55 87 -85
4603 -85 -17 219 -36 159 296 60 -283 -17 254 -64 -306 220 218 -69 156 86 68 116 139 -321 -121 37 174
4626 174 -87 57 20 70 -107 1 189 136 -157 123 77 -60 -21 -109 -91 115 -101 -305 -114 231 -106 -169 -35
4649 -35 20 -65 -341 227 -188 -311 237 -153 -24 88 251 -46 -17 49 -236 -72 -207 -72 -4 -132 174 -181
4671 -181 84 83 45 163 -196 63 -194 -283 -14 18 -207 -194 137 -104 -94 -205 -42 -163 -17 159 196 -90 72
4694 72 -62 -91 170 95 85 -150 68 214 -9 -259 168 -144 -160 27 134 -8 -166 38 -127 -1 -29 -67
4716 -67 12 -17 -122 1 -54 -97 -53 -67 -18 -73 -179 58 110 34 187 -38 258 -32 -15 20 -51 18 -287 -95 -55
4741 -55 -170 235 -11 -72 -1 84 -233 119 -202 -81 18 257 -132 29 301 -55 -19 43 -3 97 -262 65 -40
4764 -40 -132 115 39 -123 -160 144 7 -116 92 64 -470 -271 54 19 -233 -41 10 -68 -274 0 177 -133 -143
4787 -143 379 -27 -64 318 148 -99 242 306 -116 35 107 -123 -143 -29 -51 29 -93 -135 58 -173 -56 476
4809 476 -23 149 41 -160 -233 -54 -70 -161 -153 271 -133 -251 -58 -61 -262 39 70 -25 182 349 256 -250 -68
4832 -68 168 -105 -92 -97 -354 -176 -154 24 104 102 119 -120 -253 -32 -12 -81 -30 -19 -60 -66 329 94 -40 44 -91 46
4858 46 56 -27 114 -74 -20 37 -270 -73 -88 -202 -210 248 204 -294 99 122 -13 -48 22 65 65 -4 -7 51 -63 11 -107
4885 -107 39 39 504 -17 -438 50 20 -234 53 29 -112 -39 218 -106 -35 -120 186 -192 -125 -180 -88 109 99 -118
4909 -118 -233 -40 262 17 -205 -150 199 13 12 46 7 -27 -56 -113 -66 -67 -59 -162 -294 94 -163 -51 -170 132
4933 132 241 -206 -30 -113 -84 175 111 -13 -1 35 -189 67 107 170 -11 185 167 -135 -113 18 212 -126 249
4956 249 275 -104 23 7 203 -358 11 213 -94 -104 -94 -67 103 -48 456 83 -320 63 -131 -162 173 127
4978 127 -210 -146 31 -62 -119 -41 -188 -77 -184 142 167 -2 179 -72 -177 -337 172 69 -264 229 116 -52
5000 -52 -112 92 9 29 368 253 -210 -70 -56 -60 129 255 55 -328 -171 -22 -44 -119 115 -97 -288 -81 137
5023 137 -255 -62 -77 62 -98 158 170 -114 -308 95 46 121 41 194 21 40 96 -131 -148 351 249 -91 -167
5046 -167 -101 -210 -98 -134 78 -60 -162 86 -128 18 -167 130 -401 208 90 74 -141 61 -151 -62 49
5067 49 50 -114 -29 1 60 -35 172 -22 17 -53 237 44 133 199 81 -268 -15 17 -59 19 56 7 -94 28 132
5092 132 34 -179 140 161 15 76 -252 -213 91 -95 -217 -111 79 41 -66 -87 274 4 -191 178 48 -225
5114 -225 -20 107 72 -124 135 196 48 298 189 -126 -190 339 67 60 -150 6 -113 54 -61 1 -198 -118
5136 -118 279 -277 103 -21 52 -36 201 188 75 -80 250 208 -73 65 7 -157 -168 -34 -206 101 129 57 -330
5159 -330 -11 98 -124 140 247 35 -112 -203 147 -338 -59 214 -39 -12 101 23 -150 100 1 141 -155
5180 -155 -11 302 -92 -343 181 169 -270 -155 179 104 194 243 209 133 -69 366 -204 -143 -18 -85 -85 47 69 -133
5204 -133 -112 -79 95 -118 74 55 -217 -32 -77 60 7 87 -4 -22 69 -85 140 87 -87 -81 -190 80 -3 75 118
5229 118 307 -5 66 127 -85 221 -37 -171 -225 -159 59 -175 130 -158 -64 -215 83 195 -267 -165 339 20
5251 20 -39 2 207 39 -353 95 -149 -343 -100 219 109 -84 21 -260 -355 127 8 -217 -51 298 261 64
5273 64 -23 347 -261 -64 -63 154 -150 20 -14 -18 -132 57 125 -351 105 5 -111 -72 150 228 20 144 -107
5296 -107 -54 -102 187 140 -159 -126 49 41 -172 256 31 5 86 100 308 -56 131 -30 -228 254 -125 -91 128
5319 128 13 -164 109 192 130 -50 -53 -91 -242 -116 -7 83 10 143 173 99 7 300 255 -118 16 74 106 57 116
5344 116 -168 55 124 212 34 192 106 -1 111 -37 -135 80 18 66 -44 -348 -253 17 24 32 232 -22 164 -60
5368 -60 23 171 38 -223 62 46 12 11 73 144 136 -240 241 42 78 -176 -362 -159 -51 39 -50 144 103 -93 -141
5393 -141 24 -171 -34 -182 202 -55 146 53 -190 99 -222 -11 213 -55 -65 -281 -6 -115 59 -21 30
5414 30 48 155 -70 -50 -88 -9 -72 -281 164 126 -207 -17 173 68 169 -161 -113 -124 -181 124 123 -138 38 77
5438 77 -141 17 -226 63 166 180 136 53 119 51 -149 61 -227 61 -17 -55 69 140 49 206 -89 231 -119
5461 -119 -38 -30 94 122 -131 -133 0 79 -45 78 109 110 -158 -21 -207 -92 -129 286 -194 -127 215 -71 93 -47
5485 -47 -99 -348 51 222 -128 -177 107 102 -116 94 150 -76 52 116 160 -2 -145 -50 -64 68 -152 88 -247
5508 -247 4 29 -172 252 -33 -128 -80 170 40 -108 0 -2 -80 170 -47 114 15 -18 -5 -89 -79 63 -96 -139
5532 -139 -202 211 -211 -58 132 -33 -13 177 205 56 175 113 -18 139 -203 -93 -224 115 -17 52 280 -86
5554 -86 120 81 92 -22 -83 -239 -291 -106 -103 -117 173 89 -287 86 161 -57 -124 311 -38 -240 110 269 -148 -109
5578 -109 93 188 44 -67 -1 -129 134 -49 -55 -94 -159 -110 -305 203 282 136 20 102 177 152 -121 198 -314 -102
5602 -102 47 -46 325 -1 -8 106 218 330 -181 -137 31 -6 -25 -148 85 135 9 191 -94 -136 -150 183 -75
5625 -75 18 91 99 3 72 153 -117 -26 -43 -44 86 123 -213 -96 184 116 21 -38 94 10 -38 -255 58 147 86 83 -60
5652 -60 87 130 11 208 -56 161 168 -6 -100 182 -172 -221 280 -101 61 16 -91 -55 15 -93 233 -52 -33
5675 -33 97 -50 156 -31 40 155 22 22 110 53 301 -120 144 -215 -181 -339 41 178 243 -247 -16 61 68 144
5699 144 -232 -323 -131 77 56 -12 -8 95 -9 83 -110 19 -156 232 21 -147 -236 -260 29 -129 68 -154 -138
5722 -138 -12 -29 146 -176 229 134 34 117 -4 66 13 -27 117 94 -149 94 -193 3 -26 47 -331 -77 199
5745 199 7 -45 291 -95 -231 107 98 37 61 282 -175 160 108 134 128 -210 212 53 5 44 -270 -272 7 -143
5769 -143 277 -39 -22 304 107 -38 -41 -177 -225 102 -100 137 -125 -52 -178 -48 -182 -4 -54 -132 235 -65
5791 -65 171 -42 49 -29 -71 30 69 19 144 57 34 -36 -71 15 158 232 34 -91 34 -177 164 32 270 -186
5815 -186 122 -56 -301 -32 109 8 -107 -63 101 163 -81 324 191 138 -77 116 100 -176 -52 -7 -198 94
5837 94 244 29 17 -93 143 -82 62 55 55 47 70 -139 -471 134 32 -31 233 -216 70 -90 19 -273 90
5860 90 198 159 -47 -2 37 -16 -264 -172 -101 65 32 -36 250 8 -47 -33 -143 -2 7 141 140 -38 198 59 -13
5885 -13 54 192 -159 -85 101 168 45 -96 -171 174 197 132 204 149 74 -131 -6 -130 -162 -20 246 104 323 -97
5909 -97 -76 -153 -30 -277 -24 -209 -94 -120 41 -170 152 25 -67 48 178 327 -300 2 53 -171 123 77
5931 77 -93 -14 68 278 -186 -119 159 191 -127 154 -85 121 -20 -68 140 21 262 66 87 70 65 103 69 16
5955 16 -37 -170 18 -46 125 -18 127 -3 -3 -29 -27 32 -148 169 35 -98 53 34 65 -54 -66 -88 -103 32 127
5980 127 -27 -113 -166 -2 243 27 204 129 -11 -68 -65 85 135 -197 -43 -158 -2 -188 -81 154 -112 -67 -95
6003 -95 160 71 -67 209 62 111 -29 -113 -16 122 72 -140 -75 -58 -139 115 84 18 125 -115 -29 -74 -23 200 169
6028 169 -167 156 62 97 14 170 199 -130 -58 -19 22 158 79 111 -234 69 -188 29 26 205 -113 -126 81 118
6052 118 -470 -94 -69 105 3 318 -17 95 -228 -144 41 -52 52 -209 -196 -8 -167 81 24 -124 -116 -20 -149
6075 -149 -146 -403 96 64 -171 152 -194 -134 -108 213 -11 -144 -49 194 -123 12 -48 -162 -40 -201 185 70
6097 70 132 -31 -30 -30 -193 31 81 -102 70 32 80 -344 -16 -66 -161 -41 -5 259 -15 6 22 -15 -32 -23 32 314
6123 314 12 -8 202 -7 -64 52 -144 -11 -7 -38 -120 -39 -181 57 34 -16 -149 19 13 -284 -65 -96 25 2
6147 2 -48 -121 -64 1 166 -231 -29 207 -52 4 -6 62 -24 30 -109 226 -76 -65 267 26 -69 187 29 -42 -126
6172 -126 5 -288 123 -81 -8 -17 91 -221 -253 71 101 44 -51 50 110 -14 -167 5 -83 -157 119 98 -19 -4
6196 -4 67 -138 -53 -65 -46 135 47 42 -55 32 8 95 -162 -7 -223 -168 -96 25 -244 -182 -50 -35 -105 -38 -97 21 -27
6223 -27 -190 169 -199 206 -33 -6 159 1 -73 -31 35 141 -237 56 -13 114 -97 137 170 -231 14 -219
6245 -219 19 77 -58 -138 55 -251 -183 -137 -153 8 19 -1 87 129 215 -12 -45 -89 -1 -107 54 -106 -179 89 -85
6270 -85 51 -447 -50 100 -168 -140 84 -25 31 -108 -43 82 23 101 -178 61 9 174 -41 72 229 -51
6292 -51 0 35 158 -317 -23 78 329 51 44 -99 -229 300 254 -10 -14 195 -15 -146 44 208 131 -80 32
6315 32 -125 -35 265 27 -87 83 -97 -3 -108 155 -8 43 24 27 -45 3 -292 64 -69 183 34 -105 291
6338 291 158 -113 -215 18 138 -77 169 44 -35 -276 149 -199 80 -61 39 175 0 -46 203 -18 -130
6359 -130 211 -159 -44 -25 31 -96 10 -90 -80 60 177 -171 28 -66 -211 35 43 29 -323 52 -51 -44 6
6382 6 67 -263 -327 -147 29 75 349 -22 -208 -12 -62 43 -85 72 -18 93 -170 142 -234 192 -54 72
6404 72 -12 -152 116 -270 138 -148 -71 -54 -38 176 -51 -116 -267 34 120 65 93 -158 97 66 49 35 -119 -48
6428 -48 -108 69 -256 -106 -212 -221 28 134 139 -87 -42 -150 113 -10 -237 -184 -66 159 12 -17 -62 -7 -249 -193
6452 -193 45 197 -110 -125 34 -170 104 -7 -341 59 8 -67 -49 -23 15 -34 122 76 -51 90 185 306 -270
6475 -270 -14 -199 113 30 -206 -89 -37 141 -55 103 108 -85 64 17 305 123 108 -58 8 -254 -150 128
6497 128 102 52 76 52 243 193 272 117 -105 2 -196 247 -54 61 -10 203 -26 -43 -184 -140 -48 -147 -4 137
6521 137 -53 -13 180 -9 193 74 33 10 -169 37 133 -282 -178 -106 -84 -90 -25 67 -87 -94 106 -24 -62 87
6545 87 -20 -73 -4 71 106 90 -1 -8 -1 -127 -6 -16 219 301 25 -22 -36 -227 -32 -110 111 119 -69 -201 -75 -94
6571 -94 -10 4 88 -100 -50 125 53 46 186 -31 -154 -92 281 -84 -106 -143 -201 129 -54 -45 8 -320 34 26 82 -89
6597 -89 -148 192 -49 118 109 48 -67 113 -74 -203 -24 -99 -84 115 66 -66 -257 14 -242 -101 -6 -113 24
6620 24 -48 -145 -246 -33 -150 -175 -33 34 -37 82 -167 258 -7 -180 163 -92 -258 -198 43 -156 194 -51
6642 -51 -32 -63 -123 234 297 58 -116 -129 218 -87 -47 -71 -128 29 -218 -55 206 162 68 8 -32 7 -40 -28 46 47
6668 47 -56 52 38 -248 7 123 21 -197 -133 102 -27 298 200 102 -145 63 -64 -217 128 175 -92 145
6690 145 -33 166 -61 -104 339 -102 56 208 -86 -54 153 107 109 -100 -244 373 -120 -141 44 19 35 18 68
6713 68 -211 71 96 128 286 82 88 -88 108 -431 -154 72 63 151 190 141 61 87 6 -73 -294 28 31 144 20
6738 20 331 3 7 98 26 -193 29 134 -142 171 109 155 100 81 34 -140 102 -68 -29 89 56 -102 138 -144
6762 -144 61 137 -268 -125 -296 85 -41 -16 -202 26 -114 -43 -120 -181 -307 -365 36 -72 -91 -43 242 -39 23
6785 23 -35 -32 46 -75 67 -233 -42 -74 -22 51 -250 -264 14 9 -80 -60 24 -38 -137 -160 -199 -84 -73 87 -164 -38
6811 -38 -278 -56 45 10 81 -142 123 -102 27 103 -53 -31 21 92 129 147 79 14 -95 65 -36 -223 -339 -47
6835 -47 76 8 -115 -121 29 142 -29 -330 -132 -21 -46 -51 -83 -11 -16 118 97 128 -69 -81 230 211 32 -158 -77
6860 -77 121 -116 -107 -18 117 -32 -61 127 -89 -63 19 -131 14 193 -38 6 -80 -130 -50 -126 -37 -148 56 73 68
6885 68 -90 203 -37 18 83 23 149 -39 60 182 -49 -103 130 187 -72 114 -90 141 19 -18 -55 -63 140 60
6909 60 -212 151 165 -173 -51 15 79 -104 165 93 14 -26 69 85 115 -158 108 -43 106 58 -189 179 -24 -307
6933 -307 8 56 -116 -36 111 183 -199 -119 85 259 -32 -40 79 89 -99 19 167 1 49 66 54 24 65 -126
6957 -126 115 34 -109 96 -15 40 237 59 -142 74 140 107 -19 187 57 102 195 -76 -263 -181 23 -70 181
6980 181 141 79 -189 19 -36 72 -127 33 -211 -107 99 73 -69 50 159 52 -92 39 130 21 -113 -81
7002 -81 164 -137 79 -87 77 -47 89 -148 9 -142 130 -19 2 106 31 -1 50 -73 -77 148 164 -222 -62
7025 -62 167 51 -150 -164 -102 -324 -138 -54 -105 -31 88 -23 -112 343 160 -322 -55 185 -137 -356 -164 -211 -82
7048 -82 -42 68 -12 -162 12 47 -63 199 332 182 -10 111 64 12 -71 -10 -86 -145 -75 -101 -40 -99 28 149 -158
7073 -158 42 110 -16 235 -98 28 -345 2 -67 -39 -35 -165 -48 -261 -195 175 -18 -34 -26 54 9 142 186 108
7097 108 6 170 59 -131 -66 17 -108 -86 -140 -226 -8 125 36 139 50 -286 -76 236 -95 -163 -34 31 -150
7120 -150 -159 15 -190 -127 -161 1 -63 -105 132 24 94 -87 -123 42 58 -112 -101 163 -3 77 91 22 26 -262 -183
7145 -183 -83 59 -7 -181 -24 -136 45 329 -265 -167 -144 -118 88 -45 -43 194 16 19 -78 -151 19 219 -229
7168 -229 -74 -100 -29 -51 91 145 37 -126 -89 -29 -207 32 60 138 -295 -111 278 22 144 134 -13 -103 64
7191 64 140 39 -231 157 81 19 165 -120 83 -53 96 -91 -124 -149 -104 17 154 99 -70 -3 -147 -131 -75 -150
7215 -150 -27 97 225 126 -6 197 62 1 -60 77 97 195 -53 -189 56 -98 186 297 -115 -65 135 219
7237 219 123 -104 74 -103 43 -179 -17 -124 48 -93 -62 -231 10 45 -45 -151 104 38 19 -28 166 -130
7259 -130 -143 -4 18 -90 -355 150 -98 -5 5 -40 89 -272 -59 55 148 37 49 180 -34 -243 -153 -6 89
7282 89 217 -109 -7 64 103 -82 166 210 -4 106 9 -11 8 97 -275 107 -106 75 2 33 -7 -31 -97 62
7306 62 37 -134 167 38 -243 -2 167 -174 -99 -199 -121 363 18 -17 -174 192 151 31 -108 9 143 67
7328 67 -33 191 -94 -128 103 -92 76 -49 132 192 -78 -155 -34 -117 91 37 182 -74 229 -17 -124 -13
7350 -13 118 111 95 -228 137 106 -236 326 -205 -52 111 -45 -75 127 33 53 -272 189 -173 -52 -136 20 -177
7373 -177 -20 56 240 -220 118 17 -2 169 -151 -24 -20 157 133 -138 2 165 248 -55 123 -120 -95 -33 48
7396 48 -100 -44 -18 -25 -24 -140 96 -148 -3 131 -218 -208 -26 89 112 -87 -29 -23 193 -38 168 -44 22 97 -163
7421 -163 -51 202 -348 -179 -26 36 -272 348 37 -175 -96 -202 243 -82 145 113 -77 53 122 -58 -23 5
7443 5 -41 -127 -110 32 -41 123 -44 -30 -23 47 -113 127 25 -315 147 -125 7 86 -180 -200 27 142 20 -33
7467 -33 -67 66 -175 22 88 -24 -2 -93 9 -23 148 79 -117 64 -81 -131 -223 -177 287 -62 71 77 184 -4
7491 -4 32 42 -68 30 35 94 120 100 -340 11 -51 -21 -2 153 -60 -63 89 8 -179 -19 -22 113 -158 -44 -144 -81
7517 -81 -247 -17 -123 50 -104 -21 0 0 172 -22 -35 -50 48 -136 -235 72 -189 -22 68 21 49 135 -26 188
7541 188 33 -27 154 96 188 66 156 -93 -123 180 -310 7 38 360 20 114 -12 -3 -139 18 302 -101 -48
7564 -48 164 197 -25 -84 21 -121 73 -56 141 173 -114 -134 -49 -89 97 -63 176 -85 -218 21 -155 -89 -31
7587 -31 -113 -61 161 -288 39 -77 7 -122 129 -9 130 90 -62 95 -139 -77 134 167 -42 -218 -123 -68 287
7610 287 -62 -115 -58 -140 14 -151 74 133 -77 101 -17 81 31 45 48 6 9 -60 -53 -128 -11 -207 -127 -26 -56 97
7636 97 -136 -24 -291 231 150 -57 -9 174 -61 -129 -145 -89 -188 -25 238 113 76 81 -93 23 -159 0 34 93
7660 93 -151 56 13 -128 0 23 -165 116 263 99 -45 87 -84 -146 -29 -180 113 -216 183 31 -169
7681 -169 94 -55 -51 81 0 91 -71 65 -19 -303 188 54 -169 -20 -78 -84 -35 27 60 118 -184 70 14 -89
7705 -89 32 -15 -1 99 75 -40 9 95 134 -94 16 -19 -226 214 2 76 155 199 204 -67 -32 65 -282 -113 171
7730 171 -27 -9 -249 -193 77 -132 -23 140 -71 113 9 -1 -175 -153 65 109 256 -60 -43 -36 -174 -3 -200
7753 -200 114 58 -44 -146 -86 -194 29 75 -113 103 -32 -214 -40 -29 64 -46 -17 -258 5 -155 -86 119
7775 119 248 -255 20 236 -27 46 -41 104 51 6 -90 -7 228 120 -150 20 43 -164 112 -172 73 54 -200
7798 -200 88 -1 -39 41 -88 -135 110 48 150 -3 -16 -37 14 -4 -116 42 115 228 -85 -85 320 47 197 191 -114
7823 -114 231 -97 -57 -251 287 66 -29 80 -135 130 -8 10 -73 -179 -94 121 21 84 -92 91 -64 -60 63
7846 63 166 -139 -144 -193 -185 151 44 278 -15 6 17 -25 -23 -19 70 199 187 -12 -94 93 -188 -116 -93 -156 -67 -32 -3
7873 -3 -80 70 47 -188 40 151 98 -145 169 226 141 -110 -232 -112 148 79 165 -48 -252 81 168 81 -183 -26
7897 -26 -40 -7 186 80 38 80 -104 -107 -34 -75 -3 -187 -31 55 -103 -153 -12 56 84 139 7 41 -30 157 5 -75
7923 -75 -79 230 -120 -129 -132 -368 -291 194 89 -287 -50 11 83 64 -101 29 -110 159 10 172 -145 69 89 -309
7947 -309 -59 21 52 -121 70 146 -22 12 66 54 62 149 -149 116 37 -114 8 -144 71 -148 -35 248 165 -14
7971 -14 101 -53 -69 -110 -98 -134 298 27 -223 106 167 74 -179 -16 -44 86 -19 94 -141 -13 -25 -9 -55 -181
7995 -181 -118 -87 -77 83 -187 -124 36 -28 11 63 -73 251 216 244 -102 -59 -115 111 -111 42 -80 60 98 -151
8019 -151 13 24 -58 57 104 19 -110 98 204 163 17 -38 54 -18 -16 85 95 37 242 -41 18 187 94 71 -245
8044 -245 -88 -8 13 153 -82 -27 -34 -80 -113 39 -21 -120 -155 163 -34 207 -115 47 137 -272 197 182 -103 54
8068 54 124 109 -34 67 -12 81 162 28 174 -108 -261 -190 -143 79 275 -143 -124 -11 -200 -82 65 111 -267
8091 -267 51 22 121 -186 -271 37 -113 72 79 -35 -147 109 163 47 -140 -2 8 6 47 -22 64 93 74 171 -169
8116 -169 -85 -128 212 -85 -118 80 86 39 152 -37 71 -102 -60 -29 -46 52 -282 145 -300 311 -106 191 22
8139 22 -173 -46 -124 -86 -71 16 46 -135 199 -138 -117 -72 -69 207 -131 19 -163 66 -72 60 -9 -132 281 96
8163 96 -25 -54 280 237 -29 41 118 -157 -64 161 -55 -120 -135 77 66 24 59 -222 105 133 -62 331 13 171
8187 171 320 31 -151 -75
8191g5
##END NTUPLES=NMR FID
##END=
