##TITLE=1H_PhBBCO604-3
 CDCl3
 8 sc, 
 6.04.2022
##JCAMPDX= 6.0         $$ Bruker NMR JCAMP-DX V2.0
##DATA TYPE= NMR FID
##DATA CLASS= NTUPLES
##ORIGIN= UXNMR, Bruker Analytische Messtechnik GmbH
##OWNER= root
$$ XWIN-NMR		Version 3.5
$$ Wed Apr  6 16:36:19 2022 Russian Standard Time (UT+4h)  she@DPX200
##.OBSERVE FREQUENCY= 200.131346
##.OBSERVE NUCLEUS= ^1H
##.DELAY= (6, 6)
##.ACQUISITION MODE= SIMULTANEOUS
##.ACQUISITION SCHEME= undefined
##.AVERAGES= 8
##.DIGITISER RES= 18
##SPECTROMETER/DATA SYSTEM= spect
##.PULSE SEQUENCE= zg30
##.SOLVENT NAME= CDCl3
##.SHIFT REFERENCE= (INTERNAL, CDCl3, 0, 15.7039)
##AUDIT TRAIL= $$ (NUMBER, WHEN, WHO, WHERE, WHAT)
$$ ##TITLE= Audit trail, XWIN-NMR		Version 3.5
$$ ##JCAMPDX= 5.01
$$ ##ORIGIN= Bruker BioSpin GmbH
$$ ##OWNER= she
$$ F:/spectra/data/she/nmr/H-F/1/audita.txt
$$ ##AUDIT TRAIL=  $$ (NUMBER, WHEN, WHO, WHERE, WHAT)
(   1,<2022-04-06 16:35:08.25 +0400>,<she>,<DPX200>,
      <created by zg, POWCHK disabled, PULCHK disabled
       configuration hash MD5:
       00 E9 B6 7A A2 85 ED C7 34 08 36 98 17 FE 4E 26
       data hash MD5: 16K
       AA 9C 08 88 2C CD B1 65 CD 19 35 02 35 68 0D 63>)
$$ ##END=
$$ 
$$ hash MD5
$$ 27 09 92 93 E8 32 07 D5 AB A3 10 49 D3 C6 F6 79
##$RELAX= 
##$RELAX= 
##$RELAX= 
##$RELAX= 
##$RELAX= 
##$RELAX= 
$$ Bruker specific parameters
$$ --------------------------
##$DU= <F:/spectra>
##$EXPNO= 1
##$NAME= <H-F>
##$PROCNO= 1
##$TYPE= <nmr>
##$USER= <she>
##$AMP= (0..31)
100 100 100 100 100 100 100 100 100 100 100 100 100 100 100 100 100 100 
100 100 100 100 100 100 100 100 100 100 100 100 100 100 
##$AQSEQ= 0
##$AQ_mod= 1
##$AUNM= <au_zg>
##$AUTOPOS= <>
##$BF1= 200.13
##$BF2= 200.13
##$BF3= 200.13
##$BF4= 200.13
##$BF5= 200.13
##$BF6= 200.13
##$BF7= 200.13
##$BF8= 200.13
##$BYTORDA= 1
##$CFDGTYP= 0
##$CFRGTYP= 5
##$CHEMSTR= <none>
##$CNST= (0..31)
1 1 145 1 1 1 1 1 1 1 1 1 1 1 1 1 1 1 1 1 1 1 1 1 1 1 1 1 1 1 1 1 
##$CPDPRG= <>
##$CPDPRG1= <>
##$CPDPRG2= <>
##$CPDPRG3= <>
##$CPDPRG4= <mlev>
##$CPDPRG5= <mlev>
##$CPDPRG6= <mlev>
##$CPDPRG7= <mlev>
##$CPDPRG8= <mlev>
##$CPDPRGB= <>
##$CPDPRGT= <>
##$D= (0..31)
0 1.2 0 0 0 0 0 0 0 0.06 0 0.03 0 0 0 0 0.0002 0 0 0 0 0 0 0 0 0 0 0 0 
0 0 0 
##$DATE= 1649248507
##$DBL= (0..7)
120 120 120 120 120 120 120 120 
##$DBP= (0..7)
150 150 150 150 150 150 150 150 
##$DBP07= 0
##$DBPNAM0= <>
##$DBPNAM1= <>
##$DBPNAM2= <>
##$DBPNAM3= <>
##$DBPNAM4= <>
##$DBPNAM5= <>
##$DBPNAM6= <>
##$DBPNAM7= <>
##$DBPOAL= (0..7)
0.5 0.5 0.5 0.5 0.5 0.5 0.5 0.5 
##$DBPOFFS= (0..7)
0 0 0 0 0 0 0 0 
##$DE= 6
##$DECBNUC= <off>
##$DECIM= 32
##$DECNUC= <off>
##$DECSTAT= 4
##$DIGMOD= 1
##$DIGTYP= 9
##$DL= (0..7)
0 120 120 120 120 120 120 120 
##$DP= (0..7)
150 150 150 150 150 150 150 150 
##$DP07= 0
##$DPNAME0= <>
##$DPNAME1= <>
##$DPNAME2= <>
##$DPNAME3= <>
##$DPNAME4= <>
##$DPNAME5= <>
##$DPNAME6= <>
##$DPNAME7= <>
##$DPOAL= (0..7)
0.5 0.5 0.5 0.5 0.5 0.5 0.5 0.5 
##$DPOFFS= (0..7)
0 0 0 0 0 0 0 0 
##$DQDMODE= 0
##$DR= 18
##$DS= 0
##$DSLIST= <SSSSSSSSSSSSSSS>
$$ [...]
##$SUBNAM2= <"">
##$SUBNAM3= <"">
##$SUBNAM4= <"">
##$SUBNAM5= <"">
##$SUBNAM6= <"">
##$SUBNAM7= <"">
##$SUBNAM8= <"">
##$SUBNAM9= <"">
##$SW= 18.0517287032376
##$SWIBOX= (0..15)
0 0 2 0 0 0 0 0 0 0 0 0 0 0 0 0 
##$SW_h= 3612.71676300578
##$TD= 16384
##$TD0= 1
##$TE= 0
##$TE2= 300
##$TE3= 300
##$TEG= 300
##$TL= (0..7)
0 120 120 120 120 120 120 120 
##$TP= (0..7)
150 150 150 150 150 150 150 150 
##$TP07= 0
##$TPNAME0= <>
##$TPNAME1= <>
##$TPNAME2= <>
##$TPNAME3= <>
##$TPNAME4= <>
##$TPNAME5= <>
##$TPNAME6= <>
##$TPNAME7= <>
##$TPOAL= (0..7)
0.5 0.5 0.5 0.5 0.5 0.5 0.5 0.5 
##$TPOFFS= (0..7)
0 0 0 0 0 0 0 0 
##$TUNHIN= 0
##$TUNHOUT= 0
##$TUNXOUT= 0
##$USERA1= <user>
##$USERA2= <user>
##$USERA3= <user>
##$USERA4= <user>
##$USERA5= <user>
##$V9= 5
##$VALIST= <valist>
##$VCLIST= <CCCCCCCCCCCCCCC>
##$VD= 0
##$VDLIST= <DDDDDDDDDDDDDDD>
##$VPLIST= <PPPPPPPPPPPPPPP>
##$VTLIST= <TTTTTTTTTTTTTTT>
##$WBST= 1024
##$WBSW= 4
##$XGAIN= (0..3)
0 0 0 0 
##$XL= 0
##$YL= 0
##$YMAX_a= 295950
##$YMIN_a= -268460
##$ZGOPTNS= <>
##$ZL1= 120
##$ZL2= 120
##$ZL3= 120
##$ZL4= 120
##$ABSF1= 10
##$ABSF2= 0
##$ABSG= 5
##$ABSL= 3
##$ALPHA= 0
##$AQORDER= 0
##$ASSFAC= 0
##$ASSFACI= 0
##$ASSFACX= 0
##$ASSWID= 0
##$AUNMP= <proc_1d>
##$AZFE= 0.1
##$AZFW= 0.1
##$BCFW= 1
##$BC_mod= 2
##$BYTORDP= 1
##$COROFFS= 0
##$CY= 11.3945322036743
##$DATMOD= 1
##$DC= 2
##$DFILT= <>
##$DTYPP= 0
##$F1P= 2.36226072786647
##$F2P= -0.459571619588291
##$FCOR= 0.5
##$FTSIZE= 0
##$FT_mod= 4
##$GAMMA= 1
##$GB= 0.15
##$INTBC= 1
##$INTSCL= 1
##$ISEN= 128
##$LB= 0.24
##$LEV0= 0
##$LPBIN= 0
##$MAXI= 10000
##$MC2= 0
##$MEAN= 0
##$ME_mod= 0
##$MI= 1.114404
##$NCOEF= 0
##$NC_proc= 0
##$NLEV= 6
##$NOISF1= 3.799351
##$NOISF2= 2.8
##$NSP= 1
##$NTH_PI= 0
##$NZP= 0
##$OFFSET= 15.70392
##$PC= 1
##$PHC0= -18031.33
##$PHC1= 14.40078
##$PH_mod= 1
##$PKNL= yes
##$PPARMOD= 0
##$PSCAL= 0
##$PSIGN= 0
##$REVERSE= no
##$SF= 200.130013532006
##$SI= 16384
##$SIGF1= 3
##$SIGF2= 2
##$SINO= 400
##$SIOLD= 16384
##$SREGLST= <1H.CDCl3>
##$SSB= 0
##$STSI= 0
##$STSR= 0
##$SW_p= 3612.71676300578
##$SYMM= 0
##$S_DEV= 0
##$TDeff= 0
##$TDoff= 0
##$TI= <>
##$TILT= no
##$TM1= 0
##$TM2= 0
##$TOPLEV= 0
##$USERP1= <user>
##$USERP2= <user>
##$USERP3= <user>
##$USERP4= <user>
##$USERP5= <user>
##$WDW= 1
##$XDIM= 8192
##$YMAX_p= 0
##$YMIN_p= 0
$$ End of Bruker specific parameters
$$ ---------------------------------
##NTUPLES= NMR FID
##VAR_NAME=  TIME,          FID/REAL,        FID/IMAG
##SYMBOL=    X,             R,               I
##VAR_TYPE=  INDEPENDENT,   DEPENDENT,       DEPENDENT
##VAR_FORM=  AFFN,          ASDF,            ASDF
##VAR_DIM=   8192,          8192,            8192
##UNITS=     SECONDS,       ARBITRARY UNITS, ARBITRARY UNITS
##FACTOR=    0.0002768,     1,               1
##FIRST=     0,             0,               0
##LAST=      2.2672688,     0,               0
##MIN=       0,             -268460,         0
##MAX=       2.2672688,     295950,          0
$$ Real data points
##PAGE= N=1
##DATA TABLE= (X++(R..R)), XYDATA
0@%%%%%%%%%%%Qj6J6j6K4l2M0m8N6p2Q8j04J20j44J68j92K24k62L02l44L95m51
33b40N11n76O50p33Q23r21J029j146J274j415J569j738J922k123K340k577K840
50A489l128L445l797M188m624N116n670O301p029P879q895J0124j1644J3589j6180
65h836J9817k5331L4787n5358J80109j09997j26859L87618j84732k95007K41980
76E8191J37056l81672K9555L09006j91635k28961L10729O0109l22432R9851K81391
87A61188k35010j44036L09277J0255k92197J65644K33117k43343p9339L10895
97A96451n3840k58179J88716J60213k76922l7255K61499j26724k31215K02828
107B5572Q7661k75379K3904K38423j53285j58369K35734N3769k36506R0309K15134
$$ plain form
0 0 0 0 0 0 0 0 0 0 0 0 0 8 -8 8 -8 16 -16 24 -24 32 -40 48 -56 64 -80 88 -104 120 -142 160 -184 211 -240
33 -240 271 -305 345 -388 435 -486 543 -603 671 -744 825 -913 1009 -1114 1226 -1351 1489
50 1489 -1639 1806 -1991 2197 -2427 2689 -2981 3320 -3709 4170 -4725 5399 -6245 7344 -8836
65 -8836 10981 -14350 20437 -34921 145188 35191 -91668 295950 111218 -183789 58191
76 58191 195247 -186425 -156870 152136 -39499 -268460 42269 102378 -220054 -120203 161188
87 161188 -73822 -217858 91419 101674 -190523 -24879 208238 -35105 -114444 196451
97 196451 142611 -115568 73148 233361 -43561 -80816 180683 53959 -177256 25572
107 25572 113233 -162146 -138242 100181 -53104 -211473 24261 78030 -158476 -68167 146967
118A46967j68948j02569K39654k037k23271J21494J62905k01717o2023K26952
128A37407n6790k01304J51304J14181k16588j3600K07174j05711j64035J72555
138B4593O0189k10416M1047J82378j33235j07196J94729J7935j85409R4227J51772
149A30614j53790n6936J93153l3601j69554J19375J01973j79580k0159J75433
159A06928q4280j43263J46453N7684j80600L3441J62813j15735r8961J70105J3453
170F8038j73558P9745J33365j46030n3976J76414l2767j53166J17180R8057j62729
181d9427j0823J68672p7713j32102J38779N2317j72990K8137J50377j10478r6947
192a12198J57718J6419j62881P1568J30865j32290n6471J66326k3476j49022J02373
$$ plain form
118 146967 -21981 -124550 115104 113067 -110204 11290 174195 -27522 -89545 137407
128 137407 80617 -120687 30617 144798 -71790 -85390 121784 16073 -147962 24593
138 24593 84782 -125634 -84587 97791 -35444 -142640 52089 70024 -115385 -21158 130614
149 130614 -23176 -80112 113041 79440 -90114 29261 131234 -48346 -68505 106928
159 106928 22648 -120615 25838 83522 -97078 -63637 99176 -16559 -115520 54585 68038
170 68038 -105520 -25775 107590 -38440 -92416 83998 51231 -101935 15245 113302 -49427
181 -49427 -60250 108422 30709 -101393 37386 89703 -83287 -55150 95227 -15251 -112198
192 -112198 45520 61939 -100942 -29374 101491 -30799 -87270 79056 55580 -93442 8931
203H931R8791j51393k2798J60543o1608j32532J24332O5213j60406J2351J50761
214I2185r0612j06395J42771L3980j60294M7096J37282j15639p7639J57587J226
225F1548j54422Q0580J19146j35903m7256J63189l3000j46769J05672R0998j55645
236e1862j7339J58426o7598j29825J28029O2046j61122J7296J52343r2672j03017
247a05295J47074L2539j58199N1077J35741j14235p4511J53744q52j51968P7405
258g480J10919j34152m5253J53196l4791j37899J00142Q3712j43766j4067J47342
269G7903o1648j16327J18845N5880j44233J9440J35817q3571q8547J31433K5481
280G0473j39690M7411J16190j05195o2876J34292p500j31629P0427R1690j18257
$$ plain form
203 8931 107722 -43671 -66469 94074 32466 -100066 24266 89479 -70927 -58576 92185
214 92185 1573 -104822 37949 71929 -88365 -41269 96013 -19626 -97265 60322 61548
225 61548 -92874 -12294 106852 -29051 -76307 86882 53882 -92887 12785 103783 -51862
236 -51862 -69201 89225 21627 -108198 19831 81877 -79245 -61949 90394 -2278 -105295
247 -105295 41779 74318 -83881 -32804 102937 -11298 -85809 67935 67083 -84885 -7480
258 -7480 103439 -30713 -75966 77230 42439 -95460 4682 88394 -55372 -69439 77903
269 77903 16255 -100072 18773 74653 -69580 -50140 85677 2106 -86441 44992 70473
280 70473 -69217 -21806 94384 -10811 -73687 60605 53105 -78524 -8097 83593 -34664
291c4664l4427J31417l3863j14357Q9769O6848j21924l746J22961n6207r0269
302g8462J03093L9777j18721K2835J07623p4907o6905J07797J1154j11766M4250
313a4232Q6169q8261m2244J05794j3761r9639O1806O5066r5567j6697J01913l5267
325A5080q1850P7317M3400r6054Q121R3413n3369o2970Q6964J9116r5124L0472
337a5484P8584p1295m2336R1056o548q9680N0023O1383q3995j9428R2095k9037
349A5338p6666O8773M1694q8484N825Q7018m8746n9831Q1528J8895r0135K9367
361a5424P4957o7559l9880Q7858n985q5257M8807N8510q0848j8650Q8237k9125
373A5641p5193O6493L9561q7237N527Q4969m7541n8925Q0175K0359q8433K7231
$$ plain form
291 -34664 -69091 62326 28463 -85894 3875 70723 -51201 -54947 68014 11807 -78462
302 -78462 24631 64408 -54313 -31478 76145 1238 -65667 42130 53284 -58482 -14232
313 -14232 71937 -16324 -58568 47226 33465 -66174 -4368 60698 -34869 -51566 50347 15080
325 15080 -66770 10547 53947 -42107 -33986 59427 6058 -56912 30052 49168 -45956 -15484
337 -15484 63100 -8195 -50531 40525 33977 -55703 -5680 55703 -28292 -47720 44375 15338
349 15338 -61328 7445 49139 -39345 -33520 53498 4752 -55079 26449 45344 -44791 -15424
361 -15424 59533 -8026 -47906 39952 33967 -51290 -2483 56027 -24821 -43471 44766 15641
373 15641 -59552 6941 46502 -40735 -35208 49761 2220 -56705 23470 43829 -44604 -17373
385a7373P6628o5051m1912Q6993k330q6469M5453O2213p9284k3835R0045k3914
397B1164p9824O3337M6751q7917k790Q9285m2039o8204P6708L0176r1651J7052
409b7952Q4076n8052n3177Q6678J1161r0294L5650P3702p1823l7510R0273q745
421C3987q7275N0465N9626q2435k0341R0407k6249p7914O4292M5437q6682j394
433c8076Q8115m1672o5927P5671K8351q8407J6365Q0775n5731n2403Q2414J1669
445D1144q7343L2880P1291o8010l6480Q5830p187q2779M7512N7122p7658k0169
457d3847Q5885k4659p4374O1602M2645q1943p41Q2565l9222o0873P0514K6092
469D3644q1916J5655P3333n2467m5842P4855P670p7077L1369O1322o1068k9393
$$ plain form
385 -17373 59255 -5796 -47708 39285 36955 -49514 -4061 58152 -21132 -44967 45078 21164
397 21164 -58660 4677 51428 -36489 -39279 50006 7967 -60237 16471 46647 -45004 -27952
409 -27952 56124 -1928 -55105 31573 42734 -47560 -11910 61792 -10031 -47541 42732 33987
421 33987 -53288 -2823 56803 -25632 -45973 44434 18185 -59729 4563 50000 -36682 -38076
433 -38076 50039 8367 -57560 18111 46462 -41945 -25580 55195 -536 -52939 29475 41144
445 41144 -46199 -13319 57972 -10038 -46518 39312 32125 -50654 -3142 53980 -23678 -43847
457 -43847 42038 17379 -56995 4607 47252 -34691 -35432 47133 7911 -52962 17552 43644
469 43644 -38272 -22617 50716 -1751 -47593 27262 34932 -42145 -10776 50546 -10522 -39915
481c9915P5243q577p0254M2964M6472o6874j3614P1011k3570n9112N2014L1336
493C7124o6918L044O4901l5077m5173N8339J5607o4410J7581N4777m4954l1550
505c6709O0225Q03n9453K9869M4334n1203j6489O0201j3126n1693L9751L0601
517C7111n5785l134N4970k7382m3191M6949J6213n6693J1537M9025l6798k9324
529c6502N2404L452n1950K5684M0251m3914j4864N3440j0708m5892L5987K7861
541C5249m9023k535M9875k3856l9258M2274J4727n2684R756M4171l5863k8693
553c5860M8413K074n0535K4304L9296m2788j4545N4230r616m5482L7223K9601
565C6315m9807k368N2109k4408m0855M4130J6045n5472R843M7880l6868l1675
$$ plain form
481 -39915 35328 26751 -43503 -539 45933 -20941 -34555 36456 12886 -46226 5788 37124
493 37124 -29794 -26750 38151 3074 -42099 16240 31847 -32563 -14982 39795 -5159 -36709
505 -36709 23516 24319 -35134 -5265 39069 -12134 -28623 31578 18452 -33241 6510 37111
517 37111 -18674 -21808 33162 5780 -37411 9538 25751 -30942 -19405 29620 -7178 -36502
529 -36502 15902 19354 -32596 -6912 33339 -10575 -25439 28001 17293 -28599 7388 35249
541 35249 -13774 -16309 33566 9710 -29548 12726 27453 -25231 -15475 28696 -7167 -35860
553 -35860 12553 14627 -35908 -11604 27692 -15096 -29641 24589 14973 -30509 6714 36315
565 36315 -13492 -15860 36249 11841 -29014 15116 31161 -24311 -14468 33412 -3456 -35131
577c5131N1443L844n4691K2997M2876m4950k0100N6103p466n1301L5317L4941
589C3882n1350o733N6919k0116m5071M4271K3780n6079M627N2973l2348l8464
601c3709M9666J1211n7337J5529M7493m0311k8409N4167J101n4467K7161M1493
613C3588m6729j7020N6363j0149n0214L6112L3233n1971o378N5928k0864m4992
625c3093M3472K2965n5049L969N1981l0953l7968M8287J2024n5751J4455M7439
637C1778l8803k7950N2677K338n2352K4867M1499m3578j7870N3509p715m8408
649c0008L2190L1925m7967p888N0631j8349m2158L8321K1775m9738K574M7124
661B8432k6816l3662M2571J1593m7843J2349M1208l2502k3693M5002J606m4037
$$ plain form
577 -35131 16312 20156 -34535 -11538 31338 -13612 -33712 22391 14925 -36376 -1059 33882
589 33882 -17468 -24201 32718 12602 -32469 11802 35582 -20497 -15870 37103 4755 -33709
601 -33709 15957 27168 -30169 -14640 32853 -7458 -35867 18300 19401 -35066 -7905 33588
613 33588 -13141 -30161 26202 16053 -34161 1951 35184 -16787 -23165 32763 11899 -33093
625 -33093 10379 33344 -21705 -17736 34245 3292 -34676 13611 25635 -30116 -15661 31778
637 31778 -7025 -34975 17702 20040 -32312 -7445 34054 -9524 -27394 26115 18400 -30008
649 -30008 2182 34107 -13860 -21748 28883 10534 -31624 6697 28472 -21266 -18692 28432
661 28432 1616 -32046 10525 22118 -25725 -13376 27832 -4670 -28363 16639 18245 -25792
673b5792K1659L3911l7439j3557M4407q834l9306K7892K4327m0938m109M1020
685B3241j7997l2611L3293J4321m0435O214L6507k4650k3054L6576M948l7523
697b1170J5112L0140k9565j3581L6549m395l3118K1186K1920l2142n282L3952
709A9606j3086k7667K6175J2871l3545L782L0011j9856k0306K9793N114l1602
721a8710J2136K6048k4512j1985L1727l503k8724J9151J9140k8750m296L0700
733A8422j2216k4956K4192J1908l1701L586K8866j9515j9296K8955M217l1376
745a8914J2131K5577k4950j2242L2549l772k9900K0276K0382l0039m634L3145
757A9609j2078k6980K5700J3654l3432K744L1514j9947k2172L0370N844l4213
$$ plain form
673 -25792 -4133 29778 -7661 -21218 23189 14355 -24951 2941 27268 -13670 -17779 23241
685 23241 5244 -27367 5926 20247 -20188 -13974 22533 -2117 -25171 11405 16353 -21170
697 -21170 -6058 24082 -5483 -19064 17485 13090 -20028 1158 23078 -9064 -14346 19606
709 19606 6520 -21147 5028 17899 -15646 -11864 18147 -1709 -22015 7778 12892 -18710
721 -18710 -6574 19474 -5038 -17023 14704 11201 -17523 1628 20768 -7982 -12278 18422
733 18422 6206 -18750 5442 17350 -14351 -10765 18101 -1414 -20710 8245 12462 -18914
745 -18914 -6783 18794 -6156 -18398 14151 10379 -19521 755 21137 -8902 -13536 19609
757 19609 7531 -19449 6251 19905 -13527 -10783 20731 784 -21388 8982 14826 -19387
769a9387J0992K8635k5892j5722L4324j239l3398J8772K4725l0598q408L5858
781A8662q922l0607K4986J8576l4290j484L5170j6945k6954K9805J1090l6148
793a7061N944L2591k3069k1769L3788M261l6144J3721K9274k8013j4790L6161
805A4894k612l3752K0126K4751l1793q217L6531r931l1055K5246J8417l4725j550
818a3670L4171j6169k6963K8497J2045l5208N193L1674k1031k0741L1222N501
830A4521l3106J1755K7952k4739j5019L2557o32l1583J6713K3020k7828q965L1707
843A6353p120k8238K0735J6944k9550k786L0228j3120k3637K4542J0887k9777
855a4539M017K7745j7299j8475K6961N268k8479R891K3587k1200j2285K7266j842
$$ plain form
769 -19387 -8395 20240 -5652 -21374 12950 11711 -21687 -2915 21810 -8788 -17196 18662
781 18662 9740 -20867 4119 22695 -11595 -13079 22091 5146 -21808 7997 19087 -17061
793 -17061 -11117 21474 -1595 -23364 10424 14685 -21459 -7738 21536 -6477 -21267 14894
805 14894 12282 -21470 -1344 23407 -8386 -16603 19928 9997 -21058 4188 22605 -12120 -13670
818 -13670 20501 4332 -22631 5866 17911 -17297 -12104 19570 -1461 -22202 9020 14521
830 14521 -18585 -6830 21122 -3617 -18636 13921 13289 -18294 -1581 21439 -6389 -15354 16353
843 16353 9233 -19005 1730 18674 -10876 -13662 16566 3446 -20191 4351 15238 -14539
855 -14539 -10522 17223 -76 -18551 8410 13678 -14801 -4910 18677 -2523 -14808 12458 10616
868A0616k5747J4222J7828k3497o275K5974p421k2299J8256J2203k4552L96K3753
881A3457j2195j6963K0702O289k3248O172K0075j5893j1120K1737J81k0773J0787
894g92J5259j8473n559K0821n458j8299J4198J0078j9983k38J9197j0388j3982
907a3619J7316M796j9480N832J7051j4218q827J9258n92j8379J0722J3000j6998
920d138m160J9365o027j6103J4145Q616j9196J081J7836j1183j2823J7141L542
933H096j9478N980J6529j4726q955J9899r19j8848J1217J4193j7794m185K0805
946A1814n904j7492J5096R968k0749L47K0127j1162j5275J8254N287k1766M980
959f475J9156j5268j1524K1177P23k1661J0627J6684j8651p001K3114m192k0325
$$ plain form
868 10616 -15131 -909 16919 -6578 -12853 13121 5700 -16599 1657 13860 -10692 -10296 13457
881 13457 1262 -15701 5001 11290 -11958 -5786 14289 -1604 -12724 9013 9194 -11579 -792
894 -792 14467 -4006 -9565 11256 5798 -12501 1697 11775 -8208 -8446 10751 363 -13619
907 -13619 3697 8493 -10987 -5155 11896 -2322 -11149 8109 7517 -10862 -140 12860 -4138
920 -4138 -8298 11067 5040 -11063 3082 11698 -7498 -6417 11419 236 -12587 4554 8096
933 8096 -11382 -5402 11127 -3599 -12554 7345 6426 -12422 -1205 12988 -4806 -8991 11814
946 11814 5910 -11582 3514 13482 -7267 -6920 13207 2045 -13230 5024 10311 -11455 -6475
959 -6475 12681 -2587 -14111 7066 7789 -13872 -3245 13439 -5212 -12213 10901 6709 -13616
972a3616J4872J3774k1265l003K3367r247j8635J8170R135k3494J876K1844j3496
985B82j5778K1188M933k3864P237K0117j6944j1357K2770N63k2796J1031J7365
998A4747j9004p760K3277l685k1341J4435J3856k1144l258K2306p776j8652J6913
1011B914J0117k1996M75K1454j1597j5566J8989N760k1782N120J9228j4572j1727
1024a3183K0457J623k0946R055J6355j6600p819K0400k243j8972J1604J3191j8056
1037e134m001J9781o113j6571J3981R278j8782l1J8276r441j3244J5569N425j8317
1051i324M077J6261j1946r524J6568J491j6747P190J2718j3327n950J6167k597
1064E057j4596R667R175j4377j774J4930n860j1642J1768N502j4417K142J3197
$$ plain form
972 -13616 1256 15030 -6235 -9238 14129 4882 -13753 4417 13552 -9942 -8066 13778 282
985 282 -15496 5692 10625 -13239 -6002 14115 -2829 -14186 8584 9147 -13649 -2618 14747
998 14747 -4257 -12017 11260 7575 -13766 669 14525 -6619 -9877 12429 4653 -13999 2914
1011 2914 13031 -8965 -8490 12964 1367 -14199 4790 10550 -11232 -6112 13116 -1456 -13183
1024 -13183 7274 8897 -12049 -2994 13361 -3239 -11058 9342 7099 -11873 -269 12922 -5134
1037 -5134 -9135 10646 4533 -12038 1943 11221 -7561 -7592 10684 1243 -12001 3568 8993 -9324
1051 -9324 -5247 11014 -932 -10456 6112 7603 -9144 -1954 10764 -2563 -8513 7654 5057
1064 5057 -9539 128 9303 -5074 -6848 8082 2222 -9420 2348 7850 -6567 -4425 8772
1077H772q963q113J2735J698j3615N383J0414j0438n094J3126k115j1936Q359
1090B13P415j2125r28J2373n560r253J0218M265j2262K266J0935q192o379J1811
1104D797Q6j1674N964Q378j0158l580J2056l091j0539Q520O107j1898J30J1900
1118F998o194q383J0506L074j2126L547J0518r007o074J2115j47j2097O507R010
1132H247j1245l385J3342l431j1686R119P120j3375j70J3192o508j0110J1728
1145B838M066j3877L021J2506r174q172J3737J293j4159N924J1460j1765n643
1158g945J4669j683j3968Q687R698j3753k841J5165m910j2803J1283P133j4752
1171f020J98J4701p327j1265J3085M637j5604L357J3856j0128q675J4434J572
$$ plain form
1077 8772 -191 -8304 4431 6129 -7486 -2103 8311 -2127 -7221 5905 3790 -8146 213
1090 213 7628 -4497 -5425 6948 1388 -7865 2353 6618 -5644 -3378 7557 -635 -7014 4797
1104 4797 4883 -6791 -827 7551 -2607 -6187 5869 2778 -7761 759 6866 -5032 -4902 6998
1118 6998 804 -7579 2927 6001 -6125 -2578 7940 -1067 -7141 4974 4827 -7270 -763 8247
1132 8247 -2998 -6383 6959 3528 -8158 961 8081 -5294 -5464 7728 1220 -8890 2838
1145 2838 6904 -6973 -3952 8554 -620 -8792 4945 6238 -7921 -1997 9463 -2302 -7945
1158 -7945 6724 5041 -8927 -240 9458 -4295 -7136 8029 3119 -9684 1599 8732 -6020
1171 -6020 -5822 8879 1552 -9713 3372 8009 -7595 -4238 9618 -510 -9185 5249 6821
1184F821j5361O103J2040j2155o184J5220j366j4432Q597J0232j3630l102J4992
1197G775m107j2882J0542P973j4532m09J4484o986j0999J2062M790j4564K216
1210d637J2999q706q520J2840K136j3821M872J1190j0145n834J2998m86j2336
1223g450O677R139j1069l639J2893k890j1070Q194O624j1338j216J1799m942r145
1237g433R076M231j1270J550J0471o808o733R878J752j0555L592Q931q120m324
1251e762J0239p20r606N734O469q774j874R547k962p752O748M180r061L73Q480
1266E259n176n910Q013J428q620L030O787o341l403Q302q79p561N143N088p439
1281b279p45P808l208o099O458K701q018J420O801n263m386P467Q0p441L700N348
$$ plain form
1184 6821 -8540 -2437 9603 -2552 -8736 6484 5118 -9314 -717 9515 -4115 -7217 7775
1197 7775 3668 -9214 1328 9301 -5231 -5640 8844 1858 -9141 2921 7711 -6853 -4637
1210 -4637 8362 -344 -8864 3976 6112 -7709 -2837 8353 -1792 -7626 5372 4886 -7450
1223 -7450 -773 8366 -2703 -6342 6551 3661 -7409 785 7409 -3929 -5145 6654 1712 -7433
1237 -7433 1643 5874 -5396 -3846 6625 -183 -6916 2962 4714 -5841 -2249 6682 -1438 -5762
1251 -5762 4477 3757 -5849 -115 6354 -2420 -4294 5253 2291 -5461 1287 5467 -3594 -3221 5259
1266 5259 83 -5827 2186 3614 -5006 -1976 4811 -1530 -4933 3369 2490 -5071 72 5160 -2279
1281 -2279 -3024 4784 1576 -4523 1935 4636 -3382 -1962 4839 -424 -4810 2657 2737 -4704 -1004 4344
1297D344o232k422Q061k026o763N734M084p767K08P658m190n284O834J873p954
1312c842J991O975o074m137Q409k91q225M547N868p418k426Q997k289p714O313
1327F84M801q983j08Q991m238o830P731L261r649J786Q641o298n769R176J057
1342D253j0044L942P880p819m034R913r37r411N783O692r127k033J0236k911q622
1357f239P383N007r916j50J0094m661q016Q758L657j0598J608R587o579o513R441
1372B863J709j0476L443Q576p786m870J0413l75r951N417P405q833k577J0402
1386E360k091r211O751N950r686r10R978m207p944P674L865r822P06R056n251
1401B18o733Q527K189r592K634Q031o384m588Q810K44q378M171O712p151k865
$$ plain form
1297 4344 -1888 -4310 3751 1725 -5038 696 4780 -2987 -2779 4879 689 -4595 2239 4112 -3842
1312 -3842 -1851 5124 -950 -5087 3322 3031 -5194 -647 5221 -2197 -4623 4374 2085 -5629 684
1327 684 5485 -3498 -3606 5385 1147 -5683 2048 5309 -4340 -2554 6087 -211 -5980 3196 4253
1342 4253 -5791 -1849 6031 -1788 -5822 4091 3154 -6257 -474 6218 -2909 -4942 5294 2383 -6239
1357 -6239 1144 6151 -3765 -3915 6179 1518 -6498 2260 5917 -4681 -3073 6514 -65 -6578 2863
1372 2863 4572 -5904 -2461 6115 -1671 -6541 3872 3497 -6454 -1037 6368 -2465 -5042 5360
1386 5360 3269 -5942 809 6759 -2927 -3837 6141 1934 -6010 1664 5529 -4293 -3587 5469 218
1401 218 -6515 2012 4201 -5391 -2757 5274 -1110 -5698 3112 3356 -5022 -851 5861 -1290 -4155
1416d155Q799j426p598N096M829p521j203P727k867o550N729K949p421J88P116
1431C692m059m987O371J695o877K139N893m530l234O721J28o313L478M617n462
1446g28j601O381j720n353M001K847n865j93N556l243m261M722J056n286J564
1461b123M655l828k319N401m9m744L031L679m688n53M746j682l929L857K075n345
1477a816P31M474l275l127M877M8n285K457L556m176j664M995j157m581L825K803
1493B685n141K08N443k719l667N063J414n743J866M906m218l033N801l02n806
1508c243K871M196n528j627O121j642n502M340L280o211j57O382l102m761N622
1523A039K328o605J197O438m193l766O296J019o748K357N737n550l187O667m82
$$ plain form
1416 -4155 4644 3218 -4380 716 5545 -1976 -3179 4548 1681 -4869 860 3809 -3612 -3424 3692
1431 3692 -367 -5354 1017 2712 -4165 -2026 3867 -663 -3897 2824 2952 -3361 117 4734 -728
1446 -728 -2329 4052 2332 -3021 980 3827 -2038 -2231 3325 82 -4179 543 1599 -3687 -2123
1461 -2123 2532 -1296 -3615 1786 1737 -3007 24 3703 -985 -1538 3208 1526 -2403 1454 3529 -1816
1477 -1816 -1085 3389 114 -3013 1864 1912 -3373 -916 2640 -1536 -3200 1795 638 -3943 -118 2685
1493 2685 -2456 -2248 3195 476 -3191 1872 3286 -2457 -591 4315 97 -2936 2865 2563 -3243
1508 -3243 -372 3824 -1704 -3331 2790 1148 -4354 -14 3266 -2945 -3102 3280 178 -4583 1039
1523 1039 3367 -3238 -2041 4397 204 -3562 2734 3753 -2995 -638 5099 -451 -3638 3029 2547
1538B547o805L547M872o497j837P195j598o494N169L786o711m56P443l068n652
1553d559O207K627p357J051O858m339m690O685J341p423K201O053n293l791O934
1568B505J91p058L144N351n931k467P275j183o373M370M526o337j086P010k298
1583A639n682N115L118o448m1O341l330m916N561K158o768J295N788m128l634
1598c932N753P93o073K214M903m681k260N712m13n523L232L876m668j338N392
1613B987j377m504L634K452m881l20M747k456l504M040J337m873J035M237k979
1628d25k331M361K08m071J851L109l325j361M150q56l571K560K028l519k70L579
1644B117j700k683K976J092l419P58K848k284j895L355j95l164J874K261k988
$$ plain form
1538 2547 -4258 -711 4161 -2336 -4173 3022 1424 -5070 99 3885 -2826 -3282 4161 1093 -4559
1553 -4559 1648 4275 -3082 -2031 4827 488 -4202 2483 3824 -3599 -1398 4655 -638 -4429 2505
1568 2505 2696 -4362 -1218 4133 -1798 -4265 3010 1827 -4546 -176 4350 -1987 -3073 3937 1639
1583 1639 -4043 1072 4190 -2258 -2299 4042 712 -4204 1357 3515 -3253 -1958 3830 -298 -3932
1598 -3932 1821 2614 -3459 -1245 3658 -1023 -3283 2429 2016 -3507 -275 3601 -1067 -2405 2987
1613 2987 1610 -2894 740 3192 -1689 -2009 2738 282 -3222 818 2155 -2718 -1683 2554 -425
1628 -425 -2756 1605 1813 -2258 -407 2702 -623 -1984 2166 1310 -2261 299 2327 -1192 -1462 2117
1644 2117 417 -2266 710 1802 -1617 -859 1989 -295 -2190 1165 970 -2194 -320 1941 -1047
1659a047k78L281j451k417K597J452l487O03K958k227j768L188n5l373J800K438
1675B214k944r71L304o86l062K401J985l697k41L633j707k773L247J031l865J083
1691a048L464k841j953M001Q9l835J990L034l698j103M167r79m166L185K278m421
1707a836j99M418j981l482L760J609m569M26M637k876k976M424Q19m875J617M294
1723C210l743k246M895L7m920K403L862m390j694N269j079m697L272L009m835
1738a647p31N085j961m361L895K356n168M13N075k778l426M405J455m873P59M739
1754C237l351k908M969N65n163J944M136m050k153M897k77m765K375L560m344
1769a328j419M977j169m198L102K693m423l42M563j541l922L836J855m538N04
$$ plain form
1659 -1047 -1325 1956 505 -1912 685 2137 -1350 -747 2211 -16 -1784 1404 1349 -2024 -224 2214
1675 2214 -730 -1701 1603 917 -2145 256 2241 -1456 -1697 1936 229 -2544 703 1734 -2131 -1048
1691 -1048 2416 -425 -2378 1623 1712 -2123 -133 2901 -797 -1900 2267 1288 -2878 307 2585 -1836
1707 -1836 -2035 2383 402 -3080 680 2289 -2280 -1854 2783 -93 -3069 1355 2174 -2701 -1084 3210
1723 3210 -533 -2779 2116 2153 -2767 -364 3498 -892 -2586 2683 1604 -3093 179 3188 -1647
1738 -1647 -2378 2707 746 -3615 280 2636 -2532 -2119 2956 178 -3248 1157 2612 -2261 -1502 3237
1754 3237 -114 -3022 1947 2512 -2651 -707 3429 -621 -2774 2123 1846 -2919 -544 3016 -1328
1769 -1328 -2747 2230 1061 -3137 -35 2658 -1765 -2107 2456 915 -3007 829 2684 -1854 -1350
1784a350M163k488k908L788R53m113J161L650l016k106L809K20l987J909K733
1799B418k992j344L354m92l513K375J940l050k40L291j365k499K494J408l023
1814a238K97K743j726j625K684L35k874J138K160k231r11K494k56k506J624J392
1830A500k406k24K238j074j818J865Q31k199M84J969j530j081K233O3k004J309
1846A56J392j855k95J846o88j786J871N24k064K44J850j390j237K265j31k190
1862a488J184J692j940q02K464o24k181J900J100k558L60K558j431j720K221P86
1878A521k694O79K360j990j479K751Kk672J248K127k575p67L103p39k827K070
1894A18J816k974m76L132j237k707K731J224l213K27L424j862k415L034R98l491
$$ plain form
1784 -1350 2813 325 -2583 1205 2158 -1955 -794 2856 -160 -2266 1543 1763 -2224 -315 2418
1799 2418 -574 -1918 1436 944 -2569 -194 1746 -1304 -1544 1747 382 -2117 377 1785 -1238
1814 -1238 -941 1802 76 -1549 1135 1470 -1404 -266 1894 -337 -1248 1246 990 -1516 108 1500
1830 1500 -906 -1130 1108 34 -1784 81 912 -1287 -803 1166 -364 -1445 788 851 -1153 156
1846 156 1548 -307 -602 1244 556 -1230 641 1165 -899 -655 1195 -195 -1432 833 702 -1488
1862 -1488 -304 1388 -552 -1354 1110 486 -1695 205 1305 -1253 -893 1665 234 -1486 735 1521
1878 1521 -1173 -494 1866 -124 -1603 1148 1150 -1522 -274 1853 -722 -1489 1614 875 -1952 118
1894 118 1934 -1040 -1516 1616 379 -2328 403 1627 -1586 -1359 2065 203 -2212 822 1820 -1671
1910a671J064L108k546j771L202K63l444J375K831l005j550L804n80l448K094
1925b74K371l201q75L610r90l199K558J773l238j96L618j499k708L046J432l758
1941a530N23L460k056k460L385O09l680R79K951k537j847L284J90l533J561K695
1957A994k785j167L383n82k892J875K169k837o46L207q68k732K277J643k969j93
1973a123L093j427k287K517R56l010M63K523j748j741K560L71k772R50K072j914
1989e17r38K254p5k140J257J542k027m63K085m51j675J397J134k106J95J714q52
2006C34j366J614M03j904O58J203j233o67J459j57j448P87J108j514j87J428m17
2023A01r78J197M61j240J11J230p26q13J377o8j457Q36Q22j363j83J388n00r90
$$ plain form
1910 -1671 -607 2501 -45 -1816 1386 1649 -1795 -420 2411 -594 -2144 1660 1080 -2368 -274
1925 -274 2097 -1104 -1979 1631 641 -2558 0 1773 -1465 -1661 1957 458 -2250 796 2228 -1530
1941 -1530 -1007 2453 397 -2063 1322 1931 -1749 -770 2181 -356 -2203 1081 1271 -2262 -701 1994
1957 1994 -791 -1958 1425 843 -2049 -174 1995 -842 -1488 1719 851 -1881 396 2039 -930 -1123
1973 -1123 1970 543 -1744 773 1729 -1281 -818 1705 -43 -1784 776 1147 -1625 -675 1397 -517
1989 -517 -1455 799 724 -1416 -159 1383 -644 -1107 978 527 -1148 249 1383 -723 -528 1186 334
2006 334 -1032 582 985 -919 -261 942 -291 -958 501 344 -1104 -317 791 -723 -910 518 101
2023 101 -877 320 781 -459 -348 882 156 -657 720 652 -805 31 853 -510 -693 695 195 -795
2041g95J079N67j405J54J266r75p64J369K75j666O88J320j504m91J548l11j433
2058a078J177R55j897K56J739j105j338J754L36j828N04J744j304j165J955K83
2074I88k044Q61J657j765p91K138m10k079J429J427k086m81K244p58j689J561
2090B02R34k423K08K439j305j668K261O71k521Q40J879j548j349K313M02k479
2106a144O41K221j982j135K557l83k303J048J996k288q77K774n41k378J590J643
2122A439k497j09K585p38k183K149J071k487j7K368j108j980K243N07k466L26
2138h97K327j505j472K194L74k426Q60K029j825j107K438k44k217J060J602j815
2154f24n73K353l56k013J383J164j859k69K119q77j441J329O66j796J42J700r95
$$ plain form
2041 -795 284 851 -554 -400 866 -109 -873 496 771 -895 -207 1113 -391 -882 666 355 -1078
2058 -1078 99 1054 -843 -587 1152 47 -1291 463 799 -1029 -525 1219 -85 -1250 705 988
2074 988 -1056 -195 1462 -303 -1094 1044 634 -1445 -16 1411 -675 -1156 1088 330 -1359 202
2090 202 1136 -1287 -1079 1360 55 -1613 648 1319 -1202 -362 1517 -31 -1380 933 1335 -1144
2106 -1144 -503 1718 -264 -1399 1158 775 -1528 -480 1516 -772 -1649 1125 584 -1794 -204 1439
2122 1439 -1058 -1167 1418 680 -1503 646 1717 -770 -787 1581 473 -1507 736 1243 -1223 -897
2138 -897 1430 -75 -1547 647 1021 -1405 -545 1484 -341 -1448 990 746 -1471 -411 1191 -624
2154 -624 -1197 1156 800 -1213 170 1334 -525 -794 1325 448 -993 336 1002 -794 -652 1048 53
2171E3j148J454M16j689M35J532j232q31J595j97j539Q58J272j307k90J271j11
2188E42j252R00P67j148j70J188m04j109R64K39r83K31P32p27m28R94k13p52N47
2207h2P70r67j59J078m98o72Q84J15j006L29P44m99m60R01j99n89K62P42q86j43
2227c35Q71n72n55O67K12r68L52R00p49m89J073j73q54M98O42q82l02J211l32
2246B15r67P47P90j351K26J064p07p57J267K85j528N93J092j054p63J460n7j507
2264i52N92J208j133q81J721n6j712J153R88j513j53J646m29j523J208Q58j640
2281f18PJ749q85j312J434N94j868N10J439j037j016J620L57k087P95J384j246
2298a80r83J826P3j902R01J351j396o97J672lj836J296J069j547m79J714m45j490
$$ plain form
2171 53 -1095 359 775 -914 -479 1053 -179 -1010 585 388 -1151 -293 979 -328 -618 653 542
2188 542 -710 190 957 -191 -361 827 423 -686 278 517 -466 -235 497 -230 -658 336 123 -629 -82
2207 -82 688 -279 -438 640 142 -530 354 469 -537 -208 536 37 -423 478 279 -310 -48 694 -192 -335
2227 -335 536 -36 -591 76 288 -680 -328 572 -177 -666 407 234 -620 -122 520 -362 -664 547 215
2246 215 -752 -5 785 -566 -340 724 17 -740 527 812 -716 -123 969 -85 -848 612 555 -952
2264 -952 -360 848 -285 -1166 555 499 -1213 -60 928 -585 -738 908 479 -1044 164 1022 -618
2281 -618 -611 1138 253 -1059 375 969 -899 -389 1050 13 -1003 617 974 -1113 -318 1066 -180
2298 -180 -1163 663 736 -1166 -265 1086 -310 -1007 665 662 -1174 122 1191 -356 -835 879 434 -1056
2316a056J330Q04j558j39J649p15j474J612M60j823L64J489r45r43J324K55j556
2333i22M01J506j076p57J461J08j559O67J167j209n13J385j30j483R06Q71j203
2350c80m12J517k52j374J018N42j137r7J260o48p50R26L23j169L18Q41m27p53
2368f54J011R8r06L25Q02q64m14J057j39q76N10M64n75k13Q23j98o72O23L30q01
2388b69L33L88l89m22M46j2l59J86M84n08j88M27p8n54M85K80n40K26M44l18k41
2409a79M24M9o25M93L16m56j84P14k66m44M28J08p27K54N69o59k08O07j11o65
2429e62L28O77q08j05Q29j26p51M43O35q89j04J047m81o64P86K69q55K04Q62p25
2449A0o26J202o6j022K91P93r18m08J021R8j192P24O99j176k61J352k80j008P55
$$ plain form
2316 -1056 274 1078 -480 -619 1030 315 -1159 453 913 -910 -546 943 -2 -945 379 634 -922
2333 -922 -521 985 -91 -848 613 721 -838 -171 996 -213 -726 659 529 -954 -48 823 -380
2350 -380 -792 725 473 -901 117 659 -478 -575 685 37 -713 213 536 -633 -315 526 99 -654
2368 -654 357 455 -451 -126 676 -188 -602 455 316 -560 -50 414 -161 -374 449 251 -421 202 532 -269
2388 -269 64 452 63 -359 87 75 -284 -98 386 -122 -310 117 39 -515 -30 250 -290 -64 380 62 -179
2409 -179 245 294 -331 162 478 22 -162 552 286 -158 270 378 -349 -95 474 -185 -393 214 103 -562
2429 -562 -234 443 -365 -470 359 233 -518 -75 560 -329 -433 614 133 -531 255 524 -331 -127 735 10
2449 10 -616 586 520 -502 -211 582 -336 -744 277 375 -817 -93 606 -570 -831 521 241 -767 -12
2468a2O46r03k39J354m77j020J064M36j096P8R88p75q00J095M57j454L72R96r89
2487b79o70J341p7j273O04R99q69o90J442j14j091P06R84j108m48J250k84j045
2505f22R14O56j218k46J174n06q81P91M69j068M0J078n91q87R70L27r65K76R85
2524F96p01p72J188J77r37L09P06p30m69J054j10q59N87M75o89l34Q67k45r10
2543f97O73N32r83m7Q57m63m41M46L88n66p3N26k53l38P36J08o17J07M95k94l06
2564b10N14m0l60j49O35m96j47L90J2n00L47K86o01L37J53k96n1J49J28k82M1
2585a40M92m60J9L27k22q7J86J31l04j09L35j94o4J82N2m74M14J43k75p5M12l38
2607d9j47Q7K32m05L5L79k92j79N36q7n38N13K71m42q0O54j43o26N91K20p42K5
$$ plain form
2468 -12 634 -269 -508 846 369 -651 413 849 -247 -169 819 44 -756 339 796 -658 -286 710 -279
2487 -279 -949 392 315 -958 -354 645 -224 -914 528 414 -677 29 1013 -95 -543 707 423 -622
2505 -622 292 948 -270 -516 658 152 -729 62 531 -537 -497 581 -10 -897 73 400 -565 -289 696
2524 696 -5 -777 411 588 -349 -40 666 -64 -533 521 411 -448 139 614 -75 -409 458 213 -697
2543 -697 -24 508 -475 -522 335 -128 -569 -123 265 -301 -374 152 -101 -439 297 405 -212 -105 390 96 -210
2564 -210 304 264 -96 -245 390 -106 -253 137 149 -351 -4 282 -319 18 171 -125 -176 -27 101 -181 -140
2585 -140 352 -108 -89 238 16 -71 115 246 -58 -167 168 -26 -90 92 144 -330 84 227 -48 -123 289 -49
2607 -49 -196 -109 123 -282 -247 132 -160 -339 197 110 -428 85 356 -86 -166 488 345 -281 310 530 -212 -187
2629a87O62m03m06L29J86m96J02P30n48m15P73kp19K38N19o13k80R16k61o37M57
2650e5O49q37l15J090l29r18Q39N19q77k15J022m08q00Q58M07j101K43P46k32
2669B86q01O75K37q23k2R41o41n48R54K46j059J47R77p01l97Q03J32r29O72N15
2689F64p97l71J078l16n28L40M10q05n0P99k36p72O27L88j014J50Q35k80o02O38
2709A58J54p62J58P83m54n96P60J61p06L54N11l76o29P66k5p02L21N39m88j47
2729b20N79r9n57P1M90m89j23N77p8o18M79J41m42J96K91k12l88N56m0j72J64
2750A06L30m31k6J81p4r0P0J60m64J05K28M7m02L35nj07j41J27L9r7J17K4k27
2773a95Q2K60k95O3K84k34L0k4L0q8K3J44q7O3J86n0l51J73K56l02j15M71l44
$$ plain form
2629 -187 475 72 -334 -5 181 -315 -213 517 -31 -446 327 325 -394 -156 363 -250 -530 386 125 -512 -55
2650 -55 594 -243 -558 532 203 -715 124 643 -234 -449 573 165 -635 223 630 -471 -228 518 286
2669 286 -515 160 397 -426 -448 493 -148 -696 258 504 -555 -408 569 -132 -529 274 406 -523 149 664
2689 664 -133 -504 574 258 -270 70 480 -325 -375 424 188 -584 43 431 -583 -433 402 122 -480 158
2709 158 312 -450 -292 491 37 -559 201 362 -344 10 521 145 -484 282 257 -445 -124 415 -73 -220
2729 -220 359 260 -297 -226 264 -225 -348 229 151 -467 12 153 -289 -93 198 -14 -402 154 114 -58 106
2750 106 436 5 -21 160 86 -4 66 226 -238 -133 95 142 -260 75 70 -37 -178 -51 -12 -109 8 32 -195
2773 -195 -113 147 -148 -85 199 -35 -5 -29 1 -87 -64 80 -7 56 242 192 -159 14 270 -32 -147 324 -20
2796b0j32J07R6l28J3L78k16r5L27j47k97K66L83m71lL79k61l37M36K13m32l6
2818a77N75k83n15N70J4n34J58M95k47l33M60J78o13K3M61m31k36O21j17n26L68
2839h9O48o41k36N09K03o68N26L14p77o4N91j08n42M67K75n73j86N23Qn96N40
2860A24M2n37O6Q16n28n22P62Q7p33K63P54o28l85P58Ro71M90M17n63k07N43n4
2882C03o97M40N23p38j86O31j79o32N96O1n31K9O86k37n99N17J93n00L4O80m10
2903a6l70O28J25n99O6N39l44k95N07J97o04K43K93n42j69K17K85l96Q3L11k15
2924e6j97M19j06m50K51K10j95J38J68j62q5O9J14k84J18K35r0k34N22j45k74
2945c4Q1J51j74j42K02n9j88R5J18j69K9J4j27l5K03j2j74K35lj88P6K68j7j81
$$ plain form
2796 -20 -152 -45 51 -277 -264 114 -102 -197 130 -17 -314 -48 335 -136 -139 240 -21 -358 78 291 -141 -177
2818 -177 398 115 -400 170 184 -350 -192 303 56 -277 183 361 -252 -229 232 -199 -435 186 69 -457 -89
2839 -89 559 -82 -318 191 394 -274 252 566 -211 -275 316 208 -334 133 408 -165 -351 172 180 -416 124
2860 124 166 -371 -305 511 -17 -539 223 310 -423 -160 594 -34 -419 339 348 -323 167 584 21 -186 357 303
2882 303 -394 46 569 -169 -355 276 97 -535 61 122 -409 -380 306 69 -530 -13 180 -320 -286 394 -16
2903 -16 -386 242 367 -232 -166 373 29 -266 241 438 -166 77 370 -172 -341 -124 161 -235 -152 159 -56
2924 -56 -253 166 60 -390 -139 71 -124 14 182 20 -65 4 118 -166 -48 187 97 -137 385 240 -34
2945 -34 47 198 24 -118 84 25 -163 -68 50 -119 -90 -76 -203 -238 -35 -47 -221 14 11 -177 -101 167 150 -31
2969c1K60L7k76j9J60j82%K36j67j61K03k5j21j38L50k19q2R2J80k68K00J65k04
2992a0r4L54j19k96J19M83l89j00L53m4l92K24K10m10J37K74k57m65N19p4m04
3013c81l2O63k93m15M87J53m60K20M01n26j75L70K42m32K93L10m02k99N08j2m67
3034b47J27M64m66j81N19j11m58K08M84o97m2O06m1o63N67K20m82m5N54j42m28
3055b54L62P3m77P3N74l62l77N89q6m06M1N25k16m41P01p6n15K94M27m47j79M74
3077B97j39n46L41M04m30j02K94Q5n30K31L58l75j60O00k22l95J72L36m73j8M45
3098A73p7l39L64j17k05k2N15k85j57L25J59m78O9K96k37p0J56L4l13J71O9R6
3120A27k52K27j46j5K04j34K3pJ37o5j17J51J03l24K65j4k04J83j06R4j98k5J43
$$ plain form
2969 -31 229 266 -10 -29 131 -51 -51 185 18 -143 60 35 -86 -224 126 -93 -175 -83 97 -171 29 194 -10
2992 -10 -104 250 131 -165 -46 437 48 -52 301 257 -135 89 299 -111 26 300 43 -422 97 23 -381
3013 -381 -413 250 -43 -458 29 182 -278 -58 343 -183 -358 12 254 -178 115 425 23 -276 232 220 -247
3034 -247 -120 344 -122 -303 216 105 -353 -145 339 -358 -400 206 165 -498 69 289 -193 -238 316 174 -254
3055 -254 108 181 -296 -223 351 -11 -388 201 115 -291 -250 275 59 -382 319 243 -272 22 449 2 -177 297
3077 297 158 -388 -47 357 -73 -175 119 204 -326 -95 263 -112 -272 328 106 -289 -117 219 -254 -272 173
3098 173 96 -243 121 4 -201 -223 292 7 -150 175 334 -144 -75 221 -16 -86 70 104 -209 -38 31 127
3120 127 -125 102 -44 -59 145 11 34 27 164 99 -18 133 236 -88 177 163 -41 142 36 130 -68 -93 50
3143E0k26QK2N5j02J65j2j20O9J31k8k80K56J7J2J00nj65K21Mn0l1Q6j07k16J64
3169A8J88l12J67J32j62m25K72K66k51J14J50k17l5K11k16j60L32J82l31o2M46
3190C07n4m04J87J9m8j61M16k02k58J41K62m08j3M65k83j65K31J66m00R9L44l17
3212g6j90M23K3k85N8L11j68k72M76n8k53p1M35l56p2J82om74K18L45l59m9K03
3235a5N3k55J67J52j66j10L93q2l60N13m1k92j98M82on46M43J36m72QN21l04k01
3258a80L65R1m90L0L95k62r9J34J9l61L01K29k81QK44Q9l94K9M81m32J1L17j58
3281H6l06K04L38l04k30K05J74k97J50K00l33NJ65j82J71o5M1j41m7K70j89j19
3303b04K78k8j99J56J32k11o4K43k0j18L8K06k64nK50N2l01J88K1j44O2J04q4
$$ plain form
3143 50 -176 -168 -146 -91 -193 -28 -40 -160 -91 40 12 -268 -12 5 17 117 112 -53 168 172 122 91 177 70 -146 18
3169 18 206 -106 61 193 31 -394 -122 144 -107 7 157 -60 -95 116 -100 -260 72 254 -77 -139 307
3190 307 253 -151 36 55 7 -154 262 60 -198 -57 205 -203 -216 249 -34 -199 32 198 -202 -103 241 -76
3212 -76 -266 157 180 -105 -47 264 96 -176 300 242 -11 -82 353 -3 -75 107 101 -373 -155 190 -169 -218 -15
3235 -15 38 -217 -50 102 -64 -174 219 137 -223 290 249 -43 -241 241 235 -311 132 268 -204 -196 325 21 -180
3258 -180 185 276 -214 -184 211 -51 -150 -16 3 -358 -57 172 -109 -101 143 232 -162 -133 348 -84 -73 244 86
3281 86 -220 -16 322 18 -212 -7 167 -130 20 220 -113 -108 57 -125 46 -19 22 -119 -166 104 -85 -204
3303 -204 74 46 -153 3 135 -76 -140 103 83 -35 3 209 -55 -60 190 242 -59 129 150 6 68 172 88
3326H8j40J87k50j5J42q3q1l4K9K13N2m1l8k31J52K18j32j03J88j19J73j6j04
3349E5j88J59Q5j2j73K11j40o8p7J58qk13L26j93J5J9K32l23J03K18j44j53K38
3372A27n4j35J04J66k02k8J68m8j77K11M5j92j34L51k40l23K28K90k09l0K36n6
3394I8l13L55j52j80N5K46p2j88K80J75n07J64J11o2k11L82j5l05l7L93k11k04
3416a98L71J4l06J3K56k61j0K01j7k67K53K50k19q3R2m4j82J34K95m67Q5L67j68
3439A09l90K63K86m34L3M18l81M2J27K74m80j73M06q3k38L18l0k67O0K57j57j39
3461a79L06p8p2l6K31j91j04K42Pj26N5L5j73j2K53r3k71L05P5k06j52K25r1o9
3485a19j3K13l05J97J88k48l7J23k5j34M8R0K9j22J80qj06J23Pq1n4M3J27k29
$$ plain form
3326 88 -52 135 -115 -130 12 -71 -152 -186 -157 56 108 67 29 -202 -50 168 36 -67 121 2 175 159 55
3349 55 -133 26 111 99 -74 137 -3 -71 -148 10 2 -211 115 -78 -63 -44 188 -135 -32 186 42 -111 127
3372 127 73 -62 42 208 6 -22 146 98 -79 132 177 -15 -149 202 -38 -361 -133 157 -52 -82 154 98
3394 98 -215 140 -12 -192 -137 109 37 -151 129 304 -203 -39 72 10 -201 181 166 -139 -176 217 6 -198
3416 -198 173 187 -119 -106 150 -111 -121 80 63 -204 49 299 80 -3 89 45 -137 -3 292 -175 -90 277 109
3439 109 -281 -18 268 -166 -133 285 -96 -54 73 347 -133 -306 100 17 -221 97 67 -200 -140 117 -40 -179
3461 -179 127 49 -23 -59 172 -19 -123 119 126 0 55 90 -83 -95 158 65 -206 99 174 -32 -184 41 -50 -119
3485 -119 -132 81 -224 -27 161 -87 -124 -1 -26 -160 -112 -22 7 -115 65 57 -49 74 81 0 -54 -11 116 -113
3509a13J71L7k5j70J07j7j29J0j0K31k25J32o3r2L23l16J55J11j75l3R3Q2j71
3532h7j0J83j30n7J77M7j98K82k24l%J89j06k7l0Q1k06J43J18r0j57P9N4j09r3
3557a74K87j65R2p3P5Om5K14j72K4R2o7j93P2K42k46M8J35N2k46L9J46k05J48
3581H6Mk1l00L0K46j13K5K45q2k41J27K31k75j14K79J2l69L66Lk55J42J96j21
3604A01k31J73p5k71K05J88j41j41L02m1l24J63J10j49N7L29j74j76J9J48j36
3625f4P0KJ30k12J93K5n2j60J43n0j35J38J34k37j50J87L0j52K73k4k46N3J54
3648E0o8k78K84K06j45j41L29k87j26K62O1k17L4J95k61M9K11j43j19J84r4k5
3670c9m5L9K8n6k2J17k3j91P4J66J24k55n2J2j6J41J91j44K76k50Q9l8j87j01
$$ plain form
3509 -113 58 95 70 -100 7 -10 -139 -129 -139 92 -133 -1 -64 -156 167 -149 6 117 -58 -91 2 84 -87
3532 -87 -97 86 -44 -101 76 123 -75 207 -17 -20 -20 169 63 36 6 87 -119 24 142 52 -105 -26 28 -81 -174
3557 -174 113 -52 40 -33 42 48 3 217 45 69 161 94 -99 -27 215 -31 17 152 204 -42 -3 143 -62 86
3581 86 90 69 -231 -201 45 -68 -43 202 120 -121 6 237 -38 -152 127 139 -230 136 139 -116 26 222 101
3604 101 -130 43 -32 -303 -98 90 -51 -192 110 69 -255 -92 18 -131 -74 255 81 -95 -76 72 -64
3625 -64 6 8 138 -74 119 144 92 -68 75 25 -110 28 162 -75 -225 -38 -8 -160 113 89 -157 -104 50
3648 50 -18 -296 -12 194 49 -92 237 -50 -176 86 147 -70 -36 159 -102 -53 158 15 -104 80 -14 -39
3670 -39 -84 -45 -17 -73 -95 22 -1 -192 -118 48 172 -83 -135 -123 -139 2 193 49 325 75 164 126 -61 -162
3694a62J24P4Jj03j9j4L19l95K27j30JJ54j80%J6J23O3L5o8R1J5j21R6o1L1j36
3720a9r6J09M7q4N7q2J58j12O0m3K1J5J6O6k14K9J27j67N0O6O0j70K5K32k09P2
3746A4J39o7qJ36j43n7j1j4j34J5K77j8j64J83p4j86p0K36R1j96J08Q5k64Q5J34
3771I7m4k04K13J0j51r6M40j78k17K11ok25J45J19j69K0R3M9j99J02L6L5k11J01
3795b9J87l20R7J60M1l58J13K87l00lL17j65k00L01k8j70R1J40k26L1K02k02J9
3818a5M6N0j05j1J38k7j59J59j98K5j75K09J70j94nJ50j46j9J20J40m48L73m5
3841C3Q2q0k7N1l5r2k3M9K01j24J9o9P9q9j84J08J57Pk53K40J8m8q6L3m1j90K54
3868a0K5n5Q7J83k84k1L1K9l2J21J36n4N8j64k3o5J07j4m0j32N1J32J5j99J03
$$ plain form
3694 -162 -38 36 37 -66 -85 -99 220 -175 52 -78 -77 77 -103 -103 -87 36 99 134 66 157 172 51 147 86 117 -19
3720 -19 -115 -6 41 -43 14 -68 90 -22 38 -5 16 31 47 113 -101 -72 55 -112 -62 4 64 -106 -81 151 -58 14
3746 14 153 86 78 214 71 14 3 -11 -145 -130 147 129 -35 148 74 -112 -182 54 145 -51 57 142 -122 -37 97
3771 97 53 -151 62 72 -79 -175 265 87 -130 81 75 -150 -5 114 -55 -35 58 107 -92 10 46 81 -130 -29
3795 -29 158 -162 -65 95 136 -222 -109 178 -122 -125 192 27 -173 128 100 -70 21 161 -65 -34 168 -34 -15
3818 -15 31 81 -24 -35 103 76 -83 76 -122 -97 -272 -63 107 -87 -92 58 -88 -107 13 153 -295 78 33
3841 33 115 35 8 59 24 -68 -91 -42 159 35 54 -15 64 -25 -209 -101 56 63 -190 50 68 20 -66 -33 -74 -264 -10
3868 -10 15 -40 47 230 -54 -75 -44 -15 -47 74 210 156 214 50 27 -38 69 55 15 -117 -66 66 81 -118 -15
3893a5J10j59J30j74LM8j31R9L5P9n3j1JK2K4P5j62J63n2q4K3O8L1j61L3J36j25
3920d7Q5n2j5j16KK29o6p8o0M5N3K5J06l9j60R9J3Jr7K4J5jj7Q6N6q6M6j20r0
3949a59J81m4j04K20l0MO4k1n6k38K69k7j49K3J66j46J42J9o0j10M5K50k93j11
3973a65L19j2k87J18j07L6j11L13k34m6J97kn8j94L78k64N2N1K04k63M2K59j71
3996E5j37R8J89k35OJ05m4l9J93k30L2L7N2j06o6R7L0p6MM4Q7k49K36k7pk11O5
4023i7J66j43J09j14J0K42j25K8l23K20L0p9K13j74J59j5m7r7o0K20j1j22mj4
4047b8mo7K2J35j26r4K12L0j83N0Q6j44J12j2M4N6k34P5N4Nj08J68rQm0k4j2J05
4075G7P8j96Q2r5j3K0l3n2J39J0k1q7O6J17j79qJ25r0K36J2j70P9j15j22PJ40
$$ plain form
3893 -15 95 -64 66 -108 -105 -57 -188 -89 -54 25 -28 -39 -38 -16 8 83 -79 84 32 -52 -29 39 70 -91 -58 78 -47
3920 -47 38 -14 -29 -145 -143 86 20 -58 -118 -73 -20 5 111 72 -88 11 24 25 -72 -48 -33 -34 -51 35 91 5 51 -69 -159
3949 -159 22 -22 -126 94 64 68 132 111 55 -183 86 59 -90 -67 99 -47 95 114 54 -56 -11 239 -54 -165
3973 -165 154 142 -145 -27 -134 -98 -209 104 -130 -176 21 19 -39 -233 145 -119 -67 -16 188 -75 -33 226 55
3996 55 -82 16 205 -30 -24 81 37 -2 191 -39 -7 30 82 -24 -90 7 37 -39 -35 9 96 -153 83 56 49 -162 -97
4023 -97 69 -74 35 -79 -69 173 48 76 -247 -27 3 -76 137 -37 122 107 60 -37 -97 123 112 -10 -14 -28
4047 -28 -32 -99 -77 58 -68 -162 50 80 -103 -53 33 -111 1 -11 33 89 -145 -70 -16 -11 -119 49 40 48 8 -16 -28 77
4075 77 155 -41 41 -54 -67 -47 -80 -132 7 17 -4 -91 -25 92 -87 -95 30 -60 176 188 18 97 -18 -140 -133 7
4101GJ51k83J06j4J43j19M6j8m6MR0k54K81j35P0j69P6J07q1oJ34J30k33N1j9
4126A9j6nK15k06mlNL1J9j04mn5M0jP0m0J94l31Q1K71k64J9P3R2k72J85nn6J7
4155c5R6K21k37p2R4j37O9M8J7p3N9Ro7kQ2j81Q3J04L3r5p0J82n4m5q4K32r2j79
4183i4K12p8j78J68P6j70J9J04O1k32J19J3j30J03k3k7j9J36k40QJ26J63r8j50
4207a31M0j6K25j97O3J27l13J76j89J54K10P6n3k79J03Q6kq3N9l0n1k4J24j41
4231f6J1K2M3J08j43m5R9LR9k23M6l9mR4J9K4P9j13O8j10K6j0J37j97J54j5q7
4258b0PK11j18j94J05N0Lj3P1K5j63K6q1O5l5R9l1l5J6Rj7n5j3k9J67K2j37%M0
4287b5q2K7J9J27j34O7j12kL77l57J22j87K21p4K5n1J99l9k13O3O3J49k19M2j10
$$ plain form
4101 7 158 -125 -19 -33 110 -9 37 19 -27 -23 67 -187 94 -41 29 -140 -64 43 -38 -44 90 220 -13 38 19
4126 19 3 -2 213 7 3 0 5 36 55 -49 -53 -108 -68 -69 1 -39 155 -176 -95 176 -88 -69 4 96 -176 9 4 -52 -35
4155 -35 61 282 45 -27 67 -70 -1 47 64 -9 50 59 -8 -10 72 -109 -26 78 111 16 -54 128 74 29 -55 177 85 -94
4183 -94 118 40 -138 30 106 -64 -45 59 120 -112 7 20 -110 -7 -30 -57 -76 60 -180 -172 -46 117 19 -131
4207 -131 -91 -107 118 -79 -16 111 -202 -26 -215 -61 149 225 172 -107 -4 82 80 -3 56 26 -25 -49 75 -66
4231 -66 -55 -33 10 118 -25 -70 29 32 131 -92 -46 -85 -89 5 24 48 127 14 82 -28 -2 -12 125 -72 82 67 -20
4258 -20 -13 198 80 -114 -9 41 44 31 102 127 -36 -10 -91 -26 -61 38 7 -28 -12 -3 -20 -75 -88 -117 50 72 -65 -65 -25
4287 -25 -107 -80 -61 66 -68 -1 -113 -115 262 -95 27 -160 61 -13 12 -39 160 121 -92 -29 34 183 -36 6 -104
4312a04M1O9R5j15J16j02P5j14J17j51j33O8N8J36k67J28P1Q0N2q1q2jK07j53
4336A0r7oK00l6r2J65j9j46J33j19J0lJ17k47J15p1K55q2j42N9J16l17J02J47
4360E2n2J08l27O9J49l2p2N9JJ45L8k90K95o5r3O7K8j36N0p0Qq6L9J68j57P3o8
4387i9J37q0L4J49j73O0j3K7j92J44N9k06J83o6k5j52K85j15j6J53j21M5m8K27
4411A97k53l2Q8j36M8rJ25p1o4K86k14%j48K31p6j51L05n9J6j12O1j22J1Q3jj39
4437a36J98M3Q7j82N0j7o6O5K7j32K1N4p0m4J13kJ3p3N4K7m7rN9p6J74p0r0K21
4465A92j71p2O5j85J63O1l9J26n1o7l7L9k9P4m2j4P3j68L9N4J4l6j60K05Pj56
4491a15R6m7NK9m9P2R2j98L3J87Ok25J14L0Q5p4k17K14k9L6j1q8Qj26J86J23j06
$$ plain form
4312 -104 -63 6 101 -14 102 0 75 -39 78 -73 -206 -138 -80 56 -211 -83 -12 68 120 39 -43 -44 163 10
4336 10 -87 -93 107 71 -21 144 125 -21 112 -7 3 0 117 -130 -15 -86 169 87 -55 4 120 -197 -95 52
4360 52 0 108 -219 -150 -1 -33 -105 -46 -45 100 138 -152 143 78 -15 52 80 -56 -6 -76 -68 -154 -115 53 -104 -31 -99
4387 -99 38 -42 -8 141 -32 28 15 42 -150 -6 53 -153 30 -36 -61 -213 72 -43 -59 94 -27 18 -30 197
4411 197 -56 -88 0 -136 -88 -97 28 -43 -107 179 -35 -35 -183 48 -28 -179 126 67 83 -29 32 -90 -79 4 3 -136
4437 -136 62 105 192 10 60 43 -23 42 69 -63 -42 12 -58 -102 11 9 22 -51 3 30 -17 -26 33 -43 131 61 -29 192
4465 192 21 -51 14 -171 -8 53 14 140 89 22 -15 24 -5 69 27 13 86 -82 -43 11 25 -11 -171 34 41 -115
4491 -115 -19 -66 -61 -32 -81 -9 83 -115 -82 105 111 -114 0 30 115 41 -176 38 9 45 34 -54 -46 -172 14 137 31
4518C1j34N4K02j50O4r7m8o4J16K2n4J02j02J64k77K35Kj72Q2M8n0P0l3J51k57
4543i5J5K40j25l7j48J92j29m8J91j46M5j0L3j60O9J72j78jR1Q0n2n2Q1j43J6
4568i9K88k11j27P2L3k2RM8J33j66j6P7m2O5n5k2p1J55j06R9j17J65r1K6J59m1
4594A43n7o4N5k56L21j25j03M%K05r5q3J98j42j93K22j76O5J44rj16M3k8K15j44
4619B4P2n0k2m5J58k8m1p2J04K7k25l5K60k4l75L08NM5k09P9L3n9o7J9R3k6j02
4646a53J12k0J33j12J31k54J78J7j35N4J11j62J12j6K1j08n7K35o2m6p3P8J04
4669H8k7l6k7K5m6L1M0M4j06M5l6k52L59j96Q7M0j0L1j70J33j4L1m7K7m2J4O9
4696E5m6k8j14J62k8K8L3j03k3o9J56j6J9l5Mj37J25J17p3Q6j21j35J16K7J28
$$ plain form
4518 31 -103 -49 153 3 67 -30 -78 -142 -26 -4 -58 44 -58 106 -171 64 66 -106 -24 24 -26 44 11 162 -95
4543 -95 -80 160 35 -2 -150 42 -87 -135 56 -90 -45 -55 -22 -182 -113 59 -119 -120 -29 51 -1 -53 28 -115 -99
4568 -99 189 -22 -149 -77 -44 -66 -57 -9 124 -42 -58 19 -23 42 -13 -35 -106 49 -57 42 -75 90 -1 25 184 143
4594 143 86 22 77 -179 142 17 -86 -82 -82 123 28 -55 143 1 -192 30 -146 -81 63 54 -62 -19 -47 168 24
4619 24 96 46 24 -21 137 109 68 -4 100 127 -98 -133 127 103 -272 36 41 86 -123 -44 -11 -70 -137 -118 -25 -51 -153
4646 -153 -41 -61 72 -40 91 -163 15 32 -103 -49 62 -100 12 -4 17 -91 -148 87 25 -21 -94 -16 88
4669 88 61 25 -2 23 -23 8 48 92 -14 31 -5 -257 102 -94 -7 33 23 54 -116 17 3 34 -13 14 -28 -14 55
4696 55 9 -19 -133 29 1 29 62 -41 -64 -133 23 7 26 -9 -5 -142 -17 100 27 113 -8 -143 -27 0 128
4721A28j41j61K63m4j13p2n2K30%j70O5N3J7M1Q6j53lr7M8J56o6j21J38R2K9j95
4747d2N1j4p0O0L2j43K18j01l9Q9p1J96k80J26o1L2p7l4J82o0o1QN7r9J17j00
4773h4%J16q4J33j15J04n6j32J37J4r6j0J06j83P4J14j3P0j43O8l6r7Q9l4J05
4798D7r5QJ09r6J10J9r6N9km2m9J46J2j49J38n6k09K18p2o9lJ67l7m8K6RJ19j92
4826b8n9J21N2n1j40J5M4N7J02j84k0L1K20j62j9M4m0MJ11m6P6m9m5k4J49j31
4852B8j2j34K3m8J45o9J57q3L5J1j17O7k2j3R9j91K4J61K5n3J8j08J49J27l28
4877a09K07q4o0n0J70j74Q6p8J29nJ1o1j01J93j23K0j4O2K29k98NNNJ4K1P6r1
4904a5k49K54L6R4k24mN5m5J25q0Q2R9j67n1J44n8Q6n4K9kk23O1R0J7n3J5M3K2
$$ plain form
4721 128 -13 -174 89 45 -68 -140 -192 38 38 -132 -67 -14 3 44 130 -23 -26 -123 -75 81 15 -106 32 124 153 -42
4747 -42 9 -5 -75 -15 17 -126 92 -9 -48 41 -30 166 -114 12 -49 -17 -94 -128 54 -6 -67 -59 -2 -101 16 -84
4773 -84 -84 32 -52 81 -34 70 14 -118 19 33 -63 -73 33 -150 -76 38 25 95 -48 20 -16 -113 -24 -58 47
4798 47 -48 -40 69 -27 83 102 6 65 63 21 -28 118 130 -19 119 63 -146 72 0 -69 -72 95 58 10 36 45 164 -28
4826 -28 -87 34 86 35 -105 -90 -46 11 113 -71 -91 -60 160 -2 -21 23 -17 -13 98 52 128 79 34 10 159 28
4852 28 16 -118 -95 -143 2 -67 90 7 42 53 -64 3 -19 -32 67 -124 -100 61 86 33 51 -57 92 219 -109
4877 -109 98 14 -46 -96 74 -100 -14 -92 37 32 43 -18 -119 74 -49 -29 -43 19 248 -50 -45 -40 -35 -21 0 76 -15
4904 -15 -264 -10 26 120 -104 -108 -53 -98 27 -53 29 128 -39 -90 54 -4 82 28 57 55 -168 -107 -17 0 -53 -38 5 27
4932B7K0j1r9J4Q3M7J4k23K2J11n5K3J06j03o3J15j17QL0K5J02k59K42j87O9K2
4958c7O4Ok40J79n2j81K90l1mL7J28j58K9N8j48NJ6J8N5k9Q8k08j2J47k16J07
4984h9J00O8rj46K09k25R9P9j67K24j13j32J56p6m2J03m7P3k02J87j21O4j9O7
5008D1l2j05J76k4n5l2K7M5lm6qL2O5N0j22r1o2J20J15j68q8Q6Q1r9l7L9kJ87
5036I0j01J18k57J43O7j30P2j28Q4N7o7l1P4lR8m1j47J18j97J94Nj91J22P9j21
5061i3L07k43J18k62J59J9l9m0j09J46L2k5J00p8j49J72mj18J09J01k19J53j00
5084f3J25pr6K18j93j22J78k9N6j8J49k13O9Rj47K37l52K01J7nP6j12L7L3k10
5109a62R2rR3p9N8L1N6q3R3k18K00j66K32j10n0k8M8O5k6P2jk19L6P0J5l3m8l8
$$ plain form
4932 27 47 36 -63 -49 34 81 95 -128 -106 5 -50 -27 79 -24 -87 28 -89 -81 -51 -26 76 -183 59 -128 -59 -37
4958 -37 27 33 -207 -28 -80 -261 29 -2 -6 31 159 1 30 88 -60 -55 -39 -21 34 5 93 -115 -127 20 -196 -89
4984 -89 11 79 70 -76 133 -92 7 86 -81 143 30 -102 54 -22 -64 39 -8 65 -137 50 -71 -7 -26 41
5008 41 9 -96 80 56 1 -31 -4 41 38 -8 -16 16 81 131 9 -82 -144 -24 91 -77 -165 -79 2 -97 -134 -95 -97 90
5036 90 -11 107 -150 -7 60 -70 2 -126 -42 15 -52 -83 -9 -12 86 45 -102 16 -181 13 18 -173 -51 28 -93
5061 -93 214 -29 89 -173 -14 5 -34 -74 -183 -37 -5 -30 70 -8 -157 15 11 -107 2 103 -116 37 -63
5084 -63 62 55 -41 177 -16 -138 40 11 67 49 198 -15 54 63 -84 153 -199 2 19 14 90 -22 15 48 -162
5109 -162 -70 -79 14 -65 -7 24 80 -3 90 -128 72 -94 138 28 -22 -50 -2 63 37 109 108 -111 -75 -5 10 -23 -71 -109
5137a09J05K1k1l9N4j22R8K9p2J22j22o7J65j05n6J94j54P8o0J67k5lM7j52P2
5162D5r7L0J8o8K50j79l9m2r7K35R9j60J36q4o0l3qJn9O1Q8q0J05j00q2O9K6Q0
5190E5J7o8n2J2LQJ6O4p4P8k43J01R7Q2k41J25K3k3K1k0J07j02nN6q9L8l9M0J5
5219Bj38K56j60J09j70l9J46o1J53j74O4O8l0l5kRq0J4J3j8J4Q5KJ20k11R3o2
5246c2j03K54j37k8Lk6J47J2m0m5l9k3N4n5k4O2j03J53j79O6K08M8j58M3k86L04
5272G6j30%p7J24K92k73jJ02k25J23j10K70j37K39k70qJ26j90jJ40k12R6M2o2
5296f6j7j28O9J20n9N1Q2Kj52J06j62K03k7k04J61jj8m4J84j69J06j41J02k7o5
5321i4Kk0R1M8k8K0q3kp2J17P7j97J01J2q4K24k45J01L8pqj05J70q9m5k4o2J42
$$ plain form
5137 -109 -4 17 -4 -43 11 -111 -13 16 -56 66 -56 -123 42 -63 -119 75 -79 -1 -61 106 81 78 125 -27 45
5162 45 -52 -22 -4 -72 178 -1 -40 -82 -179 56 155 -5 131 47 -13 -46 -54 -53 -112 -51 37 -43 62 -38 -120 -51 -25 55
5190 55 72 4 -48 -36 -33 -25 -9 55 -19 59 -184 -83 14 96 -145 -20 3 -20 1 -19 88 -14 -19 37 -52 -14 -53 -13 2
5219 2 -136 120 -40 69 -101 -140 6 -55 98 -76 -12 56 26 -9 -11 -2 -82 -68 -55 -73 -59 26 28 148 -63 30 -32
5246 -32 -135 119 -18 -46 -43 -69 78 90 50 5 -34 -57 -3 -58 -82 -20 -123 30 -149 -83 125 173 15 58 -228 76
5272 76 -54 -54 -131 -7 285 12 11 113 -112 11 -99 171 34 273 3 -5 121 -69 -70 70 -142 -46 -4 -66
5296 -66 -83 -211 -142 -22 -81 -30 52 54 -98 8 -154 49 22 -182 -21 -22 -40 -84 100 -69 37 -104 -2 -29 -94
5321 -94 -92 -112 -21 27 -1 19 -64 -66 -138 -21 56 -141 -40 -28 -112 112 -133 -32 6 -1 -9 -114 56 -33 -78 -102 -164 -22
5349b2J19p2K0J31k14Q2l1j09M2l2P4l7j30jJ48Q0o2l6J49j30jR3j70J80qr7P2
5376C8o0M2j40J02N5q7M4o1o3L08j63J3oK4M0p9Q7k21J56n7q9N1J13k2m3J8K5
5403B5j20R4Q8n7qm4o3J21o3k0Q9p7O0k9l1l9O7m5N6O8k7L9q3ll8Q6r9O9%j14
5433i8n2K7M3J07q4J11l6m8j5L4M2j16P1Oj16lP5j37J15j05K50l7P8j74J80j66
5459d8J2m2j24L04M3k05R7j30J53m1k01K13j4jj3k5J12r7n3J87j80K6p3O1O7M5
5485G3j50L6M0j84J95k59J91L6J47j40O1R2j25M8J6k44K37l0L5j9L8j36n6O7j
5510c2l7O5N0j94L62k21j3J76j43M3K1oJ2O0j97j9K4o9J35o1J56p6k6q1P3n0m7
5537i5K0N7J21j17L0P4j13r5J11m0L0j2o2Q9o9Q9k73L61Qj25J68j52Q9p2l9J7
$$ plain form
5349 -22 97 25 45 176 -38 44 13 -96 -54 -86 -12 -49 -179 -180 -32 48 -14 -50 99 -31 -32 61 -109 71 63 -34 38
5376 38 -22 20 -120 -18 37 -50 -6 -67 -130 178 15 28 22 46 86 7 94 -127 29 -28 -117 -66 47 25 -18 0 25
5403 25 -95 -1 87 30 22 -22 -85 36 -27 -47 42 -35 25 -4 -35 -74 -7 -52 4 72 45 84 1 -2 -40 46 -53 16 16 -98
5433 -98 -150 -123 -80 27 -57 54 18 -30 -45 -11 31 -85 -14 -8 -124 -127 -52 -189 -74 -179 71 34 112 -62 118 -48
5459 -48 -36 -78 -202 102 145 -60 37 -93 60 19 -182 31 17 16 3 -22 90 -7 -60 127 -53 -27 -100 -39 28 73
5485 73 -77 -41 -1 -185 10 -249 -58 -22 125 -15 46 138 13 61 77 -167 70 40 75 56 94 -42 -98 -31 -32
5510 -32 -69 -4 46 -148 214 -7 -20 156 13 56 77 71 83 143 -54 -73 -49 -118 17 -44 112 36 10 -71 2 -48 -95
5537 -95 -75 -18 103 -14 16 90 -23 -118 -7 -47 -17 -29 -91 -2 -71 18 -255 106 114 -11 157 5 94 22 -17 0
5563@J14j90l5Q8J7j91J89Nq6N3N8nM0qo0R4j16n5m6K9J68m0K3j34J34j09Pm2
5591i8K36J7k22L6J8r1L4J82j58r1K99q1j52J27J17k43R0j8m4mj8m7J59J0r1k3
5617e6p1J17j9j56K93k9oJ6o3P4q7o7N1L6p7L1j02K46p5m7M8n8n5K0kL5o6k6P2
5646b3j9J20m3p5M4JL6j58lN1j7nj4p5J10J1PJ0k9L3K5R8r8M8j36N8K8M2l0M2
5676C9K5o7L3J70j92m1N8J76k9j33r5J24p5L8k8j8q9QJ5L8JO3j33P8j20L11k63
5703a06J43j13Nl3m4K22l16J17O9Q8l4p1Q3j04O0J90j71Ln5l5K38j33Q6J6k53
5728a48n4K38q4O3K7J7q9J10j37M6J37j97n6L5J91l01K54o8J3l3ML2j63M4J48
5753B9l9R8o6j73N9J87j33K6N7j16O6p8J60L3r9j18K23j10P1p3J36k33m9J95J
$$ plain form
5563 0 114 -76 -111 -23 -6 -197 -8 -3 -89 -36 22 17 57 49 -11 83 -33 -88 -134 -105 63 23 46 -88 46 -63 -56 -98
5591 -98 138 155 -67 -31 -13 -104 -70 112 -46 -137 162 81 -71 56 173 -70 20 2 -42 -46 -64 -111 48 58 -33 -56
5617 -56 -127 -10 -29 -185 108 79 73 89 26 100 13 -54 -3 33 -44 -13 -115 131 56 9 57 -1 -56 -36 -38 -3 -69 -95 -23
5646 -23 -42 78 35 -40 4 5 41 -117 -120 -69 -86 -91 -105 -180 -70 -59 -52 -42 -71 -38 -13 85 -13 35 -101 -43 -15 27 -3 39
5676 39 64 -3 30 200 8 -33 25 201 172 39 -56 68 -7 31 3 -15 -104 -96 -81 -43 -42 21 -112 -34 -154 157 -106
5703 -106 37 -76 -71 -104 -148 74 -242 -125 -56 32 -2 -73 10 -94 -34 156 -15 -12 -67 -102 136 3 89 105 -148
5728 -148 -202 36 -48 15 42 59 -30 80 -57 -11 126 -71 -127 -92 99 -202 52 -16 -3 -36 -32 0 -163 -119 29
5753 29 -10 88 22 -151 -92 95 -38 -12 45 -71 -5 -83 77 110 11 -107 116 6 77 4 140 -93 -142 53 54
5778E4p5p3p6J63o9K8M1n6J43k49K13j05Q2OL9j51P5n8O0k9R8q5J8R2r5J02j2
5805H1j28n2J14n8J28j97k0J78p9m2M2PJ3p4j03K12M7j01p4P1O2p8K6q3J70j20
5831e8J32rj27q6J68n7O7n4PO6p3K4N3mj20kJ35J2o3p7j19J09o6K45j40j88L51
5858A26j41j35MK15k8J47k76j21K08O9j77O4J76l35J85K2r8J57L4k89L30J4r8
5881E3ql0Q1J9q5j01l8J95j61R3j6l5M9j12J1O8n3K2J13j1n1o3Q5k13J51Jk3%
5909e9K12q4j81O2Q6kj5k9Q2m0k02J74kN8L9m4Jk1Qq9N5n0M2l0R5P3n3j55k5J65
5939G1j23J46k21J22QJ11r1Qp1N3n0M7m2L3l1r6K08j43J2r4K88j86J2J59k24O5
5965b9%k0K3M4r9K60j31r8O5k3k7m4M2j4P0n1R2J6j32R7n5M9j55M4N4L0n2J72
$$ plain form
5778 54 -21 -94 -170 -7 -76 -48 -7 -63 80 -169 44 -61 21 27 66 -85 -10 -68 -8 -37 61 -24 -6 86 -9 93 81
5805 81 -47 -99 15 -43 85 -112 -132 46 -33 -75 -33 -26 -13 -87 -190 22 69 -32 -106 -35 27 -51 -25 -108 62 -58
5831 -58 74 65 -62 -148 20 -37 30 -24 -17 49 -24 0 53 49 -71 -73 62 74 11 -66 -185 -76 -142 103 -37 -225 126
5858 126 -15 -150 -146 69 41 188 -88 -209 -1 68 -109 -45 131 -204 -19 3 -95 62 96 -193 137 151 53
5881 53 45 15 96 115 30 -71 -109 86 -75 18 2 -33 16 -96 -85 -17 -70 -48 65 54 3 -60 25 -188 -37 -36 -59 -59
5909 -59 153 69 -112 -50 36 34 19 -10 72 32 -170 4 2 60 99 55 56 35 43 -46 9 -41 1 -29 66 139 86 -69 -94 71
5939 71 -52 94 -127 -5 3 114 23 31 -40 13 -37 10 -32 1 -30 -126 82 -61 -49 -143 145 -41 -29 130 -94 -29
5965 -29 -29 -49 -26 18 -81 179 48 -50 15 -8 -35 -79 -37 -51 19 -32 60 76 -56 41 -14 35 -120 -76 -22 8 -44 128
5993A28j87J44n6q8J10L4o8rl3J09j08Q0p2L1J3r9r9L12j69K7Q2k72J53k1L0O
6019b2JO0M4kl4l2r5K9J71k29j1N0J9P9m6MK2O4J5j87J85j69P7k1M9O3k29J0J28
6048gNP1j76M9OJ89j42oJ00j36J73j17J93j84m0L8J40k63J1P8N8k5j07R0o2j29
6074a93K56n8Q6o6j29P9Q1j89K10p4J23j11p8J4N6P8k12J58j60J88l0j17J29R4
6098A35n2p4j18J87j04q8J6K66k10J02O9k7mj58K49k59j03J97N1P4j60j5P3m8
6122ar2n0J29n7N5m3P6o2j08j7J39P0j02R3J0K8m7j62K10j7k30K16R0Kj56J98
6148A72j56N4k6j07L2r8J23m4q1J49J6r4oJ55k10L13j53p3N0j19J62j33M2J19
6172H7k3m2M0J62o6j16O3p9p8R7M0k06J27j35K32j32m4J51k23P8P2K3j27k3J85
$$ plain form
5993 128 -59 85 29 -59 51 85 17 8 -25 84 -24 56 -16 15 28 -71 -170 142 -27 0 82 -190 -37 -58 -28 -22
6019 -22 -21 39 83 81 47 15 -80 -51 120 -109 -120 -70 -51 28 -18 -14 8 72 87 -100 85 -84 -7 -28 21 84 -145 -135 -7
6048 -7 -2 69 -107 -58 -52 137 -5 -11 89 -47 126 9 202 18 -22 16 156 -107 -96 -18 40 15 -92 -2 -64 -193
6074 -193 63 5 91 25 -104 -25 56 -133 77 3 126 15 -63 -49 7 85 -127 31 -129 59 29 -88 41 135
6098 135 83 9 -109 78 -26 -114 -98 168 -42 60 129 102 98 -60 189 -70 -173 24 75 149 -11 -26 47 -1
6122 -1 -93 -143 -14 -71 -16 -59 17 -45 -153 -170 -31 39 -63 30 40 68 21 -141 69 52 -178 38 128 130 -26 172
6148 172 16 70 44 -63 -31 -129 -6 -50 -131 18 34 -60 -66 89 -121 192 39 -34 16 -103 59 -74 -32 87
6172 87 64 22 62 224 158 42 105 26 -52 45 85 -121 6 -129 103 -29 -73 78 -145 -67 5 28 -99 -122 63
6197F3j71N7MM8l3J17o7mP0J12p9k06O7r5L4M5OL8j17J30k9M1j17J98l8l7j63
6224a26L12k85J77j25J57j64j5J60p4j55K25m0o4K5p3J8J11j28j85L38k6n7p3
6247f7K27k06L8j31R5K8r2k9nM8J20o8L8N2l9K5o7J48l50K85k9Q3j45j74K28o6
6273e3N7R3j18o7J82j35R6j40P7J48m5j85K52k03M8M4j36K01j38J19k40R4J00
6296E1K5j43R4l3K05j20j27J14j65o0K34j43J46Qp1j1j54K21p5l0P5j44J24JL9
6321F1R1k26oK7j7J82k12pP8L8j35n6K03j25L8N3J33p3j01O8o1K63j52M5l1j53
6347g5J07j33J23M6j20J05Nj49L2nN8n4K71j99j63K43l4k8k32J97l3K15j90Q8
6371G5k30R4j57J86j4N6Q5o2j3q6j54J36L41k45Lo2j8O0j07QJ14J36m9k38O2p
$$ plain form
6197 63 -108 -51 -47 1 -32 85 18 14 84 196 117 -89 -22 -117 -83 -38 -32 6 -111 19 -10 31 -86 112 74 37 -126
6224 -126 186 -99 78 -47 110 -54 -69 91 17 -138 87 47 -17 8 -65 -47 64 -64 -249 89 63 6 -67
6247 -67 160 -46 -8 -139 -44 -16 -108 -137 -142 -94 26 -42 -4 48 9 34 -33 115 -235 50 21 104 -41 -215 13 -53
6273 -53 4 97 -21 -88 94 -41 55 -85 -8 140 95 -90 162 -41 7 51 -85 116 -22 97 -143 -49 51
6296 51 76 -67 27 -6 199 79 -48 66 -99 -159 75 -68 78 86 15 4 -150 71 -4 -34 41 -103 21 22 61
6321 61 152 -74 -80 -53 -70 112 -100 -107 -29 9 -126 -182 21 -104 -66 -13 120 47 -54 14 -47 216 64 109 78 -75
6347 -75 32 -101 22 68 -52 53 58 -91 -59 -64 -6 -60 211 12 -151 92 58 30 -202 -5 -38 177 -13 75
6371 75 -155 -61 -218 -32 -46 10 95 33 20 -66 -220 -84 257 12 15 -47 -65 -5 -112 -104 10 146 97 -141 -79 -86
6397h6m4J12J17l0r0J63j57r6P5K29k20J37j65j2Q0m5K5q7m4J32q5P8J98k46m8
6422a09J7J39J2j58O0J9m0P9K1j09J33k7n9Pl6N3m9J30O5k97M8J14J6j30Q7Pj01
6449a08L6J82j35K5nj34M7J63j00J3k8j0N2N6M0j56J86l39K01l4M6m7J14j08J78
6474A35k72J41n9J15j85J29o1K8L0n5N8Po2P1J01q4r8J1J4o7l4J04J13j07j41
6499a68O9J01n5J07L7M3j68K04k68N5j80L48p7j63J78J2k4rq7m3L7J3kP3K6q3
6525b4K07p0P6j21K7q5N7jm6L0j37m8J52R4j07l8j34L84k14J12j25o1K2J12O6
6550A28j97j48K65k6j04j6L1M2Q4j32K20k28M7o5R1J72k40J18l9n7O4l9k2Jk1
6575g1J13j23J69j03Np4N7k6qk4J48r3o3m6J58LM5j42J48o2j68KJ37l0J70j34
$$ plain form
6397 -86 -130 -18 99 69 -21 142 -15 -111 -36 193 -27 110 -55 -67 13 -32 -7 -94 -138 -6 -91 -13 185 -61 -109
6422 -109 -92 47 59 -99 -39 -20 -60 19 40 -69 64 37 -22 -15 -51 2 -47 83 148 -149 -101 13 29 -101 -14 -7 -108
6449 -108 -72 110 -25 0 -5 -139 -92 71 -29 -16 -44 -54 -2 54 94 -62 124 -215 -14 -48 -2 -49 65 -43 135
6474 135 -137 4 -55 60 -125 4 -57 -29 1 -54 4 11 -51 20 121 37 -61 -50 -36 -103 -137 -33 80 -27 -168
6499 -168 -99 2 -53 54 91 134 -34 170 -98 -43 -223 125 48 -115 63 75 51 42 -45 -88 -51 -38 -40 33 59 -24
6525 -24 183 113 189 68 95 10 67 66 20 50 -87 -135 17 111 4 -34 -168 216 2 114 -11 -72 -50 62 128
6550 128 -69 -217 48 22 -82 -98 -67 -25 59 -73 147 -81 -34 -99 -8 164 -76 42 3 -54 10 -29 -51 -50 -71
6575 -71 42 -81 88 -15 -10 -84 -27 -53 -61 -85 63 -30 -93 -139 19 22 67 -75 73 11 -157 -155 -18 -48 122 -12
6601a2L9N9j55J72l9M0k08J34M5j6j28J08j96J70j5q1J00J06l00O6J02n0N5N4
6625E0j79K01j78J11K0k8l2N5Ln6o2rK25j28J02l5j87NJ71K7P6o0k24J59kj32
6651a07r0J70J84l45J81Q0p3J6N5J20k33L1oJ7jo4J22rp9K8j3mJ25k45m7K03O4
6678H0r9N6q3Q2M9j49r1J5K17p8m5Q7q1k4M9m9p1J04Q8j22J81j31k3K4m6q6K64
6705A18j23j55K12l8j14J15m3N9Jj5oJ12k97L29j33J8p5N0P4r9P3m6j27J47q1
6730d4M4J32j13r5J46r2N3N6r0l3O1J2k88K64m1n3l0k1Q7M1L8l1J4km8j08J36
6757ek1M1O5q6O6o4O4j03N9p4R4o0Q4l5Mq3M5L8o0R4m3q5M0q2J67k18K04j66R1
6786b9K3Ll8l1L2K3O8k07K15K4k25K08Q6l41M36k15j01J21r8Q3q2N3n4N2q0r4
$$ plain form
6601 -12 27 86 -69 103 64 104 -104 30 75 59 -69 39 -157 13 -2 -83 17 123 -177 -111 -9 -59 -4 50
6625 50 -129 72 -106 5 25 -3 -35 20 23 -33 -95 -104 121 -7 95 60 -127 -122 49 76 152 92 -132 27 25 -107
6651 -107 -197 -27 157 -188 -7 73 0 16 71 191 -42 -11 -17 0 -1 -65 57 48 -31 -3 -16 -20 105 -140 -187 16 80
6678 80 -19 37 -46 36 85 -64 -155 -140 77 -1 -46 41 -40 -64 -15 -64 -135 -31 57 -65 116 -15 -38 -14 -60 -146 118
6705 118 -5 -160 52 14 -100 15 -28 31 32 17 11 123 -174 155 22 40 -35 15 89 -10 63 17 -110 37 -44
6730 -44 0 132 19 -76 70 -22 31 87 -3 -36 25 37 -251 13 -28 -81 -111 -132 -45 -4 34 3 17 15 -33 -141 -5
6757 -5 -26 15 80 -6 60 -4 60 -43 16 -58 36 -24 60 25 29 -54 -9 29 -31 63 20 -65 -25 -107 60 -158 46 -120 -29
6786 -29 -6 -3 -41 -72 -40 -17 51 -156 59 83 -142 66 152 -189 247 32 -69 52 -46 37 -45 8 -46 6 -74 -168
6812a68L11l34K21o1J5j36N8J08q2N5r7J44r5n5R4n5Q9j23o2J35Q0k0Mk2j1Ln5
6839e9J79j66l8L9K4M2J9n7M7n5R6l3j55J60o6rj6o5J42M9o4j76J65j6m5k8J38
6866E2k7k22J92p2o1K10j35J76q4p9K80k61j3J60J5k47R7O5q4j28L5K12O1j21
6890B1K3j19Q6p0N7J41p9j68N9R6j19l0K8n8L4J57k43K41qj04N3nj40J15J10j15
6916c7K4J7k42J20P3k0J4N5Rq8J33r7M1k6O6j22K29j81j25K68j89R6p9Q4j31K41
6942A33j05m7l8J28O7j85M1N2l7r9K37o3j22Q8Q5j35o9J93j33%j14K14j5j34J53
6967I5J7n5j4p4N1q1M9L8J11j35j14L2J28l8j33N3M2k3m1k33L31Q8r1Nl7L3k4
6994b0J76k72n4J5J12j1J96r3J36k31K8k6nM5J27j67M5r5J70j91J65j07M1JQ1
$$ plain form
6812 -168 143 -191 30 -31 -16 -152 -94 14 -68 -13 -110 34 -61 -116 -22 -77 12 -111 -173 -38 42 22 26 4 -7 -4 -59
6839 -59 120 -46 -84 -45 -21 21 40 -17 30 -25 71 38 -117 43 -23 -32 -48 -113 29 78 14 -162 3 -13 -58 -86 52
6866 52 25 -197 -5 -77 -138 72 -63 113 29 -50 230 -31 -44 116 131 -116 -19 46 -38 -166 -131 81 142 21
6890 21 44 -75 11 -59 -2 139 60 -108 -49 47 -72 -102 -74 -132 -98 59 -184 57 49 -55 -2 -7 -147 -32 78 -37
6916 -37 -13 4 -238 -118 -45 -65 -51 4 13 -75 58 -39 2 -24 42 -80 149 -32 -157 111 -78 18 -61 23 -108 133
6942 133 28 -19 -57 71 138 -47 -6 46 9 -90 147 84 -38 50 135 0 -69 124 -9 -9 -123 91 76 -58 95
6967 95 112 57 43 -31 20 -61 -12 26 137 2 -112 -80 48 10 -123 -70 -28 -51 -92 -325 6 94 3 8 -29 4 -20
6994 -20 156 -116 -170 -155 -43 -54 142 49 185 -46 -18 -44 -49 -4 123 -44 1 -94 76 -115 50 -57 -16 -15 66
7019F6j19J05o9R1j00m3jO3j31J51r8K10K4Q7l29L4J00j19J57M3p3M1O2k59O8
7044c9J19j03J9J09k6j67N1m4n0K19L7k46K12k7Np7j26J31j06K79j93M2J2P2j87
7069h4J74j09N7j31J68r6L6m0k4m4J41j61J87L3j74n5J62PMj44J18j08L3PJ03
7094F0o3r4K00m1o9l7J51j08J5l5J72L4k07j60J96l4m3J54j78q6K30j29L6N0P5
7119H9j27q5j7O8k1P2R3K1n6o4j40N8J36J14j71j9J17j48k4j6P6n8k2N3NQ2J71
7146A87m8j12m7j37L4K79j75N2oj17J9Q1q7J23j18J65j37q9J83L9Ok17l6J37K3
7171BK04q4j84O8J63j08m2Q8j07J1N1N5j92J12j3KO0n5o1n1l3l7J54m3O8lmn8
7199c7Q2m2j37R1q7J68o6R1j39k0M1K7J3q2r7J33J45j18lL9j16Q7J8M9J7l2O8
$$ plain form
7019 66 -53 52 -17 74 -26 -69 -70 -7 -138 13 -85 125 149 236 -93 -59 41 -78 79 122 49 90 152 -107 -39
7044 -39 80 -23 -4 105 79 -88 -37 -81 -131 88 125 -121 91 64 69 -8 -134 -3 -109 170 -23 19 31 103 -84
7069 -84 90 -19 38 -93 75 -21 15 -25 -49 -93 48 -113 74 107 -67 -122 40 47 51 -93 25 -83 -50 -43 60
7094 60 -3 -97 103 62 -7 -44 107 -1 14 -21 151 185 -22 -182 14 -20 -63 91 -87 -173 57 -72 -36 14 89
7119 89 -38 -123 -140 -72 -93 -21 72 93 37 -27 -167 -109 27 141 -30 -49 68 -80 -104 -120 -44 -102 -124 -71 -66 16 187
7146 187 139 27 -20 -157 -123 156 -19 33 27 -90 -71 10 -77 46 -72 93 -44 -133 50 89 95 -122 -158 -21 2
7171 2 206 122 -62 6 169 61 19 107 0 11 62 117 -75 37 24 26 86 31 -30 -81 -114 -151 3 -40 28 25 21 -37
7199 -37 45 3 -134 -43 -130 38 -28 63 -76 -96 -55 -28 -15 -97 -194 -61 84 -34 -37 2 -114 -27 -9 40 57 25 93
7226I3r8l4oJ15M1j45L5J20j33q7R6j28N9P0Q1j79P2p4K2J8J23j17nL0n8J7N7
7253a5j0J3j6m8L5Qr3R0Q1m1O1j35J68j14O1m9J16j19n2K32j36m8p1J58k60J63
7279b1p9QK6j9J3k7r3L28k01o9K22j13n1jm5K20n6n1l5m1N7J08q9L8oM7K3r8p
7308a2o8J35k6Q3j06j00K19K7j73k5P8p2P8j21R7k0Q0kj88Q6l2O4l7J7PQ9mk47
7336a73R0J40Jj94J49m5J05k0j51L08j56r3J17j02j02J05J21k37P7M2l4N8J15
7359A21j67J47jk34J51K8q0k6l6R0K7o6O8j56P9K4r3J60kJ21j89J18p8m5J38J8
7385A17j46J29p9j65J12J99j75j65J1K28j06K6R9j29L9R7M4k26J29q7qj0J9M8
7409AJ14k23J18J79j40k4j5R9n5J42l06J95p4j23J13K6o2J7P0j19J65k39K16j42
$$ plain form
7226 93 -5 -39 -45 70 111 -34 1 121 -12 -99 -3 -131 -72 -2 79 -100 -28 -102 -80 -62 61 -56 -61 -31 -89 -72 -15
7253 -15 -25 -12 -28 -76 -41 -33 -126 -36 45 4 65 -70 98 -16 45 -4 112 -7 -59 173 37 -11 -82 76 -184 -21
7279 -21 -100 -92 -66 -85 -72 -99 -192 136 -65 -134 88 -25 -76 -77 -122 98 42 -9 -44 -85 -28 80 -9 29 23 70 93 -5 -12
7308 -12 -80 55 29 112 6 -94 125 152 -21 -46 32 -40 38 -83 14 -6 74 72 -116 -30 -62 2 -35 -18 -11 78 74 -173
7336 -173 -83 57 58 -136 13 -32 73 53 -98 210 54 -39 78 -24 -126 -21 100 -137 -60 -18 -52 6 121
7359 121 -46 101 100 -134 17 45 -35 -61 -97 -7 20 -46 22 -134 -55 -31 -124 36 34 155 -34 84 6 -39 99 117
7385 117 -29 100 21 -144 -32 167 -8 -173 -162 66 -40 -14 85 -44 -5 92 136 -90 39 -48 -56 -66 -47 1
7409 1 115 -108 10 189 49 25 10 109 54 196 -110 85 11 -112 1 27 -35 -18 52 -67 98 -141 75 -67
7433f7N4o3J22J1k14K12p6R6j84L3l0l0M9K09j97L5m8K1o8K11j02j26J74o5J02
7458E9k28N2J7O3j1L0J79j11Mj23n9K38r1m3J10N9m5p8nj3R2j11O7j55K40j65
7484b8Qq0J77j71Q2j6J85k49J59k85J92J69J3j40m6N9O0j20J74j78l3Q0K8L5j57
7509h2J40q0N2K9k6o6K5q3o3K09j11O1oJ7J3q1r8J23Q5k25Q3J24p9J23j72J7J20
7536D9j84L3R1J0jJ27j86O5n3j1K9Oj40L14j46lkJ0j60o1K04p5M9o1qJ84m6j61
7564a27N5Q8J88l12J65j62N5j25J74RP5j51R4j07J1r1J81Q5j77L7%o6Q0Jk8KR1
7591D5J54k01%l6K7j06J32r9J06l0k4J05R3m3j53o3R5M5m1l6o2J38Mnj06L7q8
7618a12N1l0J72j05m9J08j8P8r1J51j60J10k28K57r0j53j2P6K52l36K45j99jJ17
$$ plain form
7433 -67 -13 -76 46 57 -157 55 -21 75 -109 -76 -106 -136 -87 122 -75 -40 -88 -67 -135 76 -26 -152 22 -43 59
7458 59 -169 -117 -100 -37 -48 -18 161 50 54 -69 -128 110 19 -24 86 145 100 22 17 4 96 -15 52 -103 137 -28
7484 -28 -20 -100 77 -94 -12 -28 157 -92 67 -218 -26 143 156 16 -30 29 89 -31 143 -35 -68 12 40 75 -82
7509 -82 58 -22 30 59 33 -33 -8 -91 -154 55 -56 5 -1 16 29 -52 -150 -27 58 -167 -84 40 -39 84 -88 -71 49
7536 49 -135 -102 -11 -1 -2 125 -61 4 -49 -60 -31 -25 -165 149 3 0 -2 8 -152 -213 -9 -84 -35 -96 -104 80 34 -127
7564 -127 -72 16 204 -108 57 -105 -50 -175 -1 8 83 -68 26 -81 -70 -161 20 105 -72 -35 -35 -101 -21 -20 -48 -46 45
7591 45 199 -2 -2 -38 -11 -117 15 -84 22 -8 -32 73 166 123 -30 -93 2 47 6 -30 -92 46 50 45 -61 -24 -112
7618 -112 -61 -91 81 -24 -73 35 17 95 4 155 -5 105 -123 134 44 -109 -121 -45 207 -129 116 -83 -84 33
7642C3J25k71p0J62k5l7n6J31q9Ql9K08j36N8J4N4j29J34q1J70j54n0J30o0K6
7667E6j9O4o3j4J36j70R3jj00N8L4L3j31j18J88jj20kJ14QK5Lk8n8o9P5k5J11
7695G9j56J39j52LJ63j96J22j70O0M9oP2n7N5n6k2M3k9R7k29J88O4j51J48j11
7720e3nJ44r3Lm1pJ48j33K05k9k55K88K8k56m3O5L7j79J37R9j33nJ18K8l6m6O4
7747E0r7rm6J50r8O5q0k3K5K00oj34p8J1RJ73o3l0LJ17j95k1k6o5J80Q8j7k36
7775a53J00P3l2L0j67J12J04R9k79k4J32o5N3O7j10j39Q9J01L2j04J33j56oP9
7799c1M4o1J14M3k33K03o1K0o5n8J54j37j08K16M1mM0k31J08l0K14k71J70j34
7823e7n5K42j33j31M1J56j48K90l14J13KJ28j34jP0Pj1J2k0Or0o0j1j17J65P3
$$ plain form
7642 33 158 -113 -183 -21 -46 -83 -139 -8 -97 -89 -128 80 -56 2 16 70 -59 75 -6 164 10 -40 90 30 56
7667 56 37 101 38 24 160 -10 83 82 -18 40 74 107 -24 -142 46 45 -75 -77 37 45 70 73 45 -13 -82 -7 -32 79
7695 79 -77 62 -90 -87 76 -120 2 -168 -108 -59 -65 7 -50 5 -51 -73 -30 -59 38 -191 -3 61 -90 58 -53
7720 -53 -58 86 -7 -4 -45 -52 96 -37 168 139 -116 172 200 -56 -99 -34 3 -176 -39 60 -73 -78 40 68 32 -14 50
7747 50 -47 -56 -102 48 -50 15 -65 -88 -63 137 131 -3 -81 -70 -61 112 49 19 22 139 -56 -77 -103 -168 12 100 83 -153
7775 -153 -53 20 -12 18 -149 -37 67 166 -113 -137 -5 -70 -17 50 -60 -199 -110 -9 23 -81 52 -104 -110 -31
7799 -31 13 -48 66 109 -124 79 18 38 -27 -85 69 -68 -176 40 81 77 117 -114 -6 -36 178 -93 77 -57
7823 -57 -112 130 -3 -134 -93 63 -85 205 -109 4 6 134 0 -1 69 76 65 77 57 63 -27 -87 -98 -215 -50 23
7849B3Ml7J24k93J98j61J62r8J39rk39J87R2j9n7K5J05j27qj09J66j49o9J54p7
7874g3k1P8p8J93L5j74J6M0mj51J18n4JJ48j07K8L1Q5O4j16lr6M4O3r6J45qj87
7902g9J13j24J49R9k27lJ00p9l1M0L6J2L1J3m5Q3j89K73j57r9J06L2N8r4m5Q7
7928F0q8J33k2k09J20J04q9M2m0p3J28j54K09L5j18j8J37k11m2J21N8j73m1M0
7952i1Q7J11r1m6R5j14k6j18J59L9q0J08k24J54J50J31k45P7r8mM4k8j16R7P2
7977D3M4p5j22J89j44J14K4L3j52M4q6j28J54MJ14q5%M5j04J60k04J18j3m1R5
8002B7m9O2q4P2r5k0P6J8J07l39Q4K1J66j19Q1j8J01q3J4J9O5k24O8J69j45J71
8028A45j45o0Q0j79J37R5j05O8l9j49N8K69m3j99J03J25j97J99j78%J21j48O5
$$ plain form
7849 23 27 -10 114 -179 19 -142 20 -78 61 52 -187 0 92 73 16 41 146 19 11 -98 68 -81 -150 4 -73
7874 -73 -94 -16 -94 99 134 -40 -24 16 12 -139 -21 -75 -74 74 -33 -5 26 111 175 59 56 -40 4 67 -29 116 108 -79
7902 -79 34 -90 59 158 -69 -72 28 -51 -82 -42 -6 6 37 50 5 88 -101 172 15 -84 22 54 112 18 -27 60
7928 60 -28 105 83 -126 -6 98 9 51 11 -62 66 -88 121 156 38 20 157 -54 -96 25 83 -90 -131 -91
7952 -91 -4 107 16 -30 65 -49 -75 -193 -34 5 -75 33 -191 -37 113 244 -1 76 -22 -26 18 -10 -126 -29 43
7977 43 87 12 -110 79 -65 49 73 106 -46 -2 -88 -216 -62 -58 56 -29 -29 16 -88 72 -132 -14 -27 -68 27
8002 27 -22 40 -44 28 -67 -87 -11 7 114 -225 -141 -120 46 -73 8 -10 91 8 22 41 106 -118 -50 119 -26 145
8028 145 0 -60 20 -159 -22 73 -32 36 -3 -152 -94 175 132 -67 36 161 -36 163 -15 -15 106 -42 23
8051B3Or2R0N5q4NP3l1j92K10N6q4k7m9JL5J54q5n6r3J75p7p1R4Nj16m6N9J29
8080F7q5j27J96j60J05L5P4j25M4r8N0J72k20Pk8p1J62P3p8j3j3K5Q2k0K4mq1
8107gQ3k5j6L3K7j54R3J2N3k00l2J73l4R5k3j5k33K1K03j12L8J5j95L65l84J20
8133i9R7p8J85j24m9J10n5K01j24j6J44k62L4n0KJ56j39J77j62J11o5j7J91k63
8157i5O5l1lJ43k12L8J83r1oO9j41J40j29n2J40M3j48J41k13J57k11K36k3L2q0
8182d8J84j37J65j23J3J4q3L9q4
$$ plain form
8051 23 29 -63 27 82 -2 3 76 45 -147 63 119 35 8 -41 -40 -5 149 64 8 -85 90 13 -58 36 41 -75 -121 -62 67
8080 67 -18 -145 51 -109 -4 31 105 -20 24 -74 -24 148 -72 -65 -93 -164 -2 71 -7 -20 -33 -8 74 54 78 74 -7
8107 -7 76 51 35 68 95 -59 34 46 99 -101 -133 40 6 101 78 63 -170 -149 54 -58 -20 -5 -200 165 -219 -99
8133 -99 -2 -80 105 -19 -68 42 -13 188 64 48 192 -70 -36 -86 -84 72 -67 110 -52 59 -6 -23 168 -95
8157 -95 -30 -61 -64 79 -133 -95 88 -3 -9 60 -81 59 -70 -122 18 61 -87 54 -159 -2 -213 23 0 32 -48
8182 -48 136 -1 164 41 54 68 -15 24 -60
8191f0
$$ Imaginary data points
##PAGE= N=2
##DATA TABLE= (X++(I..I)), XYDATA
0@%%%%%%%%%%%%%%Qj6J6j6J6k4L2l2M0m8N6o5P3q7J01j16J32j49J66j87K12k38
36a26K68l00L33l71M14m60N09n64O25o90P59q35R19j012J116j229J354j496J657
55H71j836K039k275K553k884L285l781M413n252O418q146J0959j6267K9465j16852
70i7290j49426L97733l1361l17191K28939K41479l23288m9109L48692j19436k91719
81a61977K49917J31666l40169M145K98150j89747k30719K68992P2291l15755Q1319
92a31887K74371k02577j50431L01171K6782k78523J39550K27910k31831r3808
102a19273K82297m4631k55019J68449J59535k53051l9751K56656j02359k14586
112a61733J90693R9034k52555J2494K28656j36091j62895K14825N6977k32050
$$ plain form
0 0 0 0 0 0 0 0 0 0 0 0 0 0 0 0 8 -8 8 -8 8 -16 16 -16 24 -24 32 -33 40 -47 54 -62 70 -79 87 -100 112 -126
36 -126 142 -158 175 -196 218 -242 267 -297 328 -362 397 -438 481 -531 585 -644 710 -786 871
55 871 -965 1074 -1201 1352 -1532 1753 -2028 2385 -2867 3551 -4595 6364 -9903 19562 -97290
70 -97290 -246716 151017 119656 -197535 31404 272883 -50405 -99514 249178 129742 -161977
81 -161977 87940 219606 -120563 -116418 181732 -8015 -238734 30258 102549 -213206 -131887
92 -131887 142484 -60093 -210524 90647 117429 -161094 -21544 206366 -25465 -119273
102 -119273 163024 118393 -136626 31823 191358 -61693 -101444 155212 52853 -161733
112 -161733 28960 127994 -124561 -112067 116589 -19502 -182397 32428 89405 -142645
122a42645P2228K07637j58751j07650K28763Q941k16293J11618J65502j89410
132b0060o6263K17027n1712j96979J38558J08438k05775j6329J96577r6368j54089
143a46975J66561O2415j97542M0523J76609j25491j02762J84888J8231j80544
153a04087Q6128J47033j49076n8739J86358l2684j66358J16567R9202j75019j7974
164f8649J72125q2370j39629J44784N5747j79551L3171J58404j17182r6918J67663
175D7595J2037j68810Q0291J33607j40624n1467J76776l0290j52069J14836R6319
186A18201j61868j4001J64284p5454j32170J34165N4542j69705K5713J50036j07149
197a3406r7670J54914J7744j61723O7012J30511j28678n9982J64163j7566j49543
$$ plain form
122 -142645 -70417 137220 -21531 -129181 99582 108523 -107770 3848 169350 -20060
132 -20060 -86323 130704 78992 -117987 20571 129009 -76766 -93095 103482 7114 -146975
143 -146975 19586 82001 -115541 -75018 101591 -23900 -126662 58226 76457 -104087
153 -104087 -17959 129074 -20002 -78741 107617 74933 -91425 25142 124344 -50675 -68649
164 -68649 103476 21106 -118523 26261 82008 -97543 -64372 94032 -23150 -120068 47595
175 47595 59632 -109178 -28887 104720 -35904 -87371 89405 59115 -92954 21882 118201
186 118201 -43667 -57668 106616 31162 -101008 33157 87699 -82006 -56293 93743 -13406
197 -13406 -111076 43838 61582 -100141 -33129 97382 -31296 -91278 72885 55319 -94224
208i4224R7720J03475j46987k7126J60394n4124j33842J19156P1226j58270N081
219e7521J52027q5836j13385J39411L9175j62488M0405J41147j10872q4339J56825
230E4549J0205j57267P4618J25548j33102n4343J63005k6136j49635R9868R7006
241A04316j51246k5258J59562n9064j33780J22295O8911j58755R256J51887q4849
252C275j07472J40063L9478j56086M2519J37395j07551p9357J49480N729j49834
263h2361O9915J13954j26316n0886J49109k6207j37770R1833Q7029j38112k0063
274f9875J43007n4342j15951J11396N9471j38653J3169J34324p7227r0501J25676
285D0494K9888j36536M0916J15455r7648o5310J28262p21j28191O2863R2234j10822
$$ plain form
208 -94224 3496 106971 -40016 -67142 93252 39128 -94714 24442 95668 -62602 -57521
219 -57521 94506 8670 -104715 34696 73871 -88617 -48212 92935 -17937 -102276 54549
230 54549 64754 -92513 -17895 107653 -25449 -79792 83213 57077 -92558 7310 104316
241 104316 -46930 -72188 87374 28310 -105470 16825 85736 -73019 -63763 88124 3275
252 3275 -104197 35866 75344 -80742 -38223 99172 -8379 -87736 61744 67473 -82361
263 -82361 -12446 101508 -24808 -75694 73415 47208 -90562 1271 88300 -49812 -69875
274 -69875 73132 18790 -97161 14235 73706 -64947 -51778 82546 5319 -85182 40494
285 40494 70382 -66154 -25238 90217 -7431 -72741 55521 54800 -73391 -10528 81706 -29116
297b9116l7399J25045k8524j10881Q1918O6974j14599q152J17913m9687q8860
308g5368R5681M1355j12436J8386J03093o7860o5771J00976J4671j06429L8778
319a4924Q4614q2480m3255J01039j1317r6270N7183O3667r0344j8846R8029l1699
331A5397q0304P3559M3278r3238P332R1015n1791o1224Q4816J9258r2876K9553
343a5225P7984o9647m2687R0176o146q8675M9682O0019q2591j9121R0266k8474
355A5561p5926O7540M0979q8244N853Q6247m9574n8819Q1189J8302q8570K9058
367a6404P5286o6399l9406Q7666n358q5031M8724N8382q0736j8772Q7850k8570
379A7232p5472O5364M0495q7148L562Q5808m7247o0420P9527K1371q8817K5678
$$ plain form
297 -29116 -66515 58530 30006 -80875 1043 68017 -46582 -54734 63179 13492 -75368
308 -75368 20313 61668 -50768 -32382 70711 2851 -62920 38056 52727 -53702 -14924
319 -14924 69690 -12790 -56045 44994 33677 -62593 -5410 58257 -32087 -50933 47096 15397
331 15397 -64907 8652 51930 -41308 -33976 57039 5248 -55976 28840 48098 -44778 -15225
343 -15225 62759 -6888 -49575 40601 34455 -54220 -4538 55481 -27110 -46231 44035 15561
355 15561 -60365 7175 48154 -40090 -34237 52010 2436 -56383 24806 43108 -45462 -16404
367 -16404 58882 -7517 -46923 40743 35385 -49646 -922 57460 -23276 -42048 45802 17232
379 17232 -58240 7124 47619 -39529 -35967 49841 2594 -57826 21701 43072 -45745 -20067
391b0067P7461o4024m4041Q7663k46q7683M4656O5249p8591k5957R1385k0434
403B5371q1755O1248N0516q7523p122R0389l9510p1473P4517L3071r1467J2966
415c0772Q5151n4722n6524Q4338J5782r1265L1278P6221o9078m1448Q9057l730
427C4288q7380M6239O3130p8319k4354R0069k0611p9303O0705M9088q4518o182
439c7148Q7450l7331o8634P1009L2539q7558J0722Q1923n2169n5678P9849J5749
451D0723q6951K8754P2657o4230m0099Q4374k827q3169M3948O0029p4403k2759
463d3953Q5016k0007p3625N7211M5320p8206m745Q0310l5121o1764O5620K7185
475D3241p9225J1976P1123m8154m6788P0433J0763p4702K7141O0873n6703l0782
$$ plain form
391 -20067 57394 -6630 -50671 36992 36746 -50937 -6281 58968 -19623 -45580 45805 25371
403 25371 -56384 4864 55380 -32143 -39265 51124 11614 -59859 14658 47729 -43738 -30772
415 -30772 54379 -343 -56867 27471 43253 -48012 -16734 59487 -9591 -51039 38018 34288
427 34288 -53092 -6853 56277 -22042 -46396 43673 23062 -56241 4464 53552 -30966 -37148
439 -37148 50302 12971 -55663 15346 47885 -39673 -28951 52972 803 -54875 24974 40723
451 40723 -46228 -17474 55183 -9047 -49146 35228 32401 -50768 -6820 53209 -21194 -43953
463 -43953 41063 21056 -52569 4642 49962 -28244 -32989 47321 12200 -49564 16056 43241
475 43241 -35984 -24008 47115 -1039 -47827 22606 33369 -41333 -14192 46681 -10022 -40804
487d0804P1486n454o7463L9201M6184o1884j4698O8061j9883n6884M8949L1884
499C8695o3490J543O2227l2481m4651N3860J6281o2461J4373N2816m2554l2026
511c7868N7408J686n7218K8365M3370m8467j6378N8193j1711n0577L8921L0462
523C6186n3987l102N3964k6418m1057M5534J5777n4372J1092M7414l6237k8532
535c3738N0571K237n0934K4908L8612m3362j4994N2043j0048m5047L4970K8254
547C3472m8456k319N0079k3989l8380M2627J4438n2542R827M4848l6119k9068
559c5582M9623K326n1422K4926M0122m3450j4950N4459r907m6627L6437L0472
571C6427n1046l322N2990k4625m1910M4705J7327n5773Q991M9663l5977l3551
$$ plain form
487 -40804 30682 25228 -42235 -3034 43150 -18734 -33432 34629 14746 -42138 6811 38695
499 38695 -24795 -23252 38975 6494 -38157 15703 31984 -30477 -16104 36712 -5842 -37868
511 -37868 19540 21226 -35992 -7627 35743 -12724 -29102 29091 17380 -33197 5724 36186
523 36186 -17801 -20903 33061 6643 -34414 11120 26897 -27475 -16383 31031 -5206 -33738
535 -33738 16833 19070 -31864 -6956 31656 -11706 -26700 25343 15295 -29752 5218 33472
547 33472 -14984 -17303 32776 8787 -29593 13034 27472 -25070 -15243 29605 -6514 -35582
559 -35582 14041 16367 -35055 -10129 29993 -13457 -28407 26052 16145 -30482 5955 36427
571 36427 -14619 -17941 35049 10424 -31486 13219 30546 -25227 -16236 33427 -2550 -36101
583c6101N1999N735n6061K1848M4670m4836k1520N6501o266n1889L4239L6714
595C5033n0742q843N7570j8379m6713M2906K5501n5623J810N3276k9892m0156
607c4252M7885J4167n7165J2779M9173l8605l0420N3561L371n4732K4324M3287
619C3373m4959k0288N6322o703n1764L4021L5688n0211r086N5822j7889m6037
631c1711M0896K5576n4274O49N2285k8442m0074M6250J4860n5109J1259M8131
643C0296l5259l0614N0690N780n1723K1406M2386m1023j9572N1457m956m7742
655b8874K9483L3063m5549j0104M9622j5144m2082L5501K2870m7200q9M5367k3911
668B953l4085L9623J2830m6197J0546M0301l0269k3979M3008L347m2653J9868
$$ plain form
583 -36101 15898 21633 -34428 -12580 32090 -12746 -34266 22235 15969 -35920 -1681 35033
595 35033 -15709 -24552 33018 14639 -32074 10832 36333 -19290 -17480 35796 5904 -34252
607 -34252 13633 27800 -29365 -16586 32587 -6018 -36438 17123 20494 -34238 -9914 33373
619 33373 -11586 -31874 24448 17745 -34019 2 35690 -14521 -23607 32215 14326 -31711
631 -31711 9185 34761 -19513 -18864 33421 4979 -35095 11155 26015 -29094 -17835 30296
643 30296 -4963 -35577 15113 20893 -30830 -9424 32962 -8061 -27633 23824 18868 -28874
655 -28874 609 33672 -11877 -21981 27641 12497 -29585 5916 28786 -18414 -18503 26864 2953
668 2953 -31132 8491 21321 -24876 -14330 25971 -4298 -28277 14731 18078 -24575 -4707
680d707L3478l5116j4379M2502p167l8224K6311K3705l8660m736L9279j6581l1177
693b5472L1213J3856l8365N196L5129k3316k2406L4408M768l5417J3871K8795
705B2260k7115j3720L4798l597l1596K0410K0909l0760m910L2716j3000k6535
717b0140K4983J2609l2293K906K9558j9106j9797K9160M516l0893J2319K5104
729A8926k4088j1652L1141l319k8482J8903J9464k9049m103L0954j2145k5154
741a8604K4566J1752l1686L631K9069j9823j9822K9562M218l2340J2449K6197
753A9169k5733j2582L3235l620l0498K0045K1491l0317n302L3802j1771k7737
765a9818K5985J4288l3721K248L2177j9489k3316L0580P327l5343R844K9920k5630
$$ plain form
680 -4707 28771 -6345 -20724 21778 14611 -23613 2698 26403 -12257 -16993 22286 5705 -25472
693 -25472 5741 19597 -18768 -13572 21557 -1759 -24165 10243 15011 -20406 -6535 22260
705 22260 -4855 -18575 16223 12626 -18970 1440 22349 -8411 -13321 19395 6395 -20140
717 -20140 4843 17452 -14841 -11935 17623 -1483 -21280 7880 12396 -18497 -6178 18926
729 18926 -5162 -16814 14327 11008 -17474 1429 20893 -8156 -12259 18695 6550 -18604
741 -18604 5962 17714 -13972 -10341 18728 -1095 -20917 8645 12863 -19477 -7028 19169
753 19169 -6564 -19146 14089 10469 -20029 16 21507 -8810 -14112 19690 7919 -19818
765 -19818 6167 20455 -13266 -11018 21159 1670 -21646 8934 16261 -19082 -9238 20682 -4948
778d948j7049L4208J75l4027J7453K6271l0299j0061L6390p711l1729K4388J9995
791B3056l4049k541L5200j5176k8427K9207J3039l6644M392L3594k1941k3112
803b3402L2780O020l5998J1636L0200k6592j6679L5633l75l4497J8514K5926l0368
816g202r746L5677p386l1394K2870J9686l2891l726L3795j4136k7379K6645J2989
829A7802l3539L036L1235j8759k2109K9807P593l2801R310K8439k2697j6075L1033
842A2275J310l0707J4537K3639k6040j0259L0740n238k8129J9175J7630k8574
854i641l826K9122j1158k4058K2603J1972k8667K450K7295j6078j8234K5508N544
867A2832k6890Q560K2902j9398j2342K5753n79k4956J3144J7742k2165o390K4348
$$ plain form
778 -4948 -21997 12211 12386 -21641 -4188 22083 -8216 -18277 18113 10402 -21327 3061 23056
791 23056 -10993 -13534 21666 6490 -21937 7270 20309 -16335 -11943 21651 -290 -23402
803 -23402 9378 15398 -20600 -8964 21236 -5356 -22035 13598 13223 -21274 -2760 23166 -7202
816 -7202 -16948 18729 11343 -20051 2819 22505 -10386 -14112 19683 5547 -21832 4813 17802
829 17802 -15737 -12701 18534 -225 -22334 7473 15066 -17735 -8425 20014 -2683 -18758 12275
842 12275 13585 -17122 -2585 21054 -4986 -15245 15495 10257 -17872 1303 18933 -9641
854 -9641 -13467 15655 4497 -19561 3042 15014 -13653 -11203 16092 14 -18220 7288 12832
867 12832 -14058 -5498 17404 -1994 -14336 11417 10838 -14118 -974 16768 -5397 -11787 12561
880A2561o389k1198J6863J1675k3079j28K2438j1691j6252J9578N755k1941N729
893f079J9029j5001j0521K0774N07k0031J0448J4752j7756m979K0032n562j7182
906a1569J3825R356j9475K66J8691j0552j3574J7395M386j9667O067J6429j4224
919b646q718J8962o92j8448J1047J2772j7080l750J9493o163j6138J4624Q475
932A1738j9297J124J8498j1212j3593J7792L761k0094O101J6829j4933r164J9974
945G524m79j9496J1067J4791j8271m810K1400n839j8250J5247J0346k0660l34
958g764K0882j0972j5842J8482O254k2407M784J9724j5134j2269K1180J720k2370
971a3732R737J8119j8560q383K3688k834k1785J4447J4722k1311l780K3322q161
$$ plain form
880 12561 6172 -15026 1837 13512 -9567 -9695 12743 1052 -15200 4378 10133 -11808 -6079
893 -6079 12950 -2051 -12572 8202 8709 -11322 -874 13878 -3878 -8857 11175 5613 -11569
906 -11569 2256 11612 -7863 -7597 11094 542 -13032 4363 8749 -10918 -4851 11578 -2646
919 -2646 -11364 7598 6906 -11542 -495 12277 -4803 -8553 10940 4777 -11361 3263 11738
932 11738 -7559 -6435 12063 851 -12742 5050 8811 -11283 -5182 11647 -3286 -12450 7524
945 7524 7045 -12451 -1384 13407 -4864 -9674 11726 5887 -12363 2884 13230 -7430 -7764
958 -7764 13118 2146 -13696 4786 11040 -11367 -6583 13141 -1993 -14262 6918 8638 -13732
971 -13732 -3995 14124 -4436 -12819 10869 8035 -13750 697 15419 -5892 -9672 13650 5489
984E489j9566J7330J0367k3240Q08K2357j2609j6640K0657O261k3573N461K0748
997A3850j5370j2862K2089K032k2685R530J8050j8239q540K2587k446k1102J2794
1010c12J4931k0185m779K2313o537j9053J5687J0808k1243m79K0915j0075j6112
1023a4121J7989O840k1181L687J9450j3354j2465J9254K980k0012P115J6702j5269
1036b385q680J9655j002j8682J0446J3203j6834m754J8926m906j6577J2891R463
1049A0764j7717p73J7603q375j3197J4629N655j7164L271J5358j0479r494J5606
1062E687J646j5909O625J2109j2445n616J5048k370j3838R143Q888j3557j878
1075f467J4360n680j1141J1275N109j3649J822J2571q545p726J2223J652j3144
$$ plain form
984 5489 -14077 3253 13620 -9620 -8812 13545 936 -15704 4953 11214 -12359 -6898 13850
997 13850 -1520 -14382 7707 9739 -12946 -3416 14634 -3605 -12145 10442 7996 -13106 -312
1010 -312 14619 -5566 -10345 11968 5431 -13622 2065 12873 -8370 -8849 12066 1991 -14121
1023 -14121 3868 10708 -10473 -6786 12664 -690 -13155 6099 9079 -10933 -3818 12884 -2385
1036 -2385 -11065 8590 7588 -11094 -648 12555 -4279 -9033 9893 4987 -11590 1301 10764
1049 10764 -6953 -7726 9877 1502 -11695 2934 8589 -8575 -5304 10054 -425 -9919 5687
1062 5687 7333 -8576 -1951 10158 -2287 -7903 7145 4775 -9063 80 8968 -4589 -6467
1075 -6467 7893 2213 -8928 2347 7456 -6193 -4371 8200 -345 -8071 4152 5804 -7340
1088g340N467J0014j0746l997J2569k454j1106Q102O836j1611p92J1832n522q918
1102g666J0488L476j2244L272J0322q265o349J1642L58j1979N810Q928j0664l261
1116f132J2014l265j0359Q612N948j1764K07J2006o434q643J0992L080j2819L662
1130b895J1124r452o266J2453J80j2624O338R631j1462l678J3531l104j2241R376
1144I11P477j3301r39J3741o231j0871J1876M936j4535K371J3394r011q869J3659
1158D608J957j4529N253J2375j1519o714J4976j053j4442Q203J0559j3610l646
1171g582J5062l737j3571J0749Q107j4752p65J5134o804j1526J2693N320j5304
1184f976K401J4008r275r468J3958K410j5392N085J2745j1755o625J4680m23j4270
$$ plain form
1088 -7340 -1873 8141 -2605 -6602 5967 3513 -7593 509 7345 -4266 -5058 6774 1252 -7666
1102 -7666 2822 6298 -5946 -2674 7648 -617 -6966 4676 5034 -6945 -1135 7793 -2871 -6132
1116 -6132 5882 2617 -7742 870 6818 -4946 -4739 7267 833 -7810 3182 6262 -6557 -2895
1130 -2895 8229 -1223 -7489 4964 5144 -7480 -1142 8489 -2973 -6651 6880 3776 -8465 911
1144 911 8388 -4913 -5852 7889 1658 -9213 2663 7599 -6936 -4565 8829 -182 -9051 4608
1158 4608 6565 -7964 -2711 9664 -1855 -8569 6407 5354 -9088 -885 9674 -3936 -7582
1171 -7582 7480 3743 -9828 921 9028 -5724 -6489 8645 1841 -9685 3008 8328 -6976
1184 -6976 -4575 9433 158 -9310 4648 7058 -8334 -3249 9496 -2259 -8884 5796 5373 -8897
1198h897P525J0743j2985l937J5045l288j3132R938Q084j3540j443J3977n593
1211B497j1379J1193N491j3858J225J2860p961q806J2190K608j3049L677J1197
1224G885q936o723J2481M42j2332N889R326j0212l930J2036k018j0780P254P045
1238G427j0848j612J1265m360q911Q533M289j0646R31R995o068p013R641K053
1252D676j0299L284Q305p185m351R481l88r054N368O158q214j759R141l014p288
1267e139O661L648q775P74P901m951n539P590J276q286L129O455o452l019Q164
1282C437j167o970M901M654p047p76P610l316n639O339K253p655J685O477n210
1297d24m297P571r8p651L906N552o792j886Q006k175o849N971L861p769J82P802
$$ plain form
1198 -8897 -1372 9371 -3614 -7551 7494 4206 -8926 1012 9096 -4444 -5887 8090 2497
1211 2497 -8882 2311 7802 -6056 -4831 8029 68 -8738 3452 6060 -6989 -3312 7885
1224 7885 -1051 -7774 4707 5149 -7183 -1294 8032 -2180 -6110 5926 3908 -6872 382 7427
1238 7427 -3421 -5033 6232 1872 -7039 1494 5783 -4863 -3932 6063 -5 -7018 2623 4676
1252 4676 -5623 -2339 5966 -1219 -5570 3911 3523 -5531 -163 5995 -2219 -3978 5163 2149 -5139
1267 -5139 1522 5170 -3605 -2831 5070 119 -5420 2170 3446 -4840 -1711 4744 -1708 -4727 3437
1282 3437 2270 -4700 201 4855 -2192 -2968 4642 1326 -4313 2026 4279 -3376 -1691 4786 -424
1297 -424 -4721 2850 2752 -4899 -993 4559 -2233 -4119 3887 1712 -5137 834 4695 -3074 -2892 4910
1313D910l933o052P526J907q531K374P299o325m278Q343K10q754M315O425p892
1328b456k372R328k164q243O210N317r059m21R247m022p282P775L569r709J398
1343b884R126o101o215R117J477j0141L445Q569p558m790R937m16r841N465P144
1358F334q828k782J0450k387r237P048N836r907q87J0697m396q366Q392M164j0502
1373d371J013J0008o072p288R478K046j0616L099Q836p416n259R922L32j0135
1387f423M943P848q378l380J0233j349r274O077O187q936j541R680l318p990P012
1402A391M335r588L26Q907m794o661P678K455q996J732Q047n757m773Q079R32
1417C313q092L579O648o477k908Q076p30p453M542N133p182j620P620k644o318
$$ plain form
1313 4910 977 -5075 2451 4358 -4173 -1799 5500 -825 -5103 3240 3450 -5304 -989 5436 -2456
1328 -2456 -4828 4500 2336 -5907 303 5620 -3439 -3860 5387 1365 -5917 1858 5427 -4282 -2884
1343 -2884 6242 141 -6074 3043 4520 -5621 -2176 6393 -1165 -5955 3982 3566 -6275 -810 6334
1358 6334 -2494 -5276 5174 2787 -6450 598 6434 -3473 -4360 6337 1941 -6425 1967 6131 -4371
1373 -4371 -3358 6650 578 -6710 2768 4814 -5802 -2703 6133 -1283 -6542 3380 3712 -6423
1387 -6423 -1480 6368 -2010 -5390 4843 3494 -5780 297 6484 -2452 -3993 5687 2369 -5621 1391
1402 1391 5726 -3862 -3536 5371 577 -6084 1594 4049 -4947 -3215 4832 -925 -5698 2381 3313
1417 3313 -4779 -1200 5448 -1029 -3937 4139 3409 -4044 498 5631 -1551 -3171 4449 1805 -4513
1432d513N021L438p148j05O622l570m855O134J440o463J870N614m259l067O182
1447B341L45n859L240M450n116j325N752j462n073L897K322n389r3M915k998l834
1463c887M463J059n342J701M408l769k062N070l72m461L399L061m323p22N075
1478C298k068l836M346J462n103J112M424l628k758M943j36n291K543L581m855
1493a966j248N259j659m630M195K785n384K70N401k634l927N237J577n902J872
1508g54N045m293k843N684j41n834K749M610n624j902O266j505o026M405L523
1523C360o272m38O341k495n244N441K932o866R53O609l814m276O260J454o942
1538b997K094O027n439l473P023k84p353L458N105o081k371O981r63o831M824
$$ plain form
1432 -4513 508 3946 -3202 -3307 3315 -255 -5110 1024 2464 -3999 -2129 3485 -774 -3841 2341
1447 2341 2686 -3173 67 4517 -599 -1924 3828 2366 -2707 1190 3512 -1877 -1970 2945 -53 -3887
1463 -3887 576 1635 -3707 -2006 2402 -1367 -3429 1641 1269 -3192 207 3268 -1055 -1777 3298
1478 3298 1230 -2606 1740 3202 -1901 -789 3635 7 -2751 2192 2056 -3235 -692 2889 -1966
1493 -1966 -3214 2045 386 -4244 -49 2736 -2648 -2378 3023 389 -3538 1699 3276 -2626 -754
1508 -754 4291 -2 -2845 2839 2698 -3136 -387 4223 -1401 -3303 2963 1458 -4568 -163 3360
1523 3360 -2912 -3350 2991 496 -4748 693 3625 -3241 -2288 4321 507 -3769 2491 3945 -2997
1538 -2997 -903 5124 -315 -3788 3235 2951 -4402 -944 4161 -1920 -4291 2690 1727 -5104 -280
1553b80M429o786r16P480k537o098N878L176p206L22P261l845n053O328J933p407
1569c321J673O231m773m235O704O95p231K759N625n438k913O789m59o465L878
1584d81M876o055j677O839j619n830M599L515o394k88O362k946m845N209J996
1599C261o179Q97N575l648l966N533R77n714K031M471l973k606N427ln110K586
1615d41L917m344j431N199j337m193L233K499m731j92M329k018l466L616J420
1630B060m665J168L815k819k106L892K81l856J692L248l396j302M024q48l290
1645b102K617J710l361p2L421j829k606L006R76l431R72K696k736j187L238n43
1661G69k869K054J864k938l77L256j356k351K802J037l418Q53K850k450j622L188
$$ plain form
1553 -280 4149 -2637 -3553 3927 1390 -4708 1170 4346 -2860 -2538 4723 878 -4175 2153 4086 -3321
1569 -3321 -1648 4583 -190 -4425 2279 2974 -4257 -1498 4127 -1311 -4224 2565 2106 -4359 -481
1584 -481 4395 -1660 -3337 3502 1883 -3947 652 4167 -2227 -2515 3847 901 -3944 1265 3261
1599 3261 -2918 -2021 3554 -94 -4060 1473 2450 -3264 -1233 3238 -735 -3341 2086 2083 -3027 -441
1615 -441 3476 -868 -2299 2900 1563 -2630 603 3102 -1629 -1821 2508 490 -2976 640 2060
1630 2060 -2605 -1437 2378 -441 -2547 1345 1626 -2230 -538 2710 -686 -1988 2036 1188 -2102
1645 -2102 515 2225 -1136 -1208 2213 384 -2222 784 1760 -1671 -699 1997 -739 -1926 1312 769
1661 769 -2100 -46 1818 -1120 -1497 1759 403 -1948 854 1891 -1527 -674 2176 -274 -1896 1292
1677A292j5l340J763K662l210q40L422q39l243K590J753l748N0L809k052k797
1693b743L622R89m213J332L710l148j914M096L03m394K163L430m043j435M666
1708B421j058m254L136K659m535m59M554j835l929L921J905m713L18M673k754
1723E0l207M280J246n075J309M683l528k697M920K28m954K377L958m175k129N265
1739B551o97m752K820L519m836j194N007j334m505L633K484m648k21M844k293
1754C78l778M299J690m996O99M662k960k850M422J266n169J313M169l298k589
1769b742M707J63n029K262L526m013j638M697p28m352K941K702m085o18M622j632
1785G83l488L128K086m198M3M104k074k858L456J100l986J255L118k650j860L529
$$ plain form
1677 1292 1277 -2063 -300 2362 -848 -1688 1734 895 -2348 242 1995 -1753 -1703 2106 54 -2743
1693 -2743 879 1868 -2345 -1013 2697 -451 -2365 1731 2034 -2360 -197 3233 -810 -2245 2421
1708 2421 1363 -2891 245 2904 -1631 -2090 2464 629 -3300 621 2526 -2187 -1869 2804 50
1723 50 -3157 1123 2369 -2706 -1397 3286 -242 -2939 1981 2209 -2745 -368 3590 -585 -2714 2551
1739 2551 1854 -2898 -78 3441 -1395 -2589 2418 1084 -3421 212 2696 -1952 -2173 2671 378
1754 378 -3400 899 2589 -2407 -1708 2954 -6 -2856 1566 2832 -2337 -1024 3145 -153 -2742
1769 -2742 1965 2128 -2901 -639 2887 -1126 -2764 1933 1205 -3147 -206 2496 -1589 -2207 2415 783
1785 783 -2705 423 2509 -1689 -1646 2458 384 -2474 982 2082 -1904 -649 2469 -181 -2041 1488
1801A488K08l730J714K583k872j423L621o14l131J902K003k910l92L074j101k510
1817b090K223J494l129M99K547j538j579K365N45k581R15K183j898j102K538m44
1833I48k317J513J235k255k18K101j042j575J769O38k267N70K058j550q76K017
1849G49J58k000J123J501k059p2K049j032j750K130N06k352O00J986j507j272
1865a242K279o0k428J106J743k135o49K521o23k356J942J512k786K23K514j403
1881A58j894K401Q52k986Q47K604k294j384K829K29l013J305K577k812j148L247
1897A518l75l107K077J841k853q54L483j269k804K658J501l322J06L403j739k488
1913b224K959J044l397P13L304k316k133L478K70l444J365K819k793j583L488
$$ plain form
1801 1488 1696 -2034 -320 2263 -609 -2032 1589 975 -2156 -254 1749 -1161 -1553 1521 420 -2090
1817 -2090 133 1627 -1502 -1003 1544 6 -1573 792 1337 -1244 -329 1854 -44 -1146 1392 948
1833 948 -1369 144 1379 -876 -1094 1007 -35 -1610 159 797 -1470 -900 1158 -392 -1268 749
1849 749 907 -1093 30 1531 -528 -600 1449 417 -1333 797 1303 -1049 -449 1537 30 -1242
1865 -1242 1037 977 -1451 -345 1398 -737 -1386 1135 512 -1844 98 1610 -1176 -953 1561 158
1881 158 -1736 665 1517 -1469 -622 1982 -312 -1696 1133 1362 -1651 -346 2231 -581 -1729 1518
1897 1518 1143 -1964 113 1954 -899 -1753 1730 461 -2343 315 1816 -1506 -1400 2003 264 -2224
1913 -2224 735 1779 -1618 -905 2399 83 -2050 1428 1698 -1746 -381 2438 -355 -1938 1550
1928A550j86l682J968K476l031j116L621q25l181K240K156l378l26L718j431k825
1944b252K836J628l569K98L440j824k309K864R71l528N50L057k339j913L134M08
1960A452l429J302K461k474j312L241l57k815J530K098k537p36L062p15k567J939
1976A43J713k697l08K946j328j874J951J029k300O6K315j473j827K269M25k527
1992a477Q31K024j793j073K114m9j950J188J479j863n54J959l14j708J535O89
2008A038j613J13J628q44j238J445M51j664L84J291j153p69J544l01j504J014
2024a78R15j395P7J300o40q77J208K77j328M87J169j066n67J069J28j597R60R42
2042H84j186j99J324o25j091J138N04j527K92J371j052o88J467j12j626J141J130
$$ plain form
1928 1550 1364 -2318 -350 2126 -905 -2021 1600 775 -2406 -166 1990 -1388 -1714 2004 573 -2252
1944 -2252 584 2212 -1357 -1059 2381 557 -1752 1112 2083 -1445 -895 2162 -177 -2090 1044 1452
1960 1452 -1977 -675 1786 -688 -2000 1241 884 -1931 -401 1697 -840 -1576 1486 771 -1796 143
1976 143 1856 -841 -1149 1797 469 -1405 546 1575 -725 -659 1656 183 -1644 625 1050 -1477
1992 -1477 -646 1378 -415 -1488 626 577 -1373 -185 1294 -569 -1123 836 522 -1186 349 1038
2008 1038 -575 -462 1166 322 -916 529 980 -684 -300 991 -162 -931 613 312 -1192 -178
2024 -178 737 -658 -581 719 79 -798 410 687 -641 -154 1015 -51 -618 451 579 -1018 -58 884
2042 884 -302 -501 823 198 -893 245 749 -778 -486 885 -167 -855 612 500 -1126 15 1145
2059A145j600m03J548l19j536J355R64j908o4J957r95j480J811N92k049J28K231
2076A377j476j187K052K30k030P07J830j647j230K356o8k323J420J442k153n81
2092a281K479p55k048J693J241k380r4K458j209j589J902J008k323J14K388j480
2108A24j554K314N19k618R53K105j801j493K483J8k494R02K025k326q89K663l35
2125E96k350J615J593k203n61K442n30k092J755J414k348j08K291j126j675J833
2141E46Q58k316J38K235j436j574K161L46k321P49J952j710j062K138Q4k159J016
2158c55J795j841p25K153m10j648J035J516k085k70K002n99j536J235Q13j741
2174f61J21J577r46j123J392M81j687M08J316j224o58J406O4j355O35Q72j015
$$ plain form
2059 1145 -455 -858 690 371 -1165 190 1154 -754 -818 1139 144 -1336 475 1067 -982 -854 1377
2076 1377 -99 -1286 766 996 -1034 -327 1503 -144 -1374 982 914 -1409 11 1453 -700 -1281
2092 -1281 1198 443 -1605 88 1329 -1051 -1145 1313 104 -1485 417 1425 -898 -784 1604 124
2108 124 -1430 884 1403 -1215 -262 1843 42 -1451 1032 1050 -1444 -542 1483 -843 -1732 931 596
2125 596 -1754 -139 1454 -749 -1310 1132 602 -1490 265 1679 -669 -777 1514 388 -1287 546
2141 546 1404 -912 -774 1461 25 -1549 612 958 -1363 -614 1338 -372 -1434 704 788 -1371 -355
2158 -355 1440 -401 -1126 1027 617 -1031 4 1520 -565 -835 1167 568 -968 267 1080 -661
2174 -661 -540 1037 91 -1032 360 841 -846 -438 878 -346 -1004 402 466 -889 -254 618 -397
2191c97l29J282j4j191Q58N48j089k3J034n87p09R03K13r78J21Q27o52m28Q79
2210B68l6r68O91M26p43n7P94m37l83N00K53q27L34O92n57l68R13j47r46Q00M36
2231F38r05j41J093o41q16J026K78j217L66P65m55q09J251k3j107N01R28r39m70
2250f77J291m54q25M82Q58j312KJ431n24j221J402M90j612M45J407j153r50J491
2268E71M27j691L26J392j210q55J575N2j549Q76J131j549m08J739m62j574J359
2285A50Q83j527o6J690p59j447J506O23j653J40J719r97j358J443P74k038M38
2302d79J466j179q21J500L14j792O30J414j491n54J688o9j698J056J132j650m39
2319i72J938k52j818J221R95j475l37J800n98j417J069Q45j854Q2J770r11j303
$$ plain form
2191 -397 -726 556 542 -649 209 757 -332 -355 679 92 -617 286 499 -479 -358 469 -183 -611 268
2210 268 232 -736 -45 381 -362 -419 375 -62 -445 55 308 -519 -185 507 -50 -418 495 348 -598 202 638
2231 638 -267 -408 685 44 -772 254 532 -685 -319 446 -9 -818 433 410 -697 -196 732 -207 -677
2250 -677 614 160 -665 -183 675 -637 -635 796 272 -949 453 943 -669 -224 1183 30 -920 571
2268 571 998 -693 -367 1025 -185 -1040 535 587 -962 -86 1045 -504 -912 827 365 -1209 150
2285 150 1033 -494 -560 1130 371 -1076 430 1053 -600 -460 1259 262 -1096 347 1121 -917 -479
2302 -479 987 -192 -1013 487 801 -991 -361 1053 -438 -992 696 627 -1071 -15 1117 -533 -972
2319 -972 966 714 -1104 117 1112 -363 -700 1100 502 -915 154 999 -855 -773 997 86 -1217
2336a217J411M92j459L37J286j000p01J177K54j194M27J104j244n23J434j28j104
2353f48N66J037j260l89J473l57j081P46N58j181J9J112l98r09Q64L14j037L01
2371b70Q30m72p28J024q4q14K96O11m91n30Q68j38o01M07N21o48k9O86k72m26
2391b60N56J40n96J06M79m31k70O06n2o71L98K73m09j81N71m19l60O87r8m23L06
2412d8M05n94R7M92l36k84L70K52m68j21Q50n16m85O11J90p73K79O00o87k42O68
2433B60q1q37M10N95o88k90J024k94o31M44N58q67l1J064m26r14J047M19j069
$$ plain form
2336 -1217 194 686 -773 -436 850 -150 -851 326 580 -614 -187 917 -327 -850 584 456 -648
2353 -648 -82 955 -305 -694 779 422 -659 87 645 -536 -517 595 197 -712 152 466 -571 -270
2371 -270 560 88 -640 384 300 -514 -218 393 -98 -628 240 102 -499 -92 429 -219 -248 438 166 -260
2391 -260 296 436 -160 -54 425 -6 -276 330 278 -393 5 278 -131 -312 259 -160 -520 167 69 -354 -48
2412 -48 357 -237 -140 352 16 -268 102 354 -114 -235 615 99 -386 225 415 -358 -79 521 -166 -408 260
2433 260 179 -658 -248 347 -341 -631 393 99 -532 -88 470 -397 -428 636 210 -704 343 762 -307
$$ [...]
8191D8
##END NTUPLES=NMR FID
##END=
