##TITLE=1H_PhBBCO604-2
 CDCl3
 8 sc, 
 7.04.2022
##JCAMPDX= 6.0         $$ Bruker NMR JCAMP-DX V2.0
##DATA TYPE= NMR FID
##DATA CLASS= NTUPLES
##ORIGIN= UXNMR, Bruker Analytische Messtechnik GmbH
##OWNER= root
$$ XWIN-NMR		Version 3.5
$$ Thu Apr  7 09:59:26 2022 Russian Standard Time (UT+4h)  she@DPX200
##.OBSERVE FREQUENCY= 200.131346
##.OBSERVE NUCLEUS= ^1H
##.DELAY= (6, 6)
##.ACQUISITION MODE= SIMULTANEOUS
##.ACQUISITION SCHEME= undefined
##.AVERAGES= 8
##.DIGITISER RES= 18
##SPECTROMETER/DATA SYSTEM= spect
##.PULSE SEQUENCE= zg30
##.SOLVENT NAME= CDCl3
##.SHIFT REFERENCE= (INTERNAL, CDCl3, 0, 15.7039)
##AUDIT TRAIL= $$ (NUMBER, WHEN, WHO, WHERE, WHAT)
$$ ##TITLE= Audit trail, XWIN-NMR		Version 3.5
$$ ##JCAMPDX= 5.01
$$ ##ORIGIN= Bruker BioSpin GmbH
$$ ##OWNER= she
$$ F:/spectra/data/she/nmr/H-F/1/audita.txt
$$ ##AUDIT TRAIL=  $$ (NUMBER, WHEN, WHO, WHERE, WHAT)
(   1,<2022-04-07 09:58:18.23 +0400>,<she>,<DPX200>,
      <created by zg, POWCHK disabled, PULCHK disabled
       configuration hash MD5:
       00 E9 B6 7A A2 85 ED C7 34 08 36 98 17 FE 4E 26
       data hash MD5: 16K
       87 51 3A 38 1B 5D 07 6C 78 A2 F4 C1 F6 73 94 87>)
$$ ##END=
$$ 
$$ hash MD5
$$ C4 E0 D1 59 B4 94 76 B9 B9 FB 69 8A 74 0C 4F FC
##$RELAX= 
##$RELAX= 
##$RELAX= 
##$RELAX= 
##$RELAX= 
##$RELAX= 
$$ Bruker specific parameters
$$ --------------------------
##$DU= <F:/spectra>
##$EXPNO= 1
##$NAME= <H-F>
##$PROCNO= 1
##$TYPE= <nmr>
##$USER= <she>
##$AMP= (0..31)
100 100 100 100 100 100 100 100 100 100 100 100 100 100 100 100 100 100 
100 100 100 100 100 100 100 100 100 100 100 100 100 100 
##$AQSEQ= 0
##$AQ_mod= 1
##$AUNM= <au_zg>
##$AUTOPOS= <>
##$BF1= 200.13
##$BF2= 200.13
##$BF3= 200.13
##$BF4= 200.13
##$BF5= 200.13
##$BF6= 200.13
##$BF7= 200.13
##$BF8= 200.13
##$BYTORDA= 1
##$CFDGTYP= 0
##$CFRGTYP= 5
##$CHEMSTR= <none>
##$CNST= (0..31)
1 1 145 1 1 1 1 1 1 1 1 1 1 1 1 1 1 1 1 1 1 1 1 1 1 1 1 1 1 1 1 1 
##$CPDPRG= <>
##$CPDPRG1= <>
##$CPDPRG2= <>
##$CPDPRG3= <>
##$CPDPRG4= <mlev>
##$CPDPRG5= <mlev>
##$CPDPRG6= <mlev>
##$CPDPRG7= <mlev>
##$CPDPRG8= <mlev>
##$CPDPRGB= <>
##$CPDPRGT= <>
##$D= (0..31)
0 1.2 0 0 0 0 0 0 0 0.06 0 0.03 0 0 0 0 0.0002 0 0 0 0 0 0 0 0 0 0 0 0 
0 0 0 
##$DATE= 1649311097
##$DBL= (0..7)
120 120 120 120 120 120 120 120 
##$DBP= (0..7)
150 150 150 150 150 150 150 150 
##$DBP07= 0
##$DBPNAM0= <>
##$DBPNAM1= <>
##$DBPNAM2= <>
##$DBPNAM3= <>
##$DBPNAM4= <>
##$DBPNAM5= <>
##$DBPNAM6= <>
##$DBPNAM7= <>
##$DBPOAL= (0..7)
0.5 0.5 0.5 0.5 0.5 0.5 0.5 0.5 
##$DBPOFFS= (0..7)
0 0 0 0 0 0 0 0 
##$DE= 6
##$DECBNUC= <off>
##$DECIM= 32
##$DECNUC= <off>
##$DECSTAT= 4
##$DIGMOD= 1
##$DIGTYP= 9
##$DL= (0..7)
0 120 120 120 120 120 120 120 
##$DP= (0..7)
150 150 150 150 150 150 150 150 
##$DP07= 0
##$DPNAME0= <>
##$DPNAME1= <>
##$DPNAME2= <>
##$DPNAME3= <>
##$DPNAME4= <>
##$DPNAME5= <>
##$DPNAME6= <>
##$DPNAME7= <>
##$DPOAL= (0..7)
0.5 0.5 0.5 0.5 0.5 0.5 0.5 0.5 
##$DPOFFS= (0..7)
0 0 0 0 0 0 0 0 
##$DQDMODE= 0
##$DR= 18
##$DS= 0
##$DSLIST= <SSSSSSSSSSSSSSS>
$$ [...]
##$SUBNAM2= <"">
##$SUBNAM3= <"">
##$SUBNAM4= <"">
##$SUBNAM5= <"">
##$SUBNAM6= <"">
##$SUBNAM7= <"">
##$SUBNAM8= <"">
##$SUBNAM9= <"">
##$SW= 18.0517287032376
##$SWIBOX= (0..15)
0 0 2 0 0 0 0 0 0 0 0 0 0 0 0 0 
##$SW_h= 3612.71676300578
##$TD= 16384
##$TD0= 1
##$TE= 0
##$TE2= 300
##$TE3= 300
##$TEG= 300
##$TL= (0..7)
0 120 120 120 120 120 120 120 
##$TP= (0..7)
150 150 150 150 150 150 150 150 
##$TP07= 0
##$TPNAME0= <>
##$TPNAME1= <>
##$TPNAME2= <>
##$TPNAME3= <>
##$TPNAME4= <>
##$TPNAME5= <>
##$TPNAME6= <>
##$TPNAME7= <>
##$TPOAL= (0..7)
0.5 0.5 0.5 0.5 0.5 0.5 0.5 0.5 
##$TPOFFS= (0..7)
0 0 0 0 0 0 0 0 
##$TUNHIN= 0
##$TUNHOUT= 0
##$TUNXOUT= 0
##$USERA1= <user>
##$USERA2= <user>
##$USERA3= <user>
##$USERA4= <user>
##$USERA5= <user>
##$V9= 5
##$VALIST= <valist>
##$VCLIST= <CCCCCCCCCCCCCCC>
##$VD= 0
##$VDLIST= <DDDDDDDDDDDDDDD>
##$VPLIST= <PPPPPPPPPPPPPPP>
##$VTLIST= <TTTTTTTTTTTTTTT>
##$WBST= 1024
##$WBSW= 4
##$XGAIN= (0..3)
0 0 0 0 
##$XL= 0
##$YL= 0
##$YMAX_a= 217131
##$YMIN_a= -210014
##$ZGOPTNS= <>
##$ZL1= 120
##$ZL2= 120
##$ZL3= 120
##$ZL4= 120
##$ABSF1= 10
##$ABSF2= 0
##$ABSG= 5
##$ABSL= 3
##$ALPHA= 0
##$AQORDER= 0
##$ASSFAC= 0
##$ASSFACI= 0
##$ASSFACX= 0
##$ASSWID= 0
##$AUNMP= <proc_1d>
##$AZFE= 0.1
##$AZFW= 0.1
##$BCFW= 1
##$BC_mod= 2
##$BYTORDP= 1
##$COROFFS= 0
##$CY= 11.3945322036743
##$DATMOD= 1
##$DC= 2
##$DFILT= <>
##$DTYPP= 0
##$F1P= 2.36226072786647
##$F2P= -0.459571619588291
##$FCOR= 0.5
##$FTSIZE= 0
##$FT_mod= 4
##$GAMMA= 1
##$GB= 0.15
##$INTBC= 1
##$INTSCL= 1
##$ISEN= 128
##$LB= 0.24
##$LEV0= 0
##$LPBIN= 0
##$MAXI= 10000
##$MC2= 0
##$MEAN= 0
##$ME_mod= 0
##$MI= 1.114404
##$NCOEF= 0
##$NC_proc= 0
##$NLEV= 6
##$NOISF1= 3.799351
##$NOISF2= 2.8
##$NSP= 1
##$NTH_PI= 0
##$NZP= 0
##$OFFSET= 15.70392
##$PC= 1
##$PHC0= -18187.7
##$PHC1= 14.40078
##$PH_mod= 1
##$PKNL= yes
##$PPARMOD= 0
##$PSCAL= 0
##$PSIGN= 0
##$REVERSE= no
##$SF= 200.130013532006
##$SI= 16384
##$SIGF1= 3
##$SIGF2= 2
##$SINO= 400
##$SIOLD= 16384
##$SREGLST= <1H.CDCl3>
##$SSB= 0
##$STSI= 0
##$STSR= 0
##$SW_p= 3612.71676300578
##$SYMM= 0
##$S_DEV= 0
##$TDeff= 0
##$TDoff= 0
##$TI= <>
##$TILT= no
##$TM1= 0
##$TM2= 0
##$TOPLEV= 0
##$USERP1= <user>
##$USERP2= <user>
##$USERP3= <user>
##$USERP4= <user>
##$USERP5= <user>
##$WDW= 1
##$XDIM= 8192
##$YMAX_p= 0
##$YMIN_p= 0
$$ End of Bruker specific parameters
$$ ---------------------------------
##NTUPLES= NMR FID
##VAR_NAME=  TIME,          FID/REAL,        FID/IMAG
##SYMBOL=    X,             R,               I
##VAR_TYPE=  INDEPENDENT,   DEPENDENT,       DEPENDENT
##VAR_FORM=  AFFN,          ASDF,            ASDF
##VAR_DIM=   8192,          8192,            8192
##UNITS=     SECONDS,       ARBITRARY UNITS, ARBITRARY UNITS
##FACTOR=    0.0002768,     1,               1
##FIRST=     0,             0,               0
##LAST=      2.2672688,     0,               0
##MIN=       0,             -210014,         0
##MAX=       2.2672688,     217131,          0
$$ Real data points
##PAGE= N=1
##DATA TABLE= (X++(R..R)), XYDATA
0@%%%%%%%%%%%qJ6j6J6j7K5l2M0m8N6p2Q8j04J20j36J60j89K14k45K84l25L69
33A96m17M70n30N98o70P49q36R32j038J151j274J410j559J720j897K092k305K538
51A330k796L081l398L753m150M602n120N717o415P249q264R524j1144J3316j6390
66i105K1108k9331M7642j59922M5566K13868k98938L4242K84686j11867k04956
77a67007K61508Q2840k61681N5440K46031j83757j46062K32899J4834k61345J00825
88b5475J88398j97760j01047K38170l5674k34216J30766J50893k22213m3406K38107
99H6543p2329j91852J80373J10261k15167K1037K26163j10187j40114K00646N0049
110A45423k16870N7544J72990j56005j05686J92175o647k02349R0084J39350j73303
$$ plain form
0 0 0 0 0 0 0 0 0 0 0 0 0 -8 8 -8 8 -9 16 -16 24 -24 32 -40 48 -56 64 -72 88 -101 113 -132 152 -173 196
33 196 -221 249 -281 317 -353 396 -440 492 -546 605 -669 741 -818 902 -995 1097 -1208 1330
51 1330 -1466 1615 -1783 1970 -2180 2422 -2698 3019 -3396 3853 -4411 5113 -6031 7285 -9105
66 -9105 12003 -17328 30314 -129608 -84042 129826 -169112 -134870 149816 37949 -167007
77 -167007 94501 177341 -84340 -28900 217131 33374 -112688 120211 135045 -126300 -25475
88 -25475 162923 -34837 -135884 102286 66612 -167604 -36838 114055 -108158 -151564 86543
99 86543 14214 -177638 2735 112996 -102171 -81134 145029 34842 -105272 95374 145423
110 145423 -71447 -13903 159087 3082 -102604 89571 82924 -119425 -29341 110009 -63294
121f3294o1973J96733m0140j74380J32406J12799j83710j5108J96486p7342j46683
132a24206J64339P4574j90956L2944J78600j20752j14067J75893K0479j87375
142i0527P0236J42877j50768p6270J75801k3443j69352J03419J12836j58831l0385
153i4407J75290n4023j42873J31290Q4276j64621Q023J67687q7994j20240J49527
164E1935M3119j72899M1391J47611j19543r0399J59716K730j65767P6500J22354
175I6748j38299n0209J62777l1002j42777J04562R0572j46161j2667J55020o0918
186B7646j18094J22835N6408j49545J9372J37631q9681r3085J32640K1135j46074
197g8812M7987J14834j10309o0502J38488r851j29882P7762R1224j19669k5821
$$ plain form
121 -63294 -125267 71466 31326 -143054 -10648 102151 -81559 -96667 99819 22477 -124206
132 -124206 40133 114707 -76249 -43305 135295 14543 -99524 76369 96848 -90527
142 -90527 -20291 122586 -28182 -104452 71349 47906 -121446 -18027 94809 -64022 -94407
153 -94407 80883 26860 -116013 15277 99553 -65068 -57045 110642 22648 -97592 51935
164 51935 95054 -77845 -36454 111157 -8386 -98785 60931 63661 -102106 -25606 96748
175 96748 -41551 -91760 71017 40015 -102762 1800 92372 -53789 -66456 88564 27646
186 27646 -90448 32387 88795 -60750 -41378 96253 6572 -86513 46127 67262 -78812
197 -78812 -30825 84009 -26300 -86802 51686 41835 -88047 -10285 80939 -38730 -64551
208f4551J34983l9195j10162R7592O2388j26386K395J23183o6057q9992J10028
219C4226L2189j28062K9716J09387q8230o7380J19124L916j22830N8564R3823
230G4443j05167l9011J26473k3072j11390Q3364P2616j16668j0821J24121n0336
241B4552r7891R8741M5995j22589J4473J12408p3634p7927J09061J9484j20431
252f7758L9377R8683q9715n2332J16622n740j11717O4106Q1162j01634k6538J17405
264F1921l0645r9547Q1888N8638j11153l125J10246n3772q3310R2922L2951j11528
276e4514K0944R7828p1508o1980J01665R399j05057M5140Q2853q5244l7031J05502
288D7997j3701r5182O4011O3721r5130j4561J02302l8000q3178P8075M0964r9518
$$ plain form
208 -64551 70432 31237 -78925 18667 81055 -45331 -42936 80247 14190 -75802 34226
219 34226 66415 -61647 -31931 77456 -10774 -78154 40970 44886 -77944 -19380 74443
230 74443 -30724 -69735 56738 33666 -77724 5640 78256 -38412 -49233 74888 24552
241 24552 -73339 25402 71397 -51192 -36719 75689 2055 -75872 33189 52673 -67758
252 -67758 -28381 70302 -19413 -71745 44877 39137 -72580 -8474 72688 -28946 -55484 61921
264 61921 31276 -68271 13617 72255 -38898 -42023 68223 14451 -68859 24063 57014 -54514
276 -54514 -33570 64258 -7250 -69230 32435 41834 -63223 -18083 64770 -20474 -57505 47997
288 47997 34296 -60886 3125 66846 -28284 -42845 59457 21457 -61721 16354 57318 -42200
300d2200P558R2342n6381o4694Q7267J9266r6722K9853Q0620o9856m2970R2067
312C6150k584q7991M8704O4987p8914k3308R1174k2748p8349O2662M5460q6583
324c1340k745Q5764m2187o5873P3455K6441q8593J7608P9237n8291m9314Q3546
336B7708P456q5454L7560O7814p0061l0880Q7300j1604q0340N2931N3230p9610
348b3950j2401Q4880l2059o9734O5465L4819q4464O525P9353m8095n5370P5809
360B0778J6409q3656K6731P0329o0289l7766Q0319j281p7677M2123N7452o9859
372a6387k1109P9759j9681o9119N3522L9813p4751l536P4478l5552n7411O3240
384A3266K3624p5670J5034O7717m9218m1898P0929P224p2608L1266N7968n9127
$$ plain form
300 -42200 -34642 57700 1319 -63375 23892 43158 -53564 -23711 56909 -12947 -55917 36150
312 36150 33566 -54425 -5721 59266 -19648 -42956 48218 25470 -52879 9783 55243 -31340
324 -31340 -34085 51679 9492 -56381 17074 43515 -45078 -27470 51767 -6524 -55838 27708
336 27708 35164 -50290 -12730 55084 -14977 -45857 41443 29839 -50501 2430 55660 -23950
348 -23950 -36351 48529 16470 -53264 12201 47020 -37444 -30919 48434 339 -55031 20778
360 20778 37187 -46469 -19738 50591 -9698 -47464 32855 31574 -46103 -3980 53472 -16387
372 -16387 -37496 42263 22582 -46537 6985 46798 -27953 -31489 42989 7437 -49974 13266
384 13266 36890 -38780 -23746 43971 -5247 -47145 23784 31008 -41600 -10334 47634 -11493
396a1493k6261P3758j0368o7496M4629M4163o6864j1049P0869k6239n8875N4329
408I103K9870p0532M657O6801l9139m6710O2600J4993o9434K0760N9919m9640
420f752l3259O7138J38o5769L4394M8632n8465j8709O7607j5515n9578M4745L5759
433D0366o3498m576O4992k8723n1164N3517K3427o4770R270N9706l9371l9315
445d0139N9563R617o3745K2683N1911m9036k6323O2395n649n9444L6000M1417
457C9250n6758j2053O2652j9533n2291M6366K8682o0561J911N9159l1267m2531
469c6974N2232J5522n9540J4648N1425m0947l1039N5252J824n6295K5916M1648
481C3672m7686j7544N6389j0958m9772L6732L1681n1053l986N4008k2416m1407
$$ plain form
396 -11493 -37754 36004 25636 -41860 2769 46932 -19932 -30981 39888 13649 -45226 9103
408 9103 38973 -31559 -26902 39899 760 -45950 16650 31643 -37791 -17031 42888 -6752
420 -6752 -40011 27127 27265 -38504 -4110 44522 -13943 -32652 34955 19440 -40138 4607 40366
433 40366 -23132 -27708 37284 8561 -42603 10914 34341 -30429 -21159 38547 -824 -40139
445 -40139 19424 29041 -34704 -12021 39890 -9146 -35469 26926 21277 -38167 -2167 39250
457 39250 -17508 -29561 33091 13558 -38733 7633 36315 -24246 -22335 36824 5557 -36974
469 -36974 15258 30780 -28760 -14112 37313 -3634 -34673 20579 22403 -33892 -7976 33672
481 33672 -14014 -31558 24831 13873 -35899 833 32514 -18539 -22525 31483 9067 -32340
493c2340M4009J9682n2851P445M8214l1909l1910M7339P032n1732J7785M0962
505C1726l9893k2123M9470m860m8104K8515L3050m5185r921N0712j4628m1334
517c2575L7863K3915m7770K809M8365k5569l3767M3154J1955m8978J2364M1539
529C3305l5113k5658M5726L15m7803K1635L4239m0687j4941M7018r310m2409L0895
542b788K7850m2891l563M6926j7917l4687L8503J7409m4778O660M1760k7701k7950
555b3167M1079M882m5856J5805L5206l6144j9060M3197m683m1876K5017K9064
567B3464l9678q557M4776j2785l6415L3114K1339m1656K185M2502k2120k9543
579b3374L7911J0956m3294J1003L6345l1222k1857M0276o93m1468J9208K9453
$$ plain form
493 -32340 11669 31351 -21500 -14055 34159 2250 -29660 17679 24711 -27021 -9236 31726
505 31726 -8167 -30290 19180 14320 -33784 -5269 27781 -17404 -27325 23387 8759 -32575
517 -32575 5288 29203 -18567 -15758 32607 7038 -26729 16425 28380 -20598 -8234 33305
529 33305 -1808 -27466 18260 18575 -29228 -7593 26646 -14041 -28982 18036 8726 -33683 -2788
542 -2788 25062 -17829 -21392 25534 7617 -27070 11433 28842 -15936 -9276 32484 4783 -23167
555 -23167 17912 22794 -23062 -7257 27949 -8195 -27255 15942 11259 -30617 -5600 23464
567 23464 -16214 -24771 20005 7220 -29195 3919 25258 -16398 -14213 28289 6169 -23374
579 -23374 14537 25493 -17801 -6798 29547 -1675 -23532 16744 16051 -25417 -6209 23244
591B3244l5107j2378M0332q278l5894K6669K3170l6643l071L9171j4979k9389
603b3153L1317J5200l7458M498L5962k2236k4502L4104N849l8154J2027L0014
615B3468k8841j7285L5467k089l5083J9233K4819l1897p727L6622r777k9985K6036
628B961J8215l3413R9L4714j6798k5900L0221J0713l5622O684L1035k3557k0021
641b0669L2411K434l4914J3996K6798k8272j2493L4254n346l0728K1973K0112
653A9556l0794l242L3359j2643k5535K6427J2652l2537L993L0113j9287k0657
665a8595K8500N312l1673R828K5475k3436j4621L0224j321k9501J6071K1124k6418
678i031o517L0129p862k5130K1480J5098k8041Q3K8315j4446k0664K4812P511
$$ plain form
591 23244 -11863 -24241 16091 7813 -28081 -1412 21758 -14885 -17956 21215 6236 -23153
603 -23153 8164 23364 -14094 -9596 26366 4130 -20372 13732 19581 -18573 -6546 23468
615 23468 -5373 -22658 12809 10720 -24363 -5130 19689 -12208 -19935 16687 6910 -23075 2961
628 2961 21176 -12237 -12138 22576 5778 -20122 10099 20812 -14810 -8126 22909 -648 -20669
641 -20669 11742 14176 -20738 -6742 20056 -8216 -20709 13545 8199 -22529 -556 19556
653 19556 -11238 -14480 18879 6236 -19299 7128 19780 -12757 -8764 21349 2062 -18595
665 -18595 9905 15217 -16456 -6628 18847 -4589 -19210 11014 9693 -19808 -3737 17387 -9031
678 -9031 -15548 14581 6719 -18411 3069 18167 -9874 -9791 18524 4078 -16586 8226 15737
691A5737k8739N933K4575j8953j5545K5860J443k7008J1714K0682k1911r423K6356
704A0721l612k3720J6362J6100k3608l240K5752r039k0355J9957R911k4661K856
717f576K2809j5083j5850K2166L496k4498Q155J9479j9042j0030K3892k275k2413
730a5770J3775J5828k1037m154K4010p325j9571J7993J1338k3270R01K2614j2681
743B651j6103K0741M947k4089O509K0043j7581j1679K2730p94k2924J2357J6659
756A3467k0590o116K4003n390k0170J6303J2875k2020j067K3104r849j7767J8845
769E628Q060k2749L276K0483j4424j3788K0448K840k2524P775J7690j7288r053
782a3626K1837k072k0703J2704J4420j8829m152K1397o005j7283J5461J0114k0083
$$ plain form
691 15737 -13002 -7069 17506 -1447 -16992 8868 10311 -16697 -4983 15699 -6212 -15635 10721
704 10721 7109 -16611 -249 15851 -7757 -10997 14755 5716 -14639 5318 15229 -9432 -6576
717 -6576 16233 1150 -14700 7466 10962 -13536 -5381 14098 -4944 -14974 8918 6643 -15770
730 -15770 -1995 13833 -7204 -11358 12652 5327 -14244 3749 15087 -8183 -7282 15332 2651
743 2651 -13452 7289 12236 -11853 -5344 14699 -2882 -14561 8169 7375 -15549 -3192 13467
756 13467 -7123 -13239 10764 5374 -14796 1507 14382 -7638 -8705 14399 4550 -13217 5628
769 5628 13688 -9061 -5785 14698 274 -13514 6934 9774 -12750 -4975 12715 -4573 -13626
782 -13626 8211 6139 -14564 -1860 12560 -6269 -10421 10976 4971 -12312 3149 13263 -6820
795f820L30J9775j0348j4288J6875N099k0006M444J6793j3408j0666J8073P56
808F609j8500Q518J3944j5618n662J8527l090j5951J1697J0366j6202j303J7429
821A0764p305j3375J4188N821j6936K727J4864j0729j0104J5406J823j6861O212
834c505J3203j3179o375J6261k103j4910R839J0333j4636k400J6270n599j2741
847i542J2706O373j5888J957J4943r736j0024J4253K448j6202N502J3246j2692
860b656p171J5963j162j5135Q921J0322j3864l124J5858m356j3156J1171P700
873I311j4698M46J4442p729j0422J2786L756j4711L306J2445r942p849J3553M54
887E148j3957O498J0311j1306m346J3375k349j1812Q764P851j2411j157J3185
$$ plain form
795 -6820 -6490 13285 2937 -11351 5524 10623 -9383 -4939 11854 -1554 -12220 5853 6609
808 6609 -11891 -3373 10571 -5047 -10709 7818 4728 -11223 474 10840 -5362 -6665 10764
821 10764 3459 -9916 4272 10093 -6843 -4116 10748 19 -10085 5321 7144 -9717 -3505
834 -3505 9698 -3481 -9856 6405 4302 -10608 -769 9564 -5072 -7472 8798 3199 -9542
847 -9542 3164 9537 -6351 -4394 10549 813 -9211 5042 7490 -8712 -3210 10036 -2656
860 -2656 -9827 6136 4974 -10161 -1240 9082 -4782 -7906 7952 3596 -9560 1611 9311
873 9311 -5387 -4941 9501 1772 -8650 4136 7892 -6819 -3513 8932 -1010 -8859 4694 5148
887 5148 -8809 -2311 8000 -3306 -7652 5723 3374 -8438 326 8177 -4234 -5391 7794
900G794n306r872J0563M402j2751J937J1598p967p771J1371J307j2397M827R370
914G105j0196m337J2110j908j0844P530P300j1051j159J2290m861r423J0069M615
928G240j1935J777J1144p374p469J1203J686j2579M168R955r801n055J1849j701
942C108j1339P170P677j1069k036J2295m034r851R768N204j1998J220J1741o620
956A236p921J0543K702j1900L356J0187q665o314J1507J79j1796N384Q432r990
970c060l772J1766k359j0671P844O664j0909o29J1606n165q462R723L869j1186
984d741J968R944o917o302J0098R07j0603M115Q097q036l999R591r64r301N644
999d99O255q816j963R603k939p905P097M513r434O42R099m995o457Q265K246r351
$$ plain form
900 7794 2488 -7384 3179 7581 -5170 -3233 8365 398 -7373 3998 5305 -7092 -2265 7105
914 7105 -3091 -7428 4682 2774 -8070 -540 6760 -4291 -5450 6840 1979 -7444 2625 7240
928 7240 -4695 -2918 8226 852 -6617 4586 6272 -6307 -2139 7816 -1985 -7040 4809 3108
942 3108 -8231 -1061 6616 -4453 -6489 5806 1772 -8079 1689 6893 -5105 -3885 7856 1236
956 1236 -6685 3858 6560 -5340 -1984 8203 -462 -6776 4731 4910 -6886 -1502 6930 -3060
970 -3060 -6832 4934 2575 -8096 -252 6412 -4497 -5126 6480 1315 -7147 2576 6445 -4741
984 -4741 -2773 7171 254 -6048 4050 4957 -5646 -1531 6566 -1470 -5469 4122 3158 -6143 -499
999 -499 5756 -3060 -5023 4580 1641 -6264 833 5346 -4088 -3446 5653 658 -5799 2466 4712 -4639
1015d639K938P706p089l975R053o31q636N113N816q109j509Q792l011p556O566
1030H29M042q473J78Q291m532n876P430K298q596K131P538n853m473Q406j53q408
1046e221M681O231q012j859Q917k653p371O679L829q713N54Q269m744n815P285
1061B057J722q242K454O858n887l932P571K48p503L711N538o620k000Q096j956
1076B115o946N683M082p631mP751m119n869P139K152q487K206O703n667m061P675
1092B722K8p682L827N600o539k117P783j780o579N418L972p226k60P430l372n647
1108d422O183K622p806J236P323n314m648P336O50p772L261O112o647k846Q054
1123C322j050p399N136M612p240o23P689l019o011N996L142p445O27P107m386
$$ plain form
1015 -4639 -1701 6005 -1084 -5059 3994 3363 -5273 -160 5656 -2453 -3962 4830 1819 -5737 829
1030 829 4871 -3602 -3424 4867 335 -5541 1889 4187 -4409 -2278 5260 -593 -5066 3340 3187 -5221
1046 -5221 -540 5691 -2321 -4180 4737 2084 -5287 1392 5221 -3492 -2938 5331 587 -5228 2057
1061 2057 3779 -4463 -2009 4849 -1038 -4970 2601 2849 -4654 -943 4595 -2025 -4025 4071 2115
1076 2115 -4831 852 4934 -2697 -2701 5050 931 -4938 2201 4353 -4134 -1928 4775 -892 -4953 2722
1092 2722 2750 -4932 -1105 4495 -2044 -4161 3622 1842 -4737 681 4653 -2573 -2833 4597 1225 -4422
1108 -4422 1761 4383 -3423 -2187 5136 -178 -4826 2510 3160 -4612 -1351 4761 -1886 -4732 3322
1123 3322 2272 -5127 9 4621 -2619 -3242 4447 1428 -4583 1413 4555 -2890 -2263 4844 458
1138D58m967O826J192p616K363O302n676l421P328l20p340M188N382o952j509
1153c762P652k088o305N632L563p402J16P345l797n504O594J686p511K010O199
1168D428n255l745O891K12o962L274N417o229j927P430j665o376N173L772o752
1183b314q9O867l255n327O057K183p251J471O077m896l708O434J11o716L125N015
1199C784n570k237O731j101n882M505L721o021m64O531k675m817N108K314o527
1214b600J206N715m158l896N899M01o257K413M736n070k492O321o31n991L850
1229e54M070n675p28O406k307m962N015K652o131N89N944l727m113N912Q83o624
1245c350K256N178n345k558O431q79o373M028M258o225r94O725k145n366N371
$$ plain form
1138 458 -4509 2317 3509 -4107 -1744 4558 -1118 -4539 2789 2469 -4871 -683 4699 -2253 -3762
1153 -3762 3890 1802 -4503 1129 4692 -2710 -2594 4751 954 -4550 2044 3730 -3781 -1771 4428
1168 4428 -827 -4572 2319 2531 -4431 -1157 4260 -1969 -3896 3534 1869 -4507 666 4438 -2314
1183 -2314 -2403 4464 1209 -4118 1939 4122 -3129 -1658 4419 -477 -4185 2249 2360 -4356 -1231 3784
1199 3784 -1786 -4023 2708 1607 -4275 230 3951 -2070 -2534 3997 1322 -3495 1613 3927 -2600
1214 -2600 -1394 4321 163 -3733 2166 2567 -3690 -1277 3459 -1611 -4103 2218 1587 -4404 -554
1229 -554 3516 -2159 -2887 3519 1212 -3750 1265 3917 -2214 -1625 4319 592 -3521 2391 3274 -3350
1245 -3350 -1094 4084 -1261 -3819 2612 1733 -4640 -612 3646 -2579 -3573 3152 1007 -4359 1012
1260A012K705o405O75O429l774m172N939J126o554K040N597n253l160O624n46
1275B283o569L684M395o201j377O898j989n897N066L420o456J73O503l213m627
1290c907N791J966o610J436N795m398l644O086L37o515K665N029n496k297O300
1305B538j124n928M191L855o169n70O637k462n055N401K435o449J111O171m020
1320E62m000N958P76o535K419N159n354k821O457q33o210L597M228n902j121O634
1336C014k192n372N201L025o444P92O351l656m173O004J276o702K084N519n045
1351c18l117O332n35o559L389M517n829j840O472j448n824M625L508o123l24O730
1367C656k834m743N584K193o444J269O191m341l885O320M16o567K625M801n496
$$ plain form
1260 1012 3717 -2688 -2013 4416 642 -3530 2409 3535 -3019 -979 4618 -635 -3795 2829 2283
1275 2283 -4286 -602 3793 -2408 -3785 3113 1124 -4773 293 3713 -2743 -2570 3933 720 -3907
1290 -3907 1884 3850 -2760 -1324 4471 73 -3571 2515 2852 -3663 -998 4031 -1465 -3762 2538
1305 2538 1414 -4514 -323 3532 -2637 -3207 3430 968 -4087 1314 3749 -2700 -1589 4582 562
1320 562 -3438 2520 3296 -3239 -820 4339 -1015 -3836 2621 1788 -4422 -825 3403 -2499 -3620 3014
1336 3014 822 -4550 651 3676 -2768 -1976 4375 719 -3454 2550 3826 -2876 -792 4727 -318
1351 -318 -3435 2897 2362 -4197 -808 3709 -2120 -3960 2512 1064 -4760 -135 3373 -2750 -3074 3656
1367 3656 822 -3921 1663 3856 -2588 -1319 4872 531 -3354 2966 3382 -3185 -560 4241 -1255
1382a255k527O294j112n950L797L753n842p00O347k381m849N134K595n855Q62
1397a689N734l288l752N655J081o201K152M944m845k575N753r97n870L509L568
1412C179n749j111O167k463m746M897K470n932R23N899l491l664N623J513o187
1427b672K249N329m874k793O438o90o228L365M252o041j658O518k238o065N030
1442g8L212o822K22O731l513m681O179K185o903J771O444m627l699O853L75o774
1458c125K976N285n660k755O675r85o589M014M110o541j362O928k353n855N348
1473A11L246o721L19O985l639m691O292J881o831J899N909m653l333O369J33o540
1489c264K753M861n516k230O373j408n959M209L518o039p20O391k541m747N177
$$ plain form
1382 -1255 -3782 2512 1400 -4550 -753 3000 -2842 -3542 2805 424 -4425 709 3304 -2551 -1689
1397 -1689 4045 757 -2995 2660 3741 -2460 -308 4636 -209 -2784 2969 1972 -3898 -389 3179
1412 3179 -2570 -3681 2486 23 -4723 174 2644 -3288 -2365 3534 43 -3621 2002 3515 -2672
1427 -2672 -423 4906 32 -2761 3677 2987 -3241 124 4376 -1665 -3323 3195 957 -5108 -78
1442 -78 3134 -3688 -3466 3265 -248 -4929 1250 3435 -3468 -1697 4747 120 -3579 3274 3649 -3125
1458 -3125 -149 5136 -524 -3279 3396 2411 -4178 -164 3946 -2595 -3957 2971 618 -5237 111
1473 111 3357 -3364 -3045 3940 301 -4390 1902 3783 -3048 -1149 4760 107 -3226 3143 3276 -3264
1489 -3264 -511 4350 -1166 -3396 2977 1569 -4390 -181 3337 -2702 -3422 2969 428 -4319 858
1504H58K346o166J039N932l754l630N795Q21o145K365M830m921k625O224q13n888
1520c732L553L916n947q90O222k320n150M814K803o371O82O061l488m206N948
1535A895J316o376K011N390m796k852O263k08o397L337M556n657j831O510j649
1550A512n719M481L557o454l05O571k816n196N404K404o627J163O110m170l859
1565c944O046Q54o370K555M999n038k568O235o69n907L485M009n521j185O095
1580C076j918n031M518K845n817J26N789l089m175N246J635o196J632N205m344
1595d98k927N642n2n809L124M171n240j539N869j534m884M142K894n627R5N693
1611C520k926m098M869J683n809J287N271m035l327N617M26n886K431M824n186
$$ plain form
1504 858 3204 -2962 -1923 4009 255 -3375 2420 3241 -2904 -539 4291 -630 -3255 2969 2156 -3732
1520 -3732 -179 3737 -2210 -3100 3122 802 -4348 466 3269 -3102 -2420 3641 153 -4053 1895
1535 1895 3211 -3165 -1154 4236 -560 -3412 2851 2643 -3754 -417 4139 -1518 -3349 3161 1512
1550 1512 -4207 274 3831 -2623 -2928 3643 827 -4369 1035 3439 -3188 -2025 4085 -85 -3944
1565 -3944 2102 2956 -3414 -859 4140 -898 -3466 2769 2100 -3807 -322 3687 -1834 -3019 3076
1580 3076 1158 -3873 645 3490 -2327 -2201 3588 499 -3676 1570 3205 -2991 -1359 3846 -498
1595 -498 -3425 2217 2165 -3644 -520 3651 -1589 -3128 2741 1207 -3677 465 3359 -2268 -2173 3520
1611 3520 594 -3504 1365 3048 -2761 -1474 3797 -238 -3565 2052 2478 -3408 -977 3847 -1339
1626a339k074O347j097n809M031L499n604o76O175k447n126N201K550o380O97
1641b052N966l733l910N751J093o413J921N409m639l241O222L3o223L080M656
1656C920n493j884O513j304n701M286L554n961n28O447k865m911N201K118o100
1671b708Q58N591l681l898N575J112o100J940M968m463k697N885k97n739L179
1686d75M106n051j511N961j497n160M216K957n739J25N514k889m043M886J432
1701B832n697J209N098l906k940N389J17n368K476M156m527j708N416q73n177
1716c503L595L276n212m60N688k307m434M492K012n514M91N276l445l456N136
1731A635Q49n740K041M490m218k320N508m61n026L030L769m940j172N624j586
$$ plain form
1626 -1339 -3413 2934 1837 -3972 59 3558 -2046 -2722 3453 1006 -4120 1081 3631 -2749 -2052
1641 -2052 3914 181 -3729 2022 3115 -3298 -1377 4032 -607 -3848 2374 2407 -3816 -736 3920
1656 3920 -1573 -3457 3056 1752 -3949 337 3891 -2070 -2598 3849 984 -3927 1274 3392 -2708
1671 -2708 -1850 3741 60 -3838 1737 2849 -3251 -1311 3657 -806 -3503 2382 2085 -3654 -475
1686 -475 3631 -1420 -2931 3030 1533 -3627 589 3546 -2193 -2068 3446 557 -3486 1400 2832
1701 2832 -2865 -1656 3442 -464 -3404 1985 2102 -3266 -790 3366 -1161 -2869 2547 1674 -3503
1716 -3503 92 3368 -1844 -2304 3384 1077 -3357 1135 3147 -2367 -1876 3400 -45 -3501 1635
1731 1635 2484 -3256 -1215 3275 -943 -3263 2245 1784 -3242 -212 3557 -1383 -2555 3069 1483
1746A483m726L905K632n134k02N327k576m080M604J619n590J084M887l746k975
1761c488N216L29n358K493M105m480j660N441j011m690L459K925m744o68N103
1776B972k052m160M215K024n206N49M849l284l108M721P44n248J883M218l938
1791h21k190N084l95m851K928L518m762q92N226j651m334L694K440n017J34N034
1807C145k582l809M510J350n184J282M497l584k738M895L92n134K207L995m397
1822a155j813N437r08m831L188L312m870p49N354k029m278M230K117n265O23M854
1838C217k818l539M641J034n253J585M519l823k506N005K6n084K526L715m538
1853a293j413N163j191m562L496K605m730j99M897k146l798M077J778m878P82
$$ plain form
1746 1483 -3243 662 3294 -1840 -2042 3285 709 -3371 1233 2852 -2738 -1654 3233 -513 -3488
1761 -3488 1728 2057 -3301 -808 3297 -1183 -2843 2598 1587 -3103 356 3281 -1463 -2131 2972
1776 2972 920 -3240 975 2999 -2207 -1658 3191 -93 -3201 1520 2264 -2984 -1101 3117 -821
1791 -821 -3011 2073 1678 -3173 -245 3273 -1489 -2381 2845 1194 -3140 554 2994 -2023 -1889 3145
1807 3145 563 -3246 1264 2614 -2570 -1288 3209 -375 -3113 1782 2174 -2960 -753 3242 -1155
1822 -1155 -2968 2469 1561 -3270 -82 3230 -1640 -2389 2965 936 -3342 888 3005 -2260 -1637 3217
1838 3217 399 -3140 1501 2535 -2718 -1133 3386 -437 -2943 2062 2088 -2996 -470 3245 -1293
1853 -1293 -2706 2457 1266 -3296 200 2805 -1925 -2124 2773 627 -3171 906 2684 -2194 -1412
1868a412M483l014k874M427P61m873J744L915l632k156M769m17m687K545L296
1883B875m340j109M805j347m154L591K302m590J12M678k356l296M050J287m593
1898b085J021M360l286k561M387K87m588K047L384l856j586M528q08m296K799
1913b53K765m345n22M789j931l490L686J811m490N00M325k457k910M114O63m459
1929b204J464L795l411j974M214k79m132K153K949l797j169M302j176l685L049
1944I9K123m065N1M081j904l088L587J553m323Q85L949k897k364M118L02m248
1960b141J637L319l512j602M167p71l841K554K575l903o13M288j645l381L424
1975E55J719m073L39L977k236k721L867P73m222J332L464l068k061M004k3m018
$$ plain form
1868 -1412 3071 57 -2817 1610 2371 -2502 -758 3157 -475 -2631 2138 1721 -2966 -421 2875
1883 2875 -1465 -2574 2231 884 -3270 321 2623 -1967 -1855 2823 467 -2829 1221 2508 -2085
1898 -2085 -1064 3296 10 -2551 1836 2123 -2465 -418 2966 -890 -2476 2052 1244 -3052 -253
1913 -253 2512 -1833 -2355 2434 503 -2987 699 2510 -1980 -1480 2845 388 -2522 1592 2255 -2204
1929 -2204 -740 3055 -356 -2330 1884 1605 -2527 -374 2575 -1222 -2391 1911 735 -2950 99
1944 99 2222 -1843 -1792 2289 385 -2703 884 2437 -1886 -1001 2948 51 -2313 1805 2107 -2141
1960 -2141 -504 2815 -697 -2299 1868 1097 -2744 -190 2385 -1518 -2131 2157 512 -2869 555
1975 555 2274 -1799 -1460 2517 281 -2440 1427 2200 -2022 -690 2774 -294 -2355 1649 1626 -2392
1991b392K110K798l680r85M234j032l853L016K039l874o4L964j779l117L458J325
2007B168m026P50L575k496k285L642N15l991J526L153l199j549M008m80l825K479
2023c5K508l726o83M004j277l380L036J754l921L89L654k076k673L480Q59l887
2039a974J135L360k862j949L871j4l822J806K903l414j199M017p65l580K613K229
2055B355l580n17L911j509l055L215J310l780M00L609k363k290L335O57l708J090
2071i20L244k798j841L748j57l423J833K667l184r63L713q44l281K466K008l452
2087a184k91L490j440k821K853J377l557L93L257k147k246L252N83l414J187K757
2103B049k481j467L218j71l039J768K260k998o21L389j205k610K327J471l142
$$ plain form
1991 -2392 -282 2516 -1164 -2149 2085 1053 -2800 216 2255 -1619 -1683 2281 502 -2615 843 2168
2007 2168 -1858 -1108 2467 -29 -2314 1328 1843 -2148 -622 2531 -668 -2217 1791 1311 -2514 -35
2023 -35 2473 -1253 -1936 2068 791 -2589 447 2201 -1720 -1331 2323 247 -2426 1054 1913 -1974
2039 -1974 -839 2521 -341 -2290 1581 1567 -2255 -449 2454 -960 -2159 1858 1093 -2487 126 2355
2055 2355 -1225 -1742 2169 660 -2395 820 2130 -1650 -1250 2359 -4 -2294 1041 1698 -2010 -920
2071 -920 2324 -474 -2315 1433 1276 -2147 -314 2353 -831 -1794 1919 1075 -2206 260 2268 -1184
2087 -1184 -1475 2015 575 -2246 607 1984 -1573 -1180 2077 -70 -2316 936 1519 -1895 -708 2049
2103 2049 -432 -1899 1319 1148 -1891 -123 2137 -861 -1482 1907 702 -1908 419 1890 -1252
2118a252J95K956j731k011K709O11l098Q11K670k241j577L086j58k844J514K316
2134A956k807o77L195r52k559K237J509l067nL067j648k198K775Q47l229P77K760
2151A981k127j786L061J95l158J337K492k641j111L041k90k956J825K085k925
2166i77n09L274r99k873K555J496l200l4L143j563k328K755Q58l108P48K735k077
2183a04j630K805K31k977J264K307k466j193L004l45k792J732J861k570n87K944
2199A484q14k509K117J279k783O9K777j407j944K499N06k555P20K390j901j421
2215a493K575Lk643J316J856k349o85K568o30k216J846J248k433o1K569j229j870
2232a628K091Q82k593P21K132j651j455K508K51k669J220K030k448q21K621o40
$$ plain form
2118 -1252 -1057 1899 168 -1843 866 1477 -1621 -810 1860 -381 -1958 1128 970 -1874 -360 1956
2134 1956 -851 -1528 1667 715 -1844 393 1902 -1165 -1170 1897 249 -1949 826 1673 -1556 -779 1981
2151 1981 -146 -1932 1129 1324 -1834 -497 1995 -646 -1757 1284 994 -1962 -137 1948 -977
2166 -977 -1486 1788 789 -2084 471 1967 -1233 -1267 1876 313 -2015 740 1598 -1510 -762 1973 -104
2183 -104 -1734 1071 1302 -1675 -411 1896 -570 -1763 1241 896 -1896 -164 1697 -873 -1460 1484
2199 1484 670 -1839 278 1557 -1226 -1157 1620 213 -1731 768 1274 -1281 -561 1829 -72 -1493
2215 -1493 1082 1085 -1558 -242 1614 -735 -1420 1148 518 -1698 148 1396 -1037 -1098 1471 242 -1628
2232 -1628 463 1345 -1248 -527 1605 -46 -1501 1007 1258 -1411 -191 1839 -609 -1430 1191 551
2248E51k301J639J674k544l30K586q92k098J962J203k602J66K508j361j731K206
2264F36P69k664O23K451j946j355K615J47k748J178J915k198j003K643l08k387
2280a632J499J635k336n14K590q65j944J850J120k329J51K212j146j633K009N71
2296A238k308O08J840j451j186J978J25k176J118J468j939m16J995m79j747J403
2312G1J164j974n1J944j026j375J718N86j986M06J743j303r04J747Q4j897R05
2329a48J368j691n89J926m09j774J373J081j961j07K098j012j368J677P19k105
2345i22L65J975j385j168J834K60j982P39J552j571r81K068p9k137J225J470j839
2362e76n36K126n61j789J503J074j860l02K079p56j719J678P65k047K70J951j265
$$ plain form
2248 551 -1750 -111 1563 -981 -1311 1275 383 -1715 247 1450 -1152 -986 1522 161 -1570 636
2264 636 1405 -1259 -636 1815 -131 -1486 1129 1276 -1472 -294 1621 -577 -1580 1063 755 -1632
2280 -1632 -133 1502 -834 -1348 1242 377 -1567 283 1403 -926 -775 1437 291 -1342 667 1238
2296 1238 -1070 -462 1378 -73 -1259 719 844 -1332 -214 1254 -685 -1101 894 415 -1332 71
2312 71 1235 -739 -790 1154 128 -1247 471 1057 -929 -523 1220 -83 -987 760 844 -1053 -148
2329 -148 1220 -471 -1060 866 457 -1317 56 1137 -824 -931 1167 155 -1213 464 1183 -922
2345 -922 -557 1418 33 -1135 699 959 -1023 -284 1268 -303 -1284 784 705 -1432 -207 1263 -576
2362 -576 -1112 1014 453 -1336 167 1241 -619 -921 1158 402 -1317 361 1126 -921 -651 1300 35
2379C5j315J831L73j992N71J643j394j138K088j8j867R40J406j569n71J916m26
2396E13j657J228J168j803j91J872q62j318J349N56j628K76J553j040j094J697
2412F19J04j617O56J195j314p00J738k65j417R15J129j593k18J726o58j365J336
2429B71P02j642K06J481r75j104J606K47j743O65J345j320o02J480m9j574Q66
2446a40J135j422o13J766k01j582J067J027j470k33J617o37j291J255O55j629
2462f96J39J415p54j108J441M71j722M42J380j156p08J344L8j334N63J090j116
2479b71o00J423k76j322J136P73j487k0J441n67j055J064O37j383K34J253r76
2496Dp34J225J30j273M11R37r05n60J254j96j213Q77P11j135o8J071m15r04J012
$$ plain form
2379 35 -1280 551 924 -1068 -497 1146 -248 -1386 702 684 -1183 -243 1163 -406 -977 939 513
2396 513 -1144 84 1252 -551 -742 1130 268 -1050 299 855 -773 -497 1056 16 -1078 619
2412 619 723 -894 -238 957 -357 -1057 681 416 -1001 -86 1043 -550 -768 958 300 -1065 271
2429 271 973 -669 -463 1018 43 -1061 545 792 -951 -286 1059 -261 -863 617 568 -1006 -140
2446 -140 995 -427 -1040 726 525 -1057 10 1037 -433 -666 951 314 -977 278 933 -696
2462 -696 -557 858 104 -1004 437 908 -814 -372 1008 -148 -856 488 526 -808 -245 845 -271
2479 -271 -871 552 276 -1046 90 863 -624 -644 797 230 -825 239 876 -507 -273 980 4
2496 4 -730 495 625 -648 -237 700 -205 -765 489 293 -920 -43 668 -467 -535 536 121 -783 229
2515B29M16j084J13J185q14p73J203J55j257M30J062r68m43J078j40j222O74Q39
2533F83j042k20J176m28j084R16O44j204OJ204n68q95J138L84j332L29J252q08
2551A51r24J235K84j387M82J042j079n40J300j01j261P13P55j133k33J135j50
2568B89j180Q97O64j134r8J229m37j022R45N95j236K00J047o41p30R64K64j077
2586d61L01Q21p53m41R05Qr81N67O68q77k88J042k57j024Q38M09r63M1J012n08
2606E9o71Q78K41j040L48Q80p22l90Q52K2r33L63Q25r29k16Q40j31q26N24N46
2626E20r14q6R34l16q10Q56L57j028P9Q88n18n88R66J58r65J85R54o45n24Q74
2646C77N6r76M02P60o73m63R07j61q04N67N49q22m8Q04m13o73O83M25r02J48P33
$$ plain form
2515 229 645 -439 -326 859 45 -728 475 630 -627 -197 865 -103 -546 532 392 -830 -156 683
2533 683 -359 -579 597 169 -915 1 645 -559 -553 651 83 -812 326 710 -622 -293 959 151
2551 151 -773 462 746 -641 -159 883 -196 -736 564 463 -798 -85 670 -463 -696 439 289
2568 289 -891 6 670 -464 -562 667 230 -792 153 748 -488 -288 759 118 -612 352 616 -461
2586 -461 -160 661 -92 -533 372 380 -601 -34 634 -243 -531 511 254 -770 68 477 -486 -445 567 59
2606 59 -612 266 507 -533 -185 695 -27 -417 435 457 -476 -113 712 -217 -433 407 276 -550 -26 520
2626 520 -394 -480 454 138 -672 184 541 -487 -408 480 -38 -626 340 498 -467 -282 672 27 -497 377
2646 377 433 -543 -141 619 -54 -517 390 229 -575 -8 541 -281 -329 475 62 -611 72 497 -405 -257 476
2667D76l71m71N05L28p35J04O66m63l89O66J78r09L39N40n77j39N93j58n44M02
2687D1L85o70n3O95l10m98M26L22p50O8P84m70m61P72L8n78J93N93n77k25O68
2708C93j55o09M28L89o17q1N41j67n95M98K79o97J01O07l31m34N44J67o17J64
2728a92N93l97l23O60q8m88K65M66o00j56O12m2p57O56O8n44J28M40j78m70M46
2749I9J63n79N1N48l21m88O24K31o30J15O02m67k13M23J25n25K15M96n89k26P00
2770C54j13p13N06J93m44j7N99k88m39M75K96n30j70O40l30l16M27J42n34J01
2790a61M85l91k35N71Po63L02N20n11k30N71k6o17L95L38m50j89M88o8l99L27
2811F4J58m50PL66q4l87M23J35n22J58L90l14j76L13J62l63j2L89l30j74L72J0
$$ plain form
2667 476 105 -366 139 467 -268 -164 502 39 -350 316 494 -415 -76 464 -113 -252 341 183 -361 41
2687 41 426 -244 -297 398 88 -410 16 338 -412 -344 440 -30 -491 281 319 -259 -66 527 -50 -275 393
2708 393 238 -371 57 446 -171 -252 289 122 -473 25 304 -393 -292 315 -16 -450 94 261 -356 -192
2728 -192 401 4 -319 341 253 -235 30 496 -104 -260 352 310 -447 209 277 -267 -139 301 123 -347 99
2749 99 262 -317 -266 282 -39 -527 97 328 -302 -187 415 -52 -265 158 283 -242 -27 469 -120 -346 354
2770 354 241 -472 34 227 -217 -234 365 77 -362 113 409 -121 -291 349 19 -297 130 272 -262 -161
2790 -161 324 -67 -302 269 276 -387 -85 435 -76 -306 265 239 -378 17 355 -95 -284 204 136 -263 64
2811 64 222 -228 -221 145 61 -326 97 232 -290 -132 258 -56 -232 81 243 -120 -132 257 -73 -247 125 135
2833A35k77J58J44j93m8L31o7l80K36J34k21j24L55j08l20L01J20l13o0K80j38
2854e5j28K55m2k12J98R8j97l6L23q2k13K36l6j52j66M71k15k02K49J57l75k0
2876a44L36k19j36K46j5k56O2L72k52l56L83Q5k44N7K39k10j42K72O9k80J93K04
2898B64l23o9K34kl26K57J35l10P2J22L4k18L9J69l34k4L17k7j99J92J34j69o9
2921a01K95l5l11K94R1l63J44K02j53j58J84Q9k85L2J76j24j42K06j26q7Q2J98
2943A08j22j34K81j06j65J14J99j64p8J96j37m2J80Mj48J12m9n0QJ62j87j49J35
2966c2J7r5J24N9o5k49L16m6j93M3K38j57o2K38n2k21J31K45k47j5K17o4l11K14
2990C3J64j38k75L88j23k43J88K7j53j23L41o8j75J62J79l48M7L07o8k42J99J34
$$ plain form
2833 135 -142 16 160 -33 -81 250 183 -197 39 173 -48 -172 183 75 -245 56 176 -137 -197 83 -55
2854 -55 -183 72 30 -182 16 114 -83 -119 204 122 -91 145 109 -43 -209 262 47 -155 94 251 -124 -144
2876 -144 192 -27 -163 83 68 -188 -126 246 -6 -362 21 106 -138 -81 158 -52 -194 78 147 -133 60 264
2898 264 -59 -128 106 104 -222 35 170 -140 -68 54 88 -130 -91 78 -256 -280 37 10 -189 3 137 -32 -101
2921 -101 194 159 -152 142 233 -130 14 216 63 -95 89 178 -107 -75 101 -23 -165 41 -85 -172 -90 108
2943 108 -14 -148 133 27 -138 -24 175 11 -67 129 -8 -50 130 134 -14 98 49 -1 7 169 -18 -167 -32
2966 -32 -15 -110 14 73 8 -241 75 29 -164 -121 117 -40 -102 136 84 -137 -6 239 -8 -23 194 130 -181 33
2990 33 197 59 -216 172 49 -194 -6 21 -132 -255 86 18 -157 5 184 -164 -117 190 122 -120 79 213
3012B13k97p0M13j28k60K34J02l12K5K88j32k76J83J09j84j40L14j63k30J67K49
3033A05j46m2K60j36k91L44J16k03p0L76l08p1J32l9kp1J90k41l0J48M9l01K50
3056A9m2j07P2O3j3j74J77O8j18J6J33j23l3R0J05j84K8O4Rj77K82j55j60K73
3080A13q2p8J02N8m3j71P4P9j38J03J73r7k51K24J47k92Q7J52k73j23K83K0k47
3103a80J22J76j80k56L25R2k97J94J85k56J3K45l7k81K77N1k28m0K61m1k42N2
3125d5L10m22o1L31q9k88L08N1k97pL16k01r7L25L5k01l6K78j68j27L53j98j42
3148g2J84M3j01j74K45q6j47J5J32k23N4J20p8j59J82J51k22M8J44q9oJ37m0j68
3172a10J17J78k67L2J97q7k79L07R2l14O6J02N3l47K76P9l44J99K70k27k83L71
$$ plain form
3012 213 -84 -154 259 131 -129 105 207 -105 -80 208 76 -200 -17 92 -92 -232 82 -81 -311 -144 105
3033 105 -41 -83 177 41 -250 94 210 7 -63 313 5 -66 66 27 25 -46 144 -97 -127 21 70 -231 19
3056 19 -23 -130 -58 5 -8 -182 -5 63 -55 -39 94 -29 -62 28 133 -51 -23 41 50 -127 155 0 -160 113
3080 113 31 -47 55 113 70 -101 -27 52 -86 17 190 93 -158 66 213 -79 8 160 -113 -236 47 67 -180
3103 -180 -58 118 -62 -318 7 99 -198 -4 181 -75 -62 183 146 -135 142 193 -35 -75 186 145 -97 -45
3125 -45 265 -157 -218 113 24 -264 44 95 -202 -209 107 -94 -191 134 169 -32 -68 210 42 -85 268 70 -72
3148 -72 112 155 54 -120 125 39 -108 -93 39 -184 -130 -10 -88 -247 -65 86 -136 -88 56 -33 -39 98 58 -110
3172 -110 7 185 -82 -50 147 60 -219 88 180 -134 -68 34 87 -260 16 95 -249 -50 220 -7 -290 81
3194H1O8k85J47J28j79j30L19Qk38J75J30k12j39K46J45l98J85K04k90q3K14Q
3216A04l84L80P2k99m1L34j17k05K43M4k97L1L54k17k02L68K6k93O6K69l37m8
3238a49M37p9m44J85K09k04j55M00k29j08J42J43l62O7K98n3k63J69J42k22m2
3259a18J67r5j74M32j81k17R9K38j35j87K96L2k75N1L11l69p2L45q1k27K77M3
3281A60l62J03K35j64j90K91N7l88J33L32l38j62M49Nl05j0L57k80j05L96p9l42
3303b07K72J48k57LK62j82k85K16L11m64Q4K51j49k88L70M4l52Q7K31j26k25K92
3325C6J31l24J21J86j49k1K13j4l23J83L7j08r2L44j42l47L10J11l44P6L03k44
3347e7j19K69l8k29J29K96m35N7L07j24j96K10J68k91p0K73L9l21J80J88l31L8
$$ plain form
3194 81 149 -136 11 139 -40 -170 149 157 -81 94 224 12 -127 119 264 -134 51 255 -35 -118 96 104
3216 104 -280 100 172 -127 -168 166 49 -156 87 131 -166 -135 219 2 -200 168 194 -99 -33 236 -101 -149
3238 -149 288 209 -235 -50 159 -45 -200 200 -29 -137 5 148 -214 -147 151 98 -165 4 146 -76 -118
3259 -118 49 -46 -220 212 31 -186 -87 151 16 -171 125 157 -118 -67 244 -125 -197 148 67 -160 117 160
3281 160 -202 -99 136 -28 -218 73 130 -258 -125 207 -131 -293 156 161 -144 -154 203 -77 -182 214 135 -207
3303 -207 65 213 -44 -41 221 39 -246 -30 281 -183 -99 152 3 -285 85 129 -223 -136 95 -31 -256 36
3325 36 167 -157 -36 150 1 -20 193 179 -144 39 76 -32 -124 220 78 -269 41 152 -192 -116 187 -57
3347 -57 -176 93 55 -174 -45 251 -184 -127 180 56 -140 70 238 -53 -123 150 189 -132 48 236 -95 -57
3369e7K43j64k01K72J53m43Q1K49k66r5K87P6l83J50L34k97l9K55j4l64K43K83
3391C03k83k59M84j00l69K91J28l53M0K90j89l26L29J53m04R0L60k14k96M20M7
3412A42l87J07M50m50p9M30j37l34L19K60l98q6M50k75k14L33J65m17j5L52j67
3433D9k94L20J40m73J04L09j60k98M47j9l59J23L25l00k39M43l6k42J69K17k32
3454fk00N01k24k97L37Q2k38q7L04j54l30L51J94l97ML67l14o5K41O2l77J24L79
3477B57l88q6M14o0l05J38L10l49r6L84k06j64K46O9k60r4K90r2k75L50P0k59
3499a06M6K10l11j27M16n0l20J19K83k60RL21j38k80K84J60m09R2L90k71l48L08
3521A8K62l44m7L37l38k3K92p2k60K00K17k93j57M18l9n05L21J81k47j59M31p3
$$ plain form
3369 -57 186 22 -179 93 246 -197 -116 133 -133 -228 59 135 -248 -98 236 -61 -100 155 141 -223 20 303
3391 303 20 -239 245 145 -224 67 195 -158 -118 172 -17 -343 -14 139 -265 -175 185 -29 -325 95 142
3412 142 -245 -138 312 -138 -217 213 76 -258 61 321 -77 -163 287 12 -202 131 296 -121 -136 216 49
3433 49 -245 75 215 -258 -154 155 -5 -303 144 125 -234 -111 214 -86 -325 118 82 -160 9 226 -6
3454 -6 -206 295 71 -226 111 193 -45 -132 172 18 -312 39 233 -164 -160 207 -107 -172 69 131 -246 -122 257
3477 257 -131 -217 197 137 -168 -30 280 -69 -165 219 13 -151 95 164 -96 -190 100 8 -267 83 153 -106
3499 -106 -60 150 -161 -288 128 78 -242 -123 160 -100 -91 230 92 -188 96 256 -153 -61 329 58 -290 18
3521 18 280 -64 -111 226 -112 -135 157 85 -175 25 242 -51 -208 210 171 -334 -13 168 -79 -238 193 120
3543A20k86J80J21l53O0L19j21j81K75O6m49J44L62l08k05L81Q1m18J83L13k84
3564@k06L59l0m15L83J40l74j12L61j35k02K76J28l99L3M07k30j11L17R2m32Q5
3586f5L20k71j89M18K1n25K26L47l42j44L36n5l43L41J09l85Q6K72p5l39L43Q7
3608A73l68J5M23j49l21M27J37m79J29K54l08l4L40j34l01J52K67l44j11M00r4
3629G4m19L33K09m14M5L83j41l49L16K61n53J72M74l65k35L32J4j15m4K85l60
3650i7k00L02J01l69K33K53l82l8K96J6m69L42K44m46mL81q2l39L38J71l86J14
3672b1J85n2k62K80J67m97P3L99k63l69M73L9m44K80K10l24o4L68k33j20K47K1
3694I3k65j3M60j82k28K42J03l55P1L73m21q6K39rj80P9L39l28j71M06q8k85K44
$$ plain form
3543 120 -166 14 135 -218 -158 161 40 -141 134 200 -249 -105 257 -51 -256 125 206 -212 -29 284 0
3564 0 -206 153 123 -292 91 231 -143 -255 106 -29 -231 45 173 -226 -193 214 -16 -127 190 282 -150 -65
3586 -65 255 -16 -205 213 234 -291 -65 282 -60 -204 132 77 -266 75 184 -201 -115 157 82 -257 86 173
3608 173 -195 -180 243 94 -227 200 337 -142 -13 241 -67 -101 239 105 -196 -44 223 -121 -232 168 74
3629 74 -345 -12 197 -217 -172 211 70 -279 37 298 -255 -83 391 26 -209 123 137 22 -22 263 -97
3650 -97 -297 5 106 -263 -30 223 -159 -197 99 115 -354 -12 232 -214 -218 163 81 -258 80 251 -135 -21
3672 -21 164 112 -150 130 297 -200 -127 272 9 -360 113 152 -292 -12 198 -126 -190 178 -55 -175 72 93
3694 93 -172 -185 275 93 -135 107 210 -145 -74 299 -122 -208 31 22 -158 -79 260 -68 -239 167 79 -206 38
3717C8K16l34l8K12j27j52K83Pk00P7K38j87k44L26O0m14L17K15l60j47M34j1
3739B09m72K11K74l30o3L49p7k35K41O9m29R4L43j65l01L66R9l24O3K54k00l59
3761c83L97J60l91J61K07j28k07L22o5k95K61J26k70l0L79j10l22L26M1k84l3
3782a38M14k51k41K33J59l38J06J94j83k19M35l1l42R0K88k22nK34r9k89J93K46
3804B34l96J31K22k56j29J88P0k23n7K66p0k38M18j43n7p0L43k42j49L14K5l79
3826a98J47L20l11r9K80j35k04K36K15l77n1M61k28l27L41J19l29N7K09r5j70
3847a39J74Q4l32O0L44j81j61K27O5l12P2K31j28j29K39m1l26K75K12k83j14M03
3869B40j11l09J92J83l68J45K46k71k04L65N3l87J71K42j66j60K35k5k21J21K36
$$ plain form
3717 38 254 -80 -118 94 -33 -185 98 105 -95 -18 220 33 -211 115 175 -239 78 293 -67 -214 220 209
3739 209 -263 -52 222 -108 -171 178 101 -134 107 176 -253 -159 184 19 -282 84 183 -141 -78 176 -24 -383
3761 -383 14 174 -217 -56 151 23 -184 138 73 -222 39 165 -105 -135 244 134 -188 138 179 -105 -138
3782 -138 276 25 -216 17 176 -162 -56 138 -45 -264 171 140 -202 -112 176 -46 -51 183 84 -205 -12 234
3804 234 -162 -31 191 -65 -194 -6 64 -159 -216 50 -20 -258 160 17 -40 -110 233 -9 -158 156 181 -198
3826 -198 -51 269 -42 -141 139 4 -200 36 251 -126 -177 284 56 -271 70 189 -140 -83 126 31 -139
3847 -139 35 119 -213 -153 191 10 -151 76 141 -171 -99 132 4 -125 114 73 -253 22 234 -49 -163 240
3869 240 129 -180 12 195 -173 -28 218 -53 -257 108 161 -226 -55 187 21 -139 96 71 -150 -29 207
3890B07k76q0K44q5j17J54J42k87m2L83k74k17K55J95l88J34K91k79m9N5J48k12
3912i8N4K68l16j65M68j56k27J75K32l05j7K10j50q0K51M2l83K09J81j08l16K94
3934F3J1k39J49J17l9l59L78Kk64J52K26k12j53L10r3k41J99J75k83P7J88j3l96
3957b45L07N3k05j06K52L9k91K42J30k55L1K27k66r0L18j19j74J33L5r7o2K37
3979I4k4k24K24M2r9j07K49j17j80J90J01l17Q7K85k21j28J65mk03J10K07r4k59
4002b23L10k8k12O6K75k17j78L32p3j96J77J71k53p8K30r9k32K15J55k39O7K27
4024A97j39k33K94P2l19L2K62j86j60L66m1l28J12J76k62L4K32n9l00K44J02k35
4046a39J3K23n2k98L60J7l15K7K71l9j83L0J71j68k0J62l1k03K59k0j37N4K30
$$ plain form
3890 207 -69 -149 95 10 -107 47 189 -98 -140 243 -31 -248 7 202 -186 -52 239 -40 -89 -34 114 -98
3912 -98 -44 224 -92 -257 211 55 -172 3 235 -70 -87 123 -27 -107 144 186 -197 12 193 85 -231 63
3934 63 74 -165 -16 101 62 -297 81 83 -181 -29 197 -15 -168 142 49 -192 7 182 -101 -24 164 151 -245
3957 -245 62 115 -90 -196 56 95 -196 46 176 -79 -48 179 -87 -177 141 22 -152 -19 16 -81 -143 94
3979 94 70 -154 70 112 13 -94 155 38 -142 48 149 -168 -81 204 -17 -145 20 16 -187 -77 130 36 -223
4002 -223 87 59 -153 -87 188 -29 -207 125 52 -144 33 204 -49 -127 103 4 -228 -13 142 -97 -30 197
4024 197 58 -175 119 191 -128 -96 166 -20 -180 186 145 -183 -71 105 -157 -123 109 50 -250 -6 96 -139
4046 -139 -126 97 45 -253 107 124 -191 -164 107 68 -115 -85 86 -82 -102 60 29 -174 85 65 -72 -18 212
4069B12k36j45K64l3k22J94P5j30p1L01j10k31J07J84k56Q5K30k06k36L60rk32
4091a05Q5J44j16j35K11r7j17M9J50j27M7L0N3j29P2P3k32K19J14k09q9K11L1
4114A33k85J37J40j20j44K64o3j83P5K15k60o3K59k9k64J91K0j41J6K10qk50J30
4137b0J51k60R6J49j38r0K00L5j68L1J81j77p4O8J05j22j6K02k22QJ54q2j67J56
4161@J50j98j44K80r7r6J03O2j58J9K12j30j31J24R9k21l7L31k46r1L07l3k80
4184a75J24J69k10j36K86k7k53K00J33j28j29K32j8k36J70J54k99J13J90p3j45
4205e8N4R7j84K6J27n4n1J54r7r7J0J71k01j1J85K8k41J44K5j59M0N8N6j39J03
4230a4K02k04j46L00m2j10OR4j79R7J83k35r8J57J04k43J64k2r1k8K72j46r7L5
$$ plain form
4069 212 -24 -169 95 62 -160 34 109 -21 -92 209 99 -132 -25 159 -97 -12 218 12 -224 136 127 -105
4091 -105 -20 124 8 -127 84 -13 -130 -81 69 -58 -11 19 72 -57 15 88 -144 75 189 -20 -109 102 133
4114 133 -152 -15 125 5 -139 125 62 -121 -46 169 -91 -154 105 76 -188 3 23 -118 -102 108 100 -150 -20
4137 -20 131 -129 -33 116 -22 -112 88 123 -45 -14 167 -10 -84 -16 89 -33 -49 153 -69 -61 93 11 -156 0
4161 0 150 -48 -192 88 -9 -105 -2 60 -98 -79 133 3 -128 -4 95 -126 -163 168 -78 -169 138 105 -175
4184 -175 -51 118 -92 -228 58 31 -222 -22 111 -17 -146 86 68 -168 2 156 -143 -30 160 87 -58
4205 -58 -4 93 -91 -65 62 8 -43 111 14 -83 -73 98 -103 -114 71 99 -142 2 27 -132 -92 -34 22 -117 -14
4230 -14 188 -16 -162 138 96 -14 -8 86 -93 4 187 -48 -146 11 115 -128 36 14 -77 -105 167 21 -76 -41
4254d1J35j20mJ57j52oO0o1j8J9J94j66j19K16pj75N3P1M0j34K31j45j38N2J56
4279I8j47OJ80j39m4M3qj25o8K01n8j72K37L3k55J27J64l7r1J20M6k33kJ57Rj42
4305a00J61j6j89J63J37j97j7J15k9j64K14jj55rJ63j62m7J60N6j20N6J22k13
4328g2Q2M6O8k74J51M0r6J29K9j35q0Q8J36k42J4J41m0n9N2J99k78LK09j80L1
4353c8J24K6j77Q5Q8j68j6J11Oq8J11oj23M1O2j7k36J87K1J5r0J90j12M7q5J41
4379I9k32P4P3j0j62J25J08k21J58J74j88q2P0O2j35M8J34o3q3Q3k0j4K3J00j09
4404A2j22K07r9j35R5Nj03N1K4O0j21R1L3q1K6K17k01RJ44j7j75J42M1j94k5J42
4430B6k4q7O7J16j82l6K25j06n8J06M9j65rJ75p0m4J03j4j24O0J08j81oJ76k4
$$ plain form
4254 -41 94 -26 -30 127 -25 -31 29 -32 -50 -31 163 -3 -122 94 87 -88 -35 36 76 -58 173 28 -110 -58 98
4279 98 -49 -43 137 -2 -46 -3 -11 -136 -204 -3 -61 -233 4 37 -218 -91 73 36 -55 65 111 -122 -124 33 42 -100
4305 -100 61 45 -144 19 156 -41 -58 57 28 -136 78 77 -78 -87 76 -86 -133 27 83 -37 19 141 -72
4328 -72 10 56 124 -150 1 41 -55 74 103 -32 -112 -24 112 -130 -116 25 -15 -74 -22 177 -101 -98 111 -69 -38
4353 -38 86 112 -65 20 108 -60 -76 35 41 -47 64 58 -65 -24 38 21 -215 -28 -7 8 -82 108 -4 43 -42 99
4379 99 -133 -59 14 4 -158 -33 75 -146 12 186 -2 -84 -14 48 -87 -39 95 32 -51 32 12 -2 21 121 12
4404 12 -110 97 -2 -137 -42 -37 -140 -89 -65 -5 -126 -35 -2 -83 -57 160 -41 -32 112 95 -80 62 103 -91 -116 26
4430 26 2 -85 -18 98 -84 -120 105 -1 -59 47 96 -69 -78 97 27 -17 86 72 -52 8 116 -65 -71 105 81
4455H1j61N4J52k21L0J65p8p4l9J35o0K3M5n5j20J82k3j41K5J30j21N7J15m5j40
4480h4j8J55j50Q8Q7l5j56R6R6j43J9J36k2j88J82o8o8P5P3j74RJ56N9k53M2J61
4506G5n7j56J29R8k30R7J07L4qm3m4q5K3J15j62O2L9M9m9J9M4j27n3J15P3q0n4
4533f9N1pK2P2q5m5J23j00%M1J11j08o1k4J17n4O8Ko6o0J94q1j15L9J11n9n2J53
4561A18j64L7L3k5k4q9K06j26o2K37j10l7R3nj62K5J67j07K3RP0m1qK6m4j18J19
4588D1j47kN3P4k5m3J10j16j5l0R3Lq2M3R4j38M7J97j70o2J20J7j56J82j5n7j33
4615a17J64l4M4o3Nq6J15J53j69k7L4k0l1j4l4J16m2M9o0nJ75j22p9M6k8KL6o6
4643e8J65j09j00K30n9k02J70Lo2Q6K7p0n9l3J60j78J66R3j64q2J46j5j13N9J2
$$ plain form
4455 81 -80 -26 126 -95 -65 100 22 -52 -91 44 -16 7 52 -3 -123 59 36 -105 -80 50 -71 -14 101 56 -84
4480 -84 -102 53 -97 -9 78 43 -113 -17 79 -64 -45 91 69 -119 63 -5 -73 2 75 -99 -90 66 125 -128 -86 75
4506 75 18 -138 -9 89 -141 -44 63 97 89 46 2 -83 -60 55 -107 -45 -6 43 -6 13 57 -70 -123 -8 65 -15 -69
4533 -69 -18 -25 -3 69 -16 -61 62 -38 -38 3 114 6 -55 -79 38 -16 52 54 -12 -72 122 41 -74 -35 76 17 -35 118
4561 118 -46 -9 24 -1 -25 -114 92 -34 -96 141 31 -6 87 82 -80 -55 112 5 28 37 107 66 58 84 40 -78 41
4588 41 -106 -108 -55 19 -6 -49 61 -55 -70 -100 -7 -4 -86 -43 51 -87 -40 157 -13 -75 45 62 -94 88 73 16 -117
4615 -117 47 13 57 -6 -1 -87 28 181 12 -15 19 -1 -32 -46 -80 36 -6 43 -17 -22 153 31 -48 -2 -30 -28 8 -58
4643 -58 107 -2 -102 128 69 -133 37 40 -22 64 91 21 -38 -71 89 -89 77 170 6 -76 70 55 -58 1 13
4668A3J0o4O3O7k9j28J66j24m1K17j15j78R3Q0n6p2O7J4Q2l6m5Mk4R4L1o7j4J1
4696A9j6j41J59l8l5P2L7r5J28O1j45p5J13J14k48J58j05K0%p1Q3k6N0N6q9J1
4722cR2j30O0j5j32J53j23J30j07K7P4l0m9O7M5j02J38k4Jj46J17n4rJ6K6m6r
4749c3P5j65J28n9J79j97kQ0N2l9n2J11j10J3J41k21M8J43j06mn4J23p8n5R4K0
4775C2r5qJ73j03m1O0P5j24QN5kj32J34Qo4oP4j00K4Q6R0j73L2L1K9j67J00k0
4803b4o6J37j0m5n2O5P3l5K3m7m2M3p6J03lqo4J07j12M9j66K25n8J9rm7M8rJ6
4832C5OJ03j01k8o5J8qJ91j87J08r0K4l1N0o9o8J94p5No0j6P8p1n0J70j20o4J14
4860gJ40n3j05Q9j3q3N4nm4l3R1O7p7j8Q9j52K8Q1m2m0N9JJ8p8R8q8J0J00J3j59
$$ plain form
4668 13 23 -41 22 89 60 -68 98 -26 -67 150 35 -143 -50 30 -26 -98 -31 -17 65 29 -16 -12 -36 58 89 22 8 19
4696 19 3 -138 21 -17 -52 20 57 -38 90 151 6 -69 44 158 -90 68 -37 -17 -17 -88 -5 -31 19 75 -14 -3
4722 -3 89 -41 19 4 -128 25 -98 32 -75 -48 26 -4 -53 14 59 -43 95 71 72 -74 43 -11 -20 -4 22 -24 -33
4749 -33 42 -123 5 -54 125 -72 -74 6 58 19 -33 78 -32 -19 122 -99 -51 92 -14 -18 -72 51 -27 -82 12 32
4775 32 -63 -71 102 -1 -42 18 93 -31 -23 32 30 -102 32 40 -24 -30 44 -56 -32 54 144 -29 3 34 63 -104 -4 -24
4803 -24 -90 47 37 -8 -60 5 78 43 66 19 -23 20 -56 47 44 36 -28 79 -33 16 -150 75 17 36 27 -20 28 19 35
4832 35 41 144 43 15 -50 -32 -40 151 -36 72 -18 6 -25 25 -44 -112 82 7 12 -48 -64 14 -57 -107 63 -57 -121 -7
4860 -7 133 80 -25 64 51 -32 22 17 -27 -60 31 98 21 3 92 -60 -32 49 7 -33 26 27 45 -33 65 -23 -13 87 100 -59
4890e9P1M2j35Q3k5NoP7J0j7k2j6Rl7N0k4l2j7RpJ7P2L0n1J1M3r8J7J5P8j04j5
4922b6R8j07PP4m7K2N0J0j40PP6J9k0j4M4j25M9P3j35M1L6p0J13K6j5m2o7J26
4950F3k9M4r7L5l9rn8R0pK0N1pj3j60R1j1R9r4l2j0J02k3n1K9LK0L4K3Kn8j22
4981a14R3j1N3M7k3o3nK8o9J45j12j1N6L5j4j28N2J35j91J0J06n3l0MK9j1l3J07
5009C2k5q2N6m3N9M4j63J52o3lL6R1n1l8K8n3N2n5j7Q2k4l9P8ql5m9O5J1j13J28
5039E3J9j88P7J30j32L4M9O1o5m9k7M5P6j42R5p3nJ48o2rqq8J0j7J01k6p6L2J02
5068F5o8n3M9j08J85q7N5qL1O5j45N3Ol9k5J18o5q0J09kPo7%P0Lj35J88r1q0L1
5098a8o0N2j5J00j14K5p5Q4j9L3m0K1j2J69p8L5m3m2o8J68J9p6j6l9Q6j51LJ06
$$ plain form
4890 -59 12 54 -81 2 -23 -18 -24 53 63 46 24 8 17 -20 30 6 -26 -43 -34 -41 -24 48 78 27 38 81 -17 0 15 93 -11 -26
4922 -26 72 -35 -28 46 -1 21 71 81 -59 -52 24 43 23 9 53 -72 -23 50 -85 -44 -8 -78 35 61 46 4 -63 63
4950 63 34 78 -19 16 -23 -32 -90 0 -7 13 64 57 44 -116 -25 -36 63 -31 -63 -73 29 6 -45 -16 -13 7 41 64 66 8 -114
4981 -114 -21 -32 21 68 45 -18 -23 5 -64 81 -31 -42 14 49 35 -93 -41 94 -97 -87 19 -34 -64 -60 -31 -42 -75 32
5009 32 7 -75 -19 -62 -3 41 -122 30 -33 -36 0 91 40 2 30 -23 29 -26 -43 39 15 -24 54 46 11 -38 27 38 -75 53
5039 53 72 -116 -39 91 -41 -7 42 103 38 -11 -38 7 83 -59 36 -37 -42 106 44 35 27 -61 -51 -68 33 7 -69 -37 65
5068 65 -3 -56 -7 -115 70 -17 38 30 61 126 -19 34 40 1 -24 94 29 -51 58 56 63 -4 -4 66 69 -66 122 31 -49 -18
5098 -18 -78 -26 -41 59 -55 -30 -105 -21 -40 -7 -47 -26 -38 131 53 88 45 3 -65 103 122 46 30 -9 77 -74 -71 35
5126C5j13KJ10K3j21M6j6p1M5P1n2JPq4R3l0J40r4LM5n8K0N9l4j7k8J36k05L5
5155e2Q9Op0n5J71o1k0j6J1nj8m2O6r9R1m3M5L2%p6M6ML9qj09R3p5K2L0R6j08
5186a6O9l5j12N5j2K9j14R4J21j75R7L3n8L3N9K4j04QJ1M3j7J1m3l1N7N7p2qo0
5215e6J00p8N7Rq9m0J35j19P1m0N3Oj42J46r7J34rm2o4k9J96p9j60J24J67k29
5241g5L9P9l3r5N7J17p2M9L5j32p6J33o7J2M7jj62K05O0p0j61J13M8j13O6j20
5267a17Q1QjP5j28M3J8q6m0J88Ln8PK2p2Q8o8R1j13O4lJ2R2j75J49k3j4J0Ml0
5297B7O9j04m2M1O9q1o7K25k02N6Q5j6j31N7J03j33M4o8O8r1O3J30j10j5K9Q5
5323I1m0m0J6K6rK9m2j0k1P0j45P0n7l1J30o4J12j83J66j09K6nP9o9o7K4L0J14
$$ plain form
5126 35 -78 -76 34 57 -64 -18 -34 -105 -60 11 -41 -40 -33 -117 -24 -54 86 -8 -5 40 -18 2 61 27 10 -18 118 -87 -52
5155 -52 37 43 -27 -82 89 28 8 -8 3 -2 -20 -62 4 -95 -4 -47 -2 30 30 -46 0 4 43 35 -74 19 -56 -34 -4 92 -16
5186 -16 53 18 -94 -39 -51 -22 -136 -42 79 -96 1 34 -24 9 68 92 -12 -4 7 50 33 44 1 -30 27 84 12 4 -56
5215 -56 44 -34 23 32 -57 -97 38 -81 -10 -50 3 9 -133 13 -84 50 41 -1 -65 -94 102 23 -137 -13 154 -75
5241 -75 -36 43 10 -85 -28 89 17 66 101 -31 -107 26 -41 -29 18 17 -145 60 120 50 -111 2 50 -63 3 -117
5267 -117 -36 -28 -29 46 -82 -39 -21 -107 -147 41 44 -14 -7 15 -57 31 -37 54 -59 5 2 14 106 -69 80 57 43 53 57 27
5297 27 96 -8 -50 -9 60 -21 -88 137 -65 -9 76 60 -71 -14 89 -44 0 -68 0 -91 -28 102 -8 -23 6 91
5323 91 51 11 27 53 44 73 31 21 0 70 -75 -5 -62 -93 37 -27 85 -98 68 -41 -15 -20 59 -10 -77 -53 -23 91
5351I1j07J28o7j32KP3J06m6Qn8j4nJ3k9K1N7j9L4q9M0m4K1K8j5M5Lp6K5J5jq3
5382g5K0J64l0j80J40n7JPM4j13P2R3k38M7Q2K5q0Q8O8o3l4J9R2m8ro4L1k4J0
5411a2J1lP2l0k4M6n8l6j3mN5o4k3J05L6o3n0P4J4j02N5j5j6P4N9j04j9lP6r6
5441e8J4K1l9N7l6M6J4j5M1K7pm3Jn4k0K9j15J36M2p5M7L6j4Jl1m9J08j09N2J24
5471A31p1j61J43o6K6O7l7j37J02k6%J3Q5l0k8N4j07l3J41q2L9Q9j08k1K0N7L9
5498I9j48K8J60j62P0j9P5j54QQ8j88J84j6m7J0j8Pn1j6J41j0j30J29J2p0l0M1
5525gJ4J4lJ6q9J4P0j45K13r7K3o7J36K7n4r1Qj7PJ81j56L0n3R1q0NQ1oj23J41
5555H3k5o7KK6nl1jj4n4M6j4P3J6r9J3K5L4J04j47j0P4r7Q5j19J29m6L8l6K6k9
$$ plain form
5351 91 -16 112 45 -87 -85 -12 94 48 56 -2 -16 -21 -8 -37 -16 41 22 56 -33 7 -37 -16 12 -3 42 45 -31 -6 9 8 -75
5382 -75 -55 109 79 -101 39 -18 -17 -10 34 -79 -7 86 -152 -105 -23 2 -78 10 78 15 -19 0 92 44 35 -29 2 -22 -12
5411 -12 -1 -4 68 38 14 60 2 -34 -47 -51 4 -60 -83 22 58 -5 -55 19 33 -69 -14 -29 -45 29 88 -16 -35 -38 38 -58
5441 -58 -44 -23 -62 -5 -41 5 19 4 45 72 65 22 23 -31 -51 -22 -137 -1 41 -34 13 49 35 36 5 -44 64 -45 7 131
5471 131 60 -101 42 -24 2 69 32 -105 -3 -29 -29 -16 69 39 11 65 -42 -75 66 -16 23 112 4 -17 3 60 99
5498 99 -49 -21 139 -23 47 28 103 -51 -43 45 -143 41 25 -22 -12 -30 -23 -74 -90 51 41 -89 40 52 -18 -48 -7
5525 -7 7 21 18 34 -55 -41 29 -116 97 0 23 -44 92 119 65 -26 -18 -35 -28 153 -3 27 -26 65 -15 -10 71 65 -58 83
5555 83 58 -9 -7 19 14 -17 -18 -32 -86 -40 -54 19 35 -64 -51 -26 8 112 -35 -45 29 -68 17 -102 27 -19 19 -17 9 -20
5585b0R9L0p4m8j5R1m8k2o8J69q0KmL4qp1O2n7J9J30k20J89o9J2Qm1p1K6l9J08
5615B4m7j60J61OP5K7j30J8K9N0n9K2J84j29j02L4J3Pq8j2R2q3O9L7p8j6J79k07
5643h4O8k5J49j74O2P5o9p1J06p3K7k5j9J00j13J1L2J40j09M2Rj04O8l1k6qR3
5670E1n8M0L3nq9j9J09r1J8mO1r9K7Jj8J25j05k1L9l6N6m5K1L1j9j29J51K2j5
5699C2k3P5l5p1J1L0q7J18O0j24lO7qj46J06r6J0J02ml3K8o9Q4j3N5p5L8qp6J00
5729D5n6N4%J7q3N1M1k6j20%j8J44j19Q4M6o2mj8N1O2j86N6Q2j34RO4L3p6oN4
5759a5K5p4M3J47j57P3J02j12j21J12or0nJ23r6L1K7o9N2lM0j78J02Ko6O7O5N4
5787G3j30J21j9n8n3R0N6j07J15L4r6j09L6P2m4K2N1o4l6N1J4j0QK0J0j03J10
$$ plain form
5585 -20 79 109 35 -13 -28 63 15 -7 -75 94 14 16 12 46 38 -33 29 -28 -9 121 -99 90 21 33 41 0 -71 -45 -84 24
5615 24 -23 -183 -22 -16 59 86 -44 -26 3 53 -6 16 200 71 -31 3 16 23 -65 -77 15 -68 1 38 -40 -56 123 -84
5643 -84 -16 -41 108 -66 -4 71 2 -69 37 -36 -9 -34 -53 47 -66 -55 -23 117 8 50 59 -45 23 -8 -34 -42 51
5670 51 -7 33 66 61 -28 -47 62 -29 -11 -15 46 -53 -26 -25 -43 82 -23 -44 -5 -41 15 -30 -9 22 3 -126 25 47 32
5699 32 9 84 49 -22 -11 19 -68 50 110 -14 -17 50 42 -104 2 -94 -84 18 14 -19 9 -60 24 11 66 -9 29 21 -55 45
5729 45 -11 43 43 60 -23 28 69 43 -77 -77 -95 49 -70 14 60 -2 -6 -24 27 89 -97 -41 41 -93 -84 -20 13 -63 -69 -15
5759 -15 10 -64 -21 126 -31 42 144 32 -89 23 17 -73 -78 45 -51 -20 7 -62 -10 -13 27 -151 -49 -47 -113 -46 19 73
5787 73 -57 64 45 -13 -66 24 80 -27 88 122 26 -83 -47 25 -19 3 54 -10 -46 5 19 9 17 37 47 -56 54
5814E4r4J3j6M4m6L1o2rO1J1J19j76k5Q3n8R5N3r5J8J0K9l6K1j26M9L1kO5n6J00
5844H6k6lj03k9L5N9Q6j03L3o8j9J3R4m2J02j57k9Q0J8m2o2m8N3M5N9K8j17R1
5872C4o3J6K1L0M4j11MK0k6p4O9nO3J1M0j14N5J05j25P1j21K7O4j31K09j40n0
5899g7J28r5rK1P0m9lrj0LJ08j31L1J15mr4o3J58p4M5r0O0J9j30N0J19q9J6L5
5928E1o0L8P7l1j29J15j44L6l7J37j02J13j32M6N3j39J71n9p1J56q8m2J34j96
5952a03N8J06m2on0j00J34L2n7jM2j4%M5J1q8k8J9JOJ2Rm5Q4p5J26j4J4j08ML8
5983A0rK7o6K3n3J28l5K8r5o8J12o2L6N7n8K1mp4J18qj7p1M3P1p6J5l5Lr2J50
6013A9J4j65J0J49n0QOj1J1m2R7L6p5m2J2N7q1J10m7q2OK0P4r6N3L3k0l4mO8r5
$$ plain form
5814 54 -40 -27 -43 1 -45 -14 -76 -85 -24 -13 106 -70 -95 -12 -70 25 78 -17 1 11 40 4 25 -101 -52 -21 -23 42 -14 86
5844 86 60 57 -46 -75 -40 19 105 2 35 -33 -52 -39 55 13 115 -42 -71 9 27 -15 -77 -125 -72 -27 32 60 -57 34
5872 34 -29 -13 8 38 82 -29 -25 -5 -31 -105 -36 -41 22 33 73 -41 14 119 -6 65 -56 -29 35 -96 113 -27 -77
5899 -77 51 -44 -53 -32 38 -11 -14 -23 -33 -30 78 -53 -22 93 89 -5 -68 90 16 61 -29 31 50 -80 -30 89 0 16 51
5928 51 -9 29 106 75 -54 61 -83 -47 -84 53 -49 64 -68 -22 31 -108 63 4 -67 89 1 -41 93 -103
5952 -103 -45 61 19 13 -37 -137 -3 29 -28 -29 13 -1 -1 44 55 -33 -61 -42 -41 -35 -23 -14 -59 25 -50 76 62 76 -32 -28 10
5983 10 1 28 -38 -15 -68 60 25 53 -42 -110 2 -60 -24 33 -25 -4 -8 -82 36 28 11 -60 -17 54 -22 -7 -42 -39 -131 19
6013 19 33 -132 -122 27 -23 -15 -9 -20 -9 -51 46 82 7 -35 -23 34 -47 63 16 -66 -60 -40 34 -62 -9 24 4 -30 -34 34 -61
6044f1J22j68P1N2N0j4nm4L1Pj0lj13J41j3K5r6Rj8L0lp0J25n9L8n3M8p7M5lm0
6075e6oQ7on3m1P5n4R3m0M1J0j5j27N2R0j24J74o3N8q9n4P2Nlj2k5P0M6j39N6
6105B2j8j50O7N8K7L5j09L4J6J9l1K5nO9j51J06r6J47j04O5p6Q0q6j2L8J27q5
6132A2L9j23O3Mk1RR1n1p1O1j14O7Q0k9l2P6q7j3J0J6m3J02m7l3K1k2KL8j42R8
6162c9M4j1N2n4r0K17p5p1N2o0p2J20k1k0O3n8O3Lm1O4M5j12M3j25K2J8J15J2
6190H4j9l8LMq8J8K0q2J53k4q9K4R2j18j2j3J35j15PJ08l8J12m2p2k7qJ8L8j4
6219A7K9j5l5L4p1N3Ok6Q1r0rO6n8n8R7l1n2j7J48j18p6J57o0L3l6k4L6j4n4J18
6249C1k0j3QP2j45N2j5m7nR7K2j14R0m0L4Rm6J08j01%J7nR6m6j20K6O1l9j8K8
$$ plain form
6044 -61 61 -107 -36 16 66 52 47 3 34 41 31 28 -85 56 43 68 -28 -19 -37 -7 -10 -80 45 -14 24 -29 19 -58 -13 -16 -56
6075 -56 -62 25 19 -34 -75 0 -54 39 -1 40 50 35 -92 -40 50 -74 100 37 95 6 -48 24 29 26 14 -11 59 105 -34 22
6105 22 4 -146 -79 -21 6 41 -68 -34 -18 1 -30 -5 -10 59 -92 14 -82 65 -39 26 -50 30 -56 -68 -30 97 12
6132 12 51 -72 -9 -5 -26 -17 74 23 -48 13 -101 -34 46 17 -15 61 -26 -39 -29 -13 -56 46 -1 -34 -13 -35 -33 5 -137 -39
6162 -39 5 -6 46 -8 -98 119 44 -27 25 -35 -107 13 -8 -28 35 -23 40 43 2 66 111 -1 42 -83 -61 -43 72 84
6190 84 65 27 30 34 -54 -36 -16 -98 55 31 -58 -34 58 -60 -72 -85 50 -65 -58 50 12 124 82 10 -17 -25 -7 31 17
6219 17 46 31 -4 30 -41 12 18 -8 73 -17 -26 40 -18 -76 21 -10 -62 -79 69 -49 -125 32 -28 5 -31 -55 -19 -33 -87 31
6249 31 11 -2 6 78 -67 -15 -30 -77 -82 15 37 -77 13 -27 7 16 -30 78 -23 -23 -6 -11 85 39 -81 -55 6 -33 -51 -23
6279b3R8j76k3J25l5k6j0O1K8N0j08j7Q5j12M4q6J03j3k9J06P4p8pp0R0r8J07
6306F0kl0%n5k6K2JM0j0kK6q8J46j75J05o2J1J39l2l5l9n8j9J9O4mL4q8m8J01
6336eL3K4j90Q2P9j5N4n1K5nO3nj09n6J75r1n2P5k5nj1O6%j13o8J15K0j13J64
6365F1j65P0k3m7J18q3J66j60L0J11n3p2m3J25n5O7qL1j2o2L5L2j07N0P7m5o0
6392b2L3jJ6O9r8k1M0m0K2K3K8l1J6l6J33j88K8P5j01K8L1pM3Lr7M6k6Q3n2n8
6422f1J86j77M1k0M8m3R7M2rk01Q0N6j3l6O0n0l6K8P6j08Q2k8o4K1J60k19O7m9
6450g0N7J6k9J5J2p5P8J7nN3p6M7j37J50J1m6m8K8J25j42J5l3J6j6J17jj32L8
6478a5L9J1J08j29L3n9M8k3r9J87m3j10j8J38j24N9q0J04m5K7j46L7L4O2J9l5
$$ plain form
6279 -23 75 -101 -124 1 -34 -60 -70 -9 19 69 -39 -56 29 -83 -39 -125 -22 -35 -64 42 116 38 31 -39 51 -47 60
6306 60 58 28 28 -27 -53 -31 -30 10 0 -2 24 -64 82 -93 12 -50 -39 100 68 33 -6 -64 -83 -64 0 -4 30 -58 -106 -5
6336 -5 28 52 -138 -56 23 8 62 11 36 31 94 89 -20 -76 99 8 -44 31 6 1 -10 56 56 -57 -125 -10 10 -103 61
6365 61 -104 -34 -57 -104 14 -69 97 -63 -33 78 25 -47 -90 35 -20 47 39 70 58 -4 31 63 -44 6 83 38 -22
6392 -22 11 10 26 95 -3 -24 16 -24 -2 21 49 18 34 -2 131 -57 -29 46 -55 -27 4 -3 40 43 -54 -8 -34 49 -3 -61
6422 -61 125 -52 -11 -31 17 -26 71 113 104 -97 -17 39 26 -10 50 0 -36 -8 68 -40 42 14 -50 -29 131 -88 -21 -70
6450 -70 -13 3 -26 -11 1 -74 4 21 16 69 -7 40 -97 53 64 18 -30 -2 123 -19 -4 -37 -21 -37 80 79 -53 -15
6478 -15 24 35 143 14 47 -12 36 13 -86 101 58 -52 -70 68 -56 3 -77 27 -18 9 -137 -100 -66 -4 15 -20
6504b0M9J5j17O5J06n9Ol2N6j6oj05J1M5J03k9m9k3%j2k4M4M9r2O5j9m5J16o3
6533A9JL7p2J4N0j03J03n6r3J10l8JL8n1o4K2RP8k2Q5r5J43j48k5M2k1k9J55k00
6562a10R0ll8Q8K7j2o8Q1noj1r7J14o4J11n3m4n8P0%p9K4Q0R1j45jj3Ln6PJ70
6593I3k05M0L3J9M6l7N2jq5N4j2n5R0M5j9j05M1N6r5R1J0Jj04n3j6M5J02j12M8
6622c3K8M8K5p7O2J6r2Q0q6m1P4l8L3K5N4q1o9N2N6o1M6N5r5j4%K7j11Q5Q8L7
6652I3j31J22n6k2L1r9J10l8J7o7M6J9Nm0J2j7P5j60M7KO3L6Jn7K1Q2oj03J9O2
6682F7m5J09j70N6kmP7q7oLl9%n1N9%Q2j16K0l4MR7Pp4oL2o5M2O1M2mj9n6N2n
6716B7j0j6n2P7j74J86L8p9l2Q4m3k5J0p1N9L1l2N2q6J4Q3q3J26q9lL8M9j78O8
$$ plain form
6504 -20 29 44 -73 -8 98 39 45 13 69 53 47 -58 -47 -2 101 72 23 0 0 -12 -36 8 57 -35 30 11 -34 82 19
6533 19 20 57 -15 -1 49 -54 49 -7 -100 10 -28 -27 11 -40 -104 -82 -73 5 -17 68 -27 116 -32 -57 -15 -36 -65 90 -110
6562 -110 -20 -23 -61 27 54 42 -26 55 50 44 33 -64 50 -14 97 44 0 -58 12 12 -67 -43 37 128 -17 -18 -31 -28 -84 -77 93
6593 93 -112 -72 -39 -20 26 -11 41 40 -45 9 -3 -58 32 77 58 -47 -6 50 -45 46 56 57 -47 -100 -116 -71 31 -81 -33
6622 -33 -5 43 68 -9 53 69 -23 57 -29 -70 4 -34 -1 24 78 -3 -72 -20 36 -25 21 76 -19 -33 -33 -6 -117 -32 56 93
6652 93 -38 84 28 6 37 -62 48 10 27 -40 6 25 30 -10 2 -15 60 -100 -53 -51 12 48 49 -8 13 95 89 -14 5 67
6682 67 22 131 -39 17 15 11 88 1 -5 -2 -41 -41 -92 -33 -33 49 -67 -47 -81 -77 20 27 -47 -53 -21 -86 -44 17 59 55 36 -20 32 27
6716 27 17 1 -51 26 -148 38 76 -3 -35 49 6 -19 -9 -80 -21 10 -22 30 -56 -42 41 -42 84 -5 -8 30 79 -99 -31
6745c1n6J08p1QO4k2o0K9M5J0r0O9j6J0P0r6R7m9J3j8L5q5R3n8l5N7J3r1N1j3
6775a9L4k6m2kL8J8j1J5O6j55Mj3K9O9l0l2O2l9N2o7O9%k7M3n5K2k7K2k8N3J6
6806C9K4o5k0lJ9j2pJ01m6Pj03M8Jor3J05ln8O7K2o1K5N9j14J18qR8q4j56J24
6836A8m7Q4k6l5r0R2O7o1L6l7L1ppQ2n5q0qP9j3j1p7M5O4o3P4n9qq1Q0pJj4M2
6869Ip9J2Q3J3q8o3J07Jr1P8L6mNk6ON5m4m9J83j51j1Q9l5k7j25K67j12K8K0m4
6899D3J3j49J77l7q1J60r2j8K4o2K6J2l9K1PN9ll9pl9m9j4J13K3Lk2J0qn6J24
6929A00j82Q5N5l8O4n7k3K4j0jl0lO0r6P1Qp2J26p8%j9m6K6P5M4j41R6k8l0L1
6959A1j3L6kn7J8q3L6N3%kpN5j6j28J65kn0J7Pk5J2r7R7r5R3k1P3j54J33N8k04
$$ plain form
6745 -31 -87 21 -50 -42 22 0 -60 -31 14 24 -66 3 -13 -3 67 -29 68 19 32 14 49 -36 57 -1 -36 21 34 -57 -6 -19
6775 -19 15 -11 -53 -55 -17 1 -10 5 71 -84 -80 -93 -64 5 -25 -57 5 -34 18 -49 20 20 -7 36 -19 3 -24 -2 -30 23 39
6806 39 63 -2 -22 -25 -6 -18 -25 76 30 37 -66 -18 -17 -23 -116 -11 -14 -72 -5 17 -44 -19 40 -74 44 36 134 50 -106 18
6836 18 -29 55 29 -6 -96 -4 63 2 38 1 32 25 18 100 45 -35 -43 36 23 12 -65 -20 44 -19 55 -4 -12 -93 -13 -20 -19 -33 9
6869 9 -70 -58 25 38 -50 -113 -6 -5 -96 -18 18 14 19 -7 -1 54 10 -39 144 -7 -18 71 36 9 -116 151 39 67 87 43
6899 43 56 -93 84 47 -34 126 34 16 40 -22 4 16 -23 -2 5 64 61 22 15 -24 -73 -87 26 49 52 30 40 32 -24 100
6929 100 -82 3 58 20 84 27 4 28 18 17 -13 -16 44 -52 19 27 -45 81 3 3 -16 -62 -36 39 83 -58 38 10 -20 11
6959 11 -2 34 32 -25 -7 -90 -54 -1 -1 -3 -10 45 29 -99 66 64 14 31 38 13 25 -72 25 -70 23 2 75 -79 54 112 -92
6990i2O1kO9k7K3o5j3PR3l4q2M8p6k2NR7k1M3j8K7n2M0Q6nn7k3k4KR8m0l4Jj3
7023@r0J44K6K1j46Q7M0p0jK1K5p1No6J0K5R0r0l4R9o7p5K05j10P6n4q6NL1pJ61
7054A04k53J81n8m3M7M0j2m0OJ36p3J4m0P1r8r6J59q7O2OmrJ18j15N2m2J00j01
7082B5j11O1K1j9PR0j11OkJ3J1m7M0Kk6J9%J22m9j4om0J5mQ3j66N9kK6n2l5K00
7114A16j41M7m1Q8j08l0J25p2J5Lj4Q8o8m6L8j0P0p0o6k3Q4k0j31J81M2j11K8
7141b6P4J16j76N5k4K9j55J98n5o2j6J11n3j3M1l8l3M1J6j39J03j8j2K3k2N4n
7168A4j77J98q0J28j27J32q7No9jJ03p6J02p2n6J00l7kOq0O6m2J06r9Q6L0Lj92
7196a18K09n9K3q5m0LJ21k9n2L6M7K9j83R2j38J23q2N6Q7Jr6l2J53k5j8j25N3
$$ plain form
6990 -92 -31 -33 36 9 32 -33 -46 -39 54 20 -62 -14 -90 -112 -107 -10 -31 12 -6 21 -31 9 95 90 33 10 -14 -12 86 46 12 13 0
7023 0 -90 54 80 101 -45 42 82 12 11 32 57 -14 -9 -75 -65 -40 50 -40 -74 25 -42 -117 88 -22 54 0 -86 -81 -50 -57 104
7054 104 -149 32 -26 -69 -22 18 6 -34 -28 108 35 49 9 80 -18 -114 45 -42 20 26 22 13 131 16 68 26 126 25
7082 25 -86 -25 -4 -23 -16 74 -37 -31 -33 -20 -9 -56 -16 -14 -40 -21 -21 101 52 38 32 -8 7 3 86 -80 -21 -23 3 -49 -84 116
7114 116 -25 22 -19 69 -39 -69 56 -16 -1 2 -12 76 8 -38 0 -10 60 -10 -76 -99 -15 -35 -166 15 57 -54 -26
7141 -26 48 164 -12 43 19 48 -107 91 36 -26 -42 69 16 3 44 6 -27 14 30 -109 -6 -24 -36 -13 -35 19 14
7168 14 -163 35 -45 83 -44 88 1 6 -63 -64 39 -37 65 -7 -63 37 0 -2 4 -76 -10 -52 54 -45 41 71 74 -118
7196 -118 91 32 55 -30 -70 -67 54 25 -27 9 56 85 -98 -6 -144 -21 -103 -47 40 41 -55 -87 66 41 23 -102 -49
7223d9Q1j03M8M7m0Mo6R1M0l3P3j24J41j92M8L1M3o1m2R1n4J09m8K4j24mJ00k16
7251a85J82o6J05n7kk0k3O1k0L6r0J06N3Pj37N8J33l3j07J8k5j3J61j87J02n2
7277EJJ0n3J70j15n2K6J1p0J00qJJ1J6j58Q3O6o9J44j43O6j56P8QL8k9O2Mj18
7306g1R1m9K5J10j60J40j37PN3J4J8O0j19p9Q8M5m7nO0k0jl9K0L4l6K5k3j6r3
7335a05J21j8m2J55j70K9Km6J12L7K7j65J09j3j12J40n2j5j1R5q8l1j9K1L8KL5
7362C6Oj61J26JN3n9J7l8M2j04N1J38q6m4O9j39L8P0n3l3J13mk8k3k4R6q1k8P4
7391B5L0k7j2ll0Q9j08M4n3p3R0M8j7j5L5K8n9O6r3%N6p1Q9J3j25R5k5K7Qj5l7
7422b0J00j03qL9l4OJ12q6l3N1l8j56J44L6n7l3R1K9p7N7ll7Oo6J6J03J7l8m1
$$ plain form
7223 -49 32 -71 -23 24 -16 -12 -78 13 53 20 93 -31 110 -82 -34 -3 40 -21 -63 28 -26 83 35 59 -65 -69 31 -185
7251 -185 -3 -69 36 -21 -23 -43 -66 -5 -25 11 -79 27 80 87 -50 8 141 108 1 19 -6 -19 142 -45 57 5
7277 5 6 16 -37 133 18 -34 -8 3 -67 33 25 26 37 53 -105 -22 44 -25 119 -24 42 -114 -36 -28 10 -19 43 47 -71
7306 -71 20 -29 -4 106 -54 86 -51 -44 9 23 41 101 -18 -97 -9 36 -11 -16 44 24 23 -16 4 38 2 27 4 -12 -105
7335 -105 16 -2 -44 111 -59 -30 -28 -74 38 75 102 -63 46 33 -79 61 9 -6 -17 78 -10 -41 -60 -39 -1 1 36
7362 36 42 -119 7 8 61 2 19 -19 23 -81 -30 108 22 -22 47 -92 -54 16 -37 -70 43 39 11 -12 -36 60 -21 -49 25
7391 25 55 28 16 13 -17 72 -36 8 -45 -118 -28 20 3 -12 23 51 -8 58 -35 -35 21 -50 39 52 -73 22 -3 24 32 17 -20
7422 -20 80 -23 -31 8 -26 -20 92 6 -27 24 -14 -170 -26 10 -47 -80 11 40 -37 20 17 -20 -14 -80 -64 39 56 18 -23
7451b3L6lJ4l7K0k5M4q4O2M5n8l1P1r8P8N0o1j28J90j67J26p3l1M7k2N8Rj5OR7
7481I7r4Qk0Q8j5j01M6j7J8N4n1k6J12j05M8M3j17PQ6k5o2L6q1Q8m1K2%P6o4K2
7511C2j5k9l3K2mP3o1J6J01m1j3n9n5L8j8k0J6P6j01N7J8J8n3J37j17M9r0J25
7539F9n3o3Q1o7K6M3m4jK5o8N7j5M0o1K0j4P0j2o3O0k4Kk8PJ6P0ol5J0n9j8J1
7571b4Jj2N4r6J07n4KM1k4J1K5j8o9K8K5k4m9O5M5n8J3Q2l0jp5j1N8M4j1o0K5
7602A0m7L3Pj1N6J5q4Q8j8j05n1J49mj7k4Q1j65R4N2o8L9n5O5p8K8j7kL0K2J9
7632D2j20J14j6n6NRo1J59j19RP5p3J01j10j4p1J02P6q0qM5P3j49J22np7jJ05
7660G7r7O2j0J5j2L5o2M1KO3q9n2K0j09P7O4j8o6L9M6k0p5J37r4P0n4Q8m8j5l3
$$ plain form
7451 -23 13 10 24 -13 7 -18 26 -58 4 49 -9 -40 31 -67 11 61 0 -128 62 -105 21 -52 -83 -36 -58 0 9 -6 0 97
7481 97 3 11 -9 79 64 -37 9 -8 10 64 13 -13 99 -6 42 85 -32 -25 61 36 -26 10 -71 17 -24 -2 -2 74 10 32
7511 32 17 -12 -45 -23 -27 46 -15 1 102 61 48 -11 -66 -28 -46 -66 -50 26 -75 -18 0 18 -35 102 -15 34 -56 69
7539 69 16 -47 34 -33 -7 36 -8 -9 16 -52 5 -10 30 -31 -11 -25 45 33 -30 30 6 8 -20 -13 3 73 67 32 42 -17 -35 -24
7571 -24 -23 -35 19 -77 30 -24 -22 19 -5 6 31 13 -56 -28 -3 -27 -76 -11 34 -24 -11 71 41 40 -35 -46 12 56 45 -15 10
7602 10 -37 -4 3 -8 48 63 -21 67 49 -56 -107 42 38 21 -3 78 -87 7 59 -9 30 -25 40 -38 -10 -27 -29 1 23 42
7632 42 -78 36 20 -36 -31 -22 -83 76 -43 -34 41 -32 69 -41 -55 -126 -24 52 -28 -36 9 82 -67 55 50 -27 -28 77
7660 77 -20 42 32 47 35 70 8 49 51 114 25 -27 -7 -116 -39 25 7 -59 -20 26 6 -69 68 -26 44 -10 78 30 15 -18
7690a8j3Q5l4O8r4l8P0l4n5O2J90j54m7P2n5m1Q8n8L4lM9q2j9M5o6j4O9n2L2q7
7720a00RQ6rK2K2o5M3K9j03k0QN0JNQ2r2j9lN7kJ8j9l2K5J7K8o2L8M0pq0jO6l9
7754gK1Np6P7P1j28K7J6N8j04KM7Mq9J29k0m9K5N5j43J05q4O0jM9J7j32R8m9L4
7784A8qn1n5J61p7J20j02k5QM2r6K3pR4p6O1l7J06j23K5m7M3M8k4o2K6M0J9j0
7813C4q7L1L6Qn2n0L3K7n2K9O2J06l6m0j28J18q5Q9Oo9M5j6J40k35L3L6l3p5K05
7842H0j31o8J29K6k1k9K0k3j1J00p4J3o8J01rK5K4j88P5J2P7K1q4P3j13L5N3j2
7870C3l3OO9J0n9lKJ7k8jj27J43jm0j9J04r1m6R1m4M6q1J18q5P0n5K4l5rJ16j39
7901d7N6Q3q8j5Q9o2M8m7k7R1p8P8l2J4j37J18k3r5J79k22J90j37j3M1J11p3k5
$$ plain form
7690 -18 -31 54 20 88 -6 -44 26 -8 -63 -1 189 35 -12 60 5 -36 52 -6 28 25 74 -8 -27 18 -48 -62 7 -45 -13 -100
7720 -100 -91 -5 -14 8 30 -35 8 37 -66 -86 -78 -28 -27 -22 60 -32 -51 -54 3 1 19 0 -32 -7 10 38 -24 14 54 47 -33 -34 32 -7
7754 -7 14 19 -57 20 91 -37 -10 6 64 -40 -38 9 13 -76 53 33 -16 9 64 -79 26 -58 2 1 50 67 -65 33 -16 18
7784 18 10 -41 -96 65 -12 108 6 -19 -11 31 -65 -42 -49 45 -31 30 -7 99 -24 1 -46 -3 45 21 -41 -15 25 44 34
7813 34 -53 -22 14 22 -30 -80 -47 -20 -72 -43 19 125 89 49 -79 39 -46 43 49 -20 25 9 149 -86 -53 -17 -50 -125 80
7842 80 -51 -119 10 36 15 -14 6 -17 -28 72 -2 11 -57 44 35 60 84 -104 -29 -17 60 81 -3 70 -43 -8 45 33
7870 33 0 6 75 85 26 23 25 42 14 13 -114 29 28 -12 -31 73 -18 -64 27 -17 29 -52 66 -19 51 -4 20 -15 -24 92 -47
7901 -47 9 92 4 -11 78 16 64 17 -10 81 3 81 49 63 -74 44 21 -74 105 -117 73 -64 -77 -36 75 2 -23
7928b3K6l9M9J5k8L9L2j25N2N5j23Q3p9J04k3m8J15j44k9J00k6KJ5P8l3Rl6k7
7956iJ7J03j86M9L8O9k9j56J83q3M8l1nJ6j22P4j7R9j48J12J4n0n9J19n4kj1n4
7984g5m1J88K0j63J28n9q2M9L6j41J27O0k4PJ5Jo1N0q3J12m4n0J10p1p1J35n7
8011A6l7J19n0j10j0r0J60M4l7O9p4j04P0L2K1n6On4oJ05qo1P3m9L0N3j25J45
8039G2j52J22J0j55J0N9J32K9j01n9o7J65l8L4r8J09j8l3j42J12j19OJ12k2R1
8064E9L0o8m8pN2m7J23q7L8j05J22j9mr0P2k7k3N3J04j24L1o8n2J3J7P9j3O1m6
8093B6o9K3pM3j8p1Q8p8K4P2M3j50R3m9Rk2J05j91J55j55J52N3j03K3p2J17J9
8120F0j11QK00j20q3L9j7O6p5J7M6k3R4j23oN1Ll1k4M7J9qr2R8L5q0n4R5j9n6
$$ plain form
7928 -23 3 -36 13 28 0 39 71 -54 -2 53 -70 13 -66 38 15 -33 82 -62 -91 9 -17 -15 0 78 45 54 18 -9
7956 -9 8 111 -75 -26 12 81 52 -104 79 -4 44 13 8 24 -98 -24 -41 58 -90 22 36 -14 -73 46 -8 -10 -21 -75
7984 -75 -116 72 92 -71 57 -2 -84 -35 1 -140 -13 47 23 30 45 46 -15 35 -48 64 20 -30 80 9 -62 73 16
8011 16 -21 98 48 -62 -72 -162 -2 42 5 74 0 -104 -34 -2 19 -37 -31 -85 -91 14 6 -55 18 -31 -1 52 -73 72
8039 72 -80 42 52 -103 -93 -34 98 127 26 -33 -100 65 27 61 -37 72 54 21 -121 -9 -128 -122 -10 -32 59
8064 59 89 21 -27 -34 18 -29 94 7 45 -60 62 43 39 -51 21 -6 -29 24 128 4 35 -33 -85 -72 -55 24 11 72 26
8093 26 -43 -20 -27 16 -2 -73 15 -63 -39 33 76 -74 19 -30 -21 -43 62 -129 26 -129 23 76 -27 -4 -76 41 60
8120 60 -51 -43 157 37 -46 -7 -24 42 -33 -16 30 7 101 -22 -28 23 26 -5 -29 18 37 29 -63 35 70 -10 -64 31 12 -44
8150d4K3M9j20Q6M8mj7nJ3q6J6L7j9J4J02o5j04J12J0o6j1pL2l3J17m7Mr4O9n6
8180d6J26m1m6J5n0L9n4O8l6P6j21
$$ plain form
8150 -44 -21 28 -92 -6 42 38 21 16 29 -57 -41 -4 -23 -9 93 28 -76 36 46 -20 -31 -38 -6 -39 78 31 35 -59 10 -46
8180 -46 80 39 -7 8 -42 -3 -57 11 -25 51 -70
8191g0
$$ Imaginary data points
##PAGE= N=2
##DATA TABLE= (X++(I..I)), XYDATA
0@%%%%%%%%%%%%%%%%%%%%%%%%%%LpJ0j3J5j6J9k3K4k5L2l9M1m6N3o0O8p5Q4r4
46d9J05j17J28j41J56j73J92k09K25k47K70k93L18l41L63l81L91l80L29j92j67
67b13J149m527L0763J51471k48930r3210K93301q2352k57466J92587J50687k65437
79a32177o600K69503j15383j91528K27958R4043k44774N3889K39620j48955j47301
90a01705K21731K6556k53497P6289J88602j93469j11488K27966k3811k28173J27354
101d3645J53456k05087m3228K33627o1238j82126J67761J04496k08837J2484K08725
112A36388j04908j38876J83454N2880k03076M8219J72179j41173j08926J85861
122H2022N005j99150Q1451J41312j68828p0525J93257l4112j77185J27632J18574
$$ plain form
0 0 0 0 0 0 0 0 0 0 0 0 0 0 0 0 0 0 0 0 0 0 0 0 0 0 0 0 3 -4 6 -7 8 -8 11 -12 12 -13 19 -20 21 -25 28 -32 36 -39 45 -49
46 -49 56 -61 67 -74 82 -91 101 -108 117 -130 140 -153 165 -176 187 -194 197 -183 146 -46 -213
67 -213 936 -3591 27172 178643 -70287 -163497 129804 47452 -210014 -17427 133260 -132177
79 -132177 -138777 130726 15343 -176185 51773 145816 -98958 -45069 194551 45596 -101705
90 -101705 120026 146582 -106915 -30626 157976 -35493 -146981 80985 57174 -170999 -43645
101 -43645 109811 -95276 -138504 95123 33885 -148241 19520 124016 -84821 -72337 136388
112 136388 31480 -107396 76058 128938 -74138 -25919 146260 5087 -103839 82022
122 82022 87027 -112123 -30672 110640 -58188 -128713 64544 30432 -146753 -19121 99453
133I9453j78995j6430J97051p2903j43707J60806P4614j84229K8676J72324j14475
144B2185j15055J65265K2636j82509O1661J40599j41269p9180J68108j5231j66203
155a18993R4438J16541j52335l7714J74394m6847j46085J25868Q8599j61951L617
166f0468J68985q1146j21108J45932M8699j68863L6172J46015j14171r1815J52160
177F0392N486j61960O7264J18979j30361n3397J55384k4397j39478R7501R2248
188H7661j39079j7188J50766n3940j16791J16273N9310j43853J4491J35315q2569
199A0396r2098J26857K4211j40313M3770J11962j04781o1727J31185p103j26582
210h4223P0914Q9476j14445k8819J30858l4107j08854R2566O4771j21780p55J22183
$$ plain form
133 99453 -79542 -95972 101079 28176 -115531 45275 119889 -64340 -35664 136660 22185
144 22185 -92870 72395 95031 -87478 -25817 114782 -26487 -105667 62441 47210 -118993
155 -118993 -24555 91986 -60349 -98063 76331 29484 -116601 9267 97866 -64085 -60468
166 -60468 108517 27371 -93737 52195 100894 -67969 -31797 114218 47 -91768 60392
177 60392 65878 -96082 -28818 90161 -40200 -93597 61787 37390 -102088 -4587 87661
188 87661 -51418 -68606 82160 28220 -88571 27702 87012 -56841 -42350 92965 10396
199 10396 -81702 45155 69366 -70947 -27177 84785 -19996 -81723 49462 42359 -84223
210 -84223 -13309 76167 -38278 -67097 63761 29654 -79200 13366 78137 -43643 -44398 77785
222G7785o1580r1793J06940L6176j26658K6526J10630q5388o9544J18677O693
233D8464j23724N5109R5575j02986m3002J24903j9162j12796P8986P5635j13522
244c6520j5089J22589m4550r8247R3701M9086j19345R663J12062o8372p9773J05382
256C0587K3445j18579L5536R8836q6152n4886J13764j203j11781N8805Q2781r8005
268b6852l0318J15473k5643r9202P6734O0551j05697o778J07022m8654q3239Q8414
280B1811L5401j08782J7379R6521o7905o2319R8186J1782j02897M1317Q3201q1811
292a8116l9722J03316j0841r4597O0780O4238r1647j6608R9494l3288q2067P3221
304A4163M2879r5730M776R0264n3057o4649Q3480K0453r3322K6149P8896o5365
$$ plain form
222 77785 16205 -75588 31352 67528 -59130 -32604 78026 -7362 -76906 41771 48464
233 48464 -75260 -20151 75424 -27562 -70564 54339 35177 -77619 1367 77002 -36520
244 -36520 -51609 70980 26430 -71817 21884 70970 -48375 -38712 73350 4978 -74795 30587
256 30587 54032 -64547 -29011 69825 -16327 -71213 42551 41348 -70433 -11628 71153 -26852
268 -26852 -57170 58303 32660 -66542 10192 70743 -34954 -41732 65290 16636 -66603 21811
280 21811 57212 -51570 -34191 62330 -5575 -67894 30292 42074 -60823 -19506 63695 -18116
292 -18116 -57838 45478 34637 -59960 820 65058 -26589 -43197 56297 23009 -59058 14163
304 14163 57042 -38688 -33912 56352 3295 -61354 22126 42579 -50743 -24594 54302 -11063
316a1063m4480Q8907P61q7123M5122O5496p6200k4249Q9157k0295p7951N9957
328H039M7450q4422n522Q5860l9845o7005P2127K7936q8258J5423P9236n5580
340d561n1354Q1176J0705q5482L4205O9509o8201l3121Q6281r195p9496N0458
352I24N3827p7127j4353Q4513k8985p0596O3517L6630q3008M527P8304m5707n6109
365e3643P2720J8778q1841K2355P0051n6804l9514P7873J012p6290L8869N7022
377E0588o5817k2559P6803j6585o7985N1139M1205p2669n024P3928l3522n7098
389d7596O1213K4629p4250J2610O7446m6879m3512O9025R039p2377K8966N8041
401D6355n7302k7850P1692p693o7161M1318M5711o4655j3114P0222k3414n9167
$$ plain form
316 -11063 -55543 33364 34125 -52998 -7876 57620 -18580 -42829 46328 26033 -51918 8039
328 8039 55489 -28933 -34455 51405 11560 -55445 16682 44618 -43640 -28217 51019 -4561
340 -4561 -55915 25261 35966 -49516 -15311 54198 -14003 -47124 39157 29962 -49534 924
352 924 54751 -22376 -36729 47784 18799 -51797 11720 48350 -34658 -30131 48173 2466 -53643
365 -53643 19077 37855 -43986 -21631 48420 -8384 -47898 29975 30987 -45303 -6434 50588
377 50588 -15229 -37788 39015 22430 -45555 5584 46789 -25880 -30904 43024 9502 -47596
389 -47596 13617 38246 -36004 -23394 44052 -2827 -46339 22686 31725 -40652 -11686 46355
401 46355 -10947 -38797 32895 25202 -41959 -641 45070 -19585 -32699 37523 14109 -45058
413d5058N2522L1814o8608K643O6615l6303m7748O0824J7341o8754J8090N9854
425D3232m7549l4335O5035J567o5343L1432M9367n6357k1596O6168j2655o0107
437d1141M1899L7671o1490p173O4227k5106n1143N1050K5826o2980P442O0060
449C9142l7192m0174N8420J0960o3012K1289N1755m7991k7525O1612m575n9961
461c7252L3750M1722n5302j4248O1029j7519n2340M3667L0046n7927l13N7943
473C3256k7813m1902N0165J7060n7302J3053N0822l8283l1011N3215K986n4883
485c0637K4346M1259m6047j8564N4340r576m9526L4129L1442m9902n724N2409
497B7949k0365m1483M1408K0934n0566N899M7958k9538l2015M6571Q854n0827
$$ plain form
413 -45058 7464 39278 -29330 -26687 39928 3625 -44123 16701 34042 -34712 -16622 43232
425 43232 -4317 -38652 26383 27950 -37393 -5961 43406 -12951 -34547 31621 18966 -41141
437 -41141 758 38429 -23061 -30234 33993 8887 -42256 8794 34620 -28360 -20918 39142
449 39142 1950 -38224 20196 31156 -31856 -10567 41188 -6803 -34328 27284 22709 -37252
461 -37252 -3502 38220 -17082 -31330 29699 12180 -40160 3507 33553 -24374 -24687 33256
473 33256 5443 -36459 13706 30766 -26536 -13483 37339 -944 -31955 21260 24246 -30637
485 -30637 -6291 34968 -11079 -29643 24697 15121 -34405 -276 31166 -18736 -24460 27949
497 27949 7584 -33899 7509 28443 -22123 -16224 31734 2196 -29819 16752 25606 -25221
509b5221J6563M1486l8384k2731M8750l509m8323K6848L3825m4522j1107M9830
521B3505j4175m1559L6327K3980m7234J208M7593k3655l4445M1877J3315m8240
533b1503J1179M2116l2842k6348M4612K298m6813J9711L5091l8935j6570M6253
545A8249p540m2250K9416K7671m1622m355M5834j7033l5000L6842J8100m4651
557a6339N608M1512k7099k8233M0214O306m5113J4221L5932l4042k0280M2678
569A5365k694m2270K3877K9892l8778r621M3943j1420l6210L1803K1865m1140
581a5388J346M2107k1094l0031L7007J0893m2211R928L5464k9128k2600L8245
593A4538J365m0452J7093K9620l3235j3543L9168o389l5346K4313K4088l4542
$$ plain form
509 -25221 -8658 32828 -5556 -28287 20463 16954 -31369 -4521 29304 -15218 -26325 23505
521 23505 9330 -32229 4098 28078 -19156 -17948 29645 5990 -28455 13422 26737 -21503
533 -21503 -10324 31792 -1050 -27398 17214 19512 -27301 -7590 27501 -11434 -28004 18249
545 18249 10709 -31541 -2125 25546 -16076 -20431 25403 8370 -26630 10212 28312 -16339
557 -16339 -10731 30781 3682 -24551 15663 21969 -23144 -8923 27009 -7033 -27313 15365
569 15365 12671 -29599 -5722 24170 -14608 -24229 19714 8294 -27916 3887 25752 -15388
581 -15388 -14042 28065 6971 -23060 13947 24840 -17371 -7443 28021 -1107 -23707 14538
593 14538 15903 -24549 -7456 22164 -11071 -24614 14554 8165 -27181 -2868 21220 -13322
605a3322m902L8721j2948l0101L0435J6457l7077L361L5490k0794k4745L2479
617A3054O746l7426J0320L0198k7542j7955L4490j680l4454J8450K4634l0744
629a1909q808L5982p776l0598K4885J9609l3174j033L5148j5405k6387K9133J1799
642B1466l4956N620L1049k2429k0932L1867K877l4642J3551K5819k7589j2009
654b0308L2901m945l0033K0685K0541k9905m154L2897j1484k5293K5224J3281
666A9407l0987K424K9794j6986k1274K7124O333l1142Q662K5664k2664j4928K9015
679A0442o62k8855J5074K0776k5619p195K9878p156k4936K0654J4972k7025m49
692a0101K7600j2988k0573K3153Q772k7507M522K4261j7592j5794K4713K270k6319
$$ plain form
605 -13322 -18224 20497 7549 -22552 7883 24340 -12737 -9376 26114 5320 -19425 13054
617 13054 19800 -17626 -7306 22892 -4650 -22605 11885 10205 -24249 -5799 18835 -11909
629 -11909 -20717 15265 7489 -23109 1776 21385 -11789 -12822 22326 6921 -19466 9667 21466
642 21466 -13490 -7870 23179 750 -20182 11685 14562 -20080 -6529 19290 -8299 -20308
654 -20308 12593 7648 -22385 -1700 18841 -11064 -15218 17679 6195 -19098 6126 19407
666 19407 -11580 -9156 20638 3652 -17622 9502 15835 -15307 -6645 19019 -3645 -18573 10442
679 10442 9780 -19075 -4001 16775 -8844 -16039 13839 6683 -18253 2401 17373 -9652 -10101
692 -10101 17499 4511 -16062 7091 15863 -11644 -7122 17139 -453 -16247 8466 10736 -15583
705a5583J0113K0540k0539j0117K5483k981k3411J5657J6026k2916l359K5170
717A4083q610j9710J9313R976k4318K548K2709j4459j5762K1537L730k4204P980
730e187J9435j8665j0476K3377j462k2614J3057J6299k0948m827K4212o752j9965
743a4516J7790J1532k2852R00K2574j2527j6232K0722N276k4229O322K0038j7176
756b378j2048K2528k61k2958J1400J7149j9855p250K3626m331k0537J5335J3522
769A3942k1349j865K2939q810j7551J7763Q467k1945K624K0302j3349j4438J9786
782F516L470k2030P077J7522j6546r528K0957j089k0120J1087J4655j7949m498
795a0476K0609n172j7131J4639J0384j8945k65J8982r174j4110J6010N478j9494
$$ plain form
705 -15583 -5470 15070 -5469 -15586 9897 6916 -16495 -838 15188 -7728 -11087 14083
717 14083 5473 -14237 5076 15052 -9266 -6718 15991 1532 -14230 7307 11037 -13167 -5187
730 -5187 14248 -4417 -14893 8484 7022 -15592 -2535 13764 -7184 -12011 12201 5449 -14516
743 -14516 3274 14806 -8046 -7146 15428 2901 -13331 7391 12667 -11562 -5240 14798 -2378
756 -2378 -14426 8102 7841 -15117 -3717 13432 -6423 -13673 9953 5622 -14915 420 13942
769 13942 -7407 -9272 13667 4857 -12694 5069 13536 -8409 -5785 14517 1168 -13270 6516
782 6516 9986 -12044 -4967 12555 -3991 -13519 7438 6349 -13771 -2684 11971 -5978 -10476
795 -10476 10133 4961 -12170 2469 12853 -6092 -6357 12625 3451 -10659 5351 10829 -8665
808h665L650J6723j2863j0439J6975J065j7869P805J3545j4549n831J7599k675
821D471j5505J1395R891j5822j116J7037o843j3017J3509O259j6540K151J5247
834A1117j0535j0324J5128J926j6477N739J2798j2793o570J5981j749j5112R762
847a109J0271j4590k117J6063n714j2503J2699O647j5847J581J5291r281j0417
860i026J4415K840j6312N076J3147j2001p488J4976m96j4966P957J0684j3517
873d711l681J5512l828j2823J0661P458j3797q3J4001o825j0433J2336M224j4344
887f333L020J2268r394p567J2765R90j3423N469J0158j0732m778J3094k189j1881
901h533Q462P662j1848j349J2605m912r609J0085M616j2506J915J1358p900p133
$$ plain form
808 -8665 -5015 11708 -1155 -11594 5381 6446 -11423 -3618 9927 -4622 -10453 7146 4471
821 4471 -11034 361 10252 -5570 -6686 10351 3508 -9509 4000 10259 -6281 -4130 11117
834 11117 582 -9742 5386 7312 -9165 -3426 9372 -3421 -9991 5990 4241 -10871 -1109
847 -1109 9162 -5428 -7545 8518 2804 -9699 3000 9647 -6200 -4619 10672 1391 -9026
860 -9026 5389 8229 -8083 -3007 10140 -1861 -9349 5627 5131 -9835 -1878 8806 -4711
873 -4711 -8392 7120 3292 -9531 1130 8588 -5209 -5292 8709 1884 -8549 3787 8011 -6333
887 -6333 -3313 8955 -439 -8006 4759 5749 -7674 -2205 7953 -2779 -7557 5537 3348 -8533
901 -8533 -71 7591 -4257 -5606 6999 2087 -7522 2563 7179 -5327 -3412 7946 46 -7087
915g087J1203J062j1911M888R383r911m582J2049j729j1162P554P331j1492j139
929e543J2286m713r546R596N040j1910J339J1463p485p797J1449J621j2238M147
943b291R747r537m991J1919j244j1687P297Q016j1230k002J2105m022r841R257
957A496N648j1735M22J1734n989q508J0427L133j2070K830J0376q105o627J1015
971D047N95j1609N003Q718r856l814J1911k224j0365P590O621j0598o47J1101
985F473m671q305Q904L898j0559J597R443o453o090R319J256r932L186P972p442
1000a404m276R282p20r200N424O440q403k145R475k634p874P048M320r052M37
1015c282R023n039o035Q213J584q965L130P454o999l919Q590n35q350M739N785
$$ plain form
915 -7087 4116 5178 -6733 -1845 7538 -2373 -6955 5094 3365 -7797 -243 7088 -4404 -5543
929 -5543 6743 2030 -7516 2080 7120 -4790 -3451 8012 527 -7270 4179 5800 -6438 -2291
943 -2291 7456 -2081 -7072 4847 3603 -8084 -787 7229 -4001 -6003 6102 2080 -7761 1496
957 1496 7144 -4591 -4169 7565 1576 -6932 3495 6628 -5442 -2612 7764 -341 -6968 4047
971 4047 4642 -6967 -1964 6754 -3102 -6916 4995 2771 -7594 -4 6617 -3981 -4628 6473
985 6473 1802 -6503 2401 6299 -4260 -2663 6780 327 -5763 3556 4812 -5120 -1934 6038 -1404
1000 -1404 -5680 3602 2882 -6318 -894 5546 -2857 -5002 4473 1839 -6035 1013 5333 -3719 -3282
1015 -3282 5741 702 -5333 2880 4464 -4501 -1371 6083 -916 -4835 3755 3220 -5130 -391 5394
1030E394p812j929Q630k512p481O108M296q176j00Q370m272o031P557K293q662
1045d327K356P463o309l962Q584n20q421M770O004p880j819Q584k564p155O332
1060A136L778q275L99P624m155n493O882J826p883J905O998n515m103P479K49
1075B852p467L900N577o842k016Q176j897p057N638M258p863MP934m277n792O923
1091B051K017p951J875O689n475m112P558R9p611L644N643o298k182P500j518
1106A929o790N173M539p197o43P670l346n925O440K636p890J213P146m899m836
1121d780P217Q70p971L190O230o504k873P802j015p132M676M799o797j121P724
1136D315k630o235N864L341p555P52O906m239n070O729J599p755K107O504n769
$$ plain form
1030 5394 -2418 -4347 4283 1771 -5710 398 4694 -3482 -3582 4788 516 -5515 2042 4335 -4327
1045 -4327 -1971 5492 -817 -4779 3805 3285 -5136 -366 5638 -2242 -4061 4523 1959 -5196 1136
1060 1136 4914 -3361 -2962 4662 507 -4986 1896 3722 -4161 -2256 4742 -773 -4876 2603 2852
1075 2852 -4615 -715 4862 -1980 -3996 4180 2283 -4774 864 5122 -2741 -2737 5197 920 -4872 2051
1091 2051 4068 -3883 -2008 4681 -794 -4906 2652 2751 -4860 -1216 4427 -1871 -4053 3447 1929
1106 1929 -4861 312 4851 -2346 -2989 4681 1335 -4590 1850 4486 -3404 -2191 4955 56 -4780
1121 -4780 2437 3307 -4664 -1474 4756 -1748 -4621 3181 2166 -4966 -290 4509 -2288 -3409 4315
1136 4315 1685 -4550 1314 4655 -2900 -2148 4758 519 -4551 2178 3777 -3978 -1871 4633 -1136
1151a136l576P575m61p330M169N226o456j817P561j823o480N582L770p378R6P198
1167D720l773n142O095J876p273J662O298n189l834O939M5o961L532N032o075
1182b048j947P201j428o081M674M054o607k23O913l347n099N879K035o831J330
1197a525N804m609l805O338K82o697K802N083n418k138O410j101n784M319L895
1212C856n919o87O672k548m921N366K077o378J052N722m015l962N760P27o408
1227c606K201N029n155k447O141o16n837L616M202n709q66O538k164n284N188
1242A231K770o389Q18O146m123l917N994Q97o770K298N269n322k858O621p49o586
1258d670M030M237n968j165O658k194n471N347L091o590N10O687l726m434O174
$$ plain form
1151 -1136 -4712 2863 2402 -4928 -759 4467 -1989 -3806 3755 1932 -4548 1034 4804 -2574 -2478 4720
1167 4720 947 -4195 1900 3776 -3497 -1835 4463 -726 -4560 2379 2424 -4537 -1005 4027 -2048
1182 -2048 -3995 3206 1778 -4303 371 4425 -2182 -2405 4508 1161 -3938 1941 3976 -2855 -1525
1197 -1525 4279 -330 -4135 2203 2485 -4212 -1410 3673 -1745 -3883 2527 1426 -4358 -39 3856
1212 3856 -2063 -2750 3922 1374 -3547 1819 3896 -2482 -1430 4292 277 -3685 2075 2802 -3606
1227 -3606 -1405 3624 -1531 -3978 2163 1547 -4290 -674 3528 -2181 -3047 3491 1327 -3957 1231
1242 1231 4001 -2388 -1570 4576 453 -3464 2530 3427 -3343 -1045 4224 -1098 -3956 2665 1916 -4670
1258 -4670 -640 3597 -2371 -3536 3122 928 -4543 804 3895 -2695 -2185 4502 776 -3658 2516
1273B516J134o829K259N625n224l268O486l40o630L545M640o063j736O820j817
1288A118n644M539L538o138j56O542k928m758N582K214o483J196N895m203l794
1303c480O087N32o688K503N071n427k428O421j147o117M167M060o147p60O604
1318C251k430n054N430K580o452J012O169l931m095O094J000o438K132N240n223
1333g15k910O298o77o381L693M168o067j069O609k096n499N098L087o279N04O511
1349D275l727m326O206J488o618J738N626m737l378O260M1o655K988M651n575
1364a743k137O494j473n924M469L628o211l57O604k571m969N535K507o579J350
1379a377O056m084l821O126M88o316K369M853n221k482O015q75o051L712L516
$$ plain form
1273 2516 3650 -3179 -920 4705 -519 -3787 2699 2359 -4271 -726 3914 -2149 -3885 2935 1118
1288 1118 -4526 13 3551 -2587 -2743 3799 871 -3887 1695 3909 -2574 -1378 4517 314 -3480
1303 -3480 2607 3139 -3549 -1046 4025 -1402 -3830 2591 1444 -4673 -506 3554 -2593 -3353 3251
1318 3251 821 -4233 1197 3777 -2675 -1663 4506 575 -3520 2574 3574 -2864 -732 4508 -715
1333 -715 -3625 2673 1996 -4385 -692 3476 -2591 -3660 2949 853 -4646 452 3539 -2740 -2236 4275
1349 4275 548 -3778 2428 3916 -2702 -964 4662 -75 -3453 2807 2848 -3807 -819 3832 -1743
1364 -1743 -3880 2614 1141 -4783 -314 3314 -2897 -3254 3350 779 -4190 1345 3852 -2727 -1377
1379 -1377 4679 595 -3226 2900 3388 -2928 -559 4294 -927 -3409 2606 1731 -4320 -608 2908
1394B908n569r08N978k051m891M829K943n898O93N972l557l534N727R02o012K187
1410b81M841m822k605O090j055n899L617L618n895r54N912k297m891M679K631
1425B689o029O46O236l563l824N724J389o116K193N432m713l028O424j39o768
1440c447L513M518o267j754O785k027o320M995L342o738j69O788l113n202O041
1455I45K556o899J373O518m221l900O556J028o935K464N714n586k953O801r02
1470B559o605L673M491o430j643O794j905o037N037L411o621J81O672l141m832
1485d396N984K137o572J481O000m334l653O353K92o357K695M730n383k250O186
1500B913j186n893L908L623n855r96O392k587m807N203K484o183J076N816l708
$$ plain form
1394 2908 -2661 -3569 2409 358 -4533 296 3239 -2659 -1966 4006 449 -3085 2642 3544 -2468 -281
1410 -281 4560 -262 -2867 3223 2168 -3731 -114 3504 -2391 -3345 2567 270 -4621 58 2689
1425 2689 -3340 -2694 3542 -21 -3845 1879 3268 -2848 -655 4777 64 -2964 3460 3321 -3447
1440 -3447 66 4584 -1683 -3437 3348 1321 -4999 -4 3338 -3400 -3569 3219 106 -5096 945
1455 945 3501 -3398 -2025 4493 272 -3628 2928 3956 -2979 -515 5199 -387 -3340 3461 2559
1470 2559 -4046 -373 4118 -2312 -3955 2839 934 -5103 -66 3345 -3276 -3095 3577 436 -4396
1485 -4396 1588 3725 -2847 -1366 4634 300 -3353 3000 3292 -3065 -370 4360 -1023 -3273 2913
1500 2913 1727 -4166 -258 3365 -2490 -3486 2906 319 -4488 715 3199 -2984 -1908 3908 200
1515B00l682N711R39o243K380N067m982k581O167o79n982L533M036n881j129O311
1531C185k138n446M944K677o084M69O095l524m249N877J433o439J832N741m737
1546c64l141O336Mo551L108M881n604k016O454j397n934M256L860o211o85O567
1562C563k770n019N346K342o409Q87N975l858l870N847R70o173K236M980m800
1577g53k671O001m48n735L136M051n243j405O051j590n312M443L044n864Q0N817
1593C602l063m205N331J430o128J579N148m076k972N733k08n624L024L861m905
1608a473j461N639j517m845L907L188n663q1N778k631m458M952J960n966J026
1623a645N647m074l683N915N59o227K541M849n100k252O225q45n965L949L867
$$ plain form
1515 200 -3482 2229 3168 -3075 -695 4372 -610 -3191 2976 2297 -3685 -152 3884 -1997 -3126 3185
1531 3185 1047 -4399 545 3222 -2862 -2393 3702 178 -4071 1806 3239 -3200 -1368 4373 -364
1546 -364 -3505 2831 2835 -3716 -608 4273 -1331 -3347 3107 1710 -4224 32 3892 -2319 -3004 3563
1562 3563 793 -4226 1120 3462 -2947 -2060 3915 57 -3813 2034 3004 -3169 -933 4047 -753
1577 -753 -3424 2577 2129 -3606 -470 3581 -1662 -3067 2984 1394 -3918 525 3569 -2295 -2215 3602
1593 3602 539 -3666 1665 3095 -3033 -1454 3694 -382 -3354 2379 2171 -3453 -429 3432 -1473
1608 -1473 -2934 2705 1188 -3657 250 3438 -2225 -2306 3472 841 -3617 1335 3295 -2671 -1645
1623 -1645 4002 -72 -3755 2160 2719 -3508 -967 3882 -1218 -3470 2755 1910 -4055 -106 3761
1638C761n860q10O302k311n190N030K737o119K62O067l384m310N605J587o503
1653c136J474N719m484l344O068J76o225K815M898n357k106O431j180n688M019
1668H0L624n796m97O042k353m887M708K523n998N60N659l425l915N176J351n898
1684c046J642M978m193k890N675J80n958L025M184n012j482N845j534m970M060
1699E04L036n380l72N671k886m117M860J563n650J179N025l655l107N119M05n403
1715c208K291M359m632j985N697q08n185L586L343n142o95N627k119m493M325
1730I61K227n541O28N239l417l568M930R83n509J784M530m144k382N352k19n233
1746c379K890L931m751j363N533j361m797L818L003n392k87N492k676m034M568
$$ plain form
1638 3761 -2099 -2909 3393 1082 -4108 922 3659 -2460 -2198 3869 485 -3825 1780 3367 -3136
1653 -3136 -1662 4057 -427 -3771 2297 2473 -3752 -937 3961 -1396 -3502 2929 1749 -3939 80
1668 80 3704 -2092 -2589 3453 1100 -3787 921 3444 -2554 -1994 3665 240 -3675 1501 2852 -3046
1684 -3046 -1404 3574 -619 -3509 2166 2346 -3612 -587 3597 -1415 -2897 2948 1414 -3556 504
1699 504 3540 -1840 -2212 3459 573 -3544 1316 2879 -2771 -1592 3433 -222 -3329 1790 2195 -3208
1715 -3208 -917 3442 -1190 -3175 2522 1714 -3471 115 3458 -1684 -2379 3248 1129 -3364 961
1730 961 3188 -2353 -1725 3514 97 -3471 1459 2442 -3067 -1283 3247 -897 -3279 2073 1854 -3379
1746 -3379 -489 3442 -1309 -2672 2861 1500 -3297 521 3524 -1868 -2155 3337 661 -3373 1195
1761A195J601n475J204M590l448l151N204L66n350K349M158m334j717N261q43
1776A610m769L252L133m641r17N337j951m248M007K260n240N40M834l029l356
1791c178M637Q39n261J699M385l846k348N097k94m899K898L480m622j148N186
1806B625j352m443L598K618n006p0N111k400l993M427J664n226J049M741l502
1821a59l131N055M64n258K054M246m340j870N266o04m957L240L286m784r48N273
1837B833j876m267L941K358n123K39M998k711l577M594J213n203J339M535l589
1852b96k784N073K8n037K324L875m282j623N066q41m621L221K825m730m72M889
1868B615j954l831L832J952m690M31M675k893k974M437R02m797J471L971l569
$$ plain form
1761 1195 2796 -2679 -1475 3115 -333 -3484 1720 2086 -3264 -915 3243 -1091 -2808 2453 1610
1776 1610 -3159 93 3226 -1415 -2332 3005 1054 -3194 813 3073 -2167 -1627 3207 178 -3178
1791 -3178 1459 2298 -2963 -1264 3121 -725 -3073 2024 1730 -3169 -271 3209 -1413 -2561 2625
1806 2625 1273 -3170 428 3046 -1960 -2030 3081 681 -3312 1115 2779 -2447 -1398 3343 -159
1821 -159 -3290 1765 2229 -3029 -975 3271 -1069 -2939 2327 1723 -3234 6 3292 -1492 -2440 2833
1837 2833 957 -3310 631 2989 -2134 -1895 3103 392 -3185 1409 2622 -2581 -1242 3293 -296
1852 -296 -3080 1993 2021 -3016 -692 3183 -1099 -2722 2344 1503 -3118 103 2928 -1802 -2274 2615
1868 2615 661 -3170 662 2614 -2076 -1645 3030 137 -2837 1600 2502 -2295 -824 3147 -422
1883d22k230M544j60m587K403L381m266j320M825j218m087L364K337m471m8M626
1899B671k268l338L915J529m613J010M147l081k572M389M54m485J731L502l817
1914h26j628M492p76m243K715K738m175n19M432j555l745L657J917m373M77M091
1930B679k455k782M000P75m268J393L671l174k138M145k11m206K203L084l814
1945a098j246M208r89l752K865K401m262k6M203j816l286L668J339m167R99L866
1961B907k817k443L986O11m352J693L277l508j529M187q00l877K493K647l882
1976a407p86M353j497l532L276J833m052L85L938k377k715L842Q91m088J032L723
1992B819l025k013L829J5m019K041K903l491j223M076q37l714K799K143l833j24
$$ plain form
1883 -422 -2652 1892 1732 -2855 -452 2929 -1337 -2657 2168 950 -3137 227 2564 -1907 -1955 2671
1899 2671 403 -2935 980 2509 -2104 -1094 3053 -28 -2600 1789 2243 -2242 -511 2991 -826
1914 -826 -2454 2038 1262 -2981 -266 2472 -1703 -2222 2210 655 -3090 567 2484 -1889 -1412 2679
1930 2679 224 -2558 1442 2217 -2051 -658 3013 -161 -2299 1846 1635 -2571 -368 2716 -1098
1945 -1098 -2344 1864 875 -2877 -12 2389 -1873 -1899 2304 488 -2798 870 2209 -1958 -959 2907
1961 2907 90 -2353 1633 2244 -2108 -415 2862 -646 -2175 2012 1212 -2665 -172 2475 -1407
1976 -1407 -2193 2160 663 -2869 407 2240 -1812 -1427 2511 134 -2581 1261 2152 -1936 -904 2819
1992 2819 -206 -2219 1610 1625 -2394 -353 2550 -941 -2164 1912 1075 -2639 160 2303 -1530 -1654
2008a654L881j813l008L309J453l988N25L787k492k429L802N99m129J327L434
2023B604l244j583L944l98l761K188K734l508r63M087j347l243K925J803l784
2038a546J37L781k086k831L544J075l983J002L472k778k117L806J66l910J711
2053e57K967l263j277L874o61l571K453K407l535n25L915j384l191K983J715l878
2069a528J87L664k209k536L444Q20l866J025L237k606j932L478K24l588J703K833
2085B350l032j289L630o38l067K212K072l218m21L389j278k816K617J430l457
2100a516L00L239j964k332L230N76l377J094K882k607j416L254k37k994J644K301
2116B077k852o38L155r45k648K369J375l135K58K894j710k029K682P10l177P66
$$ plain form
2008 -1654 2227 414 -2594 715 2168 -1820 -1295 2492 0 -2429 1373 1972 -2157 -830 2604
2023 2604 -640 -2223 1721 1323 -2438 -250 2484 -1024 -1987 2100 753 -2490 435 2238 -1546
2038 -1546 -1409 2372 286 -2545 999 2074 -1909 -907 2565 -213 -2330 1476 1642 -2268 -557
2053 -557 2410 -853 -2130 1744 1083 -2488 -35 2372 -1163 -1688 2227 843 -2348 635 2350 -1528
2069 -1528 -1341 2323 114 -2422 1022 1842 -2024 -999 2238 -368 -2300 1178 1402 -2186 -483 2350
2085 2350 -682 -1971 1659 1021 -2046 166 2238 -980 -1401 1988 710 -2106 511 1941 -1516
2100 -1516 -1216 2023 59 -2273 957 1533 -1844 -750 2132 -475 -1891 1363 1126 -1868 -224 2077
2116 2077 -775 -1413 1742 797 -1851 518 1893 -1242 -984 1910 200 -1829 853 1563 -1614 -848
2132h48K791k260j620K985J71l084J601K250k827p37L297q63k883K321J648k967
2148a025j81L097j405k531K888Q09l103O20K807k003k028L028M16l163J191K502
2164A919k367j369L104k37l015J783K197k827p26L059q05k731K270J681l136n7
2180a257L058j408k299K467R67k913N48K793j931j842K862L65l056J174K384k289
2196c77j342K784j1k861J553K070k664o56K967r07k360K150J242k775K29K590
2212A632j347j928K417O40k662P02K438k064j232K504j34k421J241J790k217q65
2228a506K657n61k367J935J255k581J47K522j239j954K252P88k579N14K476j745
2244A4j458K545J28k536J088K040k183j139K711l59k624J656J705k429n64K578
$$ plain form
2132 -848 1943 -317 -1937 1048 1219 -1865 -264 1986 -841 -1578 1719 856 -2027 294 1942 -1025
2148 -1025 -1206 1891 486 -2045 843 1652 -1451 -831 1976 -27 -2055 973 1389 -1774 -583 1919
2164 1919 -448 -1817 1287 1050 -1965 -182 2015 -812 -1538 1521 716 -2015 255 1936 -1200 -1257
2180 -1257 1801 393 -1906 561 1528 -1385 -837 1956 25 -1817 1045 1410 -1646 -472 1912 -377
2196 -377 -1719 1065 1054 -1807 -254 1816 -848 -1504 1463 556 -1804 346 1588 -1187 -958 1632
2212 1632 285 -1643 774 1414 -1248 -546 1892 -172 -1404 1100 966 -1455 -214 1576 -641 -1506
2228 -1506 1151 590 -1777 158 1413 -1168 -1021 1501 262 -1692 560 1348 -1231 -717 1759 14
2244 14 -1444 1101 1229 -1307 -219 1821 -362 -1501 1210 851 -1773 -117 1588 -841 -1405 1173
2260A173p22k191J911J403k557q8K515j101k018K350P86k695O19K264j502j629
2276a482K411L34k629R95K102k018j182K467l03k327J356J585k063n44K463p08
2292D57k005J583J303k222R8K090j123j555K032M48k105N22J800j297j180K055
2308I01q1j977R71J385j770m35J787l59j755J374J070j832j45J967q03j453J571
2325D16O35j875L58J732j313j056J836J54j969Q44J621j869n23K046m87j914J402
2342C8J250k064j30K068q26j646J745O32j858J45K116j362j379K030L02k220N93
2359e66J959j605j073K171Jk266J097J641j819o84K157m24j920J414J091j841
2375f67l30K210p56j727J687Q40k071J96J826j091j367J767M48j985N03J606j169
$$ plain form
2260 1173 451 -1740 171 1574 -983 -1071 1444 343 -1675 675 1461 -1234 -615 1649 147 -1482
2276 -1482 929 1263 -1366 -371 1731 -287 -1469 998 695 -1632 -276 1309 -754 -1298 1165 457
2292 457 -1548 35 1338 -884 -786 1304 181 -1374 658 1106 -999 -477 1323 26 -1154 901
2308 901 820 -1157 -186 1199 -571 -1006 781 422 -1333 41 1111 -721 -866 1101 298 -1155 416
2325 416 1051 -824 -466 1266 -47 -1103 733 887 -1082 -238 1383 -486 -1009 1037 550 -1364 38
2342 38 1288 -776 -906 1162 336 -1310 435 1067 -791 -646 1470 108 -1271 759 1061 -1159 -566
2359 -566 1393 -212 -1285 886 887 -1379 -282 1359 -460 -1144 1013 589 -1331 83 1174 -667
2375 -667 -997 1213 457 -1270 417 1257 -814 -618 1208 117 -1250 517 965 -1020 -517 1089 -80
2392h0j063J781J02j876R64J339j494o24J766l70j482J015J126j624k29J873q16
2409C08j231J398N00j673K20J553j045j049J561R6j583O00J380j283p33J628j15
2426E32j737J091J225j667k55J742o27j331J335P69j766K13J478q69j152J484
2442D65L70j680M88J440j144r67J632Q0j648O49J330j436n24J664k37j472R01
2459h9J075j534j77J530m13j228J007P63j416m9J530q57j061J315N24j559K01
2476d38J402r65q52J418J3j377N37J113j215m37J244q9j249Q40Q08j297l6J366
2494G86n75j030J099M96j245K29J189q31p63J082O4j122L91Q15p59n37J177p9
2512C87j176P03O28r85j11J203n55r56R30N50j125J18J113o73p49J071K88j214
$$ plain form
2392 -80 -1143 638 740 -1136 -172 1167 -327 -951 815 445 -1037 -22 1104 -520 -749 1124 308
2409 308 -923 475 975 -698 -478 1075 30 -1019 542 638 -945 -345 1035 -248 -981 647 532
2426 532 -1205 -114 1111 -556 -811 931 304 -1027 308 1077 -689 -476 1002 133 -1019 465
2442 465 835 -845 -357 1083 -61 -1028 604 684 -964 -315 1015 -421 -945 719 482 -990 -89
2459 -89 986 -548 -725 805 392 -836 171 934 -482 -531 999 142 -919 396 920 -639 -438
2476 -438 964 -1 -853 565 578 -799 -262 851 -364 -801 443 354 -895 -55 753 -544 -580 786
2494 786 211 -819 280 776 -469 -240 949 118 -645 437 501 -621 -230 585 -174 -711 466 387
2512 387 -789 -86 542 -443 -554 649 94 -862 68 618 -507 -389 724 51 -698 373 661 -553
2530e53L91R91r15n02J257j88j223O69Q50j148l17J234k87j263R31P60j261o6
2548f40J223m15r00R87M00j225K39J084n94r20J247K58j207K44J149j063o09J249
2566E07l4j202N16J063j284l61J361l81r03O86O47j110j07J210m64q85R47M40
2584F46j073J28R27m62p78J028J08r49L01Q89r53m17R37L6r51M48P23q65l15J039
2604D47j21j086P78M95q67j15R75n08o23Q92K80r38J70Q61o16m36Q67l3r75M67
2624h6O94q04l91R62j14q81O43N51q94j60R05l19p38P43M03r29L4R79n04o16P71
2645B49K62j020K52Q09o30l67Q41k8q29L99P62p60m32R00l6r67N87N43q11j84
2665d60Q76l00p96O90L76o96r2Q24l60p20P52L81p50J05O41m72k58N35k4o59L80
$$ plain form
2530 -553 -162 829 -86 -588 669 481 -742 -73 777 -371 -688 546 259 -1004 -73 687 -574 -640
2548 -640 583 168 -732 255 655 -570 -331 753 159 -761 486 744 -463 -219 930 -133 -742 507
2566 507 473 -729 -213 850 -434 -795 566 185 -718 -32 615 -495 -602 608 144 -741 206 646
2584 646 -427 -299 628 166 -612 416 524 -425 -124 765 -188 -605 332 368 -583 -135 588 -277 -592 447
2604 447 326 -760 18 513 -354 -469 506 -2 -625 267 547 -391 -221 640 24 -412 455 422 -553 -86
2624 -86 608 -196 -587 375 261 -620 23 574 -320 -480 425 106 -632 111 514 -415 -381 598 94 -522 249
2645 249 511 -509 -257 552 -78 -445 396 368 -461 -62 700 -60 -492 408 372 -595 -8 535 -276 -460
2665 -460 416 116 -680 10 386 -310 -402 422 62 -658 94 475 -275 -170 471 -1 -259 276 252 -407 -27
$$ [...]
8191B2
##END NTUPLES=NMR FID
##END=
