##TITLE=1H_PhBBC3108
 CDCl3, 8 sc, 
 1.9.2020
##JCAMPDX= 6.0         $$ Bruker NMR JCAMP-DX V2.0
##DATA TYPE= NMR FID
##DATA CLASS= NTUPLES
##ORIGIN= UXNMR, Bruker Analytische Messtechnik GmbH
##OWNER= root
$$ XWIN-NMR		Version 3.5
$$ Tue Sep  1 10:56:47 2020 Russian Standard Time (UT+4h)  she@DPX200
##.OBSERVE FREQUENCY= 200.1315066352
##.OBSERVE NUCLEUS= ^1H
##.DELAY= (6, 6)
##.ACQUISITION MODE= SIMULTANEOUS
##.ACQUISITION SCHEME= undefined
##.AVERAGES= 8
##.DIGITISER RES= 18
##SPECTROMETER/DATA SYSTEM= spect
##.PULSE SEQUENCE= zg30
##.SOLVENT NAME= CDCl3
##.SHIFT REFERENCE= (INTERNAL, CDCl3, 0, 15.7039)
##AUDIT TRAIL= $$ (NUMBER, WHEN, WHO, WHERE, WHAT)
$$ ##TITLE= Audit trail, XWIN-NMR		Version 3.5
$$ ##JCAMPDX= 5.01
$$ ##ORIGIN= Bruker BioSpin GmbH
$$ ##OWNER= she
$$ F:/spectra/data/she/nmr/H-F/1/audita.txt
$$ ##AUDIT TRAIL=  $$ (NUMBER, WHEN, WHO, WHERE, WHAT)
(   1,<2020-09-01 10:55:09.51 +0400>,<she>,<DPX200>,
      <created by zg, POWCHK disabled, PULCHK disabled
       configuration hash MD5:
       00 E9 B6 7A A2 85 ED C7 34 08 36 98 17 FE 4E 26
       data hash MD5: 16K
       25 D6 A7 E7 58 5A E5 57 D3 8A 0B 00 1D 7B 75 00>)
$$ ##END=
$$ 
$$ hash MD5
$$ 01 AE A8 3D A7 E5 F0 36 2D 6A 8F 13 23 7B A4 A0
##$RELAX= 
##$RELAX= 
##$RELAX= 
##$RELAX= 
##$RELAX= 
##$RELAX= 
$$ Bruker specific parameters
$$ --------------------------
##$DU= <F:/spectra>
##$EXPNO= 1
##$NAME= <H-F>
##$PROCNO= 1
##$TYPE= <nmr>
##$USER= <she>
##$AMP= (0..31)
100 100 100 100 100 100 100 100 100 100 100 100 100 100 100 100 100 100 
100 100 100 100 100 100 100 100 100 100 100 100 100 100 
##$AQSEQ= 0
##$AQ_mod= 1
##$AUNM= <au_zg>
##$AUTOPOS= <>
##$BF1= 200.13
##$BF2= 200.13
##$BF3= 200.13
##$BF4= 200.13
##$BF5= 200.13
##$BF6= 200.13
##$BF7= 200.13
##$BF8= 200.13
##$BYTORDA= 1
##$CFDGTYP= 0
##$CFRGTYP= 5
##$CHEMSTR= <none>
##$CNST= (0..31)
1 1 145 1 1 1 1 1 1 1 1 1 1 1 1 1 1 1 1 1 1 1 1 1 1 1 1 1 1 1 1 1 
##$CPDPRG= <>
##$CPDPRG1= <>
##$CPDPRG2= <>
##$CPDPRG3= <>
##$CPDPRG4= <mlev>
##$CPDPRG5= <mlev>
##$CPDPRG6= <mlev>
##$CPDPRG7= <mlev>
##$CPDPRG8= <mlev>
##$CPDPRGB= <>
##$CPDPRGT= <>
##$D= (0..31)
0 1.2 0 0 0 0 0 0 0 0.06 0 0.03 0 0 0 0 0.0002 0 0 0 0 0 0 0 0 0 0 0 0 
0 0 0 
##$DATE= 1598943308
##$DBL= (0..7)
120 120 120 120 120 120 120 120 
##$DBP= (0..7)
150 150 150 150 150 150 150 150 
##$DBP07= 0
##$DBPNAM0= <>
##$DBPNAM1= <>
##$DBPNAM2= <>
##$DBPNAM3= <>
##$DBPNAM4= <>
##$DBPNAM5= <>
##$DBPNAM6= <>
##$DBPNAM7= <>
##$DBPOAL= (0..7)
0.5 0.5 0.5 0.5 0.5 0.5 0.5 0.5 
##$DBPOFFS= (0..7)
0 0 0 0 0 0 0 0 
##$DE= 6
##$DECBNUC= <off>
##$DECIM= 32
##$DECNUC= <off>
##$DECSTAT= 4
##$DIGMOD= 1
##$DIGTYP= 9
##$DL= (0..7)
0 120 120 120 120 120 120 120 
##$DP= (0..7)
150 150 150 150 150 150 150 150 
##$DP07= 0
##$DPNAME0= <>
##$DPNAME1= <>
##$DPNAME2= <>
##$DPNAME3= <>
##$DPNAME4= <>
##$DPNAME5= <>
##$DPNAME6= <>
##$DPNAME7= <>
##$DPOAL= (0..7)
0.5 0.5 0.5 0.5 0.5 0.5 0.5 0.5 
##$DPOFFS= (0..7)
0 0 0 0 0 0 0 0 
##$DQDMODE= 0
##$DR= 18
##$DS= 0
##$DSLIST= <SSSSSSSSSSSSSSS>
$$ [...]
##$SUBNAM2= <"">
##$SUBNAM3= <"">
##$SUBNAM4= <"">
##$SUBNAM5= <"">
##$SUBNAM6= <"">
##$SUBNAM7= <"">
##$SUBNAM8= <"">
##$SUBNAM9= <"">
##$SW= 16.880792210976
##$SWIBOX= (0..15)
0 0 2 0 0 0 0 0 0 0 0 0 0 0 0 0 
##$SW_h= 3378.37837837838
##$TD= 16384
##$TD0= 1
##$TE= 0
##$TE2= 300
##$TE3= 300
##$TEG= 300
##$TL= (0..7)
0 120 120 120 120 120 120 120 
##$TP= (0..7)
150 150 150 150 150 150 150 150 
##$TP07= 0
##$TPNAME0= <>
##$TPNAME1= <>
##$TPNAME2= <>
##$TPNAME3= <>
##$TPNAME4= <>
##$TPNAME5= <>
##$TPNAME6= <>
##$TPNAME7= <>
##$TPOAL= (0..7)
0.5 0.5 0.5 0.5 0.5 0.5 0.5 0.5 
##$TPOFFS= (0..7)
0 0 0 0 0 0 0 0 
##$TUNHIN= 0
##$TUNHOUT= 0
##$TUNXOUT= 0
##$USERA1= <user>
##$USERA2= <user>
##$USERA3= <user>
##$USERA4= <user>
##$USERA5= <user>
##$V9= 5
##$VALIST= <valist>
##$VCLIST= <CCCCCCCCCCCCCCC>
##$VD= 0
##$VDLIST= <DDDDDDDDDDDDDDD>
##$VPLIST= <PPPPPPPPPPPPPPP>
##$VTLIST= <TTTTTTTTTTTTTTT>
##$WBST= 1024
##$WBSW= 4
##$XGAIN= (0..3)
0 0 0 0 
##$XL= 0
##$YL= 0
##$YMAX_a= 49547
##$YMIN_a= -50333
##$ZGOPTNS= <>
##$ZL1= 120
##$ZL2= 120
##$ZL3= 120
##$ZL4= 120
##$ABSF1= 10
##$ABSF2= 0
##$ABSG= 5
##$ABSL= 3
##$ALPHA= 0
##$AQORDER= 0
##$ASSFAC= 0
##$ASSFACI= 0
##$ASSFACX= 0
##$ASSWID= 0
##$AUNMP= <proc_1d>
##$AZFE= 0.1
##$AZFW= 0.1
##$BCFW= 1
##$BC_mod= 2
##$BYTORDP= 1
##$COROFFS= 0
##$CY= 11.3945322036743
##$DATMOD= 1
##$DC= 2
##$DFILT= <>
##$DTYPP= 0
##$F1P= 16.9975609425685
##$F2P= -3.02152046262296
##$FCOR= 0.5
##$FTSIZE= 0
##$FT_mod= 4
##$GAMMA= 1
##$GB= 0.15
##$INTBC= 1
##$INTSCL= 1
##$ISEN= 128
##$LB= 0.24
##$LEV0= 0
##$LPBIN= 0
##$MAXI= 10000
##$MC2= 0
##$MEAN= 0
##$ME_mod= 0
##$MI= 1.114404
##$NCOEF= 0
##$NC_proc= 0
##$NLEV= 6
##$NOISF1= 3.799351
##$NOISF2= 2.8
##$NSP= 1
##$NTH_PI= 0
##$NZP= 0
##$OFFSET= 15.70392
##$PC= 1
##$PHC0= -10133.02
##$PHC1= 14.80092
##$PH_mod= 1
##$PKNL= yes
##$PPARMOD= 0
##$PSCAL= 0
##$PSIGN= 0
##$REVERSE= no
##$SF= 200.130013532006
##$SI= 16384
##$SIGF1= 3
##$SIGF2= 2
##$SINO= 400
##$SIOLD= 16384
##$SREGLST= <1H.CDCl3>
##$SSB= 0
##$STSI= 0
##$STSR= 0
##$SW_p= 3612.71676300578
##$SYMM= 0
##$S_DEV= 0
##$TDeff= 0
##$TDoff= 0
##$TI= <>
##$TILT= no
##$TM1= 0
##$TM2= 0
##$TOPLEV= 0
##$USERP1= <user>
##$USERP2= <user>
##$USERP3= <user>
##$USERP4= <user>
##$USERP5= <user>
##$WDW= 1
##$XDIM= 8192
##$YMAX_p= 0
##$YMIN_p= 0
$$ End of Bruker specific parameters
$$ ---------------------------------
##NTUPLES= NMR FID
##VAR_NAME=  TIME,          FID/REAL,        FID/IMAG
##SYMBOL=    X,             R,               I
##VAR_TYPE=  INDEPENDENT,   DEPENDENT,       DEPENDENT
##VAR_FORM=  AFFN,          ASDF,            ASDF
##VAR_DIM=   8192,          8192,            8192
##UNITS=     SECONDS,       ARBITRARY UNITS, ARBITRARY UNITS
##FACTOR=    0.000296,      1,               1
##FIRST=     0,             0,               0
##LAST=      2.424536,      0,               0
##MIN=       0,             -50333,          0
##MAX=       2.424536,      49547,           0
$$ Real data points
##PAGE= N=1
##DATA TABLE= (X++(R..R)), XYDATA
$$ [...]
1745b222K984N97l618M145j432k392M170k918n26L690m000J391K126m190L029
1760H34M03l487M048j616k067M038l103j09L400m067J610J927m140L248J75l253
1776b159L973j761j904M052l141O1L202l976J731J739l939L243kl140L926j957
1792e2j640L935l168J55L040m075J836J548l790L250k46k989L797j943j432L770
1808A996l221L78K753l901K019J312l614L364m82k822L832k048j160L675l297
1823a216M66K603l791K154J196l461L228o30k506L740k174q82L376l313O81K334
1839A805l666K339Q62l333L274q55k283L655k202q37L262l332P86K177l550K313
1855D15P98l228L152q90k041L547k299n89L039l248J017J917l449K500M55l042
$$ y = [-2222, 762, 1359, -2259, 1886, 454, -1938, 2232, -686, -1212, 2478, -1522, -131, 1995, -2195, 834, 1237, -2250, 1798, 182, -1885, 2153, -950, -1059, 2341, -1726, -116, 1811, -2329, 919, 1094, -2159, 1814, 53, -1851, 2201, -940, -879, 2323, -1653, 78, 1817, -2122, 1121, 1119, -2021, 1905, -52, -1692, 2243, -925, -770, 2270, -1805, 31, 1579, -2211, 1039, 793, -2196, 1601, -342, -1774, 1996, -1225, -847, 1906, -1995, 24, 1336, -2278, 1086, 604, -2218, 1614, -434, -1594, 2081, -1216, -750, 1853, -1938, 216, 1412, -2049, 1179, 549, -1957, 1783, -391, -1273, 2103, -1210, -529, 1805, -1861, 478, 1340, -1993, 1281, 426, -1857, 1798, -404, -1241, 2021, -1311, -525, 1652, -1898, 415, 1213, -2015, 1137, 247, -1794, 1753, -546, -1135, 1904, -1344, -327, 1590, -1859, 641, 1096, -1946]
1871a946L220j122j796L492k415m17K832l244J185J717l249K475J76k766L181
1886A323j277j617L351k540k19K645l157J317J577l196K529k9k643L242j380j361
1902a435L179k560o5K534l130J575J290l106K526j35k392L246j503j236L076k715
1918h51K40K421l203J709J147l098K624k61k361L274j621j135L035k790M49K186
1934A765l075J699R66l006K718m79k109L163j821r11K910k836N54K160l198J876
1950C76P80l019K843n04k087L214j975q10K866k878Q17J961l120J975O08k873
1966a826K919o88j900L252k182o65K819k841Q55J930l201J995M68k649K844p89
1982C41j832L066k103m90K669k811J016J641l121K081M16k634K949r14j723K967
$$ y = [-1946, 1274, 152, -1644, 1848, -567, -984, 1848, -1396, -211, 1506, -1743, 732, 908, -1858, 1323, 46, -1571, 1780, -760, -979, 1666, -1491, -174, 1403, -1793, 736, 707, -1936, 1306, -74, -1435, 1744, -816, -881, 1653, -1477, 98, 1388, -1718, 808, 673, -1719, 1527, 24, -1212, 1864, -851, -611, 1810, -1393, 316, 1463, -1635, 989, 728, -1633, 1641, 20, -1115, 1920, -870, -421, 1765, -1310, 389, 1355, -1651, 1067, 588, -1521, 1642, -179, -1090, 1820, -1016, -462, 1698, -1500, 376, 1156, -1863, 980, 476, -1611, 1603, -372, -1182, 1684, -1194, -377, 1584, -1536, 439, 1047, -1826, 1093, 405, -1495, 1757, -425, -1090, 1729, -1112, -257, 1673, -1528, 467, 935, -1714, 1130, 341, -1491, 1575, -528, -1018, 1651, -1160, -144, 1497, -1624, 457, 873, -1761, 1188, 274, -1449, 1518]
1998A518k136l39K621k820J037J573l033K134L47k527K850r73j591K888k084k56
2014g91K507k797J045J475l004K212K09k436K883j120j515K920k245n6K413k873
2030a173J110J250k800K250J23k269K733j330j217K819k302J06K236k894J340
2045a8J053k727K459r9k203K805j351j133K810k267K47K026k805J391J051k637
2061a398K400k76k016K711j546q32K646k334L96J848k855J526Q36k481K362m37
2077E50j914K684j528p41K499k330M54J708k712J670O34k397K433o76j691K719
2093A362j646n72K404k452O57J575k708J826N52k415K447p57j570K656j716m02
2109g59K257k499P98J477k615J881K90k289K442r01j386K636j892l17K211k561
$$ y = [1518, -618, -957, 1664, -1156, -119, 1454, -1579, 555, 902, -1625, 1225, 252, -1339, 1549, -535, -791, 1716, -1081, -36, 1439, -1565, 647, 856, -1580, 1303, 183, -1332, 1588, -657, -713, 1700, -1173, -63, 1187, -1613, 637, 760, -1509, 1224, -106, -1323, 1496, -806, -700, 1536, -1358, -18, 1035, -1692, 767, 668, -1535, 1270, -81, -1214, 1596, -671, -424, 1602, -1203, 188, 1239, -1398, 1002, 726, -1290, 1421, -125, -957, 1689, -645, -249, 1599, -1256, 270, 1106, -1375, 987, 550, -1364, 1320, -208, -949, 1550, -780, -326, 1382, -1330, 340, 974, -1423, 1010, 334, -1357, 1362, -284, -856, 1548, -904, -247, 1328, -1380, 446, 998, -1417, 1030, 273, -1297, 1359, -357, -759, 1498, -1001, -203, 1274, -1341, 540, 830, -1459, 983, 82, -1304, 1332, -560, -877, 1334, -1227]
2125a227Q96J417k606J899K81k260K531j002j189K603j927j66K137k563J085J266
2141A175k557K139j8k161K609j141j097K603k122j4K064k621J198J152k584K094
2157G19q2k098K593j219j001K500k175J29J985k662J359R91k558K135j63j965
2173a512K627j282r33K496k223K18J909k521J381Q87k449K144l14j741K589j450
2189a74p42K359k265M07J723k492J500P04k454K235m03j702K624j568p04K354
2205A402k291N41J596k497J508N62k288K240n88j459K577j651n44K240k301O83
2221b70J522k483J653L45k137K328o75j377K449j664l98K096k253Q56J282k487
2237a213J724J54k016K390q83j251K418j827j95J949k221Q78J150k411J736J75
$$ y = [-1227, -331, 1086, -1520, 379, 660, -1600, 931, -71, -1260, 1343, -584, -750, 1387, -1176, -91, 1175, -1382, 757, 739, -1422, 1187, 46, -1051, 1552, -570, -584, 1480, -1141, 57, 1209, -1375, 719, 637, -1461, 1132, -87, -1088, 1412, -763, -634, 1351, -1311, 48, 1039, -1519, 616, 453, -1512, 1115, -167, -1100, 1396, -827, -609, 1300, -1221, 160, 1047, -1402, 742, 428, -1313, 1276, -174, -916, 1443, -822, -415, 1308, -1184, 316, 1020, -1434, 801, 398, -1304, 1320, -248, -952, 1402, -889, -348, 1248, -1249, 259, 821, -1467, 773, 185, -1274, 1303, -348, -892, 1348, -953, -270, 1252, -1231, 422, 767, -1370, 958, 283, -1094, 1355, -309, -707, 1389, -864, -8, 1274, -1213, 511, 665, -1351, 1039, 156, -1095, 1323, -504, -699, 1250, -971, -93, 1057, -1354, 382, 557]
2253E57j904K264q91j121K283j893O8J824k243R98R77k314J872j3j796K425j174
2270h1r42K280j909J63J754k317J117Q47k253J982j53j650K284j264p20K108j970
2287g24L31J608k320J239O91k122K031l50j567K299j372o16K128k017M56J551
2303A246k374J341N61k041K050m50j404K230j523m29K094k087N89J254k274J567
2319C50L89k003K212p36j372K376j632k97J964k168P57J180k266J623K29j882
2335a276K190q28j220K303j641k31J939k191Q44J166k381J770K22j929K228q94
2351G1j097K238j710l9J842k208Q90R80k193J839Mj766K234j110r66K295j772
2368d68K5J733k234J016R75k194J856j33j717K204j086p52K114j828J34J622k199
$$ y = [557, -1347, 917, 26, -1095, 1188, -705, -637, 1187, -1056, -58, 919, -1395, 477, 464, -1332, 1093, -81, -1023, 1257, -652, -489, 1265, -1052, 65, 912, -1341, 641, 488, -1162, 1122, -142, -862, 1246, -724, -393, 1215, -1105, 134, 825, -1297, 734, 384, -1183, 1116, -256, -872, 1256, -761, -305, 1246, -1128, 213, 774, -1267, 783, 333, -1071, 1159, -364, -793, 1301, -786, -197, 1057, -1217, 350, 739, -1264, 948, 212, -1160, 1216, -416, -713, 1251, -917, -160, 1020, -1246, 377, 606, -1276, 914, 86, -1134, 1169, -472, -703, 1236, -955, -111, 1055, -1326, 444, 666, -1263, 965, 71, -1026, 1212, -498, -537, 1305, -903, -13, 967, -1226, 613, 617, -1149, 1085, -25, -991, 1304, -468, -443, 1290, -944, 72, 1047, -1147, 709, 576, -1141, 1063, -23, -775, 1339, -489, -355, 1267, -932]
2385i32J087Q34k118J883l06j540K176j204p06K110j976L52J491k226J192O75
2401G92j999J904m00j457K085j168n52J903j911L90J391k161J384M31j873J948
2417G07m78j339K208j399m06J890j981N07J296k105J368M03j873J918n55j190
2433a029K125j420k81J763k026O74J144k050J555J98j796J968p41j046K092j478
2449c48k24J693j996P87J008j948J472O7j646K000q08r83K102j623l3J647j992
2466h25Q99Q16j958J663j15j540K016r81p73J931j660Q7J476j982J059O82j846
2483a051J647k41j489K022j045o57J844j733K76J369j971J131O11j857J661k71
2499B46j334K063j167n16J833j815L81J330j968J224M67j827J807m75j226K039
$$ y = [-932, 155, 989, -1129, 754, 448, -1092, 1084, -120, -826, 1284, -692, -340, 1151, -1075, 117, 792, -1207, 697, 297, -1160, 925, -243, -795, 1108, -803, -413, 978, -1183, 201, 632, -1241, 707, 229, -1110, 1098, -301, -707, 1183, -798, -291, 1005, -1100, 268, 671, -1202, 716, 161, -1029, 1096, -324, -605, 1158, -868, -194, 950, -1100, 455, 653, -1143, 825, 84, -962, 1130, -348, -572, 1121, -875, -88, 920, -1028, 444, 511, -1135, 865, 57, -926, 1176, -447, -480, 1167, -825, 74, 890, -1068, 595, 480, -1060, 956, -25, -798, 1133, -527, -440, 1036, -946, 113, 795, -1051, 596, 355, -1134, 888, -157, -814, 1030, -703, -427, 942, -1029, 102, 713, -1144, 517, 246, -1088, 975, -192, -708, 1125, -690, -309, 1021, -947, 277, 744, -1083, 724, 249, -977, 1062]
2515A062j314l60J745j887N30J183j999J390K18j691J854o69j003J972j354l07
2531f30J700j944O98J133k022J460J58j679J897p23r40J967j473j89J646j898
2547h39Q25R44k044J497J43j611J895p09j002J979j498q6J568j859P80Q50j862
2564a029J529q4j526J950q76q20J834j557P0J482j862Q98P61j869J544q9j378
2581a022J888r24p07J797j555J95J332j816R94O24j751J598k37j270J825j023
2597e2o49J847j681K90J263j833J027M83j730J668l15j226J836j164m27J685j632
2614f10L67J126j818J165L45j547J650m60j092J722j125l28J573j667N46J055
2630I02j759J178K15j472J614n21r85J795j257j78J486j651N74Q47j735J283J15
$$ y = [1062, -252, -612, 1133, -754, -224, 959, -1040, 350, 568, -1123, 731, 62, -941, 1031, -323, -630, 1070, -874, -176, 957, -1065, 395, 553, -1126, 771, 48, -892, 1075, -398, -587, 1059, -839, -14, 930, -1114, 383, 526, -1085, 810, 101, -901, 1078, -420, -506, 1062, -797, -17, 833, -1029, 500, 416, -1110, 840, -36, -856, 978, -579, -509, 973, -889, 9, 770, -1099, 445, 356, -1022, 866, -58, -765, 1032, -523, -328, 1004, -812, 182, 806, -945, 653, 416, -854, 971, -52, -701, 1146, -535, -245, 1018, -815, 212, 695, -1035, 633, 318, -908, 928, -236, -663, 1022, -610, -243, 883, -935, 230, 575, -972, 678, 218, -874, 848, -277, -605, 968, -699, -153, 902, -857, 321, 536, -936, 678, 157, -828, 967, -290, -468, 1018, -633, -59, 788, -947, 336, 451]
2647D51j383J672o72q29J647j258j08J426j679P19P28j643J289K9j300J608o88
2664Ip50J646j309J7J274j652P87O59j614J427q5j236J615q20o18J603j355J28
2682b74J166j594Q24O19j678J455k49j077J626r71m89J564j479K35J118j631J003
2699A68L68j465J444k87j105J605r95l18J469j454L35J027j695J099L18j398J444
2716E60m18r50J612j062k93J481j562M50R59j632J112K54j403J506n25q74J608
2733H23j092k59J428j523M87Q46j511J153R1j356J548n74p97J600j175r9J351
2750I41j578O00P61j537J224P6j308J513o84p17J609j214j6J186j527O44P28j507
2768h06J232n6j177J503p64n76J494j266R4J144j520P20O43j508J312j55j114
$$ y = [451, -932, 740, 68, -761, 886, -372, -480, 946, -733, -14, 714, -929, 360, 389, -911, 697, 9, -741, 905, -404, -387, 887, -765, 22, 681, -933, 494, 409, -827, 788, -32, -650, 953, -402, -274, 892, -702, 122, 741, -937, 518, 269, -808, 818, -153, -642, 922, -557, -322, 796, -835, 168, 536, -929, 515, 228, -877, 728, -267, -585, 884, -570, -235, 792, -903, 196, 514, -884, 560, 142, -808, 804, -258, -551, 930, -632, -182, 777, -855, 257, 511, -892, 614, 89, -785, 823, -269, -528, 900, -623, -136, 710, -801, 352, 443, -913, 635, 61, -736, 864, -311, -410, 941, -637, -37, 724, -813, 411, 487, -821, 692, 8, -709, 900, -314, -330, 856, -671, -27, 701, -806, 426, 370, -807, 696, -68, -644, 850, -416, -322, 822, -698, 22, 665, -843, 469, 314, -800]
2785h00J463o97n65J400j272J54J101j511Q36M50j372J246k11j044J509q07m32
2802e52J330j260K30R72j386Q08M29j294J250l42q93J412q15l14J227j246L35
2819a09Q57j425R06K48j217J290l73q21J374r17k15J209j328M08P56j329R30J60
2837D04j132J298m76p37J356j013p9J113j365N53P11j337R64P0j147J338n36n98
2855f13J343j072j8J052j349N79O23j349J085j3j028J336o48m84J200j072J35
2872b93R59j285O32N27j284J096r7r73J305o24m46J218j145J26R08j241P49L29
2890D61j197J119j99q34J265p54k77J120j125K69Q42j354P94L15j159J166k44
2907B08q38J239p45k68J133j218M12P36j230P54K57j143J183l56o90J244r32j60
$$ y = [-800, 663, -34, -599, 801, -471, -317, 784, -727, 109, 559, -813, 433, 222, -822, 687, -120, -552, 778, -482, -252, 720, -666, 142, 571, -723, 527, 185, -708, 704, -111, -425, 802, -444, -109, 748, -677, 229, 477, -740, 550, 177, -644, 730, -187, -402, 807, -521, -113, 643, -686, 244, 404, -728, 570, 94, -643, 713, -300, -379, 734, -631, -78, 633, -704, 260, 330, -817, 521, -15, -613, 730, -342, -360, 692, -657, -78, 545, -804, 281, 268, -760, 576, -72, -556, 644, -428, -293, 666, -619, 13, 540, -744, 352, 255, -718, 587, -37, -483, 735, -410, -284, 624, -617, 132, 461, -736, 383, 184, -650, 615, -139, -416, 704, -421, -152, 690, -664, 130, 445, -714, 452, 208, -630, 609, -136, -404, 729, -489, -77, 659, -571, 183, 440, -703, 480, 124, -566, 678, -254, -414]
2925d14J125j213L96P52j293Q60J06j070J208l38p77J296r02q9R90j149M11O53
2943E52j232Q83J73j040J182n07n68J231r61j2R10j102M81O41j266R27M3j006
2961f71J207n05n15J127r41%R44j184N84N08j265J079p1r36J198n93m21J131j013
2980c37R9Q63j120N45M00j103R65j7r34J168o08l45J060r55J39Q17j201O59L36
2999D31j114J004j47p53J097o90k79J120r96J37O85j078P02K40r57R62k88o01
3017e25J035o98j73R80j035L40O35j104P25K12r95J000k66o16R83o63j58R76j037
3036c84L65N64j067P68P0q33J015l92o17J067p39o8Q24j003L73O06j082P60J18
3055C45q62R69m33m58J049q03p5Q77j022M36L86r31Q17n7p71J001n19l89J044
$$ y = [-414, 711, -502, -106, 646, -647, 213, 319, -751, 457, 119, -658, 638, -264, -353, 637, -512, -101, 552, -680, 203, 376, -664, 518, 11, -557, 674, -287, -299, 611, -491, -10, 631, -635, 292, 335, -671, 536, 31, -484, 643, -298, -298, 646, -538, 46, 554, -711, 368, 297, -639, 559, -34, -455, 676, -337, -238, 625, -495, 50, 450, -653, 312, 295, -639, 529, -79, -424, 636, -319, -180, 637, -564, 95, 431, -683, 321, 174, -579, 518, -172, -451, 669, -327, -190, 495, -583, 119, 359, -598, 364, 76, -525, 510, -188, -361, 619, -416, -76, 559, -545, 180, 392, -603, 397, 131, -485, 498, -165, -323, 653, -384, -19, 545, -522, 246, 316, -517, 498, 106, -511, 556, -183, -251, 573, -430, -57, 549, -533, 227, 345, -517, 452, 19, -439, 610, -193, -268, 609, -413, 23, 409, -522, 295, 238, -533, 468, -51, -440, 604]
3074F04q89J23P08r79M81L96j011Q66q6p46R43n11l26J034r10R8P40j034N71L49
3094D21r94R01j99o67J006n82k90R40q66J41P48j071O20K56q97R26k42o40J029
3113E40o69k17Q92q91J77O64j025P14J81r22R19k91n79J012o58k32R40r27K47
3132a25N51r23O44J67q62R44l29n63R67o06j31Q07r60K99N86r86O53J70q56R38
3152C85l85m45R64p49l1P73r23L45N25r74P20O4q32Q72k92n01R64o89n6P60r26
3173d31L73M75q92O39R3p39Q91m30l95R81p88J5O81q60M05M24r03P03j8o56Q60
3194D28m50l37Q55o82L5O91r28M45L20q54P70q7o92R31n39k59Q44p53J22O33q49
3215c56M17K41p86Q25k02o05Q74m64l05Q62p91J79N09q58N45K14q16P49j23n64
$$ y = [604, -285, -162, 546, -433, 48, 444, -567, 299, 213, -533, 410, -101, -427, 607, -303, -205, 535, -499, 72, 421, -573, 328, 129, -538, 468, -114, -404, 536, -330, -189, 559, -512, 108, 364, -533, 393, 151, -489, 540, -129, -346, 546, -345, -168, 496, -529, 185, 366, -556, 363, 72, -507, 505, -153, -385, 555, -372, -125, 426, -497, 147, 314, -548, 396, 67, -496, 471, -135, -266, 541, -419, -120, 466, -520, 133, 303, -553, 385, 0, -445, 519, -230, -261, 512, -411, -66, 459, -515, 205, 269, -563, 309, 17, -484, 480, -209, -265, 495, -431, -58, 417, -475, 164, 257, -482, 409, -21, -416, 565, -223, -208, 473, -387, 18, 442, -461, 242, 224, -432, 428, -22, -359, 496, -186, -151, 540, -388, 57, 377, -477, 293, 206, -486, 445, -94, -353, 491, -262, -140, 493, -356, 61, 302, -484, 341, 139, -466, 408, -56, -361, 501, -290, -111, 398, -460, 85, 299, -517, 232, 109, -455]
3235d55R16n76k20P90p49K10N20q77N70J44p62Q16k53m81Q58n73j48P33p52K25
3255f4M33q19N87J32p01P86l16m19Q57o27j19P86q75L70M13q85P04O3p66Q65l67
3276C8m28R02o84j0O33p53K88M26q60O82k4o63Q28l75l59Q09o71K3O51q36L86
3297CL41p96O81r9n88Q45l77l76P87o06QN72p73L35L48p69O50p5n54P90m51k34
3319c38P88p27J56N02q06M74K41p49P39j76n28P63m15k11P07p25J71N31q23N01
3339G5K03p30P57j60n25Q05n32j56O98p12J95M99q30N31K19p61O63j56m61P91
3359D13n29j07O65o87K12M01p62N03Q8o44O82j61m67P72m98j25O03o74K65M01
3379C51p43N39O6o45O85k09l93P36n48l2N92p14K94L54p15N20N6o34P55l21l34
$$ y = [-455, 461, -115, -335, 455, -294, -84, 436, -441, 129, 273, -489, 327, 74, -407, 451, -122, -270, 463, -289, -64, 369, -450, 137, 269, -432, 354, 38, -381, 476, -151, -270, 516, -359, 11, 424, -461, 243, 306, -460, 405, 38, -390, 512, -172, -182, 451, -302, -14, 412, -448, 234, 210, -453, 375, 0, -359, 450, -221, -198, 453, -383, 3, 344, -452, 229, 130, -458, 387, 10, -366, 421, -185, -177, 395, -378, -43, 305, -464, 186, 111, -443, 347, -104, -338, 450, -277, -121, 381, -425, 49, 290, -459, 280, 104, -424, 339, -76, -287, 420, -305, -134, 397, -426, 75, 278, -452, 305, 145, -380, 425, -107, -263, 435, -277, -82, 417, -413, 118, 337, -424, 239, 83, -378, 413, -116, -223, 442, -245, -33, 368, -394, 109, 197, -447, 235, 74, -393, 379, -119, -244, 359, -315, -50, 351, -392, 147, 213, -432, 253, 44, -349, 387, -161, -193, 399, -315, -21, 333, -382, 138, 194, -440, 315, -6, -340]
3400c40P61o24P6N40p32K98L61p64O27n3n22P05l19l09P15n88M5N52p21L52K95
3421C55p17N84pn88P59m20k62P15n93Q0N06p22L61K97p37O16n7m78O49l87k20
3442b66O63n76R2M40p26M51J77o05N58j10m52P11m37j77O47o43J47M63p32M57
3462H2J61o75P12k11m45P54m72j49O52o95K17M57p76N10R9o84P67k29l99P18n02
3483a08j13O05o45K54L23o89N47%n64O78k32l57O65n05p6O23p33L11L63o88N12
3504A71O8n91O18j90k99O10n35kN39o40K63K40o27N73k0n28O78l95k24O48n23
3525a66k3N45o64L16K88o84N18m1n11P19l00k73N94n38J00M62o36L23K40o67O11
3546B13j37m04O00k59k85O65o04Q7M73o82M56J23o50O13j14l95O14l44j51N49
$$ y = [-340, 421, -203, -127, 413, -319, -21, 340, -424, 203, 150, -372, 333, 14, -295, 420, -168, -123, 429, -292, 60, 355, -362, 222, 215, -373, 386, -34, -296, 419, -174, -94, 412, -310, 51, 348, -389, 227, 170, -308, 341, -46, -266, 397, -179, -87, 353, -373, 78, 255, -350, 208, 98, -354, 357, -80, -257, 390, -253, -106, 357, -375, 82, 243, -432, 280, 69, -376, 378, -94, -243, 409, -286, -69, 388, -388, 122, 221, -463, 304, 75, -324, 394, -108, -221, 384, -261, -7, 316, -373, 174, 174, -390, 288, 56, -301, 364, -141, -217, 406, -327, -16, 347, -341, 171, 239, -352, 266, 76, -223, 387, -148, -150, 389, -251, 12, 252, -375, 198, 178, -350, 328, -67, -291, 357, -166, -189, 356, -308, 8, 296, -388, 130, 89, -422, 297, -3, -276, 318, -220, -120, 342, -294, 29, 269, -398, 213, 76, -328, 272, 13, -272, 393, -211, -124, 349, -333, 123, 246, -404, 209, 95, -300, 314, -30, -181, 368]
3566C68n54P7M42o39L79J35n36N55j27m00O45m50p9N67n73J00L96o65M68J47n87
3587c31O25k14l90O60m68j08N38n20J64L45o25N01J2n43N68k21k59O14m67j05
3607b24N72o00K02K70n74M68N2n29O19k72k34N74m70JM82n91K29K83o09M86Jm79
3629c43O17l08k46O01n13J24M17n69K52K05n24M75rm49N85l20j99N83n30O5M15
3650C29n58L11K03o41N53r4m35N87l46r2N07n30J21L84n80L03J98n04M77r3m05
3671c05N66l64r0N38o09J69L75n19L00N1m50N22j30l64N79l79r0N31n27J66L34
3692C04o29M43N4n12N77k37l20N85l87j3M72o02K56K41n41M73K6m30M82k11k89
3713b58N46l97m3M55n28K12K47n23M27M6m41N02k18k60N56m68K4M37n90K93K79
$$ y = [368, -186, -109, 333, -306, 73, 208, -328, 227, 100, -300, 345, -105, -184, 383, -190, -90, 306, -359, 109, 256, -331, 294, 80, -310, 350, -118, -226, 312, -208, -44, 301, -324, 177, 189, -354, 214, -7, -266, 348, -119, -224, 348, -252, -50, 220, -354, 114, 166, -363, 256, -16, -250, 324, -146, -145, 337, -254, -25, 258, -351, 135, 136, -343, 274, -34, -280, 321, -192, -68, 349, -220, 32, 237, -287, 188, 179, -270, 315, -5, -204, 379, -151, -86, 329, -229, 82, 285, -356, 197, 103, -332, 255, -91, -183, 324, -206, -85, 299, -281, 22, 220, -284, 193, 100, -305, 261, -103, -193, 345, -264, -95, 280, -239, 61, 112, -338, 184, 54, -310, 269, -110, -200, 331, -196, -30, 304, -325, 118, 172, -340, 237, 0, -320, 265, -122, -135, 337, -265, -9, 232, -309, 164, 190, -240, 242, 31, -258, 288, -109, -152, 303, -225, -13, 234, -289, 138, 184, -257, 245, 27, -233, 323, -145, -121, 316, -274, 19, 298]
3734B98o06N10p6m19N47k65k22N05m72P2M29n56K51K36n40M22n2l88N62l14j53
3755b31N49m97O9L69n20L14J40m95N01q8l79N17k70j83N26m63K9L96m95K85J66
3776B40m95M45j00l55N23k91r2M76n46J83L00n76L80J14m78N03j57l04N47l83
3796f6p2M24n00J58L52n32K82Q1m19M61j01l10N15m19QL95m87J89K43m43L66J9
3818A44m04M80k32k08M77m01J4M28m87J43J91l97L99l2l83M76k35j78M18m09P7
3839a19L61m42J89J68m58M48q2l98N29k57j51M74m38Q9L99n09K51J00m54M72j04
3860F8k87M96k92j03M55m62L6L42n02L51Q6m71M79j15l34N47l52m7L64m02O1L15
3882B33m93L60P9m59M55j05k65M00l31J1L98m50J01L22m73K73J36m41M79j87k72
$$ y = [298, -308, 202, 126, -293, 254, -11, -233, 272, -200, -128, 301, -255, -4, 232, -308, 114, 62, -326, 236, -78, -231, 318, -179, -110, 259, -261, 53, 193, -302, 199, 111, -268, 249, -21, -204, 322, -141, -112, 284, -211, 74, 240, -255, 190, 90, -265, 258, -33, -125, 351, -195, -12, 288, -288, 92, 206, -272, 231, 74, -230, 317, -66, -138, 286, -214, -56, 296, -236, 46, 127, -292, 169, 68, -242, 273, -146, -138, 257, -230, -41, 202, -241, 125, 144, -260, 220, -12, -220, 257, -144, -130, 298, -189, -46, 145, -252, 147, 115, -268, 208, -27, -205, 213, -196, -119, 242, -200, -11, 157, -301, 147, 65, -333, 196, -61, -212, 262, -176, -87, 312, -197, 54, 154, -300, 172, 68, -219, 277, -15, -118, 337, -125, -89, 253, -249, 102, 188, -283, 196, 81, -253, 294, -58, -105, 259, -143, -82, 233, -260, 100, 179, -280, 175, 70, -195, 205, -126, -115, 283, -167, -66, 256, -217, 56, 192, -249, 230, 43, -229]
3903b29M47k40j00L41l71J24K24m52L51K2l62M37j88j87M08l29l1M27n27K32J71
3924A68m11L52k3l20M20j93j69M03l01k0L56m76K89R4m52M19m4l49N30k50j47
3945a24L56l62L3L55m25K21J33m14L80p4l30M36k01j50M05l45K8L04m15J80K16
3966B07m34K93L5l08M41l26p4M00m27J29K71l78J99J24l54L71j52j84M19l10q1
3987a39L45l65J06K46m42L17O0l40L70p8k77L98k83j6L39m14J72J49l58K97J8
4008A05k77L26j42j85L78k86m5L29l58J97J44l97L29k5l33M00j56j66M14l40M3
4029d5L08m37K12R4l32L31k4k98L71k16j24L69l07L6K93l67J30J83m02L53j1k83
4051a66L15k01p5K98k81L2K39l21J69J51l68L72r0k23K81j94j2K86l47O6K54l84
$$ y = [-229, 218, -22, -122, 219, -152, -28, 196, -256, 95, 117, -245, 192, 4, -183, 225, -104, -135, 292, -235, -3, 168, -243, 109, 86, -234, 186, -7, -176, 227, -74, -94, 262, -214, 75, 169, -283, 136, 92, -257, 273, 23, -124, 232, -130, -97, 258, -167, 54, 187, -227, 153, 79, -251, 185, -16, -166, 239, -106, -78, 226, -189, -9, 207, -227, 66, 101, -207, 234, -92, -166, 234, -193, -64, 207, -171, 28, 152, -202, 169, 17, -167, 252, -58, -139, 206, -159, -53, 193, -249, 68, 128, -212, 158, 80, -197, 201, -82, -98, 241, -173, -1, 148, -210, 87, 105, -172, 154, 12, -173, 205, -81, -126, 203, -155, 42, 186, -211, 118, 93, -240, 160, 4, -162, 252, -88, -45, 263, -174, 38, 132, -200, 131, 107, -191, 180, -36, -160, 209, -98, -62, 231, -136, -6, 177, -225, 128, 117, -166, 149, -52, -127, 171, -110, -78, 161, -160, 9, 160, -208, 164, 74, -149, 132, -62, -74, 212, -135, -69, 185, -199]
4073a99K20J27l19L15q0k71L68k02p8L46k84J7K15l08K12K9k99L63j14j80L33
4094B11k69m2L26l51J36K04m39L26J5k83K81j04j70L49k50n0L03l45J96P1l07
4115a92K62kk64L63j52j72K97k22p3L50l38J58J09k98K60m3k06L50j86j66L57
4136A92k77J8K88l67K00Q1l27L21j03k14L54j79j30L61l06K1K25l02J70J05k82
4157a51K09jj63K31j73n6K73k26M4J77k95K25M0l06K74k2k29K80j49j03L80l39
4179h0L2J92l48K05P9k52L10p3j84K58j43q7K88l05J29J23l14K06L0j99K82j07
4201D2j42K66k27m0K48k58R9J66l19K27K4k11K43j27j25K73j90K1J53k38J47J34
4223A66k59K20l0j91K65j71j43L14k44K8K33l05J55J20k88J97J7k03K18j04j15
$$ y = [-199, 21, 148, -171, 144, 64, -207, 161, -41, -119, 227, -57, -40, 175, -133, 79, 108, -191, 172, 58, -122, 211, -58, -100, 226, -125, 11, 215, -224, 102, 117, -166, 115, 11, -159, 190, -60, -110, 193, -152, 44, 115, -192, 70, 68, -196, 167, 15, -157, 140, -82, -155, 195, -143, 15, 124, -174, 86, 43, -163, 187, 1, -165, 192, -85, -67, 221, -146, 54, 135, -192, 129, 26, -188, 166, -13, -143, 218, -88, -67, 158, -144, 26, 131, -151, 58, 57, -106, 125, -48, -104, 169, -57, -13, 164, -131, 94, 134, -172, 102, 80, -149, 131, -18, -121, 259, -80, -48, 144, -204, 1, 80, -172, 138, 65, -119, 139, -4, -91, 197, -108, 21, 144, -170, 36, 66, -133, 149, 42, -100, 166, -61, -101, 147, -111, -12, 154, -165, 62, 86, -125, 118, -9, -134, 139, -51, -30, 123, -115, 32, 166, -93, 127, 97, -94, 171, 0, -143, 171, -73, -45, 188, -117, 38, 158, -130, 67, 84, -119, 99, -5, -120]
4244a20K51k09P3J25k19J16J32l40K75m9j77K56j40j03K66k20M3J71k80K00L5
4265H6k78L26o0j91K43j66r6L18k37o1K78k70J39P2k38K38q0k12L13j67l5K37
4287A59k69O1J79l13K54Q3l41K81l0j83K68k20J9J97k57R8J73k36Q9Q1k16J83
4309F0l8j52K81k05n3L03l02P6K03k93J55P1k49K61j06j19K76k20KJ95k52J59
4331E3O1k15J69m7j81K82q0j58K01j32o6K54k49J09J31k94J84M9k34K36o3n2J86
4354A44k40K1J84k19J54O5k46J95j0j61K22r9p8K12j92L2J59k15J02J21k61J93
4376H3k7j19K07j46o2K08j81L4J22k54J88L3k02K24n2j66K43j53j1J25j80P2J05
4399I1k32J55O4j94K00q3j09K39j44q7J99k32J30J05k40K28Lj86J97p9j13K07
$$ y = [-120, 131, -78, -5, 120, -99, 17, 149, -191, 84, 35, -142, 114, -26, -129, 137, -83, -40, 131, -149, 51, 86, -192, 134, 74, -117, 126, -40, -136, 182, -55, -116, 162, -108, 31, 103, -135, 103, 23, -189, 124, -43, -78, 159, -110, -49, 130, -183, 71, 154, -187, 94, 64, -119, 149, -71, -52, 145, -112, -14, 159, -77, 12, 93, -123, 60, 22, -130, 151, -54, -107, 196, -106, -30, 173, -120, 35, 106, -143, 118, 12, -107, 169, -51, -49, 146, -106, 53, 114, -101, 68, 21, -160, 122, 42, -116, 85, -47, -113, 141, -108, 1, 132, -162, 22, 71, -163, 73, 10, -42, 144, -96, -75, 109, -110, 44, 109, -137, 58, 48, -113, 109, 10, -68, 144, -48, -16, 143, -72, 30, 151, -110, 83, 56, -63, 144, -2, -64, 144, -37, -3, 119, -135, 53, 86, -116, 108, 56, -110, 133, -20, -31, 94, -86, -14, 91, -141, 14, 78, -116, 84, 1, -108, 131, -13, -100, 99, -133, -3, 102, -138, 90, 93, -93, 104, 25, -88, 119]
4421A19j95l0J77j84R7P0j34J21mj42K19r4j03J94j53m5K26k51J03J20k02J54
4443F3n7j09J95p8j02K41k01L3J20j93J26R7k23J45N8k44K58j04j13K60k38L1
4465c5J61j90N7J22k44K24Kk15K05j18l7J87j46n1J85k15R6Q7j24J39m5j29J78
4488I4p5p3J98k38N3J03j62J25J1j15J76n7r2J54j45j9J58j50QJ69k61J94L3k07
4512a18J67q5o2J54q5o2J71j15k2J79j66R3N6k26J60Lj41K20j45p4J96j29mJ20
4536H5j69J23N6j95J73n0o0J22r4o8J80j14N4Q1k46J80o6j00J91p9m1J90j85m4
4560g6J89j68P4N9k02J07J5j21K04p8p7J79j19l1J15j22P6Oj29J63j5j24R1j4
4584Bo4J61j75M7J30j81R1Q6j55J18r9o0J68j05M6M5j44Q3J28j79N6R1j45J67
$$ y = [119, -76, -106, 71, -113, -16, 54, -80, 41, 37, -105, 114, 20, -83, 111, -42, -87, 139, -112, -9, 111, -91, 63, 6, -103, 92, 14, -88, 153, -48, -15, 105, -88, 38, 135, -88, 57, 115, -129, 129, 25, -88, 172, -66, -35, 126, -64, -7, 115, -129, 95, 97, -118, 87, -31, -68, 119, -27, -78, 107, -108, -12, 75, -49, 90, 45, -84, 94, 19, -54, 144, -94, -41, 62, -100, 25, 36, -79, 97, 40, -52, 102, -43, -62, 96, -54, -46, 123, -138, 56, 89, -118, 49, -36, -98, 56, -29, -91, 80, -35, -57, 122, -44, 49, 105, -121, 39, 42, -99, 121, -24, -98, 98, -31, -35, 85, -84, 39, 95, -100, 73, 23, -37, 85, -9, -77, 103, -11, 43, 124, -122, 58, -8, -108, 83, 4, -37, 153, -32, -76, 113, -55, 19, 78, -124, -17, -2, -123, 81, 3, -74, 105, -14, -45, 70, -52, 24, 30, -99, 64, 49, -75, 16, 2, -62, 99, -76, -29, 101, -80, 11, 97, -58, 60, -39, -99, 69, -36, 10, 55, -89, -6, 122, -57, -1, 90, -55, 112]
4608A12q1j08J80j20j9J28j52Q4O4j13R4K3j06N1K8j35J48r1n0K15j81M9J47k61
4632i4J02R0j88J05L2j02J60j58oO5q8J17M1j54J77n0j05J12o6o9J12p4lJ28j73
4657h9Q4J23j91J08L0j12J46p4m8J21j71j9J83j34N4M5j58J65J7j52J38m8j06
4680h8J78j46JJ72j47J4R1j75J62k4j22J69j33l2J31q9N0O2j22M2M8j17J41l1
4704C5j18J49q5m9J38q2l4R0j21J03Q3j66R9m8n4J45n8j21J97j21jQ3j13N8N7
4729F6j04O7k7m2P3o2k7J26j09N7M8j08J9M6n3Q7mj27J25n6rJ19j79O4R7j24M2
4756EK3j14J55m9r4J63j17K5P9p4K8N0j03K9k0n6J19kp9R3o7n8J20q6K2M1r5N4
4784hM6j25J53k6j13J46r7m6J65r4%P1j60J18qj11J82j40KJ20j22jQ9n7L9N3j63
$$ y = [112, 31, -77, 103, -17, -36, 92, -60, 24, 88, -25, 69, 92, -14, 37, 65, -70, 78, -13, -63, 152, -29, 20, 167, -94, 8, 98, -90, 15, 47, -55, 105, -53, -59, 6, -82, 35, 76, -78, 99, 49, -56, 56, -10, -79, 33, -41, -44, 84, -89, -5, 118, -73, 35, 65, -47, 99, 25, -23, 98, -73, -92, 91, -43, 11, 56, -102, 63, 80, -72, 66, 18, -88, 90, -56, -55, 117, -30, -16, 75, -100, 62, 38, -84, 85, -48, -80, 51, -38, 12, 74, -48, -6, 42, -75, 66, 35, -83, 66, -19, -68, 70, -12, -46, 44, -77, 26, 109, -57, 42, -6, -60, 85, 27, -94, 103, -18, -19, 64, -49, 9, 66, -38, 29, 2, -40, 33, -29, -56, 70, -39, 18, 66, -42, -23, 23, -30, 57, 53, -74, 51, -5, -14, 105, -74, -10, 87, -37, 5, 28, -86, 69, 20, -74, 89, -28, -3, 76, 2, 30, 80, -23, 6, -14, -70, 49, 47, -32, 61, -6, -64, 56, -30, -8, 33, -62, -8, 38, -87, 66, 40, -73, 73, -24, -70, 95, 1, 1, 72, -88, 30, 22, -89, 93, -47, -45, 75, -47, -48, 41, -16, 23, 76, -87]
4811h7J05j8o3J31q9n0J28k3o3Q0j00N6N6q8M6J6j17J07k9n6J33j49N0J46j80
4836e8O3O8j31J15l5o5J10n7m1Q2%j35J50j15J26r9n6R7J3q6P7l4o0R1l0n6J05
4863C9o7L6R9j54N2Op9J59j08oP7r0O2L1j48J09M6j03P2l2m2O9m4l6R4r7J0O6
4891B1k4M4O6j96Q8J7r8J25n7K2Q4j17K2P4q5P2K0p9M4o0k1J04q6PQ0r3J1P3j20
4920f2M2O1j02R6j4r7J02m2qP7l9j9Q2p4MK2o5N0kj4k2P0j9M4j00M7M9j49J32
4949E0j2j02R6o5mJ12j05J8P5j15O3L0n3N1j1r8J13m5n4Q8m8j5Q8m5J5M3r5O7
4977D2K5p5J0qm4J14o8j4M7m7Q1j0r5M6L3m0R7o4k8O6r0k5R2p1M1L5r4O4kq3R6
5008C1j5q5J07j20N6J11r7J3L0n8L4j0m4J27j2j54J20p3J2Q7q6P1k3o5J10m5r8
$$ y = [-87, 18, 0, -63, 68, -21, -71, 57, 34, -29, 51, -49, 7, 63, -25, 21, 37, -80, 27, -2, -58, 75, -74, -24, 122, -58, 5, 73, -58, 57, 22, -43, 67, 10, -31, 51, 51, -84, 66, -49, 77, -22, -78, 19, 32, -54, 23, -11, -71, 20, -10, -66, 39, -28, 8, 107, -47, 5, 11, -68, 91, -17, -23, 54, -36, 26, 57, -91, 18, 64, -39, 33, 1, -41, 28, -16, -52, 42, -55, -45, 21, -3, 41, 107, -89, -1, 16, -82, 43, -14, 8, 92, -25, -3, 71, -14, 58, 78, -1, 43, -17, -38, 66, -20, -13, 67, -26, -15, 58, -62, -20, 41, -61, 35, 21, -76, 26, -16, -24, 53, 14, -5, 77, 3, 7, 29, -36, 14, 12, -2, -24, 46, 27, 71, -29, 18, 67, -82, 50, 38, -64, 32, -33, -37, 75, -30, -12, 63, -52, 11, 41, -12, 39, 28, -70, 43, -2, -56, 32, -16, -31, 57, 12, 27, 70, -25, 42, 67, -8, 2, -6, -50, 64, -4, -18, 29, -18, 63, 53, -42, 4, 37, -3, 94, 30, 2, 68, -22, -47, 45, -26, 15, 50, -44, 20, 18, -65, 31, 16, -69, 38, -82, -26, 85, -12, 1, 31, -27, 7, -3, -47, 80, 68, -86, 34, -39, -27, 60, -26, 45, 22, -43, 67, 22, -76]
5035g6R1M8j03J16m9jL0j36O8L0m6K4j0k8N4L3j04Q7o2L9R1j46L2N8q0P8k1n5
5063c8N0j4lQ1p3ON5q7N1N9j27R4p8K1N3p4J4Q9j19K7O7j58J00Ml2P1Nn1M4m5
5093ho9J33r0J8O1j04J03K5j32J05n2J4M2j9n6Q3ok5Oo0J3L6r0J11n6K0K2l2l6
5122d3J17l4j1lm2K2J2j6Q0r7QOL5q3Q2p3J6N2q6O3N8j06R5n6j4P0k9l6P4j18
5152e7K8J21j50J05j5k0O2n8q3J08n9MP5j27M9L3n1M9M7j19P2Km2J14m5q0M4k1
5180a4l6P8q2O1L0p6J02o5J7K5p7lN1oNL4j11P4np8R7%j2K3j6m5R0p7j5O5o6P5
5212D3l1l9O1n5o4J40o0K4K2n9N9k6l4L8m3PQ0o6k1P3p6pJ37j35L4K3m2L7j6l5
5242c1L6j0J1K3q2L7N8j29M4M4J7nk1j1P5m3l7M9Ml5J9n4O7nk2M0m1n2O5j8m8
$$ y = [-76, 15, 63, -40, 76, 27, 26, 56, -80, -12, 18, -28, -4, -14, -42, 12, 45, -59, 28, -34, 5, 96, -50, -18, 40, -40, 38, 17, -38, 12, -2, -5, 76, 3, 9, 64, -23, 28, 87, -40, 54, -24, -3, 50, -24, -10, 79, -40, -13, 54, -104, -4, 0, -32, 39, 44, -7, 37, -8, -77, 56, -34, -16, 45, -59, 44, 69, -63, 42, -10, 4, 46, 27, -29, 54, 48, 23, 29, -31, -18, 18, -72, 39, -17, 3, 25, -7, -43, 74, 40, 29, 26, -16, 6, 18, 2, 82, -15, -7, -1, 34, -49, 33, -40, -24, 28, -58, 5, 63, -43, 52, -4, -18, 52, 23, -13, 61, -57, -29, 92, -58, 47, 32, 12, 74, 16, -67, 41, -18, -14, 61, -66, -17, 16, -35, 14, 61, -58, 14, 16, -26, 88, 43, -37, 7, -14, -50, 28, -54, 7, 37, -39, 63, -2, 15, 40, -37, -40, 11, 5, 10, 44, -67, 7, 2, -76, 21, 21, 9, 32, 16, -29, 61, -16, -31, 34, -32, 43, 12, -27, 34, -21, -85, 55, -5, 19, 41, -18, 41, 15, -19, 19, -24, -17, 63, -3, -24, 49, -27, -34, 103, -32, 2, 25, -17, 20, 4, -31, 5, -5, 6, 29, -53, -16, 42, -87, -43, 1, 18, 13, -8, -19, 56, 13, -24, 25, 29, -6, 13, -41, 26, 21, -1, 39, -2, -54, 11, -7, -55]
5273e5P1k0j%KJk2K6J1K8p2R3p1k2O9n5P4jr5N2j0q6J02l0k2M6J6p6J04o4J8L5
5305D6q4P7k7j4j0K9KL2o2k1N3m0J2N3p7O4M4r9K3L3q8M9l0M6Mmj2L5q1K1Q5p5
5337a6lN9k5J8o4K6O5j10K9K2p8R1Pl9N7k3mM9p8L8L2q2J3R3j01J3J7k3O2l0l4
5368a9R0p7k9J22j06QN7p7M3j9Qj4L5p8J31n4p6J03n5j0L4o0O1Jm4Q0J9q5K0j2
5398cJ6O2p1j5P9p1M3J4l7J0kk4N0j00M9M6p3O5O3j22K5Nj5K0M0m6N0Or3Q3j3
5429D1k2j1m2M5L0m6J4j2MN6l5p0J05m1l5R3j05K6J3n5R4m9n4J17p2QO0q8N3L5
5459E7k4pMq3N9k0k7P0o3J6N0r3J17k8q8Q9l3m9R4l3q2J30r3j5J12p9J3J5k2J7
5489DO6j62J51o7MO2p7j8P8k0pK2j28J05J0m5O4l5N9k1l2K1Rj19Q6L5j11P8K5
$$ y = [-55, 16, -4, -5, -5, -3, -2, -24, 2, 13, 41, -31, 62, -9, -31, 38, -17, 57, 56, -39, 13, 3, -83, 19, -11, -33, 13, 29, -47, 57, -7, 11, 46, -38, 39, 12, -2, -12, 17, 19, 51, -11, -32, 21, -19, -7, 46, -31, 33, 77, -22, 1, 34, -54, -5, -35, 11, 15, 11, -1, 34, -47, -26, 59, -16, -19, 40, 15, 33, -31, -5, 60, -50, -21, 1, -77, 14, 21, -18, 39, 16, 12, 61, -17, 21, 53, -29, -16, 77, -24, -11, 6, -17, 45, 15, -19, 71, -6, -35, 87, -19, -11, 46, -31, 12, -7, 1, -13, 22, -56, 75, 21, -55, 48, -7, -17, 17, -43, 18, 19, -25, 55, 74, -11, 9, -3, 13, 75, 4, -11, 68, -3, 40, 54, 17, 27, 25, 1, 51, -49, 0, 46, -27, 38, 101, -21, 4, 9, -6, 14, 54, 8, 58, 64, -29, 54, 41, 19, 8, -34, 11, 41, -5, 9, -3, 1, 57, 22, -48, 57, 16, -19, 74, -31, -5, 8, -47, 47, -2, -56, 61, -11, -3, 57, -31, 22, 57, 33, 26, 30, -53, 6, -14, -41, 29, -34, -18, 32, -61, 56, 28, -60, 29, -4, -53, 41, 8, -74, 56, -37, -52, 60, -19, -6, 9, -13, 4, 70, -92, 59, -8, -4, 58, -19, -37, 41, 21, 14, 36, -92, 13, 23, -22, 42, 7, 66, 45, 13, 34, 43, -76, 10, 45, -66, 12, 37]
5518C7p7M7l1PQ7j02k6J01q3P1M7j45J06l8k9P0p4LP7p7JO4j11J01N0j07N7K8
5546E4j01J23j4j27J25m4J7L5j01O7l5m4L2lj3P3l1j0Rm9LO9n0k3O0p5O6kr0J06
5576B7n9mO3m4P2n4o4N0N4r3Q5j9rOl8QO7j00M4P7j21M9j5k0NO4q5O6m3j5J52
5607A06j34LQ7j51O0L1r4J22o7k2J41n5n8M2m5P4k3pM2p1m4J16k5m8N6l4k0J19
5635A01j19OM3q2L7K8l1Q3p7j7J10j45JJ10q3k0O3l4P2l9o4J22p2m8J50j02J6
5662IP2j40N1N8m2L2J0r2J09q9KQ7j07M0J3p5L7JJR2n9n8J40j28l6J06r1L1O9
5691D3j25J17lp8Q8l5m0O0l7pP3n7KN9j38K3R9o0N9k8m9J10j30J2R6n0l1N5m9
5720b1J6M2n2L9or5J07l2%M5r2O9K4o5M8k3p4O8J7o1N3K3n4J07j10KO2o0Q5n6
$$ y = [37, -40, 7, -24, -17, 70, -32, -58, 43, -40, 31, 78, -67, 39, 1, -28, 42, -32, -29, 48, -29, -28, 36, -75, 26, 76, -31, 26, 54, -47, 76, 62, -65, 60, 16, 33, 68, -33, 34, -1, -45, -13, -16, -29, 44, 13, 3, 12, -37, -34, 35, -15, -38, 22, -53, 13, 11, -79, 27, -32, -36, 27, -17, 55, 1, -63, -13, 41, -52, 33, 14, 5, 11, -27, -19, 48, -52, -8, 69, -52, -3, -18, -38, -33, 31, -54, 12, -31, -46, 106, -28, -25, 62, -89, -29, 2, -92, 30, -37, -59, 82, 27, -31, 11, -34, 40, 17, 10, 52, -19, -63, 53, 28, -20, 36, 2, -18, 101, -18, -12, 31, -51, -14, 14, -17, 66, -11, -28, 82, -63, -62, 48, -35, -55, 8, -26, 46, 7, -57, 65, -7, -55, 95, -7, 9, 81, -59, -8, 50, 8, 40, 50, -42, 67, -22, -20, 67, -40, 0, 13, -62, -25, -24, -23, 69, 10, -48, 92, -36, -72, 34, -57, -26, 43, -82, 35, 32, -46, 42, 7, -33, 27, -10, -17, 56, -1, 1, 60, -78, -55, 44, -16, 43, 15, -34, 76, -54, -42, 54, 4, -27, 28, -21, -5, 37, -15, 24, 18, -77, 30, -2, -2, 43, -49, 20, 44, -21, 27, 4, -70, -2, 15, -46, 7, 30, -24, 83, -27, -25, 37, -23, 62, 6]
5750Fl3P6n1n4J05p3K7L6p7M3N1j14M4Q8j26J17p1n2R7m6j3N5p3L9P3j27M7J1
5778Eo2O6L5r7Q9q3K1N3r2P5M0j08P1j8p4J37k7m9N5m7m3J13o1k2N7q9J05n1q9
5807i0J11op4Q2m9j0R7j40Q4Pj00J06K3j11J15o4MR3l0j16J51j66O9M3r7J21n
5834D8j40J39p1J9J8l6K2O3q9N6M3j52P5L0p5Q2o8j0R3m8QQ8j93N2L7mM5q1pJ16
5864F0o0j5O4j05O7L3n2J2N2n9J04j04p5J13o6OQ1j15N8N6j53J16k3n3O0j0n8
5891f6J28j27M7Q7j21Q0K9j42J17j7n1J15q7o8J38j11K8R6j19QO0j10J17N9j94
5916a04J93r2k7J13r2k9R8j38O1K3q7J37l8q7J08k8l0M2j11J21J1n4m3J17r0P1
5942D5pj12J44r6jP9m0m1R4j30J00lr5J51m2q1J10r9rJ06j10K0R0j11K8O0m6R0
$$ y = [6, -27, 49, -2, -56, 49, -24, 3, 39, -38, 5, 56, -58, -14, 74, -52, 65, -6, -58, 39, -7, -20, 35, -38, 1, 74, -53, -6, 5, -57, 9, 44, -53, 36, -47, -26, 27, -65, 10, 50, -58, 13, -5, -79, 58, 31, -18, 37, -10, -53, 60, -1, -23, 34, -55, 50, -1, -90, 21, 15, -59, 23, -26, -36, 61, -79, 5, 12, -88, 18, 41, -70, 45, -19, -15, 78, 48, -68, 83, -83, -14, 29, -68, 53, 48, -92, 47, -24, -5, 13, -23, -1, 62, -27, 29, 72, -80, -5, 25, -50, 32, -36, -46, 47, -1, 7, 95, -98, -46, -9, -13, 32, -49, -56, 60, 0, -15, 49, -56, 11, 44, -8, 4, 56, -3, 101, -3, -78, 35, -31, -25, 56, -59, -1, 55, -98, 18, -5, -58, 2, -8, -66, 62, -65, -18, 69, -52, 28, 57, -85, 32, 15, -36, 79, -8, -76, 62, -49, -21, 75, -44, -36, 24, -86, 31, 90, -104, 89, -3, -30, 83, -9, -38, 60, -78, -17, 6, -81, 56, 18, -69, 39, 11, -19, 23, -88, 33, 44, -10, -53, 64, -26, 45, 38, -74, 70, -26, -27, 52, 12, -29, 65, -65, 35, 32, -63, 88, 46, -35, 75, -24, -33, 73, -37, -17, 73, -38, -10, 50, 4, 94]
5970I4q3j5R9j25rR0r0N1M0j44R0M4o6L8k0LJ00j22RQ9r1jO1j05J07m9n7R9n4
5999a7J3M5q8QJ21j49P9Rj26J57n8p7J08k9j5O9r2N7K1p4L7P7j07Q5J0j03J02
6026F3o5l1J31j25k4J17r9K5N2j29J37o7o5J87j51k9J39q5o0R8m7N0J1q1R2j6
6052B8o1R6m8p7R3m8k5R6j32J07L0j66J46Jn0N5n2L1L6r2M8qo9J11K2j73J57p9
6080b3k3J00n8j2P2j55J07N1j08Q1K2j46Q5J8n8J06l7q5J44j74R9Q6j38Q7k6r2
6106g7J01k5o1J14j06M7N6j07P1l0pM9N5j22Q1jj13J06o9KJ01j22O3O6j62J00
6132A0Lq3J12j4q7Q9j4j9N2j07M1P1j37J01K6j38J63r9N0J6q4K7J35j87N2N3j17
6159h5Q9j1n7J00m6q0J81j80L0J49j24L4Q8j30J03n3r0J63q9m2J46j35LQ8q1K0
$$ y = [94, 11, -4, 95, -30, -39, 51, -39, 12, 52, -92, -2, 42, -24, 14, -6, -3, 97, -25, -16, 73, -18, -19, 42, -63, 44, -5, -62, 37, -17, -4, 41, -47, -39, 82, -67, 12, 21, -105, 52, -6, -83, 25, -4, -19, 50, -42, 15, 36, -38, -1, 76, -31, 54, 64, -39, 63, -2, -33, 98, -27, -51, 66, -33, -8, 44, -85, 52, -15, -80, 107, -44, -73, 66, -19, -79, 19, -28, 22, 33, -48, 44, 28, -33, 63, 15, -62, 31, -17, -42, 54, -78, 29, 59, -107, 39, 40, -10, 45, -7, 24, 60, -32, 16, 8, -61, 50, 72, -101, 56, -23, -46, 54, -4, -16, 56, -99, 8, 59, -49, 32, 54, -92, -7, 11, -47, 59, 22, -63, 81, -93, 6, 92, -46, 41, 15, -77, 24, -1, -62, 52, -54, -7, 49, -58, 13, -17, -24, 25, 80, -42, 39, 38, -75, 31, -38, -36, 65, -57, 6, 72, -90, 10, 13, -70, 42, 28, -59, 30, 16, -3, 49, -58, -17, 54, -83, 18, 44, -94, 69, -30, 20, 36, -48, -21, 114, -73, -21, 32, -85, 4, -7, -64, 36, -10, -90, 91, -89, -59, 90, -34, 0, 88, -42, 61, 8, -82, 81, -8, -50, 96, -39, -36, 52, -29, -9]
6185iJ8o1J26m7p2P3l2o4J43j19K7K1r2J38jj36P4L2p4J37j08j3L8o6K6R0p2L5
6213A2Pq0J28p1k9P1q6jJ20q8J9M5j19J17%j03J14k7p8J32q6j0Q5j02N9L5j02
6240c8P3oq2Q3K5j11J41r7KN7j03J15j2j14J49p0n1J43r9r3J67j13LO6j06Q5P4
6267H8j44J05l9p8J15j7p0O9r8j3J33j26J34n3p9J16l2o4O1m6j7J06j25J9R7j04
6293f2R5J4r2P8l1o2R3k4n0O6n9LM2r4J50m8r4J24o2o1J21m7q0K01j84R2j2j44
6321a27J95m8o6J24p4o6R2j28P5O7o1Q3K8k11J75o2o6J43j1j01P2j13P1R0j60
6346g9R8Op2Q6Nj55J62m7q9J81j19n1J05r8O4O3j13O5jl1M3L7j15J34q1j1R9j03
6374a7m9J35j02P7J9j30J38j00n3J21m3rN6o9O8oj20J57l3r0R8r0j8J49j43qJ22
$$ y = [-9, 9, -52, 74, 27, -45, 28, -4, -68, 75, -44, -17, 4, -88, 50, 49, -87, -13, 19, -55, 82, -26, -39, -1, -67, -41, 49, -23, 12, 19, -61, 67, -4, -33, 38, -48, -49, 71, -17, 2, 47, -72, 45, 45, -58, 56, 29, -49, 83, -3, -13, 72, -30, 29, 64, -38, 35, 29, -53, 30, 55, -56, 85, -12, -10, 47, -56, 59, 47, -67, 82, 12, -39, 104, 5, -88, 79, -34, -31, 35, -71, 14, 88, -56, 49, 10, -68, 47, 30, -40, 29, -69, -82, 51, -75, 59, 6, -73, 43, 11, -53, 8, -38, -55, 51, -74, -55, 42, -62, 33, 47, -45, 33, 2, -60, 33, 9, -41, 25, -34, -31, 11, -83, 67, 19, -75, 49, -13, -74, 47, 0, -80, 121, -63, 29, 17, -127, 68, 20, -46, 78, 4, -62, 30, -98, -23, 44, -17, 66, 94, -117, 58, -4, -70, 73, 62, -39, 33, -80, -9, 81, -79, 19, 25, -47, 39, 44, -111, 51, 4, -85, 96, -23, -74, 31, -67, -3, 60, -53, 12, 11, -20, 23, 60, -55, 79, -2, -13, 86, -17, -66, 69, -33, 44, 63, -67, 71, -29, -82, 39, -4, -13, 43, -26, 42, 36, -84, 73, 40, -50, 48, -42, -60, 89, -54, -62, 60]
6401F0r4N9N6j09N5k5n8J18p8o4J32o4m6R7r7Q2k1o5J56r3k3J07j12J6M7q6L9
6428a1O9p4P1k7j02J76j18m1J58j33M0P0j05mN1m3O4j6l8Q2q4j3J03j28jO8o8
6455e4J06P4j79J09m6j06J50m5n0J43j42NN7m4L4K3p4J07J6j26J45r1n8J23j24
6480d7kJ42j96J07R6j58N8K3q8J22k7l0M0j8J2N6j69R6J2p1Q8k4q2J72r3l6N2
6507C5l0NO0j41Q1j7k4M5p1k0J44j17k5J19r7O8K1p3J1P8j32J81r0j03J38m4n6
6534e4Q2q0N2L3p2J01J5j35J41p1p1J09j24M9P5p5kL9o9O0J6r6J23k1q9J46j68
6561h6M4J48k00J31J2j71J38Kj7R2j28n6K17j45k8J88j73O2%o9K8L7o9R8j03k7
6587g5R5m1L0O0j43J11K0p9P8m2p1J31n7q6J61r2RN8j45O9P4j38J23k1j07J11
$$ y = [60, -34, 25, 81, -28, 27, 2, -56, 62, -16, -80, 52, -12, -58, 39, -58, 24, 3, -62, 94, 1, -22, 85, -27, -11, 36, -50, -11, 58, -16, 55, 28, -74, 102, -16, -57, 101, -32, 8, 78, -27, -31, 20, -23, 41, 25, -13, 69, -15, -28, 75, -53, -54, 14, -54, 52, 126, -53, 56, 10, -96, 54, 9, -41, 102, -40, -35, 22, -22, 12, 35, -39, 68, 84, -42, 103, 12, -46, 77, -47, -49, 93, -103, 4, 100, -58, 0, 23, -65, 57, 30, 0, 40, 22, 34, 90, -79, 17, 29, -42, 46, 22, -60, 112, 19, -17, 35, 5, 10, 70, -71, 10, -7, -31, 14, -57, -77, 67, -50, -75, 44, -53, 15, 36, -37, -26, 52, -80, 101, 11, -92, 46, 2, -54, 28, -52, 0, 33, -39, 62, 77, -58, 83, 12, -59, 50, -74, -25, 50, -25, -27, 12, -57, 3, 19, -77, 46, 25, -64, 82, -86, -42, 106, -94, 37, 49, -122, 16, 18, 1, 93, -35, -91, 126, -19, -47, 141, -32, 30, 30, -39, -11, 26, -43, 55, -48, -75, 20, -21, 9, 69, -74, 37, 57, -22, 56, 14, -57, 74, 17, -69, 92, 0, 9, 67, -78, -9, 65, -73, 50, 29, -78, 33]
6613C3m3p5J46p1L9M8j69J49J9j03O8k0p1Q8n4RN3r3K6J4k0Q9pr5R7k2n8R6q0
6642gj7J04j21K7M8j17J29k3j08J63k2r7J14j33J8J62k14Q0Q5j00R4n8p6J48q5
6667fn7J19o1o7J59j06NM6q7R4j3q5J20j13K5J09j05N1K1q0L2O8j56J25K9j47
6693h0J71j16kJ01o6k2J19j74P0L9r8R2mq0O6p6l3J65j61P7P1j25J04J7j22J24
6719E7o5r0J67p9l9Q9p4J9P1j15O3P0j07J31j13m5J07j04j4J38j15J8Q1j36P9
6744fL6j08R9oq1J06m3L5M4j60R4J4p4R5m2o5R1J1p9P7l4jM4r4L8O1j04O2J5j18
6774i3J62j29OJ28j13j2J18j49N8R3j47R9K4q9J00o0p5J69j30N9J01j70Q2K9r1
6799c0R5j7r3J37j17%J19j04O2j7j09K3J18p4J00q5p3J24k4l9J07j05L2Q6k02
$$ y = [33, -10, -85, 61, -10, 29, 77, -92, 57, 76, -27, 41, 21, -50, 38, -16, -7, 46, -47, -21, -7, -27, 62, 55, -40, 57, 35, -23, 73, -7, -24, 80, -41, -14, 34, -83, 46, 23, -85, 78, 56, -41, 73, -60, -42, 120, -94, -14, 71, -29, 65, 7, -69, 79, -6, -63, 56, -5, -72, 87, -19, -14, 32, -55, 39, 26, -59, 61, -52, -27, 82, -23, 28, 49, -31, 1, 69, -87, 38, 67, -80, 91, -25, -27, 74, 8, -14, 105, -69, 1, 40, -58, 34, 30, -50, 16, -60, -93, 72, -89, -12, 59, -66, 38, 55, -67, 57, -8, -98, 69, -10, -49, 40, -34, -15, 56, -59, 4, 74, -33, 98, -15, -60, 47, -57, -71, 67, -48, -30, 51, -85, -6, 30, -78, 21, 15, -66, 40, -3, 32, 76, -84, 10, 24, -50, 45, 3, -62, 29, 40, -39, 38, 4, 3, 47, -47, -9, 52, -52, 10, 25, -93, 69, -60, -54, 74, -39, -51, 67, -82, -24, 69, -78, 21, 45, -44, 56, -4, -79, 90, -40, 19, 120, -50, 32, 61, -30, 65, 48, -45, 92, -25, -25, 94, -10, 52, 35, -74, -51, 67, -7, 93, 8, -65, 59, 35, -4, 103, -2, 30, 116, -86]
6824h6R2P2j99J89n0r2J48q3l5R3q7J2P7j13O7O1j11J15q0j07J94j33L1P5j25
6849g5Q2K2n6N5j7m6Q2n7k3N5m7j2J18j76N9P1r3J11q5j3P3m5p4J17n3j0J93k46
6877i0O1R6j18J13l2o2R1l8J1K9o3kN8o6m1J08j20J25q5l4J06j05l9J42j02O1
6903DK7j05N7M1p6Q6K1q5J12q6l9J25j42lJ54j80Q5P3j60J34n3o8J39p7n0J86
6929A20j57M9L2q2N4Nj04J18n2k3R1p0MR3j08J6N5j55J47J8j35P6L3p0J14q4l2
6956d7J22q1KL4q4M1M9j12J39m4o0R7m1j4N2p8j1Q0j01Q9M0j45J08k6j10J70r3
6983b4k1J19j44M0K7j8J1J3m7J27p6p7J53q6rJ30j21N5l7q2Q5j2j26J63n8p4J87
7010I8r7k5Q9j29jJ09j20J45p9k2J21q8m7J16q6N9pj27P5R2j46O5N7j11Q7k3o6
$$ y = [-86, 6, 78, -121, 68, 18, -74, 74, -9, -44, 49, -38, -26, 51, -62, 5, 66, -45, 70, -10, -117, 77, -56, -25, 50, -75, 7, 29, -27, 28, 11, -35, 47, -10, -33, 22, -25, -37, 81, -95, -36, 35, -58, 53, -32, -45, 28, -17, -91, 26, -27, -37, 156, -90, -29, 67, -51, 62, 30, -32, 59, 21, 32, 61, -2, -4, 54, -12, -53, 55, -65, 60, -25, -59, 47, -58, -97, 45, -57, 4, 31, -74, -17, 24, -52, 34, 55, -30, 82, -4, -43, 82, -60, -63, 91, -89, -4, 69, -91, 43, -10, -78, 61, -16, -66, 120, -37, 12, 44, -38, 16, 21, -83, 35, -17, -40, 51, -19, -15, 78, -30, -14, 41, -114, 33, 51, -84, -8, 25, -45, 69, -15, -47, 75, -6, -4, 30, -54, -13, 36, -76, 63, 19, -41, 56, 15, 1, 53, -25, -36, 44, -57, 32, 72, -73, 35, 9, -101, 69, -24, -45, 74, -70, -30, -3, -21, -10, 3, -44, 83, 7, -70, 83, -3, -12, 118, -3, 52, 15, -67, 18, 6, -120, 43, -15, -89, 98, 1, -24, 65, -64, -65, 44, -76, 69, -10, -32, 89, 1, -46, 70, -16, 43, 36, -91, -16, 76, -70, -5, 52, -59, 28, 5, -61]
7037f1J35r3k9J26j42J05Mj54J93l3j06J35j14J2J17j04j2J02j05J6Q0o9N4o4
7061gk3J00p2m5J28j44L2Q3r4P1lr9J20l8n2J58j02j6N0j19M6O9j25O5M9p1M1
7088BL5p1J49j51M8L9r2O2J08k37Q5L5m5J20p2n1O1l0l8J45j65N7N2j16R7K9l1
7115B5K9r3QJ14n4p9J57j27K0R2j63R2K8j03J33j01K3N4p6l0J85j95L5J03j48
7140g1J18oj17J05m8J2R0j20J7J19j34J4O8j76J74j1j03J23n6o7J49j15L3O8j15
7165d9J8J09j42M5L8p1J05n4r1J65r1N1L1j32Q4K3j06J08k0j19J69j30M0O4p4
7190b9pO8j18J03N3j42P1J8m0P7j04O8L5r3J9R2j19J56m4r2Q8m7o6P3m1RQ3j76
7218a05P4J26j51J42m9j17J16j4l9M2on1R4j38Q7J5j21J27n1n5Q8ln2J13m8k4
$$ y = [-61, 74, -19, -48, 78, -64, 41, 45, -109, 84, 51, -55, 80, -34, -22, 95, -9, -21, 81, -24, -8, 72, 3, 57, -7, -30, 70, -2, -47, 81, -63, -31, 52, -42, 29, 26, -73, 47, 9, -43, 115, 13, -3, 47, -72, -26, 43, -82, -17, 32, -39, 2, 37, -34, 115, -36, 12, 51, -41, 21, 129, -108, -23, 12, -33, 87, 15, -36, 25, -5, -43, 102, -63, -6, 46, -70, 27, 56, 25, 54, -39, -31, 83, 29, -50, 107, -20, 0, 92, -71, 21, 49, -54, 79, -22, 1, 55, -21, -51, 134, -61, -26, 77, -71, 47, 41, -76, 29, -19, -7, 83, -37, -20, 99, -35, -21, 47, -129, 45, 34, -69, 54, -2, -69, 80, -35, -2, 66, -49, -31, 78, -64, -19, 19, -52, 53, -1, -92, 73, -18, 33, 64, -68, 16, 39, -67, 41, 21, -98, 71, -59, -19, 45, -29, -36, 32, -86, 17, 70, -72, -1, 17, -23, 54, -50, 18, 53, -40, -21, 71, -48, 108, 64, -28, 60, 13, -53, 20, -21, -12, 71, -105, -31, 95, -56, 86, 37, -80, 36, 22, -17, 25, 19, -32, 62, -76, 11, 26, -95, 32, -19, -74, 14, 11, -41, 72, 24, 0]
7244@L7q1J09j3p9N9N2j34J14p3k7R8m5l8R0j35L6P9o4oL8p5Q2j1q4J29q3K6O2
7273F3j00P4L1r4R0o8m4J05j03N0N3j23J01Pj07Q3L5j07J32p4k7R7j19L5R1j24
7299d3J8J07j62J61o1q1P5p0kJ79j72L2J29j55N9J8j46P9O0q0P2p3K7P7o7lP5
7326E3p5L5N1j11P3J1j30J86q8m7O6l9L9K8j49P9J08j46L9O1j27J11n7k5J16j03
7352d1J1R9q5MM1q8J05m8m1P2k0l9P0j01M6O9j07R5L0j05O5l0m9N7J9o7J36r4
7380Dl4N9p6J09n2j22J85q5n7J34j01L8M0m9n1J05q0M1N2j43J84j05q9J46j02
7405d9J0R1r4N1L4j7K3Nj05R8l1m1M9l4p8J56j26j8J39j30Q0m1JQ1j5o7J08j19
7433c9j0J08p6J1Q0j74J26J2j01J11o6NP1j42P7Q9r7L7M3j61J35qp2J11j15J9
$$ y = [0, 37, -44, 65, 52, -27, 32, 84, -50, 64, -9, -36, 62, 17, -21, 69, -66, -30, 49, -15, -21, 17, -58, 24, 13, -71, 58, -25, 1, 63, -37, 37, 68, -26, 64, -4, -48, 57, -46, 4, 57, -66, 35, 42, -65, 18, 53, -54, 78, 4, -23, 74, -45, -10, 81, -43, -25, 82, -80, 81, 20, -61, 14, -56, -58, 121, -51, -19, 110, -45, 14, 32, -114, -35, 25, -55, 17, -56, -29, 48, -19, -22, 53, -22, 13, 64, -47, 26, 37, -93, 93, 5, -42, 24, -15, 24, 52, -97, -18, 90, -56, -17, 44, -83, 28, -29, -54, 62, -41, -30, 69, -16, -12, 29, -59, 46, -2, -43, 29, 9, -30, 40, -61, -15, 54, -53, 42, 72, -33, 32, 2, -47, 10, 29, -38, 98, 4, -30, 29, -47, 62, 10, -112, 73, -12, -69, 65, -36, 2, 42, -7, -58, 47, -33, 8, 60, -83, 101, -4, -93, 53, -49, -39, 52, -42, 9, 43, 26, 49, 54, -51, 47, 16, -25, 24, -10, -88, 68, -58, -76, 63, -67, 13, -28, -27, 54, 39, -28, 80, -39, -49, 59, -17, -6, 74, -100, 26, 38, -63, 48, -18, -13, 58, -84, -7, 82, -15, 22, 65, -96, 39, 31, -41, 70, -45, -26]
7459b6R7j24pJ21j34M3P0n5N4m8n2J38r7k2Q4n3j6P8j20Q5K9j03J50r4J6N8o4
7486Hk8N7q1K6J14j14L5J0o2J03o2k4Q2n1ORo8kR4q9M7K1m3M3l2m3J07o5n2J57
7516A03j61R8J3q2R3l7j16J21ml3oJ0m3J31j26N7K2j19J20l4r5J55n3k1Q4j02
7542b5N0Lq1P2J9q8Q4K7j08J30j59M3J38p1j11J28j10L2N1m7R1l9n2O8jo2Q6r7
7570b9l9J29p4k0J06q9J7J9q3P1o5qJ34q3l2Q5n5J3K7j04J16o2j0N0q6N1O0j14
7598g5O4L1n3K3O8r2Q8l3m1N8p3K7L9l8J5J7q9O7O1r9R4l6l5L8m7ML2o7L2k6p8
7629a24J67k8n9M8LoJ01q0k1K0q4N3M5o9Q2J0o4K6K8p7J54j33K9J3o5O8Kn4O8
7658E3Jj22N9m9J0K8lk4Q6j04P3K7q4Q3k3p3J20o3o1J37p8m8Q6j18Q0j2k9P9j7
$$ y = [-26, 71, -53, -60, 61, -73, -30, 40, -15, 39, -9, -61, 77, -20, -42, 42, -11, -27, 51, -69, 16, 45, -58, 92, -2, 14, 72, 8, -20, 37, -44, -18, 96, -18, 17, 27, -35, 68, 6, -18, 64, 13, 19, 28, -40, -42, 52, -37, 10, 31, -12, 31, -1, -44, 63, -2, -54, 103, -58, 40, 53, -29, 64, 27, -89, 32, 28, -5, -11, -1, -44, 87, -39, 18, 40, -79, 41, 7, -88, 67, 14, -7, 77, -25, 25, 28, -53, 19, 38, -50, 34, 61, -47, 83, -76, -33, 105, 34, -77, 51, -59, -27, 24, -23, 68, 29, -23, 45, 44, -18, 68, -29, -68, 61, -13, -33, 73, -16, 1, 20, -63, 8, -57, -65, 69, -14, -46, 39, -16, -3, 24, -80, 36, -26, -36, 14, -72, -21, 39, -75, -11, 20, -33, -10, 58, -34, 54, 21, -20, 38, -35, -8, 31, -7, 8, 25, -64, 3, 64, -35, 59, 23, -12, 26, -21, -17, 15, -52, -20, -46, -124, 43, 15, -44, 4, 7, 1, 102, 22, 1, 21, -63, -10, 35, -34, 48, 58, -6, 20, 48, -29, 125, -8, 21, 34, -31, 37, 39, -15, 53, 54, -68, -9, -58, -48, -20, -23, -47, 39, -65, 8, 35, -49, 34, 11, -62, 58, -5, -66, 71, -7, -55, 31, -87, -7, -19, -48, 31, 14]
7687A4n7R4m7K2K3o3k1J06j22N7O6r9J14q7PO6j02k9R5l5k2N2j18P7N4j26J12
7714C1Pq7J07n0k7O0q6K7Q9j34R9Kj12J16Oj26J21l5n6J05n4J7J2q1L3L0l8P2
7742D8n2p2J10j35L7J49j28J6O5n3J3K3o6R4n6m1R8p0l9J27j11L5Q9n7O6r6m3
7769d9J08j0n5M4q8M2J9l0M4l0k3L2l4RM9j11N7O0m4m1J04j09L9P3q9O8N3j23
7797c5J15o2p5J44j65J18M5j62J00Jl1Q9r4j8O1j7k5M3p8rJ04p1L2Pq6R9k0j06
7825i6J67j06J4R6p1rM8p0K1L1p7O2Kn4J00j05J9O7j07P4O2j54Q6Oo1J18o0q0
7853g7R5o2j5Q3q8N0M5j10R6ol7M2Km4N0o1MP7j34J03Ml1J9qk1RQn2P5p9N7N7
7885E1r2M2K2l0M1Pq9Q2mq2N6q0M0P2p6M9N9j18Q8m2MN5m4J1M5j04L4K1o2M9P1
$$ y = [14, -43, 51, 4, 26, 49, -14, -35, 71, -51, 6, 72, -27, 87, 0, 7, 73, -29, -58, 37, 2, -20, 32, -86, -9, 45, -81, 31, 38, -49, 58, 8, -19, 41, -45, -18, 71, -63, 36, 38, -74, 42, 48, -78, 43, 8, -48, 57, 3, 20, 32, -49, -16, 14, -24, 48, -4, -76, 34, -101, -64, 85, -43, -27, 38, -15, -2, 21, -45, 49, -7, -48, 50, -20, -59, 68, -43, -8, 81, 24, 90, -6, -49, 59, 49, -6, 38, -50, -8, 11, -19, 25, -5, -28, 4, -30, -21, 28, -83, -26, 34, -10, -51, 53, -56, -17, 56, -33, 35, 88, -35, 80, 18, -57, 87, -78, 40, 85, -77, 23, 24, -7, 82, -12, -30, 31, 14, -11, 32, -46, -55, 49, -22, 10, 17, -69, 30, 10, -96, 71, -35, -21, 75, 4, -5, 43, -27, -6, 25, -52, 10, 12, -42, 58, -47, -28, 39, -68, 6, 68, -86, 0, 6, -55, 63, 3, -77, 18, -44, -59, 24, -64, -14, 31, -79, 17, 11, -26, 16, 18, -26, 24, -37, -33, 44, -90, 13, 17, -14, 5, -3, -24, -15, -7, -59, 16, -63, -6, 51, -41, 1, 23, -7, 34, 41, -48, 34, 30, -52, 4, -76, -36, 36, -40, 9, 68, -50, 38, -4, 0, 55, 11, 22, 67, -37, -3, 18, -44, 5, 76]
7916G6j56R7L4q7J18q1n0J07j01M9M6r2J18j6j38J45o3l5J01j01N1Pp4LO7r5J04
7943C4m1j1J1J9k4N1k7m2N9n2J4N3q6N3Mj6O7k9p4P7m0n2J15p2L2M5r7K7O8j15
7973d9O6n2l4J01o5j1Q7j20Q9%j20J68o3j7J35q2r8J02q0M3L0n0L7Kj01J11L4
8000F3j40J59q6n7J61j44N5M3r2N9J3r4R5o8j0J01r7M5N3q2pJ06j10R3Qr8P1m0
8028@l5J11q0n2O5o1O2J6o2K8J3n9Q8o3m1J36q1K1N9p2K0M9j31J37lj08O5k5n2
8057e5L3J5k8M9o8N9K6r6N0No1J17k3j19J09n4L8M8r5L5R6j08J0M0p8O0K1lR0
8086A13j47O1J6o7RO0p3O4j8k2L6K2JK2j09J4O2j55J28jm4L0MK2J8n2o0J19n3
8115@qK5n0L3K0m6K5Oj8N5n3k0K9K8K4k2m9PL8j12J28n7m7J49j16l2J24j06M1
$$ y = [76, -80, 17, 51, -36, 82, 1, -49, 58, -43, 6, 52, -40, 78, 62, -76, 69, 6, -29, 72, -29, 22, 29, -45, -42, 25, -70, 34, -7, -18, -7, 12, -12, 39, 12, -30, 29, -23, -9, 44, -42, 11, 15, -1, 66, 37, -37, 40, 0, -52, 63, -9, 23, 68, -29, -2, 66, -49, 17, -35, -69, 32, -33, -44, 43, -77, 12, 12, -108, 60, -3, -20, 115, 33, -65, 37, -43, 0, 30, -20, 17, 19, -82, 29, 63, -77, 82, -4, -61, 100, -44, 11, 54, -38, 21, 34, -60, 35, -33, -43, 58, -39, 6, 59, -23, -30, 76, -34, 59, 67, -31, 40, 0, -35, 76, -4, -56, 9, -52, 10, 26, -36, -8, 5, -54, 34, -29, -70, 66, -15, 6, 65, -7, 13, 62, -69, 68, 65, -43, 22, -3, -55, -22, -7, -35, 14, -54, 5, 31, -65, -15, -10, -71, 46, 23, -96, 13, -41, -3, 45, -50, -15, 81, -27, -17, 23, -55, 5, 26, 23, 113, -34, 27, 43, -24, -15, 45, -28, 36, 18, -4, 32, 54, 55, 77, -32, -18, 44, -111, 17, 16, -28, 2, 6, 28, 46, -6, -66, 53, 0, -8, 17, -33, 0, 20, -26, -1, 5, -13, 42, -11, -31, -2, 26, 50, 28, -21, -14, 24, -88, 40, -17, -64, 85, -31, -63, 61, -45, -4]
8144dK0m6K8J3l7L3j3k2O9j2n6Q1j18K3Q7j40J45m4m4Q4k3q0Q4n8P4J9j17Q8r
8173B5j5O0n0j21P8K4o6J24l8l2N0j15N9M0q8O8L9q1
$$ y = [-4, 16, -30, -2, 11, -26, 7, -6, -28, 41, 29, -27, 54, -64, -41, 46, -94, 51, 7, -37, 47, 24, -56, 28, -30, 44, 63, -54, 34, 25, 10, 70, 20, -101, -23, 1, -65, 59, 21, -11, 39, -76, -17, 23, -65, 3, 42, -39]
8191c9
$$ Imaginary data points
##PAGE= N=2
##DATA TABLE= (X++(I..I)), XYDATA
0@%%%%%%%%%%%%%%%%%lJ1j6J6j6J6j7K5l2L2m0M8n2O0o8P6q8J01j10J21j36J53
39H1j72J94k16K39k64K91l22L55l90M30m76N25n76O34p00P73q57R52j060J188
59F29j339J518j738K017k382K875l586M697o675J1173l7501k771O5445p6599N1746
74G509J6567p4409O6652r838m7938P8235m9106j9433O6024o3581J9453M6157p5238
87c8946M4264J1671o1261O8183j7432m2077O7926m9682j0866O1251o2588K1245
99h312L7776o8367M6676Q647n6107O2801k1928l5235O4534m6351m490N4732o0654
112b6278K3478L1155o2972M7838M163n0200O1168k5181k9806O0744m6874k77N0036
125C6994n8341K5361K5655n8914M6421o4m4716N6936k7069k3870N5070m5622L488
$$ y = [0, 0, 0, 0, 0, 0, 0, 0, 0, 0, 0, 0, 0, 0, 0, 0, 0, 0, -3, 8, -8, 8, -8, 8, -9, 16, -16, 16, -24, 24, -28, 32, -36, 40, -48, 53, -57, 64, -72, 81, -91, 103, -113, 126, -138, 153, -169, 186, -204, 226, -250, 275, -301, 333, -367, 406, -451, 501, -559, 629, -710, 808, -930, 1087, -1295, 1580, -2006, 2691, -3984, 7189, -30312, -33083, 32362, -44237, 7509, 24076, -50333, 16319, 6481, -41457, 36778, -12328, -31761, 34263, -29318, -9865, 36292, -38946, 5318, 16989, -44272, 23911, 6479, -35598, 32328, -17354, -28220, 33031, -29557, -8312, 29464, -38903, 7773, 16420, -39687, 23114, 1186, -34049, 30485, -15866, -20356, 34376, -26278, -2800, 28355, -34617, 13221, 17384, -32816, 28352, 3171, -26635, 34109, -12765, -13042, 36994, -21347, 4014, 29669, -29245, 17176, 17112, -27604, 29332, 2263, -21607, 33463, -12159, -8671]
138h671M1998n5909K6284J9394n2859M5929m142l9404N2734k8759j8528N0771
150B8838m3800O570L6680n2549K7625J5658m7341M5397p311l4007N0286k9861
162c815j2826M6953m4065J0012L1480n0711L0509J1440m4005M5261j1616l0679
174b2062M8195l1665q971M3221m4157J2261K6687m7994L1855P624l9909M3771
186A8856j4831k5994M5477l2109m481L8962m3218J4957K2743m4442L3127M460
198A3507l6382M1879j6843k1877M3088l1915j398L4788m1993J6926J9144m1345
210b2421L3773N72l3416M0841j9596j7797M1445l3347J524L1540m2106J9607J6229
223A6848l9713L4629l022l1034M0241k1522j4128L9532l4193M323K8233m1074
$$ y = [-8671, 33327, -22582, 3702, 23096, -29763, 16166, 12024, -27380, 25354, -3405, -21933, 28838, -14962, -8392, 28288, -24261, 3364, 19022, -28319, 17078, 9767, -24240, 26046, -3815, -16641, 30312, -13753, -3741, 27739, -22972, 7537, 18977, -25028, 20233, 8617, -22062, 26133, -5532, -14503, 28718, -15439, -3178, 23509, -24485, 7370, 14994, -24915, 18856, 4025, -21969, 23508, -8601, -13082, 25880, -17338, -2381, 20362, -24080, 9047, 13507, -22875, 19004, 2161, -19716, 23372, -8543, -9941, 24847, -17146, -220, 18924, -22421, 11352, 11924, -21492, 19349, -247, -18044, 23401, -9946, -8422, 23118, -18988, 619, 16848, -22865, 11764, 8742, -22292, 17949, -3573, -17701, 21831, -12362, -8039, 20194, -20880]
235b0880K2173J2982l7144L5074o189k7746L9426k2411j0539L7160l4207O288
247f013K5248l8896K3262J0488l4457L3745q205k4515L7611k2844p607L3671l4051
260a2563Q306K2022l6921K4436P373l2565L3266j0420k1572L6799k3720n571L1304
273B0174l3974J0015K0044l5061K4965M836l0360L2468j1827j8182L5090k4507
285f319l107K8299l3427J2347J7301l3079K5521J906k8039L1799j2977j5207L2852
298A7870k4562j424K5377l1583J3521J4707l0386K4699o65k4747L0369j3872j1929
311a2625L0253k5113R37K2698l0302J5399J2046k9111K4853k742k2510L0024j4724
324i17j0115K8254k5311K589K0619k8834J6436R141k7226K4498m933j9294K9105
$$ y = [-20880, 1293, 14275, -22869, 12205, 6016, -21730, 17696, -4715, -15254, 21906, -12301, -6013, 19235, -19661, 3601, 14089, -20368, 13377, 5172, -19343, 18268, -4576, -12183, 21488, -12563, -4257, 17765, -19156, 5280, 12653, -19912, 13354, 2934, -18638, 18161, -5559, -11130, 20174, -13800, -3785, 16259, -18802, 6163, 10999, -19361, 13107, 1280, -16902, 18188, -6319, -9426, 18873, -14554, -2207, 15094, -17985, 7536, 9442, -18597, 13202, 225, -14982, 17870, -6692, -8116, 17261, -14322, -801, 13906, -16480, 8219, 7554, -17193, 13176, -696, -12625, 17628, -7485, -6548, 16150, -14152, 1247, 13293, -15818, 9035, 6293, -16217, 13807, -917, -11032, 17222, -8089, -5500, 15119, -13715, 2721, 11862, -15364, 9134, 4201, -15093, 14012]
337A4012j6306p359K5899k5835N266J8368k7661J7546O659k5657K4486o240j6634
350a3456K7728j6771n680K3292k4657O794J5926k5793J7630L776k3208K3936p850
363A667j3828K6134j8189l596K1393k4653Q899J3976k5317J8170J869k1795K4176
376H906q637j2216K4969j8897k015K0105k3852J0350J1956k4338J8636N3j9592
389a4572K4368j0136j0339K3836j9681q5J8958k3306J1439J0174k3518J8647r56
402D829j7699K3580j0719r035K1852j9341J413J7045k2205J1762P870k2194J8503
415E661k277j5882K2819j1875p861K0720j9391K877J6012k1815J2077O506k1054
428a3483J8916k789j4427K2153j2575o517J9867j8954M290J4825k1616J2628N107
$$ y = [14012, -2294, -9653, 16246, -9589, -4323, 14045, -13616, 3930, 10589, -15068, 9418, 3178, -13456, 14272, -2499, -8179, 15113, -9544, -2750, 13176, -12617, 5013, 8789, -14419, 9517, 1667, -12161, 13973, -4216, -7812, 13581, -11072, -2173, 11803, -13514, 4656, 6525, -15270, 8906, 269, -11947, 13022, -5875, -7890, 12215, -11637, -1287, 10669, -13669, 4967, 5020, -14572, 9796, -340, -10679, 13157, -6524, -6609, 12349, -10957, 482, 10656, -12862, 5785, 4829, -12870, 10710, -9, -9044, 12808, -6533, -5120, 11925, -10280, 1482, 9352, -12842, 5661, 3384, -12498, 10321, -1554, -9415, 11305, -8086, -5209, 10803, -11012, 1065, 7571, -13483, 5433, 2644, -11783, 10370, -2205, -8722, 11145, -7809, -3519, 11306, -10310, 2318, 7425]
441G425j9932J9274l744j3498K1228j3332n597J8980j8477M697J3129k0875J2272
454A550M076j8196J8515m343j2199J9602j3171m082J7620j7539N400J1568j9771
467a0970J2390L478j6566J8111m875j1096J8490j2716k969J6703j6777N613J0177
480H993j8650J2554K741j5223J7619n942j0058J7765j2936j586J5675j6949O014
493A7Q897j8020J2802J933j4477J6775o667r236J6869j2518q38J4219j6446O075
507f15P647j6394J2726J027j2940J5712o992p605J6032j1916J33J2816j5642O378
521C67O918j4977J2536K98j1989J4676p127o421J5068j1739O50J1154j5269O787
535I32N762j4159J2634j061j1452J4457p800n318J4645j2200J129J0407j5060
$$ y = [7425, -12507, 6767, 3023, -10475, 10753, -2579, -8176, 10804, -7673, -2976, 10153, -10722, 1550, 5626, -12570, 5945, 1602, -10597, 9005, -4166, -8248, 9372, -8167, -2767, 8801, -10970, 1420, 4898, -11668, 6443, 1568, -9528, 8962, -3754, -6723, 9980, -6797, -1184, 8993, -9657, 2897, 5638, -9585, 8034, 2092, -7966, 9799, -3137, -4723, 10952, -5997, 17, 8914, -9106, 3696, 5629, -8848, 7927, 1260, -7976, 8893, -3625, -4463, 9756, -6690, -615, 7032, -9362, 3364, 4391, -8549, 7163, 171, -7434, 8598, -3318, -3185, 9631, -6011, 367, 7285, -7692, 4844, 5142, -6847, 7829, 702, -5719, 9349, -2390, -1740, 9414, -5855, 932, 6694, -7465, 5169, 4108, -7344, 7113, -687, -6005, 8640, -3560, -2431, 7976, -7084]
548g084P527N371j3476J2356j650j0541J4015p541m174J3715j2089J663R339j4158
562f727Q172M537j2826J2154k487r686J3895p649l680J3032j2140J686Q913j3403
576f209Q038L974j2333J1362k791q820J3340p663l141J1943j2331K487Q226j3022
590f940Q541L078j2237J1562l189q089J3515p956k840J1552j2095L024Q083j2486
604f477Q562K538j1594J1358l253p163J3072q251k296J0756j1883L613P686j2399
618e731Q394J866j1409J1448l220o983J2594q296k501J0404j1184L563P268j1874
632e661P859J599j0572J1218l270o388J1934q492j848J0143j1059M067O880j2069
646e659Q006J334j0232J1442l416o347J1533q551j687R975j0607M105O052j1710
$$ y = [-7084, 443, 5814, -7662, 4694, 3044, -7497, 6518, -1023, -5197, 8518, -3571, -1908, 7431, -6727, 1445, 5982, -6844, 5310, 2823, -6863, 7032, -617, -4297, 8735, -3405, -1719, 7194, -6209, 1829, 5803, -6530, 4832, 2041, -6779, 6561, -1102, -4243, 7700, -4631, -2144, 6082, -6940, 1601, 4679, -7558, 4004, 815, -7274, 6241, -1715, -4555, 6997, -5098, -2074, 6009, -6477, 2085, 4623, -6971, 4387, 1134, -6029, 7043, -1208, -3504, 7252, -4631, -1018, 6668, -5731, 2663, 4529, -6880, 4568, 1348, -5635, 6959, -1337, -3838, 6566, -4618, -1055, 6213, -5661, 2198, 3797, -6775, 4443, 1173, -5215, 6719, -1773, -3621, 6522, -4537, -470, 6410, -5659, 2347, 3681, -6551, 4891, 1475, -4872, 6661, -1890, -3577, 6398, -4209, -104, 5948, -5762]
660e762P851J029r402J1068l866n905J0883q485j002R552j0438M069N497j1394
674f305P863R98q848J0606l880n683J0342q024o12R091j0005L905M965j0687P957
689A683Q16q352J0296m270n308J0277p843j88Q748j0059L843M699j0293Q014O54
704B717q070R828m478m888R968p618J94P999j0050M174M090r629Q213J21p784
719e213R579m780m260R841p563L94P422r881M251L959r108Q103m25p413R200m806
735g00l482R448p764P98O770r873M920L624r005Q275r89p281R504n080l058R367
751E474q055Q92O522r621N321L261q759Q292j658o762R621n380k424R072q547
766b751J395O257r730N949K865q863Q337k022o431R686n361k354Q688q610J596
$$ y = [-5762, 2089, 3118, -6284, 4784, 918, -4987, 5896, -2589, -3591, 5961, -4477, -408, 5089, -6305, 1558, 2556, -6292, 4314, 434, -5249, 5093, -2931, -3543, 5548, -4457, -552, 4413, -6274, 1683, 2499, -5853, 4443, 173, -5135, 5142, -2701, -2889, 5859, -4200, -357, 4342, -5951, 2063, 2717, -5353, 4475, -3, -4891, 5077, -2541, -2347, 5652, -4398, -224, 3866, -5763, 2450, 2571, -5213, 4366, -414, -4674, 5167, -2396, -2002, 5420, -4461, -210, 3749, -5359, 2744, 2319, -5094, 4106, -700, -4182, 5266, -2498, -1700, 5070, -4803, 117, 3741, -5264, 3011, 2022, -5259, 4245, -835, -3893, 5474, -2581, -1689, 4833, -4788, 533, 3794, -4965, 3327, 1669, -5093, 4528, -852, -3276, 5796, -2751, -1356, 4901, -4829, 1120, 3985, -4878, 3459, 1437, -4994, 4692, -669, -3023, 5665, -2945, -1349]
781a349O017r293O015K319q583Q239k361n835R795n857j916Q387r002K264N957
796D797r429O365J951q840Q539k484n555R832o224j812Q198r115K720N653r421
811d825O670J172q698Q968k893n232R982o920j443Q141r284L292N552r614O689
826A557R40q454R186k952m865R570p023j149P953r004L619M983r430O827M94p973
842e721R402l271m697R572p454p60P927q908L819M667r557O903L64p554R436l751
858D17m405R143p623j45P713r169M280M050r596P399j5p326R669m258m258R113
874D989p654K36P680r150M243L726r347P497j02o849R281m607l784Q838p613Q10
890a806P027r211M512L111r029P880n84o611R137m981l415Q724p612J153O628
$$ y = [-1349, 4668, -4625, 1390, 3709, -4874, 3365, 1004, -4831, 4964, -893, -2809, 5578, -3424, -1160, 4797, -4632, 1733, 3684, -5156, 3383, 899, -4656, 5176, -1048, -2860, 5338, -3777, -1057, 4596, -4825, 1845, 3017, -5681, 3287, 394, -4838, 5144, -1776, -3219, 4922, -4362, -1070, 4482, -5132, 1557, 2497, -5957, 3229, 277, -4588, 4982, -2041, -3190, 4763, -4241, -622, 4361, -5069, 1758, 2252, -5721, 3681, 410, -4287, 5285, -2169, -2929, 4998, -3910, -91, 4576, -4981, 1922, 2286, -5268, 4168, 417, -3988, 5155, -2468, -2613, 5100, -4069, 211, 4261, -5335, 2064, 2049, -5277, 4392, 134, -4124, 4989, -2665, -2429, 5251, -3899, 344, 4070, -5277, 2220, 2118, -4731, 4550, -57, -3841, 4997, -2616, -1806, 5221, -3990, 522, 3633, -5396, 2484, 1900, -4711, 4426, -555, -3970, 4754, -2858, -1705, 4923]
905D923r210M719K782q522Q071j227o102R014n530k514Q557p926J960N820r391
920d576N575K033q159Q648j975n868R054n961j848Q369q143K353N263r307O006
935A464J584p698Q526k726n228Q870o311j056Q015q508K817M668r195O456J225
950B903p600Q675l311m932Q964o488n51P635q688L243M163q967P068N67p301Q806
966D186m036m190R039o968J02P306r230L905L888q968P521m6p202Q930m518l665
982c946R119p450O33O771r415M553L439q739P942p95o953R179m966l068R136p882
998b442J062O415r449N028L066q539Q106j435o548R192n287k426Q809q273J526
1013a195N997r506N801K470q528Q401k192o175R535n766j979Q623q710J949N709
$$ y = [4923, -4287, 432, 3214, -5308, 2763, 1536, -4566, 4448, -1082, -3596, 4961, -2965, -1005, 4815, -4576, 999, 3032, -5127, 3521, 1546, -4322, 4732, -1229, -3077, 5292, -2851, -498, 4765, -4542, 1464, 3048, -4650, 3876, 1150, -4078, 4792, -1519, -2575, 5440, -3068, -251, 4417, -4778, 1678, 2903, -4697, 3978, 667, -4265, 4699, -1789, -2340, 5295, -3393, -150, 4013, -4954, 2114, 2681, -4620, 4186, 150, -4040, 4999, -1969, -1867, 5439, -3791, 114, 4002, -4966, 2555, 2509, -4693, 4237, -281, -3946, 5173, -2277, -1644, 5127, -4288, 265, 3704, -5035, 2907, 2112, -4841, 4338, -628, -3696, 5440, -2442, -1380, 5035, -4414, 614, 3680, -4859, 3247, 1812, -4736, 4456, -831, -3257, 5552, -2721, -1195, 4802, -4704, 1097, 3567, -4961, 3440, 1248, -4927, 4608, -1158, -3137, 5486, -3224, -1275, 4434]
1028D434r410O177K058q390Q441k694n604R525o047j499Q133q897K605N367r366
1043e167O631J452q260Q681l012n190R520o300j282P911q857K929M987q998O721
1058A766R14p947Q629l252m476R288o827o21P413q971L663M510q962P046K41p598
1074e184Q932l693m012R145p123j79O975q886M208L959q788P215m17p017R040
1089D175m266l371Q823p681M88O689q939M692L373q664P344r59o441Q941m524
1104c20k910Q227p737J107O122q639N104K465q225P558j693n638Q982n267k197
1119c061P914q123J924N641q663N578J803q095P950k115n110Q900n795j602P496
1134D642q170K621N135q713O034R82p630Q328k814m492Q835o438r84P276q343
$$ y = [4434, -4976, 1201, 3259, -5131, 3310, 616, -4988, 4537, -1510, -3009, 5124, -3773, -1168, 4199, -5167, 1464, 2916, -5344, 3337, 325, -4865, 4655, -1645, -2927, 4984, -3873, -944, 4043, -4955, 1766, 2680, -5267, 3362, 110, -4366, 4922, -1905, -2526, 4887, -4084, -421, 4089, -4873, 2173, 2414, -5184, 3748, 55, -3957, 5188, -1935, -2114, 4861, -4025, 183, 4142, -4646, 2569, 2152, -4865, 4175, -91, -3462, 5361, -2320, -1832, 4857, -4082, 610, 3983, -4681, 2663, 1704, -4737, 4204, -320, -3230, 4997, -2740, -1633, 4489, -4150, 954, 3419, -4806, 2752, 1059, -4579, 4403, -864, -3061, 4853, -3270, -1346, 4295, -4368, 1210, 3013, -5082, 2868, 753, -4357, 4543, -1252, -2854, 4642, -3528, -907, 4228, -4485, 1549, 2531, -5099, 3229, 415, -4077, 4758, -1680, -2664, 4612, -3731]
1149c731L306M574q675O280M91p173Q451l166m072Q477o760k49O821q340L964
1164A98L776q599O782k27o686Q773l952l631Q418p235M01O675q543M320L257q541
1180d814P119p20o204Q805m579k988Q124p610J269O162q748N018K412q329P650
1195B567j343n778Q897n150k555P945p687J756N792q713N198J967p896P790j729
1210A061n332Q709n555j944P759p868K348N216q727N607J418p632Q163k304m956
1225d037Q640o034j363P548p963K800M779q738N860J011p197Q280k887m503Q406
1240D602o374o37P214q147L202M136q604O332M61o767Q280l395m119Q214o470
1255b072j33O852q109L404L625q242O548N6o387Q210l908l516P992o654M60O344
$$ y = [-3731, -425, 4149, -4526, 1754, 2245, -4928, 3523, 357, -3715, 4762, -1998, -2247, 4574, -3766, 198, 3974, -4625, 2157, 1930, -4756, 4017, 65, -3566, 4852, -2383, -1982, 4693, -3850, 470, 3727, -4814, 2305, 1585, -4619, 4186, -393, -3381, 4743, -2867, -1598, 4564, -4184, 834, 3246, -5083, 2567, 1224, -4554, 4343, -807, -3362, 4583, -3104, -1348, 4444, -4269, 929, 2896, -5000, 2790, 1061, -4271, 4438, -1117, -3061, 4698, -3170, -822, 4394, -4333, 1274, 2692, -4940, 3223, 919, -4037, 4603, -1431, -2794, 4754, -3209, -409, 4370, -4368, 1492, 2503, -4694, 3586, 699, -3804, 4602, -1772, -2409, 4805, -3342, -140, 3996, -4608, 1724, 2185, -4582, 3698, 303, -3816, 4398, -2072, -2205, 4647, -3462, -58, 3567, -4675, 1873, 1929, -4458, 3752, -156, -3672, 4320, -2334, -1874, 4470]
1271D470q156L865K994p956O825l86n946Q021m295k915P667o691J002N703q104
1286c902M306K409p474P172j216n478P988m732k235P541p051J595N176q130M698
1301F67K046p132P191j678m984P794m992j603P124p103K074M495p943N276J299
1316B531o690P365k359m531P688n412q18O702p317K463L988p751N583P52o298
1331d104P290k939l828P504n699k26O209p482L116L344p488O112Q5n968P474l574
1347a74l246P513n987K63N876p592L489K981p227O322n01n540P390l921k629P286
1363D303o302Q22N281p656M074K424o960O497j071n236P457m275k084O984o398
1378b140J166M836p425M308K026o696O616j557m823P391m557j517O730o717J683
$$ y = [4470, -3686, 179, 3173, -4783, 2042, 1656, -4290, 3731, -564, -3479, 4188, -2503, -1501, 4202, -3902, 404, 2813, -4661, 2511, 1295, -4183, 3805, -927, -3162, 4379, -2672, -1077, 4099, -4031, 667, 2713, -4419, 2772, 1094, -3890, 3904, -1088, -2691, 4433, -2670, -596, 3899, -4044, 1232, 2531, -4159, 3206, 847, -3684, 4004, -1408, -2226, 4476, -2841, -378, 3610, -4141, 1442, 2194, -4104, 3186, 247, -3581, 3923, -1776, -2002, 4207, -3275, -159, 3185, -4303, 1809, 1894, -4074, 3400, -174, -3420, 4093, -1894, -1631, 4245, -3347, 142, 3123, -4104, 2218, 1717, -3823, 3567, -354, -2983, 4303, -1999, -1177, 4104, -3552, 522, 2946, -4014, 2483, 1412, -3824, 3633, -642, -2726, 4258, -2140, -974, 3862, -3563, 745, 2771, -3925, 2691, 1134, -3689, 3702, -855, -2372, 4358, -2359, -676]
1393f76M425p436M807J546o508O795k139m333P423m876j092O368o887K053M021
1408C491p172N080R69o212O712k512l832P292n146o74N989o972K413L699p009
1423c884N287O02n955O647k675l382P023n193k72N478o830K900L214o693N523
1438A790q1n518O792l093k809O848n516J20N153o802L279K819o569N594n40n143
1454c676O682l350k271O403n701O13M626o619L755K152o266N651j029m591O676
1469C055l681j782O036n867J059M306o454L897J742n983N680j407m030O512l894
1484h11j435N729n914J553L876o336M331J051n676N842j853l513O369m248r08
1499a943N321n995J988L469o187M432O32n334N889k176l011O142m600m44M958
$$ y = [-676, 3749, -3687, 1120, 2666, -3842, 2953, 814, -3519, 3904, -972, -2064, 4304, -2583, -530, 3491, -3681, 1399, 2368, -3844, 2868, 356, -3476, 3816, -1330, -2004, 3985, -2987, -574, 3125, -3884, 1403, 2005, -3950, 2697, 22, -3360, 3663, -1530, -1802, 3676, -3154, -254, 2960, -3733, 1790, 1709, -3809, 2983, -110, -2919, 3929, -1587, -1467, 3686, -3116, 163, 2982, -3587, 2007, 1467, -3676, 3006, -344, -2615, 3788, -1913, -1300, 3326, -3293, 462, 2614, -3652, 1999, 970, -3621, 3055, -626, -2408, 3628, -2239, -1180, 3126, -3328, 569, 2311, -3672, 2008, 601, -3429, 3083, -811, -2246, 3483, -2431, -878, 2998, -3338, 993, 2044, -3632, 2210, 357, -3156, 3213, -1035, -1943, 3378, -2617, -629, 2840, -3347, 1085, 1717, -3617, 2272, 96, -2915, 3227, -1373, -1817, 3141]
1514C141n933K525K964n981M627J07m892O006k548k585N961m843N5M660n909K877
1530B32K519n882M840l34m514O032k903k203N720n059M05M383n881L209K003n739
1546c172M915o49m192O010l208j891N472n241R25M000n735L351J572n490N060
1561A727r93l740N916l583j484N204n235J289L757n839L649J229n353N346j321
1576E69l451N811l680j243N090n255J570L374n635L683Q91m979N283j588l099
1591b659N561l917q44M859n272J849L127n683L804O79m758N306j803k858N394
1606B785m026m30M508n092K073K634n460M091K87m327N351k196k578N296m189
1621a273q4M410n204K256K277n287M116R3m027N107k332k241M969m241K90L996
$$ y = [3141, -2792, -267, 2697, -3284, 1343, 1450, -3442, 2564, 16, -2569, 3392, -1451, -1396, 3264, -2645, 232, 2751, -3131, 1709, 1375, -3139, 2893, -10, -2213, 3507, -1552, -1147, 3236, -2645, 564, 2567, -3172, 1743, 1094, -3098, 2912, -296, -2187, 3285, -1956, -1031, 2969, -2766, 585, 2157, -3333, 1727, 734, -3006, 2910, -673, -2157, 3047, -2188, -899, 2858, -2981, 668, 1897, -3456, 1890, 569, -2882, 2929, -751, -1994, 3096, -2159, -589, 2785, -2850, 833, 1724, -3255, 2028, 440, -2659, 2902, -1015, -1859, 3000, -2272, -423, 2704, -2979, 825, 1504, -3254, 2052, 249, -2609, 2785, -1241, -1671, 2837, -2255, -182, 2452, -3008, 1083, 1370, -2957, 2394, 198, -2380, 2916, -1273, -1357, 3053, -2151, 105, 2382, -2905, 1211, 1304, -2723, 2384, 52, -2189, 2780, -1461, -1171, 2825]
1637B825n111K449J897n078M285k84l779N117k684j897M900m240N18L674n055
1652b463K636J577m669M300n43l393M825k800j432M588m174Q88L292m963K838
1667E07J249m396M433r18l137M786l006j120M397m222R93K941m866K991R85m141
1683b524M320j211k810M526l091p31M156m355J325K542m709L257O65l909M414
1698A865j503k576M569l220m32L901m232J471K246m379L277M26l641M250j809
1713B13k233M458l330j10L577m407J786J928m335L507R2l522M244j955j919M281
1729B275l399Q4L369m366J942J753m122L632k82l226M221k175j564M218l543L55
1745h28L094m306K211J641m092L686m67l104M263k273j377M099l644N93K857m257
$$ y = [2825, -2286, 163, 2060, -3018, 1267, 983, -2796, 2321, -363, -2260, 2640, -1600, -1082, 2592, -2463, 173, 1750, -2919, 1381, 838, -2555, 2270, -530, -1962, 2626, -1548, -660, 2632, -2331, 507, 1756, -2640, 1793, 875, -2262, 2524, -482, -1602, 2795, -1427, -434, 2507, -2359, 632, 1617, -2524, 1796, 585, -2225, 2301, -790, -1521, 2635, -1720, -395, 2147, -2562, 695, 1360, -2549, 1865, 362, -2214, 2355, -865, -1297, 2604, -1628, -157, 2089, -2290, 987, 1413, -2228, 2022, 213, -2020, 2438, -892, -1002, 2575, -1832, -46, 1882, -2453, 1054, 1146, -2376, 1868, -87, -2006, 2275, -1124, -1040, 2329, -2037, -95, 1658, -2464, 1168, 886, -2340, 1881, -294, -1858, 2360, -1183, -828, 2266, -2040, 171, 1812, -2280, 1406, 939, -2165, 2098, -175, -1552, 2547, -1097, -504, 2353, -1904]
1761a904K414J260l894L658p82k906M220k446j102L891l782P33K700m292K675
1776D43J045l842L713r23k711M201k543p94L728l757R27K450m071K693Q41l659
1792b259L698j099k379M132k604p01L518l779J103K345l922K691O34l519L573
1807A432j176k188L892k586n51L291l719J255K129l835K786L41l223L626j340
1822A34j915L841k724m20L118l629J492J913l690K785J21l006L521j375j631L607
1838B142k831j27K876l576J634J650l631K849n1k870L546j576j448L413k847k5
1854h72K755l471J670J434l478K819k53k529L479j706j334L290k934K68K539l376
1870a699J825J171l356K912m19k377L453j770j142L080k869M95K396l284J831
$$ y = [-1904, 510, 1770, -2124, 1534, 752, -2154, 2066, -380, -1482, 2409, -1373, -640, 2060, -2232, 443, 1488, -2354, 1359, 436, -2275, 1926, -617, -1411, 2317, -1440, -513, 1937, -2134, 559, 1400, -2259, 1439, 340, -2039, 2093, -511, -1212, 2306, -1473, -370, 1975, -1947, 744, 1378, -2141, 1432, 256, -1932, 1960, -626, -1177, 2114, -1605, -350, 1779, -2056, 730, 1071, -2152, 1474, 134, -1781, 2060, -664, -1084, 2034, -1595, -103, 1810, -1880, 905, 1026, -1980, 1541, 166, -1465, 2142, -689, -816, 2060, -1516, 118, 1768, -1863, 986, 935, -1935, 1611, 35, -1413, 2000, -847, -872, 1883, -1588, 82, 1516, -1962, 857, 604, -1925, 1554, -152, -1486, 1804, -1130, -862, 1677, -1699, 126, 1297, -2059, 853, 434, -1943, 1510, -260, -1402, 1678, -1191, -696, 1700, -1584, 247]
1885B47Q84l076K874n37k094L369k058q74L026k974P28K174l342K004P49l064
1901a964K947n81k065L290k125p35K910k866Q02J966l264K093M70k784L035q81
1917B48j859L237k313m61K864l014J032J793l283K193L98k699L004r80j687L145
1933A618k300l13K723l023J116J639l246K395K51k643L110j170j615L109k359
1948g08j37K605l069J258J421l097K378J52k478L038j378j406L016k411L5K503
1964A722l093J388J319l097K572Qk423L097j532j270L073k474J67K438l141J410
1980A64J220k925K557j17k305K955j530j170L000k569K75K235l118J528J093k883
1996a590K545k50k306K990j583j009K870k507K30K212l121J647J003k824K574
$$ y = [247, 1131, -1945, 929, 392, -1702, 1667, -391, -1265, 1761, -1213, -485, 1689, -1653, 351, 1100, -1964, 983, 402, -1663, 1627, -498, -1233, 1677, -1189, -387, 1579, -1685, 408, 878, -1906, 1129, 248, -1611, 1626, -687, -1148, 1716, -1298, -266, 1527, -1756, 437, 835, -1864, 1140, 160, -1527, 1618, -682, -995, 1728, -1295, -179, 1460, -1786, 609, 860, -1783, 1327, 157, -1458, 1651, -708, -845, 1760, -1309, -51, 1370, -1727, 651, 803, -1675, 1363, -15, -1421, 1595, -816, -781, 1722, -1371, 17, 1336, -1761, 811, 819, -1604, 1493, -39, -1309, 1764, -710, -543, 1895, -1246, 164, 1384, -1541, 1016, 899, -1406, 1549, 19, -1151, 1849, -720, -445, 1790, -1328, 200, 1293, -1590, 955, 705, -1601, 1389, -194, -1203, 1667, -840, -610, 1602, -1519, 128, 1131, -1693, 881]
2011H81m27k081K929j719p80K814k631M81J860k883J780Q40k678K617n66j997
2027a560K961j679p10K695k666O20J781k855J822O99k623K579p68j743K885j862
2043d24n04K544k737P81J583k745J943M97k510K540p32j656K821j782m20K325
2059A524k616Q91J572k742J998L17k373K578r03j426K851j982l10K220k606R78
2075b9J418k729K053J59k333K588j016j289K726k150j47K099k562J114J287k699
2091a510K102Jk201K733j246j054K659k241J2K160k689J316J102k597K176k08
2107E15j913K630j263r44K508k218K36J977k627J384R08k549K263l72j820K695
2123A410j461q75K475k382L86J830k589J444P80k473K221l75j758K598j513o80
$$ y = [881, 454, -1627, 1302, -417, -1197, 1617, -1014, -533, 1327, -1556, 224, 1064, -1614, 1003, 437, -1560, 1401, -278, -988, 1707, -959, -339, 1442, -1413, 409, 1108, -1515, 1064, 296, -1447, 1438, -424, -928, 1616, -1121, -340, 1243, -1502, 441, 938, -1572, 968, 236, -1420, 1401, -381, -801, 1524, -1092, -201, 1371, -1371, 627, 944, -1429, 1149, 246, -1180, 1671, -311, -621, 1599, -1007, -29, 1389, -1340, 713, 872, -1461, 1127, 111, -1178, 1548, -602, -749, 1350, -1212, -98, 1189, -1510, 592, 593, -1608, 1125, -121, -1175, 1484, -757, -745, 1415, -1274, 42, 1144, -1453, 723, 515, -1398, 1232, -31, -975, 1533, -685, -449, 1528, -1099, 285, 1193, -1356, 907, 535, -1285, 1410, -51, -926, 1549, -833, -447, 1383, -1206, 238, 1018, -1455, 766, 391, -1367, 1231, -282, -962]
2139i62K396k429N98J762k605J600O27k474K437n99j589K662j698n97K407k407
2155h71O66J583k599J653M70k359K472o83j554K629j858m53K306k446Q20J532
2171A308k701J728L64k283K523q10j442K562j847k82K218k407R17J278k521J848
2187D53K74k118K477r31j284K450j872j62K155k421R90J191k540J920J43k012
2203a287K507j063j223K494j937m7J973k392J064R98k439J991j11j763K398j249
2219h6j009K387j961J01J903k463J170R02k335K055j63j812K484j312q76K360
2235A345k051K96J721k495J331P72k187K086l88j674K435j453o77K304k065L53
2251c47J568k472J462O31k192K136m52j495K284j428n57K203k112N33J387k389
$$ y = [-962, 1434, -995, -397, 1365, -1240, 360, 987, -1487, 950, 351, -1238, 1424, -274, -871, 1536, -871, -205, 1378, -1221, 432, 902, -1457, 1015, 332, -1222, 1407, -451, -904, 1402, -1044, -224, 1308, -1393, 335, 699, -1584, 939, 129, -1313, 1249, -598, -880, 1338, -1069, -152, 1126, -1395, 453, 727, -1391, 1086, 155, -1129, 1321, -551, -713, 1442, -979, 11, 1202, -1338, 582, 725, -1287, 1220, 157, -1066, 1428, -509, -556, 1417, -975, 89, 1087, -1352, 639, 528, -1235, 1163, -86, -1095, 1292, -669, -568, 1335, -1128, 42, 944, -1391, 664, 501, -1311, 1173, -139, -1015, 1345, -706, -410, 1311, -1184, 147, 919, -1268, 818, 430, -1244, 1191, -262, -939, 1365, -700, -347, 1221, -1251, 211, 842, -1350, 786, 334, -1161, 1123, -305, -862, 1341, -771, -238, 1149, -1240]
2267a240J476N24k037K183o18j424K350j532m04K101k176O04J366k372J598M06
2283H05j991K207q63j227K299j606k00J942k272Q15J156k325J768R2j834K180
2299I46r34j129K328j740n8J820k245R23J018k262J832m1j740K182j025r61K237
2316A151j820R1J707k259J093R32k241J926k13j715K303j204p60K252j959K21
2332d95J576k245J248P47k137K033l95j569K326j302o30K100j955K98J560k271
2348a111J367O30k164K028m07j537K277j342m83K023k067M95J467k263J474M44
2364H31k023K030n86j416K323j429m55K020k130O07J367k207J464L28j944K111
2380H91o81j219K155j444k94J859k122P56J169k150J596J60j820K087p66j158
$$ y = [-1240, 236, 760, -1277, 906, 288, -1136, 1214, -318, -722, 1379, -797, -193, 1173, -1199, 399, 805, -1186, 1021, 158, -1069, 1230, -376, -576, 1366, -906, -91, 1065, -1260, 508, 600, -1234, 946, 12, -1117, 1211, -529, -587, 1233, -1012, -89, 929, -1333, 499, 458, -1282, 900, -125, -1086, 1151, -669, -578, 1129, -1130, -37, 895, -1346, 580, 367, -1348, 955, -249, -1009, 1243, -716, -495, 1081, -1164, 84, 831, -1306, 727, 332, -1237, 1089, -213, -843, 1257, -698, -400, 1160, -1111, 256, 886, -1278, 750, 343, -1194, 1083, -259, -742, 1281, -786, -291, 1176, -1087, 387, 831, -1192, 838, 252, -1164, 1159, -270, -725, 1295, -835, -228, 1139, -1068, 396, 724, -1220, 891, 210, -1009, 1146, -298, -592, 1267, -855, -99, 1070, -1080, 516, 676, -1144, 943, 177, -981]
2396i81K197j615j32J754k121R29R93k119J534K12j824K100q68r78K087j661l0
2413e23J710k090R33J000k159J686k9j657K122r68q48K089j724K4J609k020J029
2430A84P72k061J723j32j493K043j067p13J942j778K31J404k014J154O51j992
2446a146J761k97j400K092j186o18J905j873M07J355k008J160N00j887J811l78
2462A98j223K001j331m17J798j778M84J230k016J336L10j775J919n81j214K121
2478A062j365l62J787j815N29J121j946J334J97j651J865o31j018J947j478j82
2494f06J649j869P97R46j984J458J18j592J955p61r67J970j591LJ638k002R40
2511A02P71j887J557m8j520K017r60q12J886j604J57J507k017R72P18j939J644
$$ y = [-981, 1216, -399, -531, 1223, -898, 31, 1024, -1095, 439, 651, -1173, 927, 59, -919, 1168, -493, -523, 1187, -903, 30, 1030, -1129, 557, 528, -1129, 993, 25, -823, 1266, -458, -434, 1175, -845, 184, 956, -1105, 618, 486, -1007, 1036, -31, -744, 1198, -580, -349, 1055, -959, 195, 846, -1146, 615, 318, -1082, 1010, -176, -794, 1111, -762, -355, 1000, -1008, 152, 652, -1235, 576, 198, -1025, 976, -355, -772, 1026, -752, -268, 962, -1054, 282, 592, -1183, 736, 155, -1059, 1062, -303, -665, 1122, -693, -164, 957, -989, 345, 542, -1109, 756, 125, -893, 1054, -424, -606, 1043, -826, -29, 917, -1067, 391, 509, -1083, 872, 111, -856, 1114, -477, -474, 1164, -838, 102, 873, -1014, 543, 495, -1025, 992, 32, -780, 1106, -498, -341, 1166, -851, 121, 839, -1100, 544]
2528E44j32j422J948j049p26J908j664J84J433j955J047N63j832J725k89j350
2544a067K034j197n75J868j655L29J273k016J170N51j856J735l32j249J958j207
2560b36m48J716j648M48J153j933J234L99j754J817m95j186J931j287k94J687
2576A104j776N12J066j906J253L27j582J705n64j009J767j272k26J625j765O15
2592a26R64j833J354J78j577J805p17r33J806j317j21J550j752O67Q12j733J429
2609D56Jj453J744p80q00J772j366k8J357j726P67P68j716J422q2j364J757q84
2627a55o57J677j401J84J213j731R35O27j661J466j74j247J723r43n30J671j505
2644e08K28J149j688R75N53j571J453l19j112J695r97m18J543j482L35J062j747
$$ y = [544, 412, -1010, 938, -111, -837, 1071, -593, -409, 1024, -931, 116, 679, -1153, 572, 283, -1067, 967, -230, -805, 1063, -592, -263, 1010, -1006, 164, 715, -1141, 594, 262, -987, 971, -236, -684, 1032, -616, -168, 985, -948, 286, 685, -1069, 748, 253, -933, 998, -289, -583, 1104, -672, -160, 906, -1000, 253, 580, -1002, 703, 139, -870, 897, -375, -601, 1024, -741, -126, 838, -995, 359, 537, -1040, 765, 48, -885, 921, -396, -517, 1033, -719, -52, 760, -973, 456, 457, -996, 748, -32, -832, 940, -426, -454, 903, -823, -56, 712, -1004, 418, 336, -1028, 729, -155, -812, 865, -536, -352, 861, -870, 65, 692, -969, 497, 323, -924, 799, -144, -674, 997, -508, -280, 869, -819, 156, 709, -862, 591, 272, -840, 855, -142, -560, 983, -499, -164, 898, -849]
2661h49J119L54j516J534m05j047J697j064l70J536j629M13J052j703J127L10
2677E59j459J542n29r80J711j137k28J418j509M68R08j656J233J15j331J547o27
2694D5q24J667j227j18J323j591O57Q04j640J281L3j306J529o03p66J629j283
2711c90j1J224j590P63O61j548J317l9j260J560p48n96J588j381J40J170j673
2728h13R12O42j572J300j06j196J590p89n43J524j405K03J147j630Q56N43j580
2745i17J412k15j109J642r40m71J484j411L00J011j572R25L69j410J384l20r53
2762g91J555r72l91J418j392L30R77j554R95L20j367J311l34q71J516r88k88J313
2780G87j412N23Q03j466J019K14j296J391m89p90J498j032j89J233j401N26P78
$$ y = [-849, 270, 624, -892, 642, 237, -810, 887, -177, -547, 989, -640, -227, 825, -878, 249, 559, -900, 642, 113, -867, 844, -293, -521, 897, -612, -144, 764, -892, 341, 456, -875, 672, 45, -779, 888, -339, -457, 866, -725, -68, 736, -904, 377, 410, -896, 633, 30, -736, 893, -390, -401, 823, -767, -4, 657, -891, 426, 387, -873, 687, -61, -657, 931, -450, -310, 860, -813, 99, 741, -831, 469, 363, -833, 757, -32, -575, 949, -456, -253, 894, -736, 120, 663, -917, 495, 280, -829, 813, -127, -598, 886, -525, -225, 786, -786, 139, 508, -902, 482, 162, -791, 764, -208, -599, 819, -573, -243, 734, -820, 175, 495, -872, 439, 105, -766, 750, -238, -526, 787, -625, -102, 701, -765, 254, 468, -828, 563, 74, -716, 782, -250, -439, 794, -607, -81, 697]
2797F97j453J014J69j181J389n54p44J464j143k0J114j362N96N98j361J122K9
2814C74j170J382n85n89J339j135J8J142j389O74N13j329J160q0j039J339o59
2831c4n44J356j155Q5R85j349P49L98j270J205j60j027J414p36m35J223j154K12
2849b37R35j348P43L56j259J215k34q10J262p89k96J132j124K87Q02j293R14J78
2867D34j121J192l63o91J218q33j88J098j207M06P41j306Q36J83j109J238m49
2884G9o75J312r72l7R90j250N28O61j325R94K6j007J244n10o94J368j054m3J071
2903G06j279O32M91j325J065k6r36J208n71n86J282j001k2J026j278O11M90j196
2921g09R82o2r30J319o78m72J204j021J25Q89j257P14L60j154J063k04p97J170
$$ y = [697, -756, 258, 427, -754, 635, 81, -663, 801, -342, -362, 752, -610, -14, 584, -777, 345, 374, -796, 586, 1, -588, 751, -384, -366, 776, -613, 61, 574, -755, 405, 325, -714, 625, -34, -578, 778, -377, -292, 693, -656, 93, 491, -779, 426, 266, -761, 653, -83, -518, 705, -449, -237, 698, -650, 93, 449, -810, 405, 171, -639, 623, -166, -462, 670, -454, -167, 635, -658, 256, 434, -687, 505, 142, -549, 669, -164, -352, 746, -461, -55, 686, -620, 216, 399, -710, 528, 79, -596, 716, -256, -293, 697, -553, -25, 636, -689, 305, 331, -676, 568, 58, -636, 732, -322, -365, 706, -573, 59, 550, -775, 290, 264, -672, 536, -35, -621, 661, -340, -362, 664, -614, -3, 487, -709, 273, 211, -719, 600, -78, -550, 654, -367, -242, 647, -610, 104, 464, -690, 373, 169, -628, 542]
2939E42o35m03J228j123J53Q71j211O09M23j115J043j89q34J237p31l45J138j088
2957d30K14Q34j297Q16L17j076J005k15p87J248p90k29J081j143L05O99j179Q03
2975A76K19j102J123l32p20J178p62j69J009j076L44O57j190Q57J25r95J097m09
2993C0n57J108q73r3R63j083M25O09j133P97O2q77J068m63m43J069q28q7Q98j053
3013d61M55M95j123R54m9q69J099n22m24J006q28L2Q05j087N54M43j048Q70n0
3032B52q13J117n85l80J061r72J27P87j080N73L74j050R22j45p17J056n61l29
3050c63R62r04J42O51j017O25L04r01Q78k29o73J064o33k04R18r97K29O76j061
3069e33O75J90r27R60k77n66R80o92j47Q90r73L24N83j014O60J65q84R82l41n38
$$ y = [542, -93, -496, 732, -391, -238, 633, -578, 31, 454, -661, 382, 193, -641, 596, -135, -480, 658, -430, -216, 618, -679, 137, 454, -622, 383, 168, -619, 629, -161, -390, 691, -452, -147, 552, -627, 176, 395, -707, 416, 84, -636, 542, -220, -389, 620, -456, -112, 545, -645, 212, 337, -658, 439, 30, -527, 581, -292, -385, 578, -505, -80, 529, -604, 193, 255, -622, 446, -17, -460, 609, -219, -306, 592, -461, -6, 489, -634, 320, 271, -598, 501, -21, -445, 561, -267, -235, 570, -517, 37, 480, -568, 302, 252, -561, 556, -29, -409, 652, -320, -193, 594, -486, 87, 461, -589, 333, 188, -529, 527, -34, -363, 599, -305, -163, 488, -529, 96, 400, -501, 377, 148, -525, 539, -94, -298, 620, -377, -148, 528, -533, 142, 332, -595, 365, 88, -478, 502, -190, -337, 553, -420, -96, 487, -527, 133, 298, -586, 396, 55, -483]
3089d83J062p42j43Q80j004M42M95j034P31P6q02R18m00m47J060q25k9Q42r16
3108c19L42M50r78P44L3q07R76m49m66J034q40P9P20r83M03M96r84P95l5p62R84
3129D33m47l89R42q34O2P79j032N09L84r70Q37j15p25J021n08l32R51q81J28O51
3149D64r50N54K92q79P83q0p35R72m83l00R33r24J81O33r41N80K20q45Q76j63
3169A88o64R88o04k25Q91q98L10N27r18N11K25q12Q18j67n77Q14m98k13Q20q69
3189c53K46O02r60O04J71q34Q41k50n41R51o15j13P14p71K26M88q54N51J35p38
3209e00Q17l03m78Q77o25q6P94q44L05N05r77O63O7o61Q32m19l89Q55o34j4O62
3230D47q20L65L75q45O76K9p35Q36l02m07Q34o76J9O89q45M49L08q88P21l0o54
$$ y = [-483, 579, -163, -306, 574, -430, 12, 507, -527, 204, 280, -522, 396, -4, -451, 609, -216, -245, 597, -319, 23, 473, -505, 239, 272, -535, 441, -8, -474, 560, -280, -201, 519, -464, -61, 435, -549, 246, 211, -551, 433, -14, -403, 539, -295, -233, 546, -486, 23, 407, -563, 274, 159, -566, 455, -53, -385, 566, -315, -187, 464, -486, 68, 360, -519, 264, 184, -551, 421, -62, -362, 571, -353, -172, 461, -480, 100, 320, -525, 351, 188, -476, 512, -92, -317, 574, -324, -14, 513, -405, 106, 331, -481, 337, 170, -407, 407, -91, -304, 516, -353, -107, 495, -465, 139, 310, -524, 317, 67, -474, 477, -138, -251, 463, -308, -82, 406, -448, 103, 238, -500, 317, 14, -464, 413, -212, -298, 496, -348, -43, 462, -515, 148, 215, -446, 386, -33, -422, 433, -201, -215, 447, -373, -8, 367, -478, 198, 227, -508, 328, 26, -381, 453, -223, -204, 485, -360, 89, 397, -491, 230, 200, -454]
3251d54Q82m42k99Q11o79L2O26p93M07K46p70P10j20o14Q67m70k58Q11p71K13
3271f5N00q86N51K60q17O56p2o09Q82n33j94P50p42J41N96q66N04J84p32P82k11
3292G9n26Q47n64j15P17p18K05M89q53N85J54p64P72k38n09Q30n14j39P39p60
3312b83K16M52q47N99O8o63P83k90m39Q44o36k5O80p76L06L71p74N77J04p11P94
3333C50l82l51P98n73k8O55q00L07L82q14O69K5p43Q14l29l14P90o24j7N63p02
3354c24K76L54q41P17m8n67P31l48l17P39o09MN93p51M15L11p63O63j12m94O90
3375C19l47l09P70o62O2N31p17M22K12p31O43q4n40P52m29j25O56o32J12N33q27
3396c91M91J58o55O90j55n04P62m79j71O64o13J44M45p91N16J58p14O59r9m88
$$ y = [-454, 428, -14, -313, 498, -181, -149, 477, -316, 91, 337, -433, 277, 157, -457, 410, -60, -318, 493, -278, -65, 435, -451, 100, 360, -457, 199, 127, -482, 400, -133, -327, 423, -319, -178, 418, -448, 56, 240, -492, 290, 79, -447, 400, -164, -279, 438, -280, -75, 414, -439, 146, 300, -464, 308, 70, -439, 391, -123, -262, 477, -283, -67, 385, -462, 137, 205, -458, 325, 35, -404, 440, -196, -221, 459, -317, -11, 360, -414, 163, 267, -444, 350, -32, -383, 415, -158, -186, 469, -331, -24, 358, -456, 213, 238, -505, 309, -20, -334, 456, -168, -185, 378, -324, -48, 306, -535, 182, 134, -433, 298, -50, -367, 372, -237, -233, 360, -391, 24, 335, -428, 235, 123, -371, 319, -28, -337, 433, -229, -167, 364, -353, 69, 281, -450, 193, 109, -431, 321, -108, -233, 423, -209, -97, 436, -391, 100, 258, -397, 293, 138, -366, 396, -83, -254, 410, -203, -59, 386, -405, 111, 269, -445, 214, 115, -373]
3416c73P74n30j18O78p27K43L69o85M57J38o38O36j70m16P43n43j15O87p28K64
3436e4L96p79N39P0o00P18k81l10O53n17o2O36o79K43L13o60N38M4n70O58k99
3457ck94O96n55rO12p52L00K63o40N42J2n32P39l73k72O82n62M8M65o68L64K09
3479B72o78O54r0n19P46m12k35O50n67M3M99p06M47K29o83O30k08m20O47l55k56
3500c12P04o16P5N05o91L52K07o46O33j51m74P98n41j16O63o27J30M49o60L95
3520G7J77o51O33j79l78O48m24j28N84n50J17M14o80M94J04o30O40k23l46O21
3540C20m54l9N69p06K24M48o65M11Q7o06O47j89l23O38n28JM88o18K63L19o38
3561c51N53l3n38O27k35k78N62m78ON55o58K93K89p26N54Lm74N97k91k33O11n58
$$ y = [-373, 401, -129, -247, 431, -296, -53, 316, -369, 88, 226, -412, 224, 54, -362, 381, -162, -277, 410, -318, -54, 342, -437, 102, 172, -428, 290, 9, -301, 352, -165, -227, 409, -270, -27, 286, -374, 164, 208, -362, 296, -3, -297, 399, -156, -165, 447, -305, -5, 258, -382, 160, 172, -360, 379, 6, -266, 416, -146, -98, 367, -301, 63, 272, -406, 248, 158, -361, 385, -27, -262, 388, -179, -136, 363, -343, 104, 333, -350, 280, 72, -348, 299, -56, -312, 392, -224, -149, 356, -335, 17, 224, -422, 211, 60, -414, 384, -157, -273, 390, -237, -107, 342, -318, 77, 254, -397, 236, 57, -321, 327, -97, -225, 359, -191, -74, 340, -340, 154, 258, -372, 268, 45, -301, 320, -134, -173, 396, -310, -86, 362, -303, 108, 195, -411, 236, 47, -276, 362, -166, -165, 323, -295, -32, 287, -351, 202, 169, -369, 258, 23, -255, 307, -171, -165, 390, -268, 25, 314, -412, 142, 145, -329, 268, -23, -256, 355, -203]
3583b03M8N16o93K94K86n97N18q5m37N70k54j93N70n49P3M85o74L63J38n42N41
3604A75q5m52O40l06j90O30n98R9M67p11M58J17n63N47j67l73O08l83j18N93o28
3625b40J46M04o20M41O5n16N25j44l76O19m35o8N07n69J76L59n80L73J63n89O13
3646B54k56k63N96m45qM21m78J63K72n61M33M8n38O10j88l00N59m68n3M97n78
3667b83K38L19o02N07l5m41M86k43j97N71m83MM56n35K73K24n45M65j07l97O30
3688C05l27j87N01m51M3M54n42K85K18o13N07n4l92N08k44j67M73m67J10L59n71
3709b52K82J92n45M92j11l59O16m00j65N38m59N0L93n69L87J49n92N57j48l89
3729c33N45l21j06N41n52J75L43n63L90P1n30N50j37l58O04m59k4M88n59K01K49
$$ y = [-203, -155, 361, -332, -38, 248, -349, 169, 84, -353, 217, -37, -230, 340, -209, -136, 349, -325, 38, 176, -366, 175, 90, -362, 278, -28, -218, 412, -186, -87, 380, -331, 127, 244, -319, 228, 61, -312, 296, -87, -205, 388, -240, -94, 310, -310, 131, 196, -320, 205, 61, -315, 304, -131, -199, 308, -261, -85, 274, -306, 67, 230, -359, 254, -2, -265, 331, -114, -122, 299, -179, -16, 256, -305, 128, 176, -362, 248, 60, -240, 319, -149, -202, 295, -283, -45, 274, -328, 179, 144, -297, 189, -54, -251, 320, -163, -159, 297, -238, 35, 259, -286, 179, 72, -325, 305, -22, -209, 292, -159, -116, 338, -204, 81, 299, -314, 193, 139, -253, 255, 11, -156, 317, -150, -40, 319, -252, 30, 222, -323, 169, 58, -301, 315, -85, -250, 288, -171, -121, 272, -297, 90, 239, -353, 204, 56, -333, 212, -109, -215, 326, -226, -51, 292, -271, 119, 190, -340, 210, 73, -285, 319, -140, -164, 324, -235, -34, 215]
3750B15n34L84R9m81M96j64k55N07l70p8M34m66J90K53n67M57J8m65N60k22k51
3771b40N64m09J4L63n28K22K59n31M01n0l75N67k74k31N39m47N1L84n44L01J97
3792B33m67L38kl89M57k30j65M91m26O9L95n89L28J75n39M30m5l09N19l21j46
3813a93M72m31J07K82m55K80J05m84M71m3l57N00l37j03M64m37J21K49m72L39
3833G8P3m29N12j83l00M76k85j24M76n01J56K78n15L44M4l70N11j91k93M91l86
3854a38LM28m79J37K96m74L83k8l87M61j98j94M32l81J5L65m52K07K05m70L64
3875I5O9m68N38k91j60M93m22M0L22m10J76K18m45L27Nl86N35k96j43M48m41J32
3897f4K99m28K13J83m68M21r2l34N03l47n6M51m41P3K80m58L22J36m31L83p6l21
$$ y = [215, -319, 65, 164, -317, 179, 15, -240, 267, -103, -181, 253, -213, -23, 230, -337, 120, 138, -327, 233, 11, -240, 324, -85, -71, 292, -236, -14, 245, -286, 115, 65, -310, 257, -17, -248, 291, -156, -105, 279, -265, 36, 233, -234, 104, 102, -287, 170, -60, -225, 266, -160, -91, 304, -285, 43, 218, -321, 109, 64, -245, 274, -47, -193, 279, -152, -45, 237, -218, 62, 167, -317, 154, 111, -246, 254, -83, -186, 278, -159, -38, 211, -261, 78, 151, -278, 234, 51, -249, 227, -58, -182, 294, -207, -51, 227, -288, 56, 100, -270, 241, 50, -243, 248, -138, -135, 293, -186, -49, 247, -227, 156, 128, -259, 202, 4, -190, 242, -139, -124, 241, -211, -4, 201, -269, 95, 164, -304, 234, -57, -217, 276, -146, -106, 216, -194, -18, 200, -245, 82, 87, -299, 236, -60, -203, 245, -196, -64, 235, -193, 20, 203, -265, 156, 64, -270, 233, -114, -170, 281, -160, -87, 193, -265, 57, 193, -238, 145, 69, -252]
3919b52M58l00n5L90l99R3K87m22K62Q2l67L98r0k71M29k97q0L62l87J35K42m14
3941a96K38J82n23M32r7k32M46l55l4M04m49J10K74m57L21Ql31L90j18j85M26
3962B54l34n1L82m32J49K71m71L19N8l59M22j66j65M00k86p8K99m43K21J73l56
3983a93L04nk80L23j59j57M19l52J3L10l46J84J02l71L10l2k98M28j99j34L27
4004A94k71J0K92l88J88J57m03L22n8j89L63k85n7L67m23J33K57m20K50R8m11
4025b74L41l6k62L70k51o3L44k97L8K39m03L37L0l00K96j20j31L10k08j01L46
4046B05l51J33K18m39L32Ql25L72j20j59K92k77OK71k70J09J16k98L02n0k62L79
4068A92k11j16L34k36j0K70l41J32J46l74K69j7k67L81j82j04L24l01O5K55m13
$$ y = [-252, 206, -94, -149, 241, -158, -65, 222, -200, 62, 144, -223, 175, 85, -186, 243, -54, -134, 228, -159, -24, 218, -196, 42, 224, -299, 133, 36, -196, 250, -105, -139, 265, -184, -74, 200, -257, 64, 72, -259, 131, 13, -172, 254, -80, -131, 251, -181, -32, 239, -232, 87, 145, -214, 208, 42, -123, 277, -9, -87, 212, -231, -10, 163, -193, 111, 106, -174, 149, -10, -167, 252, -100, -87, 223, -123, 61, 163, -208, 102, 70, -228, 200, 1, -133, 194, -77, -67, 225, -163, 25, 182, -221, 101, 43, -146, 217, -68, -125, 242, -181, -48, 209, -211, 39, 137, -274, 67, 31, -231, 139, -112, -175, 169, -128, -90, 149, -254, 83, 113, -187, 109, -11, -142, 168, -40, -141, 205, -146, -13, 205, -234, 98, 106, -219, 153, 33, -126, 166, -111, -105, 166, -104, 5, 121, -177, 125, 75, -187, 192, -19, -135, 199, -37, -47, 223, -118, 14, 160, -214, 55, 38, -229, 152, -30, -134, 190, -111, -46, 209, -204]
4089b04J75J52l07K64k7k37L44j83q7L28l05K8K31l35J78J27l40K33Qj84K44j57
4111e4j12L87l34K0K44l06J87J20l66L29p3j66L20k27m5K56l41J27K10l37K09
4132D8J11l59L57j26k34M18k45j19L43k82Q4J88l43K51Lk46K57p7j41K80k20o1
4154a13L35l47Q3J78k87K20k6k78L68q6j89L49k91k2K76l15J25J90k90J37L4k08
4176a57L20j71j13K78k47K0K20l14J60J16l12K67m8k25K89j42o4L38k75mK14l11
4198a61J64J26k95K63n2k13L21j74j25L01k67R0J52k96K24L6k61L06j16j67K99
4219A55j82j07K95k54K4K26k98J84R0l50K58j4j52K53j95k8L05k82%K54l04J92
4241G0J0k82L43j27j42K59j97m9K55k53O9J32k35K36k9k48L14j23j65K78k11L4
$$ y = [-204, -29, 123, -184, 80, 53, -184, 160, -23, -110, 218, -87, -59, 172, -163, 15, 142, -198, 35, 43, -141, 103, -54, -166, 221, -113, -93, 151, -155, 32, 152, -214, 115, 42, -124, 196, -31, -76, 180, -161, -34, 176, -161, 48, 159, -200, 157, 31, -203, 215, -30, -149, 194, -88, -4, 184, -159, 92, 95, -151, 106, 29, -112, 168, -52, -113, 222, -125, -42, 136, -151, 69, 43, -235, 133, 47, -142, 207, -84, -106, 170, -145, -20, 170, -120, 17, 51, -157, 163, -8, -121, 157, -90, -70, 150, -164, -4, 112, -200, 67, 19, -206, 83, -59, -123, 215, -60, -64, 150, -161, 3, 129, -166, 97, 45, -168, 153, -21, -146, 155, -112, -22, 130, -166, 58, 94, -167, 139, 23, -144, 155, -27, -134, 161, -93, -69, 157, -141, 43, 133, -217, 41, 27, -125, 128, -67, -95, 210, -72, -72, 182, -122, 70, 80, -202, 141, 14, -128, 131, -66, -115, 140, -113, -44, 88, -147, 89, 60, -188, 126, 3, -162, 116, -95, -61]
4263f1K44l20J27J27k38J74%k55K76q7j24K83j97pJ88k69J54Q1j89J70mk15K71
4286A29j10j15K58k35L2J69k37J21R7k39K13k9j64K05j17r2K18k17N7J88k93J45
4308a6Q8j60J45l8j92K82j14r7K12k19R9J46l15J36J57k40K19p0j58K66j95m1
4330a05K83k75N6J31k37J79K3j94J94m9q4K25k14n3K79k75J08J35k68J81j4j69
4352a43J92J4j52K08j75l4K51k19N1J33k63K49m6k25K57l0j85K27j75jK12j96
4374e0R4Qj58J31N7j93K46j73n6K75k61J2J70k29J23J01j96J50n3j19J90j06p5
4397a12K42j49m2J86k79J56J23k23J69m2j25J50o2n5J64j61M9O9j63J24P7k26
4419a30J76k1j42K57j69q6K21j78j1J98k22R5J23k82J69K9j56K53j02j01K41k03
$$ y = [-61, 183, -137, -10, 117, -121, 53, 53, -202, 74, -13, -137, 146, -51, -58, 130, -139, 15, 96, -93, 77, 73, -142, 129, 19, -96, 162, -73, -41, 128, -109, 12, 109, -130, 83, 54, -110, 95, -22, -114, 104, -113, -56, 132, -161, -16, 72, -88, 57, 19, -173, 109, -5, -102, 110, -109, -10, 136, -179, -43, 114, -126, 93, 23, -135, 131, -64, -105, 178, -97, -41, 90, -147, 32, 55, -139, 55, 6, -78, 147, -67, -120, 159, -116, -8, 127, -141, 40, 26, -143, 49, 63, -89, 119, -56, -90, 161, -58, -7, 126, -137, 112, 66, -159, 98, 68, -117, 110, -65, -66, 146, -50, 44, 52, -106, 25, 82, -111, 135, -38, -94, 181, -80, -68, 102, -127, -4, 97, -99, 51, -2, -121, 69, -37, -112, 130, -19, -61, 125, -154, 2, 125, -98, 71, 29, -96, 54, -8, -63, 101, -60, -11, 58, -105, 19, 96, -130, 46, 25, -117, 140, -29, -115, 106, -72, -83, 115, -107, -12, 111, -171, -2, 27, -129, 124, 22, -79, 162, -41]
4441d1L9J35k73J96P9k53K08l2j63K35j26o0K09k31P6R9j89J33qj59K29j31j02
4464a30K39j43n4J91j64L5J14k52K09k5j40K17r2r9J88j49j7K29k22P8M4j78J59
4487C8N9j93J29o7n0K13j69lJ72k12P7J07k19J80L9k25J81l3j18J65j53N6J44
4510A18j83P7M3j61J77j8j79K23o0j32J79j07pJ57j90J08K1j53J59l3j29J99j36
4533b7q3K57j89j1J67j99J41Jj80J98j23m5J75j72L1J97j68k3J28j32Q0N9j75
4556i3J87r0n9J24q8l7J57j48j2J59j35N5K4j36J17po9J33j18qQ1k5lP8k12J32
4582GN1j95J84%j03J41j22j4J28j35O0K8j34J99m0j42J51k7j13J41q4j2J62j69
4606c8MJ38j73P1L8j54K07p8j17J89j47j5J66j60P0J01k06J64k0j34J60r3o2J62
$$ y = [-41, -2, 133, -140, 56, 135, -118, 90, 58, -105, 130, 4, -56, 153, -78, -2, 97, -92, 41, 33, -126, 103, -28, -130, 109, -34, -88, 103, -61, -26, 88, -164, 45, 20, -120, 97, 5, -94, 94, -55, -72, 157, -65, 13, 57, -121, 38, 97, -96, 33, -34, -84, 129, -40, -43, 129, -83, -6, 101, -118, 62, 101, -124, 57, 24, -94, 71, -82, -26, 118, -65, 12, 55, -106, 71, 53, -126, 97, 37, -95, 84, -23, -30, 127, -63, 45, 66, -87, 72, 39, -90, 109, -27, -110, 147, -42, -53, 114, -85, 56, 57, -123, 75, -48, -93, 82, -90, -59, 138, -30, -53, 75, -57, 23, 82, -93, 94, 4, -55, 69, -19, -56, 101, -47, -59, 100, -35, 20, 44, -92, 25, 18, -51, 82, -36, -44, 37, 12, 9, 87, -125, 7, 58, -137, 47, 47, -56, 85, -37, -51, 77, -58, 2, 30, -104, 95, 55, -87, 64, 37, -76, 65, -19, -31, 131, -38, -34, 104, -69, 2, 40, -114, 93, 15, -102, 87, -60, -75, 91, -69, 1, 102, -104, 60, 40, -94, 66, -27, -89, 73]
4630G3j55j4J44r3M3J13k14R4M4j57J87m5o2J71j52j8J62j52MP9r4J11rj74J90
4655G6p8p5J40j60M4J50j44K6R1j47J22n5r0J85j12m1J41j44Q3K2j01P3O4q3N8
4680D5j5j12J87j08k6R7j07OJ29j63L9N4j17J24L0j41J18q4n5K00j59L9J00j72
4704i1J20nj31J59k7p0M8k4o2J30j43Q7J30k44J29K6j22J19qk9R7j30j8J42j45
4729f2P6j7p8J00j4o7J42k6j21Q9m3j9R9j17N8L2r6L9M5j31J63j11PJ45j38P4
4755B9kn7M0K7j29J62k0j42J38o1l8J13m3n3R5j01P1K9j65J58j3q3J15p3r8R9
4781bj7LR7j77J13oj17J10P2j82J74j8j18K30j74j7P5j13P1j4n6J04lj27J56o
4807E8q4N6r9K5L2j1N1L9j16R0o6j5R0m6k2Q1p3K7O3j26J5J03j24M9O2j30J54
$$ y = [73, -82, -96, 48, -45, -2, 111, -103, -9, 35, -122, 65, 20, -42, 129, -23, -41, 121, -31, -27, 52, -42, 69, 60, -114, 76, -2, -77, 63, -97, -53, 97, -47, -21, 70, -77, 45, -10, -100, 85, -27, -68, 73, -71, 12, 34, -67, 6, 70, -13, 45, 30, -82, 105, -3, -29, 68, -39, -33, 96, -67, -28, 26, -91, 33, 63, -78, 40, -44, -99, 101, -58, -19, 81, -91, 29, 24, -107, 52, 25, -45, 3, -21, -83, 47, -96, -9, 121, -123, 6, 32, -90, 29, 21, -8, 89, -41, -59, 83, -62, 14, -3, -81, 19, 5, -62, 80, 54, -67, 22, -21, -40, 59, -58, 0, 32, -64, -25, 20, -111, 52, -59, -52, 93, -45, 29, 27, -30, 10, 37, -92, 70, 50, -92, 46, -15, -53, 60, 17, -36, 59, -42, 29, 58, -107, 51, 38, -45, 70, -3, -101, -2, -19, -16, 81, -96, 17, 11, -106, 4, 76, -106, 68, 50, -68, 162, -12, -29, 46, -67, 4, -10, -66, 38, 35, -92, 64, 58, -26, 30, -69, -44, -12, -23, 28, 67, -49, 41, -25, -40, 50, 4, -18, 63, -10, 17, 80, -46, -31, 72, -52, -3, 59, -71, 83]
4834H3j37O1nk5M7Q9j69O1M3n5PJ2o4N9k0nN9q6L4L3j09R1N0j75K13r2o6J21o3
4863hk8Q1j34O6M5q4J04jj65J69j9n3Q9p7m1J43j58J07Q0j86R7k4l1N8l8o5J35
4890F2n8o7J20o1lJ8j3qk5n8J20n0k1J00j05MO7o7M6R1j36L0O2j05J47r3n4J29
4918G2j28P5l5L0mM2q6O7n7n2J53r9m9P3k7J1L3q3N3K0o3Q8mj05P7j9n6J71n6
4947D2q2M8n9M8N2j11J03k7o5J24o2j3L2o1PR8j13L8M2p2M5M9r1Q6q6K4K7l6R
4976dM2p8M5J1j03J53m2m9J01j48K5O2J1r3J13n5K5j2p1J17l4m3R9r2l6J69j23
5003a0N9mq1L2K5o9O4l6l8J03o5j0J11j39P9K3j05M2L6p9N8L2j01J21p1k4J26
5030G9j42O5Q6j56Q2J3j19R2m7L3O7l9m5O3n6K3M0m3N3r9L6JK4m3O9q3m8Q9k3
$$ y = [83, -54, 7, 2, -23, 24, 113, -56, 5, 48, -7, 0, 12, -52, 7, -13, -18, 41, -45, -11, 22, -87, 4, 54, -121, 92, 0, -66, 55, -8, -36, 45, -89, -23, 22, -62, 42, 41, -124, 45, 26, -27, 62, -15, -56, 87, -71, 36, 116, -70, 27, 3, -28, 30, -8, -73, 62, 4, -63, 57, -4, -7, 11, -2, -10, -35, -93, 27, -23, -44, 56, -49, -45, 22, -45, 1, 92, -44, -14, 48, -57, 90, -3, -57, 72, -56, 19, -16, 14, 10, 52, -34, 33, -24, -76, 77, -22, -71, 2, -25, -14, 19, -64, -11, 9, -54, 34, 30, -75, 2, -17, -73, 98, 42, -40, 8, -51, -3, 49, -62, 41, 14, -51, 73, 11, -2, 30, -31, -24, 74, -39, -1, 41, -31, 14, 63, -28, 58, -28, -4, 23, -13, -4, 38, -40, 5, 16, -87, 66, 24, -25, 76, -72, -47, 15, 26, -67, 46, -9, 16, 4, -67, 50, 16, -27, 72, -20, -56, 113, -10, 49, 45, -36, -4, 21, -48, 16, -20, -58, 45, -20, -30, 81, -58, 21, 44, -61, -19, 17, -62, -4, 28, -73, 48, -23, -47, 79, -63, 2, 88, -68, 14, 27, -92, 0, -47, -14, 53, 14, -31, 32, -24, -1, 39, -4, 49, -50, -14, -13, 11, -32, 37, -46, -94, -5, -28]
5059b8rN8p5N0Nn4P6o3mR0p2k7J03p6k7Q9j05M7O8l3J02p6m1K4r1M1Q3p7k2QM7
5090A1l0K4k6L4j4p2J01l0n7O2j8J1Om2kN9o6O2pMM4k2r7J16l3l7J8p8Q8L2j02
5121f1J38n6q5J43r3k2P7j34J36Qj01P6J3r3O8o3m5J41j28J1R6p5O0k1p6P8j0
5148a8k5N8k7j7P7q8L5M6j01P8j7m7P3ko6Q0n3k7L2J0j4K8J4o7N9r5P0K7q6J39
5178G6j03j2J6KK2L8p4K0Q5j17N5pj09J38l2m0R7q1N4J0m9N3n1l8J05n2l9R6j16
5207e3K9N6m5MNo4O5L3k7Kj1p2R3m4%Q4j09N8Pq9L8M5o3N8m3LP6m6j2J00j10J4
5239a8N0j2j4ppJ7k7n1J18n5k2N0n4K9O2j05P2N5j07R9m8q9R6m7m8J20n4j3P3
$$ y = [-28, -37, 21, -54, -4, 1, -53, 23, -40, -44, 46, -26, -53, 50, -26, -53, 36, -69, -22, 46, 13, 115, 39, -2, 22, -69, -28, 55, -22, -44, -36, 11, -19, 5, -21, 13, -1, -73, 28, -2, -59, 3, -15, -4, 2, -40, -42, 17, -49, 13, 6, 10, 54, 32, -65, 51, 18, -19, -1, -79, 9, 41, -61, 77, 21, -64, 79, -14, -36, 41, -93, 43, 51, -50, 26, 39, -54, 14, -49, -94, 47, -81, -70, 26, -49, 11, -10, -86, -8, -18, -43, 15, -12, -29, 48, -40, -5, 41, -60, 18, 1, -46, 27, 25, -41, 39, -14, -41, -9, 1, -13, 15, 29, -38, 21, -74, -4, 23, -63, 76, -27, -39, -23, -21, 1, 39, -35, -15, 70, -47, 8, 1, -108, 30, -2, -42, 55, -26, 28, 38, -11, 42, -9, -47, 58, 6, -33, 63, -53, -24, 32, -13, -9, -4, -68, -3, 30, 3, 5, -6, -78, 15, -29, -29, 55, -54, 4, 11, -78, -40, 5, -58, 0, -43, -40, 36, -10, -22, 78, -32, -18, 32, 20, 6, -1, -8, 9, -18, -69, 49, -6, -28, 22, -32, -3, 59, -46, 26, 81, -26, 73, 25, -64, 32, -15, -63, 57, 3, -10, 63]
$$ [...]
8191E0
##END NTUPLES=NMR FID
##END=
