##TITLE=1H_PhBBC1204-2
 CDCl3
 8 sc, 
 13.04.2022
##JCAMPDX= 6.0         $$ Bruker NMR JCAMP-DX V2.0
##DATA TYPE= NMR FID
##DATA CLASS= NTUPLES
##ORIGIN= UXNMR, Bruker Analytische Messtechnik GmbH
##OWNER= root
$$ XWIN-NMR		Version 3.5
$$ Wed Apr 13 10:43:04 2022 Russian Standard Time (UT+4h)  she@DPX200
##.OBSERVE FREQUENCY= 200.13135
##.OBSERVE NUCLEUS= ^1H
##.DELAY= (6, 6)
##.ACQUISITION MODE= SIMULTANEOUS
##.ACQUISITION SCHEME= undefined
##.AVERAGES= 8
##.DIGITISER RES= 18
##SPECTROMETER/DATA SYSTEM= spect
##.PULSE SEQUENCE= zg30
##.SOLVENT NAME= CDCl3
##.SHIFT REFERENCE= (INTERNAL, CDCl3, 0, 15.7039)
##AUDIT TRAIL= $$ (NUMBER, WHEN, WHO, WHERE, WHAT)
$$ ##TITLE= Audit trail, XWIN-NMR		Version 3.5
$$ ##JCAMPDX= 5.01
$$ ##ORIGIN= Bruker BioSpin GmbH
$$ ##OWNER= she
$$ F:/spectra/data/she/nmr/H-F/1/audita.txt
$$ ##AUDIT TRAIL=  $$ (NUMBER, WHEN, WHO, WHERE, WHAT)
(   1,<2022-04-13 10:41:41.90 +0400>,<she>,<DPX200>,
      <created by zg, POWCHK disabled, PULCHK disabled
       configuration hash MD5:
       00 E9 B6 7A A2 85 ED C7 34 08 36 98 17 FE 4E 26
       data hash MD5: 16K
       7D C6 14 6F E7 B5 F8 EC BD 4F 37 4E 01 95 34 4E>)
$$ ##END=
$$ 
$$ hash MD5
$$ BD 89 62 85 C2 CD 97 25 47 95 A6 E9 3D 1B 44 7B
##$RELAX= 
##$RELAX= 
##$RELAX= 
##$RELAX= 
##$RELAX= 
##$RELAX= 
$$ Bruker specific parameters
$$ --------------------------
##$DU= <F:/spectra>
##$EXPNO= 1
##$NAME= <H-F>
##$PROCNO= 1
##$TYPE= <nmr>
##$USER= <she>
##$AMP= (0..31)
100 100 100 100 100 100 100 100 100 100 100 100 100 100 100 100 100 100 
100 100 100 100 100 100 100 100 100 100 100 100 100 100 
##$AQSEQ= 0
##$AQ_mod= 1
##$AUNM= <au_zg>
##$AUTOPOS= <>
##$BF1= 200.13
##$BF2= 200.13
##$BF3= 200.13
##$BF4= 200.13
##$BF5= 200.13
##$BF6= 200.13
##$BF7= 200.13
##$BF8= 200.13
##$BYTORDA= 1
##$CFDGTYP= 0
##$CFRGTYP= 5
##$CHEMSTR= <none>
##$CNST= (0..31)
1 1 145 1 1 1 1 1 1 1 1 1 1 1 1 1 1 1 1 1 1 1 1 1 1 1 1 1 1 1 1 1 
##$CPDPRG= <>
##$CPDPRG1= <>
##$CPDPRG2= <>
##$CPDPRG3= <>
##$CPDPRG4= <mlev>
##$CPDPRG5= <mlev>
##$CPDPRG6= <mlev>
##$CPDPRG7= <mlev>
##$CPDPRG8= <mlev>
##$CPDPRGB= <>
##$CPDPRGT= <>
##$D= (0..31)
0 1.2 0 0 0 0 0 0 0 0.06 0 0.03 0 0 0 0 0.0002 0 0 0 0 0 0 0 0 0 0 0 0 
0 0 0 
##$DATE= 1649832101
##$DBL= (0..7)
120 120 120 120 120 120 120 120 
##$DBP= (0..7)
150 150 150 150 150 150 150 150 
##$DBP07= 0
##$DBPNAM0= <>
##$DBPNAM1= <>
##$DBPNAM2= <>
##$DBPNAM3= <>
##$DBPNAM4= <>
##$DBPNAM5= <>
##$DBPNAM6= <>
##$DBPNAM7= <>
##$DBPOAL= (0..7)
0.5 0.5 0.5 0.5 0.5 0.5 0.5 0.5 
##$DBPOFFS= (0..7)
0 0 0 0 0 0 0 0 
##$DE= 6
##$DECBNUC= <off>
##$DECIM= 32
##$DECNUC= <off>
##$DECSTAT= 4
##$DIGMOD= 1
##$DIGTYP= 9
##$DL= (0..7)
0 120 120 120 120 120 120 120 
##$DP= (0..7)
150 150 150 150 150 150 150 150 
##$DP07= 0
##$DPNAME0= <>
##$DPNAME1= <>
##$DPNAME2= <>
##$DPNAME3= <>
##$DPNAME4= <>
##$DPNAME5= <>
##$DPNAME6= <>
##$DPNAME7= <>
##$DPOAL= (0..7)
0.5 0.5 0.5 0.5 0.5 0.5 0.5 0.5 
##$DPOFFS= (0..7)
0 0 0 0 0 0 0 0 
##$DQDMODE= 0
##$DR= 18
##$DS= 0
##$DSLIST= <SSSSSSSSSSSSSSS>
$$ [...]
##$SUBNAM2= <"">
##$SUBNAM3= <"">
##$SUBNAM4= <"">
##$SUBNAM5= <"">
##$SUBNAM6= <"">
##$SUBNAM7= <"">
##$SUBNAM8= <"">
##$SUBNAM9= <"">
##$SW= 18.05172834244
##$SWIBOX= (0..15)
0 0 2 0 0 0 0 0 0 0 0 0 0 0 0 0 
##$SW_h= 3612.71676300578
##$TD= 16384
##$TD0= 1
##$TE= 0
##$TE2= 300
##$TE3= 300
##$TEG= 300
##$TL= (0..7)
0 120 120 120 120 120 120 120 
##$TP= (0..7)
150 150 150 150 150 150 150 150 
##$TP07= 0
##$TPNAME0= <>
##$TPNAME1= <>
##$TPNAME2= <>
##$TPNAME3= <>
##$TPNAME4= <>
##$TPNAME5= <>
##$TPNAME6= <>
##$TPNAME7= <>
##$TPOAL= (0..7)
0.5 0.5 0.5 0.5 0.5 0.5 0.5 0.5 
##$TPOFFS= (0..7)
0 0 0 0 0 0 0 0 
##$TUNHIN= 0
##$TUNHOUT= 0
##$TUNXOUT= 0
##$USERA1= <user>
##$USERA2= <user>
##$USERA3= <user>
##$USERA4= <user>
##$USERA5= <user>
##$V9= 5
##$VALIST= <valist>
##$VCLIST= <CCCCCCCCCCCCCCC>
##$VD= 0
##$VDLIST= <DDDDDDDDDDDDDDD>
##$VPLIST= <PPPPPPPPPPPPPPP>
##$VTLIST= <TTTTTTTTTTTTTTT>
##$WBST= 1024
##$WBSW= 4
##$XGAIN= (0..3)
0 0 0 0 
##$XL= 0
##$YL= 0
##$YMAX_a= 262157
##$YMIN_a= -242108
##$ZGOPTNS= <>
##$ZL1= 120
##$ZL2= 120
##$ZL3= 120
##$ZL4= 120
##$ABSF1= 10
##$ABSF2= 0
##$ABSG= 5
##$ABSL= 3
##$ALPHA= 0
##$AQORDER= 0
##$ASSFAC= 0
##$ASSFACI= 0
##$ASSFACX= 0
##$ASSWID= 0
##$AUNMP= <proc_1d>
##$AZFE= 0.1
##$AZFW= 0.1
##$BCFW= 1
##$BC_mod= 2
##$BYTORDP= 1
##$COROFFS= 0
##$CY= 11.3945322036743
##$DATMOD= 1
##$DC= 2
##$DFILT= <>
##$DTYPP= 0
##$F1P= 2.36226072786647
##$F2P= -0.459571619588291
##$FCOR= 0.5
##$FTSIZE= 0
##$FT_mod= 4
##$GAMMA= 1
##$GB= 0.15
##$INTBC= 1
##$INTSCL= 1
##$ISEN= 128
##$LB= 0.24
##$LEV0= 0
##$LPBIN= 0
##$MAXI= 10000
##$MC2= 0
##$MEAN= 0
##$ME_mod= 0
##$MI= 1.114404
##$NCOEF= 0
##$NC_proc= 0
##$NLEV= 6
##$NOISF1= 3.799351
##$NOISF2= 2.8
##$NSP= 1
##$NTH_PI= 0
##$NZP= 0
##$OFFSET= 15.70392
##$PC= 1
##$PHC0= -18388.81
##$PHC1= 11.80078
##$PH_mod= 1
##$PKNL= yes
##$PPARMOD= 0
##$PSCAL= 0
##$PSIGN= 0
##$REVERSE= no
##$SF= 200.130013532006
##$SI= 16384
##$SIGF1= 3
##$SIGF2= 2
##$SINO= 400
##$SIOLD= 16384
##$SREGLST= <1H.CDCl3>
##$SSB= 0
##$STSI= 0
##$STSR= 0
##$SW_p= 3612.71676300578
##$SYMM= 0
##$S_DEV= 0
##$TDeff= 0
##$TDoff= 0
##$TI= <>
##$TILT= no
##$TM1= 0
##$TM2= 0
##$TOPLEV= 0
##$USERP1= <user>
##$USERP2= <user>
##$USERP3= <user>
##$USERP4= <user>
##$USERP5= <user>
##$WDW= 1
##$XDIM= 8192
##$YMAX_p= 0
##$YMIN_p= 0
$$ End of Bruker specific parameters
$$ ---------------------------------
##NTUPLES= NMR FID
##VAR_NAME=  TIME,          FID/REAL,        FID/IMAG
##SYMBOL=    X,             R,               I
##VAR_TYPE=  INDEPENDENT,   DEPENDENT,       DEPENDENT
##VAR_FORM=  AFFN,          ASDF,            ASDF
##VAR_DIM=   8192,          8192,            8192
##UNITS=     SECONDS,       ARBITRARY UNITS, ARBITRARY UNITS
##FACTOR=    0.0002768,     1,               1
##FIRST=     0,             0,               0
##LAST=      2.2672688,     0,               0
##MIN=       0,             -242108,         0
##MAX=       2.2672688,     262157,          0
$$ Real data points
##PAGE= N=1
##DATA TABLE= (X++(R..R)), XYDATA
0@%%%%%%%%%%%Qj6J6j6K4l2M0m8N6p1Q6j03J20j36J59j85K12k46K84l27L74m24
33b25M81n44O13o90P73q65R65j075J196j330J474j629J805j994K198k425K672
50A400k943L244l574L939m348M808n329N924o608P408q364R517j0945J2773j5203
65h301J8612k3775L2608n1761J69018j23811j29838L57049j75833k50191K57549
76G1326J23144l63442M5558K83562k02503j99753L05670L2498k95214J33617K47965
87A82428k56949j17881K93916l0451k62023J99895J89596k62150l7356K90609
97A89634j10656k25490K26138J14850k78416K4150K39428j79161j80734K44423
107F4166L8495k66646R3656K14005j97892j02997K51642k6461k41679J48551J75962
$$ y = [0, 0, 0, 0, 0, 0, 0, 0, 0, 0, 0, 0, 8, -8, 8, -8, 16, -16, 24, -24, 32, -39, 47, -56, 64, -72, 87, -98, 114, -132, 152, -175, 199, -225, 256, -288, 325, -365, 408, -457, 508, -567, 629, -701, 773, -856, 949, -1045, 1153, -1272, 1400, -1543, 1701, -1873, 2066, -2282, 2526, -2803, 3121, -3487, 3921, -4443, 5074, -5871, 6902, -8301, 10311, -13464, 19144, -32617, 136401, 12590, -117248, 239801, 63968, -186223, 71326, 194470, -168972, -123414, 160148, -42355, -242108, 63562, 96060, -199154, -65537, 182428, -74521, -192402, 101514, 71063, -190960, 8935, 198531, -63619, -100975, 189634, 78978, -146512, 79626, 194476, -83940, -59790, 179638, 477, -180257, 64166, 102661, -163985, -70329, 143676, -54216, -157213, 94429, 67968, -173711, -25160, 150802]
118A50802k20076n1571K43720q2171k05257J94242J24734k34525J0999K37842
128A68739j25456j68156K11294N1726k48881O2846K01842j77842j24027K19384
138G1469q730k24486J19481J64324j95373n2344K33102n5628j93593J58789J13413
149A30424k07556M504K14003j10698j60581J87733O2587k15356N2538J84877j53533
160a1058j08858K06691j361k12828R6649J47566j79565n2489K09660n6276j80940
171a42809J49930J08127j91608M900J96258j00183j39014J73869M9020k01458
181i2968M9489J68687j39774r7501J83814k742j83147R6282J33209j63316m9678
192i7645J87310m4684j57948J26201Q6447j73663L308J75038q4952j24922J47095
$$ y = [150802, -69274, -120845, 122875, 40704, -164553, 29689, 154423, -80102, -69103, 168739, 43283, -124873, 86421, 138147, -110734, -47888, 153954, -23888, -147915, 71469, 62739, -161747, -42266, 122058, -73315, -125659, 107443, 51815, -141778, 17011, 130424, -77132, -72628, 141375, 30677, -129904, 57829, 120416, -94940, -42402, 142475, -11058, -119916, 86775, 85414, -127414, -30765, 116801, -62764, -115253, 94407, 38131, -142809, 7121, 115248, -76360, -71460, 124798, 24615, -114399, 59470, 108490, -92968, -43479, 125208, -14566, -112067, 71747, 69005, -114142, -17860, 115349, -47967, -97645, 89665, 44981, -112967, 13234, 99681, -73982, -70674, 104364, 19412, -105510, 41585]
203D1585M6797j66733M5762J47269j21892q9439J59826M112j61208P4817J13835
214I4731j40827m6122J65374l3790j44316J08801Q8797j50586n331J56792p2253
225B1270j17958J33239M9894j59484K9967J42343j03438q6063J49273P450j54926
236h8433P1825J19645j31199n4746J52244k9404j38583J02532Q5504j50264j3228
247g4107J53581o1638j13014J24221M8798j49791L0713J38810r6304q6984J37718
258E2003J1197j41930O4713J08542j22696m8275J44150k5393j29353R1208P9063
269H3229j33336j0683J37350o2297j05737J14892M7748j35907K3256J22556q6062
280d991p3177J29254J0184j34451N6790J03321j06734m4859J27392k6509j19019
$$ y = [41585, 88382, -78351, -32589, 114680, -7212, -96651, 63175, 67287, -93921, -19104, 94731, -46096, -92218, 73156, 39366, -104950, 3851, 92648, -57938, -63269, 93523, 21270, -96688, 36551, 86445, -73039, -43072, 99271, -4167, -90230, 59043, 66493, -88433, -16608, 103037, -28162, -82908, 69336, 39932, -98651, 3881, 89385, -60879, -74107, 79474, 17836, -95178, 29043, 77841, -71950, -41237, 97573, 1269, -85715, 52003, 63200, -78730, -14017, 94525, -28171, -76446, 67704, 42311, -87042, 4166, 83229, -50107, -60790, 76560, 14263, -91474, 23418, 71166, -64741, -41485, 81071, -4991, -78168, 51086, 61270, -73181, -16391, 86930, -19804, -64663, 62729, 36220, -82799]
291h2799Q5240P7040j23243j5862J25637n1944r5897J04891M4031j26910J9032
302d0784J16325p4973p3444J14041J3601j21053N0130R6902r7975m6715J19434
313E5489j4970j10338P0235P1663j09317j5926J17446m5684r6280R0827M7861
324F1006j12803J2783J05584o9305p1805J08800K1082j15165L8980R2676q6951
335a5118m3337J13721j3488j09628O5914P3734j02169j9449J10663m2911r2274
346g4342Q9974M6294j12245J0043J03990o4409o9386J01824J6639j10612M0630
357b1600R0839q5323m4838J07849r912r8412O3250O6579r7851j6500J06653l6902
369B3832q6645P7383M0514j00404J1852R4097o1236o5945R0507J9460r6068L3463
$$ y = [-82799, 2441, 79481, -43762, -59624, 66013, 14069, -81828, 23063, 67094, -59816, -40784, 75541, 568, -72876, 41165, 54766, -66287, -16157, 80745, -17230, -63945, 55489, 40519, -69819, 416, 72079, -37238, -53164, 64282, 18598, -77682, 13145, 61006, -51797, -39014, 66570, -2735, -74540, 34260, 55342, -59823, -20843, 71833, -15118, -58455, 55266, 41778, -67850, -1936, 71798, -30371, -49820, 60843, 17932, -74342, 15632, 61926, -50319, -40276, 63714, -695, -70081, 31743, 48382, -62230, -21600, 69239, -16084, -60922, 46927, 37015, -61397, 1853, 68432, -29419, -45919, 60734, 23832, -62813, 14570, 55084, -45320, -33468, 60629, -607, -66552, 23955, 43415, -52653, -19190]
381a9190P8055p6207l9206R7891p620r0952N2052O1574q3248j5499R4488l1028
393B1110p8469P1242M2959r0320N251Q5598n0958o1459Q0339J7967r2405K6132
405b3013P7361o5971m3186Q7130k790q3575M8709O1634p9036k2310Q8761k1518
417B2196p4685O1186M0974q6010K372Q6056m2092o2169P1710K2335q2238K3058
429a7307P3110o1474m5179Q0780K649p9522L9775N7169p0581k1108Q3514j8684
441B3142p2097N5760M2123p7659k229P6173m0076n7985O8038K1631q0018J7738
453b5459P0397n1578l8346P5210K41p4453L9932N7094o5104k2914P3049j8619
465A9450o4002N3184L7817p3793l570P2128l2992n1488N9667J7413p2185J6365
$$ y = [-19190, 58865, -17342, -56548, 41343, 33723, -57229, -5177, 56397, -26851, -42350, 52138, 21110, -57359, 13883, 56842, -33478, -28227, 57371, 6413, -55046, 25293, 43260, -49145, -23013, 54348, -11623, -54809, 32321, 29531, -54044, -5335, 56299, -22737, -45047, 43714, 22196, -52489, 8697, 49671, -36339, -33967, 52089, 9997, -52172, 19538, 41873, -40365, -17307, 55803, -5671, -50850, 29930, 32579, -46943, -7168, 50001, -20580, -41688, 41826, 23142, -48955, 6805, 48928, -28731, -30960, 45213, 5137, -52848, 15190, 36821, -43197, -25459, 44938, -6640, -44986, 30224, 30465, -43988, -4056, 53038, -12066, -34980, 38069, 19450, -44552, 8632, 46449, -27344, -30914, 41214, 8222, -43266, 16401, 33814, -38371, -22006]
477b2006O3246m7859l9317O5273L558o5153L3841N0512n6389j8873O8804j2324
489B3313n8847M2508L6166o1413m956O1771l0605m9775N3157K2043o2836R578
501a9896N5449l9081l4079N9472M710o3962K4316M8789m9083k1542N9616j1378
513A3331n5585M1188L9620n6031p488O0912k2841m5153N0375K0775o1826P928
525a4795N4785l6881l7014N3012N556n8547K3525M5196m8712k2608N7382p626
537A3273n2708L3755L3560n1405m765N8142k1018m3423M6064K3760n1584R258
549g091M8118l4860l2677M9830N514n5159J6806L7646m2515j8226N1024q766m7603
562c7959L1642L2732m3581n019M8613j8526l7994M0123J9274m8892N437M4476
$$ y = [-22006, 41240, -6619, -45936, 19337, 22895, -42258, -8417, 42095, -14294, -33167, 35637, 23313, -35534, 6974, 43140, -18273, -23229, 38542, 7937, -41838, 11319, 33362, -29474, -19896, 35553, -3528, -37607, 21865, 26575, -37387, -13071, 35718, -13365, -34907, 24709, 13331, -42254, -1066, 38554, -17477, -24965, 35947, 13106, -32047, 18328, 39103, -22723, -14795, 39990, 3109, -33905, 19107, 24663, -33884, -10359, 34837, -13875, -36483, 20899, 13273, -39435, -5680, 27880, -23525, -28290, 29852, 8834, -34589, 11475, 35235, -16349, -7091, 41027, 6167, -26510, 23320, 28834, -26325, -9519, 28127, -14388, -32614, 18410, 9644, -37959, -6317, 26415, -17166, -22185, 26428, 7902, -30092, 10031, 29305, -19587, -14150, 30326]
574C0326k7753k8893M2472O322m6753J7823L7842l6972j9955M3702m580m1017
586b7436K5619K6795m0988p777M5407j2830l6046L1217J8727m0570M330M0486
598B6934k4588k9310L6872J0449m0130J1651L4096l0281j8316M1866n48l9436
610b0741J9768K6895l4648r908L8351j2927l5652K8235J9593l8499Q14L7536j8762
623E5k4139L4818R580l7728J1502L4039k6400j9096L5024k026l5617K0202K4966
636B5180l4324j0567L6079q847l0459K5133J5518l5880J776L5239j7912k4468
648b3532K9254Q098l1178J1415K8705k3926j5891L2798M55l0035J5361K0090k7969
661f355p728L0456r329k7202J9774J5295k7595p11K7545j4253j9711K5508Q306
$$ y = [30326, 2573, -26320, 16152, 22474, -24279, -6456, 31386, -5586, -25541, 18161, 13581, -27436, -1817, 24978, -16010, -23787, 21620, 8790, -27256, 3961, 22688, -17882, -13552, 26934, 2346, -26964, 9908, 20357, -19773, -8122, 25974, -4307, -22623, 19243, 18695, -20741, -973, 25922, -8726, -18634, 19717, 6790, -28862, -627, 18966, -19533, -18719, 18817, 55, -24084, 10734, 20314, -17414, -5912, 28127, 1727, -17369, 17655, 15629, -19988, 214, 25180, -9144, -19711, 16368, 7521, -22938, 2195, 17713, -18167, -16391, 18848, 936, -23532, 5722, 13820, -17358, -5943, 22762, -1164, -17055, 15743, 16198, -13837, 1524, 21614, -6355, -14083, 16373, 7044, -20158, -384, 14911, -12684, -13395, 14150, -103, -19814, 5694, 14000]
674A4000k8770N695K4523j7034j3510K5854L30k6739J3941K1406k1504r063K4356
687A3485m959k1879J7022J3626k6034m220K5026r003j9456J8596P680k4170M441
700i845K3535j4561j5425K1872M265k2631R576J8374j9245q513K4050k148k1553
713a2249J2825J4479j9475k736K1701r570j8514J7504R081k1513P45J7540j1994
726b176j2031J9337K920k1368O808J7560j3941p186J8732l260j7302J2760J3068
739A3921j7535m185J7867n994j3384J4316N456j8388K258J6165r742j1221J4172
752C706J916j5407O199J2933j2812o648J5678O4j3350P226R017j1840j906J4257
766I033m569j2527Q807P293j1948L04J0741p863q204J1672M016j2790J283R961
$$ y = [14000, -14770, -9075, 15448, -1586, -15096, 10758, 11088, -15651, -1710, 19696, -1808, -10871, 13485, 8526, -13353, 3669, 17295, -8739, -12959, 12067, 3064, -16392, 2204, 9884, -14286, -9845, 13690, -871, -16296, 5576, 9841, -12790, -3214, 15160, -4085, -12598, 11452, 9304, -12249, 576, 15055, -4420, -7156, 14545, 4975, -13539, 3965, 13046, -8467, -7722, 9818, -2176, -14207, 5130, 8050, -13318, -6510, 11050, -2891, -10077, 8655, 5395, -11907, 853, 13921, -3614, -7799, 10068, 4074, -9310, 5006, 10462, -7926, -5668, 10497, 755, -10466, 3706, 5622, -9785, -3586, 9347, -3465, -10113, 5565, 5629, -7721, -495, 8522, -3318, -5224, 9033, 4464, -8063, 744, 8037, -3911, -3607, 7134, -729, -8933, 2739, 6755, -6035, -4752, 5209]
780E209p011n109J1533l00j2217N217R498p408m437R663j248r522P356O967j0217
795b026k102R927l092p563O801L635j0104J110R306o146p540Q641K023q699L243
810b586O841p354l576J0387P93q977L752N940o252m99Q178l520p809N531M214
825E063o075o32N217m516m272O754J686p167R82M561l463k102N310k41n528K975
841a448M835l918j674M591l49k952K610J988l855p63M312o69l865J322J173k266
857i28J96K734k326l220K138K729k439j085J871j717j340L113J929l355q99L335
873G36O30j132K213J027l429N1M038j190l079J298O45k445j95K645k533k531K811
890d40J583l373j37K770j495r31K910J50l689Q74M138j762k365K290L26k369K495
$$ y = [5209, -1802, -6911, 4622, 4322, -7895, -2678, 6820, -588, -5025, 4638, 3390, -6132, 1224, 8191, -2026, -4128, 5799, 2707, -4856, 1945, 5580, -4524, -3414, 5892, -254, -7794, 847, 2870, -5829, -2586, 4255, -3099, -6675, 3712, 4505, -4472, -720, 5220, -1032, -1531, 6647, 3127, -4682, 849, 5063, -1012, -1644, 3573, -943, -5215, 1539, 3225, -3942, -2960, 1601, -1862, -3964, 1346, 1105, -4423, -1448, 3387, -531, -2205, 2386, 2037, -915, 1695, 3683, -172, -935, 3377, 2708, -1157, 165, 1338, -928, -732, 2002, -324, -3544, -1406, 1323, -1116, -2201, -330, -2047, -3387, -274, 1655, -1700, -2599, 736, 1366, 234, 2447, 3474, 45, 96, 4134, 2944, -135, 1163, 1808, -637, -832, 1813, -720, -3251, -440, 1143, -2230, -2367, 403, -1092, -2023, 887, 1037, -2652, -1778, 2360, 598, -1767, 523, 849, -1520, 975]
907I75K558k984k903L205J601k672N79J487l535r38M261P47m205M67K823j961
923d95r99L792j231m535K746L224l791j319L831r92l100L358K396n106k40O162
939C701j845m580L332J983n280J565N098m254m945O030K549n666J689M439n408
954a592j909P786l21p420K363M970n792q81P013l555o707O741L549o934J13O886
970D310m552m952P699J851r292K268P756n739l851P996o62p082M881O374q369
985a364k485Q707k176p219N907K965r593P96R751m979p560P091L084p867L034
1000a908P832p222n224J0022J816q892L517N980p546k572J0337j603j0035N764
1014B66N895r083q18Q980m711q191Q490M129j0656O35J0590o095o437J0095J487
$$ y = [975, 3533, 549, -2354, 851, 2452, -220, 359, 1846, -1689, -2627, 1634, 2381, -1824, -1357, 1466, -495, -1494, 2298, 1067, -3468, -722, 2502, -1289, -2608, 1223, 231, -2869, 489, 2885, -2221, -2461, 3701, 1856, -2724, 608, 2591, -2689, -1124, 3974, -280, -5225, 805, 3354, -2312, -623, 3816, -1592, -3501, 4285, 3964, -3456, -1093, 3877, -1915, -2796, 4217, 662, -6045, 696, 4245, -2689, -2576, 4310, -242, -5194, 2505, 4356, -4936, -2668, 5088, -651, -4502, 3494, 2832, -4250, 631, 7005, -1364, -3849, 4858, 2682, -4537, 1370, 4335, -5258, -4462, 5289, 310, -7250, -159, 2925, -4942, -1908, 5924, -1298, -6522, 3500, 5316, -3576, -59, 5921, -1625, -4197, 6140, 4537, -5498, 266, 6161, -2922, -3740, 5240, 529, -7662, 828, 4957, -5699, -5064, 5526, -569, -7006, 3089, 4576]
1029D576j0799M151J0071q900n981J0992m03j0186P041P187j1859k320J3223k873
1043C920j0161Q579N095j2673J822J2954p878j0099J1227K525j2897M822J0253
1056G489j0766o197J3709K35j3145P410Q980j1734k434J4398m761j1675J0923
1069B432O477j3573R8J3362p576r161J2942K021j5276M699J2491r942o616J3211
1083E589j447j3586R164J0652j3847l663J3954m270j1349J0964O300j5503r0J4870
1097G738o689j0342J2381L346j4587M822J3608j0729p815J4603P55j4828P228
1110e09J0973j3237m599J5532l812j4660J0541Q979j4705j532J4637p005j2204
1123a1601J4412N908j6445J998J4551r697q241J5600R80j7216P092J4130j3177
$$ y = [4576, -6223, -2072, 7999, -901, -6882, 4110, 3707, -6479, 562, 7749, -4110, -6430, 6793, 3920, -6241, 2338, 7433, -5240, -3418, 9536, 1658, -8441, 2786, 5311, -7586, -2764, 7489, -3277, -9474, 4235, 4470, -8675, -1265, 7715, -4019, -6453, 7945, 3184, -8491, 2432, 8909, -4664, -4566, 8796, 1220, -7941, 5001, 7022, -8254, -3555, 8936, -1006, -7622, 5589, 4142, -9444, -280, 10372, -3475, -7138, 6816, 2546, -8803, 2161, 8461, -7042, -7132, 7738, 1049, -9293, 3088, 6434, -8153, -3331, 10277, -452, -8267, 6336, 7091, -7737, -509, 10464, -2773, -7372, 8160, 4348, -10312, 229, 9208, -5497, -7029, 7608, 603, -11601, 2811, 8719, -7726, -5728, 8823, -874, -9115, 6485, 7465, -9751, -2659, 11471, -1706]
1136a706o072J5979l516j5135J1625J0553j7111k814J7403o918j3320J4577N584
1149I129j8327K812J6656j1077j0744J6106K065j6860P275J3924j4255o467J8962
1162I199k355j7129J0928J0793j6211j379J7695q337j5375J4898P872j7766J754
1175e413J5711j1588j0482J7713K508j8808N954J4758j3650o679J8097k655j7588
1188a2122J1484J1891j6207l126J7892o546j4699J4737P605j8204J295J7940j0452
1201A488j2826J6727L333j8520O728J5297j4871q784J9038m35j8280J0640J1610
1214A1145j7616k877J9989n972j6801J3282R400j8367J684J8428j1414j3863J7755
1227D773N134k0059N816J6053j4604r501K0634m66j9672J0475J4438j7944m034
$$ y = [-1706, -7778, 8201, 4685, -10450, 1175, 11728, -5383, -8197, 9206, 2288, -11032, 3545, 9129, -9198, -6386, 10270, -807, -11551, 4555, 6620, -10240, -2965, 10959, -3296, -9763, 9199, 6844, -10285, 643, 11436, -4775, -6154, 11541, 3204, -12171, 2727, 10599, -7167, -5413, 10298, -1290, -11772, 5941, 8449, -10359, -4405, 10353, -3297, -9976, 8121, 5466, -12122, -638, 11253, -4954, -8080, 9812, 3266, -11433, 3304, 10909, -7295, -6000, 11940, 1488, -11338, 5389, 8722, -9798, -3070, 12227, -2644, -11428, 7610, 7175, -11105, -465, 11145, -6471, -9348, 10641, 4669, -12132, 1150, 10550, -7817, -6133, 12295, 881, -12982, 4773, 9907, -10152, -4336, 11717, -2887, -12388, 8246, 7780, -11892, -1417, 13021, -4923, -8957]
1240h957J9893n881j6958J4708R645k0514K59J9532r792j4393J7229M207k0489
1253a1511O127J8132j4675j0758J9098L75j8898J1180J4051j9124n651K1816m570
1266E592j7455J4350R352j9946P13K0616j0297j4972J7236N267k0372N401J7498
1279A2983j4710j0832J9358O65k0288R683J5295j7528o153K0710m706j7998J4437
1292I16J1985j9572j815K0408q849j4651J7910N781k1761M165J9059j3316j1391
1305a1131J8739K37k0979J0038J6420j7974p405K0359l736j8265J4470J1860k0916
1318h283j598K1500q697j5962J7443P182k1445M175J9835j4058j2128K0404K089
1331A0457k1471Q824J6724j8136p077K1764m510k0963J4183J2298j9696k563K0654
$$ y = [-8957, 10936, 5055, -11903, 2805, 12450, -8064, -7805, 11727, 1935, -12458, 4771, 8978, -11511, -5384, 12748, -1927, -12685, 6413, 6788, -12110, -930, 13121, -6003, -11654, 10162, 5592, -11863, 2487, 11839, -8107, -7394, 13222, 2925, -12047, 5189, 10456, -9916, -4515, 12983, -1727, -12559, 6799, 7464, -12824, -3141, 12154, -5374, -11527, 9183, 4477, -13521, 916, 12901, -6671, -8486, 11922, 3073, -11578, 6332, 12113, -9648, -5483, 13576, 260, -11131, 7608, 7845, -13134, -3096, 13324, -4650, -12055, 8304, 4568, -13697, 773, 12633, -8283, -9881, 11619, 2922, -13040, 4403, 11585, -9860, -5685, 14150, 92, -12036, 8368, 10457, -11014, -2190, 14534, -3602, -10679, 11085, 6575, -14388, -205, 12093, -7603, -10166, 10488]
1344A0488r625j6659J8800Q578k2146K834K0148j3212j1045K0584J980k2306Q878
1357b703J7543j6967p914K1061m068k0246J4032J2823k0480l206K1024q331j7012
1370a4444J7092Q131k1590K969K0414j3144j3167K0112L376k0856P951J7173j7486
1383c469q352K2363j840k1511J1818J3951j9754k405K1716q586j8540J6564J0324
1396A2279k0597J053J9924j3111j3976K0812M601k2640O793J7798j5821r187K1911
1409I839j609k1482J2859J4903j9814m558K2152p211j8514J5825R900k1824J092
1422h442K1312j2180j5484J9705M607k1204P237J8423j7156j0247K2235l38k0664
1435a2196J1918J4249k0095m039K3154o651j9365J5465J0154k1095J030K1221
$$ y = [10488, 863, -15796, 3004, 11582, -10564, -7730, 12418, -794, -11839, 8745, 10725, -11581, -2703, 14840, -2127, -10041, 11020, 6952, -13294, 738, 13561, -6919, -10125, 10899, 2568, -14444, 2648, 10779, -10811, -7842, 12572, -572, -13739, 6373, 9749, -11107, -3156, 14017, -3469, -11821, 10542, 8702, -12809, -991, 12960, -6794, -9199, 12517, 3931, -14609, 1955, 12279, -8318, -7265, 12659, -452, -14428, 6384, 10985, -11655, -4862, 12936, -2885, -12072, 9839, 8230, -13252, -393, 14510, -5304, -9862, 12290, 5079, -13435, 2390, 12290, -9534, -8442, 12870, 690, -14794, 4911, 9518, -11686, -4449, 13974, -3182, -13429, 8806, 8468, -12196, -278, 13971, -6124, -10163, 12991, 6340, -13025, 2440, 12594, -8501, -7471, 13750]
1447A3750j2574j5986J9294N316k1674O060J8449j5718j0572K1891l28k0472J1106
1460a458J5532j8820n685K2152n846j8576J5454J0695k1383o50K1455j0178j5612
1473a2920J8161M727k1745N633J9449j5242j1896J9901Q14k0449J1341J5821j8937
1486e342o620K2545m101j8541J4568J0846k0796q31K1586j0118j6563J7986O659
1499A1278k1850M851J9438j4686j1945K0354J225k1540R432J6546j7899p022K1392
1512I574m550j9652J4891J2548k0307k052K1079q555j5574J8097P049k2194L734
1525e912K0100j3465j2144J9379J317k1526R301J7197j7562q427K1020l683j9317
1538a3722J3987J2027k0175k536K1463q334j6497J7298P703k0597L508J9574j3209
$$ y = [13750, 1176, -14810, 4484, 9800, -11874, -5814, 12635, -3083, -13655, 8236, 7908, -12564, -1458, 14074, -4746, -10431, 11721, 5875, -12701, 2753, 13448, -7935, -8585, 12870, 2692, -12920, 5241, 9968, -11777, -6144, 13305, -1937, -13833, 6068, 6882, -13567, -2226, 13595, -5342, -11962, 10583, 6482, -12059, 2509, 13355, -7441, -8272, 13314, 3196, -13367, 4619, 11278, -10572, -5721, 13717, -969, -12914, 7440, 8665, -12875, -3443, 13103, -4796, -11818, 9574, 5024, -14628, 263, 12811, -7496, -9548, 11531, 2976, -12598, 5499, 12548, -9646, -5912, 14188, 723, -11421, 7958, 9275, -12251, -2950, 14247, -3315, -11742, 9278, 5595, -13722, 265, 12292, -7883, -10419, 11044, 2710, -13787, 3511, 11214, -9383, -5875, 13699, 490]
1551D90j2553J9667K563k1374P841J6748j7035p804K1148l275j9927J3028J3113
1564A2630j8489k796K0342q221j6573J6388R103k1061J395J8907j1952j2692J8809
1577E790L340k0975P154J7066j5226q413K0380k186j9469J2309J3396j8994l748
1590i576K0704o838j6991J5621Q741k0438J679K0052j2154j3794J8223M209k0126
1603a0688O711J6586j6065r036K0862o11j9736J0747J3512j8048l863K1222o938
1616D655j7940J5277R534j9362O28J9391j1402j3815J8809M859k0521N566J7160
1629A2839j4416r717J9525q90j9289R925J4131j7839n106K0072n206j6798J4221
1642A452R836j9312L92J9890r608j4659J6833N083j9815N661J7403j4446j0492
$$ y = [490, -12063, 7604, 10167, -11207, -3366, 13382, -3653, -11457, 9691, 6416, -13511, -483, 12630, -5859, -8655, 11687, 3466, -13107, 3281, 12384, -8677, -7282, 11625, -327, -13019, 5790, 9130, -11845, -4691, 12375, -2851, -11264, 9116, 6930, -12539, -230, 13166, -5828, -9576, 11128, 4290, -12701, 2920, 11661, -8777, -7098, 12954, 800, -12994, 5229, 9438, -10688, -3977, 12609, -3456, -12492, 8370, 7759, -11977, -1230, 12282, -5766, -9629, 11593, 4655, -13285, 1992, 11526, -7836, -7208, 12183, 781, -13034, 5775, 10634, -9887, -4321, 12839, -1577, -11294, 8231, 7341, -11948, -2023, 12108, -5731, -10837, 9235, 4029, -12769, 1452, 11288, -8024, -7632, 12258, 2650, -12009, 4824, 9907, -9908, -4247, 13156, -1290, -11782]
1655a1782J8789J377j8685R272J3776j7512n196K0243m745j7451J2453J0030j8433
1668g864k77J8767q856j4809J6609O203j9125M007J7545j2942j0535J8208J564
1681H495j9232Q698J4636j6159o416J8981l435j6760J2521J0638j8459j928J8923
1694A0503p824j4512J5181N699j9137L916J7900j2249j0893J7372J697j8110Q552
1707a905J4617j6037p027J8724k944j6431J1172J0607j7446j826J8646p177j4540
1720a1567J5245O657j8298K754J6921j1730j0685J7033J798j8461P035J4268j4178
1733c208o838J7807k546j6938J1717J1293j6562l092J7750o899j3510J4272P003
1746A0249j8379J824J6976j0052j0839J6443J947j7805O402J4730j3554p892J7051
$$ y = [-11782, 7007, 8384, -10301, -1029, 12747, -4765, -9961, 10282, 5537, -11914, 539, 10569, -7864, -8141, 10626, 1770, -13039, 3570, 9773, -9352, -5345, 12200, -742, -11277, 6931, 8495, -10737, -2039, 12597, -3562, -9978, 9003, 5568, -11192, 1329, 11967, -6492, -8420, 10503, 2679, -11833, 3348, 9047, -10090, -6174, 11726, -523, -11416, 5956, 7653, -10457, -1905, 12712, -3325, -10352, 8372, 5428, -11003, 169, 10776, -6670, -8496, 10150, 2973, -11567, 3678, 10335, -7963, -5209, 11712, -18, -10703, 6330, 8128, -10333, -3298, 10970, -3208, -10046, 7761, 5215, -11723, -6, 11287, -5275, -8367, 9383, 2484, -11026, 3246, 10249, -8130, -6306, 10670, 618, -10221, 6222, 8169, -9636, -3234, 11496, -2058, -9950, 7101]
1759G101j518j6647J0351J1381j6135k817J7794n890j4375J3265P702j7020J061
1772e747J6437j0387j1431J5759L457j7267N229J4259j2662p215J7225p27j6990
1785a0060R225J1695j4934l218J6259n797j4673J2872Q300j6516J62J6187q994
1798E08j1057J5332L390j6665M352J4157j1923p694J5860j37j5883Q832J1469
1811A0541j4386l829J6678m380j4169J1436P906j6055K74J5558q556j2177J3905
1824B746M814j5668M211J3584j1505p890J6322L08j5489P164J1207j3553m242
1837g991J6132m349j4006J0623Q774j4663m41J5159p479j1760J3607M791j5914
1850g517L140J3748j0484q456J5013Q23j4907O886J1945j2999m940J5446k771
$$ y = [7101, 5583, -11064, -713, 10668, -5467, -8284, 9510, 3620, -10755, 2510, 10212, -6808, -5747, 10690, 303, -11128, 4631, 8088, -9179, -3950, 10309, -2353, -9568, 7657, 6930, -10060, -835, 10860, -4074, -7292, 8967, 3170, -11503, 1369, 9669, -6847, -6685, 9502, 508, -10549, 4783, 8173, -8492, -4140, 10017, -1906, -9600, 6260, 6123, -9760, -928, 10541, -3845, -7674, 9004, 4624, -9545, 1891, 9797, -6258, -5984, 9574, 1018, -11159, 2746, 7560, -8108, -3897, 9687, -1818, -9708, 6614, 6922, -8567, -1403, 9804, -3749, -7991, 8141, 3792, -10214, 409, 9183, -5480, -5921, 9238, 1759, -10001, 3606, 8397, -7517, -4377, 9371, -1113, -9569, 5444, 6267, -8640, -1754, 10191, -2808, -7748, 7698, 4927]
1863D927j3784R633Q047j4376j672J5420o090j2105J2088N280j4371K770J3833
1876I600r649r245J4089K088j4956O470J0885j2384n329J5274j931j3721Q977
1889A68Q932j3392j527J4605o142j1929J1854N513j4603J877J2844q668r005J3580
1903D107J938j4441N697J1767j1248n711J3969j767j2935Q837Q704j3399k240
1916f722J4062m235j1107J0603N832j3824J193J3365q030r457J1840K273j3631
1929g838M467J1695j0834o083J3420l44j2859P452R305j1923k769J3584l962j1247
1943g936R695O473j2839l8J2581o553r481J1804L247j3394L403J0960r303o363
1957g744J2517m85j3019O855R598j1062l829J2984k928j0811R273O715j2386o38
$$ y = [4927, -8857, 776, 8823, -5553, -7225, 8195, 2105, -10000, 2088, 7368, -7003, -4233, 9600, -49, -9294, 4795, 6883, -8073, -1603, 9282, -3102, -8431, 6843, 4912, -8809, 168, 9100, -4292, -5819, 8786, 2644, -9285, 2569, 8082, -6521, -4644, 8200, -468, -9473, 4107, 6045, -8396, -2699, 9068, -2180, -7891, 6078, 4311, -8624, 213, 8917, -4482, -6722, 7340, 3105, -8002, 2601, 8433, -5391, -4198, 9167, 1137, -8320, 3520, 5793, -7838, -3371, 8324, -2510, -8593, 4827, 4483, -8376, -924, 8381, -3542, -6311, 7273, 3311, -7936, 1759, 8232, -4607, -4645, 7936, 1383, -8098, 3706, 6953, -6441, -3038, 7922, -1381, -7744, 4773, 4288, -8731, -1876, 7722, -3340, -7169, 5815, 2887, -7924, 1349, 8064, -4322, -4960]
1971d960J2511n816r029J0411L457j2671K953J1334q556o984J2098O99j2372N640
1985a285R100j0418l994J2363l004j0690P922O785j1510q86J1996m975r422J0417
1999B399M325j1905J920J0612p516o546J1365J043j2253M860R410r624l979J1300
2013E411k113j0670P416P237j0861j499J1181m519q945R284M446j1475J462J0436
2027F791o647o908J0223J805j1445M081Q939r024m331J1042j035j0371O134P027
2041F281r901j424J1406l691r524Q537N285j0766R70R689o571p149R845K386j1293
2056e920L086Q873p920m475J0687q22j0124N756P508r197k523J0546l043r167
2070f735P860M984j0287L33R834n418o947Q680K976j0239K665Q824o924n359R568
$$ y = [-4960, 7551, 1735, -7294, 3117, 6574, -6097, -3144, 8190, -366, -7350, 4748, 5447, -6925, -1285, 7815, -2603, -6597, 5766, 2762, -7928, -6, 6779, -4731, -5617, 6379, 1404, -8018, 2399, 6724, -5181, -3261, 7351, -165, -6711, 4654, 5697, -6556, -1696, 7714, -1910, -5889, 5411, 3298, -7372, 44, 7281, -3580, -5079, 6102, 1583, -7362, 1922, 6368, -5107, -3645, 6791, 144, -6764, 3459, 5264, -6181, -2100, 6839, -2185, -6516, 4526, 3491, -6880, -746, 6281, -3620, -5044, 6362, 2671, -6853, 1684, 6969, -3797, -2827, 6862, 291, -6858, 2987, 5373, -5920, -2834, 6039, -1881, -6356, 4331, 3509, -6615, -859, 6649, -2548, -5071, 5475, 2432, -6735, 1125, 6109, -4178, -3845, 5989, 571, -6376, 2304, 5280, -4959, -2294, 6530, -394, -5753, 3815]
2085C815Lr688N325O631q380l139J0356k057r369O346N627r348j50R686m803p232
2101f377Q099L480r532K048Q659o319n358R572N04r432L828P138p967l306R344
2116D381j852q666N612N996r095j038R458l714o951P568L232q912J203Q623n548
2131B97n906Q246J310q754L381P517p073m110Q956o11q067N044N348q067j914
2146d403R520l365p768O694L668q408Q39Q660n447n734Q028J626q323K775P059
2161E421o768l702Q414m33q148M399O104p324k098Q564k508p141O666L927q521
2176c148k5Q352m484n758P050J879q404K706P027n460m596P868P0p673L856N454
2192D714o916k668Q255j810o919N620M176p549j7Q070l291n886O208K605p467
$$ y = [3815, 3818, -5870, -545, 6086, -2294, -5433, 4923, 2866, -6503, -157, 5470, -3878, -4028, 5658, 855, -6377, 1722, 5202, -4330, -2282, 6377, 58, -5300, 4272, 4776, -4656, -828, 6310, -1657, -4963, 4381, 2529, -6137, -525, 5471, -3624, -4662, 4796, 1082, -5869, 1699, 4931, -3981, -2778, 5845, 297, -5609, 2637, 3947, -4807, -1426, 6091, -982, -5092, 3864, 3253, -4814, 230, 5578, -2489, -4403, 5117, 1752, -6016, 678, 4346, -4062, -3223, 5437, -10, -5744, 2284, 3910, -4413, -1638, 5421, -1347, -5049, 3365, 2932, -5216, -817, 5287, -2037, -4135, 4429, 1921, -5220, 1446, 5373, -3148, -3173, 5179, 695, -5063, 1987, 3866, -4538, -1832, 5195, -265, -4861, 3007, 3077, -4596, -740, 4714, -2202, -4870, 3385, 1575, -5344, 276, 4452, -3097, -3114, 4956, 1665, -4221, 1987, 4592, -2875]
2207b875J069O633n123m531O957J108p654K798O249o221k548P644j161o911M424
2222a42M905o932j352P211k883n477N974K720p174N96P244m313m434O540R62p443
2238c998K807N864n299l625O722q9o394L582N085o612j352P181k306o028N215
2253G53L034o926r0O915l436n101O316J991o804J969N831m408l245O422L5p194
2269c938L289M772n669j890O603j994n912M903L961o457m43O369k864m918N988
2284A800J565o967J211O333m031l728O175O61o433K945M909n203k408O189j012
2299B006n585L474L877n900q97O115j773n731N234K927o112Q49N478l807l914
2314c759N565J108o304J631N040m310k338N869m27n902L373M473n186j268N478
$$ y = [-2875, -1806, 4827, -296, -4827, 2130, 3238, -4416, -1618, 4631, -1590, -4138, 3506, 2345, -4566, -142, 4763, -2169, -3521, 3690, 807, -4670, 1304, 4024, -3150, -2554, 4690, 377, -4057, 2483, 3445, -3998, -1191, 4673, -626, -4251, 2471, 2382, -4012, -430, 4655, -1957, -3309, 3872, 1566, -4462, 753, 3787, -3139, -3229, 3686, 250, -4851, 1465, 3456, -3348, -1379, 4452, 44, -3201, 3221, 3256, -3938, -649, 4123, -1546, -3436, 3167, 1173, -4739, 164, 4125, -2332, -2775, 3594, 730, -4188, 1800, 3365, -3602, -2391, 3942, -89, -3817, 2358, 3019, -3414, -469, 4440, -763, -3171, 3018, 2006, -3579, -105, 3772, -2128, -3025, 3090, 1317, -4414, 820, 3747, -2365, -1516, 3962, 155, -3759, 1806, 2914, -3390, -1759, 3281, -1029, -3367, 2502, 2075, -3827, -454, 4019, -1167, -2435, 3043]
2329C043j817n107M483L092o242mN839l011l703N017J783n908J228N416m145l331
2345c367N837j72n894K678M038m817j592N812r77n427M096K866m874l11N406k656
2361F46m370M570K034n107N07N208l591l513N736O72n390J708M374m339k062N332
2377B415o48n373L024L767m897q92N251j612m482M241K105n059K63N001k866m056
2393c818N017J196n149J406M790l686k717N287K80n030K375L389m521j204N084
2408B699r90n033L275K679m753o5N181k351m215M257K334n272Q73M620l619l151
2424c531N081O28m824J860M238m367k051N450l56m976L080L178m703j280N307
2439B734j829m227L864K116m841K50N218l230l010L774J066m799K093L881m049
$$ y = [3043, 1226, -3881, 602, 3694, -2548, -2552, 3287, 276, -3427, 1590, 3373, -2535, -1307, 4109, -36, -3367, 2470, 2298, -3596, -918, 3120, -1697, -3289, 2523, 1546, -3881, 215, 3081, -1793, -2104, 3302, 646, -3724, 846, 2880, -2227, -1720, 3488, -103, -3616, 2120, 2792, -2598, -890, 3484, -855, -2917, 2415, 1767, -3606, -582, 3185, -1712, -2604, 2647, 1035, -3447, 794, 2899, -2160, -1897, 3104, 238, -3818, 1199, 2395, -2754, -1348, 3442, -244, -2961, 2326, 2606, -2424, -49, 3340, -1181, -2385, 2699, 1709, -3324, -49, 2630, -2123, -2188, 2993, 642, -3573, 684, 3018, -2254, -1381, 3239, -380, -3531, 1550, 2178, -2646, -786, 3452, -915, -2966, 2484, 2128, -2848, 232, 3410, -1293, -2573, 2734, 905, -3322, 542, 2658, -2183, -1933, 3285, 55, -2955, 819, 1885, -2914, -821, 3060, -989]
2454i89k504N087J59m272K063L241m048j009N127j107m406L496K244m784J03M797
2470C198k414l734L931J224m852J066M265l191k837M532O30m820K140L706l967
2485a123j717M712l53m180K974K789m892j68M622j623l633L725J413m783Q72M429
2501C064k625l321M110P19m422J889L592l760k259M814n08m145K300K982m145
2516a715j147M982j319l842L531K428m452j33M557k065l336L990J100m721J180
2531i62M010l302k330L979M6m432K192L712l960j580M448p38l748L095K330m115
2547a355m53M330j312l657L411J428m363J74M584k775k972M139N55m090J594L946
2563C184l036k477M513m93m334K462L179m241j030M248j248l672L097K414m345
$$ y = [-989, -3493, 1594, 1753, -2519, -456, 2785, -1263, -2272, 2855, 1748, -2658, 838, 3082, -1702, -1599, 3198, 784, -2950, 981, 2205, -2647, -1581, 2684, -507, -3344, 1188, 1818, -3002, -862, 2844, -1123, -2840, 1872, 1519, -2661, 313, 3102, -1790, -1958, 2664, 1041, -2592, 1133, 2546, -2237, -1365, 3064, 439, -2882, 1228, 1947, -2475, -586, 3006, -754, -3013, 1801, 1293, -2852, -552, 2430, -1715, -2862, 2120, 801, -3041, 490, 2918, -1534, -1667, 2890, 825, -2511, 1479, 2579, -2142, -962, 3048, -254, -2584, 1395, 1441, -2991, -799, 2913, -1047, -2627, 1821, 1083, -2665, 430, 2760, -1355, -1808, 2522, 1210, -2447, 964, 2392, -1971, -1797, 2787, 12, -2960, 1179, 1734, -2356, -762, 3184, 148, -2329, 2184, 1691, -2643, -181, 2998, -1243, -2273, 1975, 727, -2945, 152, 2566, -1779]
2578a779l09M490j958l224L939J334m727R79M082k562k684M087L7m404K419L580
2594C300l732j832M203n63m396L098K859m627l30M304j522l608L782J667m510
2609a907N11M093k696k504L754L94m371J354L968l210j807M576m67m116K597L127
2625C296l979r24M239j614l798L486J900m375j53M187k382k939M213J152m548
2640b239P24M297l450k148M219J32m631K365L187l332j445M747q84m230L446K459
2656C217m402m00M276j826l556L547J565m505N65L978l009k171M472N50n075J799
2672i75L609l685j527M567r82m027K471L339l944n78M510k090l348L470K366m729
2688a553J37M137k905k699M198O16m418J262M116l412j955M440N1m422K014L063
$$ y = [-1779, -2088, 2402, 444, -2780, 1159, 2493, -2234, -1255, 2827, 265, -2419, 1668, 1705, -2699, -280, 3300, -432, -2264, 1939, 1376, -3020, 78, 2937, -1690, -2020, 2284, 762, -2846, 936, 2603, -1907, -1396, 2697, 1, -2503, 1251, 1645, -2726, -1372, 2596, -614, -2421, 2155, 1688, -2428, 169, 3296, -683, -1607, 2632, 1018, -2780, 706, 2606, -1769, -1922, 2265, -117, -3056, 1157, 2309, -2239, -1515, 2782, -668, -2816, 1403, 1535, -3096, -731, 2456, -876, -2321, 2426, 1542, -2688, 758, 3217, -1185, -1585, 2691, 865, -2691, 856, 2421, -2084, -1519, 2459, -550, -2721, 1751, 2301, -2774, -975, 2634, -1051, -2578, 1989, 1007, -3020, -549, 2790, -1154, -1732, 2778, 688, -2660, 810, 3176, -1553, -1416, 2721, -184, -2883, 1315, 1931, -2487, -1225, 2891, -521, -2476, 1964, 2015, -2407, -393, 2670]
2704B670m012q29M345j386m169L126K777m525K26M186j907l423M022J289m444
2719b054R76L691l033k531M723j49m181J840L447l700j297M809j392m070K972
2734E1K545l941o32M642k182l497L829J740m691Q19M388l102k558M111N65m579
2750b492J549L929m224j547M955l64m424K625K799m074n54M716j602m056L344
2765E80K048m577K76M441l066k920M242J057m660J390M025l477k188M614km624
2781b841K888L109m217j257M942j042m391L466K157m329n4M495k441l252L659
2796H92J158m351J153M105l382k702M542M94m632K341L207m158j447N059r94m181
2812b896L072K548m493k95N024j968l690L859J344m468R06M315k861l065M329
$$ y = [2670, -1342, -2171, 2174, 788, -3381, -255, 2522, -2003, -1777, 2409, 502, -2921, 1101, 2390, -2054, -1078, 2613, -420, -2951, 1772, 1623, -2558, -718, 2729, -971, -2268, 2541, 1149, -2921, 51, 2596, -1345, -1977, 2665, 483, -3014, 815, 2555, -2136, -1317, 3071, -31, -2589, 1522, 2087, -2492, -943, 2986, -1238, -2785, 2170, 1806, -2618, 7, 2806, -1268, -1822, 2894, 1292, -2764, 580, 2628, -1949, -1673, 2768, -298, -3218, 1024, 2081, -2579, -1189, 2836, -641, -2829, 1785, 1783, -2841, 47, 3156, -1061, -2318, 2624, 1582, -2809, 657, 2814, -1515, -1569, 2926, 485, -2767, 892, 2050, -2301, -1148, 2957, -425, -3127, 1415, 1909, -2723, -382, 2825, -1333, -2780, 2279, 1285, -2896, 176, 2724, -1769, -2064, 2960, 992, -2698, 1161, 2505, -1963, -1057, 3258, 397, -2668, 1661]
2827A661N90m900J632L883l915j754M590q17l950K841L239m498j059M918j624
2842H37l788L933J437m522M99M604k676l019M231P88m947J902M003l667k135M599
2858B079o86m373K678L255m461j303N274j342m070L426K361m691J29M576k590
2873B62l182M035J094m659J209M195l221k458N046m37m655K588L496m274j388
2888b349M657j312m246L760K378m896l90N031k273l335M094J266n098J235M393
2903B915l154k516M361L51m848K354L867m001j864N036j044m573L168L109m739
2918a578l59M607k194l719M316J619n012P26M471l106k740M578N63m991J862L818
2934B861l463k025M767o61m894L180L265m476q13M809j745l868L949K096n095
$$ y = [1661, 2251, -2649, -1017, 2866, -1049, -2803, 1787, 970, -2980, -139, 3100, -1398, -2457, 2461, 837, -2951, 982, 2419, -2103, -1604, 3000, 324, -2695, 1536, 2324, -2623, -721, 3282, -385, -2520, 2079, 1393, -2980, -302, 2953, -1508, -2811, 2463, 1121, -2949, 477, 2838, -1853, -1724, 2852, 262, -2920, 1115, 2209, -2450, -1241, 2954, -267, -2725, 2321, 1884, -2771, -183, 3313, -961, -2349, 2308, 996, -3250, 510, 2888, -2008, -2398, 2633, 360, -2975, 1119, 2385, -2713, -1478, 2915, -239, -2755, 1606, 1957, -2891, -537, 3330, -671, -2535, 2501, 1457, -3116, 52, 3161, -1578, -1937, 2670, 476, -3243, 1073, 2692, -2320, -1594, 2877, -229, -2969, 1609, 2172, -2819, -957, 2861, -602, -2627, 2140, 1479, -3415, -235, 3030, -1446, -2259, 2550, 805, -3063, 886, 2982, -2113]
2949b113M46M876k948l258M372J065m879J323M096l508k270M601j37m669K692
2964c11L298m355j189M923j192m363L654K239m576J88M833l000l347M482J199
2979B483m882R94M432l570k286M915L28n170K172L464m072j032M707j147m495
2994c159L431K531m784J44M851k653l681M124J624n279J523M391l374k784M966
3009A871L20n004K329L544m155j508N218j035m442L307K435m551k21M943j752
3024A299m353L799J812m606Q26M311l254l184M733M93m770J933M071m036j864
3039b790M832k05m501K803K790m214m72M597j599m026L633J884m984M66M689k771
3055A32l411M541P29m666J493M301l951k310M860l48m331K948K994m273j165N005
$$ y = [-2113, -1667, 3209, 261, -2997, 1375, 2440, -2439, -1116, 2980, -528, -2798, 1803, 1666, -3003, -311, 2987, -1368, -2557, 2366, 1174, -3189, 465, 2704, -1872, -1684, 3149, 149, -3198, 1284, 2483, -2399, -1405, 3027, -543, -2829, 2086, 2414, -2756, -584, 2880, -1192, -2224, 2483, 1336, -3159, 272, 2803, -1981, -1837, 3014, 361, -3320, 804, 2428, -2851, -1328, 3063, -311, -3095, 1871, 2191, -2813, -484, 3060, -1095, -2603, 2615, 1580, -2862, 445, 2880, -1671, -1892, 3051, 1299, -3054, 745, 2557, -2049, -1223, 3088, -166, -3350, 1383, 1876, -2894, -961, 3110, -926, -2790, 2042, 1837, -2664, 139, 2929, -1285, -1757, 2840, 1241, -2785, 848, 2732, -2252, -1786, 2903, 132, -3279, 1262, 1991, -2675, -1182, 3119, -832, -3142, 1718, 1370, -2961, -13, 2981, -1292, -2457, 2548]
3071B548j291m171L518K335n058L30N162k703l729M362J026m673J148M484l884
3086e96k176M464m1m529K409L421m268j367M865j174m171L272K766m628m63N184
3102B968k353l151L991J497n318J394M125l125k815M462J25m754K357L653m346
3117a290j538M801n34m204K851K869m870m45M928j724l725M065J331m772Q58M347
3133B948k802k988M637L67m916K194L754l980j824M646o84m273L165L094m533
3148a195j102N032k076l404L622K012n040M49M708k955l030M101R12n137K088
3163a015M103l652k196M703n57m436K762L196m313r03M886j560l782L452K390
3178C078m992K21M669k553l461M432J149n161J534L905l341k500N061l84m570
$$ y = [2548, 1257, -2914, 604, 2939, -2119, -1789, 3373, 670, -3059, 1303, 2329, -2344, -1196, 3288, -596, -2772, 1692, 1651, -2878, -469, 2952, -1316, -2683, 2182, 1008, -3163, 109, 2875, -1753, -2216, 2968, 615, -2536, 1455, 2952, -2366, -972, 3153, 28, -2787, 1675, 1800, -2954, -597, 3056, -1290, -2828, 1973, 1439, -2765, 86, 2955, -1915, -2360, 2568, 844, -2881, 1184, 2515, -2257, -1399, 2948, 146, -2842, 1795, 2162, -2754, -560, 3194, -786, -2610, 2036, 1352, -2921, 244, 3338, -1195, -2297, 2735, 659, -2745, 877, 2889, -2151, -1702, 3006, 51, -2979, 1122, 2034, -3103, -1015, 3088, -564, -2760, 1943, 1386, -3050, -288, 2908, -1405, -2308, 2578, 1018, -2764, 688, 3078, -1914, -1693, 2976, 423, -3038, 1394, 2543, -2618, -1084, 2821, -520, -3020, 2041, 1657, -2913]
3193b913K414L290m139q38M680j531m134L456K538m565j2M591k277l670M463J207
3209B560m510Q66M121l260k382M325L96n065K196L574m022r89M487j158m196L031
3225b6K756m584j11M658k134l386L546J733m613Q63M462l146k823M502N18m427
3241b212J783L722m313j456M678n43m554K822K524m267l54M509j827l620L745
3256F37J437m029O34M094k947k707M404P40m577J474L890l518k111M629l83m236
3272b569K625K770m167q22M737j505m196L719J893m350K39M342k463l149M078
3287A182Q15m466J483L578l241k186M533j06m179K498L057m072j163M835j508
3302A060l736L504J675m354J26M389k179l317L660J469m512R23M281l192k305
$$ y = [-2913, -499, 2791, -1348, -2186, 2494, 963, -3171, 285, 2823, -1742, -1754, 2837, 560, -3110, 1353, 2560, -1950, -1084, 3037, -223, -2605, 1720, 2116, -2949, -753, 2821, -1201, -2190, 2297, 1139, -3057, -26, 2730, -1854, -1965, 2693, 559, -2827, 719, 2452, -2161, -1298, 3164, 18, -2805, 1697, 2215, -2212, -429, 3293, -1020, -2476, 2202, 1659, -2895, -73, 2451, -1816, -2170, 2339, 512, -3108, 637, 2074, -1955, -1321, 2773, -174, -2881, 1523, 2263, -2314, -840, 3050, -468, -2579, 2050, 1667, -2569, 56, 2826, -1341, -2163, 2574, 1069, -3127, 592, 2485, -1865, -1626, 2716, 253, -2896, 1182, 1997, -2469, -986, 2592, -649, -2835, 1698, 1592, -2587, -89, 2968, -1104, -2267, 2568, 1060, -2676, 828, 2503, -1851, -1725, 2664, 485, -2832, 828, 2297, -2215, -1292, 2989, -203, -2508]
3317b508M203lm314K375K883l806j251M458o39m202L274K181m356m16M562j893
3333E48l480L756J406m564R82M265k673k753M312K69m487K214L151l513j899M652
3349B186j012l840K833K204l920m59M582j929l485L385J817m464N46L996k425
3364A5k783M019P70m354J684L544l124j875M274n42m453K939K684m285m74M149
3380B188j304l523L247J722m188N29L965k513k790L868P74m348J363L592l156
3395e74j946M064Rm196K434L002l779p16M005j400l529L007K140m397K3M323k234
3412B36l062L974R08m416J230L322k639k044M033r8m148K146L199l374j244M037
3428B060j116l519L145K240m374K50L580j743k983L564J345m655J119L622k884
$$ y = [-2508, 1695, 1692, -2622, -247, 2636, -1170, -2421, 2037, 1398, -2804, 470, 2651, -1705, -2121, 2441, 548, -2932, 824, 2230, -2334, -1352, 2913, 240, -2513, 1799, 2068, -2419, -205, 2946, -567, -2466, 2186, 1174, -2666, 167, 2371, -1549, -2008, 2574, 645, -2840, 545, 2362, -2102, -1556, 2440, 15, -2768, 1251, 2021, -2333, -649, 2895, -229, -2104, 2170, 1628, -2825, 114, 2798, -1487, -1961, 2188, 884, -2639, 608, 2330, -1858, -1329, 2636, 123, -2667, 1201, 1975, -2373, -1010, 2582, -574, -2520, 1544, 1553, -2643, -209, 2793, -986, -1702, 2303, 903, -2626, 381, 2521, -1876, -1853, 2470, 236, -2826, 1148, 2056, -2360, -1130, 2192, -447, -2491, 1542, 1444, -2704, -558, 2641, -733, -1977, 2060, 944, -2575, 570, 2810, -1564, -1314, 2266, 523, -2460, 1104, 2449, -2206, -1087, 2535, -349]
3443c49k132M107K39m235J531L118l337j137M032q17l689K441K698l861m67M024
3459B166j818k990L470J541m284Q43L421k227k504L830O39m179J318L369l250
3474f55j457L974n61l615K133K614l605p62L766j648k713K930J697l838M05L796
3490B461k568k203L699M32l712J355L211l140j666M110n74l528K178K057l055
3505i43n57L507j220l220K858J737l492K7L530k368k272L344R17l612Q96L311
3521B443k687j745L482J59l773J809K736l205j178L954r09l557K630J949l708
3536a600K8L631j687k859L094J349l788P21L484k653j848L463L64l540J432K764
3552B355l422n91L493q05l455K404K173l267k69L473j547k790K892J278l416N08
$$ y = [-349, -2481, 1626, 1865, -2370, -839, 2279, -1058, -2195, 1837, 1020, -2669, -228, 2470, -1391, -1858, 2166, 348, -2642, 828, 2369, -1915, -1072, 2349, 122, -2382, 1448, 2087, -2092, -774, 2595, -655, -2112, 1862, 1301, -2314, -181, 2433, -1172, -1934, 1832, 184, -2529, 401, 2098, -1740, -1335, 2461, -107, -2310, 1389, 1821, -1891, -536, 2675, -465, -2131, 1979, 1405, -2123, 55, 2112, -943, -1500, 2007, 787, -2433, 425, 2162, -1330, -1303, 2227, -141, -2413, 931, 1848, -1764, -868, 2443, -244, -1989, 1493, 1652, -2121, -312, 2424, -781, -1959, 1995, 1086, -2471, 159, 2108, -1600, -1572, 2059, 372, -2487, 607, 1956, -1832, -1111, 2373, -280, -2128, 1335, 1699, -1841, -409, 2355, -1067, -1658, 1835, 1030, -2425, -21, 2152, -1115, -1384, 2089, 542, -2248, 644, 1922, -1494, -986]
3568i86L418k844j877L428K68l479J722K685l088r79L358l10l407K166K287l680
3584a318l90L465j197k798K722J398l387L33L466k314k199L058P67l521J171L155
3600B411k833j623L491k80l192J950K533l493p10L617q44l392K486J763l462K1
3616a557L478k150k189L115Q52l634J132L011k277j849L584jl501J892K337k758
3632e15j062L443j176k832K589J646l279m36L510j547k567K795J125l543O88K884
3648A723k041j627L011K17l122J418K687k811j102L092l57k971K096J969l433
3663a251j28L353j295k702K834J182l671O01L085k175j806K890M22l391J099K956
3679B003k427j404L153m35k710J736K118k868p31L325j122k443K413J341l184
$$ y = [-986, 2432, -412, -2289, 1139, 1407, -2072, -350, 2335, -753, -1732, 1626, 1316, -2091, 75, 2362, -1318, -1708, 1757, 560, -2238, 484, 1882, -1505, -1172, 2294, -20, -2219, 839, 1606, -1915, -744, 2411, -422, -2045, 1446, 1166, -2026, -76, 2457, -1036, -1746, 1871, 1027, -2365, 121, 1884, -1578, -1557, 1921, -229, -2418, 697, 1549, -2085, -953, 2058, -219, -2068, 1516, 1515, -1986, -94, 2243, -515, -1577, 1866, 690, -2142, 447, 2093, -1186, -1622, 1888, 341, -2226, 569, 1694, -1849, -1161, 1723, -318, -1945, 1066, 1283, -1839, -421, 2266, -545, -1647, 1445, 1088, -1883, 213, 2182, -1251, -1379, 1974, 679, -2023, 811, 1993, -1678, -1077, 2008, -167, -1973, 917, 1339, -2052, -953, 2003, -424, -1828, 1325, 890, -1820, -84, 2034, -834, -1565, 1760, 638, -1805, 608, 1949, -1235]
3694a235q8L162j663k262K977O73l064Q52K615k227j646K813n0l002J868K263
3710A986k926o72L078p29k544K083J651l107Q4K927j533k204K719R73l428P53
3726h89K640j935j620K720L43l007J391K107k535q74L050r28k652K666J056k617
3742a084N3K996j714k152K391J123l087P59K588k174j677K942M20l186J476J988
3758A662k159r82L007n70l000J913J837k307q81L251j320k390K277J190k723J21
3774a074K744j677k059L114L27l056J123K148k011j216K739n6k793J382K275k727
3790h17l18K508m91k386J828J702l075M5K789j625k296K592J036l079R66K583
3806A962k325j571K781L71k828J522J524k388n62K896p15k329K011J423k743L05
$$ y = [-1235, -1323, 1839, 176, -2086, 891, 1564, -1500, -648, 1967, -260, -1906, 907, 857, -2145, -277, 1986, -940, -1612, 1466, 737, -1807, 276, 1927, -1180, -1096, 1831, 298, -1906, 813, 1786, -1642, -889, 1751, -184, -1804, 916, 1259, -1748, -357, 1750, -785, -1659, 1391, 463, -2189, 477, 1533, -1084, -1031, 1965, 251, -1901, 490, 1613, -1474, -715, 1873, -301, -1978, 964, 1384, -1802, -326, 1662, -497, -1479, 1528, 958, -2042, -129, 1708, -599, -1480, 1771, 451, -1939, 338, 1528, -1195, -1074, 1670, -7, -2066, 1048, 1375, -1681, -558, 1590, -421, -1637, 1102, 1046, -1747, -365, 1910, -817, -1135, 1373, 882, -1504, 324, 2026, -1049, -1004, 1785, 160, -2136, 456, 1492, -1587, -621, 1962, -363, -1934, 847, 1218, -1610, -88, 1436, -952, -1514, 1382, 667, -1662, 349, 1772, -971, -666]
3822f66K593j506k099K321R27k531M28K537k324j610K680K39k271O98K311k217
3838d90j014K987m49k572J458J900l025r3K951j091k418K089J253k646L68K733
3854A941j769j731K162O60k795J095K398k380j251K645j70k085J036K291k860
3869h13o45K906r00k164J847J252k906O06K315j333j681K113Q41k725O04K488
3885A805k182j065K473L3k605J357J687k289p19K738o82k146J806J380k711k69
3901a389K838j417j688K208O97k670N61K705j933j365K353q5k309J101J937j685
3917a41j347K733l33k489J524J574k365l68K737r83j961J757J192k729K75K315
3933A391j264j527K162J0k340R66K094j811r94K355j12k329J214K030k358m42
$$ y = [-666, 1927, 421, -1678, 643, 1570, -961, -533, 2004, -320, -1930, 750, 989, -1282, -584, 1727, -490, -1504, 1483, 1034, -1538, -80, 1820, -1205, -1298, 1653, 562, -1856, 233, 1486, -1160, -792, 1941, 172, -1559, 603, 1263, -1532, -437, 1961, -419, -1670, 975, 805, -1280, -244, 2047, -813, -1458, 1448, 548, -1616, 231, 1483, -1423, -817, 1498, 165, -1516, 597, 1438, -1287, -683, 1805, -377, -1442, 1031, 1064, -1541, -184, 1503, -786, -1505, 1233, 551, -1595, 211, 1591, -1120, -1389, 1449, 32, -1656, 552, 1249, -1421, -860, 1845, -88, -1453, 900, 815, -1494, -393, 1544, -141, -1488, 1245, 912, -1577, -53, 1521, -844, -1212, 1525, 542, -1419, 338, 1530, -1199, -924, 1391, 127, -1400, 762, 772, -1568, -602, 1492, -319, -1313, 1042, 930, -1399, -185, 1845, -513, -955]
3949i55K109o10k290K235R97k500k1K518j388j929K453N81k356L11K071j610q71
3966a255K281m3k431J103J764k145l73K092o44j815J618J318k217j69K187j213
3982E8j671K343M40k384M64K093j257j600K372P6k371J149J934k151p10K399p30
3999D54k033J483J369k294J6K203j191j734K393O31k326M35J829j499j145K115
4015G06N38k527R20J768k060n90K461l43k283J382J671k259k12K044q35j721J451
4032A11J374k545Q4K426j607j320K039O69k187O31J548j559q36K217k60k080J318
4049B3J115j798k04K250r97j997J857J174k205j24K338j310j665J957M21j914
4065a079L08J944j268j495K246J94k110Q21J718j777o73K292m30j806J263J179
$$ y = [-955, 1154, 544, -1746, 489, 1486, -1014, -1035, 1483, 95, -1834, 619, 1200, -1156, -845, 1226, -384, -1255, 1026, 983, -1448, -345, 1419, -726, -1099, 993, 349, -1466, 152, 1470, -747, -916, 1271, 58, -1613, 730, 1170, -1214, -750, 1343, 86, -1514, 858, 934, -1437, -288, 1646, -505, -1215, 1184, 454, -1579, -96, 1273, -1021, -1005, 1198, 7, -1727, 666, 1297, -1029, -594, 1235, -264, -1409, 706, 1244, -1283, -363, 1405, -655, -1245, 1216, 873, -1410, -28, 1643, -616, -828, 1216, 381, -1340, 111, 1485, -1060, -976, 1450, -157, -1477, 562, 1231, -956, -325, 1223, -336, -1172, 1045, 785, -1295, 23, 1138, -660, -864, 1386, 389, -1608, 249, 1423, -782, -906, 1432, 122, -1543, 414, 835, -1079, -771, 1173, -95, -1590, 656, 850, -1260, -439, 1279, -498, -1171, 1121, 691, -1115, 148, 1327]
4081A327j993n1K286j013j832J795P42j915J72J709j327j555K099L51k195R58
4097d42J576j814o51K029M4k108J420R92j678n24K400p47j956J965Q51k127M0
4114g30K052j227j309J765N04k151R01J706j699q61J726J94j933P77J589j801
4130d97o26K238p01j633J456R14k031k8J905p16j513J514Q48k273N29J986j226
4147A46j269J733J18j546Q25J297j800p14K046l82j800J379J117j785n17K347
4163A195q68j477J501Q57k079K82K030j341j520J944L89k138J083J247j636n60
4179a091J989pk145J225J351k177J9J973n91j637J157P35j689J95K013j217j362
4196a259J729R61k324L43J945j591j185K247k48j903J223J373j896n04K262o52
$$ y = [1327, -666, -717, 1569, 556, -1276, 519, 1261, -654, -482, 1227, -100, -1655, 444, 795, -1400, -442, 1134, -680, -1331, 698, 742, -1366, 54, 1046, -632, -1156, 1244, 497, -1459, 506, 1357, -770, -730, 1322, 95, -1214, 551, 1055, -1096, -195, 1511, -188, -1049, 677, 871, -1062, -285, 1304, -497, -1123, 1115, 414, -1219, 237, 1151, -880, -908, 997, 281, -1232, 282, 1130, -1143, -614, 1372, 146, -1123, 610, 728, -818, 7, 1304, -496, -1210, 836, 454, -1346, 33, 1150, -635, -1152, 1195, 327, -1150, 351, 1208, -871, -589, 1441, 100, -1420, 524, 913, -1225, -142, 1105, -531, -1091, 898, 891, -1254, -29, 1322, -855, -836, 1137, 546, -1091, 66, 801, -888, -693, 1320, 103, -1259, 470, 1431, -893, -550, 1395, -196, -1381, 866, 618, -1285, -62, 1311, -585, -1089, 1173, 521]
4212E21j619J431J018j952j94J719p67j347J761L90j819J36J825j166j257J984
4228F64M5j766P00J560j696m36J558j05j642J330R95j859k1J917q45j611J866
4245F54O83k087K4J852r34j385J868J88j963M71J673j276q39J886k68j787J213
4262b7J120j801k21J868n17j696J822N66k196L56J745j070r31J432O12k001K72
4279f67J760j335o33J745m21j635P42J536j448m92J553j51j949J441R20j856N
4296h85K036j081j301J619N41j782K42J746j243r24K082k68k006R28J388j367
4312b75o79J845j20j897R08J488j981q5J777p68j808K108L00j400j51J806j035
4329C3j206J789J31j913O72J695j568m28J767l79j512P82J285j583l14J805l31
$$ y = [521, -1098, 333, 1351, -601, -795, 924, 157, -1190, 571, 961, -858, -722, 1103, -63, -1320, 664, 709, -1057, -357, 1203, -493, -929, 629, 524, -1118, 212, 1207, -652, -673, 1244, 399, -1212, 654, 1337, -750, -726, 1126, 192, -1193, 675, 863, -1100, -629, 1044, -232, -1071, 815, 547, -1240, -27, 1093, -708, -929, 939, 422, -1274, 548, 1114, -1082, -726, 1019, -51, -982, 450, 1062, -939, -667, 1093, -242, -875, 870, 449, -1186, -444, 1092, -356, -848, 705, 554, -1395, 46, 966, -890, -885, 1151, 70, -1231, 388, 929, -853, -611, 1135, -108, -1032, 1050, 782, -1224, -296, 1092, -275, -954, 891, 771, -1126, -218, 1270, -711, -796, 981, 213, -1595, 513, 813, -587, -738, 1068, 33, -1173, 616, 747, -1166, -494, 1201, -367, -795, 972, 593, -919, -137, 1148, -435, -749, 1056, 725]
4346G25k031J495P75j676J53J718j089j457J784M31j637L29J535j239r31J760
4362F45J89j684P59J183j504k38J514l42j709J161R64j794J14J471p73q06J375
4379E25K79j699N71J475j163j071J706J34j775R96Q82j420m91K096n35j739J171
4396e8J321j805m5J689r15j047J071Q08j939N28J367r72j106J737O2j541M97J658
4414A310j721o49J823k95j596J158J053j692k94J897p41j355J384O67j814K76
4430e89J952j206j267J495J58j545L70J749j300o04J485k6j449P78J130j418o98
4447i85J814j33j776J031R32j526K7J763j106j221J634N79k089N92J628j197j037
4464a070J945j17j796Q22J307j471n35J665l01j366R32J032j504k40J694p47j555
$$ y = [725, -1306, 189, 964, -712, -559, 1159, 70, -1387, 397, 828, -809, -480, 1055, -184, -1115, 645, 834, -850, -91, 1092, -412, -650, 864, 522, -1187, -26, 938, -856, -742, 729, -44, -850, 525, 804, -895, -324, 1151, -12, -1083, 623, 757, -1018, -22, 860, -560, -1051, 1045, 510, -1229, -58, 1263, -542, -587, 1102, 187, -860, 211, 1019, -920, -392, 975, 3, -1103, 634, 696, -845, -348, 1310, -411, -1060, 763, 468, -1128, 30, 1083, -609, -903, 994, 253, -1102, 282, 949, -865, -589, 1363, 157, -1110, 385, 543, -1002, -632, 1117, -183, -787, 698, 672, -777, 1, 1131, -287, -985, 829, 696, -1080, -49, 883, -643, -616, 1147, 41, -1180, 454, 1033, -1056, -464, 1164, -33, -1070, 875, 758, -1038, -216, 1091, -380, -915, 750, 449, -917, 15, 1047, -457, -697, 997, 250, -1305]
4481a305J634O01j896M27J523j138r30J343J67j537J039J124j279o44J548l49
4497C28j621J295J028j507k63J813q17j330J471P82k001L88J641j307j253J666
4513C13K25j407N77J183j235n37J631k76j556P68J652j672n76J890m77j634J458
4530C27J009j977M9J829j339j102J671N74j823L84J381j178n38J152L29j667R76
4547E7R30j390o19J603j84j378R44P73j337k01J830j132r68J280R88j964J94J847
4565A273j425r60J888K60j883M14J438j169q97J786j56j580Q72J053j385l23J985
4582A191q00j552J494L44j450K22J485r19j199J790J64j585N67J208j051n68J465
4599H06j2j664Q95J212j588l02J602o57j319J085R74j620L63J059r78j122J757
$$ y = [-1305, 329, 930, -966, -539, 984, -154, -1084, 259, 426, -1111, -72, 1052, -227, -871, 677, 328, -1293, 2, 1030, -477, -740, 1073, 256, -1074, 397, 1179, -822, -434, 1207, -100, -1353, 313, 538, -869, -292, 891, -344, -881, 750, 474, -1082, -314, 1338, -334, -910, 980, 503, -1131, 327, 1336, -641, -592, 1237, -102, -1204, 467, 1041, -782, -398, 983, -195, -733, 419, 748, -919, 57, 987, -403, -1022, 581, 397, -981, -37, 736, -601, -802, 1028, -104, -1072, 208, 1196, -768, -574, 1273, -152, -1112, 776, 1036, -847, -433, 1005, -164, -1061, 725, 569, -1011, -139, 914, -471, -794, 1191, 391, -1161, 333, 677, -773, -551, 934, 15, -1184, 606, 770, -815, -248, 960, -91, -659, 806, 794, -870, 25, 1237, -351, -653, 949, 292, -1027, 58, 1032, -588, -225, 834, -144, -1266, 491]
4616D91M81j936N98J454j278q33J797j65j601J076Q52j355k60J818n80j150Q34
4633B43O77j615k36J979r95j084J482L13j500M89J183j038r37J673j09j394K41
4650f28J461j253o57J698m80j147R53J231j632k46J588n95j363J344P08j888L31
4667e75J757j356p08J399k6j542M94J512j181o55J731l81j600Q98J146j410j74
4684f71J448l49j278J115M24j508L45J728j199j165J644J02j334M26J348j181
4700a05n83J165J49j592R24J238j738k54J496m18j039R51O18j462Q3J353p17j032
4718i63J355J46j470O01J341j142p16J412l11j139R24R28j275m31J515n31j190
4735i46J069P32j255j03J293m78j272J277L84j555N78J394j094j085J477M2j485
$$ y = [491, 972, -964, -366, 1088, -190, -1023, 774, 609, -992, 84, 936, -419, -679, 1139, 559, -591, 243, 920, -695, -931, 1048, 53, -1031, 451, 764, -736, -247, 936, -102, -1039, 634, 525, -869, -628, 833, -420, -1077, 621, 141, -1006, -53, 1178, -454, -700, 888, 293, -1070, 274, 982, -906, -575, 1182, -174, -882, 517, 491, -1051, -557, 955, -226, -881, 850, 469, -1131, -233, 913, -497, -671, 777, 428, -850, 265, 689, -819, -474, 1254, 55, -1110, 534, 636, -698, -272, 1076, -105, -688, 477, 626, -966, -42, 1196, -542, -796, 700, 282, -757, 194, 812, -650, -567, 786, 69, -963, 392, 538, -932, -331, 1010, -132, -848, 564, 253, -886, 38, 966, -309, -740, 775, 244, -946, 123, 855, -400, -503, 790, 312, -960, 317, 701, -854, -276, 1118, 24, -1061, 416, 458, -1027]
4752a027O97J367j140m84J140j30j385J162N25j305R9J391n36j300J245M97j760
4769i44L89J340q63r15J477o3j250P46Q96r67r42J595n6j469J079R49j509k56
4787g63J646p42j039J008P54j561J78J554j125o56J225J98j389N28J096r50p86
4804h24J624j23j569P33J031j408l3J371m41j231Q11R90j672J22J236k78j292
4821i53J337M01j411L39J158j171l71J142J60j620Q39J171j391l03J438n61j214
4838a010J072O20j142j16J395p01j344J379P67j498J57J546r74q34J272q5j282
4855g78O21J005j265m15J603m48j135Q28J059j737oJ667p05j316J005P86j712
4872i43M68J398r74o22Q26M56j425Q08Q08j122k94J171j21j544Q64J068j187k24
$$ y = [-1027, -330, 1037, -103, -587, 553, 423, -962, 200, 725, -580, -481, 910, 374, -926, 319, 816, -944, -555, 785, -78, -993, 484, 421, -829, -83, 813, -154, -1096, 499, 443, -1026, 53, 1002, -507, -763, 883, 141, -898, 110, 864, -697, -519, 1035, -90, -746, 479, 677, -712, -184, 912, -38, -824, 800, 677, -892, -159, 872, -536, -569, 802, 361, -870, -59, 931, -741, -619, 617, 339, -953, 384, 785, -626, -287, 871, -300, -671, 471, 631, -989, -150, 1021, -370, -673, 765, 204, -1010, 62, 682, -460, -576, 819, 118, -1226, 153, 920, -578, -421, 1125, 151, -683, 589, 504, -778, -157, 848, -417, -832, 771, 323, -812, 16, 1075, -662, -668, 999, 294, -1022, -17, 769, -943, -475, 923, -51, -673, 153, 609, -816, -8, 800, -322, -616, 555, 434, -1110, -246, 822, -365, -589]
4890e89J362n62r55R81P69j708N91Q02p58r58J560J3j468O94J007j182m97J485
4908E87j15j342O95R56j366r3J535m48j250J112P21j354j30J501q01r37J277K40
4926G88j442M63J117j159n74J363j73j222N10J181j334k56J654n03j122Q78O72
4943H41j422R3J081o24o91J106J34j131J7J259p49p18J279J77j440O84R51j140
4961b93o00J737m31j294P54J040j380k42J540o84q67P73L51r86K30R00m16j037
4979i05J397M7j140K58J211j049n48J481k44j322P80N49r21l42J454n28q56J049
4997C71K15j017M4J291p32r30R65M82j323K00J188j026p49J550j47j200Q00P47
5015G29j489K34J236l95j050P87O68j314L61R94o15j126J395J20j157J49J198
$$ y = [-589, 773, 211, -744, 237, 1006, -702, -111, 691, -67, -1025, 535, 548, -920, -226, 781, -401, -898, 587, 472, -870, -175, 781, -585, -678, 857, 409, -841, 271, 992, -362, -492, 1009, 208, -729, 548, 788, -654, -191, 926, -233, -807, 556, 383, -839, -329, 852, -482, -738, 916, 413, -709, 169, 841, -581, -488, 593, -31, -722, 384, 518, -613, -596, 663, -86, -804, 475, 652, -788, -104, 847, -293, -893, 844, 413, -881, -127, 913, -467, -709, 831, 147, -720, 53, 404, -582, -352, 548, 132, -905, 492, 539, -601, -343, 868, -181, -729, 752, 508, -814, -34, 515, -406, -748, 706, 178, -678, 371, 586, -431, -387, 904, 172, -758, 207, 689, -634, -434, 754, -272, -1021, 529, 382, -818, -18, 729, -760, -526, 710, 315, -735, 52, 720, -594, -233, 761, 146, -980, 415, 535, -622, -473, 725]
5032G25j001n22J202o0j053P26Q18j142j77R58j35r78O73N72r50k58J189m10j036
5051h59J150N34j411K85J012p71l42R94J41j266N04R84j248m10J190j12j228O92
5069a61P88j456K71J151l36j089J112L97j285rJ787j154n68Q68p0q03K27J263
5087I33j065l73R73Q6j346P93P97j092j83J210o71q55J216L99j533K13J099p81
5105a80q18J455L28j372K96J140j095n58J283j31j032O85J033j159l74J110n10
5122A01j086J239M45j084o5J055o38o30J022Q7j295N56J286j061n80J182n7j132
5140f55O69O62q69j34Q70n9j245R28N07q85j22R45l84q18Q93K55j223O64P16p36
5160b1p56J230O0j263O33P72r33m56J217j70q25O80P04j262l03J238j93j109R14
$$ y = [725, -276, -798, 404, 344, -709, 17, 835, -307, -484, 474, 339, -639, 34, 606, -344, -602, 587, 177, -859, 291, 825, -586, -301, 711, -60, -402, 592, 733, -533, -29, 955, -293, -703, 487, 375, -853, -161, 627, -829, -558, 593, 257, -832, 280, 677, -608, -617, 1170, 16, -552, 316, 246, -557, -330, 933, -132, -505, 468, 554, -792, 1, 798, -294, -477, 733, 62, -793, 423, 822, -711, -498, 601, -180, -998, 457, 785, -587, -291, 849, -246, -804, 479, 348, -684, 1, 1034, -125, -499, 611, 101, -985, 254, 699, -385, -450, 605, -33, -663, 359, 446, -849, -293, 993, -68, -648, 534, 477, -655, 14, 676, -193, -327, 543, 484, -761, 167, 674, -211, -333, 612, 228, -590, 303, 558, -665, -1, 715, -21, -777, 453, 513, -750, -117, 655, -278, -734, 483, 313, -512, 168, 872, -390, -693, 545, 352, -757, 157]
5179A57M98j081K56Q99p75n59J055L16j301N70O58q71o13J201J53j279O17N61
5197D62o83m18J196k81r42O99N44j289L87J203p74n05P11K90j067L39R68r36m81
5216e77J118j14j098O90O55r26k37J054l68n96N91M89j050o6J045n38q90J145
5234C27J09r83L35Q37n23n43O91K16r43M34Q40j303l58J332L4j067P25O45j060
5253b55N1R20n55j069J080M99j284L09R06o39p28J112k0j025L44R57q71o2R52
5272F22m77p82P12P45j235PJ091m57r50R16M71j240M96Q11p36o51J214L8j306
5291g11N09P35p58j47Q11k15q94P76N72p94k76P54j93p50Q42M55j280l7J023k95
5311A27j026J120L38j226M90R85r66m55J056Kj150O07Q69p14q76J091r8j134J175
$$ y = [157, 655, -426, -170, 729, -46, -605, 450, 766, -535, 35, 693, -178, -791, 410, 563, -716, -99, 462, -221, -639, 557, 276, -666, 33, 577, -712, -325, 878, 104, -401, 310, 600, -467, -128, 840, -96, -577, 541, 427, -671, 19, 674, -252, -489, 565, 197, -399, 192, 681, -369, -435, 610, 72, -818, 327, 436, -547, -212, 625, 102, -441, 250, 466, -477, -43, 797, -506, -864, 468, 502, -565, 160, 805, -255, -204, 716, 161, -908, 172, 671, -613, -304, 602, -37, -765, 347, 327, -698, -354, 603, -268, -330, 622, 145, -637, 75, 820, -415, -408, 683, 226, -724, 192, 663, -577, -81, 730, -6, -657, 557, 595, -711, -202, 533, -225, -372, 439, 224, -670, 106, 678, -116, -392, 362, 169, -581, 261, 716, -564, -601, 422, 127, -899, 221, 559, -667, -177, 808, -158, -613, 443, 445, -705, -98, 771, 57, -819, 272, 174, -960, 215]
5330B15O02j198n3J118o98p11R05K51r66L18J126o39p87J019k04q14M51O33o10
5349d2m29R35j99j031Q27O47j220O6J062l03j007R21L27j026J08J141o96n11O84
5368B54J31r12L52Q83p23m77R81j15q20N83L62o57j71Q81m02o15N32L15q05j06
5388e29J138o84o13J212Q1j202L11J077j045m15J092Q3j063M97P98j005Q7P74
5406E94l78p34O28Q50j174k02R49q39m08Q05L64q11J71P38o31n87J158J77j236
5425e66J15R73q91j30R24rj147P76P47j167J87O34j79q36P50L77j031J07R48o37
5445e5n99R28J06j043O40N89q98l48R88o4q31L31Q26r79n3Q73k56n82O74L94j037
5466c96K64O76o17l95P96J20j122O58Q28j027m17J106p9p51M47O85r31k65O71
$$ y = [215, 817, -381, -434, 684, -14, -725, 180, 431, -535, -217, 909, 270, -517, 502, 298, -516, -65, 568, -42, -471, 464, 265, -766, 61, 708, -512, -446, 616, 313, -694, 227, 554, -472, -364, 777, 81, -430, 254, 385, -527, -175, 708, -15, -492, 489, 374, -446, 137, 499, -158, -329, 552, 150, -465, 67, 382, -423, -529, 609, -75, -688, 524, 605, -597, -286, 791, -254, -669, 423, 506, -557, -60, 738, -267, -180, 594, 216, -518, 110, 960, -214, -416, 533, -306, -714, 91, 455, -356, -185, 553, -78, -665, 493, 670, -566, -451, 522, -369, -499, 425, 416, -731, 45, 792, -375, -188, 446, 267, -569, 181, 558, -473, -366, 582, -55, -654, 274, 380, -663, -23, 566, -332, -680, 308, 244, -587, -256, 570, -409, -462, 411, 155, -427, 247, 641, -396, -132, 544, -73, -468, 328, 448, -674, -16, 812, -215, -632, 474, 395, -356, 91, 776, -155, -420, 251]
5485B51o5o07O45M5o07M6P98m38o20P10K74q67M68L26n16k65Q17j03r04P76L34
5506D98o48k00P87j41p82N97M92r56m2J036l41q23O23K74p58J40Q41o14m85J009
5526E07j72r11N62L79m72j27P56k00p79N39M69q79j15R70m28o69Q88o3n18J40
5546a23P85o28p67Q95J87q60N10K88m88k43Q88mq75K92P15p51j28Q57n07n09O29
5567A63K35o17JQ37l90l80P50k36p88L7R13o43k88P46J5p29K72O87j008k49J128
5588D56m93m37O91J91n44l18Q70j89o74P19J07q57J56J012p28o44J051q2n46J26
5608a33O58o43k08O92j89n62M24M93n76k66O06l59l74P60P5q03R2Q81l50o51P86
5629C53j74n66J33P96o02m21R96k66p63N90O19j107J98N89k89o29O99J20n68n3
$$ y = [251, 186, -421, 224, 269, -338, -292, 506, 68, -552, 158, 432, -435, 33, 359, -157, -422, 395, 292, -612, 164, 498, -150, -350, 437, 296, -486, 111, 603, -353, -395, 641, 300, -523, 100, 374, -384, -244, 597, -17, -502, 507, 335, -576, -14, 365, -107, -234, 522, 322, -457, 82, 551, -328, -443, 527, 99, -570, 318, 255, -263, -123, 662, 34, -733, 162, 349, -511, -1, 287, -201, -444, 444, 440, -435, -143, 572, -179, -307, 550, 43, -466, 163, 398, -219, -218, 619, 229, -151, 599, 363, -425, -388, 525, -118, -406, 340, 355, -374, -102, 585, -423, -672, 456, -37, -474, 217, 408, -136, -454, 416, 227, -447, 272, 379, -478, -322, 690, -38, -682, 369, 287, -259, -133, 525, -118, -326, 366, 177, -385, 39, 532, -44, -310, 296, -63, -437, 323, 398, -405, -313, 568, 218, -433, 353, 179, -387, -254, 542, -60, -481, 515, 249, -514, 76, 695, -412, -214, 375, 86, -543, 156, 276, -292, -345]
5649c45P88n00l32R57j23j063N21O62p85j66P89j48p73M78L77l40m75R52n29n55
5669f10O91L11o49q3R71n27m98P00J90j024K99O80n03k02O40o3p45L36O28q51
5689c09l61R99j98n28P86k2n86n7O37k80n77O67K88q51J27P36n83l93Q80O9p18
5710b74L40M62n62m25P18r6p24O64L12p04l6P06l03n86P32k4o13J67P87p11j83
5731c53L93M65r11M51L44l71l93M36M22q80L46N01l37n32Q89m81m74P49n3l52
5751a41j00O75n02l44M68J98p25L41O76q28r4Q17q6q44N84L62p24k28J052m13
5771A44n93M84K82m88k46R70o90j83L43L5l35Q8P32m55n86N52M9m78K83N90o58
5792a60k49R27j63p85K07O23n51l69R93m94m59N74J91p59M97M94n59l71M49P0
$$ y = [-345, 443, -57, -389, 568, 445, -618, -97, 565, -220, -386, 403, 255, -518, -40, 337, -3, -478, 474, -55, -610, 81, 392, -257, -340, 631, 104, -394, 306, 496, -528, -229, 451, -52, -254, 386, 323, -422, -86, 542, -309, -670, 329, 131, -397, 389, 367, -219, -276, 361, 81, -496, 171, 459, -392, -265, 471, -112, -505, 375, 444, -274, 66, 528, -34, -459, 259, 163, -561, 103, 415, -289, -325, 381, 78, -508, 224, 200, -413, -246, 541, -170, -353, 40, 505, -406, 45, 389, 18, -375, 61, 483, -397, -51, 450, 113, -419, 470, -11, -485, 264, 211, -141, -241, 434, -68, -412, 56, 254, -471, -130, 546, -282, -376, 441, 355, -489, 95, 457, -267, -495, 557, 144, -449, 35, 317, -171, -417, 553, -137, -320, 23, 58, -277, -189, 543, 88, -498, 54, 103, -375, -92, 498, -160, -409, 518, 355, -430, -223, 400, -151, -520, 473, -21, -480, 94, 285, -474, 23, 517, -42, -413, 36, 106]
5812A06o49K62O45m44n79J116j75o88N61M95o94m54Q95j97m82M06K02n46K31L20
5832C31k03k16L16K50q73L23N29q11r4Q53k96p28M73P64r20j75R50l39m35L54
5852E3K97p39K59M42k07l01M99J96q66L04O23n22n16P30K49q02J1O40m81k94Q71
5873D46o35k93P17J16n75j41O94m7o39L64L89o96p7O98m13k24P88j63p28K51L32
5894A64l08l08P44Ko50N45K33m64l90R75m35o65O47L58p81j05Q61l11o60P24k0
5915A56m26J01O34m38m89P01l04n81N47L35m71J94L96j98m71K81O61j290K90P99
5935D27m70n23O81Q4n93K04M81l12l86P50k01p80O33N16p94k53P90j62m74O31
5955B49n2n37K37P06m29n87O92R2o45K55M44l24m95P07k34o74O83K81p01p4Q17
$$ y = [106, -543, -281, 364, -80, -659, 457, 282, -406, 155, 650, -44, -498, 397, 200, -282, 124, 326, -220, 11, 331, 128, -88, 228, 478, -395, -72, 457, -354, -448, 405, 109, -619, -146, 618, -302, -477, 473, 134, -301, 53, 350, -389, -130, 312, 105, -196, 303, 499, -367, -63, 560, 38, -478, 252, 501, -301, -290, 350, -131, -425, 446, -189, -482, 235, 351, -224, -365, 329, 282, -357, 7, 396, -300, -377, 321, -92, -316, 472, 309, -419, -168, 164, -144, -452, 292, 294, -356, 189, 422, -42, -432, 543, 108, -557, 90, 448, -333, -438, 423, 112, -548, 176, 156, -270, -169, 465, 27, -462, 239, -65, -646, -99, 236, -235, -41, 355, 157, -314, -33, 628, -662, -372, 427, -43, -566, 115, 199, -394, -190, 291, -21, -407, 343, 142, -638, -5, 511, -283, -536, 254, 92, -382, 249, 197, -340, -103, 603, 174, -413, 279, 371, -274, -19, 425, 101, -394, 313, 79, -595, 88, 369, -332, -406, 411]
5976D11j83o08N39K43p77j6P07l42o42Q67J01n72RO31n34k64N64K11p85M15N34
5997E09p36l11O92K37r39N04L16m33j03N31j39n20L66J62n01j51J112p42j29L32
6017E7L33n16R4M55m52m12P28j13p02P02K62n99j35O80j16j006R18K33q40M69
6037D0K59k52n16P17Q0o78N5Q48q53l1P34l35k92K76K91k37n02R99n68l97O26
6058B64o8n8l81N90l19m00N61Rp22L15M72n01j43P10j18n86L34M99o58k96O41
6079A45J20o39N60J82n21k04O91m81l79O05L42p36J75N08l86m79M74M26o82L55
6099G6J38k08o02J046m82l50L53L05o07k44R93l21o50M81M52n85j20Q22n11k86
6119c00O04k69k35j16O11m46l1K29L81p11N31K91q34j4N09qo15M00K65m94K1L67
$$ y = [411, 228, -380, 159, 402, -375, -391, 316, -26, -668, 199, 300, -272, -263, 368, -166, -430, 134, 345, -440, -25, 509, -227, -538, 154, 391, -548, -44, 272, -161, -264, 267, 128, -392, -26, 136, -365, -516, 596, -146, -275, 57, 390, -126, -32, 423, -29, -441, 287, 174, -528, 174, 436, -163, -298, 382, 266, -740, 178, 411, -429, 40, 299, 47, -469, 248, 328, -350, -295, 553, -300, -331, 403, 68, -224, 52, 343, 106, -396, 603, 35, -362, 264, 196, 138, -243, 347, 28, -372, 189, 198, -524, -209, 263, -238, -381, 329, 211, -375, -41, 458, -200, -496, 145, 265, -374, 186, 368, -153, -357, 334, -147, -526, 79, 421, -315, -140, 368, -18, -497, -23, 403, -279, 76, 214, 6, -596, 450, -32, -382, -29, 276, -331, -575, 418, 97, -553, -72, 380, -205, -325, 497, -14, -300, 304, 35, -200, -316, 295, -151, -182, 47, 428, -283, 248, 539, -295, -309, 200, 192, -423, -23, 242, -252, -231, 136]
6141A36k0l96N09Jn09J54M75j74n06O91k85m31O11K94p10p0O45l46m10K73N35
6162D67p26j00Q37n81l62P30r3n34p9J007n12m01M19n6m26J44O18n06r4L57l5
6183G4k28J24M53o15k1P13l08n25M79K07m82j44O68k59n47M49J3o72P07N67p66
6204a13m10R73k75n32K12O08m58m15P67j41n89Q30o7o02L41K46k72n46O25Q1n65
6225c02L35K23m49j78O26r7n71K25M90o85J47O64l31l72L61R8n00n4N77j20m13
6246c26N24J17p84L86M04l52m48Q72j74m66K24N39o10j64K81O7o09L63P12o90
6266a34j62N78k43l61M86K05p31M35L47l09p29R44j53o96N43P46r72l42P73j93
6286C2j64J37L76p14j6N96l41m21N58L36p01k6O25l78l38N39J88p52M26M56o74
$$ y = [136, 116, -280, 229, 230, -279, -125, 350, 176, -330, 361, 76, -355, 256, 550, -160, -230, 415, 69, -341, -68, 467, -259, -359, 478, -103, -465, 265, 172, -362, -441, 566, 54, -347, 72, 16, -410, -266, 352, -154, -248, 109, 74, -154, -30, 423, -192, -213, 500, 192, -333, 146, 353, -129, -273, 395, 136, -411, 38, 51, -621, 86, 653, -113, -523, 450, 175, -357, -145, 463, 5, -410, 357, 216, -373, 457, 390, -212, 129, 375, 103, -443, 182, 263, -302, 33, 256, -193, -371, 255, 158, -413, -188, 302, -383, -236, 428, 97, -275, 86, 184, -316, -370, 207, 87, -326, 198, 315, -469, -83, 321, -31, -479, 393, 219, -247, -23, 516, -94, -258, 23, 90, -519, -156, 556, -134, -296, 282, 39, -322, 164, 369, -362, 73, 420, 111, -618, 326, 173, -523, 20, 766, -206, -548, 225, 32, -132, 5, 381, -333, -349, 247, -94, -515, 43, 379, -322, -348, 277, -101, -439, 100, 288, -464, -38, 418, -256]
6307b56k72P89j3p43N00L22n53o3Q47m73m21M08K10o84J07O02l37k29O06j3n12
6328a78j52P18n15k51P79k61n34L98K63n42j32O17j81j88kP19r32J78O78m27k05
6349a50K44L65o74J69L79l17m14O17p1o18M50M53l44l25O05Jq92O88J9o50O0N68
6371A63On67N22K29m95l8M85l92m70Q82k25m52L81M16n42k50M91J08n78L14K12
6392B00l55j12P26n97k16N24J25n05J05L57l40l21M47K85o10K20O20o90j30N50
6412B83k06o45L76N25o32j5N10r5p00Q14L47p36r1N20k19l11K81J68n36J79O96
6433E13m26m21L95j43l34M33K56n27K89K81l35m61O46K68p43J87N17k07n25M99
6453A62K30q41L21O11p02j98O40J57p95M05M05l56k03K67J50o40K18M15q11M12
$$ y = [-256, -528, 261, 248, -495, 5, 327, -226, -289, 558, 85, -336, 72, 282, -402, -295, 307, -30, -259, 347, 334, -178, -330, 388, -127, -378, 401, 140, -394, 4, 267, -275, -407, 210, 29, -159, -161, 558, -374, -196, 482, 55, -150, 94, 459, -215, -46, 333, 16, -398, 219, 148, -470, -20, 433, 89, -236, 369, 370, -522, 166, 185, -465, -405, 163, 169, -398, 124, 353, -142, -180, 305, -87, -557, 325, 100, -352, 29, 445, -97, -347, 144, 252, -326, -12, 200, -155, -267, 459, -138, -354, 170, 295, -210, -105, 252, -88, -409, 38, 323, -287, -67, 553, -137, -267, 283, 77, -568, -192, 333, -299, -314, 196, 101, -599, 215, 562, -174, -265, 255, 36, -275, 6, 174, -362, -183, 513, 87, -334, 61, -82, -416, 17, 273, -254, 35, 316, -19, -480, 166, 434, -309, -122, 395, 188, -337, 162, 392, -449, -128, 483, -219, -417, 223, 380, -415, -10, 395, 39, -164, 103, 253, -387, -169, 246, -565, -153]
6473a53O39m19m81N28L13o91J2M14k6k04L13J3o35L57L76m66k50L52M40j059L49
6494b78P80m39n9L68l99k44M32J91n16j5M61l83k04M01K47k89j44L28j23j53L94
6515C56p4m45K08L43p10l8Q37l18p17N81J82n00k20R77n45l60O48M1n18Q6N58
6536C72k39m02M49J46p61M01M32n53kO30m21l82O62m19j37J57M92j70o64M96k
6557H5m23L36M46m92l52M96j15n13K29M41l04O6L78l75j64K84L44n37j65O47k53
6578E9l36L46L24m58J10M59n21k11K46m6k51J29K97l76O9M14o3n77N29K69q95
6599d83J34O20l03l76P73o3n16K50o8Jm45N65J54o77M11L74l71l44P84l64m73
6620d17L42L50m72J4P39j39p32M24J56n99K69M10m29j44J56N53q91L21M24l29
$$ y = [-153, 486, 67, -414, 114, 427, -264, -252, 162, 136, -68, 245, 258, -377, -20, 356, -110, -360, -8, 432, -627, -278, 502, 63, 4, 372, -27, -271, 161, 352, -164, -179, 282, -101, -305, 96, 343, 54, -90, 238, 115, -38, 356, 282, -163, 45, 388, -322, -360, 477, 159, -558, 23, 205, -295, -515, 462, -83, -443, 205, 246, -272, -186, 372, 133, -269, 180, 326, -435, -34, 398, -155, -157, 473, 52, -330, 332, -87, -224, -67, 425, 255, -409, 87, 85, -338, -2, 444, -48, -400, 96, -19, -532, -303, 138, -166, -100, 278, -97, -261, 23, 367, -170, -335, 312, 59, -277, 69, 393, -65, 45, 504, -17, -228, 18, -28, -279, -150, 147, -229, -160, 254, 191, -386, 143, 412, -483, -349, 271, -32, -408, 365, 302, -214, 36, -32, -31, -476, 89, 243, -434, -23, 351, -20, -364, 420, 56, -417, -75, 275, -197, -183, 556, 417, -315, 109, 265, -334, -65, 345, -84, -228, -72, 481, -410, -89, 335, 6]
6640Fl78N87M8o92K92L52l63L1N72m95m08N78L54o54k9N18k09l85N92k75k43m
6662b05M79l44l43N89R2m66K3O33m96l31M13j42j45N39L30o69l24P62q1n86L76
6683A04L2m44J29M44l73l53L59K10p62K86O10o07n5Q58k25n93L02M94n73n1L87
6704A79N4o81N11M31p90K4O06o20o0O21j59j81p4N44k57j69K45o3p21L35N72l5
6726C12m21K20l2m85O30K8o03J36K97q7m14P61j20m07J85J20j06m29N71P9m36
6747b01K55J59j09m10L97J16n41L86L09q42M66M07m17n3L01j69k76J86P21p64
6767g9j89K62K11n47J59L77l35k3N95n27j80K95K17l37N6L68n00l19M87L50m82
6788a41l1K90k62m9N35l20l15K86M05m41j12N14k50m47L43L07l97j35M63K7o33
$$ y = [6, -372, 215, 263, -429, -137, 215, -148, -117, 455, -40, -448, 130, 484, -170, -199, 319, 110, -275, 317, 42, -201, -205, 274, -70, -413, 176, 268, -198, -175, 458, -38, -369, 44, -98, -243, 296, 626, -43, -367, 395, 314, -272, 104, 136, -308, -179, 265, -108, -461, -102, 108, -654, -368, 242, -365, -420, 438, 213, -380, -78, 416, -157, -208, 179, 233, -448, 63, 494, -296, -272, 334, -286, -346, 275, 116, -65, -139, 405, 148, -21, 224, 161, -560, -225, 347, 312, -109, 111, 79, -406, 224, 252, -351, -215, 82, -5, -419, 342, 222, -185, 0, 120, 14, -415, 156, 235, -201, 54, 213, 104, -306, 91, 207, -334, 52, 361, -481, -15, 392, -25, -78, 223, 54, -222, -36, 685, -79, -268, -6, 205, -342, -183, 194, -141, -164, 431, -96, -276, 19, 236, -101, -45, 323, -177, -496, -9, 341, -141, -172, 118, -144, -193, 342, 22, -293, -7, 398, -43, -155, 359, 109, -338, 5, 312, -85, -220, 243, 270, -363]
6809c63Q95j53m52O5L10m61k02L54L26m95O7O44o39k18M66mm21L05L36n15K6M42
6831C13k46m00L68K65o28M37K66l19l32M36O0m99q7M49q9m41O00l8o01L89L06
6852B09R6o66P96l59l00K68J34k75L6L95k93l47L77J63n32N07K55m88l85M57J18
6873A66o84K53M51n30R5L71j26l71O39L41p37j04N30k18l77K86M57o90J7P46n14
6894Aj04M50o2l89J74J23j77l81M64J53m09P7M11l80j66M01k18l10K26L96n84
6915c04K51L04k14l07N64Q9p32N5R40q81J25K75J26p20L98L78k92m34O64k60j84
6936a59J79K82m03k65P38m11J26j93L76o13J99L04k16k00L23J73n96L17N67p25
6956a97K4L03J20m42J01K21l07rL62k96k18M27L01m52j18L94l03j71M08q7k52
$$ y = [-363, 532, 379, -73, -8, 302, -159, -361, -7, 319, -176, -109, 535, -104, -322, 144, 140, -281, 24, 360, -155, -129, 313, 67, -333, 35, 300, -328, 109, 375, 56, -276, 160, 220, -279, -366, 83, -6, -447, 153, 115, -486, -97, 209, 305, -361, 435, 76, -224, 44, 178, -97, -61, 334, 41, -306, 71, 234, -298, 209, 464, -24, -409, 48, 166, -518, -265, 186, -344, -249, 122, -4, -375, 264, 605, -132, -236, 294, 76, -301, -15, 442, -248, -231, 515, 1, -103, 347, 285, -104, 70, 193, 16, -365, 99, 252, -157, -80, 331, -49, -215, 186, -32, -342, -116, 280, -304, -53, 251, 37, -270, 294, 383, -349, -294, 646, -235, -110, 165, 291, -429, -31, 347, 55, -379, 285, 25, -159, 20, 302, -101, -366, 372, -39, 87, -106, 270, -343, -144, 160, -56, -256, 67, 240, -356, -39, 528, -197, -173, 130, 250, -192, -91, 130, -177, -186, 176, -120, -338, 89, 390, -62, -180, 214, -89, -260, 148, 61, -191]
6977a91j05N22k14l56N61j65n69O91J02m62j04N02l0l50J02M83p31J95M00l76
6997i5j96P06k34m25M46K44o51J12M98l68n36K79M01m17M0L96l30j76M09L33n97
7018a61j54P76m90k50L02M09k81j58K23m12J8M66J17n02J49L76l08l70L72J34
7038B56m65K29K7l33O4M44j63n37K30M05m32K55M14o89Q1K01J75l33Q7J71j90
7059a03j29K70L2k65J65J85m21J6O00k78l34K70K55m27J92L65n32J14J36J70m66
7080a85k0N77n24j85M61j23m41M90M10n61j36M69j09m40K76K42n56M9M27j85k53
7101c17M23J49n11J85L24l98j03M77j97l78K22N57n72q4M66n2l38L13J19m63K2
7122a56L93l51k43O82j61l90M7O94n28l12M23Rl95L22K07l64N1N49l05o53M92
$$ y = [-191, -296, 226, 12, -344, 217, 52, -517, 174, 276, -186, -290, 212, 182, -168, -66, 417, -314, -119, 281, -95, -291, 415, 181, -244, 202, 446, -205, -93, 405, 37, -499, -220, 181, -236, -196, 200, -130, -306, 103, 436, -161, -315, 461, -29, -279, 23, 432, 151, -7, 216, -196, -178, 288, 405, -97, 52, 428, 120, -250, 122, 256, -209, 20, 47, -286, -222, 222, 59, -478, -248, 157, -275, -20, 394, -295, -214, -13, 162, -171, -84, 87, -103, -232, 38, 70, -195, -30, 155, -266, -250, 350, 72, -262, 8, 263, -164, 28, 393, -139, -25, 111, 281, -185, -205, 372, -152, -337, 124, 1, -440, 50, 460, -101, -237, 232, 123, -317, -41, 201, -355, -306, 121, -64, -317, 106, 255, -256, -71, 253, -145, -248, 229, 32, -346, -124, 433, -139, -223, 243, 191, -147, 166, 285, -178, -156, 237, -114, -357, 325, 164, -226, -179, 515, -13, -325, 98, 107, -288, 34, 241, -123, -72, 477, 172, -481, 11]
7143A1K81k74k54M12m56k50O97J6k34q4M64k7o13K94Q2n01N45K74n26j54N14k39
7165b2l69N76M1k40k34N93k37p29N50K33m13P2M60j41l60O47J0n74j54O54o14
7186b51J37K78K1n91P17j41k35p4N01j84n23K82L64l34j05N26l46l25N26K5q58
7207e90N92L92l86o9Q8J80m24L28J72l55R8K71k53m85K79L78k54K0J31j98k34
7228c19M47j19k98L49L82k79k52L28n7l42M0L50m50J53L05o9o60O87ml69N9M57
7250C39j08n35J52L16m38K02M36j39l68L57R7o54M56L37m72l06M21Q2l26J07K91
7271B47l57j43O38m15k8J84Q0n51J83P29q22J8L95Q4o83M77K44l06n18P30o7m30
7293c11M24K72n68k4L60k6k75j44N67m75J33N36o43k30O59J28q44K47N68l41m41
$$ y = [11, 292, 18, -236, 176, -280, -530, 167, 183, -51, -135, 329, 302, -311, -17, 65, -436, 109, 383, -143, -297, 217, -22, -391, 185, 226, -14, -248, 345, 108, -621, -71, 162, -251, -179, 281, 140, -220, 427, 437, -137, -291, 363, -251, -114, 164, 185, -406, 311, 170, -65, -139, 362, 178, -345, -63, 301, -33, -138, 388, 42, -283, 243, 268, -590, 2, 394, 8, -61, 27, 207, -217, 111, 283, -72, 26, 297, 44, -441, -162, 216, -38, -18, 113, -85, -319, 128, 9, -289, 60, 442, 163, -89, 239, 182, -160, -120, 230, -220, -67, 238, 169, -491, 196, 192, -177, -118, 339, 231, -304, -152, 164, -274, -72, 364, 225, -143, 214, 311, -343, 113, 450, -22, -328, 93, 175, -151, -44, 247, -110, -253, 385, -30, -58, 126, 206, -345, -162, 567, -255, -237, 158, 242, -441, 36, 280, -26, -544, 186, 119, -311, 113, 385, -183, -207, 153, 127, -148, -292, 275, -200, -67, 469, -174, -404, 255, 383, -461, -214, 354, 13, -428]
7314d28M44L27o79M61J06j31j71K27r1j38k9K91o13J75N31j72j66R8J48m33Q1
7335a62K89J75o36O01k4n13J57M4p3j81M17K00n66K86M27n29l4M51m51j51L34
7356F1J84k31JK76m12l00N18J1l57L59oj89j3J27J9k71J22L24l72L2L84k24l02
7379b59L43J83l73j35M04k22k91K96K07k60P9N25p89K05N57j61p09K95J13q6M7
7400c1L36j49m48K60L58o62J22J60mk19O65q3m27K47M20o13j97K26K16k35J88
7421A30Kl10j65N88q2m74L31K60l24j59K95j46L7K00p0m52K10L45o1m04K94J50
7443A95n59M11L1k58K2M34j48l23K75J31m78j43P18j90k31K65ml42K35K18n41
7464b82R3M28j9p09K73K60p1l13L67J58l55L3M43l87j6M10q2o18M88m7q5jP1o4
$$ y = [-428, 16, 343, -336, 125, 231, 100, -71, 156, 65, -73, -102, 189, -424, -249, 282, 110, -56, 42, 190, -243, -162, 127, 302, -334, 267, 243, -270, -113, -69, -142, -323, 94, 294, -272, 14, 441, -88, -122, 329, -122, -273, 61, 245, 14, 15, 291, -121, -421, 97, 108, -249, 110, 104, -85, -98, 29, 48, -223, -101, 223, -149, -117, 267, 43, -259, 84, 267, -106, -241, 163, -59, -350, -54, 153, -107, -28, 497, -292, -87, 470, 309, -400, -105, 8, -78, -31, 305, 156, -292, -32, 326, -336, -214, -54, -58, -277, 388, 305, -122, 125, 545, -68, -265, -39, 177, -58, 130, 132, -178, -343, 245, 163, -311, 20, 280, -44, -203, 92, -54, -17, 183, 113, -339, -129, 216, 155, -249, 45, 195, -364, 47, 78, -180, -158, 276, 128, -195, 80, 211, -267, -410, 308, 118, -113, 152, 148, -194, 41, 259, -282, -189, 239, 220, -489, -216, 44, -27, -340, 27, 185, -170, -137, 306, -81, -97, 313, 231, -387, 101, 54, -31, -32, 39, -25]
7488b5pj11K15l24J79L47j49l79M58j17m92M49J83k96k86L72R7m24K88J81m26
7509b67K21J30l18j14N18J8j91k87N96k44k93K86J49n33L19J66j90l03Q62m90
7529C5m16J51L71l97K6L44k14k96M81K56k74j42J39j29l50M50Q4m10K83K56n83
7550c35K69M74k23m67L57J67m54n5L29M1k92K74j11k08k1N95n47j94N73Q5k87
7571c0J05Q5l91j27O52j31k25N6J12k91J3M37k42k32K21K75n21K58J38k3n51N02
7593I0R1m68R6M54k12l40N26J05q12N39J38m19K22K78o6l76N57j96l48j5O32l91
7615H5k33K99L46n84p7L79l39j81M43L58q52L13K88l35j08K62L3l38M58p7k11
7636g1j34L44O8m19K35L78o29PN88n26l22N45L84o18j88M12j4l22K24K82n79K84
$$ y = [-25, -32, -143, 72, -252, -73, 274, 125, -254, 204, 87, -405, 44, 227, -69, -355, 17, 114, -310, -22, 159, -267, -46, 84, -234, -348, 170, 188, -3, -290, 306, 62, -231, 55, 204, -329, -10, 156, -34, -337, 525, 35, -381, -230, 141, -256, -230, 114, -100, -396, 85, 341, 67, -75, 64, -65, -415, 35, 119, -291, -8, 248, -335, -66, 408, 185, -282, 75, 242, -212, -267, 62, 103, -189, 85, -26, -234, -255, 340, -207, -401, 172, 257, -30, 75, 160, -231, -358, 294, 163, -62, -6, 106, -185, -172, 265, 23, -209, 12, 287, -234, 24, 162, 139, -412, 90, 181, -287, -191, 263, 51, -289, 237, 342, -470, 69, 207, -212, 10, 288, 222, -154, 403, 207, -141, -156, 476, 85, -148, 151, 497, -87, -164, 215, -124, -305, 138, 496, -356, -43, 245, -90, -198, 64, 97, -241, 217, 140, -71, -205, 139, 207, -212, 23, 401, -228, -221, 367, -159, -481, 64, 448, -170, -358, 54, 40, -282, -58, 224, -355, -71]
7658g1N89p63k6M79j57k30L15L5l89J86M57n22j62M60qj39KQ5j63k06N98k67m90
7681c87J00M94r7k99J03J08n55N43K26m92l4O57l01l64M98j30k79Q7M38n08M8
7702a44L28k24j47J92K44k01l09M04pm55N47K57n24k94N66j44k92J16K15m39R
7723c02N76m12k18O51k85j76L73n2k38j11M87j90n07L46K70l65j73N29j10l30
7743b37K28L35l20j43M58j5n83K50L70m45LL23k77k88M50J17l02j67M08k50R7
7764A2J69Qn03L69k7k54J15K70p1j52J43Pm17J07O21n84l8M28k2n03J46O61o08
7787a23o3M86l47j09J51J96l50Q8K27p5l94K57M20m95K58J8O0j49J06l5n00M48
7809G5L3j55j43N84k39n40N35n8j11j88M25l31j23K26K78l18j19N67l89k70O05
$$ y = [-71, 518, -245, -271, 208, 51, -179, 136, 171, -218, -32, 425, -97, -259, 201, 193, 54, 56, 141, -22, -228, 370, 103, -387, -287, 207, 110, -189, -86, 22, -533, 10, 236, -256, -290, 367, 66, -298, 200, 70, -209, -122, 316, -192, -144, 184, -40, -187, 5, 249, 48, -261, 143, 136, -319, 228, 485, -39, -333, 233, 89, -203, -87, 128, -311, -302, 274, -138, -356, 295, 10, -166, 207, 155, -83, -194, 293, 103, -404, -58, 212, -153, -326, 203, 93, -237, -9, 326, 6, -137, 321, 306, -277, -27, 343, -102, -99, 224, -53, -341, 109, 226, -76, -243, 165, -85, 12, 181, 189, -314, 55, 28, -226, -111, 159, 88, -64, 79, 86, -331, -224, 397, -187, -225, 203, 181, -322, -176, 485, -123, -186, 300, -47, -156, -5, 191, -159, -71, 156, 81, -313, -56, 364, -131, 127, 145, 205, 56, 162, 127, -373, 75, 108, -47, -190, 394, 155, -385, 150, 92, -19, -207, 218, -113, -236, -10, 268, -50, -169, 398, 9, -261, 344]
7830C44k29k56jM50m22r0K95J01l66J76K98m77L8J00K66k86K89p7j32M7J74j75
7852F7l89N48k21m00K57L93m71k1L00N3k93L55Q7k47l72N42p6l38K98j4l09J01
7874a50L50l48O7N3m6k22J94J38%k57J81L04o89L54K02k72j03M35nm38L65J45
7896B58m37r1N75k32l03L62L02o22K24P3m7k20M11j48m46N25p8j67q4M89j99l89
7918b44L23K13k54j92N06r5n04M57k86k49K02M18l82j54N57k51n75M92N11o02
7938a09NJ44j0l06M00r1j15r7K53j05j05n1L90m37J74O63m33l96M23j34l12K83
7960C4K21j72l10O90l71j06j35N72m63J5K00k10p4J26K79k84k28R0L56m68K27
7981a1L13p17L19K67m41OL81P6l35K13J84m72J08K98k41q0L31p1k63L4N01k27
$$ y = [344, 115, -141, -142, 308, -114, -204, 91, 192, -174, 2, 300, -177, -139, -39, 227, -59, 230, 153, 21, 68, 242, 67, -322, 226, 5, -395, -138, 255, -216, -237, 63, 116, -177, 178, 265, 18, -354, 188, 112, -226, 72, 58, -251, -150, 200, -148, -81, -28, -74, -296, -102, 36, 36, -221, -40, 264, -425, -71, 131, -141, -244, 191, 186, -252, 113, 258, -179, -270, 305, 73, -230, 132, 434, -188, 36, 109, 62, -158, 253, 105, -341, 184, 106, -61, -145, 344, 145, -244, 79, 292, 38, -154, 352, 257, -247, 210, -76, -325, -123, 295, -87, -241, 316, 65, -510, -18, 493, -109, -104, 40, 30, -276, 124, 33, -82, -179, 74, -31, -136, -187, 203, -234, -60, 603, 170, -226, 197, 63, -249, 34, 255, 83, -227, 463, 92, -14, -149, 423, -40, -25, 175, -35, -109, 17, 296, 12, -216, -126, 230, -238, -11, 302, -415, -96, 171, -270, -264, 117, 193, -142, 71, 255, -217, -109, 189, -52, -132, 199, 128, -135, -101, 400, 173]
8003A73l31K38J64n62L56K11nm69J65J52l89K81J51m01k0M33k84j91K90K52m02
8024a88L8M51m76K7J89Q4k95K06K17l11k1j65L45k81J14R7k19Q5K35j35l25K58
8046g0K01k62k71M59J63l14K7J37m37L46L35l90k84P36K1o41K00J98p0m61K10
8067a67L69m12J22L69k65l03Q46k69n52M38J36o22L33P9j66l39N60k13J3J29J69
8088B55j88j76M53k15l27J56L82n45R8R5O0LR4R3n57N9N11j03k90n6K12n5j16
8111a57J80j31pK34L4k65nK86n02J8O92l07k46J05K84m00J76J50j21m1l02N64
8133B39k74j86K47k00NK86J63m68L49M9l42k80O36Q3n52M14q6o2k83N65k75k85
8155b57J64L1l38M01J72l64P0O8J54m60K97O2N4k64J29K20j96M2J85k98J62K35
$$ y = [173, -158, 80, 244, -318, 38, 249, 244, -225, -60, 92, -297, -16, 135, -266, -286, 147, -137, -328, -38, 214, -188, -150, 301, -175, -148, 41, 125, -170, 36, 253, -58, -79, -244, 101, -180, -66, 31, -188, -103, 132, -3, -328, -70, 131, -131, -402, 57, 220, -94, -67, 70, -367, -21, 314, -76, -360, 376, 397, -244, -44, 154, 84, -377, -167, 202, -210, -88, 281, 16, -287, 559, 290, -262, 176, 312, -310, 23, 102, -64, -403, 157, -56, -43, 86, 255, 67, -109, 344, 129, -198, -42, 340, -205, -107, -12, 48, 51, 145, 238, -319, -260, 251, 148, -142, -198, 14, -41, -157, 23, -108, -115, 119, 153, -112, -117, 169, -333, -315, 377, 70, -176, -71, 213, -187, -11, 139, 18, -23, -325, 239, -35, -221, 26, -174, -169, 117, 280, -188, 161, 210, -132, -412, 224, 307, -245, 169, 83, 21, -262, 303, 28, -257, -93, -62, -400, 1, 173, -191, -121, -53, 101, -359, -62, 0, 54, -210, -81, 139, -57, -15, 170, -128, 34, 269]
8177B69O3n12l0N92n31K17m6j15j46J76J00j46J17P8
$$ y = [269, 332, -180, -210, 382, -149, 68, 22, -93, -239, -63, 37, -109, 8, 86]
8191H6
$$ Imaginary data points
##PAGE= N=2
##DATA TABLE= (X++(I..I)), XYDATA
0@%%%%%%%%%%%%%%Nj3J6j6J6k1K9l2L9m7N3o1P2q2R0j04J21j38J55j75J99k27
36a21K54k82L15l51L91m35M80n30N89o51P16p88Q66r54J052j158J277j411J562
55H21j732J925k148K411k723L099l568M167m960O061p694J0358j5387K7905j10435
70i1900j44798L72770l4099k88502K32378K16308l19989m1610L15713j37695k57274
81a78698K63294J07313l26629L4629K74106k04475j87960K77699L9773k86562
91a87510J29590K41320k38347j23907K83905l1398k52184J85113J79064k61748
101g6102m2499K77519r6591k17127K13461J07830k63503L0914K43795j63480j75932
112a61715K27245M2081k51327Q8373K09303j93002j14203K44847j5795k38377
$$ y = [0, 0, 0, 0, 0, 0, 0, 0, 0, 0, 0, 0, 0, 0, 0, 5, -8, 8, -8, 8, -13, 16, -16, 23, -24, 29, -32, 40, -42, 48, -56, 65, -73, 82, -93, 106, -121, 133, -149, 166, -185, 206, -229, 251, -279, 310, -341, 375, -413, 453, -501, 551, -607, 670, -741, 821, -911, 1014, -1134, 1277, -1446, 1653, -1915, 2252, -2708, 3353, -4341, 6017, -9370, 18535, -91900, -236698, 136072, 101973, -186529, 45849, 262157, -57832, -99442, 216271, 78576, -178698, 84596, 191909, -134720, -100091, 174015, -30460, -218420, 59279, 99052, -187510, -57920, 183400, -54947, -178854, 105051, 73653, -178531, 6582, 185646, -76102, -118601, 158918, 62327, -154800, 58661, 166491, -97012, -66098, 177697, 14217, -161715, 65530, 107611, -143716, -55343, 153960, -39042, -153245, 91602, 75807, -162570]
122a62570J37713J72514k15110n4679K42203p4463k07511J85069J26000k32053
132h2887N911K33228j20804j63174K05655N0245k41373N9003J99802j64843j18914
143a38151K11744q264k18150J19232J64102j90274n7485K22026n1305j87311J54246
154B0410J11004k10095m20K13620j05573j55683J82638N6626k12026N3677J82765
165A36943j50700j08355K01273k205k06565R8871J43151j75515m7123K05421n4213
176D0983j74531J45594J06600j85305K819J88680j00536j35864J70803M8513j96510
187h8754M3827J60910j32073r1687J79563l543j82163R1141J30781j54524m7434
198i3956J75361m6556j50317J23631Q7299j65386L44J68367p9174j18332J44498
$$ y = [-162570, -24857, 147657, -67453, -122132, 120071, 45608, -161903, 23166, 149166, -82887, -76976, 156252, 35448, -127726, 77929, 128174, -113199, -54196, 145606, -19237, -138151, 73593, 65329, -152821, -33589, 130513, -59761, -117246, 104780, 53475, -133836, 20410, 131414, -78681, -79101, 134519, 28946, -126737, 55901, 112527, -99499, -45822, 136943, -13757, -122112, 79161, 76956, -129609, -30738, 112413, -63102, -110225, 95196, 40983, -133548, 12046, 118646, -66659, -63840, 124840, 24304, -111560, 59243, 107756, -88754, -44927, 115983, -16090, -107777, 71786, 68243, -113920, -22779, 108002, -46522, -93956, 81405, 34849, -115468, 8163, 95462, -69924, -69580, 98787, 19613, -98719, 45779]
209D5779M6682j64330M1531J43020j15903q9747J53907O922j59299P1114J14434
220I4110j37999m6900J64678l1637j43721J03185Q7205j46936n784J55484p3353
231A8332j21073J33174N3482j55551L1300J39016j03980q4794J50690J1935j54985
242h2454O5683J16822j28566n1922J51721l1041j38866R9388Q5170j43327j2968
253g0360J49254o1592j11362J22995M7619j47229L0244J34547r4674q3374J33374
264D9442J1472j37415O3977J07135j20529m9296J41583k3431j24952Q7412P3992
275G9390j31473j0091J36212n8165j05609J09483M6200j31406K6577J21478q6923
286d327p5009J26140J2906j28466N3762R9736j06116m4885J28239k3337j18379
$$ y = [45779, 92461, -71869, -30338, 112682, -3221, -92968, 60939, 67861, -91438, -20324, 94110, -43889, -90789, 73889, 42252, -101469, 1716, 88921, -58015, -63799, 91685, 18332, -102741, 30433, 83915, -71636, -40336, 98680, -5300, -90094, 60596, 72531, -82454, -16771, 100051, -28515, -80437, 71284, 40243, -98623, 765, 85935, -57392, -70360, 78894, 17302, -94060, 28935, 76554, -70675, -40431, 94116, -558, -83932, 49442, 60914, -76501, -12524, 94611, -25918, -75214, 66369, 42938, -82014, 5398, 79390, -52083, -62174, 74038, 15873, -89736, 19747, 65947, -65459, -38882, 82596, -4327, -79336, 46804, 59710, -68756, -14994, 84742, -21374, -66259, 61980, 38643, -79736]
297g9736Q1532P5481j18765j5284J22095m9745r5440J01572M4999j25076J6589
308d1778J14490p1629p1858J10181J3307j18932M8118R7550r3127m9309J14785
319E1798j3632j06997P1307P0812j09772j8819J15461m0147r3770Q8043M5539
330E9823j13943J3227J08613o7805p2355J05446J9770j11865M0173R2298q7625
341a4243m5021J13701j2263j08782O5636P2112j01410j8026J08990m2911r0621
352g2838Q8138M7501j10950Q296J01323o4237o6569J01331J5632j10256L8369
363b4260Q9276p9407m2563J03520j1425r6929O3591O7281r4897j7963J00012l5651
375B0585q1268P6098L9666r8953R307R2548n6676o3513Q7738J7122r4395L2975
$$ y = [-79736, 1796, 77277, -41488, -56772, 65323, 15578, -79862, 21710, 66709, -58367, -41778, 72712, 1083, -70775, 39406, 52713, -66219, -18101, 79449, -13678, -62987, 51798, 38166, -68831, 2476, 73288, -36484, -55303, 60158, 20011, -73759, 14284, 59823, -54120, -40893, 67720, -85, -72440, 33006, 52776, -59089, -18916, 73382, -14243, -59264, 54437, 42174, -66608, -972, 71140, -30270, -48296, 60694, 17783, -72838, 15300, 62801, -48149, -39853, 61470, -2767, -69336, 31995, 47627, -62629, -24260, 65016, -14391, -56954, 46566, 35141, -61788, 1803, 69084, -25813, -43776, 56236, 20585, -60683, 15415, 55081, -43872, -34565, 57983, 1307, -62206, 25532, 42654, -51741, -18766]
387a8766P6576p3288m0842R4344m942q9738N0297O1264q1251j4410R3662l0459
399B2447p8473O7948M3924q6500K793Q2587n1128o1998Q0974K0818r1070K2675
411b5003P5139o2462m0301Q6706j611q5700M5536O3161p5048k3055Q6283k2501
423B1144p3871O1085M2401q2064n37Q3697m0828o1125P0498K1650q2660K1578
435a9032P1074o0367m4412P8654L690p6910L8838N7107o9890j9992Q4068j7674
447B5154p1719N2936L9821p4856l15P5464m0201n8694O6695K3424p6192J8888
459a9595O6699n3476l7846P4299J710p3824L5716N3813o3301k1470P2976j7842
471A7859o3024N1654L7512o9278k863O9060l1615n0676N7046J8111p1079J5559
$$ y = [-18766, 57810, -15478, -56320, 38024, 33082, -56656, -6359, 54905, -26346, -40756, 52906, 22447, -56026, 11922, 55846, -30654, -27861, 54726, 3598, -58400, 22574, 43392, -47678, -25003, 50136, -12326, -52627, 34079, 32468, -53232, -7696, 55465, -19583, -42638, 43645, 21144, -52727, 8358, 50759, -31305, -31842, 51855, 11027, -50098, 20400, 42050, -40610, -19032, 52042, -8325, -52737, 25917, 29607, -47303, -8465, 48642, -21248, -41240, 42828, 25154, -46565, 6371, 46192, -28664, -28979, 46485, 6284, -52410, 14285, 37709, -38483, -19595, 47104, -6372, -44218, 30081, 31791, -42033, -6317, 47496, -15805, -37275, 35701, 17859, -45165, 6489, 44001, -25277, -28140, 40920, 9305, -41371, 15675, 33786, -37293, -21734]
483b1734O1935m5606l7760O2256M020o1555L2228N0221n5646k1917O5631j0101
495B1972n6978L9946L3237o1107m736O2888k5853m9516N0058K2617o0633J1550
507a6555N6616m0440l6534N8050N788o1735K2863M7365m8989k2050O0510j0186
519A4703n5514M0331L8038n5156o970N8608k3357m4923M8926K1316o0647O741
531a7904N4948l4979l3951N2550M046n7819K3300M5744m6515k3767N4072q181
543A1544n0276L5265L3009n1673n094N6499j8442m0045M3215K0637n1345Q602
555h104M7592l4013l3036M6536M222n1735J7196L6962m0340j7679N0525o722m6592
568c5188L0537L1690m2294m973M7129j9246l7643L8848K0721m6348L662M2715
$$ y = [-21734, 40201, -5405, -43165, 19091, 23111, -38444, -6216, 44005, -11641, -33558, 32073, 21972, -35006, 4940, 38177, -22930, -27666, 35222, 9369, -40147, 9911, 32528, -28105, -16555, 40061, -379, -36913, 21137, 26925, -34810, -11947, 35418, -13571, -35621, 24889, 14703, -40811, -480, 37558, -17598, -24568, 34040, 10683, -34240, 14686, 36002, -24645, -17904, 37044, 2065, -31886, 20664, 24710, -33109, -9809, 35935, -10580, -34347, 19725, 11544, -38732, -3467, 29542, -22131, -27225, 29274, 10832, -29213, 14002, 34639, -16706, -8104, 39488, 5475, -27561, 18975, 23197, -28538, -11342, 25620, -14720, -32399, 18126, 11404, -35188, -4651, 27039, -15255, -20228, 26901, 7655, -29988, 8860, 29581, -16767, -13105, 29610]
580B9610k6939k7308M3072N756m7119J5182L6492l3548j9674M1173m767m1123
592b9193K5248K9012l9201q994M3020j1928l4308L0855J8292m0291J880M0261
604B4653k1666k9586L5676J0344l8486J2899L3957l0310j8526M0623L33l8897
616a8986J7983K5221l5393q827L8560j3446l5134K7327J9968l5405J618L5806
628A9292j9255k4973L6108J0906l7919J0084L1499k5538j6701L4668k044l5693
640a9566J8591K5482l1811j0063L4373j0608k9625K4761J4876l4548P66L2817
652A5445j6186k2388K7885Q160l0275J1803K8326k3262j5313L0203J633k7920
664a1889J3733J9014k6707p886L0225p420k6427J7717J4145k5981L12K6414j4438
$$ y = [29610, 2671, -24637, 18435, 24191, -22928, -7746, 28746, -4802, -24476, 16697, 11930, -29193, -3945, 25067, -14134, -23128, 19892, 7964, -26344, 4511, 22803, -17488, -15608, 24653, 2987, -26599, 9077, 19421, -19065, -6166, 27791, -2519, -21045, 19578, 19911, -18986, -1003, 24218, -11175, -20002, 18558, 5112, -30022, -2695, 17273, -18132, -16514, 19292, 37, -24936, 11172, 22078, -15841, -5757, 25742, 204, -16497, 18171, 16127, -19566, -975, 24507, -7304, -17367, 17006, 6398, -23227, 1534, 16410, -18138, -17372, 15445, -741, -23129, 4756, 12916, -17359, -5556, 22770, -492, -15805, 14398, 16031, -11889, 1844, 20858, -5849, -13735, 16490, 9070, -17357, 360, 14505, -11476, -11164, 15250, 812]
677H12k1065K3373R041k6621N370K3112j7942j2882K6000J990k5240J1360K0908
690A8216j9789q647K4299m638k2998J6383J4504k4622m564K4048q447j8558J7941
703C128Q259k4545L648K3657j3926j5709K0173L208k1472R795J8082j8335r580
716a3617K2998n20j9822J2560J2870j9817k399K1838q097j8211J4987Q452k0134
729h912J818J7818j2872j2286J8822L224j9580O697J5589j3849o575J8531k768
742E657j7071J1543J2451j5830k860J6055o733j1870J3738O190j7899L63J4953
755H687p792r784J2514J421j5087N518J3656j0705p722J3091O05j1673P378R117
769I224j2509l273J3853k947j0468P707N360j1109P9J1707o416r341J0192M148
$$ y = [812, -20253, 3120, 12161, -14460, -9090, 14022, -3920, -16802, 9198, 11188, -14052, -2692, 18216, -1573, -10220, 14079, 9441, -13557, 2826, 17330, -7292, -11856, 12192, 3745, -14813, 3128, 11387, -13158, -9510, 14147, 221, -15488, 4685, 7893, -13579, -3784, 14298, -4037, -13617, 9381, 8861, -10961, 1599, 14469, -5348, -7747, 14091, 5994, -12217, 2770, 11222, -8912, -7094, 10724, -2148, -14434, 4388, 7612, -11968, -5271, 10318, -3531, -10106, 8425, 5657, -11414, 129, 12580, -3250, -6110, 9945, 3212, -8658, 5080, 11270, -6629, -6266, 8687, 895, -8889, 3625, 5046, -10041, -4523, 9133, -1572, -9294, 3797, 4402, -7271, 107, 9224, -3285, -6558, 7295, 4348, -6120, 1587, 6947, -4162, -4083, 7624, 1208, -8133, 2059, 6207]
783F207j1104J353R340p022n862J1145J182j1852L279R918o875m018R494k446
797B739r220P038Q026r395l229Q872k736p026Q203K391j0793M76R121m494o061
812f088O693J182q674L708Q064o510m077Q185N84o644M285M572o124r68P461k054
828C595o729M059M057o221N86M629m577m255O057J930o464j93M111k896j360N073
844A402q05n469K106M788j449j897K989k35l339L169L297l666j978K871K18j840
860A62J065J267k915r89L229n76l474Q73J867k140q46K274j061k478K130L163
876A551k203j964L437O26j334K265J235l592m75L815p8l503M12R14k765O21L419
893B381k372l680K206K406k002m32K435k100k193L843J237l507K97K961j043j383
$$ y = [6207, -4897, -3544, 5796, -1226, -7088, 4057, 5239, -6613, -3334, 6584, -291, -4309, 5185, 2739, -6481, 557, 8583, -812, -4041, 4831, 2095, -4931, 3272, 5663, -5130, -4654, 4467, -27, -6088, 605, 1787, -6887, -3179, 4885, -1625, -5702, 2483, 3067, -3577, 708, 5280, -844, -1812, 5649, 3595, -3134, 925, 4982, -1239, -653, 3976, -601, -4856, 1201, 3131, -3333, -3526, 585, -2311, -3671, 1402, 597, -4872, -2766, 2022, 573, -1324, 1665, 1430, -1909, 1260, 4557, 891, -1087, 1784, 2002, 162, 1227, 2494, -421, -1410, 1819, 1243, -2231, -1358, 509, -1631, -2477, -203, -1264, -3742, -1612, 1551, -652, -2616, 821, 1447, 113, 2378, 3613, 21, -454, 3361, 3283, -220, 192, 1106, -1659, -1038, 2381, 9, -3671, -1465, 941, -1061, -1493, 942, -1158, -3351, 492, 1729, -1778, -1481, 1480, 437, -946]
909i46K660Q57l468O26M021k038l387K731Q93k849L56K360l133k025M410J480
925B548m808P00K912k639q78M304j281n052K179M441k916j832M403j606m020M603
941A058L992n761j480N338j413m391L986K123o959N18P025l903m511N622J252
956B496o063K560N440n524l121P762l78p464L690M591o517k81P762l338p224O078
972D69M817p734k80O838n059n378Q733J892r207J712P054n231k711Q790j210q643
988e148N151P026p602k185Q092l148p573O895M305r812l98R166m197o873P493
1003A192K471q908K463Q567o621o103R253K131r179L759P101q404k772J0968r32
1018D986j0693N453O168q718q36R966m841r958R312N424j0188M65R506o156o754
$$ y = [-946, 1714, 2571, -897, -271, 3750, 1712, -1675, 1056, 1949, -900, -544, 1816, -1317, -3342, 1068, 2548, -2260, -1560, 1352, -1287, -2165, 2139, 858, -4194, -2015, 2426, -490, -2322, 2081, 475, -3545, 1058, 5050, -711, -2191, 3147, 1734, -2657, 1329, 3452, -3507, -2989, 4036, 133, -4378, 1244, 2496, -3567, -1007, 4433, -1091, -4212, 3550, 3172, -4292, -602, 3989, -2528, -2809, 4953, 1615, -5609, 469, 5286, -2448, -2728, 4110, -949, -6327, 2406, 4298, -4909, -3197, 3857, -1374, -4085, 4705, 3495, -5148, 3, 7029, -573, -2758, 5334, 2186, -5387, 1508, 5813, -3999, -4397, 4769, 572, -6301, 1192, 3663, -5245, -2782, 5785, -836, -6939, 2314, 4445, -4734, -975, 6126, -2278, -5050, 5918, 4986, -5707, -254, 5914, -2804, -3640, 6326, 1485, -8473, 839, 6263, -3925, -3460, 6046, -110, -6864]
1033f864J1138K205j2800L200J0170q914n199J1849j780j1650P525Q610j1360
1046c870k499J2977l511j0533R836N360j3366J864J3043p661r935J0909K898j2496
1060f984M625J1127j1613o617J4018M68j2604O745Q254j2129k177J5125m260j2837
1074h859J0361O475j3586J818J2973q667r745J3070L478j4435L900J1946j0401
1087a672o533J4395p36j3938P991J0865j3602l868J4081l478j2440J0382P166
1100H613j6135j01J5007o170j0564J2037L582j4847M791J4831j0607r381J4875
1113E931R83j4323P824J0780j4094n215J6052k601j4581R767Q487j5107j452J6427
1127H878p394j2956J3414N815j6050K448J5369j0386r840J6575J490j7536P537
$$ y = [-6864, 4274, 6479, -6321, -3121, 7049, -1865, -7064, 4785, 3005, -8645, -1120, 7490, -3870, -6369, 6608, 3097, -7436, 2400, 7760, -5606, -3742, 9301, 1640, -8295, 2614, 5512, -6984, -2359, 8768, -2845, -9462, 4556, 5024, -7580, -835, 7419, -4710, -6887, 8238, 3978, -8859, 1502, 7977, -5609, -3791, 9182, 515, -9230, 3840, 7318, -7117, -3217, 8729, -1672, -8205, 6190, 5454, -8484, -493, 10372, -3230, -7098, 6983, 3505, -8935, 1447, 8613, -7522, -7623, 7384, 1214, -9350, 2687, 6269, -8578, -3787, 11044, 437, -8944, 5931, 6914, -7409, 415, 11195, -2899, -8114, 7938, 5337, -9244, 523, 9010, -6097, -7549, 8878, 1484, -11472, 1942, 7757, -8293, -5845, 9524, -862, -10702, 5873, 7363, -10173, -2636]
1140b636J4296j3700o218J6510l012j5700J2076J0878j7204l008J7439o884j2824
1153i987J4233N354j8864K201J7022j0339j0813J5947J530j7644Q182J4890j4893
1166c181p030J7863k085j5923J0952J1075j7235k170J8365p124j4538J4279O835
1179A0083j7641K051J6372j1060j1330J7271K892j8859O322J4621j3618o963J7859
1192H000k363j7718J0665J3010j6051l598J7689o570j5034J4981Q680j8806L65
1205f750J7766j0440j1591J7017L286j9834O228J6412j4194q848J8318r25j8248
$$ y = [-2636, 11660, -2040, -8258, 8252, 5240, -10460, 1616, 12494, -4710, -7718, 9721, 2837, -9987, 4246, 9600, -9264, -7063, 9959, -380, -11193, 4754, 6284, -11360, -3178, 11712, -3181, -10211, 7652, 5567, -10356, 596, 11671, -5564, -7734, 10631, 3507, -11031, 3248, 10083, -7558, -5507, 10865, -195, -11525, 5746, 8638, -10221, -3899, 10722, -2896, -9859, 8000, 5637, -12081, -1416, 11594, -4457, -8055, 9634, 3064, -11970, 3011, 11691, -7115, -6750, 11016, 576, -11015, 6002, 9288, -10546, -4318, 12094, -2100, -10948, 7370, 6445, -11803]
$$ [...]
8191E6
##END NTUPLES=NMR FID
##END=
