##TITLE=1H_PhBBC1204-1
 CDCl3
 8 sc, 
 13.04.2022
##JCAMPDX= 6.0         $$ Bruker NMR JCAMP-DX V2.0
##DATA TYPE= NMR FID
##DATA CLASS= NTUPLES
##ORIGIN= UXNMR, Bruker Analytische Messtechnik GmbH
##OWNER= root
$$ XWIN-NMR		Version 3.5
$$ Wed Apr 13 10:36:41 2022 Russian Standard Time (UT+4h)  she@DPX200
##.OBSERVE FREQUENCY= 200.13135
##.OBSERVE NUCLEUS= ^1H
##.DELAY= (6, 6)
##.ACQUISITION MODE= SIMULTANEOUS
##.ACQUISITION SCHEME= undefined
##.AVERAGES= 8
##.DIGITISER RES= 18
##SPECTROMETER/DATA SYSTEM= spect
##.PULSE SEQUENCE= zg30
##.SOLVENT NAME= CDCl3
##.SHIFT REFERENCE= (INTERNAL, CDCl3, 0, 15.7039)
##AUDIT TRAIL= $$ (NUMBER, WHEN, WHO, WHERE, WHAT)
$$ ##TITLE= Audit trail, XWIN-NMR		Version 3.5
$$ ##JCAMPDX= 5.01
$$ ##ORIGIN= Bruker BioSpin GmbH
$$ ##OWNER= she
$$ F:/spectra/data/she/nmr/H-F/1/audita.txt
$$ ##AUDIT TRAIL=  $$ (NUMBER, WHEN, WHO, WHERE, WHAT)
(   1,<2022-04-13 10:35:26.32 +0400>,<she>,<DPX200>,
      <created by zg, POWCHK disabled, PULCHK disabled
       configuration hash MD5:
       00 E9 B6 7A A2 85 ED C7 34 08 36 98 17 FE 4E 26
       data hash MD5: 16K
       E7 2F 5A 3B 97 92 FF 6F DA BE 76 9A 74 68 F8 21>)
$$ ##END=
$$ 
$$ hash MD5
$$ A9 7E F2 6D 16 D0 8C 1D D4 10 EC A3 6C BB BC 73
##$RELAX= 
##$RELAX= 
##$RELAX= 
##$RELAX= 
##$RELAX= 
##$RELAX= 
$$ Bruker specific parameters
$$ --------------------------
##$DU= <F:/spectra>
##$EXPNO= 1
##$NAME= <H-F>
##$PROCNO= 1
##$TYPE= <nmr>
##$USER= <she>
##$AMP= (0..31)
100 100 100 100 100 100 100 100 100 100 100 100 100 100 100 100 100 100 
100 100 100 100 100 100 100 100 100 100 100 100 100 100 
##$AQSEQ= 0
##$AQ_mod= 1
##$AUNM= <au_zg>
##$AUTOPOS= <>
##$BF1= 200.13
##$BF2= 200.13
##$BF3= 200.13
##$BF4= 200.13
##$BF5= 200.13
##$BF6= 200.13
##$BF7= 200.13
##$BF8= 200.13
##$BYTORDA= 1
##$CFDGTYP= 0
##$CFRGTYP= 5
##$CHEMSTR= <none>
##$CNST= (0..31)
1 1 145 1 1 1 1 1 1 1 1 1 1 1 1 1 1 1 1 1 1 1 1 1 1 1 1 1 1 1 1 1 
##$CPDPRG= <>
##$CPDPRG1= <>
##$CPDPRG2= <>
##$CPDPRG3= <>
##$CPDPRG4= <mlev>
##$CPDPRG5= <mlev>
##$CPDPRG6= <mlev>
##$CPDPRG7= <mlev>
##$CPDPRG8= <mlev>
##$CPDPRGB= <>
##$CPDPRGT= <>
##$D= (0..31)
0 1.2 0 0 0 0 0 0 0 0.06 0 0.03 0 0 0 0 0.0002 0 0 0 0 0 0 0 0 0 0 0 0 
0 0 0 
##$DATE= 1649831725
##$DBL= (0..7)
120 120 120 120 120 120 120 120 
##$DBP= (0..7)
150 150 150 150 150 150 150 150 
##$DBP07= 0
##$DBPNAM0= <>
##$DBPNAM1= <>
##$DBPNAM2= <>
##$DBPNAM3= <>
##$DBPNAM4= <>
##$DBPNAM5= <>
##$DBPNAM6= <>
##$DBPNAM7= <>
##$DBPOAL= (0..7)
0.5 0.5 0.5 0.5 0.5 0.5 0.5 0.5 
##$DBPOFFS= (0..7)
0 0 0 0 0 0 0 0 
##$DE= 6
##$DECBNUC= <off>
##$DECIM= 32
##$DECNUC= <off>
##$DECSTAT= 4
##$DIGMOD= 1
##$DIGTYP= 9
##$DL= (0..7)
0 120 120 120 120 120 120 120 
##$DP= (0..7)
150 150 150 150 150 150 150 150 
##$DP07= 0
##$DPNAME0= <>
##$DPNAME1= <>
##$DPNAME2= <>
##$DPNAME3= <>
##$DPNAME4= <>
##$DPNAME5= <>
##$DPNAME6= <>
##$DPNAME7= <>
##$DPOAL= (0..7)
0.5 0.5 0.5 0.5 0.5 0.5 0.5 0.5 
##$DPOFFS= (0..7)
0 0 0 0 0 0 0 0 
##$DQDMODE= 0
##$DR= 18
##$DS= 0
##$DSLIST= <SSSSSSSSSSSSSSS>
$$ [...]
##$SUBNAM2= <"">
##$SUBNAM3= <"">
##$SUBNAM4= <"">
##$SUBNAM5= <"">
##$SUBNAM6= <"">
##$SUBNAM7= <"">
##$SUBNAM8= <"">
##$SUBNAM9= <"">
##$SW= 18.05172834244
##$SWIBOX= (0..15)
0 0 2 0 0 0 0 0 0 0 0 0 0 0 0 0 
##$SW_h= 3612.71676300578
##$TD= 16384
##$TD0= 1
##$TE= 0
##$TE2= 300
##$TE3= 300
##$TEG= 300
##$TL= (0..7)
0 120 120 120 120 120 120 120 
##$TP= (0..7)
150 150 150 150 150 150 150 150 
##$TP07= 0
##$TPNAME0= <>
##$TPNAME1= <>
##$TPNAME2= <>
##$TPNAME3= <>
##$TPNAME4= <>
##$TPNAME5= <>
##$TPNAME6= <>
##$TPNAME7= <>
##$TPOAL= (0..7)
0.5 0.5 0.5 0.5 0.5 0.5 0.5 0.5 
##$TPOFFS= (0..7)
0 0 0 0 0 0 0 0 
##$TUNHIN= 0
##$TUNHOUT= 0
##$TUNXOUT= 0
##$USERA1= <user>
##$USERA2= <user>
##$USERA3= <user>
##$USERA4= <user>
##$USERA5= <user>
##$V9= 5
##$VALIST= <valist>
##$VCLIST= <CCCCCCCCCCCCCCC>
##$VD= 0
##$VDLIST= <DDDDDDDDDDDDDDD>
##$VPLIST= <PPPPPPPPPPPPPPP>
##$VTLIST= <TTTTTTTTTTTTTTT>
##$WBST= 1024
##$WBSW= 4
##$XGAIN= (0..3)
0 0 0 0 
##$XL= 0
##$YL= 0
##$YMAX_a= 41078
##$YMIN_a= -46464
##$ZGOPTNS= <>
##$ZL1= 120
##$ZL2= 120
##$ZL3= 120
##$ZL4= 120
##$ABSF1= 10
##$ABSF2= 0
##$ABSG= 5
##$ABSL= 3
##$ALPHA= 0
##$AQORDER= 0
##$ASSFAC= 0
##$ASSFACI= 0
##$ASSFACX= 0
##$ASSWID= 0
##$AUNMP= <proc_1d>
##$AZFE= 0.1
##$AZFW= 0.1
##$BCFW= 1
##$BC_mod= 2
##$BYTORDP= 1
##$COROFFS= 0
##$CY= 11.3945322036743
##$DATMOD= 1
##$DC= 2
##$DFILT= <>
##$DTYPP= 0
##$F1P= 2.36226072786647
##$F2P= -0.459571619588291
##$FCOR= 0.5
##$FTSIZE= 0
##$FT_mod= 4
##$GAMMA= 1
##$GB= 0.15
##$INTBC= 1
##$INTSCL= 1
##$ISEN= 128
##$LB= 0.24
##$LEV0= 0
##$LPBIN= 0
##$MAXI= 10000
##$MC2= 0
##$MEAN= 0
##$ME_mod= 0
##$MI= 1.114404
##$NCOEF= 0
##$NC_proc= 0
##$NLEV= 6
##$NOISF1= 3.799351
##$NOISF2= 2.8
##$NSP= 1
##$NTH_PI= 0
##$NZP= 0
##$OFFSET= 15.70392
##$PC= 1
##$PHC0= -18404.52
##$PHC1= 37.20078
##$PH_mod= 1
##$PKNL= yes
##$PPARMOD= 0
##$PSCAL= 0
##$PSIGN= 0
##$REVERSE= no
##$SF= 200.130013532006
##$SI= 16384
##$SIGF1= 3
##$SIGF2= 2
##$SINO= 400
##$SIOLD= 16384
##$SREGLST= <1H.CDCl3>
##$SSB= 0
##$STSI= 0
##$STSR= 0
##$SW_p= 3612.71676300578
##$SYMM= 0
##$S_DEV= 0
##$TDeff= 0
##$TDoff= 0
##$TI= <>
##$TILT= no
##$TM1= 0
##$TM2= 0
##$TOPLEV= 0
##$USERP1= <user>
##$USERP2= <user>
##$USERP3= <user>
##$USERP4= <user>
##$USERP5= <user>
##$WDW= 1
##$XDIM= 8192
##$YMAX_p= 0
##$YMIN_p= 0
$$ End of Bruker specific parameters
$$ ---------------------------------
##NTUPLES= NMR FID
##VAR_NAME=  TIME,          FID/REAL,        FID/IMAG
##SYMBOL=    X,             R,               I
##VAR_TYPE=  INDEPENDENT,   DEPENDENT,       DEPENDENT
##VAR_FORM=  AFFN,          ASDF,            ASDF
##VAR_DIM=   8192,          8192,            8192
##UNITS=     SECONDS,       ARBITRARY UNITS, ARBITRARY UNITS
##FACTOR=    0.0002768,     1,               1
##FIRST=     0,             0,               0
##LAST=      2.2672688,     0,               0
##MIN=       0,             -46464,          0
##MAX=       2.2672688,     41078,           0
$$ Real data points
##PAGE= N=1
##DATA TABLE= (X++(R..R)), XYDATA
$$ plain form
0 0 0 0 0 0 0 0 0 0 0 0 0 0 0 0 0 0 0 8 -8 8 -8 8 -8 16 -16 16 -24 24 -30 32 -38 41 -48 54 -62 70 -78 86 -99
39 -99 110 -121 136 -150 168 -185 201 -224 247 -271 299 -330 362 -400 441 -489 540 -600 666 -745
59 -745 836 -948 1082 -1251 1471 -1765 2191 -2852 4038 -6835 31294 -9590 -32591 41078
73 41078 3379 -28577 19360 22572 -26673 -1754 18114 -11876 -10084 14624 -5815 -12272 6706
86 6706 1199 -10816 178 915 -4882 -1109 4216 -1948 -5054 1915 3027 -4607 2942 8748 -5181
101 -5181 -4070 11715 1461 -8709 10464 9528 -12694 1578 15084 -9675 -7304 15510 -3863
114 -3863 -14355 10415 3186 -16148 2623 7806 -11882 -3696 9313 -6382 -7367 7242 -1533
127 -1533 -6351 6415 2421 -5701 3589 4866 -3209 1769 7055 639 -2199 4494 3853 -3095 1121
$$ packed form
0@%%%%%%%%%%%%%%%%%Qj6J6j6J6j6K4l2L2m0M8n4O2p0P9q9J02j16J32j48J64j85
39i9K09k31K57k86L18l53L86m25M71n18N70o29O92p62Q41r30J029j140J266j411
59g45J581j784K030k333K722l236L956n043O890j0873L8129m0884k3001P3669
73D1078l7699l1956M7937L212m9245K4919J9868k9990J792K4708k0439o457J8978
86F706n507j2015J0994P37n797L773N325o164l106O969J112p634P549N806j3929
101e181J111J5785j0254j0170J9173r36k2222J4272J3506k4759K371K2814j9373
114c863j0492K4770p229j9334J8771N183j9688Q186J3009j5695r85J4609q775
127a533m818J2766l994q122R290J277q075M978N286o416k838O693o41o948M216
$$ plain form
142 1121 4834 -2648 -3588 3791 -34 -6644 688 2667 -7663 -3617 5973 -5106 -7223 5915 133
157 133 -7952 4534 4860 -6753 622 7241 -3133 -1804 7931 -291 -4444 6440 2923 -5030 3875
172 3875 4506 -4265 335 5236 -2533 -3113 3143 -46 -5152 766 1719 -5400 -2558 2549 -3556 -4463
188 -4463 2515 -136 -4922 808 3705 -3073 -1138 5857 -499 -2592 6131 2672 -3390 3754 4222
203 4222 -3173 773 5191 -2012 -2422 4102 -786 -4694 2548 937 -5679 328 1777 -5147 -2111
218 -2111 2527 -2915 -3439 2402 -70 -4271 1606 2959 -2781 542 4783 -829 -1129 4484 1238 -1915
234 -1915 2948 3405 -2070 126 3962 -1391 -2765 3190 58 -4297 1397 1102 -4384 -1076 1913 -3417
250 -3417 -3253 2213 -1212 -4422 1951 1576 -4411 818 3798 -1937 -709 4215 42 -1580 4040 3001
$$ packed form
142A121L713p482r40P379l825o610P332J979j0330M046R590j1079k117J3138n782
157A33q085J2486L26j1613P375O619j0374J329R735q222m153J0884l517p953Q905
172C875O31q771M600M901p769n80O256l189n106N918R53p119K842N107o105r07
188d463O978k651m786N730K897o778J935O995o356k093Q723l459o062P144M68
203D222p395L946M418p203m10O524m888l908P242j611o616O007J449o924L036
218b111M638n442n24N841k472m201N877J353n740L323M241n612l00N613l246l153
234a915M863M57n475K196L836n353j374N955l132m355N694k95n486L308K989n330
250c417J64N466l425l210O373l75n987N229K980n735J228M924m173j622N620j039
$$ plain form
266 3001 -1694 1844 3780 -1738 -159 3977 -1385 -2243 1928 -305 -3590 -61 899 -3529 -2284 1805
282 1805 -2432 -3547 1760 -540 -3303 1323 1564 -2424 -105 2626 -969 -755 3091 1246 -1435 2695
298 2695 2664 -1860 1606 3255 -1273 -754 2775 -351 -2323 1012 486 -3267 -884 1581 -3184 -2308
314 -2308 1480 -2089 -3092 1581 131 -3092 494 2220 -1988 -648 3467 61 -1563 3384 1844
329 1844 -1595 2622 2822 -1419 338 2707 -372 -1230 2183 382 -2994 429 924 -3239 -1139 1351
345 1351 -2467 -2559 1255 -565 -2994 280 1133 -2339 -164 2660 -1207 -1289 3070 808 -991 2580
361 2580 1922 -1019 1132 2835 -204 -364 2557 -41 -2296 1512 697 -2418 -58 892 -2522 -1631
377 -1631 746 -1536 -2629 322 -165 -2435 163 1475 -2108 -267 2107 -641 -743 2305 903 -732
$$ packed form
266C001m695L538J936n518J579M136n362q58M171k233l285L529R60m428J245M089
282A805m237j115N307k300k763M626K41l988K319K731l595K14L846j845k681M130
298B695l1m524L466J649m528N19L529l126j972L335n26l753K383K465m765Q76
314b308L788l569j003M673j450l223L586J726m208J340M115l406j624M947j540
329A844l439M217K00m241J757K369l079q58L413j801l376L423M95m163K100K490
345A351l818r2L814j820k429L274Q53l472K175K824l867q2M359k262j799L571
361B580o58k941K151J703l039j60K921k598k255L808q15l115K360R50l414Q91
377a631K377k282j093K951m87k270K598J312l583J841K374k748j02L048j402j635
$$ plain form
393 -732 1667 2396 -392 810 2634 -315 -791 2301 92 -1972 976 262 -2262 -508 841 -2185
409 -2185 -2139 725 -854 -2689 773 197 -2386 237 1109 -1561 -574 2001 298 -797 2036 1773 -781
426 -781 1115 2769 -404 87 2812 79 -1060 1484 253 -1645 192 917 -2025 -1478 1059 -1655
442 -1655 -2540 792 -347 -2876 94 428 -2188 -337 1584 -564 -827 2174 690 -847 1851 1991
458 1991 -673 1356 2369 -364 225 1998 166 -937 1018 452 -1443 -347 511 -1799 -972 465
474 465 -1227 -1881 42 -719 -1678 -255 311 -1388 -515 1461 -52 -827 1871 720 -647 1651 1835
491 1835 -237 564 2515 -176 -647 2090 762 -1823 923 965 -2222 -359 1011 -2192 -1755 688
507 688 -1355 -2438 294 -162 -2499 -187 1561 -1518 -637 2087 -400 -552 2177 785 -244 1387
$$ packed form
393g32K399P29k788J202J824k949m76L092k209k064K948p14k524J754J349l026
409b185M6K864j579j835L462n76k583K623Q72k670R87K575j703j095K833k63k554
426g81J896J654l173M91K725k733j139K544j231j898J837P25k942N47K537k714
442a655q85L332j139k529K970L34k616J851J921k148k63L001j484j537K698J40
458A991k664K029J013k733N89J773j832j103J955n66j895J096Q58k310Q27J437
474D65j692o54J923p61r59J423N66j699Q73J976j513p75K698j151j367K298J84
491A835k072Q01J951k691m71K737j328k585K746M2l187J863J370l203M37K443
507F88k043j083K732m56k337K312J748l079Q81K724k487j52K729j392j029J631
$$ plain form
523 1387 1782 -126 336 1799 528 -570 1450 715 -1100 74 476 -1133 -1023 147 -502 -1928 -337
540 -337 129 -2095 -737 835 -1591 -828 1317 -608 -988 1112 679 -602 1311 1764 -642 519 2422
557 2422 -358 90 2315 78 -888 1219 109 -1425 177 317 -1253 -1002 273 -1373 -1541 374
573 374 -961 -1418 24 -226 -1581 -276 768 -67 -187 948 832 -241 555 1471 120 846 1699 130
591 130 -184 1486 472 -930 553 854 -1069 -779 1059 -1460 -1985 753 -739 -2071 288 -373 -2085
608 -2085 -445 810 -1077 -750 1260 10 -1193 1688 897 -867 1160 1640 -131 689 1433 238
624 238 65 876 952 -481 46 753 -1086 -911 219 -732 -1433 -59 -368 -1440 -836 261 -1046 -1022 843
643 843 -149 -1026 665 494 -921 1203 1211 -112 590 1628 390 345 1585 658 -446 1082 808 -1247
$$ packed form
523A387L95j908M62J463j271j098K020p35j815J174M02j609J10J170o49j426J591
540c37M66k224J358J572k426P63K145j925l80K100m33j281J913M53k406J161J903
557B422k780M48K225k237r66K107j110j534J602J40j570K51J275j646j68J915
573C74j335m57J442k50j355J305J044q35j20J135j16j073P96R16j351P26Q53j569
591A30l14J670j014j402J483L01j923K90J838k519n25K738j492j332K359o61j712
608b085J640J255j887L27K010j250j203K881p91j764K027M80j771Q20P44j195
624B38j73Q11P6j433N27P07j839J75J130r51p01J374l09j072O04J097j307K4J865
643H43r92q77J691j71j415K124Qj323P02J038j238m5J240r27j104J528k74k055
$$ plain form
661 -1247 402 476 -1027 -553 93 -805 -1160 -175 -392 -1276 -620 142 -1344 -715 639 -364 -560 655
679 655 729 -299 471 1516 30 233 1671 554 -390 1102 764 -673 898 807 -977 -283 611 -930
697 -930 -1270 105 -517 -1840 311 -102 -1670 -541 139 -793 -920 530 -120 -311 989 644 119 704
715 704 1138 213 499 1426 719 127 916 590 -137 63 687 -249 -579 235 -447 -1469 -68 -310 -1550
734 -1550 -125 -69 -1248 -427 161 -581 -660 668 299 -855 750 744 -29 835 1437 208 594 1234 543
753 543 173 1095 541 -435 118 696 -591 -634 228 -704 -1058 -269 -808 -1270 -366 -37 -707 -556 138 -222
773 -222 -774 338 686 -713 329 1007 89 525 1209 288 -316 1056 938 -537 598 822 -696 -345
791 -345 678 -531 -662 268 -411 -1218 -248 -105 -1138 -808 278 -904 -649 478 -323 -362 456 202 -40
$$ packed form
661a247J649P4j503M74O46q98l55R85k17q84O56P62j486O29J354j003j96J215
679F55P4j028P70J045j486K03J438j117r44J492l38j437J571r1j784O94Q94j541
697i30l40J375o22j323K151m13j568J129O80r32j27J450o50j91J300l45n25N85
715G04M34r25K86R27p07n92P89l26p27K00O24r36l30Q14o82j022J401k42j240
734a550J425N6j179Q21N88p42p9J328l69j154J605op73Q64O02j229L86O40o91
753E43l70R22n54r76N53N78j287m3Q62r32l54P89n39m62R04L29o70J51O94l60
773b22n52J112L48j399J042O78r18M36O84r21o04J372j18j475J135K24j518L51
791c45J023j209j31R30o79q07R70J43j033L30J086j182K55J127q01l9Q18k54k42
$$ plain form
810 -40 279 913 617 4 1091 645 -32 628 635 -335 258 874 -219 -504 376 -426 -943 -344 -51 -1030 -317
831 -317 -190 -1128 -610 90 -669 -721 361 118 -240 73 553 10 466 1243 279 -96 1280 224 -179 917
851 917 457 -125 342 303 -62 -460 297 -187 -1216 -304 -353 -1140 -408 -211 -898 -615 42 -216 -721 75 428
872 428 -374 292 1056 31 192 1331 470 227 842 647 5 697 626 -186 -413 709 -166 -859 281
891 281 -354 -1156 -303 -390 -703 -588 -414 -618 -811 -131 -53 -601 424 411 -265 296 765 228 291 971 395
912 395 257 514 643 -81 188 582 -106 -10 478 -161 -552 -135 -225 -1070 -584 -87 -1194 -692 124 -408 -554
933 -554 271 -100 -543 344 363 -132 355 878 275 392 1017 657 31 876 517 -461 382 733 -427 -222
953 -222 7 -349 -470 -532 -351 -872 -412 -96 -889 -622 19 -237 -593 111 155 -152 47 474 426 -84 784
$$ packed form
810d0L19O34k96o13J087m46o77O60Pr70N93O16j093k85Q80q02n17N99K93r79P13
831c17J27r38N18P00p59n2J082k43l58L13M80n43M56P77r64l75J376j056m03J096
851I17m60n82M67l9l65l98P57m84j029R12m9p87P32J97o87K83O57k58n05P96L53
872D28q02O66P64j025J61J139q61k43O15j95o42O92p1q12k27J122q75o93J140
891B81o35q02Q53q7l13J15J74k04j93O80P8n48J025j3o76N61M69n37O3O80n76
912C95j38K57J29p24K69L94o88R6M88o39l91M17r0q45M86M97j107N02Q16n32j46
933e54Q25l71m43Q87J9m95M87N23o03J17O25l60o26Q45l59r78Q43L51j160K05
953b22K29l56j21o2J81n21M60L16p93K67O41k56l56P04M4l07J99M27m8n10Q68
$$ plain form
974 784 604 30 688 962 -23 380 804 73 -204 318 168 -677 -59 107 -816 -380 -323 -1257 -551 -421 -824
995 -824 -668 104 -205 -384 147 130 -241 285 511 -85 115 649 329 164 471 266 504 393 214 247 -51
1016 -51 280 -188 -626 -228 -243 -594 -290 -336 -495 -457 -108 -278 -763 -141 161 -295 156 427 -321 128 1040
1037 1040 1 189 822 495 123 464 665 -100 364 542 -319 -292 515 -230 -325 23 -102 -1087 -411 -131
1057 -131 -542 -690 -212 -252 -830 106 42 -190 -82 247 161 71 303 408 288 425 663 86 351 852 44
1078 44 -34 387 72 -328 190 3 -464 -412 -20 -314 -795 -221 -807 -662 -20 -426 -362 226 -69 -242 50
1099 50 160 446 274 398 251 311 757 619 -53 442 637 -29 171 204 -25 -125 -182 -118 -558 -427 -82 -590
1121 -590 -594 -168 -376 -632 -189 -249 -524 42 343 36 74 715 120 297 759 447 79 738 526 185 152 436
$$ packed form
974G84j80n74O58K74r85M03M24p31k77N22j50q45O18J66r23M36N7r34P06J30m03
995h24J56P72l09j79N31j7l71N26K26n96K00N34l20j65L07k05K38j11j79L3k98
1016e1L31m68m38L98j5l51L04m6j59L8L49j70m85O22L02m56M51K71p48M49R12
1037A040j039J88O33l27l72L41K01p65M64J78q61K7Q07p45r5L48j25r85O76K80
1057a31m11j48M78m0n78R36o4k32J08L29q6r0K32J05j20J37K38n77K65N01q08
1078D4p8M21l15m00N18j87m67N2L92k94m81N74n86J45O42m06O4N88k95j73K92
1099E0J10K86j72J24j47O0M46j38o72M95J95o66K00L3k29j00n7O4m40J31L45n08
1121e90mM26k08k56M43o0k75N66L01l07L8O41n95J77M62l12l68O59k12l41l3K84
$$ plain form
1143 436 173 -75 361 -27 -513 -7 168 -654 -376 -267 -515 -526 15 -285 -529 -483 -101 -57 -403 318 58
1164 58 -218 335 369 191 503 421 440 209 754 254 -178 602 5 -263 360 -346 -627 -240 -99 -505 -211
1185 -211 -494 -265 -502 -472 -47 -670 166 52 -128 173 176 -309 336 403 287 261 473 458 266 63 569 228
1207 228 18 684 49 -268 342 -165 -361 -389 -8 -447 -707 -16 -422 -675 -181 -208 -582 -204 -22 102 40
1228 40 184 101 164 589 591 132 603 555 175 218 657 101 126 447 78 -116 -96 -185 -539 -604 -4 -422 -657 -413
1252 -413 -442 -403 -344 -97 -231 -203 456 3 286 672 360 -11 495 432 -72 454 584 239 343 232 48 -167
1274 -167 -315 81 -358 -106 -58 -556 23 -250 -799 -367 2 -373 -448 -369 105 -416 -96 273 -93 -240 305
1295 305 270 54 449 163 449 437 496 145 210 419 358 -181 13 228 -291 -12 -202 -653 -374 -323 -342 -467
$$ packed form
1143D36k63k48M36l88m86N06J75q22K78J09k48j1N41l00k44M6L82M4l46P21k60
1164E8k76N53L4j78L12q2J9k31N45n00m32P80n97k68O23p06k81L87J41m06K94
1185b11k83K29k37L0M25o23Q36j14j80L01Lm85O45O7j16k6K12j5j92k03N06l41
1207B28k10O66o35l17O10n07j96k8L81m39k60O91m06k53M94k7l74L78J82J24o2
1228D0J44q3O3M25Km59M71m8l80M3M39n56K5L21l69j94K0q9l54o5O00m18k35K44
1252d13k9L9N9K47j34K8O59m53K83L86l12l71N06o3n04N26J30l45J04j11j84k15
1274a67j48L96m39K52M8m98N79k73n49M32L69l75p5P9M74n21L20L69l66j47N45
1295C05l5k16L95k86K86j2N9l51O5K09o1n39J94K15n19K79j90m51K79N1j9j25
$$ plain form
1317 -467 -194 -182 -534 -272 344 -68 -310 164 47 373 482 583 278 505 513 370 396 497 218 -16 91
1338 91 97 158 -152 101 -481 8 -271 -226 -331 -364 -511 -587 -334 -202 -307 57 24 -177 -49 112 356 138 405
1361 405 426 137 274 522 154 464 328 187 -19 387 116 181 -134 -215 -311 -449 96 -445 -665 -158 -259
1382 -259 -299 -241 -291 -237 -1 212 -154 -152 176 279 66 369 401 284 366 399 83 -3 200 93 41 52 239 -542
1406 -542 -198 161 -408 -200 -319 -108 -502 -70 -257 -334 -351 -232 -86 -330 154 193 -182 236 330 -101 227
1427 227 375 -60 409 506 199 415 337 359 -106 145 51 -336 76 -447 -520 -337 -123 -534 -168 -181 -363 -275
1449 -275 -385 -173 -149 141 143 207 158 232 410 343 248 387 465 287 273 175 143 293 37 -151 -152 -69 -212 -176 -202 -630
1475 -630 -279 -113 -264 -652 -330 7 -655 -163 77 -338 -20 115 84 130 292 214 140 229 614 380 255 488
$$ packed form
1317d67K73J2l52K62O16m12k42M74j17L26J09J01l05K27Qj43K6J01k79k34J07
1338I1OO1l10K53n82M89k79M5j05l3j47p6K53J32j05L64l3k01J28J61K44k18K67
1361D05K1k89J37K48l68L10j36j41k06M06k71O5l15q1r6j38N45n41k20N07j01
1382b59m0N8n0N4K36K13l66KL28J03k13L03L2j17Q2L3l16q6K03j07n2J1J87p81
1406e42L44L59n69K08j19K11l94M32j87p7j7J19J46k44M84L9l75M18R4m31L28
1427B27J48m35M69R7l07K16p8K2m65K51r4l87M12n23p3J83K14m11L66j3j82Q8
1449b75j10K12K4K90KO4m9P4J78o7r5J39P8j78j4r8l2J50k56j88jQ3j43L6k6m28
1475f30L51J66j51l88L22L37o62M92K40m15L18J35l1M6J62p8p4Q9L85k34j25K33
$$ plain form
1497 488 253 -53 137 313 -56 -219 67 -119 -525 -164 -423 -327 -159 -206 -506 -334 -270 -283 -252 158 -152 124
1519 124 -23 393 91 -94 458 405 132 361 412 210 421 2 -129 240 99 -203 -48 57 -186 -188 -66
1540 -66 -212 -155 -289 -495 -152 -265 -125 -41 -93 75 -14 7 270 312 18 303 481 268 332 436 91 313 268
1563 268 27 -347 -105 -54 -359 -85 -219 -193 -180 -384 -472 -545 -245 -100 -80 -388 -5 -164 -201 208 24 122 412
1586 412 438 198 202 240 255 154 300 273 -4 426 359 105 206 -7 -72 -37 -55 -223 -227 -369 -205 -567 -160 -171
1610 -171 -179 -229 33 -51 -174 -34 83 215 269 269 24 -13 492 505 257 361 143 141 292 -58 -232 -71 -173 -132
1634 -132 -312 -76 -230 -474 -178 -279 -433 -432 -201 -66 -44 26 -292 -151 147 274 144 125 385 279 308 638
1656 638 186 206 373 251 202 -11 200 -177 -228 90 -83 -168 101 -293 -259 -307 -49 -257 -40 -114 -246 -76
$$ packed form
1497D88k35l06J90J76l69j63K86j86m06L61k59R6J68m7l00J72O4j3L1M10l10K76
1519A24j47M16l02j85N52n3k73K29N1k02K11m19j31L69j41l02J55J05k43kJ22
1540f6j46N7j34k06L43j13J40Q4n2J68q9K1K63M2k94K85J78k13O4J04l45K22m5
1563B68k41l74K42N1l05K74j34K6J3k04q8p3L00J45K0l08L83j59l7M09j84R8K90
1586D12K6k40ML8J5j01J46k7k77M30o7k54J01k13o5L5j8j68mj42J64l62M07j1
1610a71qn0K62q4j23J40J17J32N4%k45l7N05J3k48J04k18kJ51l50j74J61j02M1
1634a32j80K36j54k44K96j01j54JK31J35K2P0l18J41K98J27j30j9K60j06K9L30
1656F38m52K0J67j22m9k13K11l77n1L18j73q5K69l94L4m8K58k08K17p4j32J70
$$ plain form
1678 -76 -60 -106 24 277 244 81 184 354 177 278 329 270 139 207 267 19 34 225 -147 -107 -118 -25 -182 -234
1702 -234 -45 -243 -285 -334 -207 -232 -83 -190 -132 -36 -204 -109 64 274 135 224 431 211 253 349 188 -28 11
1725 11 263 -131 119 -433 -363 -145 -317 -311 -173 -155 -228 -426 -284 -116 -94 -36 34 13 -254 123 163 326 74 244
1749 244 158 187 428 252 244 330 325 -134 136 263 -57 -18 84 45 -471 -55 -333 -340 -54 -118 -210 -206 -3 -276 -222
1774 -222 -159 -195 27 -10 65 140 287 210 -59 64 497 231 164 122 380 217 -21 238 181 -68 -265 -65 -141
1797 -141 -141 -159 -308 -298 -244 -326 -39 -77 115 -355 -235 232 -92 -7 109 -90 312 386 185 353 135 120 189 218
1821 218 98 54 -297 10 114 -30 -353 -257 -303 -214 -116 -199 -205 -98 -329 -163 -268 14 -146 -156 30 -288 22
1844 22 303 245 313 435 294 16 350 189 47 405 358 49 108 -34 -8 140 -176 -195 -128 57 -143 -288 -396
$$ packed form
1678g6J6m6J30K53l3j63J03J70j77J01N1n9j31O8O0k48J5J91l72M0j1R3j57n2
1702b34J89j98m2m9J27k5J49j07N8R6j68R5J73K10j39Q9K07k20M2R6j61k16L9
1725A1K52l94K50n52P0K18j72OJ38J8p3j98J42J68K2N8P0k1k67L77M0J63k52J70
1749B44q6K9K41j76qQ6nm59K70J27l20L9J02l9n16M16k78pK86o4r2MK03k73N4
1774b22O3l6K22l7P5P5J47p7k69J23M33k66o7m2K58j63k38K59n7k49j97K00p6
1797a41%j8j49J0N4q2K87l8J92m70J20M67l24Q5J16j99M02P4k01J68k18j5O9K9
1821B18j20m4l51L07J04j44l23R6m6Q9R8q3oJ07k31J66j05K82j60j0J86l18L10
1844B2K81n8O8J22j41k78L34j61j42L58m7l09N9j42K6J48l16j9O7J85k00j45j08
$$ plain form
1867 -396 -385 -109 -245 34 -84 -241 25 126 -155 275 551 511 367 135 130 -14 326 391 123 217 9 -42
1889 -42 -188 -331 -241 -28 -73 -41 -301 -118 -135 -201 -234 11 -351 -206 -151 -384 -165 80 135 85 56 348 218 65
1913 65 349 -117 -35 332 102 -21 299 -35 58 -91 -109 -137 -236 -249 -472 -336 -76 -233 -265 -33 -130 -229 -62
1936 -62 -73 76 105 -40 346 159 259 359 191 343 444 280 248 219 348 139 171 168 336 -230 205 -165 -262
1959 -262 -64 -258 -158 -449 -385 -366 -268 -20 -340 -38 -195 -112 0 -32 404 72 155 176 -82 220 648 396
1981 396 256 41 505 157 24 1 -182 -150 -193 -160 273 -406 -204 -394 -267 -191 -199 -231 109 21 80 25 -189 -110
2005 -110 144 290 34 127 239 181 190 258 333 52 120 264 -182 173 -65 -77 48 -292 -226 -245 -199 -164 -266 -96
2029 -96 -327 -384 -204 -273 172 166 117 45 84 100 139 119 383 190 179 349 -80 101 -2 113 -91 -30 -18 62 -229
$$ packed form
1867c96J1K76j36K79j18j57K66J01k81M30K76m0j44k32nj44L40O5k68R4k08n1
1889d2j46j43R0K13m5L2k60J83j7o6l3K45l62J45N5k33K19K45N5n0k9K92j30j53
1913F5K84m66Q2L67k30j23L20l34R3j49j8k8r9j3k23J36K60j57l2K32r7r9J67
1936f2j1J49K9j45L86j87J00J00j68J52J01j64l2k9J29k09L2lJ68n66M35l70r7
1959b62J98j94J00k91O4J9R8K48l20L02j57Q3J12l2M36l32Q3K1k58L02M28k52
1981C96j40k15M64l48j33k3j83L2m3L3M33o79K02j90J27P6ql2L40q8N9n5k14P9
2005a10K54J46k56R3J12n8RO8P5k81O8J44m46L55k38j2J25l40O6j9M6L5j02J70
2029i6k31n7J80o9M45om9p2L9J6L9k0K64j93j1J70m29J81j03J15k04O1J2Q0k91
$$ plain form
2054 -229 -92 4 -113 -415 -253 -255 -402 -199 -71 -76 -311 -85 -42 -25 154 -58 -160 74 236 39 -110 431
2076 431 124 339 268 112 186 224 59 -17 -184 205 -92 -395 -137 -79 4 -128 -74 -175 -107 -108 -37 -187 -166 198
2100 198 -179 64 27 -207 -103 122 235 207 319 -10 133 -52 282 56 13 -31 -2 -140 -49 -96 -271 -68
2122 -68 -46 -27 -278 -232 -245 -196 -428 -77 -135 307 -28 -72 267 231 227 84 200 257 61 -10 150 228 293 326 33
2147 33 81 -12 -97 -161 -164 123 -256 -147 -388 -133 -115 -35 -337 -109 -44 -157 -200 -132 63 -31 70 155 231 221 173 243
2173 243 119 390 290 129 208 205 68 -36 -213 -273 28 -151 49 -204 -297 -129 -215 -276 -253 -106 73 -146 -73
2196 -73 -188 -99 -143 104 184 18 192 278 362 371 276 445 251 469 124 -99 216 118 -2 98 210 -124 -309
2219 -309 -64 -366 -2 -238 -107 -163 110 -18 -379 41 33 -120 203 275 129 329 252 -5 217 332 18 87
$$ packed form
2054b29J37R6j17l02J62kj47K03J28nk35K26M3J7J79k12j02K34J62j97j49N41
2076D31l07K15p1j56P4L8j65p6j67L89k97l03K58N8Q3j32N4j01O8jP1j50K1L64
2100A98l77K43l7k34J04K25J13k8J12l29J43j85L34k26m3m4K9j38R1m7j75K03
2122f8K2J9k51M6j3M9k32L51n8M42l35m4L39l6mj43J16N7j96p1J60P8O5L3k93
2147C3M8r3q5o4lK87l79J09k41K55J8Q0l02K28O5j13m3O8J95r4J01Q5P6j0m8P0
2173B43j24K71j00j61P9lj37j04j77o0L01j79K00k53r3J68q6o1K3J47J79k19P3
2196g3j15Q9m4K47Q0j66J74Q6Q4Rr5J69j94K18l45k23L15r8j20J00J12l34j85
2219c09K45l02L64k36J31n6K73j28l61M20qj53L23P2j46K00p7k57K22J15l14O9
$$ plain form
2241 87 183 140 -91 82 131 77 -44 -263 -178 -458 25 -232 42 -15 -266 -274 -217 19 -138 45 57 -168 95 106
2265 106 102 123 326 352 250 324 94 -39 106 275 128 110 184 -49 -25 154 146 6 -260 -92 -252 -350 -299 -249
2289 -249 -303 -172 -74 -123 -49 -113 143 247 102 261 140 -49 216 133 238 72 -16 112 -6 93 90 48 39 -163
2313 -163 -11 -169 -354 -349 -61 -187 -341 -384 122 -111 -99 67 191 -116 236 189 -48 105 197 218 354 214
2335 214 462 384 162 -20 60 231 146 -240 131 43 -48 94 -226 -62 -262 -28 -137 -165 -226 152 -235 -234 195
2358 195 -135 100 304 -71 143 455 -30 171 164 264 227 56 43 231 68 -96 235 -169 -103 -57 -58 -35 46
2381 46 -285 95 -396 -215 -122 20 115 -103 -139 -124 -302 -163 210 393 316 268 216 225 3 -1 208 -130 262 100
2405 100 -107 -29 2 71 270 -32 -62 -29 -133 -160 -257 -114 -97 -103 -419 38 -196 -98 -35 132 69 -7 267 183 -8
$$ packed form
2241H7R6m3k31J73M9n4j21k19Q5k80M83k57K74n7k51qN7K36j57J83J2k25K63J1
2265A06mK1K03K6j02P4k30j33J45J69j47j8P4k33K4J79qj40k66J68j60r8N1N0
2289b49n4J31R8m9P4o4K56J04j45J59j21j89K65q3J05j66q8J28j18R9lm2rk02
2313a63J52j58j85NK88j26j54m3N06k33J2J66J24l07L52m7k37J53R2K1J36j40
2335B14K48p8k22j82Q0J71q5l86L71q8r1J42l20J64k00K34j09k8o1L78l87JM29
2358A95l30K35K04l75K14L12m85K01pJ00l7j71j3J88j63j64L31m04O6M6jK3Q1
2381D6l31L80m91J81R3J42R5k18l6J5j78J39L73J83p7m8n2Rk22mK09l38L92j62
2405A00k07P8L1O9J99l02l0L3j04k7r7J43J7ol16M57k34R8O3J67o3p6K74q4j91
$$ plain form
2430 -8 267 101 192 99 218 197 296 70 78 -10 -259 -145 -264 230 -216 -133 -143 -107 -76 -51 -274 -239 -123 -272 -237
2455 -237 75 275 -113 -132 143 200 70 -16 169 75 265 145 228 221 21 140 91 -47 -68 -221 -173 60 -77
2478 -77 -139 -352 -178 -77 -370 -28 14 -355 -33 157 54 219 16 138 -93 95 230 396 137 21 317
2499 317 330 11 -173 43 -23 27 127 21 -378 -184 -96 -247 26 -67 -120 -69 -131 -172 -73 -52 -60 -435 17 189
2523 189 -100 155 -74 -113 -164 131 303 66 184 51 37 -181 197 40 -189 119 -133 296 -281 -27 -75
2544 -75 -179 -147 -140 -12 126 -132 -20 -172 -167 86 219 224 244 263 140 152 -3 303 386 114 97 -89 152 -1
2568 -1 -189 -65 -187 -238 -111 190 -374 38 -168 -272 -199 -182 -210 41 -216 71 -92 78 45 -36 175 315 12
2591 12 -54 265 111 212 -55 105 448 84 116 35 -158 80 -47 -174 -82 -275 -218 14 -187 -119 -80 -180 40
$$ packed form
2430hK75j66R1r3J19k1R9k26Qq8k49J14j19M94m46Q3j0L6L1K5k23L5J16j49L5
2455b37L12K00l88j9K75N7j30q6J85r4J90j20Q3pk00J19m9j38k1j53M8K33j37
2478g7o2k13J74J01k93L42M2l69L22J90j03J65k03J22k31J88J35J66k59j16K96
2499C17J3l19j84K16o6N0J00j06l99J94Q8j51K73r3n3N1o2m1R9K1ql75M52J72
2523A89k89K55k29l9n1K95J72k37J18j33j4k18L78j57k29L08k52M29n77K54m8
2544g5j04L2PJ28J38k58J12j52NK53J33NK0J9j23J2j55L06Q3k72j7j86K41j53
2568aj88J24j22n1J27L01n64M12k06j04P3J7k8K51k57K87j63J70l3q1K11J40l03
2591A2o6L19j54J01k67J60L43l64L2q1j93K38j27j27R2j93N7K32k01O8L9j00K20
$$ plain form
2614 40 -37 45 99 142 106 75 221 -182 305 172 61 -6 292 91 139 26 -161 49 231 -146 -41 210 -187
2637 -187 52 -166 -18 6 -247 48 93 39 3 -163 23 196 -48 47 99 127 377 95 233 204 -167 67 44
2660 44 106 269 223 59 212 110 -17 36 -46 30 -117 -354 29 -212 -323 -118 -288 56 109 -208 -43 -108 37
2683 37 69 37 77 -26 233 123 120 157 257 19 158 203 -4 120 -109 193 210 -255 -256 176 64 -199 19 -78
2707 -78 38 -14 -155 -255 -27 -78 72 2 50 34 45 90 -18 -25 121 296 66 203 -90 189 249 4 -51 -46 -50
2732 -50 -75 17 -215 -52 114 -127 -150 -42 -384 5 -240 156 -176 -99 147 57 270 113 115 155 283 85 13
2755 13 241 210 144 57 96 163 -1 -109 -30 -102 -155 -61 102 -112 -399 -215 -209 -97 -93 -186 105 -165 -89 -38 93 20
2781 20 117 -6 150 80 -94 46 109 105 -2 80 198 109 66 204 71 148 187 -285 -124 -201 -35 -343 -374 -142
$$ packed form
2614D0p7Q2N4M3l6l1J46m03M87j33j11o7K98k01M8j13j87K10J82l77J05K51l97
2637a87K39k18J48K4k53K95M5n4l6j66J86J73k44R5N2K8K50k82J38k9l71K34k3
2660D4O2J63m6j64J53j02j27N3q2P6j47k37L83k41j11K05j70L44N3l17J65o5J45
2683C7L2l2M0j03K59j10lL7J00k38J39M5k07J24k29L02J7m65jM32j12k63K18r7
2707g8J16n2j41j00K28n1J50p0M8j6J1M5j08pJ46J75k30J37k93K79O0k45n5Nm
2732e0k5R2k32J63J66k41k3J08l42L89k45L96l32P7K46r0K13j57KM0J28j98p2
2755A3K28l1o6q7L9O7j64j08P9p2n3R4J63k14k87J84OJ12Mr3K91k70P6N1J31p3
2781B0R7j23J56p0j74J40O3mj07Q2J18q9m3J38j33P7L9m72J61p7J66l08l1K32
$$ plain form
2805 -142 -368 -15 -156 -119 -204 -88 121 34 15 -22 239 63 202 -182 11 241 -101 25 38 52 -85 71
2827 71 148 -94 -173 192 73 -85 -13 -151 52 -101 -247 84 -224 76 -352 65 87 -104 30 -88 127 -203
2849 -203 99 364 336 -75 169 12 142 140 -111 79 -62 50 107 49 -49 -243 -107 -185 34 -29 -98 -125 -216 -91
2873 -91 -143 -3 100 15 21 -9 21 -262 41 156 330 319 51 326 39 24 -38 98 164 -89 223 -78 50 38
2897 38 158 -122 10 -65 -153 -190 -211 -150 -15 -48 -116 -70 -313 60 191 285 -112 13 285 122 84 -25 228 -28
2921 -28 73 26 -39 -349 -53 50 -249 -18 -242 -117 53 17 -322 -49 -280 122 -136 9 126 -100 156
2942 156 -217 81 184 -24 387 176 211 -15 32 -104 80 1 -142 145 -18 -241 -24 -76 -222 -95 -241
2963 -241 72 -275 -178 -67 -292 -220 199 -149 12 -128 34 25 -11 -61 -270 -411 45 128 134 -72 219 211 148 154 55
$$ packed form
2805a42k26L53j41L7q5J16K09q7j9l7K61j76J39l84J93K30l42J26J3J4j37J56
2827G1P7k42p9L65j19j58P2j38K03j53j46L31l08L00m28M17K2j91J34j18K15l30
2849b03L02K65k8m11K44j57J30kk51J90j41J12N7n8r8j94J36p8K19o3o9k7r1J25
2873i1n2J40J03q5Ol0L0k83L03J15J74j1k68K75k87j5o2J36O6k53L12l01J28j2
2897C8J20k80J32p5q8l7k1O1J35l3o8M6k43L73J31R4l97J25K72j63l8j09K53k56
2921b8J01m7o5l10K96J03k99K31k24J25J70l6l39K73k31M02k58J45J17k26K56
2942A56l73K98J03k08M11k11L5k26M7j36J84p9j43K87j63k23K17n2j46J27j46
2963b41L13l47R7J11k25P2M19l48J61j40J62rl6n0k09j41M56Q3Ok06K91qo3Or9
$$ plain form
2988 55 -115 11 1 21 19 85 -72 -137 -151 -211 231 -180 -138 -12 19 150 254 -2 263 157 65 225 86 77 45
3013 45 94 111 -18 67 132 291 132 34 -3 117 -186 -141 95 -168 -183 -463 -137 -280 -90 -8 -200 4 -22 167
3037 167 31 -102 -177 32 -87 135 80 37 164 68 -11 226 74 -24 -106 -28 215 0 -113 -290 -88 5 -73
3060 -73 -83 -156 -57 -124 48 127 -439 126 71 -8 88 165 -200 -69 67 -29 251 -66 -27 -122 359 -25 70 -11 60
3085 60 385 115 -135 -53 -21 -349 -196 -128 -146 -487 -376 -279 30 8 -203 304 -133 70 124 -27 20 184 22
3108 22 131 37 148 -103 -34 -207 270 169 -14 -66 272 -109 -129 -96 60 -50 17 -34 -49 -223 -93 -91 -57 -94
3132 -94 -51 147 106 145 -185 -13 -98 190 92 9 261 -70 -7 -104 153 -145 192 -34 -199 -190 -1 38 -113 -40
3156 -40 -176 -80 -142 -16 -142 55 -147 -192 -40 12 77 74 7 -104 295 -151 241 -2 77 332 318 -202 64 52
$$ packed form
2988E5j70J26j0K0kO6j57o5j4o0M42m11M2J26L1J31J04k56K65j06r2J60j39rl2
3013D5M9J7j29Q5O5J59j59r8l7J20l03M5K36k63j5k80L26j43J90Q2j92K04k6J89
3037A67j36j33p5K09j19K22n5m3J27r6p9K37j52r8q2P8K43k15j13j77K02R3p8
3060g3j0p3R9o7J72P9n66N65n5p9R6P7l65J31J36r6K80l17L9r5M81l84R5q1P1
3085F0L25k70k50Q2L2l28J53O8j8l41J11R7L09k2k11N07m37K03N4j51M7J64j62
3108B2J09r4J11k51O9j73M77j01j83n2L38l81k0L3J56j10O7n1j5j74J30KL4l7
3132i4M3J98m1L9l30J72q5K88r8q3K52l31O3r7K57k98L37k26j65RJ89L9j51P3
3156d0j36R6o2J26j26J97k02m5J52N2O5lo7j11L99m46L92k43P9K55j4n20K66j2
$$ plain form
3180 52 98 49 190 221 -115 -169 -314 -10 -145 118 -263 109 -364 -14 1 -116 60 -133 30 15 234 37
3202 37 -15 531 263 115 142 94 143 -44 69 104 -54 -41 65 20 -63 17 -50 -53 -57 -35 -399 47 -368 -224 -66
3227 -66 40 -156 -42 -136 208 -119 104 66 183 50 282 367 -1 114 -21 224 -22 303 91 326 287 -180
3249 -180 21 -349 -128 -106 -100 -88 142 -163 -211 -90 -158 70 -274 129 -41 129 118 -117 -84 -88 119 198 -8 187
3273 187 73 84 -54 43 -16 53 -36 -88 221 -222 53 22 -145 -6 -163 62 -85 -129 -143 165 -66 214 30
3296 30 -46 288 171 -168 3 65 270 166 -1 -82 -6 298 -13 28 84 -23 -302 -223 -210 -26 -50 12 -103 -10
3320 -10 -171 -191 -21 -165 18 54 -169 -24 -419 21 44 57 148 19 26 157 -73 253 112 -57 -220 -75 141
3343 141 88 159 -49 -160 185 -76 -129 -88 -152 -113 -20 -95 -99 -205 143 -5 32 7 18 5 -37 -319 -244 -192 122 130
$$ packed form
3180E2M6m9J41L1l36n4j45L04j35K63l81L72m73L50J5j17J76j93J63j5K19j97
3202C7n2N46k68j48K7m8M9j87J13L5j58J3J06m5q3Q0o7lmK2l64M46m15J44J58
3227f6J06j96J14r4L44l27K23l8J17j33K32Q5l68J15j35K45k46L25k12K35l9m67
3249a80K01l70K21K2OJ2K30l05m8J21o8K28l44M03j70J70j1k35L3mK07P9k06J95
3273A87j14J1j38R7n9O9q9n2L09m43K75l1j67J39j57K25j47m4j4L08k31K80j84
3296C0p6L34j17l39J71O2K05j04j67q1P6L04l11M1N6j07k79P9J3J84k4O2j15R3
3320a0j61k0J70j44J83L6k23J45l95M40K3J3R1j29PJ31k30L26j41j69j63J45K16
3343A41n3P1k08j11L45k61n3M1o4L9R3p5mj06L48j48L7k5J1j3m2k82P5N2L14Q
$$ plain form
3369 130 195 155 111 -37 52 125 -187 195 -94 290 80 172 -126 35 69 -117 -148 136 40 -107 215 102 -41
3392 -41 -78 223 -99 73 100 83 71 242 276 -77 206 -22 97 -17 -37 -86 -16 -32 -38 -149 -62 -32 61 -96 -13
3417 -13 173 -82 -108 -221 -86 -153 113 -133 87 120 -76 55 145 30 121 41 126 113 175 6 22 351 -71 -133
3441 -133 174 -131 -184 -88 -6 55 -15 10 -71 -223 -28 -171 6 -193 90 74 -129 -35 107 175 132 -137 16 -69
3465 -69 -167 204 56 38 -82 170 29 -19 -199 68 48 -204 105 -293 -7 -41 -4 33 80 -21 1 65 -139 97
3489 97 -77 -187 172 120 -72 -196 93 273 21 145 144 90 14 163 -49 105 110 -55 -77 -3 95 29 -200 -217
3513 -217 -189 -180 34 177 -184 25 -65 96 214 -77 173 -55 -112 52 376 180 161 -106 -56 170 -146 148
3535 148 319 -60 -48 5 67 -23 -79 -242 -84 -54 -171 -332 -129 147 139 58 105 -55 -126 -303 -134 32 261 117
$$ packed form
3369A30O5m0m4j48Q9P3l12L82k89L84k10R2k98J61L4j86l1K84r6j47L22j13j43
3392d1l7L01l22J72K7j7j2J71L4l53K83k28J19j14k0m9P0j6oj11Q7L0R3j57Q3
3417a3J86k55k6j13J35o7K66k46K20L3j96J31R0j15R1q0Q5j3O2j69J6L29m22o2
3441a33L07l05n3R6Q2O1p0K5q1j52J95j43J77j99K83j6k03R4J42O8m3k69J53q5
3465f9r8L71j48j8j20K52j41m8j80K67k0k52L09l98K86l4L7L7M7j01K2O4k04K36
3489I7j74j10L59n2j92j24K89J80k52J24jn4p6J49k12J54Nj65k2P4R8o6k29j7
3513b17K8RK14J43l61K09r0J61J18k91K50k28n7J64L24j96j9k67N0K26l16K94
3535A48J71l79J2N3O2r0n6j63J58L0j17j61K03K76qq1M7j60p1j77J69J66K29j44
$$ plain form
3559 117 -56 -92 36 -17 -134 281 -220 -164 177 -168 49 183 -118 -38 -96 -97 -334 -24 -191 75 255 -78
3581 -78 133 -231 -158 28 -111 -146 19 82 108 2 53 274 86 163 53 72 -68 -12 322 27 194 200 109 -65
3605 -65 124 3 -109 -271 -137 -289 -50 -154 72 -149 -70 44 -229 -3 10 217 -10 -13 230 260 95 429
3627 429 44 7 232 -25 -142 177 279 228 -33 255 102 -20 -49 -23 -16 -106 84 4 -198 -81 -64 87 -83
3650 -83 -13 -87 -6 160 -35 -15 35 392 -47 -7 -30 199 31 217 25 241 235 -160 -21 61 -97 192 34 -70
3674 -70 -197 -159 83 221 -76 -96 13 -322 -13 -36 78 101 -185 -135 58 197 294 242 61 141 10 117 -26
3697 -26 46 158 22 -3 -16 170 -145 -157 38 -67 -216 -34 9 70 -110 21 -148 157 80 -58 43 -88 273
3720 273 101 61 188 83 203 35 69 -145 130 29 45 110 89 -316 81 -199 188 66 -8 23 44 85 -155
$$ packed form
3559A17j73l6J28n3j17M15n01N6L41l45K17J34l01Q0n8jk37L10j67K66J80l33
3581g8K11l64P3J86j39l5J65O3K6j06N1K21j88P7j10J9j40N6L34k95J67Or1j74
3605f5J89j21j12j62J34j52K39j04K26k21P9J14k73K26J3K07k27lK43L0j65L34
3627D29l85l7K25k57j17L19J02n1k61K88j53j22k9K6Pr0J90q0k02J17J7J51j70
3650h3P0p4Q1J66j95K0N0L57m39M0k3K29j68J86j92K16ol95J39Q2j58K89j58j04
3674g0j27L8K42J38k97k0J09l35L09k3J14K3k86N0J93J39R7n2j81Q0j31J07j43
3697b6P2J12j36k5j3J86l15j2J95j05j49J82M3O1j80J31j69L05p7j38J01j31L61
3720B73j72m0J27j05J20j68L4k14K75j01J6O5k1m05L97k80L87j22p4L1K1M1k40
$$ plain form
3743 -155 173 116 -81 -177 22 130 63 -152 286 -94 -111 282 -104 39 284 -76 -128 96 -49 292 -41 -29
3765 -29 -98 -78 2 -89 -19 -16 -78 -223 168 -94 -7 30 -246 -41 41 -63 177 280 33 77 108 169 160 -126 35 -141
3791 -141 123 -78 184 -135 128 5 -29 187 -114 70 -101 -183 52 -30 -18 32 76 -138 258 -77 -35 -36 368
3814 368 311 58 189 175 104 102 -73 -34 -134 271 178 -86 99 -76 -122 -65 40 57 139 -100 -356 -377 59 -238
3838 -238 122 -56 5 -46 5 85 1 -50 -184 25 182 10 -15 -58 166 -121 95 404 8 177 -33 131 104
3861 104 201 66 -152 -119 4 -19 99 17 7 -164 -102 -125 132 -291 -185 109 -241 71 231 -51 -17 -54 48
3884 48 90 234 -164 -35 30 -21 197 -87 50 -49 208 -54 -137 146 -105 77 167 -291 0 -235 -22 -139
3906 -139 -170 77 11 173 30 27 -57 32 374 4 191 140 164 -41 178 240 -30 152 34 125 26 107 -97 -152
$$ packed form
3743a55L28n7j97r6J99J08o7k15M38l80j7L93l86J43K45l60n2K24j45L41l33J2
3765b9o9K0Q0r1P0Lo2j45L91k62Q7L7k76K05Q2j04K40J03k47M4L1O1rk86J61j76
3791a41K64k01K62l19K63j23l4K16l01J84j71q2K35q2J2N0M4k14L96l35M2jM04
3814C68n7k53J31j4p1kj75L9j00M05r3k64J85j75m6N7J05J7Q2k39k56k1M36k97
3838b38L60j78O1n1N1Q0q4n1j34K09J57j72k5m3K24k87K16L09l96J69k10J64k7
3861A04R7j35k18L3J23k3J18q2j0j71O2k3K57m23J06K94l50L12J60k82L4l7J02
3884D8M2J44l98J29O5n1K18k84J37r9K57k62q3K83k51J82R0m58K91k35K13j17
3906a39l1K47o6J62j43lq4Q9L42l70J87n1K4k05K19O2k70J82j18R1r9Q1k04n5
$$ plain form
3930 -152 -155 -183 -27 -332 -157 186 -198 -123 109 294 -178 81 78 -31 177 185 -34 16 51 360 -106 31 108 -154
3954 -154 121 -53 -74 14 -132 14 -318 80 -219 -36 359 -345 -143 -135 -183 -349 186 84 -53 102 260 63
3976 63 240 15 -147 -202 240 -16 -176 118 88 38 420 -117 83 130 167 -29 -28 -93 169 95 -5 125 -433
3999 -433 -62 -24 6 -21 -151 132 135 -101 -154 -32 -35 -230 17 -75 62 61 96 317 -59 97 -149 41 153 29
4023 29 103 90 -33 -189 -104 26 -67 -199 204 -310 70 24 41 101 57 13 75 -116 23 -253 35 -15 -45 -123 -112
4048 -112 159 -15 111 44 -226 173 -24 146 97 -175 -254 -77 65 -77 -3 -97 -59 5 -175 108 -168 -58
4070 -58 28 -215 -412 20 -105 120 133 -31 41 130 45 109 -40 -288 -158 -21 -99 16 -4 23 -6 17 -108 -254
4094 -254 161 -17 -330 19 36 11 112 -127 -191 182 91 100 229 76 -102 -92 111 153 3 -147 -158 264 7
$$ packed form
3930a52lk8J56l05J75L43l84P5K32J85m72K59lj09K08Qk19N0L5L09m66J37P7k62
3954a54K75j74k1Q8j46J46l32L98k99J83L95p04K02Qm8j66N35j02j37J55J58j97
3976F3J77k25j62n5M42k56j60K94l0n0L82n37K00M7L7j96Jo5K62p4j00J30n58
3999d33L71L8L0k7j30K83Lk36n3J22lj95K47r2J37jL5K21l76J56k46J90J12j24
4023B9P4j3j23j56Q5J30r3j32M03n14L80m6J7O0m4m4O2j91J39k76K88n0l0p8J1
4048a12K71j74J26o7k70L99j97J70m9k72p9J77J42j42P4r4L8O4j80K83k76J10
4070e8Q6k43j97M32j25K25J3j64P2Q9q5O4j49k48J30J37p8J15k0K7k9K3j25j46
4094b54M15j78l13L49J7k5J01k39o4L73r1RJ29j53j78J0K03M2j50j50j1M22k57
$$ plain form
4117 7 38 125 184 133 -34 81 212 8 -119 22 21 -81 -38 -241 -111 -109 -101 146 -111 -230 -23 129 -104 91
4141 91 84 -31 222 173 -103 -275 154 215 142 32 -314 -45 74 17 -264 17 -56 52 -6 99 49 -65 8 -38
4165 -38 -49 -92 136 49 162 128 66 -49 -27 -5 152 -54 28 34 -43 2 -8 177 -76 -104 99 -126 -278 -53 -70
4190 -70 -77 76 89 -45 75 -62 -11 74 209 239 120 67 -22 37 20 152 68 -139 260 26 156 -292 326 141
4214 141 -16 103 -132 27 337 -288 13 -116 -153 -113 8 50 -49 -65 127 -155 -107 -217 -232 174 47 -103
4236 -103 113 -6 -79 70 52 379 -1 225 -10 145 -158 -152 -36 101 -65 17 -21 -98 -213 115 -5 -198
4258 -198 55 -90 69 -264 -79 -41 65 -6 -23 -124 198 -83 297 -6 243 156 63 342 34 150 43 -26
4280 -26 -28 230 42 -154 -76 46 -252 69 -89 -84 159 -147 40 -203 -138 76 -320 220 98 -89 53 175
$$ packed form
4117GL1Q7N9n1j67J15J31k04j27J41jj02M3k03J30KQK47k57j19K07J52k33J95
4141I1pj15K53m9k76j72M29O1p3j10l46K69J19n7k81K81p3J08n8J05n0j14P3m6
4165c8j1m3K28q7J13l4o2j15K2K2J57k06Q2Op7M5j0J85k53k8K03k25j52K25j7
4190g0pJ53J3j34J20j37N1Q5J35L0j19n3q9N9j7J32q4k07L99k34J30m48O18j85
4214A41j57J19k35J59L10o25L01j29l7M0J21M2r9j6J92k82M8j10j5M06j27j50
4236a03K16j19p3J49j8L27l80K26k35J55l03OJ16J37j66Q2l8p7j15L28j20j93
4258a98K53j45J59l33J85L8J06p1j7j01L22k81L80l03K49q7r3K79l08J16j07o9
4280b6kK58j88j96P8J22k98L21j58NK43l06J87k43O5K14l96N40j22j87J42J22
$$ plain form
4302 175 -191 188 23 61 47 9 -54 212 24 122 7 315 174 -107 -4 -153 -332 -119 -78 -215 -213 -126 -5
4325 -5 1 -134 -29 -238 -14 293 -121 8 6 252 134 141 -25 88 47 97 -42 271 -128 -69 135 -70 -132 -159
4349 -159 121 0 151 68 -186 -40 301 8 38 147 -56 114 -186 255 41 175 54 190 68 8 144
4370 144 136 137 -130 197 -226 236 -119 -11 -128 -105 -41 -137 -315 -49 -47 132 62 -4 44 -11 26 8 -165 -101 15
4395 15 147 90 61 -209 134 95 -170 78 247 -38 11 210 -70 -27 -123 188 35 -100 -86 113 58 -137 -42
4418 -42 20 166 -184 -157 -227 -175 9 48 -14 -32 -80 -172 61 96 -146 216 -35 -97 449 326 121 66 89 -60 -98
4443 -98 -3 131 -83 -29 -41 -120 -205 76 46 -65 49 307 75 106 320 170 -10 42 31 92 66 -41 -266 325
4467 325 -41 -38 158 -175 68 270 -54 -131 -216 -128 -193 -119 19 -224 -179 31 129 -64 -79 22 19 -109 -44 -256
$$ packed form
4302A75l66L79j65L8j4l8o3K66j88R8j15L08j41k81J03j49j79K13M1j37KQ7J21
4325eOj35J05k09K24L07m14J29kK46j18Pj66J13m1N0j39L13l99N9K04k05o2k7
4349a59K80j21J51q3k54J46L41k93L0J09k03J70l00M41k14J34j21J36j22o0J36
4370A44qJk67L27m23M62l55J08j17K3O4r6j78K66KJ79p0o6M8n5L7j8j73O4J16
4395A5J32n7k9k70L43l9k65K48J69k85M9J99k80M3r6L11j53j35J4J99n5j95R5
4418d2O2J46l50K7p0N2J84L9o2j8m8r2K33L5k42L62k51o2N46j23k05n5K3j49l8
4443i8R5J34k14N4j2p9q5K81l0j11J14K58k32L1K14j50j80N2j1O1k6j07k25N91
4467C25l66LJ96l33K43K02l24p7q5Q8o5P4J38k43M5K10R8j93j5J01lj28O5k12
$$ plain form
4491 -256 192 327 -155 185 -74 -43 394 48 141 195 278 42 185 -68 -71 -54 206 -173 34 -305 -223 -30 23
4514 23 -13 83 -183 44 -101 113 -193 128 44 -25 98 90 -181 -14 -18 158 211 -184 -47 275 139 83 180 63
4538 63 -247 42 47 260 102 -95 144 -133 86 -33 105 -91 38 -135 -248 -243 -121 -181 67 6 30 -43 -149
4561 -149 -49 53 31 -37 -34 -16 -74 51 -65 -132 -51 58 -14 -117 -42 -113 -201 87 -81 -23 -37 79 -117 152 112
4586 112 15 -22 -156 -114 311 153 -45 164 8 52 118 71 -5 10 47 -29 -74 44 57 -80 206 -73 91 7
4610 7 -141 124 -260 3 149 125 -131 -79 27 59 163 47 204 -25 287 209 195 -56 48 -164 57 229
4632 229 23 -49 12 145 -163 4 -76 113 -117 -180 -227 15 43 -54 7 -129 103 36 -145 -10 85 -79 -28 214
4656 214 -99 -251 51 87 121 179 106 252 281 89 -18 22 96 -207 -105 69 -162 -52 259 -109 -82 -108 -217
$$ packed form
4491b56M48J35m82L40k59L1M37l46R3N4Q3k36J43k53lJ7K60l79K07l39Q2J93N3
4514B3l6R6k66K27j45K14l06L21q4o9J23qk71J67mJ76N3l95J37L22j36n6R7j17
4538F3l10K89NK13j58j97K39k77K19j19J38j96J29j73j13NJ22o0K48o1K4p3j06
4561a49J00J02k2o8LJ8n8J25j16o7Q1J09p2j03P5p1q8K88j68N8j4J16j96K69m0
4586A12r7l7j34M2M25j58j98K09j56M4O6m7p6J5L7p6m5J18J3j37K86k79J64q4
4610Gj48K65l84K63J46k4k56N2J06L2J04j16J57k29L12p8j4k51J04k12K21J72
4632B29k06p2O1J33l08J67q0J89k30o3m7K42K8r7O1j36K32o7j81J35R5j64N1K42
4656B14l13j52L02L6L4N8p3J46K9j92j07M0P4l03J02J74k31J10L11l68K7k6j09
$$ plain form
4679 -217 -24 -95 -215 -133 40 60 39 -161 167 -298 258 92 118 226 -115 -158 100 240 -16 -21 183 26 72
4702 72 27 42 176 178 -140 -163 -287 -122 -63 -203 -40 -289 130 -30 49 58 -126 -58 -112 -23 -169 73 97 34 58
4727 58 -44 -235 144 -193 -193 13 61 129 -288 -22 40 -212 -205 1 -233 194 -129 -3 24 -36 -9 60 96 62 16
4752 16 122 299 322 97 -35 15 -33 387 -142 -10 -41 -300 39 255 -8 73 -184 -113 -11 -301 191 50
4774 50 -58 232 -162 51 56 -144 -404 -189 42 6 69 207 178 -12 121 120 -56 -141 216 -83 -143 129 -123
4797 -123 52 110 181 36 -237 -1 155 77 110 131 -19 246 -20 53 -187 144 -104 144 81 87 198 10 -148
4820 -148 -19 134 -235 62 94 -142 -264 32 -295 125 49 -192 9 204 -227 -132 109 -302 -143 13 -47
4841 -47 75 -308 66 66 -41 -44 97 -72 24 185 -57 357 61 149 169 -137 76 -74 -114 -86 83 -7 54 24
$$ packed form
4679b17J93p1j20Q2J73K0k1k00L28m65N56j66K6J08l41m3K58J40k56nK04j57M6
4702G2m5J5J34Kl18k3j24J65N9j40J63k49M19j60P9Rj84O8n4Q9j46K42K4o3K4
4727E8j02j91L79l37%K06M8O8m17K66O2k52PK06k34M27l23J26K7o0K7O9L6l4m6
4752A6J06J77K3k25j32N0m8M20n29J32l1k59L39K16k63Q1k57P1J02k90M92j41
4774E0j08K90l94K13Nk00k60K15K31l6O3J38k9j90J33jj76q5L57k99o0K72k52
4797a23J75N8P1j45k73K36J56p8L3K1j50K65k66P3k40L31k48K48o3OJ11j88j58
4820a48J29J53l69K97L2k36j22K96l27M20p6k41K01J95m31R5K41m11J59J56o0
4841d7J22l83L74%j07lJ41j69R6J61k42M14k96Q8K0l06K13j50m0K8J69r0O1l0
$$ plain form
4865 24 -259 151 52 -105 85 -58 -87 98 103 -146 359 -53 89 -123 -39 69 85 74 48 40 -87 -79 -246 156
4889 156 -170 158 113 -96 161 -78 -83 -183 40 -26 -126 -55 129 186 -197 -42 -16 197 264 -176 121 180 -80
4912 -80 -118 -96 212 239 63 76 -57 107 49 317 -55 62 32 62 129 69 -269 10 136 -125 80 39 -330 -94
4936 -94 -37 63 239 57 15 -191 -24 -93 100 22 -243 189 -157 -209 100 14 -180 -97 -159 49 19 -80 -88 24
4960 24 165 17 53 23 -202 -185 188 -2 48 29 16 -45 -69 194 -247 -98 -121 187 121 37 45 96 -1 178 65
4985 65 -177 238 157 -15 77 -126 -162 -160 -37 -23 83 52 -29 49 -128 -144 109 -201 -310 237 -7 159 186 -25
5009 -25 -60 -129 -36 -152 -56 260 -88 64 -124 68 8 -96 -97 -96 -36 -176 101 -4 9 -84 -33 -53 -49 112 113 -189
5035 -189 -173 215 -118 -62 -70 -104 96 136 67 17 235 99 324 -90 -159 -85 -14 37 -26 -11 -91 -54 -60 -36 26 23 89 -281
$$ packed form
4865B4k83M10r9j57J90j43k9J85Nk49N05m12J42k12Q4J08J6j1k6qj27Qj67M02
4889A56l26L28m5k09K57k39nj00K23o6j00P1J84N7l83J55K6K13O7m40K97N9k60
4912h0l8K2L08K7j76J3j33J64n8K68l72J17l0L0O7o0l38K79J26k61K05m1l69K36
4936i4N7J00J76j82m2k06J67o9J93p8k65M32l46n2L09q6j94Q3o2K08l0r9qJ12
4960B4J41j48L6l0k25J7L73j90N0j9j3o1k4K63m41J49k3L08o6q4QN1r7J79j13
4985F5k42M15q1j72R2k03l6KJ23J4J06l1q1P8j77j6K53l10j09N47k44J66K7k11
5009b5l5o9R3j16R6L16l48J52j88J92o0j04jJO0j40K77j05J3r3N1k0MJ61Jl02
5035a89J6L88l33N6ql4K00M0o9n0K18j36K25m14o9P4P1N1o3J5q0L7oK4O2lO6l70
$$ plain form
5063 -281 -234 -85 -70 -258 -173 62 -71 29 103 -35 -122 86 -3 -86 219 -62 254 305 41 194 -46 65 128
5086 128 45 -353 -210 -33 -237 114 -56 -84 164 -53 -6 -21 -82 -323 -221 78 -150 -233 132 31 -65 139
5108 139 -33 -99 339 12 55 89 -135 82 47 -59 -79 60 16 -77 -44 230 50 -151 -23 -206 22 136 163
5131 163 -94 -135 -88 -104 -125 -88 236 -10 53 182 101 -15 -67 18 62 -71 -85 -66 -180 76 14 141 48 -180 -249
5156 -249 -21 -141 -42 53 77 -14 204 -181 -28 28 -66 78 155 -99 17 59 -107 -39 145 208 151 -88 226 -6
5180 -6 41 49 -95 51 262 31 -208 -71 100 143 -135 -98 61 -17 -287 -44 -81 135 70 -54 -16 -74 -189 39
5204 39 -74 90 14 47 -212 122 -15 155 -167 -127 -102 148 20 26 101 29 25 225 14 198 -73 7 -59 -62 89
5229 89 19 69 -60 65 -92 182 17 64 65 113 95 204 63 200 56 264 -116 -2 189 -165 121 69 109
$$ packed form
5063b81M7J49J5j88Q5K35j33J00P4j38q7K08q9q3L05k81L16N1k64J53k40J11O3
5086A28q3l98J43J77k04L51j70k8K48k17M7j5o1k41J02K99k28q3L65j01r6K04
5108A39j72o6M38l27M3L4k24K17l5j06k0J39m4r3L3K74j80k01J28j83K28J14K7
5131A63k57m1M7j6k1L7L24k46O3J29q1j16n2Q5M4j33j4J9j14K56o2J27r3k28o9
5156b49K28j20R9R5K4r1K18l85J53N6r4J44P7k54J16M2j66O8J84O3n7k39L14k32
5180fM7Qj44J46K11k31k39J37J71M3k78L7J59p8k70K43l7K16o5j24L8n8j15K28
5204C9j13J64p6L3k59L34j37J70l22M0K5K50j28OP5p2mK00k11J84k71Q0o6lJ51
5229H9p0N0j29J25j57K74j65M7JM8j8J09j41J37j44K08l80J14J91l54K86n2M0
$$ plain form
5252 109 -190 -144 -106 -43 30 -69 77 -181 -143 57 111 117 126 -40 182 -23 -81 112 -56 63 149 27 55 58 16 142
5278 142 31 70 -14 -148 24 -314 100 -98 -93 126 -77 219 -62 -237 156 10 2 160 -98 161 73 -74
5300 -74 130 149 104 15 -150 -124 -213 35 -38 -75 -114 167 -60 -51 35 16 -27 -130 -188 38 -26 -73 80 68 39 -190
5326 -190 133 -85 52 -150 8 -16 31 196 -76 -74 76 98 90 269 266 127 -221 85 -38 110 159 -174 89
5349 89 -260 -150 -188 -221 2 -83 -30 -95 -31 -312 44 101 110 83 -164 84 146 147 -250 202 284 109 -74 76 -59
5374 -59 41 -127 -362 -160 -131 -62 124 -218 52 -186 -150 160 -334 -252 58 122 26 -147 -270 -49 -15 75 -81
5397 -81 89 55 -160 28 54 -104 -190 108 -23 91 175 186 90 -260 -143 -175 186 271 56 80 -45 -173 167
5420 167 -34 54 46 -77 127 -97 140 93 -250 155 62 -30 120 -50 -51 13 -13 315 192 -95 -21 40 -36 10 -122
$$ packed form
5252A09k99M6L8O3P3r9J46k58L8K00N4ORj66K22k05n8J93j68J19Q6j22K8Lm2J26
5278A42j11L9q4j34J72l38M14j98NK19k03K96k81j75L93j46qJ58k58K59q8j47
5300g4K04J9m5q9j65K6q9K48p3l7l9K81k27RQ6j9m3j03n8K26o4m7J53j2k9k29
5326a90L23k18J37k02J58k4M7J65k72KJ50K2qJ79lj39l48L06j23J48M9l33K63
5349H9l49J10l8l3K23q5N3o5O4k81L56N7Rk7k47K48O2Jl97M52Q2j75j83J50j35
5374e9J00j68k35K02K9O9J86l42K70k38L6L10m94Q2L10O4r6j73j23K21L4R0j56
5397h1J70l4k15J88K6j58q6K98j31J14Q4J1r6l50J17l2L61Q5k15K4j25j28L40
5420A67k01Q8qj23K04k24K37m7l43M05r3r2J50j70jO4k6L28j23k87P4O1p6M6j32
$$ plain form
5445 -122 -35 86 -219 186 -32 119 -24 138 -250 -186 -47 21 33 110 -169 0 100 113 266 -106 -28 -193
5467 -193 196 103 60 252 -100 132 -52 105 -131 -101 110 -117 -59 67 80 -293 -158 63 42 -167 175 -52
5489 -52 -31 -12 -29 -98 -49 100 204 -237 25 -86 -210 71 73 -99 -319 165 222 50 150 -164 -209 18 99 94
5513 94 -149 30 -317 -76 -112 158 193 17 81 194 -97 89 -9 44 172 -330 -74 42 121 94 -17 -191 175
5536 175 -51 114 -8 178 21 -88 -291 -122 46 137 169 105 -289 -15 -49 -277 82 176 94 -103 -144 -85 -33
5559 -33 95 -142 -11 87 -55 -81 39 113 6 26 -52 -166 10 -155 104 115 160 -98 -126 180 -372 -7 97
5582 97 -22 -54 138 -194 111 53 171 41 48 233 -45 -26 106 91 -292 214 -163 -89 -59 120 -111 -326 -107
5605 -107 1 19 181 -117 -113 59 -252 57 -62 104 -138 -90 -73 59 -278 -257 112 12 -14 -332 -69 -301
$$ packed form
5445a22Q7J21l05M05k18J51j43J62l88O4J39O8J2P7k79J69J00J3J53l72P8j65
5467a93L89r3m3J92l52K32j84J57k36L0K11k27N8J26J3l73J35K21k1k09L42k27
5489e2K1J9j7o9M9J49J04m41K62j11j24K81Kj72k20M84N7j72J00l14m5K27Q1n
5513I4k43J79l47K41l6K70L5j76O4J13k91J86r8N3J28n02K56J16P9k7j11j74L66
5536A75k26J65j22J86j57j09k03J69J68R1L2o4l94K74l4k28L59R4q2j97m1N9N2
5559c3J28k37J31R8j42k6J20P4j07K0p8j14J76j65K59J1M5k58k8L06n52L65J04
5582I7j19l2J92l32L05n8J18j30PJ85k78J9J32j5l83N06l77P4L0J79k31k15K19
5605a07J08J8J62k98MJ72l11L09j19J66k42M8J7J32l37K1L69j00k6l18K63k32
$$ plain form
5627 -301 7 -22 162 -102 107 101 45 116 -65 -247 -14 22 -37 181 -87 -226 -7 -25 -159 -171 123 -25 41
5650 41 -158 183 -16 309 3 20 -180 -279 -30 54 110 -285 30 -151 72 -8 39 -43 -61 -391 1 -4 -275 -41
5674 -41 69 -112 -76 -44 45 22 -179 -112 86 33 -155 172 86 140 183 179 -44 71 -59 110 305 191 -21 162
5698 162 -73 -49 79 60 -189 38 47 235 155 119 -17 113 139 165 181 -129 98 -30 173 118 103 -34 128 34
5722 34 -143 191 80 220 453 1 -8 47 -3 64 -103 -26 109 16 146 62 -24 220 -205 -90 -99 -81 106 -245
5746 -245 -180 42 -133 204 -114 43 -21 105 0 396 -180 55 -32 -107 -11 -35 -167 -281 -267 112 140 -38 -14
5769 -14 -12 116 -77 91 -46 21 133 37 81 1 121 75 36 111 -136 -98 -29 -201 -102 -59 -48 -142 164 -186 -107 103
5795 103 -137 140 118 149 2 25 -149 -139 77 176 -171 -76 46 47 40 117 -67 -44 84 -63 93 160 -183 -114 37
$$ packed form
5627c01L08k9J84k64K09on6P1j81j82K33L6n9K18k68j39K19j8j34j2K94j48O6
5650D1j99L41j99L25l06J7k00r9K49Q4N6l95L15j81K23q0M7q2j8l30L92nk71K34
5674d1J10j81L6L2Q9k3k01O7J98n3j88L27q6N4M3mk23J15j30J69J95j14k12J83
5698A62k35K4J28j9k49K27RJ88q0l6j36J30K6K6J6l10K27j28K03n5j5j37J62r4
5722C4j77L34j11J40K33m52rN5n0O7j67P7J35r3J30q4q6K44m25J15rJ8J87l51
5746b45O5K22j75L37l18J57o4J26j05L96n76K35q7p5R6k4j32j14J4L79K8j78K4
5769a4KJ28j93J68j37O7J12r6M4q0J20m6l9P5k47L8O9j72R9M3J1r4L06l50P9K10
5795A03k40K77k2L1j47K3j74J0K16R9l47R5J22JpP7j84K3J28j47J56O7l43O9J51
$$ plain form
5820 37 20 -53 -50 -41 58 -200 50 -132 -29 -206 170 176 -67 135 -35 94 -266 -68 69 -28 -284 154 -166 42
5844 42 23 181 51 -174 -99 96 158 23 115 -188 -24 139 32 -169 261 45 -13 -237 52 358 39 48 -145
5867 -145 3 111 118 -76 -37 -74 83 141 -124 -101 -71 38 251 107 -34 -28 20 32 115 -91 139 91 161 -134 -19
5892 -19 50 158 43 249 67 197 177 -19 -121 8 18 -69 -375 -104 21 0 114 85 262 -105 -38 -161 164
5915 164 93 56 -289 394 73 -236 -221 24 60 94 -13 -27 191 11 177 -74 138 -65 51 -167 -69 -3 49
5938 49 48 -81 75 143 -12 115 -83 28 -100 228 185 -131 71 -74 202 69 38 -138 7 -77 252 36
5960 36 62 -185 -356 -37 44 151 121 71 16 -17 -36 256 -152 164 214 92 38 -129 -81 70 135 84 46 -63 66
5985 66 252 83 -148 -19 122 18 -178 57 -240 8 -20 -147 -121 95 -203 10 -167 -75 -34 -99 -227 267
$$ packed form
5820C7j7p3LRR9k58K50j82J03j77L76Ok43K02j70J29l60J98J37r7k56M38l20K08
5844D2j9J58j30k25P5J95O2j35R2l03J64J63j07k01M30k16n8k24K89L06l19Rj93
5867a45J48J08Pj94L9l7J57N8k65K3L0J09K13j44j41OM8J2Q3k06K30m8P0k95J15
5892a9O9J08j15K06j82J30k0j96j02J29J0q7l06K71J25k1J14k9J77l67O7j23L25
5915A64p1l7l45O83l21l09J5K45L6L4j07j4K18j80J66k51K12k03J16k18R8O6N2
5938D9jj29J56O8j55J27j98J11j28L28m3l16K02j45K76j33l1j76J45q4L29k16
5960C6K6k47j71L19Q1J07l0n0n5l3j9K92m08L16N0j22n4j67M8J51O5n1l8j09J29
5985F6J86j69k31J29J41j04j96K35k97K48k8j27K6K16k98K13j77R2M1o5j28M94
$$ plain form
6007 267 -6 4 128 169 -6 -47 28 54 -164 -142 249 -85 -26 -156 -95 -175 -17 -60 -3 76 199 -5 -161 -114
6031 -114 291 152 334 31 69 92 322 37 18 -62 -109 -33 82 29 -13 11 -111 -50 112 -43 196 40 187
6054 187 -247 94 -73 206 -34 -50 31 -370 53 -55 -56 -36 -242 22 24 -37 -242 -5 254 -176 -2 56 227
6077 227 -28 56 67 8 7 -97 104 212 33 -27 127 -203 -297 -103 -297 93 60 -42 -143 -69 -58 -105 -173 -83
6101 -83 -140 -273 -73 -75 81 80 79 45 226 4 12 0 -13 -15 131 -2 112 202 -160 -57 -52 195 125 -172 -40 -76 92
6128 92 -95 -24 138 30 31 -164 24 75 170 71 13 73 267 94 143 -34 -142 35 37 -113 267 67 40 -229
6152 -229 -47 30 162 64 78 9 77 -67 -124 26 149 103 247 27 12 -77 -258 79 -327 -129 460 -185 -85
6175 -85 -255 96 103 50 49 -238 68 169 286 -63 -24 -240 -232 -272 119 148 -10 0 211 33 252 102 117 28 178
$$ packed form
6007B67k73J0J24M1j75m1P5K6k18K2L91l34N9j30O1q0J58m3N7P9J23k04j56M7
6031a14M05j39J82l03L8K3K30k85j9q0m7P6J15n3m2K4j22O1J62j55K39j56J47
6054A87m34L41j67K79k40j6Q1m01M23j08jK0k06K64Ko1k05K37K59m30J74N8J71
6077B27k55Q4J1n9jj04K01J08j79o0J54l30r4J94j94L90l3j02j01P4J1m7o8R0
6101h3n7j33K00kJ56jjl4J81k22Qj2j3kJ46j33J14R0l62J03NK47p0k97J32l6J68
6128I2j87P1J62j08Jj95J88N1R5r9n8O0J94j73M9j77j08J77Kj50L80k00k7k69
6152b29J82P7J32r8J4o9O8j44n7J50J23m6J44k20j5q9j81L37m06J98N89o45J00
6175h5j70L51Pn3jk87L06J01J17l49L9k16Qm0L91K9j58J0K11j78K19j50J5q9J50
$$ plain form
6200 178 -150 -202 135 19 115 54 -195 -59 334 108 67 62 -85 320 19 -99 -71 3 184 -184 -69 -202 138
6223 138 -60 31 -92 -179 -256 -191 -41 -115 -78 -5 11 202 -128 -108 -89 92 120 -178 -75 20 71 -171 -60 190
6247 190 5 122 -137 95 0 19 43 4 -49 -106 41 42 -148 -15 24 -113 -19 34 193 113 184 111 -20 1 -297
6272 -297 149 -61 -14 205 -73 18 169 35 -58 308 30 -129 124 1 277 111 -176 -123 48 -70 -73 -150
6294 -150 -208 -15 -24 46 -31 33 -15 198 -80 -250 -177 -110 -182 -97 188 -321 -126 152 -200 -123 31 41 -107 -52 -161
6319 -161 -47 -164 -71 54 -16 -176 79 -100 101 -81 -162 96 98 -36 119 -143 -88 51 133 44 -101 145 239
6342 239 -44 105 195 23 -16 8 -27 98 -4 -139 212 -127 -136 113 -247 -191 -152 94 -33 65 185 -41 294
6365 294 87 134 24 -97 62 -149 166 115 70 72 -170 -76 86 13 -92 185 92 -52 161 40 -1 -97 162
$$ packed form
6200A78l28n2L37j16R6o1k49J36L93k26m1nj47M05l01j18K8P4J81l68J15j33L40
6223A38j98R1j23q7p7O5J50p4L7P3J6J91l30K0J9J81K8k98J03R5N1k42J11K50
6247A90j85J17k59K32r5J9K4l9n3n7J47Jj90J33L9j37R4N3J59q0P1p3j31K1k98
6272b97M46k10M7K19k78R1J51j34r3L66k78j59K53j23K76j66k87N3J71j18lp7
6294a50n8J93rP0p7O4m8K13k78j70P3O7p2Q5K85n09J95K78l52P7J54J0j48N5j09
6319a61J14j17R3J25p0j60K55j79K01j82q1K58Kj34J55k62N5J39Q2q9j45K46R4
6342B39k83J49R0j72l9K4l5J25j02j35L51l39rK49l60N6L9K46j27R8J20k26L35
6365B94k07M7j10j21J59k11L15n1m5Kk42R4J62p3j05K77r3j44K13j21m1r6K59
$$ plain form
6388 162 99 -9 -138 -320 -204 45 -7 -1 0 19 -159 92 -18 -163 -336 -32 158 -45 -97 195 -47 -12 83
6411 83 -153 125 18 -17 13 -80 86 146 -288 34 113 -93 -409 150 69 164 -97 -209 -140 248 129 -209 -150
6434 -150 -266 73 -46 74 -124 143 -79 -193 162 26 235 14 0 -82 4 -133 -140 -34 -232 86 88 -103
6456 -103 5 -86 -48 51 91 35 -35 -51 19 -45 55 -82 -15 5 -208 83 10 -97 -36 44 -27 67 -65 -367 104
6481 104 -44 8 -245 130 -258 -72 60 -155 -33 -160 -259 63 62 110 -35 -274 198 333 24 -38 4 145
6503 145 -22 65 -209 22 -65 131 112 88 90 -70 -22 -152 -111 -98 19 -39 -282 -58 -137 323 -135 67 139 -32
6527 -32 -127 469 -188 -123 -55 -68 -39 -52 117 97 35 -72 -20 -139 -2 46 60 80 145 -252 7 100 -122 -54 -36 -196
6553 -196 174 -4 3 -126 -188 168 57 -190 -150 171 79 -188 30 -92 -95 -115 -373 45 109 61 -236 4 11 -53
$$ packed form
6388A62o3j08j29j82J16K49n2OJJ9j78K51j10j45j73L04J90k03n2K92k42L5R5
6411H3k36K78j07l5L0r3J66O0m34L22P9k06l16N59q1R5k61j12O9L88j19l38N9
6434a50j16L39j19J20j98K67k22j14L55j36K09k21j4q2Q6j37pJ06j98L18Kj91
6456a03J08r1L8R9M0n6p0j6P0o4J00j37O7K0k13K91p3j07O1Q0p1R4j32l02M71
6481A04j48N2k53L75l88J86J32k15J22j27r9L22jM8j45k39M72J35l09o2M2J41
6503A45j67Q7k74K31q7J96j9k4Kj60M8j30M1J3J17n8k43K24p9M60m58K02P2j71
6527c2r5N96o57O5O8j3K9j3J69k0o2j07N2j19J37M8J4K0O5l97K59R3k22O8J8j60
6553a96L70j78Pj29o2L56j11k47M0L21r2k67K18j22lk0k58M18O4m8k97K40Po4
$$ plain form
6577 -53 45 174 0 -71 76 -46 -77 -46 -181 -49 142 -299 57 254 148 90 -91 85 -55 189 84 120
6599 120 -201 -56 150 -265 179 -85 -12 207 6 18 -100 -181 210 125 -64 -151 -157 5 -222 -104 -5 -48 44
6622 44 25 82 61 -94 -2 -60 177 65 79 9 -29 -8 156 -52 237 -5 -45 -24 12 -36 -126 42 -130 -338 -87
6647 -87 -14 100 67 -124 -188 152 116 163 -69 -132 107 19 -90 128 143 14 0 218 34 176 -186 189 82
6670 82 30 240 -136 -33 172 30 -107 75 -231 -77 -82 71 -132 4 -93 206 49 136 107 -270 -34 -73 -37
6693 -37 92 349 -5 123 -78 -58 -70 -110 102 104 -183 -21 116 -136 -322 -53 103 -11 80 90 -6 -245 -25
6716 -25 84 -20 -51 115 -193 22 50 84 234 -141 -58 -58 59 69 17 109 -43 -47 39 12 -43 21 -168 -225 -234 -208 -220
6743 -220 -223 -81 -28 159 52 -12 90 26 -116 -39 -238 -248 -57 -2 -4 14 38 34 29 108 -33 6 -326 56 33 22 95
$$ packed form
6577e3R8J29j74p1J47j22l1L1j35J32J91m41L56J97j06n8j81J76j40K44j05L6
6599A20l21J45K06m15M44k64P3K19k01J2j18q1L91q5j89q7oJ62k27J18R9m3R2
6622D4j9N7k1j55R2n8K37j12J4p0l8K1J64k08K89k42m0K1L6m8r0J68j72k08K51
6647h7P3J14l3j91o4L40l6M7k32o3K39q8j09K18J5j29j4K18j84J42l62L75j07
6670H2n2K10l76J03K05j42j37J82l06J54nJ53k03J36r7K99j57Q7k9l77K36l9L6
6693c7J29K57l54J28k01K0j2m0K12Kk87J62J37k52j86K69J56j14R1J0r6k39K20
6716b5J09j04l1J66l08K15K8L4J50l75Q3%J17J0n2R2j52mQ6k7n5O4j89n7rK6j2
6743b20lJ42N3J87j07o4J02o4j42P7j99j0J91N5kJ8K4mnP9j41L9l32L82k3j1P3
$$ plain form
6770 95 152 -18 167 -42 -58 56 -204 38 -26 -268 -74 -92 -252 6 69 130 -149 249 144 -133 148 -133
6792 -133 63 28 233 -105 82 -120 -42 79 26 -153 109 -179 143 -22 -53 74 -154 -66 50 69 -14 -16 104
6815 104 98 -59 -53 -25 60 -171 -70 140 118 54 75 -29 53 -85 125 -70 -12 -41 -40 -131 25 16 29 149 61 -166
6841 -166 70 -51 -97 -287 -79 -164 -8 -92 -23 73 228 130 36 126 -22 -80 -112 -128 -246 -181 -97 65 -99 -64 99
6866 99 47 -14 -104 -250 -114 60 -182 44 89 20 155 -144 -161 168 -288 56 11 60 -48 230 -2 -66 -62 174
6890 174 133 202 197 259 218 15 9 -148 -36 34 22 -90 -82 -259 -1 27 61 -88 44 -119 -65 -120 300 -323 -8
6915 -8 116 100 -254 -88 196 47 102 147 -90 -141 361 47 -391 -12 -57 -46 -127 -70 -50 -154 -17 -102 -2 65
6939 65 -25 -78 76 -13 269 -111 186 -53 31 -11 287 -49 -17 178 86 -90 133 125 345 -134 152 -36 128
$$ packed form
6770I5N7j70J85k09j6J14k60K42o4k42J94j8j60K58O3O1k79L98j05k77K81k81
6792a33J96l5K05l38J87k02P8J21n3j79K62k88L22j65l1J27k28Q8J16J9q3kJ20
6815A04oj57OK8Q5k31J01K10k2o4K1j04Q2j38K10j95N8k9Jr1J56rJ3J20q8k27
6841a66K36j21m6j90K08q5J56q4O9R6J55r8r4R0j48n8l2j6j18O5Q4J62j64L5J63
6866I9n2o1r0j46J36J74k42K26M5o9J35k99j7L29m56L44m5M9j08K78k32o4MK36
6890A74m1O9nO2m1k03oj57J12P0j2j12Qj77K58K8L4j49J32j63N4n5M20o23L15
6915hJ24j6l54J66K84j49N5M5k37n1N02l14m38L79m5J1q1N7K0j04J37q5J00O7
6939F5r0n3J54q9K82l80K97k39Q4m2K98l36L2J95r2j76K23qK20m79K86j88J64
$$ plain form
6962 128 205 79 95 284 -188 59 20 26 -9 255 131 130 11 -93 -113 194 97 54 -72 -28 -279 19 -38 56 89
6987 89 -279 -21 -114 119 197 -130 34 -32 -162 17 1 90 52 -135 -63 -222 -152 47 -32 46 -120 34 3 85
7011 85 -25 -71 -69 -195 -62 68 -109 66 -181 160 -236 52 36 -172 -80 87 136 -66 63 -63 121 60 59
7034 59 -148 -79 86 -14 31 132 -49 18 39 -74 -140 36 -102 -168 297 82 -114 41 83 -75 -39 -3 257
7057 257 86 -96 68 120 338 80 -174 -176 -44 -157 189 -197 -69 26 -26 -100 -4 75 -71 137 -144 -130 71
7080 71 -34 -214 119 -38 -237 -31 -191 -150 294 21 16 44 -115 -28 -13 223 100 -248 -78 -212 99 -181
7102 -181 116 34 49 153 -103 50 16 -20 94 41 80 167 -139 93 350 -58 -171 -35 -209 118 -199 80
7124 80 -198 -170 178 -46 -101 -76 -69 -140 -36 -5 198 120 -56 24 195 138 -93 -99 59 -35 37 121 325 6 -5 -202
$$ packed form
6962A28P7j26J6J89m72K47l9Ol5K64j24jj19j04k0L07r7m3j26M4k51K98n7R4L3
6987H9l68K58r3K33P8l27J64o6j30J79j6Q9l8j87P2j59P0J99p9P8j66J54l1Q2
7011H5j10m6Kj26J33J30j77J75k47L41l96K88j6k08R2J67M9k02J29j26J84o1j
7034E9k07O9J65j00M5J01j81O7K1j13o6J76j38o6M65k15j96J55M2j58L6L6K60
7057B57j71j82J64N2K18k58k54kJ32j13L46l86J28R5n2p4R6P9j46K08k81J4K01
7080G1j05j80L33j57j99K06j60M1M44k73nK8j59Q7J5K36j23l48J70j34L11k80
7102a81K97q2J5J04k56J53l4l6J14n3L9Q7l06K32K57m08j13J36j74L27l17K79
7124H0k78K8L48k24n5K5Pp1J04L1K03p8j76Q0J71n7k31oJ58r4P2Q4K04l19j1j97
$$ plain form
7150 -202 99 174 109 -136 -96 83 -316 -382 -38 105 -95 -34 303 -94 -117 -26 -178 7 118 -9 -137 14
7172 14 -93 -198 189 47 24 72 -134 156 -34 78 381 -37 -31 250 -12 -207 -90 -12 68 -172 -241 -10 124
7195 124 332 187 -131 169 -15 -57 29 -18 79 -89 -215 -69 26 162 115 173 49 55 307 -280 242 -43 -42 202
7219 202 229 81 46 -71 -34 17 111 -137 -84 125 -11 33 -124 -261 41 163 132 -87 151 111 -73 161 193
7242 193 63 -199 181 26 -221 -23 147 337 -17 28 240 -209 251 -572 64 -329 -119 -68 -115 62 -117
7263 -117 6 141 115 -19 -28 117 -185 121 396 137 316 44 45 138 21 172 51 189 287 30 -206 -124 54
7286 54 -5 -2 -285 89 -77 -73 139 -31 26 -172 -264 120 -172 -291 58 -112 23 -151 -93 -6 50 -37 109 155
7310 155 143 -110 74 -88 -128 53 78 -12 295 180 113 -274 97 105 135 -73 -90 16 -75 -28 -58 -159 -211 82
$$ packed form
7150b02L01P5o5k45M0J79l99o6L44J43k00O1L37l97k3R1j52J85J11j27j28J51
7172A4j07j05L87j42k3M8k06K90j90J12L03m18OK81k62j95J17P8Q0k40o9K31J34
7195A24K08j45l18L00j84m2Q6m7R7j68j26J46R5J36m7N8j24OK52n87N22k85JK44
7219B02K7j48l5j17L7N1R4k48N3K09j36M4j57j37L02J22l1k19K38m0j84K34L2
7242A93j30k62L80j55k47J98J70J90l54M5K12m49M60q23O36l93K10N1m7J77j79
7263a17J23J35k6j34rJ45l02L06K75k59J79k72JR3j17J51j21J38R8k57k36Q2J78
7286E4n9Lk83L74j66MK12j70N7j98r2L84k92j19L49j70J35j74N8Q7N6q7J46M6
7310A55j2k53J84j62m0J81K5r0L07j15o7l87L71QL0k08j7J06r1M7l0j01n2K93
$$ plain form
7334 82 -84 -169 -115 32 46 161 -166 180 21 108 240 -6 271 94 -63 101 -262 45 -2 -54 192 302
7356 302 147 -16 -108 51 -148 -52 -256 76 125 -74 -52 41 -111 -171 283 -3 -110 305 -22 7 176 -110
7378 -110 -171 174 -98 -61 -187 -212 103 114 130 104 133 129 -282 -140 85 33 1 140 -46 182 12 44 -42 40 -16
7403 -16 150 -45 61 169 -37 -3 83 117 68 -105 97 180 38 -94 -39 92 105 15 34 140 -69 22 -7 -276
7427 -276 -175 79 235 182 -35 -77 -33 285 -153 -47 113 70 -166 -16 27 224 94 304 172 -22 38 -153
7449 -153 -61 -25 -169 -317 194 70 12 -73 108 -205 101 54 -21 43 -38 -55 67 207 -124 99 65 62 -140 -47
7473 -47 -7 70 -14 87 -71 -143 -64 228 17 -273 -109 116 -126 -32 -337 140 79 -33 -176 -5 148 -94 171
7496 171 58 156 41 117 58 126 16 105 15 -22 193 -73 -154 214 -33 -30 202 -219 -97 41 11 -91 -34 -62
$$ packed form
7334H2j66q5N4J47J4J15l27L46j59Q7J32k46K77j77j57J64l63L07m7n2K46J10
7356C02j55j63r2J59j99R6k04L32M9j99K2R3j52o0M54k86j07M15l27K9J69k86
7378a10o1L45k72L7j26k5L15J1J6k6K9mm11J42K25n2l2J39j86K28j70L2q6Q2n6
7403a6J66j95J06J08k06L4Q6L4m9j73K02Q3j42j32N5J31J3r0J9J06k09R1k9k69
7427b76J01K54J56n3k17m2M4L18m38J06J60m3k36J50M3J97j30K10j32j94O0j91
7449a53R2L6j44j48N11j24n8q5J81l13L06m7p5O4q1j7J22J40l31K23l4lk02R3
7473d7M0P7q4J01j58p2P9K92k11k90J64K25k42R4l05M77o1j12j43J71J53k42K65
7496A71j13R8j15P6n9O8j10Q9r0l7K15k66q1L68k47LK32m21J22J38l0j02N7k8
$$ plain form
7520 -62 -16 273 -69 434 119 51 -182 77 18 160 171 -130 65 151 135 -90 136 -32 165 -8 -16 55 -33 63
7544 63 -83 -105 -40 210 -57 85 321 -95 -192 -128 103 -130 -142 186 21 35 137 50 223 -158 -90 7 62 249
7568 249 -143 45 59 -55 -157 230 -251 29 41 6 113 24 -94 53 -361 -148 -4 89 -117 -219 -258 1
7590 1 -49 88 -166 -5 162 109 55 -305 -147 223 17 -7 205 10 -39 35 128 58 122 73 205 -149 103 -302
7614 -302 -13 -130 -55 -65 47 152 204 170 49 -258 89 39 208 132 91 -86 -344 -50 -279 -10 -58 435 -304
7637 -304 52 49 -6 -300 -152 -129 -30 -23 104 -42 -222 -128 57 8 126 3 66 -255 -143 22 57 -143 83 61
7661 61 114 69 86 -269 21 237 240 3 -90 192 -86 -11 -23 93 -221 -9 -10 -6 -100 15 99 -233 74 158 -101
7686 -101 144 194 -39 -172 -95 144 156 -131 117 -107 -193 94 143 129 147 -42 171 14 -131 194 97 -66 -11
$$ packed form
7520f2M6K89l42N03l15o8k33K59n9J42J1l01J95Q6j6k25K26j68J97j73qP1q8R6
7544F3j46k2O5K50k67J42K36m16r7O4K31k33j2L28j65J4J02q7J73l81O8R7N5J87
7568B49l92J88J4j14j02L87m81K80J2l5J07q9j18J47m14K13J44R3k06j02l9K59
7590An0J37k54J61J67n3n4l60J58L70k06k4K12j95m9P4R3p0O4m9J32l54K52m05
7614c02K89j17P5j0J12J05N2l4j21l07L47n0J69p6m1j77k58K94k29K69m8M93p39
7637c04L56ln5k94J48K3R9PJ27j46j80R4J85m9J18j23O3l21J12J65L5k00K26k2
7661F1N3m5J7l55K90K16Lk37r3K82k78P5j2J16l14K12jMr4J15Q4l32L07Q4k59
7686a01K45N0k33j33P7K39J2k87K48k24q6K87M9j4J8j89K13j57j45L25r7j63N5
$$ plain form
7709 -11 6 -54 -117 129 -26 83 19 -49 214 -25 -155 -220 125 116 51 -22 44 143 -19 -83 -136 109 -168 -99 -53 -107
7735 -107 103 29 135 68 0 -55 -153 189 -157 130 48 -229 -179 111 24 -96 107 -55 119 -94 -36 -88 -93 28
7759 28 24 167 -127 43 -11 -144 28 -33 -212 -12 -42 186 175 90 96 93 -1 67 16 38 -61 43 69 -154 206 -189
7785 -189 178 154 213 277 -33 79 -115 88 -60 -57 -288 -167 231 85 305 174 17 5 -370 54 -49 45
7807 45 230 62 -29 195 -139 -85 -103 48 107 198 256 -194 37 2 272 202 199 -163 141 -40 137 288 -93 -145
7831 -145 -110 -41 -67 -110 95 193 47 -11 89 62 -54 39 34 -332 24 45 13 -177 -239 242 -88 -62 211 90 184
7856 184 143 -108 56 -123 -57 81 -95 220 -212 247 13 -67 98 0 46 -155 -18 -69 101 -92 -96 129 -74
7879 -74 251 -24 143 -76 -152 16 249 48 -135 159 -103 -95 39 54 -112 28 -46 220 84 -47 131 63
$$ packed form
7709a1J7o0o3K46j55J09o4o8K63k39j30o5L45ro5p3O6R9j62o4n3K45k77O9M6n4
7735a07K10p4J06o7o8n5r8L42l46K87q2k77N0K90q7j20K03j62J74k13N8n2nJ21
7759B8mJ43k94J70n4j33J72o1j79K00l0K28j1q5Olr4O8n1K2r9J04K6k23L60l95
7785a89L67k4N9O4l10J12j94K03j48Lk31J21L98j46K20j31j57j2l75M24j03R4
7807D5J85j68r1K24l34N4j8J51N9R1N8m50K31l5K70p0ll62L04j81J77J51l81n2
7831a45L5O9k6m3K05R8j46n8J00k7j16R3nl66L56K1l2j90o2M81l30K6K73j21R4
7856A84m1k51J64j79O6J38j76L15m32M59k34q0J65r8M6k01J37n1J70j93mK25k03
7879g4L25k75J67k19p6J68K33k01j83K94k62QJ34J5j66J40p4K66j36j31J78o8
$$ plain form
7901 63 -169 -230 -124 85 -55 -55 96 175 21 -106 108 42 32 5 -386 -17 -16 198 -60 88 -11 -40 83 191
7925 191 -172 -75 -41 -217 -193 21 118 12 -91 26 106 54 40 -172 118 -65 -130 -97 216 -48 -199 109 -28
7948 -28 -354 -179 -111 23 -141 120 -213 63 265 180 245 -8 -113 -80 -61 27 -50 75 79 -45 -165 -18 -88 270
7972 270 34 44 -173 -98 -171 -15 192 -45 4 -232 44 -81 -46 -193 -137 80 66 303 46 -122 -185 -52 -33
7995 -33 34 118 100 65 46 -35 -170 -178 262 -24 -86 -19 -122 -22 143 37 -40 -85 134 -96 16 59 295 189 -66
8020 -66 -103 -40 31 -69 152 41 129 -96 -165 -137 -24 -8 -82 45 -199 53 -94 51 6 162 52 -188 390
8043 390 183 255 -127 -80 11 -20 -159 -87 122 4 -178 29 -101 15 -147 -100 274 92 31 14 -45 -53 126 -95
8067 -95 -144 -19 6 5 153 47 -43 149 112 106 82 38 135 188 107 26 -262 -149 17 167 131 53 147 30 42 98 59
$$ packed form
7901F3k32o1J06K09j40%J51P9j54j27K14o6j0k7l91L69JK14k58J48r9k9J23J08
7925A91l63R7L4j76K4K14R7j06j03J17Q0n2j4k12K90j83o5L3L13k64j51L08j37
7948b8l26J75O8J34j64K61l33K76K02q5O5k53j05L3J9Q8p7J25Mj24j20J47p0L58
7972B70k36J0k17P5p3J56K07k37M9k36K76j25L5j47N6K17j4K37k57j68o3J33J9
7995c3O7Q4j8l5j9q1j35qM40k86o2O7j03J00J65j06p7m5K19k30J12M3K36j06k55
8020f6l7O3P1j00K21j11Q8k25o9K8J13J6p4J27k44K52j47J45m5J56j10k40N78
8043C90k07P2l82M7R1l1j39P2K09j18j82K07j30J16j62M7L74j82o1j7n9qJ79k21
8067i5m9J25K5jJ48j06r0J92l7ok4m4R7N3q1q1k88J13J66J50l6p8R4j17J2N6l9
$$ plain form
8094 59 -98 -168 156 -8 145 -284 65 193 -220 34 -91 53 31 -178 85 59 121 28 19 -46 -30 65 109 25
8118 25 77 294 79 -155 -269 -102 -304 -63 87 149 11 393 287 -138 89 -122 13 -4 51 147 58 -287
8140 -287 -138 -56 -127 -259 109 78 -13 31 277 177 332 -42 137 142 -76 69 -468 -169 -214 110 -40 -45 -147
8163 -147 130 -57 31 -155 -99 -110 -70 -220 -150 -23 -211 160 49 277 77 36 42 -8 -110 67 -11 125 -44
8186 -44 -101 142 159 -201 -111
$$ packed form
8094E9j57p0L24j64J53m29L49J28m13K54j25J44k2k09K63k6O2r3ro5J6R5M4q4
8118B5N2K17k15k34j14J67k02K41J50O2j38L82j06m25K27k11J35j7N5R6q9l45
8140b87J49Q2p1j32L68l1r1M4K46j00J55l74J79Nk18J45n37K99m5L24j50nj02
8163a47K77j87Q8j86N6j1M0j50P0J27j88L71j11K28k00m1On0j02J77p8J36j69
8186d4n7K43J7l60R0
8191a11
$$ Imaginary data points
##PAGE= N=2
##DATA TABLE= (X++(I..I)), XYDATA
$$ plain form
0 0 0 0 0 0 0 0 0 0 0 0 0 0 0 0 0 0 0 0 0 0 0 -1 7 -8 8 -8 8 -8 8 -11 16 -16 16 -19 24 -25 30 -32 33 -39 44 -48 55
43 55 -59 64 -72 80 -88 97 -108 118 -130 143 -158 174 -194 218 -243 274 -308 354 -410 480 -577
64 -577 714 -924 1277 -1979 3885 -18292 -46464 30839 18366 -33098 11983 31079 -21315 -7780
78 -7780 27008 -2377 -11846 17235 3271 -12516 7896 7341 -9879 -488 5085 -3826 -1937 2802
92 2802 -2394 -6560 -624 2145 -5559 -2083 4833 -5766 -8435 7139 2386 -10534 4734 10313
106 10313 -10904 -2931 16548 -3648 -9795 15877 4403 -13762 10002 10826 -12749 1038 13164
119 13164 -7671 -6146 10456 -2551 -10183 5569 998 -9306 2036 2066 -8650 -1213 3699 -5106
133 -5106 -2726 4544 -760 -4500 2622 4192 -2261 438 6391 529 -2280 5565 4366 -3317 1954
$$ packed form
0@%%%%%%%%%%%%%%%%%%%%%jQj5J6j6J6j6J6j9K7l2L2l5M3m9N5o2O5p2Q3r2J03
43E5j14J23j36J52j68J85k05K26k48K73l01L32l68M12m61N17n82O62p64Q90j057
64e77J291j638K201l256N864k2177k8172P7303j2473n1464M5081J9096n2394J3535
78g780L4788k9385r469K9081j3964j5787K0412n55j7220R391N573q911J889M739
92B802n196m166N936K769p704L476O916j0599k669J5574m753j2920J5268N579
106A0313k1217P973J9479k0196o147K5672j1474j8165K3764Q24k3575J3787J2126
119A3164k0835J525J6602j3007p632J5752m571j0304J1342L0j0716P437M912q805
133e106K380P270n304l740P122J570o453K699N953n862k809P845j199p683N271
$$ plain form
148 1954 6240 -3366 -2956 7093 -1163 -8336 4322 2253 -9564 326 4877 -7511 -3996 5931
162 5931 -3521 -6102 4956 240 -6700 3363 4140 -5658 1221 6013 -3474 -768 6561 86 -2419
177 -2419 4522 3294 -2715 1628 4774 -2220 -1627 4451 -944 -4518 1891 897 -5415 -1344 2423 -3769
193 -3769 -4769 2707 -1165 -5707 2158 2014 -5121 742 4544 -2964 -334 5779 -67 -2303 4960
208 4960 2488 -3117 3360 4462 -3112 671 4886 -2777 -1917 3857 -988 -4117 1654 553 -5160
223 -5160 -1001 2115 -4045 -2694 2823 -1999 -4101 2201 444 -3313 1383 3362 -1671 -731 4276
238 4276 907 -1940 4177 2985 -2793 2127 3846 -2290 -378 3846 -1078 -2750 2731 428 -4481
253 -4481 630 1817 -4790 -1893 2645 -3356 -3544 2236 -972 -3713 1409 2036 -2568 -186 3789 -1113
$$ packed form
148A954M286r606M10J0049q256p173J2658k069j1817R890M551j2388L515R927
162E931r452k581J1058m716o940J0063P77r798O879M792r487K706P329o475k505
177b419O941j228o009M343L146o994N93O078n395l574O409r94o312M071L767o192
193c769j000P476l872m542P865j44p135N863L802p508K630O113n846k236P263
208D960k472n605O477J102p574L783M215p663Q60N774m845l129N771j101n713
223e160M159L116o160J351N517m822k102O302j757l757M696J979n033R40N007
238D276l369k847O117j192n778M920J719o136J912M224m924j672N481k303m909
253d481N111J187o607K897M538o001j88N780l208k741N122O27m604K382L975m902
$$ plain form
269 -1113 -938 4480 1031 -1662 3223 2317 -1596 1228 3057 -906 -881 2681 -377 -3032 1238 930
285 930 -3635 -478 1312 -3336 -1849 1215 -1715 -2626 1175 443 -2795 539 2162 -2051 -4 3790
301 3790 -395 -816 3392 1492 -1103 2176 3011 -1203 244 3416 -766 -1891 2629 -150 -3046 995
317 995 741 -3561 -783 1120 -2511 -2540 1440 -821 -3814 1211 1476 -3011 277 2679 -1342 -218
333 -218 3220 421 -1151 2699 2430 -1588 1206 3264 -1094 -570 3154 -568 -2059 1549 512 -2654
349 -2654 -452 953 -2506 -2070 1238 -1714 -3135 870 26 -2848 690 1315 -2232 -248 2587 -355
365 -355 -863 2637 1444 -1693 1991 2849 -1153 865 2884 -892 -471 2418 97 -1730 598 563 -2720
382 -2720 -620 1234 -2340 -2241 769 -1672 -2566 725 -50 -2393 175 1440 -975 -839 2274 221
$$ packed form
269a113J75N418l449k693M885r06l913K824J829l963K5L562l058k655M270l08
285I30m565L157J790m648J487L064k930r11L801p32l238L334J623m213K047L794
301C790m185m21M208j900k595L279Q35m214J447L172m182j125M520k779k896M041
317I95k54m302K778J903l631k9L980k261k993N025K65m487L288K402m021J124
333b18L438k799j572L850k69m018K794K058m358N24L724l722j491L608j037l166
349b654K202J405l459M36L308k952j421M005q44k874L538O25l547J984K835k942
365c55n08L500j193l137L684Q58m002K018K019l776M21K889k321j827K328l5l283
382b720K100J854l574R9L010k441q94L291p75k343K568J265k415J36L113k053
$$ plain form
398 221 -873 2587 1684 -1197 1826 2443 -645 691 2342 -192 -1399 1740 725 -2175 455 1082
414 1082 -2495 -962 1242 -2505 -1993 824 -876 -2484 244 517 -1969 -525 1815 -699 -744 2427
430 2427 469 -946 1989 1720 -568 976 2432 74 -465 2358 445 -1600 1119 807 -2112 -181
446 -181 761 -2156 -1497 797 -1492 -2550 39 -98 -2340 -68 1238 -1417 -374 1995 -523 -343
462 -343 1941 716 -282 1410 1642 -86 475 1833 63 -76 1736 -64 -1126 933 372 -1276 -789
479 -789 355 -1708 -1584 87 -851 -2172 -10 -241 -2123 -255 1124 -1099 -764 1600 182 -1157
495 -1157 1728 1800 -900 1246 2672 -851 149 2623 -374 -997 2171 178 -1905 855 690 -2308
511 -2308 -807 1290 -1744 -1941 799 -896 -2218 244 42 -1515 -38 818 -643 -483 1532 697
$$ packed form
398B21j094L460r03k881L023O17l088J336J651k534j207L139j015k900K630O27
414A082l577J533K204l747N12K817j700j608K728K73k486J444K340k514m5L171
430B427j958j415K935k69k288J544J456k358n39K823j913k045K719l12k919J931
446a81R42k917O59K294k289j058K589j37k242K272J306k655J043K369k518J80
462c43K284j225r98J692K32j728N61J358j770j39J812j800j062K059n61j648M87
479g89J144k063J24J671r38j321K162k31j882J868J379k223L35K364j418j339
495a157K885P2k700K146J426l523J000K474k997o23L168j993k083K760j65k998
511b308J501K097l034j97K740j695j322K462k02j557J477Q56j461J60K015q35
$$ plain form
527 697 -734 1230 1629 -613 655 1847 379 87 1576 1166 -692 90 1035 -1110 -500 977 -1304
544 -1304 -1664 434 -862 -2121 -40 -137 -1815 -420 657 -1219 -787 1499 -362 -1033 1764 790 -1031
561 -1031 1327 1534 -189 1036 1807 -227 -56 1580 171 -594 1060 473 -1425 -204 185 -1496 -831
578 -831 51 -899 -1055 -345 -163 -1522 -694 335 -757 -583 1079 158 -671 903 790 -205 858 2011
596 2011 50 -14 2063 602 -883 1546 1061 -1333 416 908 -1602 -508 632 -1244 -1539 535
612 535 -701 -2124 -123 509 -1777 -478 901 -1056 -588 1183 277 -49 873 1294 69 473 1864
629 1864 536 44 1681 723 -384 699 697 -657 -574 686 -621 -1197 411 -459 -1992 -404 -103 -1876
647 -1876 -281 477 -1087 -254 583 -259 -444 1276 1019 -472 1061 1230 -389 685 1611 422 35
$$ packed form
527F97j431J964L99k242J268J192j468k92J489m10j858P82R45k145O10J477k281
544a304l60K098j296j259K081r7j678J395J077j876M32K286j861o71K797r74j821
561a031K358K07j723J225P71k034J71J636j409p65J654n87j898J221L89j681O65
578h31Q82r50j56P10J82j359Q28J029j092J74J662r21q29J574j13r95J063J153
596B011j961o4K077j461j485K429m85k394J749M92k510J094J140j876k95K074
612E35j236j423K001O32k286J299J379j957M68J771r06l26R22M21j225M04J391
629A864j328m92J637r58j107J083kj354Q3J260j307n76J608q70j533J588L01j773
647a876J595P58j564Q33Q37q42j85J720k57j491J533J69j619J074R26j189l87
$$ plain form
664 35 1172 213 -296 609 256 -622 -510 220 -692 -1276 82 -577 -1580 -298 -380 -1287 -652 403 -869
683 -869 -794 700 388 -981 1008 1296 -449 712 1672 -235 343 1726 395 -251 1097 819 -704
700 -704 273 691 -1080 -712 561 -1020 -1093 14 -619 -1259 -482 -319 -986 -702 481 -287 -654 563 130
719 130 -208 555 691 288 445 1189 502 47 1112 901 -348 377 879 -483 -80 561 -846 -840 203
738 203 -552 -1153 -465 -99 -1552 -421 275 -985 -683 608 -526 -415 631 150 -29 626 790 -82
756 -82 403 1173 516 241 1319 487 -265 704 349 -348 -273 38 -440 -989 -4 -200 -1363 -347 -12 -1057
776 -1057 -603 159 -878 -718 528 108 -491 469 896 -683 277 1445 -12 145 1567 356 -149 1066
794 1066 479 -325 44 771 -421 -383 405 -534 -1259 -98 -317 -1160 -158 -460 -1056 -611 12 -389 -732
$$ packed form
664C5J137r59n09R05l53q78J12P30r12n84J358o59j003J282q2r07O35J055j272
683h69P5J494l12j369J989K88j745J161R60j907N78J383j331o46J348k78j523
700g04R77M18j771L68J273j581p3J107o33o40P77J63o67K84J183p68l67J217m33
719A30l38P63J36m03J57P44o87m55J065k11j249P25N02j362M03O41j407OJ043
738B03p55o01O88L66j453J131O96j260L02J291j134J11J046m81j79O55J64q72
756h2M85P70o57k75J078q32p52R69l55o97P5L11m78n49R85j96j163J016L35j045
776a057M54P62j037J60J246m20n99R60M27j579R60J168j457J57J422j211n05J215
794A066n87q04L69P27j192L8P88r39p25J161k19q43J002l02n96M45O23m01l43
$$ plain form
813 -732 342 311 -523 168 701 14 429 1245 350 323 874 610 -62 592 862 -389 256 585 -393 -691
833 -691 335 -682 -879 -5 -525 -1231 -311 -183 -597 -517 251 -172 -746 611 274 -370 589 736 71 411
853 411 1084 717 270 808 824 -39 609 952 -428 129 494 -228 -647 178 -491 -1199 -694 -90 -854 -846 98
874 98 -818 -1005 266 -430 -648 574 440 -135 93 1106 366 308 1008 744 38 1000 781 -235 310 687
894 687 -35 72 232 -230 -728 -300 -88 -975 -371 -274 -851 -582 -107 -767 -631 5 -17 -247 -156 626 212
915 212 265 792 263 300 890 384 91 657 592 25 226 593 -37 -646 263 -182 -1189 -162 -121 -1401 -3
936 -3 -331 -1035 -475 -162 -239 -433 420 129 -666 237 876 -107 539 1101 111 387 900 662 301 660 727 187
958 187 -250 165 139 -421 -99 -94 -778 -245 -396 -820 -773 -425 -389 -746 -33 -93 -687 -132 536 -144 61 1047
$$ packed form
813g32J074l1q34O91N33o87M15Q16q95k7N51k64o72O54K70j251O45L29r78k98
833f91J026j017j97Q74n20p06R20J28m14Q0P68m23n74J357l37o44R59J47o65L40
853D11O73l67m47N38J6q63O48L43j380N57L65p22m19Q25o69p08N05O04p64QR44
874I8r16j87J271o96k18J222j34n75K28J013p40n8P00k64p06R62k19j016N45L77
894F87p22J07J60m62m98M28K12q87O04R7n77K69M75o60J36O36k2k30R1P82m14
915B12N3N27n29L7N90n06k93N66o5n67K01L67o30o09R09m45j007J027M1j280J398
936cl28p04N60L13p7j94Q53k91p95R03O39r83O46N62r90K76N13k38l61L59O7n40
958A87m37M15k6n60L22No84N33j51m24M7L48L6l57P13o0n94N55O68o80K05R86
$$ plain form
980 1047 313 122 814 512 166 546 1042 261 280 744 -186 -72 598 -413 -429 199 -233 -782 -471 -415 -530
1001 -530 -664 -89 -662 -549 -47 -239 -365 246 84 47 387 352 443 200 535 617 168 588 553 -79 315 287
1023 287 -7 -66 398 -349 -608 -621 8 -615 -490 -55 -627 -876 84 -203 -866 233 70 -217 280 485
1043 485 -185 115 854 248 -37 1066 611 31 828 566 -34 316 377 -145 -346 4 -25 -642 -460 -154
1063 -154 -732 -533 -324 -542 -258 -239 15 -426 -130 253 155 -49 575 262 -225 809 413 33 664 465
1083 465 329 688 572 271 -47 248 173 -342 353 -106 -666 -244 -501 -881 -376 -123 -497 -426 -427 -169 -593
1104 -593 -133 82 -283 217 521 332 420 640 566 625 652 492 247 92 544 166 -271 496 -10 -516 -194
1125 -194 -128 -695 -439 -144 -755 -780 -166 -323 -789 -59 142 -639 83 340 -120 152 475 338 230 639 574
$$ packed form
980A047p34j91O92l02l46L80M96p81J9M64r30J14O70j011j6O28m32n49L11N6j15
1001e30j34N75n73J13N02j92j26O11j62l7L40l5R1k43L35Q2m49M20l5o32L94k8
1023B87k94n9M64p47k59j3O29o23J25M35n72k49R60k87o63J099j63k87M97K05
1043D85o70L00P39o06k85J103m55n80P97k62o00L50O1n22k01L50k9o17J82L06
1063a54n78J99K09k18K84J9K54m41K96L83r8k04O24l13m87J034l96l80O31j99
1083D65j36L59j16l01l18K95p5n15O95m59n60M22k57l80N05K53l74P1jK58m24
1104e93M60K15l65N00L04j89Q8K20p4N9K7j60k45j55M52l78m37P67n06n06L22
1125a94O6n67K56K95o11k5O14j57m66P30K01p81P22K57m60K72L23j37j08M09o5
$$ plain form
1146 574 185 240 412 152 46 528 305 -73 23 183 -275 -462 -98 -384 -661 -386 -446 -539 -324 -368 -374 -204
1168 -204 -28 -17 -226 87 147 -174 798 643 104 602 454 -62 318 495 236 253 502 104 -179 137 -246
1189 -246 -604 -64 -218 -836 -304 -221 -766 -230 -208 -192 -263 -181 40 -50 -57 646 63 146 483 371 379 508 717 163
1213 163 219 262 29 -106 -69 247 -652 -15 -197 -742 -189 74 -447 -408 -163 -345 -751 -76 62 -517 -325
1234 -325 331 -322 -132 556 -91 285 857 593 393 552 377 521 438 348 240 -44 406 -22 -356 -287 -114
1255 -114 -237 -332 -438 -402 -590 -213 -183 -455 -467 11 -442 -172 367 -34 194 378 227 446 519 382 394 579
1277 579 654 418 191 614 247 52 245 54 -630 -247 -191 -219 -380 -219 -237 -435 34 -350 -578 11 -233
1298 -233 -51 -225 198 114 -24 307 265 112 349 441 130 589 550 230 331 348 -314 55 -28 102 -340 -522
$$ packed form
1146E74l89N5J72k60j06M82k23l78R6J60m58j87L64k86k77K75o0r3K15m4oJ70
1168b04J76J1k09L13O0l21R72j55n39M98j48n16L80J77k59J7K49l98k83L16l83
1189b46l58N40j54o18N32Q3n45N36K2J6p1Q2K21r0pP03n83Q3L37j12QJ29K09n54
1213A63N6M3k33j35L7L16q99O37j82n45N53K63n21L9K45j82m06O75J38n79J92
1234c25O56o53J90O88o47L76N72k64k00J59j75J44q3r0j08k84M50m28l34O9J73
1255a14j23r5j06L6j88L77L0k72j2M78m53K70N39m01K28J84j51K19P3j37J2J85
1277E79P5k36k27M23l67j95J93j91o84L83N6k8j61J61j8j98M69l84k28N89k44
1298b33J82j74M23q4j38L31m2j53K37R2l11M59l9l20J01J7o62L69q3J30m42j82
$$ plain form
1320 -522 -245 -396 -564 133 -82 -467 -152 -175 -366 -132 -100 -13 -28 187 192 13 346 340 127 296 526 381 506
1343 506 365 198 81 -26 269 -14 -223 136 -215 -265 -567 -393 -596 -355 -383 -249 -362 -12 -128 -207 151
1364 151 -141 -83 276 177 194 400 465 101 432 502 128 137 328 204 -25 91 232 -225 55 -71 -685 -297
1386 -297 -294 -180 -533 -326 -613 -499 -55 116 -316 -19 80 -57 132 185 382 111 353 363 435 320 458 554
1408 554 -99 521 357 2 -17 191 -424 -190 45 -207 -515 -265 -189 -474 -242 -272 -537 -126 -184 -375 -142
1429 -142 40 -125 31 257 476 -93 392 299 344 299 499 358 205 223 104 168 12 -65 -461 -201 -323 -199
1451 -199 -293 -216 -216 -189 -279 -49 -232 -150 -187 -244 -190 130 257 -61 439 272 121 322 408 152 151 375 -152 106
1475 106 164 1 -341 10 327 -438 -63 57 -203 -480 -19 -211 -341 -211 -37 -292 -52 370 -143 -140 244
$$ packed form
1320e22K77j51j68O97k15l85L15k3j91K34L2Q7j5K15Nj79L33ok13J69K30j45J25
1343E06j41j67j17j07K95k83k09L59l51n0l02J74k03K41k8J34j13L50j16p9L58
1364A51k92N8L59r9J7K06O5l64L31P0l74RJ91j24k29J16J41m57K80j26o14L88
1386b97LJ14l53K07k87J14M44J71m32K97R9j37J89N3J97k71K42J0P2j15J38R6
1408E54o53O20j64l55j9K08o15K34K35k52l08K50P6k85K32l0k65M11n8j91K33
1429a42J82j65J56K26K19n69M85r3M5m5K00j41j53J8j19O4j56p7l96K60j22J24
1451a99r4P7%K7r0K30j83Q2l7n7N4L20J27l18N00j67j51K01Q6k56jK24n27K58
1475A06N8j63l42L51L17p65L75J20k60k77M61j92j30J30J74k55K40M22n13LL84
$$ plain form
1496 244 171 171 430 424 306 300 362 456 203 224 246 -69 290 187 -185 -412 78 -94 -453 103 -192 -219 -537 -200
1520 -200 -466 -353 -17 -17 24 165 99 37 174 171 273 406 364 215 139 275 501 149 355 263 39 135 -241 -2
1544 -2 -36 -204 -269 -306 -409 -121 -616 -289 -222 -434 -174 71 -238 -133 407 -178 17 10 251 80 363 415 298
1567 298 324 341 26 -110 385 112 -41 117 65 -153 -350 -168 -184 -443 -213 -313 -356 -293 -364 46 -173 54
1589 54 -39 -157 -25 -1 128 285 405 261 253 519 377 167 199 4 186 77 81 -137 23 -13 52 -155 -126 -519
1613 -519 -215 -129 -128 -139 -320 -31 -539 -206 -93 -47 -287 66 207 296 424 14 147 518 362 293 361 383 99
1636 99 61 209 120 -81 -11 -8 -261 -268 -331 -190 -68 -130 -456 -201 -285 -56 57 -300 -81 -123 -165 290 175 93 347
1661 347 296 198 -3 450 419 -37 176 263 -20 34 0 -269 -281 -144 -323 -293 -118 -197 -315 -380 -72 -418 -323 195
$$ packed form
1496B44p3%K59oj18oO2R4k53K1K2l15L59j03l72k27M90j72l59N56k95k7l18L37
1520b00k66J13L36%M1J41o6o2J37lJ02J33m2j49p6J36K26l52K06r2k24R6l76K39
1544bl4j68o5l7j03K88m95L27O7k12K60K45l09J05N40n85J95pK41j71K83N2j17
1567B98K6J7l15j36M95k73j53J58n2k18j97J82j6k59K30j00m3O3p1M10k19K27
1589E4r3j18J32K4J29J57J20j44qK66j42k10L2j95J82j09Mk18J60l6O5k07K9l93
1613e19L04Q6Jj1j81K89n08L33J13M6k40L53J41Q9J28m10J33L71j56o9O8K2k84
1636I9l8J48q9k01P0Lk53po3J41J22o2l26K55q4K29J13l57K19m2m2M55j15q2K54
1661C47n1r8k01M53l1m56K13Q7k83N4l4k69j2J37j79L0J75p9j18o5L08l46R5N18
$$ plain form
1685 195 -307 -478 138 131 148 148 -114 230 165 434 204 197 349 352 92 313 74 -151 -18 67 -80 -282 -38 -38
1709 -38 -289 -201 -276 -520 -191 -196 -202 -211 -187 -16 10 142 -64 33 -21 311 146 198 197 149 181 331 252 93 111 84 33
1736 33 27 156 -279 -253 -84 -293 -628 -386 -376 -311 -135 -16 -171 -79 -49 335 -89 0 319 -80 404 544 409
1759 409 370 10 410 27 123 321 -68 -59 289 259 -146 -157 -115 -359 -321 66 -174 -189 -240 -230 -289 -289 33 -101 28
1784 28 -140 -132 297 -43 205 384 180 99 369 236 277 228 305 321 123 98 51 -69 -347 74 -35 -58 -229 -147
1808 -147 -365 -133 234 -480 -48 -166 -162 -179 38 213 -29 24 97 103 434 39 254 40 293 164 186 365 6
1831 6 -71 194 80 97 -276 19 -88 -99 -78 -184 -337 -323 10 60 -185 -16 -79 -247 153 -16 102 71 416
1854 416 357 75 416 307 87 312 286 207 15 152 203 -161 178 37 -354 -185 -216 -296 -153 -268 -209 -498
$$ packed form
1685A95n02j71O16pJ7%k62L44o5K69k30pJ52Lk60K21k39k25J33Q5j47k02K44%
1709c8k51Q8p5k44L29norK4J71K6J32k06R7n4L32j65N2jm8L2J50p9j59J8k7n1
1736C3oJ29m35K6J69k09l35K42J0O5J76J19j55R2L0L84m24Q9L19l99M84J40j35
1759D09l9l60M00l83R6J98l89RL48l0m05j1M2k44L8L87k40j5n1J0n9%L22j34J29
1784B8j68QM29l40K48J79k04q1K70j33M1m9P7J6j98k5m7j20k78M21j09k3j71Q2
1808a47k18K32L67p14M32j18Mj7K17J75k42N3P3OL31l95K15k14K53j29K2J79l59
1831Fp7K65j14J7l73K95j07j1K1j06j53J4L33N0k45J69o3j68M00j69J18l1L45
1854D16n9k82L41j09k20K25k6p9j92J37N1l64L39j41l91J69l1q0J43j15N9k89
$$ plain form
1876 -498 -183 152 109 133 77 57 112 126 39 187 119 216 123 117 355 401 143 324 278 -69 230 124 0 115 -145
1901 -145 -264 -282 -83 -244 -305 -225 -182 -162 -127 -124 -502 179 -63 94 334 86 186 321 400 222 106 233 458
1924 458 157 177 284 -2 -33 124 63 179 -195 -233 -369 -314 -125 -12 -218 -288 40 -182 -124 -55 166 70 89
1947 89 86 48 178 200 150 -96 99 302 117 275 157 424 273 -116 150 -316 -81 103 -375 158 -201 -244
1969 -244 -304 -375 -255 -197 -307 -129 -195 36 -132 -109 150 282 -134 150 297 257 96 233 99 343 400 169
1991 169 163 -289 -59 -104 -90 -22 -368 97 -58 -133 -282 -365 -203 -259 -33 -219 11 94 127 -19 18 77 -139 -27
2015 -27 171 234 187 73 195 253 138 146 269 -25 -17 59 -173 218 -189 -129 -106 -69 -338 -203 -268 18 -239 -230 4
2040 4 -114 -22 -127 -26 -71 130 245 309 174 244 204 139 322 179 -5 150 21 -117 152 -85 289 -179 -249
$$ packed form
1876d98L15L35m3K4n6k0N5J4q7J48o8R7r3oK38M6k58J81m6l47K99j06j24J15k60
1901a45j19j8J99j61o1Q0M3K0L5Ll78O81k42J57K40k48J00J35P9j78j16J27K25
1924D58l01K0J07k86l1J57o1J16l74l8j36N5J89J13k06p0L28k22N8O9K21r6J9
1947H9ll8J30K2n0k46J95K03j85J58j18K67j51l89K66m66K35J84m78N33l59m3
1969b44o0p1J20N8j10J78o6K31j68K3K59J32m16K84J47m0j61J37j34K44N7k31
1991A69om52K30m5J4O8l46M65j55p5j49q3J62n6K26j86K30Q3L3j46L7N9k16J12
2015b7J98O3m7j14J22N8j15QJ23k94QP6k32L91m07O0K3L7k69J35o5K86k57RK34
2040Dj18R2j05J01m5K01J15O4j35P0m0o5J83j43j84J55j29j38K69k37L74m68p0
$$ plain form
2063 -249 -68 -243 -257 32 -163 -236 -337 -316 -62 -223 -76 102 36 -5 -150 118 23 71 -16 176 220 240 409
2086 409 -58 244 125 -144 58 188 106 35 -112 133 -279 -405 -30 -332 -424 18 -279 -350 -66 -123 -163 60
2108 60 12 168 64 187 124 -108 181 257 308 57 175 72 100 161 108 -40 273 159 46 -152 79 -294 63
2131 63 135 -307 -266 -164 -18 126 -155 -18 -101 -3 -96 24 -107 232 147 330 88 177 56 -53 150 134 -79
2154 -79 212 91 -21 -113 -83 -252 -140 -84 -480 138 -78 56 -190 -380 -90 -110 -147 -103 113 188 46 150 -7
2177 -7 215 191 -112 247 184 264 183 195 156 -36 26 -53 -1 -81 -338 -206 -197 -209 -119 -75 -310 -173 -60 -314 -180 -33
2203 -33 -340 31 181 108 144 75 99 -79 53 215 -149 16 -50 -170 -117 -180 -46 172 41 32 59 6 -12 -81 -154
2228 -154 -339 -173 -96 -96 -213 81 -254 -15 54 -7 -87 112 -152 77 30 176 225 -81 173 -3 187 210 64
$$ packed form
2063b49J81j75j4K89j95p3j01K1K54j61J47J78o6m1j45K68r5M8q7J92M4K0J69
2086D09m67L02j19k69K02J30q2p1j47K45m12j26L75l02r2M42k97p1K84n7m0K23
2108F0m8J56j04J23o3k32K89P6N1k51J18j03K8O1n3j48L13j14j13j98K31l73L57
2131F3P2m42M1J02J46J44k81J37q3R8r3J20j31L39q5J83k42Q9j21j09K03j6k13
2154g9K91j21j12r2L0j69J12N6l96O18k16J34k46j90K90k0l7M4K16P5j42J04j57
2177gK22k4l03L59o3Q0q1J2l9j92O2p9N2q0k57J32Rj2R0M4k35J37J13k54J34J47
2203c3l07L71J50p3L6o9K4j78J32J62l64J65o6j20N3o3J34K18j31rK7n3j8o9p3
2228a54j85J66P7%j17K94l35K39O9o1q0J99k64K29m7J46M9l06K54j76J90K3j46
$$ plain form
2251 64 30 8 51 -37 -89 -351 -149 -362 -362 -140 -264 -147 -358 -412 -119 -35 -68 78 -116 180 48 -5 63 -155
2275 -155 67 182 133 134 172 125 79 212 222 6 118 0 -42 -320 -312 -316 -227 -289 84 -317 -140 49 -311 -128 236
2300 236 173 -116 -150 70 12 158 193 -36 133 210 460 194 311 229 363 -109 -56 23 -80 -128 158 -52 -203
2323 -203 113 -267 -242 -59 -181 -290 -140 -280 -201 -127 93 79 -120 -88 129 240 137 -97 87 211 75 -42
2345 -42 154 206 99 290 36 -4 -27 -88 -20 -49 -154 -213 -297 -527 107 -221 -383 -262 -31 10 78 -100 -82 35
2369 35 109 52 131 145 239 169 100 173 -139 264 -8 -89 46 -72 250 55 -81 -124 13 -186 -222 18 6 211
2393 211 -296 -254 -312 156 -19 -122 88 206 -142 201 77 75 52 319 76 40 392 150 -75 -62 -88 28 -135
2416 -135 -172 25 -19 -13 -235 -200 -101 -242 -192 -292 -52 233 -227 -189 -39 -189 14 -9 -101 57 157 128 124 508
$$ packed form
2251F4l4k2M3q8n2k62K02k13%K22j24J17k11n4K93Q4l3J46j94K96j32n3O8k18
2275a55K22J15m9JL8m7m6J33J0k16J12j18m2k78QmQ9o2L73m01J77J89l60J83L64
2300B36o3k89l4K20n8J46L5k29J69P7K50k66J17q2J34m72N3P9j03m8K86k10j51
2323b03L16l80K5J83j22j09J50j40P9P4K20j4j99L2K17J11j03k34J84J24j36j17
2345d2J96N2j07J91k54m0k3o1O8k9j05n9q4k30O34l28j62J21K31M1O8j78J8J17
2369C5P4n7P9J4R4p0o9P3l12M03k72q1J35j18L22j95j36m3J37j99l6K40j2K05
2393B11n07M2n8M68j75j03K10J18l48L43j24kk3K67k43l6L52k42k25J3k6J16j63
2416a35l7J97m4Ok22L5R9j41N0j00K40K85m60L8J50j50K03k3r2J58J00k9mL84
$$ plain form
2440 508 288 63 46 163 164 158 -6 -147 60 114 -170 29 -105 -337 -49 -101 -21 -222 -44 -18 -123 -63 -93 -106
2464 -106 -98 9 3 107 -146 251 257 -18 73 177 204 213 166 45 -46 -30 40 -8 33 170 -149 61 18 -299 -36 -396
2490 -396 -384 -78 145 2 36 -79 -10 86 194 206 95 204 164 167 255 -56 30 165 8 30 68 246 -1 61
2514 61 -370 -258 -322 73 -3 38 -169 14 -122 -175 -81 54 -84 -99 -30 143 164 -123 2 154 -19 -68 -88 280
2538 280 152 -223 315 150 40 14 -12 348 -167 -110 2 -141 -126 -246 -198 -37 -133 -300 2 -238 -121 143
2560 143 -125 -94 144 -117 -36 -71 -123 263 135 183 271 -40 227 13 -11 112 -166 8 54 30 -82 -146 -266
2583 -266 219 -248 -119 -151 -213 -191 51 -330 6 141 -156 101 -63 219 167 85 -117 108 229 144 -164 -43
2605 -43 -65 205 106 -133 -29 -178 48 -91 -52 -135 -367 -216 27 -119 29 -160 -95 -92 -183 -45 -118 141 117 264
$$ packed form
2440E08k20k25j7J17Joj64j41K07N4k84J99j34k32K88n2Q0k01J78K6j05O0l0j3
2464a06QJ07oJ04k53L97Ok75R1J04K7Rm7j21r1J6P0m8M1J37l19K10m3l17K63l60
2490c96J2L06K23j43L4j15O9R6J08J2j11J09m0LQ8l11Q6J35j57K2L8J78k47O2
2514F1m31J12o4L95p6M1k07J83j36n3R4J35j38j5O9J73K1k87J25J52j73m9k0L68
2538B80j28l75N38j65j10k6k6L60n15N7J12j43J5j20M8J61r6j67L02k40J17K64
2560A43k68L1K38k61Q1l5n2L86j28M8Q8l11K67k14k4J23k78J74M6k4j12o4j20
2583b66M85m67J29l2o2K2K42l81L36J35k97K57j64K82n2q2k02K25J21q5l08J21
2605d3k2K70r9k39J04j49K26j39L9q3k32J51K43j46J48j89O5Lr1J38p3K59k4J47
$$ plain form
2629 264 205 222 52 79 170 -14 -37 93 424 -134 37 30 215 -55 4 -17 -54 -231 -62 -123 -209 -124 -86 -12 -55
2654 -55 -70 -13 16 -115 9 107 -93 159 160 182 110 87 -124 -81 150 67 146 -88 27 183 155 -135 -188 -66 190
2679 190 72 61 -101 -297 -333 -236 110 -133 -184 -52 204 62 -140 145 74 -7 120 96 -60 237 -17 7 -6
2702 -6 12 -7 345 -97 -149 185 -30 82 -193 -160 -141 -188 -217 -50 -268 -41 -179 103 -73 84 80 -21 528 -17
2726 -17 205 -17 -42 22 441 189 36 108 43 168 87 90 49 29 95 138 -370 -53 -237 -34 -49 -71 -99 48 -5
2751 -5 11 -232 74 -44 222 1 69 175 193 174 190 -86 271 107 80 80 -6 79 160 159 81 5 -55 -234 -177 -171 -228
2778 -228 146 -189 -249 -230 -126 -149 -188 -144 -43 -240 168 141 78 57 162 187 316 1 257 -247 26 -230 15
2801 15 7 -229 9 61 78 -109 -145 -43 61 -165 -116 -197 -224 -94 -528 69 -72 -124 207 263 -73 39 174 261
$$ packed form
2629B64n9J7j70K7R1j84k3J30L31n58J71pJ85k70N9k1l7j77J69o1q6Q5L8P4m3
2654e5j5N7K9j31J24R8k00K52JK2p2k3k11M3K31q3P9k34J15J56k8k90n3J22K56
2679A90j18j1j62j96l6R7L46k43n1J32K56j42k02K85p1q1J27k4j56K97k54K4j3
2702fJ8j9L52m42n2L34k15J12k75L3J9m7k9J67k18K27j38K82j76J57mj01N49n45
2726a7K22k22k5O4M19k52j53P2o5J25q1Lm1k0O6M3n08L17j84K03j5k2k8J47n3
2751eJ6k43L06j18K66k21O8J06J8j9J6k76L57j64k7%q6Q5Q1jp8p6o0j79N7On7
2778b28L74l35o0J9J04k3l9M4J01j97M08k7o3k1J05K5J29l15K56n04K73k56K45
2801A5qk36K38N2J7j87l6J02J04k26M9q1k7J30m34N97j41n2L31N6l36J12J35Q7
$$ plain form
2825 261 -100 -130 -47 344 10 9 71 14 151 64 -193 67 26 60 13 41 -306 -87 -129 -232 -254 -247 -60 -378 -167
2850 -167 58 -43 -136 91 1 -31 74 194 13 -43 336 81 3 351 252 -51 -9 -47 0 -4 174 -367 -31 -14
2874 -14 108 -301 -147 -255 125 -89 -11 -179 7 -18 -127 58 111 226 -67 288 89 -57 122 9 101 69
2896 69 1 -7 -13 165 123 -193 -106 -44 -188 -174 76 197 -123 71 -221 -196 -7 -114 -146 27 -24 -81 49 -192 121
2921 121 59 114 276 325 179 346 187 346 70 185 56 -82 61 -226 128 -200 -27 -155 15 -224 -6
2942 -6 -69 -19 -208 -106 178 -104 10 179 -1 252 55 -15 147 15 168 229 62 124 -166 -57 159 -30
2964 -30 120 42 71 -77 -38 -79 -279 -48 -91 -124 -226 -268 -149 -107 -9 150 224 32 120 -208 -16 34 216 399
2988 399 213 394 176 -270 323 182 226 336 157 264 49 -350 79 -84 -350 75 -272 -184 -332 -138 -122
$$ packed form
2825B61l61l0Q3L91l34jO2n7J37q7k57K60m1L4m7K8l47K19m2j03k2PJ87l18K11
2850a67K25j01r3K27r0l2J05J20j81n6L79k55p8L48r9l03M2l8M7mJ78n41L36J7
2874a4J22m09J54j08L80k14P8j68J86k5j09J85N3J15k93L55j99j46J79j13R2l2
2896F9o8qoJ78m2l16Q7O2j44J4K50J21l20J94k92K5J89j07l2J73n1n7J30k41L13
2921A21o2N5J62M9j46J67j59J59k76J15j29j38J43k87L54l28J73j28J70k39K18
2942fo3N0j89J02K84k82J14J69j80K53j97p0J62j32J53O1j67O2k90J09K16j89
2964c0J50p8K9j48L9m1k00K31m3l3j02m2J19M2R8J59P4j92Q8l28J92N0J82J83
2988C99j86J81k18m46N93j41M4J10j79J07k15l99M29j63k66M25l47Q8j48J94J6
$$ plain form
3009 -122 -185 -127 -20 -219 -35 -21 -85 0 165 -129 360 67 344 261 113 367 158 363 91 21 33 70 -32
3032 -32 53 -64 -10 -100 -122 -75 0 -254 -72 -187 -16 53 -32 11 89 -173 -126 237 -120 232 69 211 104 92
3056 92 230 119 15 109 -111 131 -168 16 -25 -13 -153 197 -89 -415 -37 10 -264 181 -136 -137 -153 215 -32
3079 -32 69 356 -25 83 119 139 77 -46 27 186 271 125 59 -89 -10 34 -89 -249 -119 -65 -15 -163 -214 -206 -65
3104 -65 -267 -60 -164 -253 -253 -11 189 -182 -2 118 279 -64 333 91 288 262 -10 217 -3 1 -41 111 209
3127 209 -21 79 -75 260 -234 11 -113 -276 -42 -58 -242 113 -259 192 60 -87 179 -84 -75 102 51
3148 51 149 -1 70 -107 -1 -71 -34 -224 -155 50 41 -9 -234 103 -151 -89 2 -150 -5 -9 -120 -296 -106 -25 -269
3173 -269 -51 -5 107 73 135 269 -38 137 -88 107 -56 2 25 53 131 129 -55 184 -332 -288 -106 -35 152 -320
$$ packed form
3009a22o3N8J07j99J84J4o4Q5J65k94M89k93K77q3j48K54k09K05k72p0J2L7j02
3032c2Q5j17N4r0k2M7P5k54J82j15J71O9q5M3P8k62M7L63l57L52j63J42j07j2
3056I2J38j11j04R4k20K42k99J84m1J2j40L50k86l26L78M7k74M45l17jj6L68k47
3079c2J01K87l81J08L6K0o2j23P3J59Q5j46o6j48P9M4j23j60J30N4N0j48n1QJ41
3104f5k02K07j04q9%K42K00l71J80J20J61l43L97k42J97k6k72K27k20Mm2J52R8
3127B09k30J00j54L35m94K45j24j63K34j6j84L55l72M51j32j47K66k63RJ77n1
3148E1R8j50P1j77J06p0L7j90O9K05rn0k25L37k54O2R1j52J45mj11j76J90Q1k44
3173b69K18M6J12l4O2J34l07J75k25J95j63N8K3K8P8kj84K39n16M4J82P1J87m72
$$ plain form
3197 -320 42 -211 -101 -122 -251 -15 -225 -101 -196 -86 295 -293 56 -67 -193 123 185 -112 218 112 69
3218 69 279 80 217 -58 149 120 54 93 -116 -96 5 32 144 7 -139 -38 19 -101 -111 46 -92 187 361
3241 361 47 313 210 -3 -13 210 223 28 86 -49 25 -309 110 205 23 34 -44 23 -177 -87 -222 -259 -131
3264 -131 -108 -321 -36 102 145 166 -86 25 -150 -114 100 144 273 125 -40 93 24 -66 167 -7 -43 -26 144
3287 144 -2 141 -134 -7 -4 100 -156 67 -172 -304 112 -294 -170 -186 125 -143 177 273 134 60 -4 104
3309 104 -47 4 -156 285 118 24 106 -28 -55 108 349 220 132 -104 -32 -252 -27 -107 -50 -290 71 -220 -61
3332 -61 45 40 3 2 229 112 -79 117 114 99 187 29 122 183 -68 29 -59 36 254 -142 65 275 9 72 -4 -28
3358 -28 -3 120 -280 105 -100 16 -118 55 -59 105 -55 -7 40 220 140 172 196 50 86 60 -132 259 285
$$ packed form
3197c20L62k53J10k1j29K36k10J24r5J10L81n88L49j23j26L16O2k97L30j06m3
3218F9K10j99J37k75K07k9o6L9k09K0J01K7J12j37j46J01N7j20j0J57j38K79J74
3241C61l14K66j03k13j0K23J3j95N8j35P4l34M19R5j82J1p8O7k00R0j35l7J28
3264a31K3k13K85J38M3K1k52J11j75L6K14M4J29j48j65J33o9r0K33j74l6J7J70
3287A44j46J43k75J27LJ04k56K23k39j32M16m06J24j6L11k68L20R6j39p4o4J08
3309A04j51N1j60M41j67r4Q2j34k7J63K41j29q8k36P2k20K25q0N7k40L61k91J59
3332f1J06nl7jK27j17j91J96lj5Q8j58R3O1k51R7q8R5K18l96K07K10k66O3p6k4
3358b8K5J23m00L85k05J16j34J73j14J64j60M8M7J80q0L2K4j46L6k6j92L91K6
$$ plain form
3381 285 -39 26 -8 -152 -44 -134 -255 -38 -256 51 -84 -160 -423 -122 -133 -148 -299 127 52 -84 185 24
3403 24 36 -117 -206 136 20 110 254 15 399 -7 187 234 176 40 121 156 -103 11 -72 12 -34 -25 -215 -197 -281
3428 -281 -100 36 -132 90 -99 24 -57 105 112 -183 92 101 79 95 317 140 152 232 188 118 -43 -13 -57 32 51
3453 51 -76 0 -120 -314 -141 60 -47 -163 123 89 -37 -25 14 54 -95 383 135 149 175 177 -2 108 -154
3476 -154 -14 -112 -162 113 -43 49 -138 80 105 -356 44 65 1 178 -229 -119 -39 -74 -85 -48 235 -162 -136 32
3500 32 137 46 157 -222 20 -61 -120 79 -73 205 254 0 226 2 -58 -121 -302 -17 81 -197 -59 174 -178
3523 -178 247 -290 -93 -53 -123 -136 -53 64 -114 -175 206 25 -147 135 54 194 136 -33 196 226 -23 88 9
3546 9 -24 -130 63 19 -113 -210 -24 97 -56 49 -207 5 -171 14 -130 381 -5 174 -100 -75 -37 -92 68
$$ packed form
3381B85l24O5l4j44J08r0j21K17k18L07j35p6k63L01j1j5j51M26p5j36K69j61
3403B4J2j53q9L42j16R0J44k39L84m06J94M7n8j36Q1L5k59J14q3Q4m6Rj90J8q4
3428b81J81J36j68K22j89J23q1J62Pk95K75Rk2J6K22j77J2Q0m4p0j61L0m4Q9J9
3453E1j27P6j20j94J73K01j07j16K86l4j26J2L9M0j49M78k48J4K6Kj79J10k62
3476a54J40r8n0K75j56R2j87K18K5m61M00K1o4J77m07J10Q0l5j1L7K83l97K6J68
3500C2J05r1J11l79K42q1n9J99j52K78M9k54K26k24o0o3j81K85R8k78J38K33l52
3523a78M25n37J97M0p0j3Q3J17j78o1L81j81j72K82q1J40n8j69K29L0k49J11p9
3546Il3j06J93m4j32r7J86J21j53J05k56K12j76J85j44N11l86J79k74K5L8n5J60
$$ plain form
3569 68 -8 169 -22 94 140 65 83 96 126 24 -80 -14 -129 103 -136 144 139 -149 -57 -194 -127 42 -7 -109
3593 -109 67 -31 166 74 33 182 -5 -20 201 -85 -68 216 -60 303 -46 -4 18 175 -47 -63 -49 100 -3
3616 -3 -107 -71 -354 -16 -193 -271 30 -94 -239 -110 -119 75 -91 -254 -32 -176 80 104 -286 255 500 71
3638 71 163 251 -29 -235 -37 -87 89 91 -283 311 -150 22 -53 -266 -58 -85 -97 -54 -248 -19 -90 -188 -140 -186 -139
3663 -139 134 -133 -18 66 147 8 137 104 58 109 193 222 -50 -50 107 -97 28 -54 -413 -194 92 -143 -181 -67
3687 -67 -134 -203 9 78 96 -54 -19 -103 -70 171 43 25 283 -110 23 22 141 -106 -16 -26 159 51 35 173 139
3712 139 68 13 -211 -123 -209 23 0 -51 89 31 94 66 -21 -145 -52 -47 185 -109 -89 34 181 163 -89 188 232
3737 232 -38 -67 -242 -283 69 -125 -152 99 75 -19 -190 -248 46 1 -126 -26 -37 -213 36 -60 -134 -93 333 71
$$ packed form
3569F8p6J77j91J16M6p5J8J3L0j02j04O6j15K32k39K80nk88R2j37O7J69m9j02
3593a09J76r8J97r2m1J49j87j5K21k86J7K84k76L63l49M2K2J57k22j6J4J49j03
3616cj04L6k83L38j77p8L01j24j45J29rJ94j66j63K22j44K56K4l90N41K45m29
3638G1R2Q8k80k06J98n0J76Kl74N94m61J72p5k13K08k7j2M3j94K29p1r8M8m6M7
3663a39K73k67J15Q4Q1j39J29l3m6N1Q4K9k72%J57k04J25q2l59K19K86k35l8J14
3687f7o7o9K12O9J8j50L5q4L3K41j28j8K58l93J33jJ19k47R0j0J85j08j6J38l4
3712A39p1n5k24Q8q6K32k3n1J40n8O3k8q7j24R3NK32k94K0J23J47j8k52K77M4
3737B32k70k9j75m1L52j94k7K51k4r4j71n8K94m5j27J00j1j76K49r6p4M1M26k62
$$ plain form
3761 71 -99 148 31 139 101 129 323 -67 33 32 37 103 84 291 -39 -190 24 -75 -35 27 22 -298 -36 -44 40 -296
3787 -296 124 78 -7 -227 -22 323 -154 15 -47 31 231 37 -122 88 48 246 -9 -46 190 61 -16 174
3809 174 -46 -53 -116 4 30 -56 -154 65 -224 -164 65 -103 23 -44 -65 87 -48 189 65 -24 -85 71 132 -89
3833 -89 131 -121 -46 -135 -132 43 -1 63 10 59 -53 -69 -91 -66 -44 -132 -188 -351 58 42 65 110 -108 8 50 -13 7
3860 7 -2 83 170 -106 82 67 233 201 91 243 -189 -184 93 57 -23 -49 -216 -125 -93 73 -236 176 -434 -136 -94
3885 -94 155 67 84 35 -25 193 160 155 262 140 153 55 122 -40 -83 121 12 -147 -209 268 73 -324 -69 27 30
3910 30 -40 -31 120 95 15 -77 41 -16 54 -105 101 312 -20 211 197 355 8 145 -11 -46 -102 131 69 -124
3934 -124 -163 2 -219 295 69 -35 106 -218 -14 95 120 153 -126 -174 -200 277 321 80 -153 37 -144 46
$$ packed form
3761G1j70K47j17J08l8K8J94l90J00jNO6j9K07l30j51K14r9M0O2nl20K62qQ4l36
3787b96M20m6q5k20K05L45m77J69o2P8K00j94j59K10m0J98k55l7K36j29p7J90
3809A74k20po3J20K6q6r8K19k89O0K29j68J26o7k1J52j35K37j24q9o1J56O1k21
3833h9K20k52P5q9LJ75m4O4n3M9j12j6k2K5K2q8n6j63M09j6K3M5k18J16M2o3K0
3860GrQ5Q7k76J88j5J66l2j10J52m32NK77l6q0k6j67R1L2J66l09M12o10K98M2
3885i4K49q8J7m9o0K18l3nJ07j22J3r8O7j62m3K04j09j59o2M77j95l97K55R6L
3910C0p0RJ51k5q0r2J18n7P0j59K06K11l32K31j4J58l47J37j56l5n6K33o2j93
3934a24l9J65k21N14k26j04J41l24K04J09K5L3k79m8k6M77M4k41k33J90j81J90
$$ plain form
3956 46 102 -56 220 -75 -48 -190 31 198 133 -36 46 2 -145 -46 -241 -18 6 -26 121 -73 23 92 -37 -150
3980 -150 -94 137 -90 10 144 215 204 -98 66 295 136 -44 -267 26 -27 222 -147 -86 151 -80 10 -88
4002 -88 37 -163 22 55 26 -165 -38 55 201 11 88 174 65 -29 161 111 -2 -143 -62 199 -66 164 25
4025 25 177 165 104 -69 48 82 -192 -26 -61 -111 -126 -45 -19 8 -186 -140 -172 -46 116 -114 -204 -9 -210 163
4049 163 -116 172 219 -60 166 102 68 276 88 182 -67 -14 21 -157 13 -177 34 -205 -127 -152 99 -123 -50
4072 -50 14 -133 -187 95 20 157 100 281 -78 47 -23 33 1 -13 -31 -76 -150 -186 189 130 103 41 -171 57 -182
4097 -182 66 -272 3 37 -41 102 37 -68 -94 23 -70 -61 -53 -146 15 -83 -38 3 -16 -44 130 40 -218 66 -21 11
4123 11 -18 -119 -112 15 45 231 -188 -52 105 -37 -146 -167 -131 -67 -202 -36 -178 -27 -60 -110 181 38 -78
$$ packed form
3956D6N6j58K76k95K7j42K21J67o5j69Q2m4j47R9j95K23K4l2J47j94R6O9j29j13
3980a50N6K31k27J00J34P1j1l02J64K29j59j80k23K93n3K49l69O1K37k31R0r8
4002h8J25k00J85L3k9j91J27R3J46j90P7Q6j09r4J90n0j13j41Q1K61k65K30j39
4025B5J52j2o1j73J17L4k74J66l5n0j5Q1K6K7j94M6l2J26J62k30r0J95k01L73
4049A63k79K88M7k79K26o4l4K08j88R4k49N3L5j78J70j90K11k39P8k5K51k22P3
4072e0O4j47n4K82p5J37n7J81l59J25p0N6l2j4j8m5p4l6L75n9k7o2k12K28k39
4097a82K48l38K75L4p8J43o5j05k6J17r3RQr3J61r8M5M1j9k8J74r0k58K84q7L2
4123A1k9j01PJ27L0J86m19J36J57j42j09k1L6O4j35J66j42J51l3n0K91j43j16
$$ plain form
4146 -78 90 -15 63 -129 223 -130 321 427 -5 16 243 214 147 163 76 -323 -47 46 -350 -160 75 -332 -60
4169 -60 -315 -222 -191 -256 81 -57 -73 176 81 -123 -52 -68 44 -14 -16 119 166 -51 -76 114 -63 148 -157 165
$$ packed form
4146g8J68j05P8j92L52l53M51J06m32K1K27k9o7J6q7l99K76R3l96J90K35m07K72
4169f0k55R3L1o5L37j38j6K49r5k04P1j6J12n8kJ35M7k17k5J90j77K11l05L22
$$ [...]
8191A02
##END NTUPLES=NMR FID
##END=
