##TITLE=1H_PhBBCO604-1
 CDCl3
 8 sc, 
 7.04.2022
##JCAMPDX= 6.0         $$ Bruker NMR JCAMP-DX V2.0
##DATA TYPE= NMR FID
##DATA CLASS= NTUPLES
##ORIGIN= UXNMR, Bruker Analytische Messtechnik GmbH
##OWNER= root
$$ XWIN-NMR		Version 3.5
$$ Thu Apr  7 10:22:27 2022 Russian Standard Time (UT+4h)  she@DPX200
##.OBSERVE FREQUENCY= 200.131346
##.OBSERVE NUCLEUS= ^1H
##.DELAY= (6, 6)
##.ACQUISITION MODE= SIMULTANEOUS
##.ACQUISITION SCHEME= undefined
##.AVERAGES= 8
##.DIGITISER RES= 18
##SPECTROMETER/DATA SYSTEM= spect
##.PULSE SEQUENCE= zg30
##.SOLVENT NAME= CDCl3
##.SHIFT REFERENCE= (INTERNAL, CDCl3, 0, 15.7039)
##AUDIT TRAIL= $$ (NUMBER, WHEN, WHO, WHERE, WHAT)
$$ ##TITLE= Audit trail, XWIN-NMR		Version 3.5
$$ ##JCAMPDX= 5.01
$$ ##ORIGIN= Bruker BioSpin GmbH
$$ ##OWNER= she
$$ F:/spectra/data/she/nmr/H-F/1/audita.txt
$$ ##AUDIT TRAIL=  $$ (NUMBER, WHEN, WHO, WHERE, WHAT)
(   1,<2022-04-07 10:21:11.65 +0400>,<she>,<DPX200>,
      <created by zg, POWCHK disabled, PULCHK disabled
       configuration hash MD5:
       00 E9 B6 7A A2 85 ED C7 34 08 36 98 17 FE 4E 26
       data hash MD5: 16K
       39 C7 70 8E FB 47 E8 7A 7E 9B DC E1 A4 18 83 E5>)
$$ ##END=
$$ 
$$ hash MD5
$$ D6 95 2D 1E 1F A1 E5 AC 07 7C 87 97 C0 EB 9B 30
##$RELAX= 
##$RELAX= 
##$RELAX= 
##$RELAX= 
##$RELAX= 
##$RELAX= 
$$ Bruker specific parameters
$$ --------------------------
##$DU= <F:/spectra>
##$EXPNO= 1
##$NAME= <H-F>
##$PROCNO= 1
##$TYPE= <nmr>
##$USER= <she>
##$AMP= (0..31)
100 100 100 100 100 100 100 100 100 100 100 100 100 100 100 100 100 100 
100 100 100 100 100 100 100 100 100 100 100 100 100 100 
##$AQSEQ= 0
##$AQ_mod= 1
##$AUNM= <au_zg>
##$AUTOPOS= <>
##$BF1= 200.13
##$BF2= 200.13
##$BF3= 200.13
##$BF4= 200.13
##$BF5= 200.13
##$BF6= 200.13
##$BF7= 200.13
##$BF8= 200.13
##$BYTORDA= 1
##$CFDGTYP= 0
##$CFRGTYP= 5
##$CHEMSTR= <none>
##$CNST= (0..31)
1 1 145 1 1 1 1 1 1 1 1 1 1 1 1 1 1 1 1 1 1 1 1 1 1 1 1 1 1 1 1 1 
##$CPDPRG= <>
##$CPDPRG1= <>
##$CPDPRG2= <>
##$CPDPRG3= <>
##$CPDPRG4= <mlev>
##$CPDPRG5= <mlev>
##$CPDPRG6= <mlev>
##$CPDPRG7= <mlev>
##$CPDPRG8= <mlev>
##$CPDPRGB= <>
##$CPDPRGT= <>
##$D= (0..31)
0 1.2 0 0 0 0 0 0 0 0.06 0 0.03 0 0 0 0 0.0002 0 0 0 0 0 0 0 0 0 0 0 0 
0 0 0 
##$DATE= 1649312471
##$DBL= (0..7)
120 120 120 120 120 120 120 120 
##$DBP= (0..7)
150 150 150 150 150 150 150 150 
##$DBP07= 0
##$DBPNAM0= <>
##$DBPNAM1= <>
##$DBPNAM2= <>
##$DBPNAM3= <>
##$DBPNAM4= <>
##$DBPNAM5= <>
##$DBPNAM6= <>
##$DBPNAM7= <>
##$DBPOAL= (0..7)
0.5 0.5 0.5 0.5 0.5 0.5 0.5 0.5 
##$DBPOFFS= (0..7)
0 0 0 0 0 0 0 0 
##$DE= 6
##$DECBNUC= <off>
##$DECIM= 32
##$DECNUC= <off>
##$DECSTAT= 4
##$DIGMOD= 1
##$DIGTYP= 9
##$DL= (0..7)
0 120 120 120 120 120 120 120 
##$DP= (0..7)
150 150 150 150 150 150 150 150 
##$DP07= 0
##$DPNAME0= <>
##$DPNAME1= <>
##$DPNAME2= <>
##$DPNAME3= <>
##$DPNAME4= <>
##$DPNAME5= <>
##$DPNAME6= <>
##$DPNAME7= <>
##$DPOAL= (0..7)
0.5 0.5 0.5 0.5 0.5 0.5 0.5 0.5 
##$DPOFFS= (0..7)
0 0 0 0 0 0 0 0 
##$DQDMODE= 0
##$DR= 18
##$DS= 0
##$DSLIST= <SSSSSSSSSSSSSSS>
$$ [...]
##$SUBNAM2= <"">
##$SUBNAM3= <"">
##$SUBNAM4= <"">
##$SUBNAM5= <"">
##$SUBNAM6= <"">
##$SUBNAM7= <"">
##$SUBNAM8= <"">
##$SUBNAM9= <"">
##$SW= 18.0517287032376
##$SWIBOX= (0..15)
0 0 2 0 0 0 0 0 0 0 0 0 0 0 0 0 
##$SW_h= 3612.71676300578
##$TD= 16384
##$TD0= 1
##$TE= 0
##$TE2= 300
##$TE3= 300
##$TEG= 300
##$TL= (0..7)
0 120 120 120 120 120 120 120 
##$TP= (0..7)
150 150 150 150 150 150 150 150 
##$TP07= 0
##$TPNAME0= <>
##$TPNAME1= <>
##$TPNAME2= <>
##$TPNAME3= <>
##$TPNAME4= <>
##$TPNAME5= <>
##$TPNAME6= <>
##$TPNAME7= <>
##$TPOAL= (0..7)
0.5 0.5 0.5 0.5 0.5 0.5 0.5 0.5 
##$TPOFFS= (0..7)
0 0 0 0 0 0 0 0 
##$TUNHIN= 0
##$TUNHOUT= 0
##$TUNXOUT= 0
##$USERA1= <user>
##$USERA2= <user>
##$USERA3= <user>
##$USERA4= <user>
##$USERA5= <user>
##$V9= 5
##$VALIST= <valist>
##$VCLIST= <CCCCCCCCCCCCCCC>
##$VD= 0
##$VDLIST= <DDDDDDDDDDDDDDD>
##$VPLIST= <PPPPPPPPPPPPPPP>
##$VTLIST= <TTTTTTTTTTTTTTT>
##$WBST= 1024
##$WBSW= 4
##$XGAIN= (0..3)
0 0 0 0 
##$XL= 0
##$YL= 0
##$YMAX_a= 23165
##$YMIN_a= -28904
##$ZGOPTNS= <>
##$ZL1= 120
##$ZL2= 120
##$ZL3= 120
##$ZL4= 120
##$ABSF1= 10
##$ABSF2= 0
##$ABSG= 5
##$ABSL= 3
##$ALPHA= 0
##$AQORDER= 0
##$ASSFAC= 0
##$ASSFACI= 0
##$ASSFACX= 0
##$ASSWID= 0
##$AUNMP= <proc_1d>
##$AZFE= 0.1
##$AZFW= 0.1
##$BCFW= 1
##$BC_mod= 2
##$BYTORDP= 1
##$COROFFS= 0
##$CY= 11.3945322036743
##$DATMOD= 1
##$DC= 2
##$DFILT= <>
##$DTYPP= 0
##$F1P= 2.36226072786647
##$F2P= -0.459571619588291
##$FCOR= 0.5
##$FTSIZE= 0
##$FT_mod= 4
##$GAMMA= 1
##$GB= 0.15
##$INTBC= 1
##$INTSCL= 1
##$ISEN= 128
##$LB= 0.24
##$LEV0= 0
##$LPBIN= 0
##$MAXI= 10000
##$MC2= 0
##$MEAN= 0
##$ME_mod= 0
##$MI= 1.114404
##$NCOEF= 0
##$NC_proc= 0
##$NLEV= 6
##$NOISF1= 3.799351
##$NOISF2= 2.8
##$NSP= 1
##$NTH_PI= 0
##$NZP= 0
##$OFFSET= 15.70392
##$PC= 1
##$PHC0= -18027.51
##$PHC1= 12.60078
##$PH_mod= 1
##$PKNL= yes
##$PPARMOD= 0
##$PSCAL= 0
##$PSIGN= 0
##$REVERSE= no
##$SF= 200.130013532006
##$SI= 16384
##$SIGF1= 3
##$SIGF2= 2
##$SINO= 400
##$SIOLD= 16384
##$SREGLST= <1H.CDCl3>
##$SSB= 0
##$STSI= 0
##$STSR= 0
##$SW_p= 3612.71676300578
##$SYMM= 0
##$S_DEV= 0
##$TDeff= 0
##$TDoff= 0
##$TI= <>
##$TILT= no
##$TM1= 0
##$TM2= 0
##$TOPLEV= 0
##$USERP1= <user>
##$USERP2= <user>
##$USERP3= <user>
##$USERP4= <user>
##$USERP5= <user>
##$WDW= 1
##$XDIM= 8192
##$YMAX_p= 0
##$YMIN_p= 0
$$ End of Bruker specific parameters
$$ ---------------------------------
##NTUPLES= NMR FID
##VAR_NAME=  TIME,          FID/REAL,        FID/IMAG
##SYMBOL=    X,             R,               I
##VAR_TYPE=  INDEPENDENT,   DEPENDENT,       DEPENDENT
##VAR_FORM=  AFFN,          ASDF,            ASDF
##VAR_DIM=   8192,          8192,            8192
##UNITS=     SECONDS,       ARBITRARY UNITS, ARBITRARY UNITS
##FACTOR=    0.0002768,     1,               1
##FIRST=     0,             0,               0
##LAST=      2.2672688,     0,               0
##MIN=       0,             -28904,          0
##MAX=       2.2672688,     23165,           0
$$ Real data points
##PAGE= N=1
##DATA TABLE= (X++(R..R)), XYDATA
0@%%%%%%%%%%%%%%%%%%%Qj6J6j6J6j6K2l0L2l2M0m8N4o2P0p8Q8j02J14j27J40
40G3j57J77j95K13k36K63k91L22l55L89m28M73n20N74o34P00p75Q60r61J078j217
61f47J385j589J853k205K698l443M718p511K7819k4257j7630M1974j9135j8175
75a4145K3700M854k7671R780J2745j5117k331J5786j0098o848J1053r20r045P190
89a067K749n627J172O349l442m403O326K545p754M061O754q718k505J1160l881
104C719r677R578N063j3789K242J1973j1382n390J4296n675j0688J1952J043j2901
118i636P000Q043j0309p73J0695n828n421R404q64o752P425J907p254L061M658
133E356m668j285M977j290n053K882L247n753n67M564k946l600L738Q18m492J179
$$ plain form
0 0 0 0 0 0 0 0 0 0 0 0 0 0 0 0 0 0 0 0 0 8 -8 8 -8 8 -8 14 -16 16 -16 24 -24 30 -32 38 -40 48 -54 60 -67 73
40 73 -84 93 -102 111 -125 138 -153 169 -186 203 -225 248 -272 302 -332 368 -407 453 -508 570 -647
61 -647 738 -851 1002 -1203 1495 -1948 2770 -4741 23078 -1179 -18809 23165 4030 -14145
75 -14145 9555 14409 -13262 -3482 9263 -5854 -8185 7601 -2497 -9345 1708 788 -8257 -1067
89 -1067 1682 -3945 -2773 3576 134 -4269 2057 4602 -3152 909 7663 -1055 -3560 7600 3719
104 3719 -5958 3620 8683 -5106 -2864 9109 -2273 -7663 6633 958 -9730 2222 3265 -9636
118 -9636 -2636 5407 -4902 -5675 5020 -808 -6229 3175 2311 -4441 2984 4891 -2363 698 5356
133 5356 688 -597 4380 3090 -1963 919 4166 -1587 -2154 2410 -536 -4136 -398 420 -4072 -2893
149b893M241m133j896O926k245n037O757J609p292M512M899o424m63O296l096
164A761m147O518n45o819M547L412p137J043N606n401k198M848j250m084L037
179h09J813l876j21M094k691k042M553n05k867K744J948l121M66L830j384k899
195h67L668K81l914K307K168m221L97K592l144j864L728o32l848K601J270m157
211c635J324L694m196K29M205k410j817L819N2k950K381K198k707l62L276j822
227A279k258L717m49k956J895R64l193J35K189j869k012K594J92l700K217K008
243G53l300K23L156j956j285L086k13k418K330J953k586k34L822k438j774M062
259C181p75l392K351J191l396K55K574k168j755K604n93l317K598J079l348J073
$$ plain form
149 -2893 1348 -2785 -4681 2245 0 -5037 1720 3329 -3963 549 5448 -976 -1439 4857 1761
164 1761 -2386 4132 3587 -3232 1315 4727 -2410 -1367 4239 -1162 -3360 1488 238 -3846 -809
179 -809 1004 -2872 -2993 1101 -1590 -3632 921 416 -2451 293 2241 -880 -414 3416 2032 -867
195 -867 2801 3082 -832 1475 3643 -578 -181 2411 -733 -2597 1131 499 -3349 -748 522 -3635
211 -3635 -2311 1383 -2813 -2584 1621 -789 -2606 1213 1265 -1685 696 2894 187 -175 3101 1279
227 1279 -979 2738 2289 -667 1228 2192 -1001 -866 1323 -546 -2558 36 228 -3472 -1255 753
243 753 -2547 -2324 832 -1124 -2409 677 464 -1954 376 2329 -257 -491 3331 893 -881 3181
259 3181 2406 -986 1365 2556 -840 -585 1989 -179 -1934 670 77 -3240 -642 437 -2911 -1838
275a838K325k037q00K976k22k269J918K121l221J190K383k083o71K912j111j988
291d15J914N57k201M6J891j532j509K140p58k584K224M73k629P64J585j547q00
308b381K653l15k186K162J601k969J325K538k304l78K973j450j708K046L64k161
324a90K90K236k375j342K933j504k487K452K52k241N76J779j791p69K245n31j969
341b436K328J030k370J355J971k107M6K124m62j636J149J444k520N03J857j843
357D33j335K482j424j430J509M5k109M63J479j447o87J886m09j749K205L06j788
374a570J346J194j290N00J188k73j090J375M03k084J357R22j984J70J260j426
390bn76J254n46j589O55P59j328j25J541j093p92J997n31j097J522K64q11P18
$$ plain form
275 -1838 487 -1550 -2350 626 404 -1865 53 2174 -1047 143 2526 443 -228 2684 1573 -415
291 -415 1499 2056 -145 -99 1792 260 -1249 891 133 -2451 -227 246 -2383 -1619 -34 -1581 -2381
308 -2381 272 -43 -2229 -67 1534 -1435 -110 2428 124 -254 2719 1269 -439 1607 1971 -190
324 -190 100 2336 -39 -1381 1552 48 -2439 13 265 -1976 -1400 379 -1412 -2181 64 -467 -2436
341 -2436 -108 922 -1448 -93 1878 -229 -183 1941 1479 -157 992 2436 -84 419 2276 433
357 433 -902 1580 156 -1274 235 280 -1829 -1366 113 -1334 -2021 -135 -544 -2293 -88 218 -1570
374 -1570 -224 970 -320 180 1368 1095 5 1380 1783 -301 1056 1978 -6 164 1424 -2
390 -2 -578 676 130 -1459 -804 -45 -1373 -1498 43 -1050 -1842 155 -376 -1473 49 313 -498 220
408B20R12j015J97J129K8j466J147Q31j793L82R30j453n9O42n23j196Q28M42j696
427a513M66J155j315m46J577o53o41J168K66q34J57J400q44j83J752o24j070J537
445A355L63j693J141M16j193k35J000r79q79Q72R9j675R72K15j483N77J148j326
463a305J43J156o31j94Q48M75j087O39J023q47l1J538n58j111J107J44j233M81
481E57O21q48p41Q05l84j337J341K05j878O67J244j697j57J338J13j714J559R84
499F78k039R81K138j759k79K236j250j148J996l5j856Q99J407k290n27K033r88
516A97j254J317K9j818R94L90j159J05J054m34q90J209O66j463N63J648j103l07
534b56J444j99o91K57J019q52o03J588j240r18J426m44j355R11O25j404m1J066
$$ plain form
408 220 1132 117 314 1443 1471 5 1152 1983 190 572 1502 49 -10 632 109 -1087 -259 183 -1513
427 -1513 -1047 108 -1207 -1653 -76 -729 -1370 -202 64 -770 -613 787 -57 -240 1512 888 -182 1355
445 1355 1718 25 1166 1582 389 154 1154 175 -704 168 267 -1408 -436 -221 -1704 -1127 21 -1305
463 -1305 -1162 -6 -637 -831 17 492 -595 44 1067 220 189 1727 1169 58 1165 1309 76 557
481 557 1178 330 -411 394 10 -1327 14 219 -1659 -992 252 -1445 -1602 -264 -151 -1865 -306 678
499 678 -1361 -380 1758 -1 -280 1956 706 -442 1554 1519 -337 562 1969 -321 -848 1185 197
516 197 -1057 260 289 -1529 -535 -145 -1304 -1199 -145 -579 -1469 -260 406 -1057 -494 1154 51 -256
534 -256 1188 989 298 555 1574 722 119 1707 467 -451 975 531 -824 87 712 -692 -733 333
552C33j274p25J535m22r22J098K79j593J571J040j540N77J139r21l06J320k54
569I35r60R01P11j352K39R01j345l50J197j115n15M35K27q84j13R67k03j300R65
588f59L62q64O14P72m33k12J486q56o81J469M89j596Q19R75j677J70J317r04j028
607d37J220j71j411M62N52j343n0J382p81j203J794l81j039J123K09n26j32J119
625C87j71o91J172j23q06J217K07r61K51O14p20j23M85l96n78m5O94r97l64J299
645C51j102n95J228n19q45R38M08o58M35J031o93n00J389l09p82R35K64r64P64
664G76M49r61N08P6n88l80M83m2q46J50L41j004J48O27m15m11Q46k5q15M72Q71
685B60n56m80J488l74o70J569k32j151Q55N75q50q8Q22o49o67P11j33j106P39
$$ plain form
552 333 -941 -1666 -131 -553 -1475 -377 -98 -1691 -120 920 -620 -43 1096 175 -131 1189 935
569 935 -25 876 1587 235 474 1375 30 -320 877 -238 -753 -318 -91 -975 -1088 -121 -324 -1624 -659
588 -659 -297 -1161 -547 225 -208 -420 1066 210 -471 998 1487 -109 710 1685 8 178 1495 591 -437
607 -437 783 612 -799 -337 215 -1128 -1178 204 -577 -1780 14 -367 -1406 -283 -74 -600 -732 387
625 387 216 -475 697 574 -232 985 1192 231 482 1096 376 253 738 342 -236 -281 413 -584 -948 351
645 351 -751 -1346 -118 -637 -1482 -544 -136 -794 -359 672 -21 -521 868 559 -223 712 976 12 776
664 776 1225 264 772 848 260 -120 363 321 -525 -375 -34 -1038 -890 -263 -678 -1089 -243 -268 -1083 -611 260
685 260 -296 -776 712 338 -332 1237 1005 -146 709 1284 434 346 1168 519 -148 563 430 -676 63
704F3K04j074K28N41o99K7K37J56p81N74O01o37L9J107n40l77Q50j14m40N01M22
725H88n23l1N23k07o12Q11k36j078P02J60q52O5M89p49k94M89M01j378Q79L69
745a84r59N84R03p43p9J033n17l7N60N12p14J01O92o44k30Q05m93q69O75j70k63
766c7j67M69n56n89R25k90j060P43Q03j317M38P02n50j75J146k02o17O09L48n30
786I3r8J288o15p51J392q24m53N59K6o51J2K53n14l49M82l44o26N53M66p93K44
807f50O50q02J59N49L00n50P06N32p29K66N04l01j66M42k35m28K50j17l07m7K86
828C12k72n04M32l47o96J037j92o16L72k5l8J76L78j16l14O35K54m90L67Q1m66
849c2M59L85l39P0m6j65p1l5L40n31l64O29n37n51O99l30l21K87J41k79j16M94
$$ plain form
704 63 267 -807 -579 -38 -737 -710 -473 -317 -1098 -524 77 -560 -521 586 46 -331 519 405 -35 466 888
725 888 365 334 857 650 38 849 613 -465 237 397 -455 -390 99 -650 -944 -455 -54 -1432 -553 -184
745 -184 -1143 -559 344 -399 -478 555 38 1 561 1073 359 460 1152 508 278 1083 590 -279 396 226 -37
766 -37 -204 265 -291 -880 45 -245 -1305 -562 241 -1076 -638 64 -486 -661 485 283 -334 275 623 93
786 93 -5 1283 668 -83 1309 485 32 591 617 -34 -22 231 -283 -632 -150 -494 -1120 -567 -101 -894 -650
807 -650 0 -802 -643 -94 206 -344 362 894 165 431 935 634 468 910 675 247 497 380 73 26 312
828 312 40 -464 -32 -379 -1075 -38 -230 -846 -474 -499 -537 -361 17 -99 -413 222 476 -14 353 434 -32
849 -32 427 812 473 543 497 332 261 226 566 35 -329 300 -237 -788 -89 -419 -740 -453 -312 -591 -707 -213
871b13K40n92M37K61m44K76N40k80M53J74k12Mj74M32q57K62J25m99j93M64o94
892d90J83K28m54l72L69q8J45%J14q8j43J94N25l78L42K0l7M23j32R7j20J35P0
915E43j08J01pl66P5O5k92l30J96j45k69K09j10j97P9J19k02NP62p30r1P52J54
938B13l53O21O2m21L81L87l14m53N27p6m15K79p9n74K58k0l16k0K06j54l21J37
960d45pj74o5M24j13j59O72j02kM8N41l07j26M10K98r09P67j15n83M26K2m25p
983F9L66m25m29K60n0o26K20M49o35L45K29o33O52J26j00P4J78J19l69N48K69
1004F37n14L63J3j60O7L03l22kM8k87m9p2j17j38k15p7L13o58M63R5m12J75J55
1027c91K08j62J60M15n64L44P93p73K26L63k3m64O22l12l84K66P6l28l48K56j68
$$ plain form
871 -213 27 -565 -128 133 -311 -35 505 225 678 852 640 644 470 902 45 307 432 -67 -260 204 -490
892 -490 -307 -79 -533 -905 -536 -624 -479 -479 -365 -453 -596 -402 123 -255 87 107 70 493 361 458 338 473 543
915 543 435 536 529 163 238 303 11 -319 -123 -268 -537 -328 -438 -635 -556 -437 -639 -634 128 -602 -693 59 213
938 213 -140 481 543 122 503 890 576 123 650 574 159 438 359 -215 43 23 -293 -313 -107 -261 -582 -445
960 -445 -452 -626 -691 -267 -380 -539 133 31 29 77 618 311 185 595 893 -16 751 636 53 479 501 76 69
983 69 435 10 -419 -159 -209 -835 -615 -166 -801 -456 -227 -860 -208 -82 -182 -108 70 189 -180 368 637
1004 637 123 486 499 339 406 709 387 385 433 146 97 25 -92 -230 -445 -522 -209 -867 -404 -309 -721 -546 -391
1027 -391 -183 -345 -185 230 -334 10 803 30 256 619 596 132 754 442 58 324 400 72 -276 -20 -188
1048a88l77N98n07j01M9Ml6n7K66K00j37OL47k52J90K26k01O9M40k78K85j61J01
1071D86Jl48J71J72o24K13q6l20L70j60q6j59j28k67M39N5J24k90K39j23m9L46
1093b4J65l94O78j27k11L22L8P7q8J53Kn18J14K9m28M11Jl87j46L95m50j58J22
1116d24j05q1q9N61k9j54K35K04r5K29J32j80J02J91R1l50L39Np29P46j66n76
1138a43K07L19n44J76Qn07N3j12L20k81J0M02m19J45J94k6k2K21K65j84q7M71
1160D66r7j27J07L05k99K22m2l37J06M2m61q9K20j07l60k22L81l83K47J26l59
1181f61J97M26n09L16K71L5j64J73J48J85m4J89k95k7M35k57l65N9K64l01r5O6
1203D6Mj95J00O6o16P7N00p59M79K55j62j22J30J99l25K15J93j38q1Q06k66j64
$$ plain form
1048 -188 -565 33 -474 -575 -526 -522 -558 -615 -349 -149 -286 -280 67 -185 5 231 30 99 539 261 546 385 486
1071 486 487 139 310 482 -142 71 -15 -335 35 -125 -211 -370 -498 -765 -326 -271 -147 -437 -198 -321 -370 -24
1093 -24 141 -253 425 298 87 409 447 524 436 589 591 73 187 216 -212 199 200 -187 -333 62 -388 -546 -424
1116 -424 -529 -610 -699 -138 -167 -321 -86 118 23 252 384 204 306 497 588 238 577 582 -147 599 433 -143
1138 -143 64 383 -161 15 23 -484 -431 -543 -223 -504 -494 -92 -511 -366 -172 -198 -220 1 266 82 -5 466
1160 466 369 242 349 654 355 577 535 198 304 346 -115 -204 16 -91 -451 -673 -292 -675 -428 -302 -661
1181 -661 -464 -38 -547 -231 40 75 -89 84 232 417 373 562 267 240 675 418 53 112 376 75 -20 46
1203 46 50 -145 -45 21 -595 -518 -18 -777 -298 -43 -205 -327 -197 2 -323 -108 85 -53 -134 672 406 242
1225B42K37M2m32L64Q7k88m39L62K3l66r5K06m24K20j55Lk6J28k49P6K76K26j43
1248a25MM26l01p4L74O5k39J83K50o3l62N40k94k79J29K9l72J32j9m03MK20j49
1271c24j04K79m74o0P18j55k83K16L39n29M36J09k65N21j61Q1n6P9J00k26o5L63
1293E39m81q8L26j28n10K74j64k46j26M99m28P1K40l4K8R7K09j72J4J48rj68M43
1316C34M7k62J97J36Ll83J69m9j06Q9k30Q9k50M18l46K00m13l3j09L97j06j45
1338c53J5J72k02J71M44k99L85m10M55n5NM86m95j21K8P5j96L0J21l03P7nk10
1361a85k23K41k90N6mk0o5M9Q9J2K79j51K92mL65j19l01N52k79OJ26j2j16O5j77
1386A86M2J75q9m22K2j17L03m65M5p5Mm34O86k34pJ86K4J9j42M25J79m63K45L06
$$ plain form
1225 242 479 521 89 453 540 252 -187 175 198 -168 -263 -57 -481 -261 -416 -413 -439 -311 -560 -484 -208 18 -125
1248 -125 -121 305 4 -70 304 369 130 313 563 500 138 678 384 105 234 263 -109 23 4 -399 -395 -175 -324
1271 -324 -428 -149 -623 -683 35 -120 -403 -187 152 -377 59 168 -97 424 263 344 288 367 467 241 176 539
1293 539 58 -30 296 168 -342 -68 -232 -478 -604 -105 -533 -462 -222 -256 -228 -131 78 -94 -80 68 59 -109 334
1316 334 381 119 316 452 455 72 241 192 86 175 -55 34 -216 202 -144 56 -357 -390 -499 -102 -208 -353
1338 -353 -338 -166 -368 -197 247 -52 333 -77 378 323 328 814 319 198 226 301 105 135 256 -47 30 25 -185
1361 -185 -408 -167 -457 -401 -405 -425 -490 -441 -352 -340 -61 -212 80 76 441 322 21 573 294 300 426 414 298 363 186
1386 186 228 403 314 -108 -86 -203 100 -365 -320 -395 -391 -825 -139 -373 -380 -194 -170 -151 -293 132 311 -152 93 399
1410C99l66L82r7K03m23K20m7j42j12K29k23m7L52n44K04L9m53J65J89k18l2j7
1432c39J53J90m31N19j29j15L43j37j7L03J94k16o9J76k65M5J51k73l3Q5l28J93
1454@m00K47q9j64K22J13m3m33M64l27L14k8K7MJ04n7L53K0Qp2K30j54j08m4R7
1479B84j32J03K7m2l94O5p5j29J81j50L01k89j03J08j11jK90j77K70j24k0K75
1501A57k39N07j60No9K09j39Q2P7m27K81j09P9k52j45K35n00M9K78k97K29j16
1523b65k8j71M05l42K80Q2K2K33m9P5m8J4m3J12J85Q3l49J94p3k17K2L9l64J09
1547i4J71k61k5M3j41L5j59N5j4J79K16k12lJ8K51M3k35M62P8l17M06k82j40l9
1571C5R4k2L02l43K36l79P0J5k81L03l69L8j1M2l3K0m5l7R4j1P6J67lK45j35j35
$$ plain form
1410 399 33 415 318 521 98 318 271 129 17 246 23 -24 328 -216 -12 27 -426 -261 -72 -290 -322 -339
1432 -339 -186 4 -427 92 -37 -152 191 54 37 340 534 318 249 425 160 205 356 83 50 135 -193 0
1454 0 -400 -153 -242 -406 -184 -71 -114 -547 -83 -410 -96 -124 -97 -93 11 -46 307 327 335 263 493 339 231 187 284
1479 284 152 255 282 240 -154 -89 -164 -293 -112 -262 39 -250 -353 -245 -356 -357 -67 -244 26 -98 -118 157
1501 157 -82 425 265 270 201 410 271 353 430 3 284 175 254 2 -143 92 -408 -359 -81 -378 -149 -265
1523 -265 -293 -464 -59 -401 -121 -39 -17 216 167 242 194 208 165 277 462 545 196 390 317 100 122 161 -203 -94
1547 -94 77 -184 -209 -166 -307 -272 -431 -376 -390 -211 5 -207 -210 -192 59 102 -133 329 407 90 496 214 74 35
1571 35 129 107 409 66 302 -77 -7 8 -273 30 -339 -301 -312 -270 -303 -283 -328 -365 -271 -282 -206 -39 -42 203 68 -67
1597f7M71l80J23J73p8k1j64M7J47k85P5n8j22Jqj64K76k11k33J54M9j95K28L
1621b39J89N4q0J58l74K31L08q3K6K15l60J12P6M00l75l02J65j65k49M00M2p25
1643e76L07Q2k23K8J02M3j49L6K10j9l4M14l97J35J25J40N0j01l6L9J71N4o6n42
1667b07P00k50l18J29Kl72L58j61q4j61QJ29l00J97J43J80l93M91l1j51L02j02
1689A09j56K86j80L90k73O4K6q3q3J29j82o1n2J42k78K45m00J48k9J97r3P3j49
1712b10k06O9M52l05L34P2l8j06K98j02j03m5J82l5j76J90j05K15j78l96M55j75
1734H7j60O4j49J65k68j52M42l42l19N07Pk93K96J14r3J80p0L93m58J90L38n4
1756D25k49J33j40J43j26k82K55j54j44K12j34j49K09m01J79k87K06J11j23L82
$$ plain form
1597 -67 404 24 147 320 242 221 57 104 251 -34 41 -17 -139 -138 -146 -310 -34 -245 -478 -324 -275 -470 -242 -239
1621 -239 -50 4 -76 82 -292 -61 247 164 190 405 45 157 233 633 258 -44 121 -44 -293 107 149 -576
1643 -576 -269 -187 -410 -382 -280 -237 -386 -350 -140 -159 -193 221 -176 -41 84 224 274 173 137 176 347 401 335 -207
1667 -207 493 243 -75 54 56 -316 42 -119 -203 -364 -356 -227 -527 -330 -187 -7 -400 91 60 -91 211 109
1689 109 -47 239 59 449 176 240 266 183 100 229 47 -14 -66 76 -202 43 -357 -209 -238 -41 -134 -61 -210
1712 -210 -416 -347 105 -200 134 206 168 62 360 258 155 110 292 257 81 271 166 381 203 -193 262 87
1734 87 -73 -9 -158 7 -261 -413 29 -313 -632 -125 -118 -411 -115 -1 -94 86 16 409 -49 141 479 425
1756 425 176 309 169 312 186 -96 159 5 -139 73 -61 -210 -1 -402 -223 -510 -304 -193 -316 66
1776F6n1j45J24n4J82L7j18J20J12pj17K41j69j83r6K23j31J36o4q2M6k37k36
1799d03L01J42j89j78j02N29k79k9J04r1K0R4r7P1M64k22L3J13K68m83p2L03j66
1822A31k13K05J47l43l5K11m00m3M22m35j04K75j57L13k06L09l18q1M01o1K0j28
1844i0J86mM9J05O1k38Q9K61m90L30j23k06J25K7j67n2kr0q7M4K0J2jJ44P5j99
1870b21L04p6j0L6K14J01l49N5O9O9P5p1K9J9k37K97k0k92K9J63j51N2rj85J47
1895C8k98J7L34n14J63K01L2KJ59k41j70M91n9M2j70L40j20j60K95m70K41J63
1917C16k44J90l64j18K95k37Q8k5p7m8J44k24q3K44K0j09K18N5l3r0K09J66K3
1940C16J35j42j22l2K72m32k3J45k17K4M6J72k20l05L57j13j66K09J10k36j4K06
$$ plain form
1776 66 15 -130 -6 -60 122 159 41 161 273 266 149 390 221 38 -58 165 34 170 106 24 70 -167 -403
1799 -403 -102 40 -149 -327 -429 100 -179 -208 -104 -195 -175 -81 -178 -107 357 135 168 281 549 66 -6 297 131
1822 131 -82 123 270 -73 -108 103 -297 -340 82 -353 -457 -182 -339 -26 -232 77 -241 -322 79 18 38 -90
1844 -90 96 92 141 246 307 69 158 419 -71 259 136 -70 55 82 -85 -137 -139 -229 -316 -272 -252 -240 -241 -97 -22 -221
1870 -221 83 7 -3 33 247 348 -1 54 123 192 267 196 225 244 7 304 284 -8 21 184 33 85 76 -109 38
1895 38 -260 -243 91 -423 -260 -59 -27 -25 134 -107 -277 214 155 197 27 367 247 87 382 -88 153 316
1917 316 72 262 -102 -220 75 -162 -74 -99 -176 -224 -80 -304 -387 -143 -123 -232 -14 41 8 -82 127 293 316
1940 316 451 309 187 155 427 -5 -28 117 -100 -76 -30 142 -78 -383 -26 -139 -305 -96 14 -222 -236 -30
1962c0k43M2K01q4J84q5l7l5J23J65J5oj29L58l50J85r2j41K32l85J1j6n7j05
1986b79N9k2M9qm0p8L1J85J19Np1K59l56L28J4j78K48R7j1j58j51J41Q5m4k43
2011a9L48l76j09J16l7j90p8k8J65K11n3l09K6L08k11N4J26J69l59J74J15p7K72
2034B38k79M13k85J03P2lo6J72l34j01K53k4qj34J2p6j41j32K54j13m4M2r0L27
2058E6k76r2Q0K88R4k46J75j79K29j77K18k6m1L9q3p8n9J62j63M7Q0k9j51J25
2082gl25k3K60j73J18l05K00M51n00L94o9p6K01M3J05n7j48j9K98l40K31jK2j13
2106A67m1k41J5l61L27J22j93j06M25l53k3q9L89j09n7O3j2j14J92O7J7K82j35
2129B32j9l77pM03L3Pj60o2M0m10K23K0K03j66j08k5q3J69Rj0p3J65j01j46K97
$$ plain form
1962 -30 -273 -231 -30 -114 70 -15 -52 -87 36 201 216 210 81 439 89 274 182 41 273 -112 -101 -117 -174 -279
1986 -279 -220 -242 -193 -201 -241 -319 -288 -103 16 21 -50 209 -147 181 195 17 265 362 351 193 42 183 268 224 -19
2011 -19 329 -47 -156 -40 -77 -267 -345 -373 -208 3 -50 -359 -333 -25 -236 -182 -56 113 -246 -72 43 -34 238
2034 238 -41 372 87 190 262 259 193 365 31 -70 183 159 151 17 29 -47 -188 -320 -66 -179 -223 -181 -271 56
2058 56 -220 -312 -232 56 150 -96 79 -100 129 -48 170 144 103 142 59 -19 -78 84 -79 -32 48 19 -132 -7
2082 -7 -332 -355 -95 -268 -150 -455 -255 196 -304 90 21 -55 146 189 294 237 89 70 368 28 259 258 280 167
2106 167 126 -115 -100 -461 -134 -12 -205 -311 114 -239 -262 -351 38 -71 -128 -65 -77 -191 1 68 85 367 232
2129 232 213 -164 -171 232 265 272 112 50 90 -320 -97 -77 126 -40 -148 -173 -256 -87 -78 -88 -161 4 -97 -243 54
2154E4jQ5r9J45j7p1R8k55K65L4n6J9k4O9m20J6J44j14P7p5J57k86L27k40K26
2179E8n14P4L92l6Nk17J91K52k10O8R2j68J63J66j21j38K56l36O6n6q0K70m05
2202b28L39l66R3K61l47J92j82J40m4j7o2M9qJ34q0N1K04Q4n7Q9j42J5K01l81
2226f2J50j07R5J2l7k37J72p6m2K69j39k90p8M22k36o0k8K21l12N15k67p8N60
2249C67j28rk20M6l3J43J93k90N9j70K31j35N5j28j4l9N7j60Q6J15l33J91p7K7
2273a66J73m6J58j40R6Q0O0j83K47j76k30L74j49J19k02j8K55k11J79j28r3q9
2295i0l5Q7j80O1J98l0l31K28p0J56k06P4l4L50p8k9Rj76L55k96J99J67k79K00
2319B50K17m56J12K11l65M7j41J13m5o0j14J48O7j98J52n1k24K95k24K11K17m61
$$ plain form
2154 54 53 138 39 184 167 96 194 -61 204 238 182 201 177 246 -174 -158 -14 -128 -51 -126 31 -255 72 -168 58
2179 58 -456 -382 10 -26 -21 -238 -47 205 -5 63 155 -13 150 316 195 57 313 -23 43 -13 -93 177 -228
2202 -228 111 -255 -162 99 -248 -56 -238 -98 -142 -159 -221 -172 -180 -46 -126 -75 129 213 156 245 103 118 319 -62
2226 -62 88 -19 76 88 51 -186 -14 -90 -132 137 -2 -292 -370 52 -184 -244 -272 -51 -363 152 -115 -193 367
2249 367 239 230 10 56 23 166 359 69 128 -42 189 54 109 -19 -33 -72 -15 -175 -89 26 -307 -116 -193 -166
2273 -166 7 -39 119 -21 75 155 215 32 279 103 -127 247 98 217 15 -3 252 41 220 92 -1 -90
2295 -90 -125 -38 -218 -157 41 11 -320 -92 -162 -6 -212 -138 -172 178 100 71 80 -96 259 -37 162 329 50 250
2319 250 467 11 123 334 -31 16 -125 -12 -57 -117 -231 -83 -16 -214 -62 -113 -337 -42 -266 -55 162 -299
2341b99K41J76m6j83L36k30q2M95j26k37K08k00J48j65M9O9m01L2J95l3p6Q7j58
2364b00J9OJ01J17k40M7L72k45o7L41j71K63k67J0k2J11J64j23K2q8l01M2L66
2387B57l06q2K20j2r4J17l6l84L9J65o4j00J39K47k94J46r3L65o5k30L12j04O8
2410B11k7j05kJ51j7L6k2J39m51j9P9Jj29J29R2j26k25K25K6M1k9l02L30r1L4
2435e1j65J20MJ82K91q2j89K8K44j17m8k8j81J01r8j82J67K15m14L08j35l08K03
2458a35j40M15r7j13k13J94K65l85J73Qq6M5J42J91k10J69j17n0J82j82J13l4
2480A35n3L5m5j17j84J39J07j59K17k55j8j51M47j30n7k50L44o7o1P4J85K5k66
2503a05K10p6L15l33J47k95K15O6l27L38j25o4n4K7j05j7J09o8o3m5K39k22J74
$$ plain form
2341 -299 -58 118 72 -111 225 -5 -87 408 282 45 253 53 201 36 85 154 -247 -215 -20 -53 -129 -42 -200
2364 -200 -181 -175 -74 43 -197 -150 222 -23 -90 251 80 343 76 86 64 175 339 216 238 150 -151 -109 257
2387 257 -49 -131 89 77 -17 100 64 -320 -281 -116 -180 -280 -141 106 -188 -42 -135 230 165 -65 247 143 211
2410 211 184 79 77 228 211 247 225 364 -87 -106 -27 -26 -155 -26 66 -60 -285 -60 -34 7 -22 -324 6 -85 -51
2435 -51 -216 -96 -92 90 381 299 110 138 382 265 217 189 8 109 11 -171 -4 211 -203 105 -30 -338 -135
2458 -135 -275 140 43 -70 -283 -89 176 -209 -36 -28 -114 -69 73 264 54 223 106 56 238 56 169 135
2480 135 82 117 72 -45 -229 -90 17 -142 75 -180 -198 -349 98 -32 -89 -339 5 -62 -123 -49 136 161 -105
2503 -105 105 29 344 11 158 -137 78 144 -183 155 30 -34 -88 -61 -166 -183 -74 -142 -205 -250 -11 -233 -59
2526e9j49K31J49k22J86j23K9p9J54K12j47l5l13K42mJ20q0l50J18J32q5L25l89
2549a37J73j77L4j48k7j23K33K52l56L64k40J58K63k60m9n3N7K75J3j38K8j08
2571C4NJ46Q7k88R0M9k84p5p0J50j51K72k44ONK05K56m84K58N7p5J65j8j8k23
2596a45J88R6k89M18l24Q4J18o7K1j58J66O1j53nk10nPJ23k32M9K73k37J31J23
2620C3j55L37J4j80O0k61K33j28j74M52l43K58J6J9R2k56r9lK75l02Mm5J26j80
2644b07N1J42k15J8k7M09k45j6j25K56n4j60L54j15n7L16l61K19j24J64m3j87
2666gJ26j99j64J55K44r1n5j55K98j46l54L63j63r4L17q3j84K63k18J41O8L5M
2689A01R7k11j4J05N0p1J98k95J84j43J61P2m34L87m29K63R7m25K57o8j95K46
$$ plain form
2526 -59 -208 23 172 -50 136 13 42 -37 117 329 182 147 -166 76 72 192 112 -238 -120 12 -73 252 -137
2549 -137 36 -141 -107 -255 -282 -405 -172 80 -276 88 -152 6 269 9 -40 -93 -36 239 252 114 142 34
2571 34 39 185 272 -16 74 123 -161 -236 -306 -156 -307 -35 -279 -273 -268 -63 193 -291 -33 24 -51 114 96 78 -145
2596 -145 43 139 -150 268 -56 28 146 79 100 -58 108 169 16 11 -199 -204 -197 -74 -306 -257 16 -221 -90 33
2620 33 -122 215 229 49 109 -152 81 -47 -221 231 -112 146 162 181 273 17 -82 -85 190 -112 -108 -153 -27 -207
2644 -207 -156 -14 -229 -211 -238 171 -74 -90 -215 41 -13 -173 181 66 9 325 -36 183 59 223 180 -7
2666 -7 119 -80 -244 -89 155 64 9 -146 152 6 -348 15 -148 -242 75 -8 -192 71 -147 -6 62 97 101
2689 101 198 -13 -27 78 128 57 255 -40 144 1 162 234 -200 187 -242 21 118 -307 -50 -118 -313 -67
2711f7n0R0l6K0n9J3q6J62o0n4K08k1J09m3O7l07J00K23j71k38J20J89j75l14
2735c80L36l5j18L24l12J00p7J08K77j47o6k3N2k1j0K8j60p9N02N1m04O4J8J42
2759A70j05j64J12J09j38k00JL44j11j73r2J15k42J44Q4kJ03n7o4J10K8k9J35
2782G8k26J75L5P7M7k75L95l72P7j23J83J00k86J72j41k16K40r5K8Q2j81k01L52
2805g5J17j78J46J02p2nq9P2J47n1J21o6J51n1l11R0q2l7P3P0J57k81j60K14k01
2830a99j73J82Q4j27J82K8J00j81j43K25K3J23p1P1k78K13k24K23r3N0R7J6J97
2853C25q7k39N5k78J37L7n1J3k27M5L05J47k17k33K29o6M1J17j08P5m5k09K83
2876D9J74p9l86L75O9q6O8p1j1j7j84M2j22J74K5J0j76J15n7K6j08j4J70o1J5
$$ plain form
2711 -67 -117 -27 -63 -43 -102 -89 -175 -13 -73 -127 81 60 169 126 193 -114 -14 209 38 -200 -80 109 -66 -380
2735 -380 -44 -79 -197 127 -185 -85 -162 -54 223 76 10 -13 39 18 8 36 -124 -203 299 350 -54 10 28 170
2759 170 65 -99 13 122 -16 -216 -215 129 18 -155 -247 -132 -374 -230 -146 -148 -45 -102 -166 -56 -28 -57 78
2782 78 -148 27 62 139 186 -89 306 -66 11 -112 71 171 -115 57 -84 -300 -60 -155 -127 -45 -226 -427 -75
2805 -75 42 -136 10 112 40 35 -54 18 165 114 235 169 320 269 -42 48 -34 -71 2 72 229 -52 -212 2 -199
2830 -199 -372 -190 -106 -233 -51 -23 77 -104 -247 -22 1 124 53 124 -154 59 -165 58 -35 15 112 128 325
2853 325 238 -1 54 -224 -87 -50 -101 -88 -315 -270 35 182 -35 -268 -39 -105 -64 53 -55 20 -25 -234 49
2876 49 223 144 -242 133 202 116 184 113 102 85 -99 -57 -179 -5 20 30 -146 -31 -88 -62 -170 -184 -14 -75 -60
2901f0q7K05j01j7J31J05M9p1J78r4j15j27p8O1JJ49j52J96j42J31l69o7J75J91
2925I2l41J42l5R7pp1J60j6P1P4j90K7k3p0K14j62L09j14r3j10P6P0P6k64L1K67
2951B10m42J7K41K62k52j12K10l82k00N04j55j05K53kj29L8O6n2O7J72%m18M35
2974B26j07l23L22J00L0k98k6p0J48M6j53N3J24o0J21o55N82j79L7j82L69j81
2996g6l0m0K82j15j91M73j15K2j55K00Rj1l10M9o7k5K73j62j29l3J69k29J35Q8
3020A2k27j91L41J04k75M48k96j04K15k3J14k28L18mj50K57m58P9J16m6Q8k8K39
3043C01l01J51j22j24KL56k52K6l0J43j30J45q8k33J91m4J99k96J43P0rj15P5
3066E8M3N7j0J21k46Q0r1L0J03l9j95L52m60K37j8R5k97q2J78O0j67L81m46OJ09
$$ plain form
2901 -60 -147 58 -43 -60 71 176 225 154 332 238 123 -4 -82 -21 -20 129 -23 173 31 162 -207 -274 -99 92
2925 92 -249 -107 -142 -45 -52 -123 37 21 92 166 -24 3 -20 -90 124 -38 271 157 64 -46 30 100 176 -88 -57 210
2951 210 -232 -215 26 288 36 -76 134 -248 -448 56 -99 -204 49 47 -82 -44 22 -30 37 209 209 -209 226
2974 226 119 -204 118 218 248 -50 -76 -146 2 48 -105 -52 72 12 133 -522 60 -119 -82 -264 105 -76
2996 -76 -106 -146 136 21 -170 303 188 210 55 255 264 253 -57 -8 -75 -100 173 11 -118 -151 18 -211 -76 12
3020 12 -215 -406 -65 39 -236 212 -84 -188 27 4 118 -110 208 204 54 311 -147 -68 48 2 90 62 301
3043 301 0 151 29 -95 -93 263 11 37 7 150 20 165 77 -156 35 -9 190 -106 37 107 98 -17 58
3066 58 101 158 148 269 23 103 12 42 145 106 -89 263 -197 40 22 117 -180 -262 -84 -24 -191 190 -256 -250 -141
3091a41K64l02J88j02K31J26j80N6K40k46j07L4N7j14j49m8J13J20j29J49j44
3112h4K8q8j46J94m5J34k9j07R4K92j4l38P4k3L53k52k5L5O8j77K81j88j04J29
3136F2p7l56M29j51NJ67k12J38j94K70j52o8J81j08P4J16k36Q1J70MM4l0J5Kk16
3161d2J0K12m26K73J2j37K06l9J59m9j01k63N3k37K15R7r0j37K82p5j66K60K39
3184B56k02r6J20j13J56q4j3J07Kj71L1K49j68r9J24n6Kk54L29l29J76K0K6j06
3208i3k4j8J8L16k20J99k02J89j76J3P5Mj53J78R6j22j5L0L37k71j66l3L01j23
3232A40J38m13J7K8J33j38K08k3k04K0J93j46k16K88q4O2J66j12j36k2J69RK05
3255B82k17Or1O8r0k6J65l11j26N79j9k01L4J01j45j8J74k51jN2RJ19l73L30j5
$$ plain form
3091 -141 123 -179 9 -93 138 264 84 140 380 134 27 61 118 4 -145 -193 -80 40 -89 60 -84
3112 -84 -56 -144 -290 -96 -141 -7 -36 -143 -49 243 229 -109 -35 -58 295 43 18 53 121 -56 225 37 -67 62
3136 62 -15 -371 58 -93 -88 79 -133 5 -189 81 -71 -139 42 -66 8 124 -112 -31 139 143 187 157 172 174 -42
3161 -42 -32 180 -246 27 39 -98 108 69 228 179 78 -185 -132 -369 -154 -57 -147 -284 -2 -77 -243 17 256
3184 256 54 -42 78 -35 121 37 24 131 133 -38 -7 242 74 -25 99 43 45 -209 120 -209 -33 -13 13 -93
3208 -93 -117 -135 -117 199 -21 178 -24 165 -11 2 77 81 -72 106 202 80 65 95 432 161 -5 -38 263 140
3232 140 278 -135 -118 -90 43 -95 113 90 -114 -94 99 -47 -263 25 -59 3 169 57 -79 -101 68 77 282
3255 282 65 71 -20 48 -42 -68 97 -214 -340 239 220 19 53 154 9 -9 165 -86 -87 -35 -26 93 -280 50 35
3280C5j09J55J30l13L01j46J02l3k27K55j09RL0l7j55L1L0J62q8j85j24K70j01
3303a17O9O9%j47K45j49J38r6j4j40J89J56l38J42%k48N55l85J52k02R3J33k11
3326a06J11J04m9p7R3j70Ll0M9n7m9l08M54J7j10J58J84k70J95m6L0p5r3J21%
3351G9PJ6K93m56J73j34j17K64k64J17J59k74p1L77k03j56J3J9J55mJ38q6n5k23
3375b33K19pq5L04Lr9m8j82R9J75qR7k60J64l91N5J37lj06J44o0r0J01P2j17p6
3401a95K89O3j09j15K02j26K5J97l57R5J13L8Q0m09M44l65J84j13R0j48J89M6
3423A18j97NO7j4J55j35l01R7K92k84J35J96k49J38j69J76k4k3LM6J57k67J09
3446C1j54K35l10K63j33l55L17J62j18K77j00l15K17J02j35O9N5o6J10l52J30
$$ plain form
3280 35 -74 81 211 -102 199 53 155 122 -105 150 41 50 80 43 -112 -81 -51 111 23 -162 -286 -16 -117
3303 -117 -48 21 21 -126 119 -30 108 12 -2 -142 47 203 -135 7 7 -241 314 -71 81 -121 -28 105 -106
3326 -106 5 109 60 -17 76 -94 -91 -121 -72 -129 -178 -486 -32 -15 -125 33 217 -53 142 96 126 51 -42 79 79
3351 79 86 102 395 -61 112 -22 -139 125 -139 -22 137 -137 -208 169 -34 -190 -177 -158 -3 -7 131 45 -10 -233
3375 -233 -14 -21 -106 198 201 102 54 -128 -29 146 138 235 -25 139 -252 -197 -60 -63 -169 -25 -85 -175 -74 -2 -119 -195
3401 -195 94 157 48 -67 135 9 34 231 -126 -31 82 120 200 -209 235 -130 54 -59 31 -117 72 118
3423 118 -79 -74 -7 -21 134 -1 -302 -205 87 -197 -62 134 -115 23 -146 30 6 -17 -14 32 189 -78 31
3446 31 -123 112 -198 65 -68 -423 -106 56 -62 215 115 -200 17 119 -16 53 108 42 152 -200 -70
3467g0J75j40J0K45k16K39K5n1j45j8k30L48l3j26j18K01Nl46K10q9J1K55j74
3490c2j48J64j10J13J54n8j52o5K69m7N9p0j99L10j02J08l11K23q9J93j04K24
3512C30m59PM1J32p6m2J11r3ml9j08J57q4J93p7j80N5j81M15r2pj5n5L35j43O2
3538A83m78L50J03p8j83mK3L3j18J26k77K71l0O2J42l07K48n1J51j33K16j47j29
3561b7K03j97N0L1j99J44J06j45L2R7l8k1r3M28l27j1q9j60L03k79K31L1k19M7
3585a02O0J3m04K09M48m51K01J49j82J61m7k23K93R4j58j54J96M1n8k5j97J54
3607A8Q6r4j22j25J54j22P6j05M57j73l0P2o6qL5M0j16J47l05M77j79j69J45j83
3631i0J18J08K08p66K96K42m8j31N3m1K0R7m48M69j15n0k6L56l22J19j11J07Q2
$$ plain form
3467 -70 105 -35 -25 220 4 243 268 217 72 54 -176 172 139 13 -105 96 101 -245 -35 -124 -113 142 -32
3490 -32 -180 -16 -126 -13 141 83 -69 -134 135 88 147 77 -122 188 86 194 -117 106 17 210 106 330
3512 330 -129 -122 -81 51 -25 -67 44 -49 -53 -92 -200 -43 -127 66 -11 -191 -136 -317 98 6 -1 -16 -71 264 121 183
3538 183 -295 55 158 80 -103 -107 -84 -51 -169 -43 -320 -49 -79 -17 125 -182 66 15 166 33 249 102 -27
3561 -27 176 -21 29 60 -139 5 111 -34 -2 95 57 36 -57 371 44 33 -56 -216 87 -192 39 70 -149 -102
3585 -102 -42 -29 -433 -224 224 -227 -26 123 -59 102 55 -168 125 219 61 -93 103 144 86 61 -136 18
3607 18 104 10 -112 -237 -83 -205 -129 -234 223 50 20 92 26 18 53 93 -23 124 -181 296 117 -52 93 -90
3631 -90 28 136 344 -422 -126 116 68 -63 -10 -51 -31 66 -382 87 -28 -78 -104 252 -70 49 -62 45 127
3654A27k1R1j71j82N4J01N7K38k05j8K45k95k5p5N2j24J6J34k43K21N2N6j0j93
3678a18j35J25P9K09k36OJ49k35P6L5J06n3K62k11J24j56q4K15Lnq3j6Rp2N5K02
3704B51m04q0L44l70K9M37j92n9QJ2p4k0J75k07n4J9L19Q2o6j6o7K2r1r4O5k23
3730b54K43M7l52M35r4j66J85Q6l86J12k3J39k26K80k57M23j77Pk38Q3K87k71
3752a17K67j96J95o6K2m12N25k59K65l37L5L15k01o7Jr0J53j33k8K56J15lm30
3775a90L15p5J92j64Rj84P0K37l23Q0J45k15K34n4J04m0j45Q1j23l9J1M2p1K71
3799A68k28NK32k12j74K17o6J23k33P7q0J08Q0K11m18K96k27J70jP8n5R5l9j78
3823e1O3J07k40J01j23j96L58n7K09l37p3J38N6J59k58K07k6K28m46J38R2J10
$$ plain form
3654 127 106 197 26 -156 -102 -1 56 294 89 71 316 21 -4 -79 -27 -151 -135 -1 -244 -23 29 85 75 -118
3678 -118 -253 -128 -49 160 -76 -70 79 -156 -80 -45 61 8 270 59 183 27 -57 158 161 156 73 57 66 -6 49 251
3704 251 -153 -233 111 -259 -230 207 15 -44 -36 -24 -98 -118 57 -150 -204 -185 134 216 150 134 67 89 -2 -96 -31 -254
3730 -254 -11 36 -316 119 25 -141 44 130 -256 -144 -167 -28 -254 26 -231 192 15 22 -216 -133 154 -117
3752 -117 150 -46 149 83 105 -307 218 -41 224 -113 -78 237 36 -31 -30 -120 33 -100 -128 128 243 240 -190
3775 -190 125 50 242 78 87 -97 -27 210 -113 -33 112 -103 131 77 181 141 -4 77 -46 -85 -74 -32 -103 168
3799 168 -60 -55 177 -35 -209 8 -58 65 -168 -91 -171 -63 17 228 -190 106 -121 49 48 126 71 166 127 -51
3823 -51 12 119 -121 -20 -143 -339 19 -38 171 -166 -239 -101 -45 114 -144 63 37 265 -181 -43 49 159
3845A59J0j13J38j27k2Kj80R9L5o6J18j48J54J4j64J82j50j10Q1K37N9n08J1M72
3869A83k81k18N69j77r9J15%m0J19m8j41j23J30j36J88qj2L2j83L6j11J5j8Q1
3893a27J62k82M54j07N9j50m3Q0j17K25k14K29k01K74p0k55K13M6j68j42J86j17
3915f5J30l4K46j49k42K92p1j32n4Q5J44m70L04R0M3j07LQ7k89R4K05j26m4M9
3939a1J04j64K49j52j32P2p5K38j39m6j8J49J02l04J74M5l5q9j81K91q5j28L38
3962B03j42m8J49j85j39J73n0L9J46PR7l82N9j44N40k64j40L21m04J26l2J18k18
3985a70K44p9r1J56k53J06K7k36L3K19P7k3j95pL18N5Q8l57K21qj75P5R5n1m3
4010B6K06l19L08j69Q9j81Rk72K71J88r1j90j00J82o6j75L95j47M7O2k1j76m2
$$ plain form
3845 159 169 56 194 67 45 47 -133 -34 1 -65 53 -95 59 73 -91 91 -59 -169 -88 149 208 -300 -289 183
3869 183 -98 -316 253 76 -23 92 92 52 171 123 -18 -141 -11 -147 41 33 21 53 -130 -94 -205 -190 -208 -127
3893 -127 35 -247 207 100 159 9 -34 46 -71 154 -60 169 -32 242 172 -83 130 176 8 -134 52 -65
3915 -65 65 31 277 128 -114 178 107 -25 -79 6 150 -320 -16 74 117 10 13 100 -189 -95 110 -16 -60 -11
3939 -11 93 -71 178 26 -106 -34 -109 129 -10 -56 -74 75 177 -127 47 92 57 -32 -213 78 -7 -135 203
3962 203 61 13 162 -23 -162 11 -39 0 146 153 250 -132 -73 -217 323 59 -81 240 -164 -38 -70 48 -170
3985 -170 74 -5 -96 60 -193 -87 -60 -296 -263 -44 33 10 -185 -192 126 181 269 -88 133 125 -50 25 120 69 26
4010 26 232 -87 221 52 141 -40 -31 -303 -32 156 65 -125 -225 -43 -109 -284 111 -36 11 73 52 -124 -166
4033a66K38j05K48j29J3l8J4j51J22jj08J80j14R3L0p1j06l0M7o8NQm8N5K46k18
4059e4K66n7k98J40q1k3k2L64n82L44L99k56R8l49J54L7n6j62J29l44J34L36j70
4082e3O3k33K55Q3Nl12L57j05Q9j09Q9k79K01j38M0J13k9L8o1l5L9J6N9j65j5
4107h7j55J90J00j81O1K6R9j32n7j2K04J65j43J21j85J19k43L37m04J68K32p0
4129A53j54K64j43J3k22k4J54j88J07K5J23j43J41j83J46m6j86K30k60K09k39
4150b23J82M2m5J87j0j61j80L55l70J23K50j35K59k74J99r6j44K73n1r3m7nO5
4173A01k15LK91k42k7J91j1Rj58M5KJ28k8K7k05K83j83k71N68l91J33P5k37K25
4197A13kj67M3q2k7j09J29N9J14k22j45K48n9L82j22J3k94K60j88J77k11J26K08
$$ plain form
4033 -166 72 -33 215 86 99 61 75 -76 46 45 -63 117 3 96 126 55 -51 -81 -34 -102 -97 -89 -137 -82 164 -54
4059 -54 212 155 -143 -3 -84 -107 -129 235 -347 -3 396 140 238 -111 43 80 24 -138 -9 -353 -219 117 -53
4082 -53 10 -223 32 115 120 -192 165 60 149 40 129 -150 51 -87 -47 66 37 75 14 -21 18 34 93 -72 -87
4107 -87 -242 -52 48 -133 -72 -46 53 -79 -136 -148 56 221 78 199 14 133 -110 227 -177 -9 223 153
4129 153 -1 263 120 133 -89 -113 41 -147 -40 -15 108 -35 106 -77 69 23 -163 67 -193 16 -223
4150 -223 -41 1 -44 143 133 -28 -208 147 -223 -100 150 15 274 0 199 103 -41 232 181 88 41 36 101
4173 101 -114 -111 180 -62 -89 102 91 100 -58 -13 -11 117 89 116 -89 194 11 -260 308 -83 50 125 -112 113
4197 113 111 -56 -13 -95 -122 -231 -102 -43 71 -151 -296 -48 -107 275 153 166 -128 132 -56 121 -90 36 244
4220B44m18L83m74oK85j35J42J19K8j44j57Q1J23j1K2kr8o5O8M1P1M5j91Q1j13
4245h1j8KL15j97j53K56K5n3J3N5j52m3J15J24k57j24K18J36m88L65N1j09j03
4268a03K00j99J17m3k8p4m9L36k63J53k2J45l01K93O5m47K84J54N8l9O1j08l25
4291a35J96J32j57J64k89j07j2K62Q1r1j27J90j27P4k18oJ26J88l09j05R1L6L74
4314B31j97KJ75k08J68q5l1O0j23l10L62j3q6k5j27R9K70j95m3M4Q0P3k33J22
4338A0J24k15l9j4J72q2R4kr9M4l4o0J11J39l09J51J67j48k99M81l30J66M1j73
4362a04J88l01r5P5M47m45K43k79K46J01k3j86M8L9K21j15J18J77l12n2j77O5
4384a21M5J20l60N51n52L54J93o3j31J31j4j75N2j35l8K74k55J63n4m5j39K59
$$ plain form
4220 244 -174 209 -265 -271 14 -121 21 140 168 24 -133 -52 71 60 82 80 -18 -83 -15 26 97 142 -49 32 -81
4245 -81 -99 -97 218 21 -132 124 149 96 109 164 12 -31 84 208 -49 -173 45 181 -307 58 109 0 -103
4268 -103 97 -102 15 -28 -56 -130 -179 157 -106 47 25 170 -131 162 227 -220 64 218 276 237 298 190 -135
4291 -135 61 193 36 200 -89 -196 -208 54 135 44 -83 107 -20 54 -164 -170 -44 144 -165 -270 -179 -143 231
4314 231 34 36 211 3 171 86 55 115 -8 -318 44 31 -55 -80 -207 -108 162 -33 -76 -32 48 121 -112 10
4338 10 134 -81 -120 -134 38 -44 50 48 -51 -7 -41 -101 10 149 -160 -9 158 10 -289 192 -138 28 69 -104
4362 -104 84 -217 -312 -237 210 -235 8 -271 -25 76 53 -133 -85 -46 175 60 178 355 43 -9 -186 -121
4384 -121 -76 44 -316 235 -317 37 230 167 36 167 153 -22 30 -105 -143 131 -124 39 -15 -60 -199 60
4406F0j68J65J59Kk63J64j16j68J14J99k05J84j86R9j14j20j11N13k27J35M2k21
4428f3j3J68r4L12k18j3J1m53L94j84L11r6L5o3K48k89Q8j83J96j04J79k88R0
4451b9qj67J31J31p5k24L62k33R6k7n4J42j04l1J67j42L0p5J98l92K34J31J28
4474A89k03j13R8K11L6l01r1P8J05o8k2K35j74n4J7P2J08Ok37n5L0j3J05j4J19
4499F4J24k85K20j55r2R3Q0l0J96q7l44K89j88p9K25L6l64M82lr4J28j57n7k84
4523b82O3j41M34j01J20K7k09M6k9M6J39l0K7k14k1J90O7n6p1p7k00K41l7J72
4547A04j91R9N4j12J22l67J37LK27k16J60k14J14L89n48N31l41L4Ol9k47K98J01
4570A04k3j4Mj0r2Oj7O7j33J72q2j14P3R9M8j53L8K35k62J05k0J71p6n3O9j16
$$ plain form
4406 60 -108 57 216 218 -45 119 3 -165 -51 148 -57 127 -59 40 -74 -194 -305 208 -19 116 158 -63
4428 -63 -76 92 -2 310 92 79 90 -363 31 -153 158 62 97 34 282 -7 81 -102 94 -10 169 -119 -29
4451 -29 -37 -204 -73 58 -17 -241 121 -112 -16 -43 -97 45 -59 -90 77 -65 -35 -110 88 -304 -70 61 189
4474 189 -14 -127 -29 182 218 -83 -174 -96 9 -59 -81 154 -20 -74 -57 15 123 129 -108 -163 -133 -146 -41 -55 64
4499 64 188 -97 123 -32 -124 -31 49 19 215 128 -216 73 -115 -194 31 67 -297 185 182 88 216 59 2 -282
4523 -282 -219 -360 74 -27 93 120 -89 -43 -72 -26 113 83 110 -104 -125 65 132 76 5 -72 -272 -31 -68 104
4547 104 -87 12 66 -46 76 -291 -154 -151 76 -140 20 -194 -80 309 -239 292 -49 -15 -9 -48 -295 3 104
4570 104 81 67 71 61 -31 -25 -42 25 -108 64 -18 -132 -59 40 88 -65 -27 208 -54 51 31 202 126 73 142 26
4596B6l5J78j38j47J10N4K03k01P8k62K15j76K2j19J64J19j15O2n0J67o7qj65
4619h5K12q6p1J92j52n6j72K21J73j55K54p4j13m2l6J24k79N7K01j09K04l13L10
4642B05kk82K72j35r0r7J65J7j40q4L16m2O2j30l7J17k39jM64j95j91j9r8K23
4666E9j95K33J59k68l0j17J46k3l20K44J14j10M3k4J65k73P9o4J23K83m46K45
4688B3j60J88l4J77m20K32JL1J9k71L28j17J31k50J8K67k31j21J5N5l6j33K80
4711hJ5j7j16L4m3J26K3r9j5K66j26J69N3m10L8J88K14l21J99k80M4l3o8K04j38
4736a01J35j27J16k66L25n4j62J77q3K48j24Oj21J48n4j60J31j04o1J26Pj7R4
4759G9K7k29K53j83j09K72mj15R7m2q2j26R1j9KR1K2n2j22L9j50L99p8j62L25
$$ plain form
4596 26 -9 169 31 -116 -6 48 251 50 128 -134 81 -95 -73 -192 -28 91 -24 38 -12 155 88 80 -85
4619 -85 127 41 -30 162 10 -46 -218 3 176 21 275 201 88 46 10 134 -145 -88 113 4 208 -105 205
4642 205 203 -79 193 58 -32 -129 36 53 -87 -171 145 103 165 35 -2 115 -124 -125 339 144 -47 -66 -164 59
4666 59 -136 97 256 -12 -42 -159 -13 -36 -356 -112 2 -108 -65 -89 76 -197 -118 -182 -59 224 -222 23
4688 23 -137 51 17 194 -226 6 7 38 57 -214 114 -3 128 -122 -104 163 -68 -189 -174 -119 -155 -288 -8
4711 -8 7 -10 -126 -92 -135 -9 14 -85 -100 166 40 209 262 -148 -110 78 292 -29 170 -110 -66 -99 -167 37 -101
4736 -101 34 -93 23 -243 82 28 -134 43 -40 208 84 90 -31 117 63 -97 34 -70 -131 -5 2 -15 79
4759 79 106 -123 130 -53 -162 110 106 -9 88 46 -36 -162 -71 -90 -88 3 25 -27 -149 -110 -260 139 61 -101 224
4784B24m09J00J04r3M7K04j29j34J85k48M85m72QK03j49M7m9M7Q2M5k08K4K17
4807A31n1k23J75J38l8k75J35N6j11K89j3k44J73n3J19l50K53M7K0l72K42j44
4829i6j29K91L4J6j21Kj87J52oQ3J14k03N0K18m24M37k33m8K67k85q9L6J10L8
4853B7j26L01j92j0J2L1j19K48r1j29l5R5J95r6po7l07M1J42NO4RN4m9o8L99k47
4880H0j84K56j40J16j07K3n1J22Mj47J76j67rj06L7J87j24j48J25P6j62K11m57
4903c89L04J71k05R7J7J6j51J68p7J82j68J93j29J52j30L9j17J58j99o1J02k10
4925b37K40q4j69K28mQ9k58J49J65k29K56j83n4O6J15L3k98J77J62k36L81n23
4947b14J08J68M5j62M79m71J0oj78K48j09P3k47L06q3K32j31P5j61j77j46K09
$$ plain form
4784 224 -185 -85 19 -74 -27 177 48 -86 99 -149 336 -136 -128 75 -74 -27 -76 -29 53 98 -110 -86 131
4807 131 80 -143 32 170 132 -143 -8 48 -63 226 213 -31 142 89 208 -142 111 158 178 -194 48 -96
4829 -96 -225 66 100 116 -5 -3 -190 -38 -44 39 153 -50 0 218 -206 231 -2 -50 217 -68 -157 -121 -11 27
4853 27 -99 202 10 0 12 43 -76 172 81 -48 -83 12 207 111 104 37 -270 -229 -87 -82 -18 -9 45 -4 -72 327 80
4880 80 -104 152 12 128 21 44 -7 115 119 -28 148 -19 -28 -134 -97 90 -34 -182 -57 19 -143 68 -389
4903 -389 -85 86 -119 -22 -5 11 -140 28 -49 133 -35 158 29 181 51 90 -27 131 -68 -129 -27 -237
4925 -237 3 -81 -250 -22 -26 63 -195 -46 119 -110 146 -37 -91 -25 90 123 -175 2 164 -72 309 -214
4947 -214 -106 62 107 -55 424 -47 -37 -43 -221 27 -82 -9 -256 50 -33 199 68 143 -18 -195 -341 -132
4969a32J20j3J96k11J17J1p3k2R7k2k51J38j28K66j80p2K00j81J17N9k5mR4k30
4993a29J29k45O1L16j43k0K23k34Q5j35L0J24K44j92l6n9K2l8N3P0k47K84l13
5016a50J27Q6j34J00R3k65J05Q3k01J21j1R5J60j85L8j33LK6M7K32k99L64m33
5039a31qK79l01K44j83N4K74l02M1Q8m7M3N2M2N5l51R5O0J00j12k36K13jJ84j85
5064c3r9K8J0J73J37j72M5j97k9rM2L63l56P5p8K23j37K76m89J66J79j36qm2j44
5089b12M73k20K8J19r3j30K89m73J67J82k55K07k4Q8j89J7M3n7J38M4j78L4k9
5112c1L88m17n8P3N3J72j51Q8l33j22K06O1J12j72K1L01j48Mj38J38Pj23J14N1
5136I6K13m78L03r9J00j06K5k36M35k91J50P0n6p5k75J73Q9j39R2J51l60K73J54
$$ plain form
4969 -132 -12 -25 171 -40 77 88 15 -7 90 68 -183 -45 -173 93 -87 -159 41 -140 -23 36 11 7 101 -129
4993 -129 0 -245 -184 132 -11 -31 192 -42 43 -92 -62 62 306 114 78 19 41 3 56 126 -121 163 -150
5016 -150 -23 63 -71 29 122 -143 -38 45 -156 -35 -46 49 209 24 62 -71 -68 -42 5 237 -62 302 -131
5039 -131 -139 140 -161 83 -100 -46 228 -74 -33 55 8 51 103 145 200 -151 -56 4 104 -8 -244 -31 -32 152 -33
5064 -33 -132 -104 -94 79 216 44 89 -108 -137 -146 -104 259 -97 -22 -100 123 -14 262 -227 -61 118 -18 -26 -68 -212
5089 -212 261 41 69 188 95 -35 254 -219 -52 130 -125 82 58 146 -43 -26 17 -40 98 142 -36 -2 -31
5112 -31 357 -60 -118 -45 8 180 29 117 -216 -338 -132 -71 41 -131 -110 191 43 47 -91 47 54 -69 45 96
5136 96 309 -169 134 35 135 29 54 -182 253 -38 112 182 126 51 -224 -51 38 -101 -9 142 -218 55 209
5159B09k33O2L26k2j86j65o7J73l10M9J44k29L56k45J34L7k0j85J24o5K16n5m5
5182Cj17K5o6J45J3k26K26J63O4j8k58k3K1K3l46M03n1K63l91K2K1J45j01j19
5206a79L09j02K3R1j94qj02Q4K97m25J61J11J14L6n7j65P9N9K4k46l8J71r3M7
5230cP1p0n0L50l10K53j34j90K92n4j47J3P1J0n1m6K07k24L1j21K92j62k56M53
5254B25l05J14J23N8j77j22K13J19l27n9L75m09Q6O6L53l09M4k32K21J4N6k00
5276g3J92l9l03K00k0N4q8J87L1l36K59j15k2Q1R7l63K56j9r5j76N19j66j98K33
5300I6k05J03Q4k46J0O8j23K0O5K49k4j44nJ14j29K75k86M29m34K26k05r7J63
5323DJ95k7n3l7p1j01K70m16L17o0j94J85k19J07q5O3k0J5J30K8k31K18j27Q5
$$ plain form
5159 209 -24 38 364 342 156 -9 -76 97 -213 -164 -20 -249 107 -138 -4 33 13 -172 -48 -113 103 48 3
5182 3 -114 -89 -155 -10 3 -223 3 166 230 212 -46 -69 -48 -25 -371 32 -19 244 -147 -125 -104 41 -60 -179
5206 -179 130 28 51 142 -52 -60 -162 -78 219 -206 -45 66 180 216 159 -6 73 132 156 -90 -128 43 -50 -3
5230 -3 68 -2 -52 298 -12 241 107 -83 209 155 8 21 92 102 51 5 212 -12 19 -102 190 28 -228 225
5254 225 -80 34 157 215 38 -84 129 248 -79 -138 237 -172 -86 -20 333 24 68 -164 57 71 127 -73
5276 -73 119 80 -223 -23 -43 11 -77 110 141 -195 64 -51 -73 8 105 -258 -2 -21 -116 -292 227 61 -137 96
5300 96 -109 -6 78 -168 -158 -90 -213 -193 -128 121 97 -47 -52 62 -67 208 -78 351 -83 143 -62 -159 4
5323 4 199 172 119 82 11 -90 180 -236 81 21 -173 12 -207 -100 -185 -122 -142 -127 3 31 -200 18 -109 -24
5347b4k85L29J98l86R5L4p2K07J6O4l65J20Q6O5Lj64O2J74k20J48Q7L3k82K73
5371A96l58L48q2k35P1M8K37j25r5O0o7j07Qo6M8J53OL3n7j31Q6l5J69j0j07J7
5397Ej7J25M9k91L3P4K01k89J02k38L35k61J28J19K0m7R5k04M3N3k51K35j5j52
5421a48J77N6l8o6K8K92m94K31n3r7p8J47L3rJ54j14J94j77Q8k33J48o6k88N6
5445b57L53j42J53J34j67O0r4K21n52L96j3J10j59M6k17K11m00L56J23Q9l97K95
5467A49j11l72K72K91j11j62J21p1m7N0J36j23R9L0j28K49k22j64l2K78p0N3L5
5490A50j88K13J06j70m12K35l1J34q7J45q3j5l4M5K30l15K83pl3n4j77m4j11K83
5514F3Q9j32p5K20k26K56j65l13J69N5N8p7R3m6J84N8k79J59l0J31j14j51K14
$$ plain form
5347 -24 -309 20 218 -168 -73 -39 -111 96 112 176 -189 -69 17 82 85 -79 -17 157 -63 85 172 205 -77 196
5371 196 -162 186 104 -131 -60 -12 225 100 5 65 -2 -109 -101 -167 -119 34 40 73 16 -115 -29 -64 105 95 -12 5
5397 5 -12 113 162 -129 -96 -22 179 -110 -8 -246 89 -172 -44 75 95 48 143 -61 -18 35 -216 19 4 -148
5421 -148 29 85 47 -19 9 301 -193 38 -15 -112 -190 -43 -10 -19 135 21 215 38 126 -107 41 -25 -313 -257
5445 -257 96 -46 107 241 74 134 40 261 -291 105 92 202 43 89 -128 83 -317 39 162 251 -146 149
5467 149 38 -334 -62 229 118 -44 77 6 -41 9 145 22 121 151 23 272 50 -114 -146 132 62 115 150
5490 150 -38 175 281 111 -301 -66 -97 37 -50 95 12 -3 -37 8 238 -77 206 199 166 112 -65 -109 -220 63
5514 63 152 20 -55 165 -61 195 30 -283 -114 -59 -1 -78 15 -31 153 211 -68 91 61 192 78 -73 141
5537A41j00k5j3K09J5k11Jj04J81J28k63K82j68m2p3n1L52j77m7qk60K47k80N37
5561B71k72j90K31k57K09K4j09N4J90J15l51Q7J10n2Q7j62k35L55m8m2J60j23
5583E2rn9l1j58K30j8l3J00j01K2j72J65P4k63j9K69l08J78j82K93k1k70K33k9
5607e7J05o5Nkm8Q4k9j79m0K05K66j35n7q1P4N5J56l42J13k1k2j82K49J3o9m9
5633e3l02L56n7P1J73k45J2j96J13K47j21N1j7K8l7N1j55R0k12r4K14J05Qj37
5657a07M20k87j50Q6P6k6P1%Jj07J09j57L45j70q2q6M3M3n0O8p5j86P0J76r8N3
5683b0R1J45j44j51K35N5j50j8m2j70J44J05k30J02oK54l35K98j51j15O3L4n4
5706f0j21l9Q3L2M5j22P3O5J36K2k30J12q1j36J62j08K72RJ19l35J93r7J68k66
$$ plain form
5537 141 41 16 3 212 227 16 17 -87 94 222 -41 241 73 31 -42 -93 259 82 35 27 -233 14 -266 271
5561 271 -1 -191 40 -217 -8 16 -93 -39 151 266 -85 2 112 60 147 -15 -250 105 57 15 175 52
5583 52 43 -16 -47 -205 25 7 -26 74 -27 -5 -177 -12 62 -201 -220 49 -259 -81 -263 30 9 -261 -28 -57
5607 -57 48 -17 -12 -14 -62 22 -7 -186 -226 -21 245 110 53 -28 46 101 257 -85 28 7 -15 -197 52 65 -4 -53
5633 -53 -355 1 -56 15 188 -57 -45 -241 -128 119 -2 49 32 60 23 74 -81 9 -203 -297 -83 22 30 -107
5657 -107 313 26 -124 -38 38 12 83 83 84 -23 86 -71 274 104 22 -64 -21 22 -28 40 -35 -221 -151 25 -73 -20
5683 -20 71 216 72 -79 156 211 61 43 1 -169 -25 80 -150 -48 -54 200 -135 163 12 -103 -40 -6 -60
5706 -60 -181 -220 -137 -105 -60 -182 -109 -44 92 114 -116 -4 -85 -221 -59 -167 105 114 233 -102 91 -6 162 -104
5730a04j37Q8L7R7j46K37j00l0j0O9m3j28K48j75K72o9J16k18K5R1o6j1q0K48
5754B11k52j4l4K94k46k26K43m21M98J99k14jJ25k5n6J56k62L2p5J3k6J0O0O6
5778E5j08L8j8j17NK71P3k21M4Pj56J33j09K25k9P5o2k16P1n4L00k08k4k63J33
5803a55K30j47k5K32j01j34J84o9J06jm2r1K32l2j97l6r7K6J5M7J19J28k57j45
5827b10K72O4j08j16J83l6O2k08j99K31k1J2O9J36p3QO4j27J83k08J48K9J8J5
5851A88ml23J45rj74J64K09k08Rl3K53j47j55O3m5m5K07p4nj68J63k5j69K31k61
5876b13Q5K83k00K21k05J98j64R9j45M1J05p9j97L46k43J65J07M0k88M6J87k03
5898a4oJ86k90L20q0q2j52K43j42K09Q1m66L80k16K12k74L72l38K62j44j50J36
$$ plain form
5730 -104 -241 -153 -116 -19 -165 72 -28 -58 -68 1 -42 -170 78 -97 175 106 222 4 29 120 54 43 -37 211
5754 211 -41 -55 -89 205 -41 -267 -24 -445 53 252 38 37 162 137 81 237 -25 7 -68 -55 -81 -71 -11 55
5778 55 -53 -15 -33 -150 -145 126 199 -22 22 29 -127 6 -103 122 93 168 106 -110 -39 -93 207 -1 -25 -288 -155
5803 -155 75 -72 -97 135 34 -100 84 15 121 120 78 -13 219 187 -10 -46 -143 -117 -102 -55 64 192 -65 -210
5827 -210 62 126 18 -98 85 49 111 -97 -296 -65 -86 -74 -5 131 58 66 130 3 186 -22 126 155 173 188
5851 188 184 -139 6 -3 -177 -13 196 -12 -3 -36 217 70 -85 -22 -67 -112 95 21 16 -152 11 -14 -183 48 -213
5876 -213 -128 155 -45 176 -29 169 5 104 -41 0 105 26 -171 175 -68 97 204 244 -44 2 189 -14
5898 -14 -20 166 -124 196 116 34 -118 125 -17 192 273 -193 187 -29 183 -91 281 -57 205 61 -89 47
5920D7L6j81M1q4J61j46j67L26Q9j12J65k49j64L30k21P5l23M68j12l6J79J85
5942C07k70p5J05k00P6q7J2K48r5j8k17O54k77j27j1j25J46j97L60k19Q4r3J67
5965A48o9J36j20K5j35LQ3j31m6N4k1j09J92J92O1j91lj5J18j69K72j43J58l72
5989h2J87j00j22J17j69K41l61J51K14n9j64K6K27k01L48k80k68K26L85l14m9
6010d7J3j57J80j10L26k16j24L62k80q5L2K02l10L01j49P5N8Rk99K16K24k54K2
6033a1R8j52J15Oj45M5J26j2J4j21J51r5K3l2M6J84k51O2j02J66j30n1K04M2m06
6058b26K72p8j03J30K69l29J51j79K48n0k9J86m08J71M7j15l8k17J54J12j61J44
6080d9j73K31K9m6m3J38k03pJ89k5n2k7P4K3o1J62L7k42J6J14m9J11j53j5M8j4
$$ plain form
5920 47 83 -98 -57 -141 20 -126 -293 33 122 10 175 -74 -238 92 -129 -54 -377 91 -21 -57 122 307
5942 307 37 -38 67 -133 -57 -144 -132 116 21 3 -214 440 163 36 25 -100 46 -151 209 -10 74 -19 148
5965 148 79 215 95 120 -15 -12 71 -60 -106 -52 -73 -182 10 202 263 72 69 54 172 3 275 132 290 -82
5989 -82 105 5 -117 0 -169 72 -289 -138 76 17 -147 -121 106 -95 253 -27 -295 -69 316 2 -47
6010 -47 -34 -191 -11 -121 205 -11 -135 227 -53 -138 -106 96 -214 87 -62 13 71 80 -219 -3 221 -33 -11
6033 -11 87 -65 50 56 -89 -44 82 70 84 -37 114 19 42 10 56 240 -11 51 -51 115 -15 -66 138 180 -226
6058 -226 46 -32 -135 -5 264 -65 86 -93 155 105 76 262 -146 25 72 -43 -81 -298 -144 -32 -193 -49
6080 -49 -222 9 38 -8 -51 87 -116 -123 66 41 -11 -38 36 59 -2 160 197 -45 -29 85 36 147 -6 -21 27 13
6106A3J23j64J00m7Q5j33N6l4j02L19k88L39l32J32P9l3k71J22J8j71L25p1L3
6129I8J0O4k40J91J26j97k1j76J93N3j14nj56J03M18l88j99K4R8O0j12L69j40
6152E9J83k42N2R9j61J47m5o2p6K6N5o2R4k03J33Q0P2j38J74J35k15k94K22j50
6176a17J94J5k34k35M31o4L1j47j97L38L7n3r6O0q3R3J32l64K63J3J52p7j20O4
6200C6j6k02L0M9P7j34j2J11j5O9M2j15N4J02m9j5m2K20j68N3rj24J29rm82M19
6226aq5M2K38k24l2K5Q4J49l22J01j43J89K04k66N2N1l8j09Qq5J56N3J9j81K24
6251A09j16n7J38j21P8K74n09M20j52m7j75L91l94K35j55L2k10L51J94N5j91k69
6273a19N9Q5n3J13q0j82J50OK17m06L42j18j01J45k0p0J05j26r8K69j81l9J1o3
$$ plain form
6106 13 136 -28 72 25 110 -23 33 -1 -103 216 -72 267 -65 67 146 113 -158 -36 -18 -189 136 65 98
6129 98 108 172 -68 123 249 52 31 -145 48 101 -13 -18 -174 -71 347 -41 -240 -216 -118 -58 -170 199 59
6152 59 242 0 52 151 -10 137 92 30 -46 -20 35 -27 67 -136 -3 77 149 11 185 320 105 -189 33 -117
6176 -117 77 92 -142 -377 54 -10 21 -126 -323 15 52 -1 -97 -37 -120 -27 105 -259 4 17 169 92 -28 36
6200 36 20 -182 -152 -103 -26 -160 -172 -61 -76 -7 35 -80 -26 76 27 12 -30 190 22 75 66 -58 71 62 -420 -1
6226 -1 -86 -44 194 -30 -62 -37 47 196 -126 -25 -168 21 225 -41 11 62 24 -85 -77 -162 -6 47 66 -115 109
6251 109 -7 -64 74 -47 31 305 -204 216 64 17 -158 233 -161 74 -81 -49 -259 92 286 341 150 -119
6273 -119 -60 25 -28 85 5 -177 -27 -21 196 -210 132 14 -87 58 38 -32 73 -53 -151 118 -63 -102 -91 -154
6297a54K06j65L44j57Mk10J0K45j63j4J42N6k84K21j7k1m5j35K80k04K14j96Q8
6320D5n2m5J77l42K36k52M30j41j0Pj40q7J72o%J39l19q6K48j06O4L6j42J61K10
6345A97l4%M1m01K81k47J28k60L63k6N0l2j00m2J76Q8k3P1r4k18l4KQ3Q9NL2k02
6372a07K26j83J32j77K96k46J30j1j2L3o2q1J9K6J23k52P8O7k12O5J71J38k18
6395e7J12k01J30J35l91J80Q6J22j13NJ73m54K06N6J90l28l0K33o4J7j18J52l5
6418FJ15j77J05k1nj56J76j55J14n5JJ19n3N4P5k27p3J46m8K39j42j10J5N8p8
6443g7O0L0j47K26j2Q0k25MK66k63P0Nj61oJ20J27k3J7j97J37r0q5L32l94L26
6468A20j01j27J59k9j73K89k83J02j85K69mj15M12o69M67k01P3J6N7j72l5j37
$$ plain form
6297 -154 52 -113 231 74 78 -132 -122 123 -40 -54 88 144 -140 81 64 43 -2 -137 143 -61 153 -43 45
6320 45 -7 -52 125 -217 19 -233 197 56 46 53 -87 -174 -2 -8 -8 131 -188 -274 -26 -132 -68 -32 -174 -13 197
6345 197 163 163 204 -197 84 -163 -35 -295 68 42 92 60 -40 -82 94 182 159 230 136 -82 -116 -114 -31 58 63 95 -107
6372 -107 119 -64 68 -109 187 -59 71 60 48 81 19 -62 -43 -17 106 -146 -68 -1 -213 -148 23 161 -57
6395 -57 55 -146 -16 119 -272 -92 -6 116 3 8 181 -273 -67 -11 179 -149 -179 54 -10 7 -111 41 6
6418 6 121 -56 49 28 23 -133 43 -112 2 -53 -52 67 14 68 143 -84 -157 -11 -59 180 38 -72 -57 1 -77
6443 -77 -17 13 -134 92 80 160 -65 -61 205 -58 12 17 -144 -150 -30 97 74 91 -106 31 -59 -144 188 -206 120
6468 120 19 -108 51 22 -151 138 -145 -43 -228 41 37 -78 334 -335 132 -69 4 20 77 -95 -130 -267
6490b67J66K44l27J00Q3j30N8J25J4l58K39OJ98l22L6K22j78J58j24L37k88M7
6512C9o4J4J61k5r7k03M00n87L40K50j32j11J28r6m3J8J6K42l66K46K0j83K73
6535B40k02j39J82k90J00J95OQ5J34k67k77L78L8Kk4k62L16j86J68k72RjK1R1
6559D5P1q5j46J71j06J89j15J62q2l35K75O2n2J4R0l23J27qRL7p3%K24l52Q1l8
6585a58J17p3J20N9p1J36k60J61J1p0J43k58J62K7k6j05l7J00m6oK60J76j52k84
6609g4J6jq5N0K19o8q1J8K67k94k5oP4P1k49L13Ml96K20N8j98J81Ll6q5J72k54
6636a86L9J91J93k34L3j02k6J32m4J45k19r7J52L37l79P3K25k50K5K6q1k28M07
6659A32r8K9O3j44J18j09n6Q8m2P2k72K56K1j24k10J14K84O2j62m20K30M35m09
$$ plain form
6490 -267 -101 143 -184 -84 -1 -131 -73 52 66 -292 -53 -47 151 -171 -135 87 -91 67 -57 280 -8 39
6512 39 -25 -11 150 125 28 -175 225 -362 -22 228 96 -15 113 17 -26 -8 8 250 -116 130 150 -33 240
6535 240 38 -101 81 -209 -109 86 92 177 311 44 -233 145 183 185 161 -101 215 29 197 -75 -66 -67 -46 45
6559 45 116 31 -115 56 -50 139 24 186 104 -231 44 106 54 68 158 -165 -38 -46 -37 0 -73 -73 151 -201 -120 -158
6585 -158 -41 -114 6 65 -6 130 -130 31 42 -28 115 -143 19 46 20 -85 -122 -22 -68 -74 186 362 210 -74
6609 -74 -58 -59 -144 -94 125 57 -24 -6 261 -33 -58 -64 10 81 -168 145 149 -247 -27 31 -167 14 17 -19 -104 68 -186
6636 -186 -147 44 237 3 36 -66 -92 40 -4 141 -78 -175 -23 314 -65 8 233 -17 8 34 -47 -275 132
6659 132 34 63 126 -18 100 -9 -65 23 -19 53 -219 37 58 -66 -276 -162 122 184 22 -398 -168 267 -142
6682a42K32k03M2J39k6k5n6j25J02R9m6p7J77j8j47J50k06J71r1m6M1K29l48K03
6706B9p1J52l0p4m1K2r0K21l05J77L3Q9m06K33Qn1j13L5J1J58J3o9J20L4j6l40
6732b71M68l29K22k11K94j26k36J52J04J15k26j27J25J53J1q2J04J09k89M7K6
6753C3K28l57k84N38k52J96j83J13J10q9J61j7r7j62k0J48j66o4K56l31J40k7
6775a26K45mJ94j99mr9r7J06O5l3J42r2k2j77Q0j17J2K58j43l14O5K37K22k31
6799c2J20j61K83j12j51R5m8L6k8q6O7J11lJ16k61J28k09J24j32r2J31J92o6p1
6823d9r5K32j4n0k12K51J39l19J62m5O6j8J24j01j24J24N8m1j61j09J27J9K63
6846B27k04j6k6o5p9k06L41J6LK6k37J22O1q2p5J85k8R1p5j10M5R2K8J82k71O8
$$ plain form
6682 -142 90 -113 -71 68 42 17 -39 -164 -62 37 -9 -86 91 73 -74 76 -130 41 -50 -96 -55 174 -174 29
6706 29 -42 110 80 6 -35 -13 -103 118 -187 -10 23 112 -294 -61 -53 -104 -217 -182 -171 -13 0 -69 51 85 69 -271
6732 -271 197 -132 90 -121 173 47 -189 -37 67 182 -44 -171 -46 107 118 36 140 249 -40 7 33
6753 33 261 -96 -380 158 -94 102 -81 32 142 53 214 197 100 -62 -82 66 -100 -164 92 -239 -99 -126
6775 -126 119 115 309 110 106 7 -90 16 81 48 190 98 76 -101 -21 -138 -126 132 -11 -325 -260 -23 199 -32
6799 -32 88 -73 210 98 -53 42 -6 30 2 -84 -17 94 91 207 -54 74 -135 -11 -143 -235 -104 88 22 -49
6823 -49 -144 88 74 24 -188 63 202 -117 45 0 66 48 172 71 -53 71 129 88 -73 -182 -55 -36 227
6846 227 23 7 -19 -84 -163 -369 -28 -12 -9 17 -220 -98 -37 -119 -194 -9 -37 54 -21 -131 -86 6 34 216 -55 13
6872A3p4%Q3L4l08K76J34r2j36J4L71k49K84j22m36M1K06J38O2r5R4k20r7J9Q8
6897B8r3j22L12j78J74M5j26p3J37j02P4j70J7NMJ56j25J08n4k1pql35L90j5K96
6923C17k37j2J5p1n1j81K88Pj59K00j80O2J41j11J3L1J17l88L4J78k22M28k98
6946g9j1K39r0j06J56j02m0j41K05K5m0q9r4R3R8O3k65K42j51j5N2J72r5L9L0
6971I6j14k34K11K02k7Mj97L3L54l24O7J9k38L29k70q9K10R6l5R9j30m6k6K11
6995B01j12k13J98j79J53J53l12l2o5J96k8Mm3mJ06k8M2m0J1j56O5l2M3L0K6J22
7021A06j0o9N5J08m58K14R0j72j1K70k53J20R3l50J58P2m6J19k50M22k41J65k9
7044A03J27j78q6J42j2j37m1R6j09J22J6J28k39J90j72RQ4M4j91L4K38Q2j65n7
$$ plain form
6872 13 -61 -61 22 56 -252 24 158 66 -70 -56 315 66 350 228 -208 -167 39 177 239 144 238 18 -79 -60 28
6897 28 -65 -187 125 -53 121 166 40 -33 104 2 76 -94 -77 -72 -68 88 -37 71 17 -4 -11 -19 -354 36 21 317
6923 317 80 68 83 12 -39 -220 68 75 -84 116 -64 -2 139 28 41 72 189 -199 -165 13 -209 219 -79
6946 -79 -90 149 59 -47 109 7 -33 -174 31 56 16 -73 -167 -74 24 87 -178 64 -87 -102 -50 122 27 66 96
6971 96 -18 -252 -41 161 134 138 -59 -26 328 4 71 90 -148 181 -89 -178 32 128 93 192 62 16 -10 201
6995 201 89 -124 74 -105 48 201 -111 -143 -208 -12 -40 -36 -79 -83 23 -5 37 -3 8 -148 -83 -115 -72 -42 -16 106
7021 106 96 27 82 190 -268 -54 36 -136 -147 123 -130 -10 83 -267 -109 -37 -83 36 -214 208 -33 132 103
7044 103 230 52 -34 108 96 -41 -82 14 -95 27 43 171 -68 122 -50 -41 43 87 -104 -70 168 250 85 28
7068B8N5o7k27K04J1J7q3J97o3J7k99J17J43j02P5j44K33o9J7R7J05l60M1J07
7092E0J27j64j88K22j23j14K96j36J58l8l35J30l0K23j81J83j48J75k10L5J62
7113I4j0k31J80O6k12Mk89M95L5k00L23l81L77k45j50K39m8J25k15r5J90j67J39
7136B4Q0j89J42J72l51J84r2J65O7m45L08j42o4J78j37L26j76k3R7l44L30m8j84
7159a22l2L48p8k49J33j30L4K0P5o7Q0j80K67l61K31J26j40R2k44J15K1J07J1
7182E7j91K19m9q6j5r3K67l3%j90L1o0K59j66K90j27n1j63K1j67K16P3r3KQ8m2
7208cL1K32j70p2p7J38k17J11N5k49L50M8r5LJ08k62P3Pp5J26k85K67j48j06K01
7233in6Pk4o6%K63P1r4r0J79k21J03K2j07K00k08M6k6O8nk22K45o5j88L07j24
$$ plain form
7068 28 83 16 -211 -7 4 21 -62 135 72 89 -210 -93 50 -52 23 -121 112 43 60 157 262 -98 -57 50
7092 50 177 13 -175 47 -76 -190 106 -30 128 90 -245 -115 -145 78 -103 80 -68 107 -103 -68 94
7113 94 84 -147 33 99 -113 -109 -398 97 132 -68 255 -126 251 6 -144 95 47 172 -43 -138 52 -115 24
7136 24 104 -85 57 229 -122 62 -30 135 202 -243 65 -77 -141 37 -100 226 50 27 124 -220 110 62 -122
7159 -122 -154 194 116 -133 0 -130 -96 -76 -1 -68 12 -168 99 -262 -31 95 -45 47 -197 -82 -61 46 57
7182 57 -134 85 36 -50 -65 -158 109 76 76 -114 -83 -143 116 -50 240 113 62 -101 -80 -247 -31 42 -51 -49 39 -3
7208 -3 28 260 90 18 -59 79 -138 -27 28 -221 129 177 82 85 193 -69 4 11 -64 62 -223 44 -104 -210 -9
7233 -9 -65 -58 -82 -148 -148 115 186 92 2 181 -40 63 85 -22 178 -30 16 -10 58 53 -169 76 11 -177 130 6
7259FO8K19k25m9L6J95m40L98J41k19r1k80K03m5J99R8l75L39p7j65L16j86k6
7282D0O5k97K61j07Q0l0J09l1p1j01j2j47M44k40J34nr1l6P0K13k78K8j12J7L02
7307B05j23q5q5J15J57m53L70q3P2k99O9K69kk38J53j02J28m4p0m7J36L9p1j86
7331a75J41J49k08J23J52j87j00J50j9r2J37j09k22L39k42K47j55J30r9j4l2M09
7353C23K6o97L83j36J70Q0k90K42j61j28K7J37R6K0k1J35l11Q4K0QJ30k21q3O3
7377a04K08k26J08l0Q6j4J88l10J24R0q1j07J00oj81J07O4j24P0P2O5R5p2m28
7401c06J47K56r3J61j97K1r1J29M8k80NK80J39k99N1L1L9k23N06l23R9j65r8L21
7425A58j92KQk2P0K5j35K35j75k6J03j13m6K9j28K47pN3r2J03j16J27j4o7j43
$$ plain form
7259 6 74 293 68 19 55 250 -190 208 349 130 39 -241 -38 -83 116 214 -161 178 101 -64 252 66 40
7282 40 105 -192 69 -38 42 12 121 90 19 -82 -94 -241 203 -37 97 92 1 -35 35 248 -30 -2 -114 -97 205
7307 205 82 -3 -88 27 184 -269 101 18 90 -209 -140 129 127 -111 42 -60 68 24 -46 -93 43 82 11 -175
7331 -175 -34 115 -93 30 182 -5 -105 45 26 -66 71 -38 -260 79 -163 84 -71 59 -40 -54 -86 323
7353 323 349 -348 35 -101 69 149 -141 101 -60 -188 -161 -24 72 92 71 206 -105 -21 -1 7 137 -84 -167 -104
7377 -104 104 -122 -14 -44 42 28 216 -94 30 120 39 -68 32 26 -155 -48 16 -108 -38 34 99 194 122 -306
7401 -306 -159 97 4 165 -32 -11 -102 27 75 -205 -200 80 219 -80 -29 2 41 -182 324 1 100 -65 -163 158
7425 158 -34 -32 -24 -46 24 49 -86 149 -26 -52 51 -62 -108 -79 -207 40 33 86 -6 97 -19 108 94 27 -116
7450a16j9J38J09K4l53M68J38o26Q7K87k15J64J02k23q8J56j1K75j83r5Q3k63
7472a61M6J39L4N3N1q9k03J85O9k44r1J59J92k6j15q0RJ26O2jj61M5j45J91K3
7497F8m1pm0R5l0J41j76k4J48j24L4j09j70M0J70K19j61m2J20q4l6m5q9j2K06
7522E1L7Q2j66j8j72L04N4q3j3j08J94k4k39M0J7K16k09Q5j71K91j14m6P0J10
7546A88M3k70j52J57KJ0JN0m5j27K2L27l7j27J65m2k22J73M7Ol37K69j00j51J95
7571D5j38J65m9O2l9qP6p7q2K31k76J25q5j13K60J67j22j77l18L07K93k68j06
7594a27J78j23j26J04J9L3K02j90j4Q9J58j05k0r3j59K41k64J22j53N57l48k7
7616d6K00l03N7J43j74R1oJ43L4j27j30P7L8r6O3J44r7Q4J41m62J38J06O0n2m0
$$ plain form
7450 -116 -135 3 112 136 -217 251 389 -237 -150 137 -78 86 188 -35 -123 33 22 297 114 19 102 -161
7472 -161 -115 24 58 111 162 73 -130 55 124 -120 -211 -52 140 114 -1 -81 -72 54 116 115 -46 -1 -146 45 68
7497 68 27 20 -20 75 45 186 10 -14 134 10 44 -65 -235 -195 -25 194 33 -9 111 27 -9 -54 -143 -155 51
7522 51 88 170 4 -14 -186 118 172 89 76 -32 162 138 -101 -61 -44 172 -37 48 -123 168 54 8 78 188
7546 188 231 -39 -191 -34 -32 -22 -21 29 -16 -143 -121 206 169 42 207 165 -57 116 163 169 -168 101 1 -150 45
7571 45 -93 72 23 85 46 38 114 37 -45 186 -90 35 -50 -163 97 264 142 -35 -353 -46 247 -21 -127
7594 -127 51 -72 -198 -94 -75 -42 160 -30 -44 45 203 98 78 -15 -174 67 -197 -75 -228 329 -19 -46
7616 -46 154 -149 -92 51 -123 -32 -38 105 139 12 -118 -41 -3 -99 -36 108 11 95 236 -226 -88 18 78 26 -14
7641a4j17KQ8N3m2L1p5L7Q7o6l0J36j11j56j4l9M02l38Q8J25j09J38J31p0j29
7666HN8j81M08j98j50m0J71n9j75J57j57K31j31L9j13K9o1K48k50K71j28j22Q9
7689e6J45j11J66m76K65K05O4k08o2K54k61L27k00O8k57K38l2o9j19L28k22K55
7711B42k72K32q1k82J8K98j24J02p0j23O3p4K67k08J04l8j86K42k31M3o9K31R9
7734A83j36k7j22k4l7M52l9k93N4J80n9J19l06K32k90J4K42p7J63l21K59l26K07
7757D8j71MN6j11J82k22L17j41J02M5K51l29p9Ol1m3JJ38J22l50J55K34L0J2j23
7782A03l14M22n2J73k81j63J54j04J24q0j7j85K06K04j66MN9l4l61L19Q1j00J12
7805A04k15P8%j1J21o3p1l37L83K2K28j63l5k20J87JP1m8r0J44P1m64K20j46Q7
$$ plain form
7641 -14 -131 -129 -41 12 -30 1 -74 -37 50 -16 -46 90 -21 -177 -191 -230 172 -166 -78 47 -62 76 207 137 8
7666 8 66 -115 293 95 -55 -95 76 17 -158 -1 -158 73 -58 -19 -132 -103 -164 84 -166 105 -23 -145 -56
7689 -56 89 -22 144 -332 -67 138 202 -6 -68 186 -75 252 52 120 -137 101 69 0 -119 209 -13 242
7711 242 -30 202 121 -161 -143 155 31 133 63 -60 3 -71 196 -12 92 54 -132 110 -121 -78 -147 84 183
7734 183 47 20 -102 -126 -163 289 250 -43 11 191 132 251 -55 177 -113 -99 143 66 229 -92 167 -159 48
7757 48 -123 -119 -63 -174 8 -214 103 -38 64 109 360 31 -48 -42 -73 -116 -115 23 145 -205 -50 184 214 226 103
7782 103 -211 211 159 332 51 -112 42 -62 62 -18 -35 -220 -14 190 24 28 87 53 -308 11 92 -8 104
7805 104 -111 -33 -33 -44 77 14 -57 -394 -11 11 239 76 41 -179 8 9 80 32 -58 86 157 -307 -87 -233 -146
7830a46K20j52MJ04q6N7q0Q7l4K46k36r5K85j56n9Ol5N4n4j50J32K16k48J67j49
7855a02K0o4m6J03K41j30N2j78J88q3k88L93j30K15j23j54K40j07o7J67j88N5
7877A4k8j70K08M3m6j44M00k17j15K48k42J56o3p3K4L8K59q1n2j3j12Qk16J47
7901b7pJ33K1k59J3J07J03j33J0Q1l43L51R2j35J49l52K83M3O2j64k34K3K53j75
7925a05j62J16K88J46k15j79J35J71k17J79k8j44K2R9J0j15k7R9j59n0Q8j78L41
7948A15m70N66l39J70j13j0OJ0J67J27j08k14l3rNJ96j85R5J42P4j59r6J79m3
7972G3q8J12J34k59pj44M1j7L21l10j4J70j63K5K9j11J61J55k73J98K8J7J42k57
7996c7J49j70J23J63l09J27o8K8J04q1J84K9r3K7j77r3M78m44p0L9M0j17K79j60
$$ plain form
7830 -146 74 -78 -74 30 -56 1 -79 8 -26 220 -16 -111 174 18 -41 -35 -70 -16 -70 -220 -88 128 -120 47 -102
7855 -102 -82 -146 -192 -89 152 22 74 -104 84 1 -287 106 -24 191 68 -86 154 47 -20 147 -41 14
7877 14 -14 -184 24 67 21 -123 277 60 -55 193 -49 107 44 -29 -5 33 292 211 159 146 34 42 -174 -27
7901 -27 -34 99 120 -139 -126 -19 84 -49 -39 42 -301 50 142 7 156 -196 87 130 192 28 -206 -183 70 -105
7925 -105 -267 -151 137 283 68 -111 24 195 -22 157 129 -15 7 106 116 1 -26 73 -86 -136 -48 -226 115
7948 115 -355 211 -128 42 -71 -81 -75 -65 102 229 121 -93 -126 -135 -130 66 -119 -24 118 192 33 -63 116 73
7972 73 -15 97 231 -28 -35 -179 -138 -155 166 -144 -158 12 -151 -126 -97 -208 -47 108 -165 33 61 78 220 -37
7996 -37 112 -58 65 228 -81 46 -22 6 110 29 213 242 149 176 -1 -94 384 -60 -130 -91 -51 -168 111 -49
8020d9K1r0K58j10N7%j22K80j42j40K17l35OK33M9k67L19j28l14Q6L8J47j9O8
8044F3J69k63R7n5K53l50P2L32l90P9q0j49L41l23R8J92n7Q0J2j69K9qn1J57N8
8069A37j64L49k22K12k56j22J89P1k09P1k60K95j86J98J5l95L81j03k7L4O6p8
8091dJ05M5j94J9Oj2J04mj30O8j23J66J50L7r1l56L88k59K24l66K00O5n2J5p3
8116g2O3K04j32l24L52P3j95k1j68L43l6k54J96r4J59j06J05m8j96L36Mj40j91
8139a42L50l46J02K8lK14k36L3N4N2p6M9loL6j37J02j24j10K07n7J02r2j59J37
8164b5K19k50p4%J68j68J45j11P8J12j69M0K12o0k49M4j57L75j68J35j50O5M1
8187E3j88k3J09J69
$$ plain form
8020 -49 -28 -118 140 30 87 87 -35 245 103 -37 180 -155 -149 84 133 -134 185 57 -257 -171 -133 14 -5 63
8044 63 232 -31 66 11 264 -86 -14 318 -72 7 -73 -222 119 -204 -106 86 29 109 121 -48 -19 -27 -78 79 137
8069 137 -27 322 100 312 56 -66 123 194 -15 56 -204 91 -95 103 118 -277 104 1 -26 8 74 -4
8091 -4 101 146 -48 -29 -23 -35 69 65 -65 3 -120 46 196 233 142 -214 174 -85 139 -227 -27 38 -14 1 -72
8116 -72 -9 195 63 -261 91 164 -31 -52 -220 123 87 -167 29 -65 94 -12 93 45 -151 185 189 49 -142
8139 -142 208 -138 -36 -8 -11 203 -33 0 54 106 30 79 76 70 106 -31 71 -53 -163 44 -13 89 -3 -162 -25
8164 -25 194 -56 -130 -130 38 -130 15 -96 -18 94 -75 -35 177 117 -132 -88 -245 130 -38 97 -53 12 53
8187 53 -135 -158 -49 120
8191A20
$$ Imaginary data points
##PAGE= N=2
##DATA TABLE= (X++(I..I)), XYDATA
0@%%%%%%%%%%%%%%%%%%%%%%%%JpJ4j6J6j6J6j6J7k1K8l2L3l6M1m7N2n8O5p1P7
45D0q5R4j02J13j26J39j53J68j87K08k29K55k84L17l58M08m69N47o51P93j004
66e66J348j990L573j2304j8965M4727m033k8294K2726J2835k7745L683K0039j3190
80A844q015J6326n497j2212J0818K290j2001N146N152o898j159N792k439n590
94f443M955M026o875N67P693o188m668J0790j78j0301P327Q248j2144r96J4113
109I926p267r218J3868o17j3478Q971N951j3844K773J0981j0073m666J0511l276
123E42q710Q396K118q862M517M883p803J369O602l740k305N414N90n107K196M935
139E035l950j867N247j434m578L258K239m692l15L792l133l642N393k50o915M615
$$ plain form
0 0 0 0 0 0 0 0 0 0 0 0 0 0 0 0 0 0 0 0 0 0 0 0 0 0 1 -6 8 -8 8 -8 8 -8 9 -12 16 -16 17 -19 22 -25 27 -31 34 -37 40
45 40 -45 49 -53 60 -66 73 -80 88 -99 109 -120 135 -149 168 -190 218 -251 296 -355 438 -566
66 -566 782 -1208 2365 -9939 -28904 15823 11790 -16504 6222 19057 -8688 -5005 15034 1844
80 1844 -6171 10155 4658 -7554 3264 5554 -6447 -1301 3851 -3047 -4206 1586 -853 -6443
94 -6443 -1488 2538 -4337 -3770 3923 -2265 -6933 3857 3679 -6622 705 8953 -3191 -4187 9926
109 9926 2659 -6559 7309 6692 -6786 2185 8136 -5708 -2935 8046 -2027 -6693 3818 542
123 542 -8168 228 2346 -6516 -1999 2884 -4919 -3550 3052 -688 -2993 2421 3011 -2096 100 5035
139 5035 1085 -782 4465 3031 -1547 1711 3950 -742 -1057 2735 -398 -4040 1353 1103 -5812 -1197
155a197L575p356J493O359n011k763P228j355m818N419K107o667K794N617o225
170h00r17P001l710l822N184M34m732J840K848m032j091L727j893l443L538M07
186E39m173J680K298k770p77L871n87l278K909K282l796J647L717l318q64M194
202C574j779k522L616M50m116J530K458l866q44M144l310k165M218j629l423L190
218d74P24l479J028K849j919j640L784n50k883L579J395l611J842K275k541k13
234A66K776j095k253K262N15l242R08K524l083j544L455j813k606K887J58k772
250b757J139K278k546j123M040j056k932L977K96l293K381K238k571k99L269q96
266B145k953L021O30l612J312K044l406l31K739k004j923K251L50l054J003K124
$$ plain form
155 -1197 2378 -4978 -3485 2874 -2137 -4900 2328 973 -3845 1574 3681 -2986 -192 5425 -800
170 -800 -1717 5284 1574 -2248 2936 3370 -1362 478 3326 -706 -1797 1930 37 -3406 132 539
186 539 -3634 -1954 344 -2426 -3203 668 81 -3197 -288 1994 -1802 -155 3562 244 -620 3574
202 3574 1795 -727 2889 3339 -777 753 3211 -655 -1499 2645 -665 -2830 1388 -241 -3664 -474
218 -474 250 -3229 -2201 648 -1271 -2911 873 323 -2560 1019 2414 -1197 645 2920 379 166
234 166 2942 1847 -406 1856 2371 -871 37 2561 -522 -2066 1389 -424 -3030 -143 15 -2757
250 -2757 -1618 660 -1886 -3009 1031 -25 -2957 1020 1316 -1977 404 2642 71 -228 3041 2145
266 2145 -808 2213 2843 -769 543 2587 -819 -1150 1589 -415 -2338 -87 263 -2791 -1788 336
282C36k366o29L204j327j660L194Q1k184J705J520j657n22K697q51k014K520J83
299B230k906J906J091k997L30K012j810j583J947l6k712J092J953k774p1L090
315G62k039j034K757j89k087J965J392j847O8K840j558j786L136m17k626J680
331A017J164k482M7J763j442j472J783j33k194J027J655k963K49K423j853q58
347b269K209J24j635J469J270j758k62L036j077j565K439l26j706J320P27j949
363D7K13J231j238j143J453K08k464J309P99k212K91J547j250p94J724j79j088
380a546J186R50j412N85J552j120k93J779p36m88J031M7j204M08O01q58r07J391
398I66o23j610J592l34j614Q59N34j289L21J014o82p67J313M68j464J120J205
$$ plain form
282 336 -2030 -2659 545 -782 -2442 752 833 -1351 354 1874 217 -305 2392 1541 -473 2047 2230
299 2230 -676 1230 2321 -676 -346 1666 -144 -1727 220 184 -2528 -1436 517 -2257 -2328 762
315 762 -1277 -2311 446 257 -1830 135 1527 -320 -252 2588 1030 -756 2380 1963 -663 1017
331 1017 2181 -301 -254 1509 67 -1405 378 245 -1949 -922 733 -2230 -1981 442 -1411 -2269
347 -2269 -60 64 -1571 -102 1168 -590 -852 2184 1107 -458 1981 1655 -51 1269 1996 47
363 47 260 1491 253 -890 563 771 -1693 -384 415 -1797 -1506 41 -1209 -2003 -279 -458 -1546
380 -1546 -360 590 -822 -237 1315 195 -98 1681 945 457 1488 1535 331 739 1340 482 -425 966
398 966 343 -1267 325 -9 -1623 -764 -230 -1519 -1198 -184 -866 -1633 -320 148 -1316 -196 1009
415A009j405J39J834r96m65J436k14j120Q97N36j294m05J343q37j188J233j80
432C23j766J066L59j305P7Q25m05o81J002K79j129J188P70j319P55J040q38j84
450E7J524n13p24P04L87j277K14J145j628j13J316j490o02R96l45p64K70L07r20
469a456L70J060r18o78J541r6q50J241M79j084P20R69l88r44J331R1j213M86R15
488A576j693J24J249j434n86J220o9j942P44J505k242j51J960j227j006K114j57
505a5j755J802R43j744P72J684j273p99J803j0j794J656L83j757N25J103j687
522a63m88R20j85j216O92N45j537K66J333j220n28J426j1j216O06J050n31l32
540e89J440l8j458J560M31j384O70R84j220k63J045p01j066J410j09j824R89P22
$$ plain form
415 1009 -396 -257 1577 581 116 1552 1338 218 1115 1651 357 -48 1295 458 -730 503 323
432 323 -1443 -377 -18 -1323 -1246 -421 -826 -1507 -505 -226 -1355 -167 603 -716 39 1079 241 57
450 57 1581 1068 344 1048 1435 158 372 1517 -111 -224 1092 -398 -1000 -4 -349 -1113 -843 -536 -1456
469 -1456 -1086 -26 -944 -1622 -81 -177 -1027 214 693 -391 329 1298 910 -34 1297 1388 175 661 1576
488 1576 -117 7 1256 -178 -764 456 387 -1555 -811 694 -1548 -1699 261 -966 -1972 142 -15
505 -15 -1770 32 975 -769 3 1687 414 -385 1418 1408 -386 1270 1653 -104 421 1524 -163
522 -163 -651 269 84 -1132 -440 105 -1432 -1166 167 -1053 -1581 -155 -166 -1382 -776 274 -257 -589
540 -589 851 813 -645 915 1346 -38 632 1616 396 133 1178 477 -589 821 712 -1112 -123 599
558E99j946M54J411j726j89J316m28q04J086K39r54N84R38r12OJ675j148q9J133
577A245r3r02O59K28p94l57J066m11j299O72M59j624L00P15j004o1R06k77r77
596a549J040Q18j092O1J468j244RJ773r15n35J337p5j043M30J161j324n08J238
614A050m33j070J054k03j639J077M60j206l77J043k94o95M53N49r33L05J270p49
632c38R3R72l45l49O67J39m54k8P18m71n66J344n97j247J276l94r48N65O5p15
652f13n9N56o53n40R54J29j104P50N69j187J115O18r13K45P98k04j35L53N14p73
672D20m7Q26r35k85R46o39q86Q77K93j292p5Q05p38n48R34j69q49P34N27j030
692a131L81J171m72m62Q25L33q63J042M10r27L07P79j134k59J014n26p11N44k9
$$ plain form
558 599 -1347 -893 518 -1208 -1397 -81 -509 -1313 -227 12 -942 -358 580 -332 -326 1349 201 112 1245
577 1245 1152 250 909 1137 343 -14 1052 641 -658 14 473 -1151 -851 -136 -1140 -1201 -295 -572 -1549
596 -1549 -509 309 -783 -722 746 -498 -489 1284 369 -166 1171 1096 53 483 1644 320 -188 1050
614 1050 617 -453 601 398 -1241 -164 296 -910 -1287 -244 -538 -1233 -780 -231 -1164 -859 411 -338
632 -338 -245 727 382 33 700 839 385 357 1075 604 38 1382 785 -462 814 420 -528 37 102 -613
652 -613 -672 -116 -769 -1309 -355 -226 -1330 -580 -11 -1198 -83 535 -378 -133 665 461 326 679 1193 420
672 420 373 1199 264 -21 925 286 -600 277 570 -722 -797 8 -730 -1278 -344 -513 -1362 -628 -101 -1131
692 -1131 -750 421 -51 -513 312 645 -218 824 1234 307 614 1393 259 0 1014 488 -223 321 292
711B92p53qL83m36o18O57j15o03P55R3o08N00K16j33k79J234j54n11N67M03q33
732D9K80R43q52j55O49l87o36P48N0j094J48O21j008K9O11o73n95R80l11m51Q48
753b06J50o10j85J262k92n64R57J41o74O37J83n17j34R65m09n71M11K73j160K01
773a42Q07j260j00R49q53o37Q04K85r38L35Q85q45K0P81j3r39J360O7q00N98P21
794A085n70j44O84m60m53M59K73r22J81P39j172j04J66k54j81J83J41n55L48L37
814b19p14J37J021l78l73L84K69k4K5N35l29j11P42k35p86J056m36m49K64K5o83
835b79J44L02m48k44K48L6n10M07K31p60K10O30o00J98P81n65q2M16L96n2k46
856B13N79j31n24P85l8o98N97l27n95K42K87l00m52K06l32k75LO92q25K33M44
$$ plain form
711 292 -461 -469 -86 -522 -1140 -483 -598 -1201 -446 -353 -961 -461 -245 -378 -657 577 423 -88 479 882 49
732 49 329 1272 420 265 914 527 -109 639 689 -405 -257 364 -644 -615 -4 -677 -1272 -292 -603 -1054 -206
753 -206 -56 -666 -851 411 119 -445 512 653 -21 616 799 282 148 1113 704 133 544 817 -343 -142
773 -142 665 -595 -695 254 -599 -1236 -432 -147 -1085 -750 135 -710 -690 91 78 -861 499 566 -234 364 1085
794 1085 515 371 1055 595 142 601 874 -48 133 872 -300 -404 -238 -492 -673 -490 -349 -904 -556 -219
814 -219 -933 -796 225 -153 -526 -142 127 103 128 663 334 223 965 730 -56 1000 564 115 379 404 -279
835 -279 -135 167 -281 -525 -277 -241 -751 -344 -113 -873 -663 -33 -633 -435 346 -219 -301 115 511 459 213
856 213 792 661 137 922 884 186 783 456 -139 103 390 90 -362 -156 -488 -763 -760 -68 -893 -660 -216
877b16n45n7P53j59j66Q09K8m04K98M40m52j16N30j64l53K45o4j51R2j76Lm41
899b66K58j82l72M87k97k35K01J25n28M48r6J65j4J33L52o9J07K27k85r2N50k78
921C39%M56l4m11J95o2l97j1L89o79j29J33j81m18L56p4m92L48M73m69K89N51
943A72n35p7O72J90l83N31J67m39J97L78n37O7J9l16R6r1m4j85j18N37o11MQ1
966b25j79j46O3O9k32k2L41L76n73N71L71o36N69K15n03Q4N29M4m65L16J67n74
988A60j4M62o87J20J88n87J07J8l83k53M66q5k80K53L81l67J41J21K43l8M30k73
1010A23j8M54j70k5J85J17j40k45J87Nj98j11R0m88p0J82j12l49K28l0j13m9L27
1033b20j34l70O84j00k28M48L85l57J50K52j56j03L91j41l19L21N9o35L56j28
$$ plain form
877 -216 -761 -818 -65 -224 -390 419 447 43 341 781 329 213 743 579 226 471 407 256 348 172 175 -266
899 -266 -8 -190 -562 -75 -372 -607 -406 -281 -809 -361 -457 -292 -306 -173 179 110 217 444 159 67 617 339
921 339 339 795 761 350 545 483 86 75 464 -215 -344 -211 -392 -810 -454 -528 -1020 -672 -199 -668 -379 172
943 172 -363 -440 232 422 39 570 737 298 495 873 336 403 422 106 202 111 67 -118 -236 301 -310 -306 -225
966 -225 -404 -550 -487 -418 -650 -672 -331 45 -528 43 414 -222 347 562 59 143 672 716 251 567 734 160
988 160 146 608 -79 41 229 -358 -251 -233 -616 -869 -403 -488 -768 -515 -134 -501 -360 -239 4 -34 396 123
1010 123 105 559 389 364 549 666 526 281 468 473 275 164 254 -234 -304 -122 -234 -583 -355 -385 -498 -547 -220
1033 -220 -354 -724 -40 -140 -368 80 465 108 258 510 354 251 642 501 182 503 562 -73 283 155
1053A55j90O9m2j95k30K82l01k13K42J0l1j37M23k46P2J84J40K60j10M52k81P5
1075C88m6J86k55L20p6j30o5J00j69m5j39q4k65M5R3n07J37M01o86K65O6n8J11
1098d13K31k73M15J82l0J56k93Q07m80M5J79L3n76O98o7o04J50j60J90o10L62
1119e8l12p1K90j48m28K37K30m35L91K52n4kK0M84n45L44J09j12j20M51j82MJ38
1142D83k50n1MJ75m26k9K73m21l12O06l03m32K72K04j41j79J9M51l98L68M1Q3
1164C7j13O24l60K92J98m54O2L21k08j33J28K31n53j13L70n65l25O06k00m60L68
1185b47ql29K12J69P0k12K74J76n53O00L89p81M51L72l23q2J29Q3k77K97K00n55
1207E5K8M78o68pJ49q1m76K24K57k28l44L81N9o92Q11J04n92M19J94k07L40M18
$$ plain form
1053 155 -35 34 -8 -203 -433 -151 -452 -665 -423 -413 -444 -581 -158 -404 -332 -148 -8 252 142 594 313 388
1075 388 342 528 273 593 517 387 322 422 253 208 69 -15 -280 -235 -142 -649 -512 -111 -797 -532 -466 -524 -413
1098 -413 -182 -455 -40 142 112 268 -25 782 302 347 526 559 -17 681 614 10 160 0 190 -420 -58
1119 -58 -370 -441 -151 -299 -727 -490 -260 -695 -304 -52 -106 -108 -88 396 -149 195 304 192 72 523 341 345 483
1142 483 233 182 186 361 -65 -94 179 -242 -554 52 -251 -683 -411 -207 -348 -527 -508 -57 -455 -87 -46 37
1164 37 -76 548 188 480 678 224 286 607 399 266 394 625 72 -41 329 -236 -561 45 -155 -615 -247
1185 -247 -255 -584 -372 -203 -133 -345 -71 105 -448 152 541 -240 211 583 260 178 307 390 113 410 610 55
1207 55 83 561 -107 -114 35 -46 -522 -298 -41 -269 -613 -232 -173 -865 -54 50 -542 -123 71 -136 204 622
1229F22l11oJ24J21l34J09P7j88o4M02m52r9J09n4l42J22O5p8l83K40j51j75L86
1252b60j64J08J56j48l4J92M26J07l68M26Qn32L91K71o12O0K18j29R1m8J1l99
1274b29j43L40l09j59J66j02j57M09j88m5K66O8l29K45L31j55k0L47J60m91M27
1295D32j33P7K7J24m35L37k97J88l09j51L04n04j9L80n44P8J40k1l1j33L12l35
1317e13n5N81M1j80M49j53n8J45K19k12L22k30Nj85J09k32kl26J35J36K1j19j63
1340b65p2Kj3Q7k3J20j72p5L53R3j59L34J5k45M72k16j48M8L57k41q2L74j97j50
1364A97q4J00l31Q9j1j37j6Nk40p3K45k41o0K68J71m40Q83k19l21L01K46j13K3
1387B42P7L1kK6j12J19k83K87k88j78J46q5j68JL3j62O4j05O6n2k46O53n47L14
$$ plain form
1229 622 311 305 429 550 216 325 402 214 150 552 100 1 110 56 -286 -164 -99 -177 -560 -320 -471 -646 -260
1252 -260 -424 -316 -160 -308 -342 -150 276 383 15 441 449 -83 308 579 -33 27 245 116 207 159 170 -229
1274 -229 -372 -32 -341 -500 -334 -436 -593 -184 -372 -417 -151 -83 -412 -167 164 9 -11 336 496 5 432
1295 432 299 376 403 527 92 429 132 320 11 -140 164 -340 -359 21 -523 -445 -305 -326 -357 -490 -178 -513
1317 -513 -568 13 54 -126 323 170 112 257 476 264 586 356 361 176 285 53 51 -275 -140 -4 17 -102 -265
1340 -265 -337 -335 -348 -261 -284 -164 -336 -411 -58 35 -124 210 225 -20 452 236 88 136 493 252 170 544 347 197
1364 197 113 213 -118 -29 -40 -177 -193 -188 -428 -501 -256 -497 -557 -289 -118 -558 325 106 -215 86 332 219 242
1387 242 319 350 348 374 262 381 98 385 97 -81 65 -20 -188 -187 -154 -316 -252 -357 -291 -343 -589 64 -483 -169
1411a69K18k32K6R9K90k47M7L69j52O7M9K9p7r7O4j05kj02n7j14q0J8k15L0k68
1436f11J17P5L42k51r3mN8J79K81j06K49j10J37J09j42R0j74J17J73j43j43K18
1458C68k45k5R0k11j07j58K73n26J19J37k54J14J82Qk9O8J75R6k50M23j90J13
1480A71K96j36k90K26J14k25O1K04j29k59J25n2j01k47K44j70j76M27o25L55j03
1501b90Q3R2k61L02K03j84j06J67J03Q1Q6J34k75M4L35j87k76K04KJ5l1k46j80
1524a85l3k6J82j23k62J54J05j07J94l78K66P5J12P9p2pM18o9j38J68l56J27L83
1547E07k13k44K59l38K09j97r0R3j93j54J38j35J64j23r0K21k53K56j25K68q1
1568a21j80J19M63l54K04K41k64q4L54j3o3p6L28n02O0Q3n0p3k57P7n1l63K97
$$ plain form
1411 -169 49 -183 -157 -58 232 -15 32 401 249 316 365 394 317 220 284 179 177 75 18 -96 -176 -158 -373 -343 -611
1436 -611 -494 -419 -77 -328 -421 -425 -367 -188 93 -13 236 126 263 372 230 320 146 263 436 293 150 368
1458 368 123 98 188 -23 -130 -288 -15 -541 -422 -285 -539 -425 -243 -235 -264 -196 -21 75 -175 248 58 171
1480 171 467 331 41 267 381 156 217 421 292 33 158 106 5 -242 2 -168 -344 83 -542 -187 -290
1501 -290 -207 -115 -376 -74 129 -55 -161 6 109 190 276 410 135 179 514 327 51 255 257 272 241 -5 -185
1524 -185 -218 -244 -62 -185 -447 -293 -188 -295 -101 -479 -213 -138 -26 53 -19 -26 392 323 185 353 -3 124 507
1547 507 294 50 309 -29 180 -17 -107 -14 -207 -361 -223 -358 -194 -317 -407 -186 -439 -183 -308 -40 -121
1568 -121 -301 -182 281 -73 131 372 108 24 378 365 302 226 554 52 112 195 145 72 -185 -108 -159 -522 -225
1591b25j9j33J85n8l89M74k18L13J67K2j97K24l35L77K29l18K95k00K22j49j64
1612A03K56J18n43N5qk06ll2J22j19r5K20j07k22L03j57O1L20r0j61K09L85l27
1635H2n2N48k09r1l3J36j26L1K05l38l88M56j62j52K5k28J44l21N92k95j99M65
1657I0m27r4K03L12k86K47J05k5j57L24j7j02J34l4J84m15K29q8L8R4n3k87j23
1680a48K13l88k75M92j06l26K53j85J06J7j42L12m0P2J58j15M5K24j39J93J18
1701C39q5K3n2J80l6l20J04j55j17J43Lk57K11j34j53L1J12Qm4m8J02r3L14j85
1725a09J07K60j14M5J38j51M1nm1K21k46p3K62k32J3K56n44o4K15o1j19N0p0k4
1749b45M1L9j46R7%K7J61m0J27j24J96K96l05J42M1m3l9L3Mj84m0J65k84p5o5
$$ plain form
1591 -225 -244 -377 -192 -250 -639 -165 -383 -70 97 119 -78 146 -189 188 417 99 394 194 416 267 103
1612 103 359 477 -66 -11 -19 -225 -228 -260 -138 -257 -352 -132 -239 -461 -158 -315 -254 66 -24 -185 24 409 82
1635 82 30 578 369 278 245 381 255 286 491 153 -235 221 59 -93 -68 -296 -152 -473 119 -176 -375 90
1657 90 -337 -431 -228 84 -202 45 150 125 -32 292 275 173 307 273 457 42 271 183 221 315 262 -25 -148
1680 -148 65 -323 -598 -106 -212 -538 -285 -470 -364 -347 -489 -177 -217 -145 13 -102 -57 167 28 221 339
1701 339 254 277 225 405 369 49 153 -2 -119 24 27 -230 -19 -153 -306 -275 -163 -155 -199 -247 -145 -238 76 -109
1725 -109 -2 258 144 189 327 176 217 212 171 392 146 73 335 103 116 372 -172 -236 -21 -82 -201 -151 -221 -245
1749 -245 -204 -165 -311 -214 -214 -187 -26 -66 61 -63 133 429 124 266 307 264 225 258 262 78 38 203 -81 -156 -221
1774b21j39J12j61L38Q4j31N8k72J61L8j21J75j26J65L45O5p4j30K06j91L15l47
1796A49J31N3k28J46j02k7J00k78K0j31J41q1J31j61m5j81K62j38o2J14N2l0r8
1819b63L62J98n2m6O2j74J40m0k86K48K06m24n3L17k97l2p1J04P4P0r1j91R0j21
1843b70J34k70nL53k4j69L23L24k78j18L40k64R0r2o1L3L65l57L56l17J49j36
1865A06k02M7j5j94J78m6j8l01L75l6j15m0K71j35o4N32l09p1K86p5J05J8k19
1888G8K53m0Qk04N0Q9j31k48K35k92J67p6k4K18j66l82Q3K45l53M60j83N3Q4M5
1912c1P6J61j73K93K16j71J5k43N2J58j41j6o8j84K77k12m8J29l18j3mP8J9j88
1936c36L84k65j27K84N9R0j52J55l81M72l94O39l98J43J24m29K26L81q0r3J88
$$ plain form
1774 -221 -360 -248 -409 -71 13 -118 -60 -332 -171 -133 -254 -79 -205 -40 305 370 296 166 372 181 496 149
1796 149 280 333 105 251 149 122 222 -56 -36 -167 -26 -107 24 -137 -182 -363 -101 -239 -301 -187 -135 -165 -263
1819 -263 99 297 245 199 261 87 227 187 -99 149 355 -69 -122 195 -102 -134 -205 -101 -27 43 -48 -239 -149 -270
1843 -270 -136 -406 -411 -58 -82 -251 72 396 118 0 340 76 166 74 13 46 411 54 410 93 242 106
1865 106 -96 -49 -64 -258 -80 -126 -144 -445 -70 -106 -221 -261 10 -125 -189 343 34 -37 249 174 279 297 78
1888 78 331 291 299 95 145 234 103 -145 90 -202 -35 -111 -135 83 -83 -465 -382 -137 -490 -30 -213 -160 -76 -31
1912 -31 45 206 33 326 542 371 386 143 195 353 212 196 128 -56 221 9 -39 90 -228 -241 -245 -167 -148 -336
1936 -336 48 -217 -344 -60 -1 89 -63 92 -289 183 -211 428 30 173 297 -132 94 475 395 302 490
1957D90l53K8q7r4N7R5k86q8pj12M55l67P7J00j30J10J26M2j24Q3LQ6q2J96K5
1982B43j55p9J60O9j53m82M48J13j39k33J25R4j79M4p9P7j08J25j75nL28j35J20
2005B4P9O1r4K21j52J50q1j9K51j06K89n84K02k39K08j61J1o0j15O0k54L15k61
2028b55kq2K08N3k75L20j6n4j2J01Q3N7J5P8J93l38J92n9j69j58L46j0j94L4k8
2053B8J42Kl06N6k65L48m71l2N43k05r0J55R7k36K31j47K26M4M3k0k40L51J67
2076D21k12j98N37m32O4m7O2r0l8j02q6k35K02j03J24J18k12n3o4K53M1o0J32
2099B2K94l66l30M91j2o5L9J85j29J23rk61J15Q0j96J30q4L7l52NK82j73J4r2
2123b52oN5P3l0J03k57M07J73k78J62o0J48r6N4Q3j32k8P6o2N8j05l5j42J85j81
$$ plain form
1957 490 137 165 78 -16 41 136 -150 -238 -245 -357 98 -269 -192 -92 -222 -112 14 56 -68 15 18 104 22 218 243
1982 243 88 9 169 238 85 -397 51 164 25 -208 -83 11 -168 -124 -203 -126 -234 -109 -284 -289 39 -96 24
2005 24 103 164 70 291 139 289 208 189 440 334 623 39 241 2 210 49 60 0 -115 -55 -309 6 -255
2028 -255 -257 -339 -131 -78 -353 -33 -49 -103 -115 -14 69 126 141 219 412 74 266 207 38 -120 226 216 22 56 28
2053 28 170 172 -134 -78 -343 5 -466 -498 45 -160 -250 -95 2 -234 -3 -150 76 120 163 143 -97 254 421
2076 421 209 11 548 116 180 133 195 105 67 -35 -121 -356 -154 -257 -133 -15 -227 -280 -344 -91 -50 -110 22
2099 22 316 -50 -380 111 99 34 73 258 129 252 243 -18 97 177 -19 111 27 64 -288 -283 -1 -174 -160 -252
2123 -252 -258 -203 -130 -160 -57 -314 93 266 -12 150 90 238 142 196 279 147 119 195 133 191 86 51 -91 94 -87
2148h7K62l84O2J36p9q5j37K88l90K87k1J66k95L46Q7K6j25J27m9L4oJ65P9j28
2172B79k18l22L35J35k75J37K64m29m1L8J78j20k04Q7J21k66N0K12j07J07p5J28
2194A4k98M49j58P1P3M1n0J74l53K36r6o4o7J10R6k21N0j02K00j05k16P7M8J09
2218A8j23j5J46k19J72J85M8r3M2j83K93l2j91J29J29k10K04r0l4n7j40PR9r8
2242a3j29k17K16R5j12L4j09J26j71J11J48l3J29N3p3J87o3j22J08o0O6k98R4
2265c3L23l06K01j59j9j20K02kj92O2R0m32J00K71k49J96k70M28n5j23k4O4m2
2288h9J90k0k05K78K00l00L01Qk70J04L5J23n33K62L0j26P8J14k44J23l20k2M8
2311b35M7L8K3q9J48k54L29j9J29j5o3O9k0J76j45k67J61L31k19nr9L62l48m1
$$ plain form
2148 -87 175 -209 -147 -11 -90 -175 -312 -24 -414 -127 -148 18 -277 69 156 182 57 184 135 169 163 328 407 279
2172 279 61 -261 74 209 -66 71 335 -94 -135 -97 81 -39 -243 -156 -35 -301 -251 -39 -146 -39 -114 14
2194 14 -284 165 7 78 151 192 142 316 -37 199 103 39 -28 82 178 -43 7 -95 105 0 -216 -139 -91 18
2218 18 -105 -120 26 -193 -21 164 212 119 161 -22 271 239 48 177 306 96 300 210 176 119 -21 -14 85 -13
2242 -13 -142 -359 -143 -48 -160 -126 -235 -109 -280 -169 -21 -54 75 128 55 242 179 57 165 105 171 -127 -33
2265 -33 290 -16 185 26 7 -113 89 87 -105 -43 47 -385 -285 -14 -263 -67 -337 91 36 -87 -111 -47 -89
2288 -89 101 81 -124 154 354 54 355 363 93 197 232 355 -178 84 114 -12 66 180 -64 59 -261 -283 -235
2311 -235 -188 -150 -127 -216 -68 -322 7 -12 117 102 39 108 88 264 119 -148 13 344 125 120 21 383 35 -6
2335fJ6m16L33Q3m9l04K72L64o16J38J21q1o3K13J09k24L41j08k44J41L83k18
2357A85O5o2j47q7M3R8l5j91m4K03o7j32J07l5o5K09l25Q0M2J80L6n9L31m82J60
2382HO5j03K84kj83j7J33r6P1Qjl97L77p8j27j03L59j91k05K7rJ1k19K87m2N2
2408i1J06k26J88J7L76m38l9j07M81j06k9L3Q7j46K36j81j58j22M4J63O3J25k93
2431a7k1j06l1j4j12l8K42l8PL40j89k13J14L1N7l09M56j7On6R9l0OO0q4j88J26
2458H1j03k27K75m4r1N4P7l49PN8J00J63j46L38k26k72l0M51m3j97K38L73l33
2481A54l5Q9k71n4M29k9o16L64J80J7m70J11N0m4Q6l35M20j02j63M1K37k08k8
2504a77O6L6J97k8K48k41j60L84j83j00L79l31n6L16j78k37J95j72R3p7j05J13
$$ plain form
2335 -6 10 -406 -73 10 -39 -343 -71 293 -323 -185 -64 -145 -208 5 114 -110 231 123 -121 20 403 185
2357 185 250 188 41 -46 -3 95 60 -131 -175 28 -39 -171 -64 -99 -164 45 -280 -200 -158 22 58 -1 330 -152 8
2382 8 73 -30 254 252 69 52 185 89 160 168 167 -230 147 69 -58 -161 198 7 -198 -171 -180 -169 -388 -101 -143 -91
2408 -91 15 -211 -23 -6 370 -68 -107 -214 267 161 132 165 252 106 342 161 3 -119 -75 88 151 276 -17
2431 -17 -38 -144 -175 -189 -301 -339 -97 -135 -128 212 23 -190 -76 -45 12 -297 159 142 148 92 191 161 167 227 143 -45 81
2458 81 -22 -249 26 -18 -109 -55 22 -327 -320 -262 -162 1 -145 193 -33 -305 -335 116 73 -124 114 487 154
2481 154 119 208 -63 -117 312 283 -333 31 211 228 -242 -131 -81 -125 -39 -374 46 -56 -219 -178 59 -149 -177
2504 -177 -111 -75 122 94 342 101 -59 325 142 42 421 90 34 350 172 -65 130 -42 51 -26 -131 -18
2526a8l53M67k89K35k82J09Q4j80J88N6p5L14k44LJ06j22K1R4J54l30rJ04K4N8
2550A15r7M5k14J69Pj27n0J51J3o8q6J00j87J58k71K61K30k24Q3L1J48m1o9J91
2574B68j09l25L49j74J18R9k0P8l31J73k05N4j6j35j04J21k16L28j80P3J07j99
2596b46L68l25K71k66K14J62j5K76k41n5j62L79l79j38K34P8l72N1o4mK06R5k33
2619a66n7J1K4J33j20r8K8K76l03M61l32K06M4r0j10K27k49L52j52R5o9k25K90
2642A76k8p0j09j41J15J60L9l23R4j81K81R5l67O5P2J01m7J10J62j11Lj7Kj39
2666e8K77q3J42j69n2Pj94K89N1o3j20k9Q8p7KJ66n0k78j98J67O0J8K99k91K59
2691A63j85K77k08j54L85P7m43J31K37j97J12j74P2j15O0mj89O2j38J82m2j11
$$ plain form
2526 -18 -371 96 -193 42 -240 -131 -47 -227 -39 17 -58 256 12 15 121 -1 20 114 268 -62 -71 33 57 115
2550 115 18 63 -151 18 25 -102 -152 -1 12 -56 -142 -42 -229 -71 -342 -81 149 -75 8 39 187 146 77 268
2574 268 159 -166 183 9 127 226 206 284 -47 126 -79 -25 -41 -176 -280 -159 -375 -47 -227 -154 -47 -246
2596 -246 122 -203 68 -198 16 178 163 439 198 143 -19 360 -19 -157 77 155 -217 -166 -230 -234 -28 67 -166
2619 -166 -223 -212 -188 -55 -175 -273 -245 31 -272 189 -143 63 107 17 -93 134 -115 237 85 180 111 -114 176
2642 176 148 78 -31 -172 -57 103 142 -181 -87 -268 13 108 -259 -194 -122 -21 -68 42 204 93 96 79 81 -58
2666 -58 219 136 278 109 57 64 -130 159 210 147 27 -2 86 9 11 177 127 -151 -349 -182 -122 -104 195 -96 163
2691 163 -22 255 47 -107 278 355 -88 43 280 83 195 21 93 -22 38 34 -155 -93 -231 -49 -91 -202
2713b02m8J11L9n0J31j14J65k91O7K23j91L44k52K45l4k16K53j10O9m1J48l17
2735g1J7J35J65r8j79J46q5J32n7j14p2p2K08j56J40k06QL9k9J86q4J61k3J12
2759B03lj99n2K93k19J09k7j30q4K04n5j12J60k16P4K8l3O5K06l44L3J44k80P2
2783a63J34J73k35J92q6k7J1p6L20N0o2j4QN4m50L65J17k49o8q6J37l4j24k17
2807c30J3J96j39K83Q4j19j51L0N6n7K19j68pL15k51J13Q4J2l3k5J17l69L78m0
2831B11l01j12M01j01K0o8r4k92L58l90L76J22k80J13O4r2J08j57O3K94j75k53
2853a85K85M6n0r0%M5o8J23o4k3L9q0q9P3k07L22k10K0k22R4J65k5P3J16n6j6
2879A6PJ01q5J20j35L8o4J00p7J22J4Q6j02j03j45K62o6J5R5l90K28p6L9n2j55
$$ plain form
2713 -202 -250 -139 -100 -150 -19 -133 32 -259 -192 31 -160 184 -68 177 143 -73 180 70 139 98 246 -71
2735 -71 -54 81 246 148 -31 115 30 162 105 -9 -81 -153 55 -101 39 -167 -159 -120 -149 37 -47 114 91 203
2759 203 200 1 -51 242 23 132 105 -25 -109 95 40 -72 88 -128 -54 -26 -59 6 212 -132 -99 45 -235 -163
2783 -163 -29 144 -91 101 15 -12 -1 -77 243 293 231 217 225 279 -171 194 311 62 -6 -92 45 11 -113 -330
2807 -330 -317 -121 -260 23 107 -12 -163 -133 -77 -134 85 -83 -90 225 -26 87 171 183 150 125 242 -127 251 211
2831 211 -90 -202 199 98 118 50 -44 -336 22 -368 8 130 -150 -37 27 -65 43 -114 -51 243 68 -185
2853 -185 100 146 96 6 6 51 -17 106 42 19 58 -22 -111 -38 -245 77 -133 -113 -335 -241 -76 -101 -28 88 32 16
2879 16 23 124 39 159 24 62 -2 98 21 143 157 243 141 38 -107 155 89 104 199 -191 37 -39 0 -52 -207
2904b07k0R3k4N6J12j7j33Q9J87k6k7J49j63J23mj46J01O2p2mj61J55k81J07j66
2929b17J42j14n5O2P8M2l64L10r8L38j88j63K78K22j51j21K83k34K85j45j5q1
2951I4L8K0J2j80KK77l25n3k6K83q5Q9j04k82L34k10J91j70l01K65J0n3J37J00
2975F3l2O9J63j62l1Q5o0J06n7k11J27m8K13l23L29k76o9k08K29j02L17l2j31
2998d1j63K56%k03J75n8k3NJ60q9K59k02Q6k35J37j98J44q4J05N9p2k11L47k05
3022e1j63J71N3m1O7m8k23J97j65P9j26Q6j73L37j10P0n6K15J70k46J10L1O9l00
3046d7%K27m4K0j15k0q6J91j41%j13P2N3M7k76L48J07k64k95M56nj04n1J51j56
3071d5l7j0L89k44p6N6k12L58m5K19l96K58k22k36J94J0R7Rj76k13K28qJ22j5
$$ plain form
2904 -207 -227 -134 -158 -102 10 -7 -140 -51 136 110 83 232 69 192 188 42 143 205 133 129 -32 123 -158 -51 -217
2929 -217 -75 -189 -244 -182 -104 -62 -426 -116 -214 124 -64 -227 51 273 122 1 284 50 335 190 175 94
2951 94 132 152 164 -16 -14 263 -62 -115 -141 142 57 146 42 -240 94 -116 75 -95 -396 -131 -121 -174 -37 63
2975 63 31 100 263 101 70 155 95 201 144 -67 60 12 225 -98 231 -45 -114 -322 -93 -195 122 90 -41
2998 -41 -204 52 52 -151 24 -34 -57 -52 108 19 278 76 162 -73 64 -134 10 -74 31 90 18 -193 154 -51
3022 -51 -214 -43 10 -31 36 -12 -235 -38 -203 -124 -250 -164 -337 0 -110 -40 -96 119 289 43 153 184 253 -47
3046 -47 -47 180 136 156 41 21 -65 126 -15 -15 -128 -56 -3 44 -232 116 223 -41 -336 120 115 11 -40 111 -45
3071 -45 -82 -92 297 53 -23 33 -179 179 134 353 -43 215 -7 -243 -49 -39 58 67 -109 -322 -94 -102 20 5
3095Ej13j76P1J14L28j34k07M8O3J21p3J67l50L80l01J37Kj01N7j35p9K97k91
3118a70J55o4j19k2R5m2qK04J46k8k6j89K95j90k36K43J09rr0J42j82J25l03K41
3142G7K01l22j6J16R5n7m7j48j61P1J10J23l57K24j91J20K77k80J80o6J92k4M0
3165A57m6j72K23R2k84j3K28r5jk20K0Q7k38M10J76k21j83Q4o0J34j58J41j29
3188f8J27p7J45j31Pj33K17n0J91k5L48l72j14P7LK9o4k9L4J1l42K19l2K03l74
3213b00Q2n8P4M9k8j87L14P5k5m6k11O1J64k07L34j91j35K26K3R4M0j55J01l23
3237a29L07J3l83K96l5n5q0J74k90J70j22q2J10J71J68n15K68j12K03j1k1q1M1
3260Em7K24j98L9K9K49k05k42J01J1j94J60J83k79M8Q5Q6k39K23j37n0M2j7m2
$$ plain form
3095 5 -108 -284 -213 -99 229 95 -112 -64 -1 120 47 214 -136 244 -57 80 82 -19 38 -97 -176 121 -170
3118 -170 -15 -79 -198 -220 -125 -167 -175 29 175 147 121 -68 227 37 -199 44 153 144 54 196 14 139 -164 77
3142 77 278 -44 -60 56 151 94 47 -101 -262 -191 -81 42 -315 -91 -282 -162 115 -165 15 -51 141 117 157
3165 157 111 -61 162 254 -30 -43 185 90 89 -131 -111 -24 -262 148 324 103 -80 4 -56 78 -80 61 -68
3188 -68 59 -18 127 -4 3 -130 87 37 228 203 551 179 65 142 145 174 110 81 115 126 -216 3 -29 174 -200
3213 -200 -118 -176 -102 -53 -81 -268 46 121 96 50 -161 -100 64 -143 191 0 -135 91 114 208 248 93 194 -129
3237 -129 178 191 -192 104 69 14 -66 108 -182 -12 -134 -216 -106 65 233 -282 -14 -126 77 66 45 -36 5
3260 5 -42 182 -16 23 52 301 96 -146 -45 -34 -228 -68 115 -164 -116 -31 55 -184 39 -98 -148 -106 -123 -165
3284a65N4P7r4P8j7KM7J4J45k22J35o8J66O6j6j91J17j78o6O6L84n35J09J58j07
3309d1k18K89K7M2m07J53K11j55o2J36J96j27j45J50K5O8Q2l2k32L46m77J89J93
3332B11m3o8pq6j7qJ97J7k01j50K42j72j73K36k8L6q2J64p9K03q6J08n5j00L6
3357I5K69l01o0K42k27j29K09R1k60K12k53l4l2K00O5m9j25O1k9j3m5N5K06k68
3381a20p5M11l03J89j23r7J42J09m32K93j73K45J62j3p8k90J94K4j98M09k51j67
3403a42R9n9O1J34J7q0J09j59J00k14J36J43j94k19L35J55j89J28P5k21j28K52
3425A39k89K24j27K11j57M3j10RJ36k4k46L10j41j49r2J71J38J76j21l5j59J97
3447A04m2m8m2n0J54J46j18N3k69K21R3j28n0j8n9M8N4j60J51l9Po6K04j53J05
$$ plain form
3284 -165 -111 -34 -128 -50 -67 -65 -18 -4 141 -81 54 -14 152 218 202 11 128 -50 -116 -50 334 -201 -92 66 -41
3309 -41 -259 30 57 99 -308 -155 56 -99 -161 -25 171 44 -101 49 74 142 224 192 -40 306 -171 18 211
3332 211 168 100 93 7 -10 -18 179 196 -5 -155 87 -85 -258 -22 -50 -14 -96 68 -11 192 106 214 159 59 95
3357 95 364 63 3 245 18 -111 98 189 -71 141 -112 -146 -178 22 87 38 -87 -26 -55 -68 -113 -58 148 -120
3381 -120 -195 216 -87 102 -21 -118 24 133 -299 -6 -179 66 228 215 137 -153 41 65 -133 276 25 -142
3403 -142 -43 -102 -41 93 110 30 139 -20 80 -134 2 145 -49 -268 67 222 33 161 236 15 -113 139
3425 139 -150 74 -53 158 1 44 -66 -57 79 55 -191 119 -22 -171 -263 -92 46 222 101 66 -93 104
3447 104 62 14 -28 -78 76 222 104 157 -112 109 202 74 24 6 -53 -5 49 -111 40 1 8 -58 146 -7 98
3472I8j67j1M5J78k09k9r8K31k7k06M16j79M5j37L3L0N1K90k47l08J52o9N0l4
3496a02M39l19j6j73P4J17k68K80m40L43L07p3o3n6L5j24K27j87K20j52k32K26
3518F3j60L71k42k84M0J93o6qm0k03J10K12K33o0n2J24j06j48j3m4K04j1n63N98
3542A48q3j1J10q1m7k09J96K0J07j74L05k13l14J31K22l47R1J44r1q1M5j29L21
3565F0J24j85q5j48J91J22q8K38l80K78n7J57l88J08P5Q3k64qO7K81l25K54k26
3588a16P4K07k67J4K9k9lm%j1k3oM65j70J4K39k33k42J87j62L21l28J72k17K6
3613f3l7P7j7R5J58m81L96k00N4j07K74k04K00j55J02j09r3J83o1MM9L8k9q6j16
3638a28K66J33j38j1j61K6J67k31N3N2P0j71L1N3P0l61L23q7K8K20j95n2j23K1
$$ plain form
3472 98 -69 -80 -35 143 -66 -95 -193 38 11 -195 221 42 87 -50 -17 13 64 354 107 -201 -49 -118 -68 -102
3496 -102 337 18 2 -171 -97 20 -248 32 -408 -65 242 169 106 50 85 -39 188 1 221 69 -163 63
3518 63 -97 274 32 -252 -212 -19 -85 -93 -133 -336 -226 -14 219 159 107 231 125 -23 -36 -80 124 113 -450 148
3542 148 65 54 164 83 36 -173 23 43 150 -24 281 68 -246 -115 107 -240 -149 -5 -96 -177 -132 -261 60
3565 60 184 -1 -86 -234 -43 79 -9 229 -151 127 70 227 -161 -53 22 105 -159 -167 -100 181 -144 110 -116
3588 -116 -42 165 -102 -88 -59 -88 -91 -95 -95 -106 -129 -135 330 160 174 413 180 -62 125 -37 284 -44 128 -89 -63
3613 -63 -100 -23 -40 55 213 -268 128 -72 -18 -125 149 -55 145 -10 92 -17 -110 73 12 16 65 103 74 -12 -128
3638 -128 138 271 133 122 -39 -13 154 -77 -24 28 98 -73 -42 11 81 -280 43 -44 -16 204 9 -43 -166 -145
3662a45l3J46OK19j50K0nj35O5O3P3Kj8J71k46l5n1q4M9K26j75K9q7RK64k63k9
3689a14J78j25L3k30K67mJ31j4j3j15po6n1L9J9j01L33p2l73L03j44J75k35rO8
3714a27J04O1q8Q1l11L05k9m9o3J42j53J79j65l3J56q3J17k27K27N8K10k51N6
3737A17J04k02k7j0K1q0o7P6J62r0n8J03Q8l72K32l4M4J67k89O1J69m06J36L85
3761B30k54J25J04oj24k1J0N3p7r5M9j5j80K32J71l98MJ30j18J64r6K48l63Q6
3785a41LQ8K32l13l1K27J56k4m16J78K04k14k19J68K10k14l0J62J43o8j23P8j30
3808g4L33l79L4J03q3L56k80k62J31R7k4J1Q2k02P0J34o5K54j77q7P4j4O1l82
3832b89K19M6o5K35Q5m31J22J9j35J63K5J99j41j42J47k0N2m1j03j8P2J30j76
$$ plain form
3662 -145 -178 -32 -26 193 43 63 58 -77 -12 51 124 126 108 279 33 -2 -53 -137 -88 138 -37 -8 -95 -86 178 -85 -114
3689 -114 64 -61 -28 -258 9 5 136 122 109 -6 -13 -79 -130 -91 -72 -173 160 88 -285 18 -126 49 -186 -195 -127
3714 -127 -23 38 -50 31 -280 25 -4 -53 -116 26 -127 52 -113 -146 10 -73 44 -183 44 102 312 61 117
3737 117 221 19 -8 -18 3 -77 -144 -68 94 4 -54 49 137 -235 -3 -37 7 174 -115 -54 115 -291 -155 230
3761 230 -24 101 205 199 75 54 64 117 40 -55 -6 -21 -201 31 202 -196 -192 -62 -180 -16 -112 136 -227 -141
3785 -141 -138 -50 182 -131 -162 65 221 197 -219 -41 163 -51 -270 -102 108 -106 -136 26 169 101 -22 56 -74
3808 -74 259 -120 -86 17 -66 290 10 -252 -121 -24 -48 -37 45 -157 -87 47 -18 236 59 -28 46 32 93 -289
3832 -289 -70 -24 -89 146 231 -200 -78 -59 -194 -31 -6 193 52 -90 57 37 89 48 -55 -73 -1 129 -47
3855d7K59j49O8j61J03L3N8J08r3l63K81K11n35N5J21J4q6K47l24J04K66j98n7
3878h5K51o8j7j2j98K89O8j57NL2Lrl39J71j13M9K27k35J70j01J25j0m3j32K1
3903a08J68j24J40j13k5R0r4K04j98J53k47R7J77k42k4L78l13J26j70K78j56R0
3925H7O1j92O2J74o3k98J4O3J33J7J40j40j66J73j75K55j86r2K34k5Jm3p1o4P8
3950b3oJ83k10K09l08O2R5q9J52J75m21J23J87n70P4K63k4P5J3l5M6j1K14j42
3974C2O1j52J84j14j6m5N2q7J79J5k33L43k77k8Qj8j07P0K84q7K1Q5l28K88j23
3999Gr9J41o5QP1j38J04N2o8O9j32O6J02m8J77j54K44l03R6n6j34J98j5J3k85
4024a49J28L2M1J34j54j05p6L7J61kp2R0j36N4j80M72k22J15r2J5j34m2K67r5
$$ plain form
3855 -47 212 63 131 -30 73 106 164 272 179 -184 97 308 -227 -172 -51 -37 -123 124 -200 -96 170 -28 -85
3878 -85 166 98 81 69 -129 160 228 71 76 108 111 102 -237 -66 -179 -130 97 -138 32 -69 56 46 3 -129 -108
3903 -108 60 -64 76 -37 -62 28 -66 138 -60 93 -154 -57 120 -122 -146 232 -81 45 -125 153 -3 87
3925 87 148 -44 18 192 129 -169 -155 -92 41 58 198 58 -108 65 -110 145 -41 -133 101 76 77 34 -37 -101 -23
3950 -23 -29 154 -56 153 -155 -93 2 -87 65 240 -181 -58 129 -441 -367 -104 -128 -53 -40 -75 -29 -40 174 32
3974 32 93 -59 125 11 -5 -50 2 -85 94 109 -124 219 -58 -86 -78 -96 -203 -133 151 64 85 170 -158 130 7
3999 7 -92 49 -16 -8 63 -75 29 81 13 82 -50 16 118 70 247 93 337 34 130 74 -60 138 123 136 -149
4024 -149 -21 11 52 186 32 -73 -149 -112 49 47 -25 65 -71 -17 -197 275 53 168 76 91 -43 -85 182 87
4048H7j47J01o1O2l4m1j04n3K13j49R0L8J04o8Nk54L72j33j30K77l18o1M09j17
4072H8kj73N2%N7K19j08j00J9k0L6M7J2k06J69k41J98l27L45j16P0k0J26K7k30
4097g8R2rm3N5o9J60L9k25M3R8q2J27j30Kj38L14k09K3j7P9j57j0M40m06J91l00
4123b10N8n3L50l45L32j11q2K08k64K17l7j66K24j9j17M5k06M21k32mQ5j21J3
4146a4J30j53j22J62J58m31J64J10Ok7M3J33k59L27o1j30k6k89J03M11j92j25
4168h2rn3L04Nk82O1L29k80K34j20O2k82K0j72K36k90J44K28l1Ll2j97K23j2N9
4193F6k52J47L58m06N1j4K25j56q5J25K01P0k30l9j63K08q8j27P6O2j2j87M0q3
4217b13K67J4q2n9J16Nk35K26n4Q0J9q1K23j9j02j36n8L22k45J14J1j67J14j85
$$ plain form
4048 87 -60 41 -20 42 8 -33 -137 -190 23 -126 -36 2 106 38 43 -211 161 28 -102 175 -143 -204 205 88
4072 88 86 -87 -35 -35 22 241 133 33 52 32 68 115 127 -79 90 -151 47 -280 65 -51 19 -1 125 152 -78
4097 -78 14 5 -38 17 -52 108 147 -78 -35 63 -19 108 -22 -20 -158 156 -53 -30 -47 32 -125 -135 305 -101 90 -210
4123 -210 -152 -205 145 -200 132 21 -61 147 -117 100 63 -103 121 102 -15 30 -176 245 13 9 94 -27 -14
4146 -14 116 -37 -159 3 161 -270 -106 4 10 -17 26 159 -100 227 166 36 10 -279 -176 235 43 -82
4168 -82 -91 -144 160 165 -117 -56 273 -7 227 107 169 -113 -93 -265 -29 -319 -175 53 22 25 -7 -204 19 7 66
4193 66 -186 -39 319 -87 -36 -50 175 19 -66 59 260 330 100 61 -102 106 18 -109 -33 29 17 -170 -130 -213
4217 -213 54 68 -14 -73 43 48 -187 39 -15 65 84 3 226 207 105 -31 -89 233 -12 102 113 -54 60 -125
4241a25J87m6p2J8Rl22K14O8k06K54K0R4j18%L4q8k17M14J41k56j3N8l7l9l0N4
4267dL47m29M1K44k55J85o8j24L2L4m8J5J1N7n0l4K46k88J12j0j93Q9k1L05j52
4292D2K5j2j7K14k44Kj48K36J45j65j28O8o3O4N7k5P8j52M0l9K5J95l99J61O4
4317B4M9r3j7J01l1J0K63j49m3n5K27l68J13P7j35R2N5k03R9m8n6k32K15K00m9
4342D6j36J09P1L2j18mO9j88O8m8Q3J39o3j64l5K95k84R4O2O5k03J59J2O2j14
4367IJ38k75R6l8Q3n1p7j18J81k6p2m3R0P5p6j3%L85l30J57l4l09K39K71l24K41
$$ plain form
4241 -125 62 16 -56 -38 -29 -351 -137 -69 -275 -21 -1 93 -25 -25 9 -79 -296 118 259 3 -10 48 11 -28 -58 -4
4267 -4 343 -86 -45 199 -56 129 61 -63 -31 3 -45 -30 -19 38 -12 -46 200 -88 24 14 -179 -90 -111 194 42
4292 42 67 55 38 252 8 10 -138 98 243 78 -50 18 -45 19 76 51 129 -23 17 -22 3 198 -201 -40 24
4317 24 73 -20 -37 64 33 43 306 157 114 59 286 -82 31 108 -27 65 120 -83 16 -32 -88 -320 -105 95 46
4342 46 -90 19 90 122 4 0 69 -119 -51 -99 -16 123 60 -104 -139 156 -128 -34 28 93 -110 49 61 123 9
4367 9 147 -128 -32 -70 13 -38 -115 -233 -52 -78 -150 -193 -103 -28 -104 -117 -117 268 -62 95 61 -248 -9 262 -62 179
$$ [...]
8191a0
##END NTUPLES=NMR FID
##END=
