##TITLE=1H_PhBBC0509M
 CDCl3
 8 sc, 
 6.9.2023
##JCAMPDX= 6.0         $$ Bruker NMR JCAMP-DX V2.0
##DATA TYPE= NMR FID
##DATA CLASS= NTUPLES
##ORIGIN= UXNMR, Bruker Analytische Messtechnik GmbH
##OWNER= root
$$ XWIN-NMR		Version 3.5
$$ Wed Sep  6 14:11:50 2023 Russian Standard Time (UT+4h)  she@DPX200
##.OBSERVE FREQUENCY= 200.13135
##.OBSERVE NUCLEUS= ^1H
##.DELAY= (6, 6)
##.ACQUISITION MODE= SIMULTANEOUS
##.ACQUISITION SCHEME= undefined
##.AVERAGES= 8
##.DIGITISER RES= 18
##SPECTROMETER/DATA SYSTEM= spect
##.PULSE SEQUENCE= zg30
##.SOLVENT NAME= CDCl3
##.SHIFT REFERENCE= (INTERNAL, CDCl3, 0, 15.7039)
##AUDIT TRAIL= $$ (NUMBER, WHEN, WHO, WHERE, WHAT)
$$ ##TITLE= Audit trail, XWIN-NMR		Version 3.5
$$ ##JCAMPDX= 5.01
$$ ##ORIGIN= Bruker BioSpin GmbH
$$ ##OWNER= she
$$ F:/spectra/data/she/nmr/H-F/1/audita.txt
$$ ##AUDIT TRAIL=  $$ (NUMBER, WHEN, WHO, WHERE, WHAT)
(   1,<2023-09-06 14:10:00.75 +0400>,<she>,<DPX200>,
      <created by zg, POWCHK disabled, PULCHK disabled
       configuration hash MD5:
       00 E9 B6 7A A2 85 ED C7 34 08 36 98 17 FE 4E 26
       data hash MD5: 16K
       6C 23 DB CC 1F E7 AD 79 96 46 38 1B AA 68 E7 75>)
$$ ##END=
$$ 
$$ hash MD5
$$ 18 AC B0 C8 72 61 89 03 80 DD 80 80 85 26 51 81
##$RELAX= 
##$RELAX= 
##$RELAX= 
##$RELAX= 
##$RELAX= 
##$RELAX= 
$$ Bruker specific parameters
$$ --------------------------
##$DU= <F:/spectra>
##$EXPNO= 1
##$NAME= <H-F>
##$PROCNO= 1
##$TYPE= <nmr>
##$USER= <she>
##$AMP= (0..31)
100 100 100 100 100 100 100 100 100 100 100 100 100 100 100 100 100 100 
100 100 100 100 100 100 100 100 100 100 100 100 100 100 
##$AQSEQ= 0
##$AQ_mod= 1
##$AUNM= <au_zg>
##$AUTOPOS= <>
##$BF1= 200.13
##$BF2= 200.13
##$BF3= 200.13
##$BF4= 200.13
##$BF5= 200.13
##$BF6= 200.13
##$BF7= 200.13
##$BF8= 200.13
##$BYTORDA= 1
##$CFDGTYP= 0
##$CFRGTYP= 5
##$CHEMSTR= <none>
##$CNST= (0..31)
1 1 145 1 1 1 1 1 1 1 1 1 1 1 1 1 1 1 1 1 1 1 1 1 1 1 1 1 1 1 1 1 
##$CPDPRG= <>
##$CPDPRG1= <>
##$CPDPRG2= <>
##$CPDPRG3= <>
##$CPDPRG4= <mlev>
##$CPDPRG5= <mlev>
##$CPDPRG6= <mlev>
##$CPDPRG7= <mlev>
##$CPDPRG8= <mlev>
##$CPDPRGB= <>
##$CPDPRGT= <>
##$D= (0..31)
0 1.2 0 0 0 0 0 0 0 0.06 0 0.03 0 0 0 0 0.0002 0 0 0 0 0 0 0 0 0 0 0 0 
0 0 0 
##$DATE= 1693995000
##$DBL= (0..7)
120 120 120 120 120 120 120 120 
##$DBP= (0..7)
150 150 150 150 150 150 150 150 
##$DBP07= 0
##$DBPNAM0= <>
##$DBPNAM1= <>
##$DBPNAM2= <>
##$DBPNAM3= <>
##$DBPNAM4= <>
##$DBPNAM5= <>
##$DBPNAM6= <>
##$DBPNAM7= <>
##$DBPOAL= (0..7)
0.5 0.5 0.5 0.5 0.5 0.5 0.5 0.5 
##$DBPOFFS= (0..7)
0 0 0 0 0 0 0 0 
##$DE= 6
##$DECBNUC= <off>
##$DECIM= 32
##$DECNUC= <off>
##$DECSTAT= 4
##$DIGMOD= 1
##$DIGTYP= 9
##$DL= (0..7)
0 120 120 120 120 120 120 120 
##$DP= (0..7)
150 150 150 150 150 150 150 150 
##$DP07= 0
##$DPNAME0= <>
##$DPNAME1= <>
##$DPNAME2= <>
##$DPNAME3= <>
##$DPNAME4= <>
##$DPNAME5= <>
##$DPNAME6= <>
##$DPNAME7= <>
##$DPOAL= (0..7)
0.5 0.5 0.5 0.5 0.5 0.5 0.5 0.5 
##$DPOFFS= (0..7)
0 0 0 0 0 0 0 0 
##$DQDMODE= 0
##$DR= 18
##$DS= 0
##$DSLIST= <SSSSSSSSSSSSSSS>
$$ [...]
##$SUBNAM2= <"">
##$SUBNAM3= <"">
##$SUBNAM4= <"">
##$SUBNAM5= <"">
##$SUBNAM6= <"">
##$SUBNAM7= <"">
##$SUBNAM8= <"">
##$SUBNAM9= <"">
##$SW= 18.05172834244
##$SWIBOX= (0..15)
0 0 2 0 0 0 0 0 0 0 0 0 0 0 0 0 
##$SW_h= 3612.71676300578
##$TD= 16384
##$TD0= 1
##$TE= 0
##$TE2= 300
##$TE3= 300
##$TEG= 300
##$TL= (0..7)
0 120 120 120 120 120 120 120 
##$TP= (0..7)
150 150 150 150 150 150 150 150 
##$TP07= 0
##$TPNAME0= <>
##$TPNAME1= <>
##$TPNAME2= <>
##$TPNAME3= <>
##$TPNAME4= <>
##$TPNAME5= <>
##$TPNAME6= <>
##$TPNAME7= <>
##$TPOAL= (0..7)
0.5 0.5 0.5 0.5 0.5 0.5 0.5 0.5 
##$TPOFFS= (0..7)
0 0 0 0 0 0 0 0 
##$TUNHIN= 0
##$TUNHOUT= 0
##$TUNXOUT= 0
##$USERA1= <user>
##$USERA2= <user>
##$USERA3= <user>
##$USERA4= <user>
##$USERA5= <user>
##$V9= 5
##$VALIST= <valist>
##$VCLIST= <CCCCCCCCCCCCCCC>
##$VD= 0
##$VDLIST= <DDDDDDDDDDDDDDD>
##$VPLIST= <PPPPPPPPPPPPPPP>
##$VTLIST= <TTTTTTTTTTTTTTT>
##$WBST= 1024
##$WBSW= 4
##$XGAIN= (0..3)
0 0 0 0 
##$XL= 0
##$YL= 0
##$YMAX_a= 123050
##$YMIN_a= -121282
##$ZGOPTNS= <>
##$ZL1= 120
##$ZL2= 120
##$ZL3= 120
##$ZL4= 120
##$ABSF1= 10
##$ABSF2= 0
##$ABSG= 5
##$ABSL= 3
##$ALPHA= 0
##$AQORDER= 0
##$ASSFAC= 0
##$ASSFACI= 0
##$ASSFACX= 0
##$ASSWID= 0
##$AUNMP= <proc_1d>
##$AZFE= 0.1
##$AZFW= 0.1
##$BCFW= 1
##$BC_mod= 2
##$BYTORDP= 1
##$COROFFS= 0
##$CY= 11.3945322036743
##$DATMOD= 1
##$DC= 2
##$DFILT= <>
##$DTYPP= 0
##$F1P= 15.7292609196834
##$F2P= 12.9074282941183
##$FCOR= 0.5
##$FTSIZE= 0
##$FT_mod= 4
##$GAMMA= 1
##$GB= 0.15
##$INTBC= 1
##$INTSCL= 1
##$ISEN= 128
##$LB= 0.24
##$LEV0= 0
##$LPBIN= 0
##$MAXI= 10000
##$MC2= 0
##$MEAN= 0
##$ME_mod= 0
##$MI= 1.114404
##$NCOEF= 0
##$NC_proc= 0
##$NLEV= 6
##$NOISF1= 3.799351
##$NOISF2= 2.8
##$NSP= 1
##$NTH_PI= 0
##$NZP= 0
##$OFFSET= 15.70392
##$PC= 1
##$PHC0= -21043.17
##$PHC1= 11.85271
##$PH_mod= 1
##$PKNL= yes
##$PPARMOD= 0
##$PSCAL= 0
##$PSIGN= 0
##$REVERSE= no
##$SF= 200.130013532006
##$SI= 16384
##$SIGF1= 3
##$SIGF2= 2
##$SINO= 400
##$SIOLD= 16384
##$SREGLST= <1H.CDCl3>
##$SSB= 0
##$STSI= 0
##$STSR= 0
##$SW_p= 3612.71676300578
##$SYMM= 0
##$S_DEV= 0
##$TDeff= 0
##$TDoff= 0
##$TI= <>
##$TILT= no
##$TM1= 0
##$TM2= 0
##$TOPLEV= 0
##$USERP1= <user>
##$USERP2= <user>
##$USERP3= <user>
##$USERP4= <user>
##$USERP5= <user>
##$WDW= 1
##$XDIM= 8192
##$YMAX_p= 0
##$YMIN_p= 0
$$ End of Bruker specific parameters
$$ ---------------------------------
##NTUPLES= NMR FID
##VAR_NAME=  TIME,          FID/REAL,        FID/IMAG
##SYMBOL=    X,             R,               I
##VAR_TYPE=  INDEPENDENT,   DEPENDENT,       DEPENDENT
##VAR_FORM=  AFFN,          ASDF,            ASDF
##VAR_DIM=   8192,          8192,            8192
##UNITS=     SECONDS,       ARBITRARY UNITS, ARBITRARY UNITS
##FACTOR=    0.0002768,     1,               1
##FIRST=     0,             0,               0
##LAST=      2.2672688,     0,               0
##MIN=       0,             -121282,         0
##MAX=       2.2672688,     123050,          0
$$ Real data points
##PAGE= N=1
##DATA TABLE= (X++(R..R)), XYDATA
$$ [...]
1798c46j597L740l23l531J895K287k731j375L582q20l235K879J590l841M68L181
1814A823j803k209K858R73l306O03L503k620k033L763l43l073J946K068k602j000
1830a452L374p59l472K722J545l490K77L078j925k267K847P91l001M18L316k328
1846c26j742L564n76l065J981K269k584j249L350m11l222K404J974l440L2K864
1862A823j421k077K471P12k768L0L154j925k315L448J35l233J779K013k424j027
1878a625K809k86k958K006K206l144k94L183j522k192K656P36k768K96K774j839
1894C8j853K720M88l169J377K183k252q78K500k90k554J573K043k945m40L116
1910A657j590k001K672N35k453L05K323j484j733K339P46k965J258K275k370p56
$$ y = [-346, -1943, 1797, 1474, -2057, -162, 2125, -606, -1981, 1601, 781, -2454, 425, 2015, -1826, -1358, 1823, 20, -2189, 669, 1642, -1664, -1061, 2442, -178, -2211, 1552, 1209, -1864, 82, 2150, -452, -1452, 1922, 1163, -2309, 413, 1958, -1532, -1255, 1823, -102, -2369, 478, 1269, -1732, -1314, 2002, -326, -2068, 1496, 920, -2145, -164, 2105, -479, -1728, 1622, 1211, -2011, 393, 2367, -1073, -1041, 1823, 402, -1675, 796, 1508, -1260, -1230, 1924, -1, -2316, 1132, 1267, -1966, -187, 1826, -598, -1625, 1184, 898, -2060, -54, 2152, -992, -1286, 1897, 375, -1817, 839, 1575, -1193, -897, 1877, 38, -1815, 905, 1393, -1776, -399, 1784, -468, -1346, 1154, 864, -1690, -117, 1926, -1019, -1459, 1657, 67, -1934, 738, 1273, -1180, -875, 1448, -36, -1769, 570, 1316, -1649, -391, 1884, -486, -1242]
1926a242K356l36k127J210J965k422q43L145j266k254K461P66k762N44K226j317
1942A04j872K290O84k690Q20K139k062p58K510o54j786R09J735j913n73K573o96
1959G60k615K710N22k416N02K003j306j507K083P92k722N60K161k007j040K470
1975I50m53j862J165J303j802o33K493q16j940J860J272k523M99J983j150j500
1991a154J664Q45k299O41K031j796j437K531k14k060R83J399j761p79K377n66
2007D05k033J735R93k407M42K230j548j131J810M86j832K12K341j957q31K141
2023A056j39j899J032J136j505n11J725l22k028J549J129k300K38J942j180j218
2039a295J867J97j664L24J916j248j358K000r6j885J440J056j673l59J621l16
$$ y = [-1242, 1114, 778, -1349, -139, 1826, -596, -1439, 1706, 440, -1814, 647, 1413, -1349, -805, 1421, 104, -1768, 522, 1206, -1484, -664, 1475, -587, -1345, 1165, 511, -1275, -366, 1369, -544, -1117, 1456, 760, -1855, 855, 1377, -1039, -537, 1466, 160, -1347, 736, 1528, -1194, -634, 1527, -480, -1520, 950, 497, -1365, -200, 1103, -699, -1332, 1161, 345, -1595, 265, 1537, -986, -487, 1496, 346, -1154, 510, 1355, -944, -303, 1728, -68, -1505, 1026, 812, -1248, -265, 1134, -627, -1406, 971, 405, -1628, 107, 1100, -1307, -865, 1365, -183, -1314, 496, 982, -850, -638, 1703, -254, -1085, 1056, 917, -982, 50, 1186, -319, -830, 895, 573, -1455, 94, 1223, -1077, -839, 1103, -77, -1295, 572, 769, -895, -571, 1345, 97, -1261, 739, 643, -1242, 198, 1254, -419, -778, 843, 527]
2055E27j478R94J170k180K92J847j184j124J708K26j609L02J494r62j332J754
2071D45K58j803R14J158j467k07J454k90j511J261Q32j713j23K005j111j134J661
2088F29J77j728M92J280o41j182J617K74k080J132J028j583j05J396l57j362Q36
2105a77J090j509k49J679q41j194J493N05j750Q07J063r10q98J397L34j593P86
2122C3J258j685j35J266l97r54O18Q01j063n81J751q46j289J460M04j439M54Q01
2140D57n89p47J158M51j550N93J244j435r6J481o23q74Q61N02j128l82J596m73
2158D46j445J391K59j351M35J049j074l10R00L7q71J34J163j199l57J580n17q59
2176e89Q57M47r72k59J190o4j315J080M31j123L42Q67j021n59J010K02j077K40
$$ y = [527, -951, 43, 1213, -967, -675, 1172, -12, -1136, 572, 798, -811, -509, 985, 23, -1309, 445, 703, -1100, -186, 972, -495, -702, 752, 462, -1049, 212, 1044, -669, -792, 1213, 102, -1032, 629, 806, -922, -430, 850, 209, -973, 644, 918, -1162, -30, 998, -585, -690, 706, 349, -1013, -177, 913, -596, -845, 834, -7, -1201, 292, 797, -953, -146, 917, 7, -891, 506, 840, -753, 33, 1291, -394, -529, 737, 340, -614, 4, 805, -258, -839, 912, 66, -1223, 237, 641, -798, -344, 457, -132, -879, 279, 730, -820, -227, 1017, -418, -514, 967, 344, -530, 331, 833, -295, -677, 919, 446, -999, 392, 651, -700, -265, 784, -290, -600, 300, 337, -534, -400, 763, -436, -793, 787, 270, -589, 268, 715, -257, -516, 674, 610, -705, 375, 806, -317, 25, 892, -129, -688, 322, 524, -553, -313]
2194c13J051j081k31J023l93r62J005O70r90l48J006k95r27J020O21j529N33P60
2212F20p23j24N88J74q50K84P89j049k92J122j83j013Q34K54p66n9Q26j93p81
2231e42N49M67r36K05Q61r35m07J001q2o57K56O73n76k90Q63j70p09R14p0r12
2251d97L97O30l03q15P64N17r78lR72j015j04P58k6p77J58P62p02m48R19k87o72
2272g50O87L32o49Q2O29l26m27O33L94p67K23Q90q96m52R16k98n96L30L44n10
2292b11j47N63j71q60P34L45q83K74N44k07l66L05K88m54%J029o29m93J060k16
2312E05o88L38L14m54j85K85L7n89M17M42q28Q6N35p08j3M61J51l32j53Q19n27
2333h7l48Q20j82n99O55J66o03J62K64k7n53L27N84r33L03M36o43r4O46m45j00
$$ y = [-313, 738, -343, -574, 449, 56, -906, 99, 769, -221, -569, 437, 142, -785, 235, 856, -673, -140, 620, -103, -227, 361, 535, -315, -31, 758, -291, -583, 539, 356, -657, 177, 431, -335, -394, 432, 239, -542, 7, 474, -462, -257, 604, -331, -738, 263, 181, -476, -220, 453, -123, -413, 450, 280, -429, 485, 415, -497, -100, 530, 227, -588, 176, 693, -285, -288, 684, -331, -435, 323, 297, -480, -322, 440, -262, -710, 209, -78, -750, -63, 269, -380, -298, 331, 5, -422, 211, 605, -162, 61, 951, 55, -397, 519, 221, -375, -45, 299, -211, -358, 205, 34, -826, -92, 253, -630, -356, 188, -19, -385, -80, 208, -246, -246, 783, 154, -339, 721, 505, -183, 155, 469, 15, -170, 115, 152, -437, -20, 422, -406, -320, 215, -493, -506, -45, 106, -226, -379, 440, -87, -435, 385, 203, -396, 259, 425, -178, -16, 248, 221, -332, -5, 579, -354, -51, 385, -258, -352, 294, -151, -251]
2354b51K10K39j28n50P03j34m24L91K37n09L7N30m50j91L49M09p29j8P37n25m05
2375d72O61j94k03K63J17j94n07N10J77n41O21K28p00L00J30j38l36L21L23o44
2395b78P8Q18q97k24O95l90k27M76J51m36L3K63K31p49N22L42o55M46J9l28P1
2416c9M88j00n22m3N04l16n19R88l85m44M30n0k82K42J41j58l72M44K76p07L87
2437c7L68l60j13K96J6j38J4M80l07l52M37j15o33M32J28k40M3L71k68l51L21
2458hL5o08M89K20l99J9K95o8l83K14L32j62k41O00J6p16O14K23o80L44J72j00
2480B08j85J16K70p23J6P59n48j62M99l19k03L10l7j34k16M90J1m38N16j76m57
2501d03O43j37j02j02M32K8n31K00M25n74Q3L88k67j74K61J92n56m9N35k34l86
$$ y = [-251, -41, 198, 70, -480, 223, 89, -335, 56, 293, -216, -179, 351, -99, -290, 59, 468, -261, -279, 458, -67, -472, 189, -5, -208, 55, 172, -22, -529, -19, 158, -383, 238, 466, -234, 66, 196, 58, -278, 43, 366, -278, -200, 618, -279, -503, 192, -198, -425, 51, 202, -234, -201, 62, 293, -456, 66, 408, -247, 199, 218, -110, -39, 449, 349, -173, -216, 288, -28, -547, 441, 56, -388, 42, -8, -290, -48, 93, -65, -437, 7, 283, -424, -37, 331, -29, -142, 154, 170, 32, 46, 526, 219, -133, 304, 189, -444, -12, 116, -124, -81, 290, 22, -329, -8, 27, -581, -92, 128, -271, -252, 43, -25, -408, -194, 138, -24, -265, 335, 351, -365, 249, 472, -208, 136, 308, 208, 23, 139, 409, -314, -298, 461, -87, -249, 250, -69, -272, 38, 1, -133, -349, 141, 152, -286, 230, 54, -403, 240, 103, 1, -101, 331, 359, -172, 28, 453, -121, -38, 350, 83, -91, 170, 362, -194, -243, 292, 58, -328]
2522c28K79K63o05L58L38o39J67L98m49L0K10N08o98QO11j72n07K67L22m25O1
2543cK55j76m28N04K49p01K01M09o81Q6M71r0n13K99L71l59l71O39m00k93O03
2564G2l4l45K70J46j53k09M92j02l10K01L82m96J46K59l09k84J84L69k27m44M00
2585Hk99l02O75m3m70K15M85m11l79M57L70p23R9P23p35J45P76n46j78J80M00
2606D47l62k79M96P3p04L99K85q53L27K71k49j22M52j19l85J17N41o39j29P29
2626B96j16o38L98K92m70J59J42P6m39N80K58q90M02N94n66l60M98J48n87J02
2646a21N16l97n26Q44j60n45L38K31n08K27L86j69m54M28J14p40K36P22o19o5
2666b62N89p2m81J32M05l09l72Q62k00q49R17M7n54j55M69j42m54M96K19p43J14
$$ y = [-328, -49, 214, -391, -33, 305, -334, -167, 231, -218, -188, 22, 530, -168, -160, 451, 279, -228, 39, 361, -64, -3, 252, 76, -352, 152, 401, -300, -99, 310, -371, -285, 186, 96, -417, -118, 253, -106, -477, 162, -238, -531, 72, 38, -307, -37, 109, -44, -253, 239, 137, -173, 28, 410, -86, 60, 319, 10, -274, -90, 279, 52, -392, 8, -291, -593, 82, 39, -431, -216, 269, -142, -521, -64, 306, -417, -318, 405, -330, -185, 591, 45, -133, 47, 447, 85, -194, 302, 375, -329, 70, 355, -498, -171, 100, -149, -271, 181, 62, -323, -206, 335, -304, -433, 296, 180, -458, -60, 232, -238, -79, 63, 139, -300, 280, 538, -352, 50, 644, 78, -282, 216, 364, -223, -121, 395, -2, -528, 316, 156, -389, -51, 180, -328, -101, 285, 116, -338, 90, 204, -536, -300, 422, -197, -262, 327, 255, -226, -94, 311, 2, -370, 492, 292, -557, 360, 407, -147, -302, 167, 25, -429, 67, 286, -457, -343]
2687c43R80o70n44Q06j12l98J08N32m78j83P94k06p05O66J33n41J27N41m62k24
2707a79J63L87o33NP94o61k29N79k2o06K64K77j58m14O08L0p00N87M10o65J70
2728GN03n94k56M15K63o69J08P67o47l99R43j48o94M61M12n67l30O43k04m50M15
2749b1M44p95J88O65m16n73O35J30p66J95O99k03n97O52O8o87L10N90k78o50N69
2770A59K89p61J97P73q25r6P63m39n39M87L07o90r4P12k81n12R74j42r03P30K54
2791C63m44l75O97j99n16L50Q72r92n3Q11l28l95O01j1n19p6N84j71o36P74J19
2812D56j075N43M83p28p1P30k85m22J50O98q26j24R41m87m59N98L05n34R5L89
2832C77k26p19Q42L55q58Q7O34p33l44R11j80o42K57O59q49j65R13j75r22Q62
$$ y = [-343, 637, -33, -577, 229, 117, -281, -173, 359, -119, -302, 492, 286, -419, 247, 380, -161, -34, 507, 45, -179, -16, 371, -262, -257, 537, -124, -353, 226, 204, -402, -138, 139, -19, -433, 175, 205, -495, 92, 502, -163, 7, 510, -84, -340, 75, 338, -331, -223, 544, -103, -502, 441, 293, -401, 60, 472, -95, -425, 218, 14, -436, -21, 423, -372, -184, 481, 65, -508, 127, 257, -509, -314, 385, 182, -415, 237, 305, -382, -72, 518, 240, -410, 159, 448, -313, -116, 657, -168, -264, 499, 60, -479, 8, 315, -375, -469, 243, -38, -550, 424, 282, -621, 109, 363, -81, -456, 241, 42, -474, -124, 748, -244, -297, 514, 186, -209, 392, 381, -138, -214, 370, 199, -437, 337, 456, -619, -76, 407, -321, -392, 338, 53, -369, -219, 479, -347, -471, 470, -17, -476, 122, 427, -107, -12, 377, 151, -568, 274, 629, -229, -142, 492, -241, -585, 326, 146, -496, -239, 420, -429, -594, 319, 144, -778, 84]
2852H4K19o12j0N78k64l92N90K22p78J22R19o57n03R73k52n69L04M27m36l67N84
2873A82j57n37N51L47q42K11N71o11k8L01M98r65J39R31n27m57Q43k6o56L71K07
2894C46l92k09Q21lj203P81L58q30K07O41m26n67M10M74o05j33O92m72l89Q19
2914C20j39q57O91M78o34j15P44l09q76P41N65r08N7P02n43j99N07J73q02NR93
2935E94o60m83Q96l0p32M97L23o73j25P36o3o72K54N27o27j85R19n11j75L84P2
2956B66o16N6O85j14p76Q32R1q72K71O61n95k75R77k75p48L24M34o22j53P86m82
2977a45l55O21K43q79Q4P62j70n24O71m0q04L34O54l96m89P75j30m83J69P16n29
2998H5m93Q28k28n26O32J30p39J18P33m52o38P66J06q65M05N65p16j35M98J06
$$ y = [84, 303, -309, -319, 259, -5, -397, 193, 415, -363, -241, 678, 21, -482, 491, 239, -330, -26, 401, -35, -402, 182, 25, -512, 39, 386, -456, -245, 326, -285, -313, -12, 486, -479, -340, 591, 64, -393, 450, 424, -232, 139, 346, -46, -255, 566, 563, -640, 141, 499, -331, -124, 517, 91, -476, -66, 408, -197, -330, 362, -110, -499, 320, 181, -676, 15, 493, -141, -256, 488, 179, -697, 44, 609, -299, -242, 460, -83, -282, 225, 398, -404, -399, 594, -66, -549, 347, 317, -415, 82, 405, -268, -393, 343, 280, -392, -138, 389, -238, -423, 496, -15, -190, 194, 266, -350, -294, 391, 277, -499, 333, 424, -448, -177, 484, -111, -386, 591, 316, -432, -108, 326, -296, -449, 337, -145, -500, 121, 364, -515, -431, 331, 161, -363, 308, 268, -536, -202, 452, 56, -433, 342, 212, -271, -102, 614, 85, -408, 420, 192, -334, 298, 428, -311, -193, 540, 88, -550, 216, 322, -543, -138, 427, -289, -424, 74, 180]
3018A80o46J94O96n57k56R10k26p03O42J41n81J12O44l67n34M07M40r09J81Q25
3038E93n84l08N39j65m20J91N21n87l75Q16k3o88O85M6o28L74J98r0m86N02M95
3059F06r13L04O54o10m42P36q2o36M02M86o44l92R45k44r71P46M92p79p2P36j40
3080A82o47N04L16n04O1N84n31k81O67L1m77R0M55m91m41N88L15p71M46K15o48
3101c37j66R22l87m40K69L11o00p2R22l16p27J040N8r57M93O38n56l03O37k2p28
3122c21M58O14j011l4O76m21l28N08K29o38J04N92l09o85Q36k8p33L69M65m20
3142g7l22O11J45o44J02P61p75j19P07k27o41L91M67o19j05N43L4q60R21J96r43
3163d54M35N17o01j87L64R2m04L4Q11q24j93O54k19m95P12om88p2N39j32m98N57
$$ y = [180, -466, -272, 424, -133, -389, 521, 295, -408, 234, 375, -206, -94, 550, 183, -351, 56, 496, -413, -232, 593, 9, -299, 240, 75, -345, -154, 367, -220, -595, 221, 198, -490, 195, 241, -387, -13, 185, 95, -391, 111, 606, -307, -3, 651, 41, -401, 335, 253, -383, 19, 505, -139, -531, 414, 170, -801, -55, 437, -342, -414, 322, 182, -465, 39, 355, -149, -88, 496, -35, -316, 351, 382, -95, -5, 450, -41, -482, 106, 421, -350, 96, 311, -337, -503, 419, 32, -408, -139, 172, -428, -500, 422, 106, -621, 419, 477, -480, 13, 651, 95, -208, 429, 407, -321, 137, 751, -260, -294, 382, -39, -367, 141, 370, -268, -164, 428, 119, -566, 270, 242, -491, -122, 343, -77, -399, 212, 357, -287, -185, 576, -199, -318, 389, 162, -479, -88, 379, -240, -345, 198, 232, -628, 293, 489, -454, -19, 498, -103, -290, 74, 166, -238, -204, 607, -217, -410, 244, 25, -470, 242, 236, -252, -324, 215, 83, -415, 142]
3185A42L38q63J92N61l52l52O59j51l37J83K88l90k25Q54m08n75M91K03n33j5
3205b90L00L3p53O81L93o95L9O85p99j50P69J95j052N74O07m57o03Q47j9q11Q73
3226C67n5m60j0L88k34l92M12K71m86j27N67m39l01N02L06o24J42M00j71n44Q27
3247C39J2o38K44N08o74o5N85j42l62M9N35o90K8N75l30p78R40mn30K00N31l54
3269b1n47P18J19o61M95M35q96J75N67r3m59P1M35n12j70N39j33l56L42K06m78
3290b24R2N20l32l99M80K27p15J31O24m62l50P29j69k35j3L03m30o2O76K00r75
3311c84M73K97n68O3L85l69j2K33J44m66J9O05m89j09L06L5n38K96K40m00l0N60
3333B91K5p03M45K73o96J02N44k99l35M96J54n19J32M57m92l42O71K11n44K24
$$ y = [142, 480, -383, -191, 370, 18, -334, 325, 174, -163, 20, 308, -82, -307, 547, 139, -436, 55, 258, -275, -290, 10, 43, -710, -29, 364, -331, -292, 393, -406, -556, 213, 408, -644, -70, 537, 80, -523, 324, 305, -506, 367, 312, -148, -158, 230, -4, -396, 16, 287, -199, -326, 241, -198, -499, 3, 309, -315, -173, 227, 56, -488, 339, 351, -287, -43, 465, -209, -274, 311, 169, -193, -144, 391, -299, -271, 304, -26, -804, 136, 132, -398, -198, 333, -21, -568, 150, 269, -392, 103, 538, -358, -183, 384, 291, -168, -97, 338, -174, -344, 195, 62, -294, 48, 254, -224, -132, 388, 56, -343, 137, 364, -351, -220, 404, -58, -408, 321, 152, -83, -96, 207, -223, -285, 391, 591, -384, 89, 386, -182, -119, 266, -103, -115, 118, 262, -204, -185, 420, -69, -178, 128, 163, -375, -79, 161, -239, -269, 291, 316, -387, 58, 331, -365, -263, 281, -18, -353, 143, 297, -222, -90, 367, -125, -467, 204, 415, -129, 95]
3353I5J91n14J06J55J12n79M46L98o81P1K93j94m8K43K4l39ML60l08j53M04J51
3375B37p05N25Q1l25J14J47J11m57K14N08n68o6N67l65j14K23J06m00LL89k04
3396B1k95L63Nm55L95K46o74K44O8M14n44L57J68n11r5P34l28l02M40L5j95k34
3418a43N38r9q24O26K87p59M69j01k26k48N22R1n83J39O17p12pP27k65m20M55
3439H4J7l09J36L72k00j89K36K77m05l5K55k92N9o2K11l42L1M28k08l13N73m21
3461i7l79N18Q3l16M4K56K8k91K12K13k51n1K53k60j60L72M3l60R0L16l82k72
3483c91O93l41l09K64J74k99j70M13m4j67j17M37l39J8M20m85J38L48k82J6J12
3504H9K23l26j03L50J1m59K95J46k66K9J81J4l77J69K41l99Q6J96q9m56O25j70
$$ y = [95, 286, -228, -122, 33, 145, -434, 12, 410, -271, -200, 93, -101, -149, 94, 118, -221, -217, 143, -165, -318, 86, 237, -468, 57, 138, -187, -73, 74, 185, -272, -58, 450, -118, -184, 383, 18, -96, 127, 233, -167, -164, 225, 21, -274, 89, 94, -361, 34, 280, -394, -150, -82, 332, -212, 145, 313, -198, -293, 441, 113, -189, 251, 286, 91, -143, 395, 296, -528, 98, 385, -374, 95, -6, -232, -480, 42, 133, -450, -311, 306, -406, -413, 314, 49, -371, 84, 101, -208, -72, 300, 100, -89, 147, 424, 19, -16, 239, -53, 6, -56, 155, -187, -156, 272, 64, -249, 324, -97, -476, 42, 125, -191, -147, 109, 137, -154, 58, 271, 20, -31, 222, -38, -198, 174, 217, -143, -53, 263, -119, -391, 302, -39, -348, -84, 90, -209, -379, 34, -10, -177, -294, 143, -196, -178, 242, -243, -105, 243, -39, -23, 89, 312, -14, -117, 233, 244, -215, 80, 226, -40, -11, 170, 184, -193, -24, 217, -182, -96, 100, 11, -445, 180, 10]
3526A0k93K53p2J43k86M82k2l76J59K28l88J37L08k30j13%K63k54l86P24j09n03
3548c25M19J86m42R0J98r2k28J67J07k02J21K93m49M7J54J12l40J04L30l37j01
3569a88L29j72k84M84M1l97O0K76k21k36N12j26j54j36M21l26k44N20m6k78L15
3590A50Pl35j14L78j34m27M68K65m45J32J78j98l3K06N3j05k75N20l28j67M84
3611B80j0l96J97K27j89N4n4J0k50J78J3j18n3K50k29k78L64L5k17R0K06j2l60
3634b62M90j09j18J68j1j36J86l45K68j42P7K84m54m3M15l53Q1L2r6R0k10K12
3656B4k3j59K87q1o8m0R7j04M0QP0j12M9J01r8j24K41j39q9J91j18j77K78K4P7
3681A55k65J08o0k51K00J23k27J36j39K41j37M3J53j72o9L08j63k5J72pl40L45
$$ y = [10, -283, -30, -102, 41, -245, 237, 215, -161, -2, 226, -162, -25, 283, 53, -60, -60, 203, -51, -437, 287, 178, -325, 94, 280, -162, -72, 126, 34, -194, -27, 80, -122, -1, 292, -157, -110, 44, 156, -184, -80, 250, -87, -188, 141, -31, -315, 169, 210, -187, -127, 149, -72, -308, 204, 78, -76, -212, 209, -117, -361, 159, 113, -165, 150, 157, -178, -292, 86, -48, -475, -7, 258, -187, -55, 123, -75, -108, 98, 151, 46, -229, 291, -37, -204, 280, 270, -126, 71, 298, 109, 163, 109, 119, -131, 47, 60, -58, -111, 139, -90, -368, -4, 31, -186, -96, 110, 98, -262, 228, 119, 1, 169, 158, 22, 208, -137, 131, -11, 66, 350, -104, -147, 268, -85, -4, 28, -68, 22, -188, 24, 1, -158, 129, 48, -20, -60, 37, -67, -27, -19, 51, -61, -12, 89, -9, -133, 108, -31, -120, 71, -47, -224, 54, 78, 155, -110, -2, -62, -313, -113, 10, -217, -81, -220, 21, -116, -73, 80, -92, -161, 147, -16, -41, 131, 124, -216, 129]
3703A29N7r0j66jM44m56k5J22n5k6P0o7P2K5p9m2l9J87k0o6L37k81k31J62K7P9
3729F7j6l36K73j26J54N7k3j64J74J36j73j58J89Lk5N0J14k10R2K09j16k04J9
3752a4Q1j71M2J34l12o0N24j03j74M1O7j23J01J9R6k36K5K86j00j72K42n8j29
3775FL7j13M2L8J61k68J06k5j04L1j43P3L4m0Km0QJ91N4k59R4J99m69M57J23j17
3801G8m2K3j20J72k15K30l2k83M07p7j49jk7Lj54N6J26k27J66P6k25L6K29R0q8
3826E2k18M24k28o1p8L33r1k0n6j78K90l01K12j48j08K42m0j19K3Q5k74K29j9
3849d9K4rm3rJ79k15J81pk76M28l98J61J0m6o6J63L7q3J50J1j57oJ47j91J82l8
3875H0p6J91k57qN4Q1o3J20j64r6J79r2m5J22j24J85j95J60P1k00K14M6j47k7
$$ y = [129, 186, 96, -70, -71, 373, -83, -108, 14, -41, -67, 3, -64, 8, 33, -46, -88, -127, 60, 40, -26, 311, 30, -201, -39, -12, 67, 51, -285, -12, -138, 16, 73, 50, -114, 60, 196, 23, -135, 54, 57, 32, 82, 196, -14, 78, 287, 171, -33, -14, 67, -104, -62, 72, -240, -300, 224, 121, -53, -12, 55, -68, 33, 52, 148, -88, -63, 223, 123, -49, 193, 135, 6, 43, -70, -28, 10, 171, -97, 9, -16, -120, -89, -232, -159, -125, -165, -163, -203, -195, -4, 50, -209, -115, 84, -385, 72, 195, 78, 36, 59, -61, 111, -104, 126, 94, -189, 218, 141, -8, -9, -36, -33, -187, -131, -5, -232, -66, 10, -215, -179, 50, 140, 52, -166, 258, 30, -31, -109, 224, 133, 113, 57, -121, 169, -132, 80, -68, -176, 66, 26, -93, -70, 15, -259, -30, -49, -25, -34, -77, -86, 93, -122, 59, 52, -224, 204, -194, -33, -23, -69, -135, 28, 65, -18, 132, 143, -14, -20, 127, -64, 118, 80, 4, 195, -62, -70, -16, 65, 2, 122, -42, -138, 41, -51, -96, 26, -98, 87, -108, 52, 123, -77, 137, 183, 36, 9]
3899In3P6k0o2k7L1j55J82J96j09J63p1j94k01K72j06O9l38N20k72J6n8K3Q2p8
3924a05J69k27K18q9J72j71OJ38k40L44j42o5J10LL5l28M24j02r4m7j70j14J75
3947a00J09k05j6M8L45j83p7j17J84j1k25L42j85J51n4J17K2m9R0r0k17L37Mk79
3971e9J43J05m2l95J14K28j91J74k39Q8L6J23j46Q2N0k74J97J29K7j59k82M61
3993A70j79j01J14k5o8N8m3K71l00R2K22k18r5J82mn0j40J14j97J34K4K31j52
4016D0K6p2k41K54j06l6J53l0J51Q1k63M1j29qK19Rj16l1N3J75k59j4J33k35J34
4041g1M1j82J63K81m97L58q5o0q0J22O4l3r2J12J22l63L29k05R1j9J44l29k4L80
4065A67R3j32k49K4R5L2r3J01p4n8on6k07M74J52m57L28j18L3p9j4J26k14K80
$$ y = [9, -44, 32, 12, -50, -77, -46, -201, -19, 177, 68, 231, 160, -34, -235, 37, -69, 0, -338, 182, -90, -74, -132, -109, -27, -105, 64, -163, 55, -34, 138, -33, -27, 111, -129, 215, 73, 8, 118, 121, 156, -172, 252, 150, 56, 9, -161, -275, -100, 9, -196, -212, -164, 181, -2, -79, -196, -12, -23, -248, 94, -91, 60, 6, 123, 145, 96, 186, 96, -121, 216, 220, -59, 84, 189, 147, -248, -134, 94, -97, 77, -162, -74, -38, 85, -61, 21, 71, -203, -6, 123, 150, -9, -291, 170, -9, -110, 4, -21, -89, -31, -74, 197, -103, -11, 211, -7, -102, 80, 76, 26, -114, 0, -197, -63, -39, 192, 40, 66, -6, -247, 7, -99, -135, 18, -12, 139, 220, -43, -2, -131, -139, 80, 89, -27, -58, -5, 170, -89, -103, 30, -205, -71, -30, -212, -49, 232, -265, 93, 8, -52, -132, -10, 54, 21, -71, 41, 163, -200, 129, -76, 15, -4, 140, -189, -213, 167, 260, 128, -121, -97, -2, 30, -63, 38, -36, -94, -100, -156, -363, 111, 263, -194, 134, 16, 49, -30, -44, 82, -132, 148]
4089A48j49Lj03K63k23Q5J74j30j48%J18K6k72K3K49j56P3J86k86J24l9Nj93J91
4113c1J51j32k16L32q9k42L45K3j19l9q8J28k01K33J33l95J68J65k74J60j10L26
4135B28r4j35J78k47P8J35j53r2J09P1q7J39N8j22k08OK83j72pJ60j17j24K27
4158A14M7j93m2P8L6j75M06j64j63MK67j70j63K00j71k3N8L18l11o5K24o1l5R6
4182A12n3j90J47M0oM5J53k01J4k10J81l13L07N0n5r1j12K10n3m6K24k16k14K57
4206b0R1j64J53j90K25l53K37K42m06J07J34k8j59L10j06p3K3K19j96j68K94j80
4228hj26J69k4j75J00K03j38j40J10J08l45R3M41l01k39N37l31j88K33P1k00K44
4250I4l1Q9m27M82k0l45K37N5K7k85K3K11k88n4K40p9j38L70J0l59J75m0j57P6
$$ y = [148, -1, 2, -101, 162, -61, 24, 198, 68, -80, -80, 38, 64, -208, -185, 64, -92, -19, 167, -119, 5, -34, -29, -222, -31, 120, -12, -228, 104, 15, -227, 118, 141, 22, -17, -105, 23, -178, 55, 188, -207, -39, 126, -148, 12, -98, 228, 134, -1, 177, -70, 8, 143, -10, -102, 7, 78, -9, 130, 188, 66, -142, -136, 147, -25, -32, 128, 11, -113, 114, 161, -32, -74, 4, 40, -135, 271, 107, -56, -52, 215, 45, -118, 82, -89, -112, -54, 264, -47, -112, 112, 51, 16, 112, 59, -131, 16, 56, 50, 95, 248, 47, 61, -149, 32, -281, 26, 76, 21, -70, -182, 28, -25, -71, 153, -63, -277, -20, 71, -93, 60, -130, 95, -258, -21, 221, -185, -78, 56, 28, -131, 179, 73, 0, 23, 242, 46, -122, 172, -8, -134, 35, 11, -164, -64, 139, 1, -139, -29, 79, -266, -173, 268, -33, -272, 265, -66, -254, -21, 50, -150, 94, 63, 152, -275, 207, 187, -158, 79, 134, 161, -124, -101, 110, -178, -232, 8, -71, -209, 161, 171, -188, -13, -53, -210, -134]
4274a34R2K15q5p4J26k72K37N7j57k0J9k6j4j05L9J68k38R2J87m0j34J98l7m6
4298D8Pl1l10L86j41k5M7P4R8j42j21R2L2r7J06R9j98K35R5m63JL85j56J26k43
4323i6K66l40K91j52O5k04J60J37j81n2R8q4N6J31k5n2J03pj48m3J91j27k65K06
4347g2K63j97L6J84j80l23N10m9j69L6K37k43j45L04k7r2p6L6k16L4J69j06j57
4370b43j0K79j16O3k2o6k6J55Q5j33Q1K5J04j95kQ8j00j05K82j04k69R7K27j16
4394b1J50p5j29J23k6l6j65J06K47m52K26J10j63J29n8O2k18K10L08m06j26N76
4416C72m09k14J47Q7p1R2L01m87r6J87J3j08N6J2QK7N5Q2p7q9K41j30k47M93j87
4441E8k90J67K49j86o0L09k5l63M1L97k78k61L15O9l65J41R7j96o3L93j38n5R0
$$ y = [-134, -42, 173, 88, 14, 140, -132, 105, 162, 5, -15, 4, -22, -36, -141, -102, 66, -172, -80, 107, 67, -67, 131, 94, 48, 55, 24, -286, 100, -41, -66, -19, 55, 153, 11, -110, -18, 14, -83, 23, 122, -76, 159, 254, -209, -208, 177, 21, 147, -96, 170, -170, 121, -31, 34, -170, -10, 127, -54, -106, -8, -92, -36, 95, 70, 18, 121, 114, -34, -77, 114, -13, -278, -72, 191, -6, 30, 214, 34, -289, 221, 172, 3, 39, 276, 33, -112, 192, 165, 73, -3, 33, -183, -149, 20, -86, -243, -253, 26, -90, -27, -49, -115, -141, 14, 99, -34, 47, 72, 176, -19, -21, 67, -33, -138, 144, 40, -229, -132, 95, -21, 129, 54, -75, 48, 22, -14, -179, -73, 174, -278, -52, 58, -105, 24, -34, 28, -190, 20, 328, -78, -204, 372, -37, -251, -104, -17, -88, 4, 305, -182, -278, -91, -78, -186, -130, -118, -110, -83, -28, 54, -23, -112, 129, -1, -248, 245, 58, -232, -65, 184, -2, -62, 247, 222, -141, -100, 297, 19, -242, 73, 142, -223, -82, 15, -181, -244, 149, 11, -44, 46]
4464D6l1j76K96l0l6j59O4N9j72M6J57P2j37K10j07J3P8j66k4j91K94J16k99J24
4488D7M4j32K07j48Q2K9j49R9k87NJ35j4J01J05kk02Q3Mj44J12K09kk93J83k9
4513D3j48N9J48j36O9p8j8m0K23J95l50j7K17k17k38K76O9j04j5rl4j15L08Q9
4537A77k80O1J98n5o7J23J72l92j27L74l88J46N2J65n0k6mk04K67l3j52J28j45
4560f0K37k44M9N3J98k75J61j62J14o5J82j33n2Q4K5l38K24M8j5N3L1J03n23K56
4584d9R0j11l7K68j54q0J80k34N0J23O4m0j00p0O3mj9L21l54Qj3J34jj18K33k2
4610A28k79M12k70r8J06%n3K14j64R0l20M13j6l70J58Qj17j8K08J50k65N1N4q1
4634e9P8J70q1k18J89j30p1P8J55K4l03K80P1l01J59R8j62k16K67j61p9J21mp7
$$ y = [46, 15, -161, 135, 105, 69, -90, -26, 33, -139, -93, 64, 136, -1, 209, 102, 115, 193, 27, 3, -188, 106, 222, -77, 47, 91, -41, 166, 18, 100, 129, -20, 79, -208, -203, -68, -82, 19, 124, 122, -80, 3, 7, -137, -25, 184, 182, -111, 72, 43, -105, -46, 102, -34, 35, -43, -61, -101, 122, 317, -33, -50, 167, -50, -288, -12, 57, -47, -62, -71, -105, -220, 88, 177, -103, -42, 156, 101, 34, 157, 329, -63, -190, 184, -204, -58, -6, 159, 109, 83, 79, -125, 142, 109, -43, 85, -60, 177, -67, -18, 35, 233, -42, 119, -43, 71, 6, 188, 55, 3, 87, 112, -226, -2, 46, 31, 84, 115, 218, -305, -49, 41, -70, -107, 161, 7, -73, 107, -127, -77, 46, 110, 70, -30, -100, -37, -41, -60, 261, -93, -85, -98, 36, 35, -83, 150, 128, -151, 261, -9, -107, -1, -1, -54, 160, -4, 86, -234, 179, 163, -207, -49, -41, -158, -176, 32, 182, -83, -32, 22, -59, 19, 189, 108, -110, 79, -51, -122, -44, 111, 135, -168, 112, 183, -118, 41, 139, -23, -239, 28, -133, -212, -91, -95, -172]
4658a72J20J71p6p3J6J38k76K48M9K9k9q4k0j35p7K33j46K07l4Q5l38P8L04l52
4682a34J32J89l34K25o2J82m43K56Pj17N1J5M5l0k08L95om22L06j17N6J54r8k17
4706a75K09Mm9k81K46L4l4o6J94o2j84J33k4j62K78O6ll33M20k44M3j43K56kk14
4731i3J00r5P2r9J13j78K18J79r2j27J34j11k4p3J39m7k2J17j62R0L2j40N1J9
4755AQ5j15j94J80O3n1r2R9J0m1P9K11l42j3M6NL6m9L57l29P1J72n1k99K91n8
4781G2l19K59N9j52n5K21k40r3L28O8k49j1M2K26j85K31j97j20J39J99l02r7J50
4804b6P2j99R8K52j67j72L4J47l62J29K96k87K11Mk08PJ68R2j38Q9J17j43r8K14
4828A30m4o0l1J55j82m4J30K8l3J7n2%m5J64l6k47J48J01N1m92K06K79j96R3R0
$$ y = [-172, -52, 119, 43, -30, -14, 124, -152, 96, 145, 174, 145, 61, 41, -94, -171, 62, -84, 123, 89, 174, -164, -86, 218, -134, -2, 187, -147, 78, 16, 198, -245, 11, 18, -99, -48, -33, 12, -18, -226, 169, 163, -259, 47, -70, -14, 140, 42, -175, 34, 38, -11, -292, -46, -12, -46, -112, 82, 20, -164, -31, -55, -217, 61, 127, 124, -209, 211, -33, 10, -133, 123, 121, -93, 7, -88, -16, -115, -2, -180, 38, 217, 125, -2, 132, 21, -3, -76, 63, 16, -6, 111, -51, 39, 71, -69, -18, 1, 86, -29, -223, -43, 20, -31, -123, -24, -14, -55, 24, 235, -107, -120, -74, -69, -33, -82, 275, -54, 17, 189, 138, -161, 130, 72, -247, 12, 71, -81, -136, 85, -155, -248, 80, 148, -101, -112, -70, 156, -29, 202, 5, -115, 24, 223, -79, -176, -26, 46, -153, -55, 197, 30, -142, -108, 39, -323, -194, 102, -185, 26, 30, -178, -171, -3, 89, -49, 40, 157, 14, -84, 130, 86, 26, -5, 150, -32, -76, 54, 82, 49, 66, 14, 14, -31, 133, 97, -150, -2, 99, 150, -342, -136, 143, -53, 40, 130]
4853A30j49L7n8J46l02L31q8K3p5K00n7k54L74j17j71N6J47j91j17K88l5k03K89
4876B04m17R2J0J64n8j14P1o4N2j7J47R5j86J84O6l27K08j4o3k61K12J8k18M62
4900B46j71k62p1L39L0l06K81j06J6j67M13k82k93N39m11J17m7J18j12J68R5k17
4922h3j59L13%l07J03K13k9j87R0j5N9J63k18j1J25Q8j15j27J87J01k12l30M04
4945E3o7j84N8J79l8k77L28n7J2j26K94k16j63L03k11J73K6J96k69r9K20j20k19
4968b04K50L3J9J2Q0l28J36O7o3j00l1J52r5k0J18L3k84L74j57K9J03R9j75n2
4992dl0J17J3j49J88k29j09L21o7j54J35K6o1n6P5Q4j06P2K8o1j16j7J16J3J07
5017A36q7K6q7R9r1Q2j32N3k3o6R8k7p5J28j6l5j2n8Ql9Q9m5O8o6Nj8J34m2J29
$$ y = [130, -19, 18, -40, 106, -196, 135, 47, 70, -5, 195, 138, -116, 258, 141, -30, 26, 173, -18, -135, 153, 118, -85, 204, -213, -121, -111, 53, -5, -119, -48, -112, -60, -77, 70, 165, -21, 163, 229, -98, 110, 96, 33, -228, -16, 2, -216, 246, 75, -187, -258, 81, 111, -195, 86, -20, -4, -171, 242, -40, -333, 206, -205, -88, -135, -17, -129, 39, 134, -83, -242, 71, 71, -236, -133, 80, 51, -136, -46, -61, -2, 161, -57, -68, 57, 145, 30, -97, 90, 191, -21, -351, 53, -14, -198, -140, 39, 1, -276, 52, -5, 7, -119, 175, -41, -204, 99, -112, 61, 87, 283, 14, -85, 135, 15, -204, 46, 79, 98, 110, 190, -138, -2, 65, 2, -98, -129, 23, -72, -92, 26, 59, -225, 149, -8, 21, 124, 223, 48, -4, -34, 83, 96, -53, 135, -94, -203, 118, 51, -103, 32, 58, -3, -59, 16, 100, -6, 66, 94, 33, -83, -100, 16, 29, 136, 49, 75, -12, 87, -4, 78, -54, -1, -24, -90, 8, -19, -94, 34, 18, -17, -29, -87, -79, -118, -29, -74, -6, -72, -67, -85, 49, 7, 136]
5046A36k30m5L0q2R0J96j91lK02n5j44J28m0J09l3j4m9J69L2k90J15o0m10N58
5070A19j85P3M0j6j78L8J13n6R4N2j12q4O7Q7j0P3q7P9j81J29L7j57J83j59q9
5095a30J57J59j73K8R0j39o7L07k76j29K88r3J53k54M4N9k92L80M2j78J20n2L7
5118H1j76J12J31r3j11K12j77J25J2j14k6n8K70j85r1M9P2q1J67j54Q6njp4N6
5143B7p3J21J60k12k18K21j43l3J50R0n9Lj09P8MJ23k19J84J20j84P4p6P5M2r6
5168E0Qk1p0K21k49O7j60J13L7k7pP6n5q3jR5k24K39R0n3j44N5p1K65j41Kl9O4
5196C7L2j45kR3KJ37j45j21j12K04L1r2j7K16k3l37L54pQn1K5m3K6J3L0j77J65
5223A01k8q2L8K1k04L0J61j20O4l4K7k51K30P6K8o4J01M1j68j08L4o9J16n6J55
$$ y = [136, -94, -139, -109, -191, -101, 95, -96, -99, 103, 48, -96, 32, -8, 101, 68, 54, 5, 174, 206, -84, 31, -29, -439, 119, -66, 7, 47, 31, -147, -109, 4, -52, 42, 94, -18, -102, -35, 52, 42, 115, 28, 107, -74, 55, 92, -65, 118, -41, -130, 27, 186, 13, 41, 131, -8, -75, 232, -44, -173, 115, 22, 175, -79, -35, 24, -268, 112, 154, -24, 96, 44, 81, -95, 17, 148, 55, -56, 156, -21, 104, 116, 2, -24, -82, 188, 3, -88, -39, 33, -48, 119, -35, 51, 46, 45, -29, 27, -46, 75, 235, 23, -195, 26, -117, -150, 0, 90, 31, 34, -75, 3, 7, 130, -89, 95, 215, 31, 105, 29, 104, 146, 50, 58, 37, -33, 188, -61, 6, -154, -41, -4, -31, -38, 38, -17, -100, -101, -6, -230, 9, 99, 46, -98, -43, -114, 151, 10, 12, -27, 37, 69, -76, -78, 15, 17, 154, 9, -112, -224, -20, 11, -81, -98, 118, 95, -242, 112, 105, 113, 62, 87, 44, 70, 83, 113, -64, 101, 73, -9, 29, 50, -154, -124, 37, -83, -19, -53, -26, -277, -47, 29, 57, -7, 94, 135, -33, -141, -107, -176, -60, -116, 39]
5248C9P4l23L16J5p6k1p8J20o3j01L06k63K58j79j55L7K78j25l1q1J1r6P2J73
5272A07j55K18M0k70M0o8J45n6J67k89K58m7j14J36l78K69M7J06q4r2M8o0R6l3
5296C1Q3Kj48r6K07o0N6r3n7J64R2j68j85M27k41j71O9J15N1j62J39P1k96K28
5320E8p9j08J68k0k3K5j04J95O7r4Q5l92J01K79j54R1rN9j36j7k1L8P7j18K53
5345B21k96N5J50n3k51J43K9l0J18r6J57k16K10j77K3J18k32m5J77j5o9J40J01
5368A62k33j22L36k76K2R6MJ16j65j36Q3L96k80m2J68o2j07J11j65K81k22l5O9
5391aj2o7j24K13P4j79o5K66j71n1K53J44l71q1K00N7j84K4P6j19K93j60J09k42
5415a18J31R4r6j62J22r3J05K2M4k52J44L2N5Q6o1j96P9Q0j31o9K1M61k97O9P6
$$ y = [39, 113, -210, 106, 121, 45, 24, -54, 66, 3, -98, 208, -55, 203, 24, -131, -94, 184, 59, 28, -53, -42, -138, -66, 107, -48, 170, 210, -60, -20, -88, 57, 1, 168, -121, 137, 90, -24, 112, -266, 3, 50, 156, 72, -20, 28, -32, 64, 31, 114, 116, -32, -128, 79, 19, 75, -18, -75, 89, 181, 13, -172, 255, 14, -157, -88, 27, 78, -84, 55, 126, -170, 58, -21, -129, 39, 19, -4, 21, -83, 112, 179, 85, 170, -222, -121, 158, 4, 95, 86, 145, 9, -8, -29, 9, 86, -32, 221, -75, -20, 130, 77, -174, -31, -2, -32, 86, -10, 147, -69, 141, -36, -13, 105, -127, -172, 5, -10, -79, 61, 162, -71, -193, 143, -133, -111, -15, -11, 105, -60, -196, -113, 283, 3, -39, 129, 67, -40, 71, -94, 187, -35, -70, -1, -13, -80, -204, 9, 83, -96, -161, 105, -66, -117, 136, 280, -91, -172, 28, 85, -99, -75, 1, -118, 175, 15, 124, -118, 13, 107, 11, -151, -29, -122, -17, 5, 49, -203, -59, -27, 28, 114, 53, -143, -64, 16, -115, -184, -163, 298, 1, 70, 146]
5440A46m0l7j08K6jk04K37K3n1J12k12J79Nr0J94l33J08M2p6K35qj24k02J32J37
5465I0o3Q1j91K6j27K69n6j30J88r3j07J87m9P7p9J5j33J45k6K3M1j28J77l07
5489a70K00j88K71o5n0qN0r3m0N8M5n9K4m9j02N2K77l5j02k23J43j04J80Q9n0
5514E1LpR0j2r8O1j44N2k9r4J52j3j21O1lk3l1m7J63n7NJ09k08J33K39k47R2p6
5542AM7O3j01j44R5Kq1K69k08Nj9J73J11l28J56l5k7j19j8J68pj55L48m28K36
5567Dq2p9L0Q9R0j41J4Q2K9j12j02L39j07o7Or0j5K10l01qK84Q4j79j54M5L2J97
5594I8K5n0j7Ol0p8J20o4j0j22L30O3l84J71L9j86K7o5m7J37N0J76q5l1j28J52
5620I7j49R0j99L77r6k91J13P7J00q9q2P1J80j04j96J28n0J39k56J35Q4j48N3
$$ y = [146, 106, 69, -39, -13, -14, -218, 19, 42, -9, 103, -109, 70, 75, -15, 179, -154, -46, -4, -80, 155, 147, 23, -179, -47, 90, 27, 108, -83, -57, -184, 85, 29, -101, 87, -6, -113, 74, 25, 102, 23, 38, -95, 50, 24, 47, 88, -40, 137, -170, 30, -158, 113, 48, -2, -10, 40, -53, -93, -35, 10, -49, -25, -74, -176, -124, 153, 118, 16, -207, -64, -168, 12, 101, 51, 54, 47, 137, 125, 27, 88, -56, -4, -33, -127, 25, 12, -109, -48, -51, -74, -105, -152, 11, -46, -41, 68, -140, -7, 232, -15, 77, 1, 48, 111, 10, -134, -39, -37, -118, 151, -57, -52, -71, 102, 213, -115, 41, 6, -21, -140, -158, 10, 3, -152, 196, -232, 4, -78, -157, -127, -38, 52, -89, -75, 7, 36, -76, -178, 161, 54, -13, -7, -97, -112, 98, -203, -211, 73, 157, -22, -176, -131, -99, 98, 123, 73, 56, 62, 32, -46, 74, 10, 0, -122, 208, 271, -113, 58, 97, -89, -62, -127, -174, -37, 13, 189, 104, 73, -55, 97, -52, 38, -161, 216, 120, -171, -58, 19, 119, 30, -52, 19, 199, 95, -101, 27, -23, 116, -140, -5, 79, -69, -16]
5643a6K7r4l1J75j62K85l03q0J30J46J60l20N1J8j53J27N0j06o3J46K30j82j31
5666i6J39Lj65N9M0P0l7j18Q8j2o4J64o2J20O9k95%J70j5p7J2OJ87k43J71j35
5692b1j28K3R1J75j73J56j45M8k4J23j93O3Q2rr6J08n8l1J09q3r3NJ05k4L2l16
5718b74K82on3P4P9l67K56L12k63j6nL14m24K38k13M0p9J98j79kj53M93m06M8
5742a06P7O0j0k60K75j85J58o4J05j16K18o9j29l5O2N0n8K7N4Q7k34oQ0k7N1J2
5768A7p5l9K23j75P3R6k53P4Q9Qr4Q1Ok36l3J69j39K8J27j25K54m7rJ66l30J48
5794Dp0o6L15k31l6m8J33m9J7J4J56j94J41P9j44k6k5K3m0J0J5j9j46J08J26j08
5820f1K8P9q1o1j3J01K8j80L2J65n8N2J0o7J1K4O6k09K26K8j63o4K50j26j6nq2
$$ y = [-16, 11, -83, -114, 61, -101, 184, -119, -199, -69, 77, 237, -83, -32, -14, -167, -40, 10, -96, -159, -13, 217, 35, -96, 43, 46, -119, -60, -20, 50, 13, -105, -17, -29, -93, 71, 9, 129, 198, -97, -97, 73, 58, -19, -7, -1, 186, -57, 114, -21, -149, -126, -35, 140, -33, 123, -22, 26, 2, 125, -68, -5, 77, 68, -28, 80, 22, -9, 100, 17, -76, -71, 34, 10, 42, -274, 8, 2, -51, 23, 102, -265, -9, 303, 40, 24, 19, 333, -91, 147, -66, -26, -105, 93, -86, -88, -241, 252, -154, -106, -29, 31, 21, -239, 36, -149, 9, -55, 50, -66, 152, 83, -46, -81, -19, 31, -27, 0, 54, 141, -93, -99, -19, -46, 5, 17, -58, -97, 126, -49, 24, 120, -133, -59, 30, 38, -56, 25, 31, -205, -238, -69, -208, -180, -53, -178, 76, 29, 20, 186, -144, 4, -66, -132, 183, -48, -84, -132, 1, -48, -31, -17, 139, -55, 86, 165, 21, -5, -30, -7, -47, -37, -22, -41, -187, -79, 47, -61, -33, 46, -35, -96, -109, -8, 20, -160, -128, 37, -21, 31, 41, -26, -15, 9, 75, -134, 92, 120, -43, -107, 143, 17, 1, -4, -86]
5847h6K9J83n8M0j59J04J28j89O1O2j23p8L2m4K07k31J63M6j38N3j43O1j3K12
5871A19j31J7J51K6l3k01p2J31K32j73j04l4Q6P2M0q8m4j29k0K89k93J74K0n8
5895b3p8k8J94j21O8j43L02j76M5n7K55k57M0J75k73n8K33j17j5J44k75J56J60
5918A51m1p2K6J38m7l13K34J75k19o3K11j09k36L10k28o3K04K1l6j8J18p9j90
5941a26R3O6Q0m7j05J07rO7o3j1j58J64J7j52J79j55j7R0K14j57j22J96n7p6j4
5966DO1k32J92R5j19l6J36K0n6j14k2J56j37J07j52m6rn4K13m1J70K5J9j43P1
5991A08j01j62O4K03j15J18m8j90J25J16j56Pm5Q2j86K46j58K45j36Nj56R7j69
6014b06O06l88k4O5j72K80k03J35l68L24n4p7K52j04kk5j82J02R9n1r0M3Lm4J52
$$ y = [-86, -57, 126, 68, 108, -51, 53, 181, -8, 53, 115, -8, -86, -54, -98, 109, -122, 41, 87, -51, 2, -141, -80, -93, 119, -12, 5, 156, 182, 149, -52, -124, 7, 239, 66, -38, -72, 14, 86, 126, 38, -6, -135, -155, 134, -159, 15, 35, -23, -101, -129, 65, -56, 12, -131, 171, -5, 40, -17, 238, -19, 21, 196, -77, -135, 98, -19, -34, 110, -165, -9, 151, 110, 38, 64, 202, 155, -158, 76, 251, 32, -31, 180, 71, -165, 145, -83, -146, 58, 79, 43, 25, 143, 64, -126, -33, 33, 113, 66, -39, 68, 59, 126, 63, 52, -106, 58, 75, -77, 102, -53, -70, 20, 234, 77, -45, 151, 94, 18, 4, 65, -167, 25, 120, 1, -35, 101, 121, 65, -49, -71, 85, -52, 55, -97, -143, -152, -206, 7, -34, 136, 161, 180, 37, 108, 7, -155, -91, 112, -3, 115, 67, -123, 2, 118, -38, -31, -76, 6, -180, 66, -92, 153, 17, 22, -134, -37, -206, 400, 12, -12, 53, -119, 161, -42, 93, -275, 49, -5, -82, 170, 66, 64, 39, -143, -41, 58, 7, -83, -40, -37, -81, 71]
6039G1k49J33J39j12j4K23k23j63J85m1K19k03K01J6k00KJ4j65K12J00k47J57
6061E5q0J18N7k08O5K67l02J20j04K56n8n26N86m51J8O9l1k9L19j69N7ol1J2l8
6086c4j07J57k1m6J51j46J43j12N1j21j4J68J13n4J0j28k99L93j43lQ7p0J45k23
6110a03J72R7k45J31M6k75J81J42j16p6MQk8l0L09j57RjJ9r6J26j42M5j7L02l37
6136c2q4O0L73n29J72J01j95N4Q6n1k0m1N4J59j31K0P5j19k6K07k55J60J9j67
6160a10R4J02j84PJ26j78L76k87N3J6k01J56R0r8L7R8k19L5J72q7q6jJ42m5m6
6185c8N2N5j71K24o6r2L4O1j63K3M9R0r3N8n0NQ0l1p5k4K17p9o7j8pl3j37J95
6213aO2k78J85j10R4J08j44K8O1K0n6J89m2l32J14Q3r0M7j7M6J23L8rj45J55j43
$$ y = [71, -178, -45, 94, -18, -32, 191, -32, -195, -10, -51, 168, -35, 166, 182, -18, -16, -2, -167, 45, 145, -102, 55, -25, 93, 150, -58, 7, 274, -28, 92, -12, 244, 186, -340, 246, -205, -187, -118, -149, -178, 141, -28, 29, 23, -8, 4, -34, -141, 16, -5, -51, 100, -46, 97, -15, 36, -85, -99, 69, 182, 128, 138, 10, -289, 104, -39, -42, 45, -25, 120, -103, 69, 166, -79, 52, 98, -177, 4, 146, 30, -46, -42, -34, -62, -92, 217, 60, 69, 68, 87, -9, 117, -25, 20, 3, 305, -32, -116, -56, 317, -212, -40, 61, -134, -80, 6, -45, -65, -106, -52, 107, -24, -4, 71, -48, -74, 133, -122, 38, 57, -110, -16, 86, -98, -91, 35, -143, 233, -54, -1, 15, -186, -30, 60, -38, -1, 97, -122, -87, 85, -2, -88, -89, 53, 8, -38, 14, 69, -102, 122, 56, -36, -2, 59, -104, -81, -32, 58, -35, 23, -27, -22, 58, 27, -48, -72, 145, 66, -1, -19, -26, -59, -196, -1, 61, -217, -32, -142, -48, 60, -84, -56, 5, 25, -31, 158, 116, -216, -102, -19, -109, -62, -79, -33, 90, 128, 119, -26, 129, -14]
6239a4k0O4j58J13j5Q1m0J57k1qk15K6J15m3J29m6Q7l9o3K3j93r2J51J99j43J19
6265A54q2K4p1r3j14k8J65J13q8N0K07k00r2J8j50J65j1P9K1k30K47o0r3P9L2
6290D2k41J65O2j27J88k70K35j35Q5m3pJ34mj28j9J67r4K05m07L13j18p5J52j64
6314h4P4l5K19l19J95k32J70J8J19k04J03k22K77K3j38K01o1k58L0P2Q9k89J88
6337f4J07p0m3mK5Jr2M4K83k54K50j33k05R1O2Q5M8n4r7J30Jj73J51j75m8L0J8
6364h6K03j94K25k65J98n2j23k1J0r6J38N7l3J09J11k09N9R5nj20n2LL38k69J74
6389A95j10j89J55J08j31M7q6p1J3o5J31L2nO0k49L41q8j20m5j51O2J36j8K80
6413B32j66k84J93j38J21j0Mj31J57J09K6N7r1k2o3k11M71k24j58J68M5n1J6L8
$$ y = [-14, -34, 30, -128, -15, -30, 51, 11, 168, 147, 139, -76, -50, 65, 22, 151, 105, 192, 153, 90, 113, -80, -172, -21, 178, 35, 154, 72, 96, 25, -68, -182, -210, -45, 68, -20, 30, 237, 37, -55, -37, -187, -22, -33, 46, 67, -163, 84, 24, -69, 10, 42, -199, -34, 28, -99, 89, -181, 54, -81, 4, -39, -46, 88, 84, -44, -63, 104, 10, 215, -192, 121, 3, -72, 80, -84, -10, -45, 174, -145, 50, -182, -12, 6, 125, -79, 24, -198, 79, 102, -36, 165, 104, -154, -124, -52, 37, -252, -64, 43, -27, -70, -74, -49, -48, -140, -96, 187, -67, 183, 50, -155, -64, -2, 83, 131, 77, -20, 110, 111, -62, 89, -86, -134, -104, -86, 117, -77, 148, -117, 81, 29, -94, -115, -105, -201, -63, -6, -39, 70, 181, -28, 31, 126, 121, 1, -51, -48, 290, 21, 195, 85, -104, 51, 159, 28, 75, -11, -82, -69, -134, -3, 29, 24, 84, -165, 176, 88, -32, -77, -228, -166, -30, -48, 232, 66, -218, -25, -163, -42, -52, -48, -179, -22, 87, 113, 170, 79, 57, -6, -217, 254, 30, -128, 40, 85, 34, 50, 88]
6437H8j44K1J77j34k3k54J76J76l01J33J52N9m2N7p5R1j80J6Q2r2P6k20K28Qm1
6462C4J65j14k37K61k28K48k84J08qp4K03p6J99k24L5J4m3J3J94j14j81K00K2
6485A13j5k54Q2J55j5K52k90L3Q7j84k7K08k6j24Ml0Q5k5p4l7J71l5M7j74K41
6510A68l84K31R4L5l0k65K02K6p5K91j45q9o6K50o5k54L5kJ44q3R0k30J20K8K6
6535E2o7k5r8KK45n9j42K11j43M9N0J51j77o1K1N7O8k15K78k09r5NJ14r4j7K63
6561A64l11J96k11Q0R4j34Q9j7l6J10l4j34L74j23n0j13p4J12jq1j14K09J6k31
6585b20J35k5J74n6RJ14K9q9j12j42K35J20j98J43j33M5m8K16r7m1P1lk1j05n
6610dj46K68j00Rk4n1R6K7k16R8r5R7L26l52K25o3J1j72q9J56m3O9N8m4o2N0j07
$$ y = [88, -56, -35, 142, 8, -15, -269, -93, 83, -218, -85, 67, 126, 84, 141, 66, 157, -23, -7, 75, -17, 59, -161, 67, 75, 34, 199, 85, -152, 109, -119, 129, -155, -47, -55, -129, 74, -2, 197, -27, 8, 22, -21, -8, 186, 72, -109, 91, 113, 98, -156, -74, 81, 66, 318, 28, 61, 148, -36, -63, 145, 119, -5, -1, -31, 54, 29, -45, -82, 89, 54, 101, -73, 168, -216, 15, 109, 144, 114, -151, 51, 77, 2, 293, 148, 59, -7, 243, 178, -76, -41, -43, 101, 18, 108, -122, -2, 26, 52, -15, -40, -138, -136, 109, 50, -92, 119, -24, 25, 75, 226, 49, -12, 9, 66, 134, -81, 197, -12, -107, -102, 12, -82, -99, 164, -147, 49, -162, -82, 12, -122, -33, -50, -86, 24, -10, -144, 230, 107, 57, -56, -130, -18, -19, -100, -214, -5, 11, -220, -85, -110, 64, 8, 17, 131, 160, 71, -41, -183, 52, 172, -26, 117, -16, 29, -19, 197, 100, 59, 130, 127, 106, 1, -4, -150, 118, 18, 27, 3, -48, 48, 75, -141, -43, -138, -41, 285, -67, 158, 95, 106, -66, -155, 1, -42, 27, 85, 41, -21, 29, -78]
6637g8J25p8Q7m1j80J72N0j13J03pJ5L7J0j59K7qJ99o5l8j38J47p1r3J5O2O8J8
6664F6q2J47k54J73n8j60J42J43k21O1RJ84j10l8k9J6M9j17K39k10KO0j07Q4R1
6689H0k66K41j51K10k41K85r3l6P1k46J87j71l5J28K41K8l80J25q8N6J13M7k4
6712H1N2r5k09L62j93k04J33K10L9L4k13j77J91j61J11j39J01qM3R7j10N1n0J20
6736F6O3k71O3n1N6J12m8n1K04j73%N7m4P5j75j48J21j19L30q5K9m4j26K1J90
6761E2j05N5PK5L0j80j24K79R3q3M8j26o7J45q3k0K8l6l4k1K25k87M9K57o6O1
6787A22k22M1M8J09j84J33j12J38p0m4N5j73K61P4j05k8m5O2K7k12J97j66K06
6810A12j15Q8jq8J16k78K16P9Q3k43R2k1j26mJ01N6j84j02J73Kk6Q8j34K57o9
$$ y = [-78, 47, -31, 56, 15, -165, 7, 57, -56, 47, 40, 55, 92, 102, -57, -30, -38, 161, 96, 58, -80, 67, -4, -97, -82, -20, 48, 66, -16, 131, -123, 50, -8, -168, -26, 117, -104, -43, -34, 150, 40, 2, -27, -11, 38, -79, 160, -50, -48, 12, -95, -11, 80, -186, 55, -96, 114, -127, 158, 65, 29, 100, -146, 41, -130, -165, -37, 204, 232, -148, -23, -111, -55, 58, 105, 81, 133, 38, -171, 191, -2, -206, -73, 137, 176, 210, -3, -180, 11, -150, -39, -178, -77, -85, -42, 55, -55, -4, -54, 66, 129, -142, -79, -130, -74, 38, -10, -61, 143, -30, -30, 27, -17, 58, -117, -265, -144, -263, 67, -18, 11, -33, -159, -138, 52, -53, 2, 9, 34, 64, -116, -240, 39, 132, 49, 97, -29, -96, 49, -34, -54, -26, -62, -96, -117, 108, -179, -130, 127, 61, 122, -100, -59, -11, 98, -86, 47, -65, 73, 3, -41, 14, -159, 102, 176, 71, 43, -2, 60, 87, -125, 72, -94, 112, -3, 85, 84, -4, 112, -166, 50, 129, 212, -31, 61, 40, -86, -90, 11, 67, -117, -219, -46, -44, -70, 18, -116, 141, 72]
6835G2j08n9J21m7n0QK3k8R8K5J47k51Q7k84K40N0n0n7J0j5oM2O8j11j11K84j42
6862d4Q9R0j55j26O4pJ13j02J84o9J9j49N3J88k37N6J12j14J83l16M9J04K8m6
6886c3l0J23J06k64K36j83m2j23N58l46J16Pk65N8m5K01L1O8k45J70k7J03k30
6909e6R0O3n0J8j71J03j31RJ70q8j42P3M6Q6k69J64M9p9m4J97p2J93r1l39L44
6934G3j03J39k45P3K14j89n3J2N8Q0p0j29J35J40l12J18m7R1K0m9R5j05K67j56
6958E7j50J62k25Lj03J87J66j48k5m5K3MK03q1j2k5n3R1k56N8O9J61k17j00K19
6983c7QJ26k21J28p4R5m8np3Q7J63J02k59p1K00j06n9J94j88K05l48R7M6J26r2
7008dK37l51K8J9j0J34l4O3j16k2J17lk14K04k03K02p0K6O1j23J94k44R5O3l6
$$ y = [72, -36, -95, 26, -21, -71, -63, -40, -68, 30, 55, 202, -49, 38, -246, -6, 44, -6, -63, -53, -68, -74, -32, 36, -75, -186, 98, -44, 45, 135, -20, -146, -82, -89, 24, -78, 106, 37, 56, -93, -40, 148, -89, -33, 79, -35, 148, -168, -119, -15, 13, -33, -63, 60, 166, -98, 138, -45, -87, -210, 348, 2, 118, 125, -140, -82, -127, 74, 105, 173, -72, 98, 71, 174, -56, 34, 97, 47, 65, -106, -3, -134, -125, 45, -43, -185, -112, -66, 20, -249, -85, -36, -115, -159, 38, -34, 159, 68, -271, 73, -30, 109, -136, -63, 151, -38, -91, -79, -21, 59, -11, -140, -5, 135, -177, -59, -106, -15, 5, -44, 51, -54, 213, 57, -93, 69, -156, -153, -256, -69, 97, -51, -76, -121, -98, -94, 109, 28, 16, -9, -62, 29, -227, -169, -100, 61, -156, -256, -37, -29, 97, -124, 4, -70, 25, -23, -28, -101, -14, 149, 251, -8, -79, 121, 15, -44, 150, -38, 167, -181, -84, -38, 88, -4, 233, -118, -90, -71, -81, 53, 19, 82, -34, -56, 61, 58, -156, 48, -155, 47, -23, 3, 64, -59, 135, -109, -14, 49, 13]
7033A3l6kjrj24L74k62m4MO0p2n3J64j35L0j21J34J64L3krk24J97j83mO1k2R2
7061B3j65J97K61k81M8PQ3k95J14J56j83P7K3k63K38r5J14j62J57K3j19k8L96
7084C26l30o6p8K39k5j01M9K0K3j08K1N1o9R3j85J39J95j77Rm2L6j8l4o0j51J46
7110i7J21J93k33l4l4l8N8J19o0n6L1J7r7J63j25J32M6r9J34j43J27m7j17P1J22
7135A54j76J38J0k87R1k11L14K4j17J51J0j57J90j17j53J22J12m7m9O3n5p4R7
7158C3J05o6j17p2J27k6j09P0J02o7l5L3m4k2p3M46k80L2K31l96J33j5L1k6M0
7183C5P2l4j37R5k06J89P1j33K33j65j8j5j40J64J21l46J60M4J35k47p7J83j06
7206a22J69Kk36J84J8Q9p9p0Q7m4rM0m0j71kK76o1L6m7q4K5O1K1N4j56l9J72k5
$$ y = [13, -23, -25, -26, -35, -159, 215, -47, -91, -87, -27, -99, -152, 12, -123, -93, -214, -80, 84, 117, 115, 106, -118, 79, -104, -108, -47, -69, 23, -142, 55, 316, 35, 83, 90, 173, -122, -8, 148, -35, 42, 65, -198, 40, -55, 59, -103, 54, 77, -42, -70, 326, -4, -70, -148, 91, 66, -35, 14, 34, 57, -51, -30, 21, -48, 45, -140, -1, 194, 17, 26, -16, 20, 2, -32, -92, -243, -97, 24, 217, -16, -50, -84, -122, -64, 55, -5, -61, -30, -13, -110, 53, -72, 60, 106, 7, 141, -2, 125, 78, -39, 32, 154, -22, 116, 126, -161, -70, -281, 33, 57, -60, 91, 101, -56, 134, 17, -136, -14, 98, 51, 2, 65, 10, -64, 33, 138, 72, -45, -117, 10, -16, -125, -55, 47, -20, -55, -22, -66, -88, -161, 285, 5, 37, 268, -128, 5, -10, 21, -5, 35, 107, 73, -64, 31, -175, 14, 85, -48, 185, 20, 2, -13, -153, 11, 132, -214, -54, -10, 125, -122, -199, -16, -122, 47, 49, -187, -3, 15, 104, 25, -45, 42, -2, -11, 29, -11, -182, -184, 92, 31, 67, 20, -64, -39, 22, 43, 97, -59, -98, 74, 49]
7234D9j9j94n3K36J50k06k8K18k8k24K64j55r2J11j1Q0k2k36J58l1l3J86j86O1
7258ej03R6j5M4K8on5lK2O4j43P2Q9mp1Q2p7J79j18k22N7J95r7N4K05l63J79j84
7286a00J01K07k01K06j07j50J45p5j84J81P1k14J87m0j78N8k2N0n7j49K29m0m1
7309a23J09qk7J09pl7j60J62j75R6p1P7O8kJ25m3O9j76M3j51M9K05l7j32K11j48
7335B6r4K02k53L10o8j92Kl9J06J47j07L1Q1k75K26j99R7K03k79q5J93rn1J58
7359A31k00R6K3j82K03j89K38r7K7O7j39kJ47o3k5J39k08n2J4J90o2l9n4K01j89
7384b5L9o4O6r4J17O6j7j46M0pj44J62l9mM4m5J14k21K09j13j13K37l5j53K23
7409I7L7N7j97J8o7J41j83K52n0j88O4J08J15k98P4k5M8n4l9O0J92j78K5n5L6
$$ y = [49, 30, -164, -217, 19, 169, -37, -65, 153, 125, -99, 165, 10, -82, 29, 18, 98, 76, -160, -2, -33, -66, 120, -66, -5, -108, -12, -27, 17, 45, 39, -16, -19, 3, 67, -76, -4, 85, 81, 10, 92, 15, 194, 76, -146, -89, 106, 9, 63, 268, -95, 84, -100, 1, 208, 7, 213, 106, -44, 101, 26, -158, 23, 94, -120, 67, 27, -151, -93, -115, -65, -122, -271, -42, -82, -123, -14, -22, -49, 60, 53, 16, -144, 18, -157, -61, -132, -55, 13, 11, 136, 93, 162, -14, 29, -122, -73, 132, 95, -37, 174, 26, -68, 134, -119, 191, 123, -69, -67, -106, 0, 147, 40, 71, 152, -123, 103, -96, 1, 204, -75, -160, 33, 24, -27, 131, -69, 27, 50, -132, 71, -118, 120, 23, 50, 117, -22, -24, 123, 60, 35, 174, -34, -86, -72, 118, 56, 17, -37, 164, -25, 14, -50, 16, -78, 39, 105, 88, -58, -18, -25, -169, -7, -46, -50, -6, -51, 63, -158, 51, -62, -175, 62, 27, -126, 97, 134, 191, -6, 12, -55, 86, -97, 155, 105, -83, -19, 89, 204, -94, -20, -45, 3, -51, -90, -30, 162, -16, 9, -46, -10]
7434a0K03j83j68J56J12j18j23J35J1Nm1k19J13J32o9l4J11J05l2m1n5J1q1J44
7458F4k64K55j40J04n6o2oJ64q3P2O9n0J62j51k6j48K2o5O6m7J89n0j54M6Q0K6
7484A7j13L72l38N5l4j43J04K26j44M1p4L00k62j94R6J7R8qr4J17m3r5L3L0M3
7509Gj5k0l4K8K7n2J50j48L9O0j68M2P5L5m0M1n3k94R8J98J30j34j57K76j9o8
7535Dj41N9p9J83J87q9p3p2J20j71l3KJ15jN0J5l2l16L23j02o6J90K48k18J54
7560B57m11L01k30k9O4k5J36j03J60nn6j23J6oq8K47j63j30L60k52q9J38K42m32
7584b21K51j42K02q7J72k43P9p1r4J56M5M8k59J64J33r6l2p4K0M8M8m9M2OJ19
7609A65j88P6o8o0p7L19j25m6n2L5J05j05J85m08J72K07k86P6J71M2M5l28J43
$$ y = [-10, 193, 10, -158, -2, 110, -8, -131, 4, 15, 20, -21, -240, -127, 5, -64, -98, 13, 118, 86, 45, -10, 1, -80, 64, -200, 55, -85, 19, -37, -99, -105, 59, -24, 48, 117, 67, 229, 78, 52, -96, -74, -139, -73, -120, 69, 19, -135, -89, -9, 17, -96, 276, -62, -7, -41, -184, -80, 146, 2, 43, -31, 269, 7, -187, -91, -74, 24, 16, -78, 39, -4, -99, -66, -36, 7, -8, -28, -62, -34, -7, -59, 91, -57, -18, 42, -126, -84, -9, 26, -14, 27, -26, -320, -222, -24, 106, -28, -185, 91, 72, 4, -137, -78, -157, 26, 213, 124, 51, -21, 99, -72, -105, -103, 12, 11, 61, 76, 44, -272, 51, -51, -117, 73, 321, 103, 257, -154, 147, -83, -112, -48, -73, 63, -40, 120, 115, 59, -64, -48, -54, -142, 105, -58, -188, 172, -80, -169, -31, 211, -221, 30, -112, 90, 3, 175, -68, 11, -60, -154, 2, 47, 95, -164, 0, 133, 37, 5, -69, -49, -1, 47, -2, 40, 46, 165, -23, 53, -15, -75, -152, 167, 42, -4, -56, -21, 84, -21, 164, -244, -72, 135, -151, -75, 96, 138, 183, -145, -2]
7632bQ0j24j00M2K36j56j13K62p4k5J28p4j27O1J2p2J78j40J84q8k27J68j64J89
7656E4n1o9l8P6L5P6o9K2m2j34L61k77n3n8L9J90j74K7J69m5Kq5P0j15J8Q1Q2
7683I2l4j11Q7n2m4Q3Ll0J5j7k6J92k49J98l0j06J19l4k41K86j50J99m7j51J05
7708E7m5j25J50L4j8O2n8kQ5k02M6J21L9k00J90k22J79o6R2j81p6K85k66J59m6
7733hJ88k36J47j97m8J24J28L9j06J12j58L4j59J95j10Q3j9PM3jJ11j45m4l2Q8
7758C6J57j04k67L41j42j16P6j02L7K6K54j66r2J2j61J30J46Q3j62J94K8k31L7
7781A4j78L44j85Q5j74N9j18K27j09j9Q4p1j31K18k7M8mo6N6j11O6k09K83Mp5
7806A1O3r9r9K31j5k35N6J02P7l2l3j02J63j51K8L1o5k8k8K55l32K82J06o7m5
$$ y = [-2, 78, -46, -146, -104, 132, -24, -137, 125, 51, 26, 154, 80, -47, 14, 26, -46, 132, -8, 176, 88, -139, 29, -135, 54, 3, -66, -104, -28, 7, 83, 14, 36, -6, -140, 221, -56, -109, -167, -128, 62, -112, -85, 84, 39, 41, -44, 26, -89, -71, 10, 92, 58, -53, 34, -18, -62, 21, 24, -6, 9, -8, -34, 158, -91, 107, 77, -29, 90, 56, -185, 101, -49, 150, 103, -48, 57, 12, -113, 37, 71, 53, 115, 57, 55, 140, -62, -16, 105, 144, -56, 134, -88, 91, 25, 117, -64, -140, 145, -121, 38, -8, 180, -56, 91, -106, -154, -30, 98, 137, 31, 143, -15, 19, -140, 55, -55, 28, 9, 16, 59, 58, 169, 24, -20, -52, 36, 193, 89, -178, 163, 21, -95, -19, -121, -84, -58, 196, 30, -62, -50, -211, -81, 65, 148, -14, 180, 208, -23, 14, -164, 180, -5, 80, -94, -35, -153, 74, -35, -54, 30, -41, -172, 46, 19, 67, 63, -3, 53, -58, 8, -201, 82, 86, 11, 74, -25, -124, 107, 92, -143, -87, 15, 92, 60, 27, -75, 88, -63, -35, -4, -69, -97, -125, 130, -202, 80, 186, 119, 74]
7831G4R6k17l2J22j03N8O3j89R7M1j19P7J65j09M4l4j01k1J30p9M2J41k35J1J2
7856f6Q3m6L8q1Mq9K2J83k04J94N0r7o7q9J46j9Q3m9J06k49O3J13j08q4J99k27
7882a91J19j55J14R8J59k62J87j37N1l6j44J28J64o7m4L6N8J8k20J38J56j49M1
7905F2q4N3M0m6k36J52K06j46n3J82k1j85j55K49p2J07q2J0J8J1j20J27r4K0M8
7930il4N4j60M5L37j98j07K43q7Lk8j0J44Q2l26J09p7J09j79kK38j98j27L21k10
7955f7O6N2j46K9M9o1K76m0k69J17m4M3J17j02J17r3j47L0J04L2l45K15R7r7J77
7980A10M4P4k8l72K59j8l5J75j06r9j99K54P7j01j15J08m4j8J16r6L0M9Jn4M5
8005E7j92L14j81j08P9K05k29qN6jj41j5K7J35pL7M0j28k3Q7P3q2j04K45j45m2
$$ y = [74, 170, -47, -79, 43, -60, -2, 61, -128, -31, 10, -109, -32, 133, 24, 68, 34, -67, -88, 42, -37, 5, 146, -89, -78, -66, 17, -29, 9, -72, -68, -157, -135, 48, -156, 38, 88, -9, -76, -165, -19, -38, 45, -4, 102, -147, -84, 29, -79, -163, 36, -191, -72, -227, -113, -15, 144, -118, 69, -68, -17, -53, -197, -69, 95, 28, -16, 20, 78, 96, -124, 14, 170, 21, 62, -22, 31, 71, 25, -211, -59, 147, 1, -52, 130, 109, -76, -231, 18, -54, 53, -29, -19, -1, 10, -110, 17, -77, -57, -9, -43, 11, -149, -104, 233, 35, -72, 171, 84, 87, 59, 49, 193, 275, -51, 58, -19, 90, -89, -91, 147, -51, -178, 143, -67, -1, 51, -95, -66, -17, -78, 198, 158, -111, 6, -38, 5, 122, 20, 137, 44, -103, -73, 31, 63, -282, -67, 30, -67, 110, 154, 228, 200, -172, 87, 69, 34, 209, 103, 4, -195, 59, 136, 35, -80, 28, -16, -34, 82, -14, 16, 65, 66, 12, 57, -135, 179, -2, -110, -31, 174, -55, -63, -7, -8, -149, -164, -137, -2, -9, 28, 68, -60, -83, 4, 77, -5, -109, 136, -9, -51]
8031e1j10J58j65N8K87k3j84J20j01M0J4l5K7k35J39r0J20j11J01k0m4J87P7j61
8055bN0n2J0J62l51K71l8j6N2q2N6o2r1j2J10j56N2J77k2ML0j0%k74P4K0K01j32
8083c1j2j6n4K9o0K22j79O3k4J8J04q5o4P9L46k51j72L18K9m37L01j70q6J04J13
8108H5r4l6J11j87J08l4K0j96L16l8r8q8N7J05m8l7n9J55m0o8O2o1K38j74R0n2
8134C7L4Q8j08J02j49q8J95j58M6j20J91m5Pk79J26O5J04j29M7n2M7P5k30L97
8158B03j47j60J11rJ1m5k1L0o7L31k79O8J06k52K30j25m6K7Q1p6M4J24l17K07
8182B9m4Q4p2j03j8J36n6L9K4
$$ y = [-51, -161, -3, -168, -110, 177, 154, -30, 90, -11, 29, 43, 8, 35, -200, -61, -151, -31, -142, -41, -61, -105, 82, 159, -2, 48, -4, 6, 168, -183, 88, 50, 34, 86, 4, 60, -2, -93, -105, 5, -151, -99, 78, 56, 60, 90, 80, 80, -194, -120, -100, 101, -31, -43, -59, -113, -84, -144, 78, -101, -38, -62, -44, 60, -25, -89, -10, 336, 85, -87, 231, 260, -177, 124, -46, -132, -28, 85, -9, -45, 66, -121, -13, -47, -27, -223, 93, 55, -43, -131, -74, 31, -17, -54, -113, 42, 2, -66, -4, -65, 173, -1, 89, 37, 71, 159, 51, 153, 4, -84, 111, -47, -1, -121, 70, 25, 32, -247, -121, -56, 48, -81, -34, -86, -39, 36, -194, 203, 56, -104, 7, -2, 9, -36, -57, -27, -94, 237, -42, 26, 132, -120, 110, -15, -61, -34, 47, -29, 15, 139, -178, 29, -15, 69, -3, -106, -124, 12, -44, -5, 19]
8191A9
$$ Imaginary data points
##PAGE= N=2
##DATA TABLE= (X++(I..I)), XYDATA
0@%%%%%%%%%%%%%%%%%qJ6j6J6j6J9k7L2l2M0m8N5o3P1q3R5j08J21j37J56j75J96
39A04k19K44k74L05l36L71m12M56n02N55o12O73p42Q18q98R89j094J212j345J494
59G87j670J877k121K416k789L270l914M826o231Q759k2089Q8392q0710j12085
73a21282J56322J9319j52394M6925J35832j12907o8871J53685J606j44245R0089
84D079J03964j24325k6422J42860m0357j19903R0304O3345j39815n408J26915
95G5237p5959r6261J13635K4695j26072L6287J06596q5271n8893J22854K418j18618
107g9352O9361Q7206j06278j8858J22545l5187r6006Q6182N6321j15573K36J14127
119H4724o8565q6084J04866J8833j22551L3179R5029q4536n6825J11275J725j13246
$$ y = [0, 0, 0, 0, 0, 0, 0, 0, 0, 0, 0, 0, 0, 0, 0, 0, 0, 0, -8, 8, -8, 8, -8, 11, -16, 16, -16, 24, -24, 31, -32, 39, -44, 51, -57, 64, -73, 83, -92, 104, -115, 129, -145, 160, -176, 195, -217, 239, -263, 292, -320, 353, -389, 429, -469, 520, -574, 638, -707, 787, -883, 994, -1127, 1289, -1500, 1770, -2144, 2682, -3549, 5210, -16879, 71513, -9197, -121282, 35040, 54359, -98035, -51110, 84722, -28185, -97056, 56629, 58235, -86010, 4079, 108043, -16282, -42704, 100156, 59799, -60104, 30200, 93545, -46270, -51678, 75237, -722, -96983, 16652, 41347, -84725, -48438, 58158, -27113, -86006, 36848, 39266, -79352, -9991, 77215, -29063, -47921, 74624, 39437, -56569, 29613, 85934, -29639, -29403, 84724, 16159, -69925, 34941, 53774, -68777, -35598, 59431, -25105, -81930, 29345, 31070, -82176]
131h2176O0957Q6274j00320k4245J16870k8261r1696P8893N7592j01994l962J07754
143G5686n0954q2509R1787K6902j09077K3341Q6758p1317n6772R2391O983r9735
155f6516M2654P7436q3575k9211J00690j9750q1761O4377N2752q4375n971R2414
167E9164l8617p1612P8990K8319r4612K0285P7300o2801m7891Q0770L793q8057
179e4969L7469O7118p5498k7070R0307k0922p4830O1536M5172p8603k858Q3043
191D9895l5294o3650P2463K6442q6291K0224P3258n8798m3092P5438K674p9536
203d6267L3335O1197o8617k8330Q2727j7266p1694N4940M2349p2135l711P6194
215D2722l0402n9104O3725K9089p8138J4143P0168n1280m2175O9847N188p2727
$$ y = [-82176, -21219, 65055, -35265, -59510, 57360, 29099, -62597, 16296, 73888, -28106, -32068, 75686, 24732, -57777, 34010, 60912, -48165, -24824, 61934, -9383, -66155, 26236, 33219, -66516, -23862, 53574, -30001, -59212, 41478, 21728, -60033, 4344, 57096, -27279, -33250, 59164, 20547, -51065, 27925, 56244, -38368, -18083, 59217, -3584, -51475, 29295, 33088, -54969, -17500, 49618, -25880, -52950, 37357, 16435, -58395, 3141, 48313, -30290, -33148, 49895, 14601, -49049, 23414, 49856, -36435, -16211, 57047, -1751, -44843, 30595, 33269, -46267, -12932, 48265, -20352, -48682, 34045, 16779, -54915, 25, 42374, -29761, -33472, 42722, 12320, -46784, 16941, 46030, -32108, -17965, 52203, 923, -41252, 28595, 33783, -38944]
227c8944K7826N7365n9894k9399P4780j2610o9029M8170M1433o7177n999O9300
239C5822k6579n4597N6704K8712p0800J1009O6566m5421l9254O4729M802o5766
251c4073K6321N1280n3112k7509O6737r559o3776M2978L7840o2524m738O2809
263C2674k5399m9009N0246K5880o3599R169O1052m0870l7378O0852N568o1013
275c1827K4911M7697m8940k4833O1523p708o0465L8993L7767n9630n982N9979
287C1485k4336m7019M7398K4759n9356O074N8640l6803l7304N7694O937n9053
299c0884K3352M5835m4861k4066N6362m819n6436L4124L7138n5222q191N6875
311B9207k1613m4175M1947K3098n2683L570N3316l0842l6274N1615R041n3740
$$ y = [-38944, -11118, 46247, -13647, -43046, 31734, 19124, -49905, -1735, 39698, -27479, -33478, 35822, 9243, -45354, 11350, 40062, -30738, -19729, 46837, 1416, -37838, 26891, 31693, -34073, -7752, 43528, -9584, -37093, 29644, 20085, -43691, -713, 37127, -25397, -30135, 32674, 7275, -41734, 8512, 34392, -29207, -20038, 41014, 144, -37234, 23618, 29186, -31827, -6916, 40781, -8159, -32992, 28531, 20823, -39642, -649, 37118, -22512, -28494, 31485, 7149, -39870, 7528, 32287, -27069, -20995, 37645, 842, -36462, 21232, 28169, -30884, -7532, 38303, -6558, -30624, 25738, 20919, -35517, -1393, 35745, -19477, -27668, 29207, 7594, -36581, 5366, 28464, -24219, -20649, 32667, 1825, -34449, 17166, 26207, -27533]
323b7533K0573M1939l9944k1924N0623k980n0632K8707L4993m9753q951N2437
335B7555k0427m1747L9429K0872m9321K930M8782k7696l4703M8430R719n1602
347b7779J9467M1126l8118j9774M8118l111m6633K6952L4129m6562j0001N0394
359B8208j8711m0370L7344J9065m7305K648M4686k5393l3400M3579J0368m8760
371b8041J7147L9552l5724j8785M5066j877m2185K3741L2182m0579j0438M6870
383B6929j5286l8293L4246J8444m3167K232M0079k2823l1272L8468J0679m5988
395b5752J3680L7522l3615j8291M2378k379l9410K2206L0495l6695j0798M4306
407B3647j2406l6662L2862J8383m1134K496L8199k1441k8317L5059J0225m2537
$$ y = [-27533, -6960, 34979, -4965, -26889, 23734, 20754, -29878, -1171, 33822, -15931, -24882, 27555, 7128, -34619, 4810, 25682, -23639, -20709, 28073, 377, -34326, 14104, 23823, -27779, -8312, 32814, -5304, -25078, 23040, 19929, -26704, 248, 34377, -12185, -22186, 28208, 9497, -30873, 6471, 25536, -21769, -19121, 25565, 172, -33228, 10351, 20719, -28041, -10894, 28658, -7066, -25851, 19215, 17338, -24847, -1106, 31076, -9503, -19941, 26929, 11643, -26650, 7596, 26040, -17127, -14895, 25184, 2361, -28911, 9557, 20236, -25752, -12072, 25450, -8165, -26456, 15922, 13543, -25867, -3661, 26834, -9861, -20659, 23647, 11241, -25421, 7441, 25824, -15310, -12814, 25385, 3944, -24373, 10686, 20911, -21626]
419b1626J1948L5734l1851j8519L9516k775l6940K0268K7204l3686j0442M0559
431A9390j0411l4833L0238J8376l8048K415L6053j9785k6094L2332J0740l8840
443a8467R730L3920k8731j8280L7902j958l5756J9159K5351l1504j0442L7158
455A8082q933l4050K7561J8748l7415J430L5051j9033k4259L0636R855l5689P994
468a0022L3308k5803j8593L5874q34l3839J8467K3957k9308r402L4203p377l1346
481b0715K4269J7986l5140N06L2832j8245k2837K7670Q756l2383O844K9629k2711
494c539j7918L3574L4l1888J7630K1896k6956p625L1452o788k8564K2059J7762
507B1129l1813j22L1315j7247k1911K6794P532l0794N733K8055k1703j8121L1254
$$ y = [-21626, -9678, 26056, -5795, -24314, 15202, 12427, -24513, -4245, 22959, -10727, -21169, 19390, 8979, -25854, 4384, 22760, -15288, -12873, 23180, 3395, -22699, 9633, 20373, -18467, -8737, 25183, -3548, -21828, 16074, 14116, -21640, -2481, 22870, -8634, -19076, 18082, 9149, -24901, 2660, 21408, -16007, -14577, 20474, 1441, -22818, 7818, 17673, -18016, -10022, 23286, -2517, -21110, 14764, 13930, -19909, -1442, 22515, -6793, -16195, 18008, 10631, -20715, 3554, 21540, -13600, -13094, 19738, 1493, -21344, 6326, 15082, -17301, -10457, 19172, -3539, -21457, 12117, 12151, -19737, -2107, 19789, -7167, -14792, 16660, 9872, -18692, 3367, 21129, -10684, -10806, 20509, 3262, -18649, 8145, 15677, -15117, -9384, 18671, -3032, -21153, 10101]
520A0101K72l1409J6673K1974k6118p457L0068o028k6406K0724J7684l0144o49
533a0715L0887j5547k1546K6073P271k8991N746K5371j9345j7544K7759J527l0054
546a9108J4294K0770k5307p087K7797n443k4126J8123J7108k6746j188K8837j3476
559D448k0108K4692P008k6951N978K2793j7665j5795K5518J560k8219J2732K0076
572A6067k4497o607K6008o398k2680J7684J4683k4553j716K7323j2317j9110K3794
585G681P012k5748O687K2173j6949j4069K3475J916k6223J1486J9056k3118p216
598a3837K5088o851k1116J5880J3228k2739k082K4976j0548j9117K1978P773k4108
611a1475O540K0545j5243j2068K1753K551k3880R857J8779k1140p646K3529o310
$$ y = [10101, 10373, -21036, -4363, 17611, -8507, -15964, 14104, 8076, -18330, 2394, 20078, -10066, -10715, 20172, 4625, -16921, 9152, 16423, -12568, -6822, 18549, -796, -18340, 9419, 10946, -19108, -4814, 15956, -9351, -16438, 11359, 5916, -18210, -87, 17021, -9725, -10913, 17924, 4448, -15660, 9032, 16040, -10911, -4933, 17860, 195, -15600, 9918, 11478, -16741, -4009, 16067, -8430, -15037, 10971, 4573, -18107, -423, 14260, -10293, -12009, 15314, 2997, -16113, 7681, 14693, -11055, -4368, 17805, 856, -13213, 10262, 12178, -14045, -2559, 16497, -6621, -13837, 11251, 4400, -16716, -836, 12392, -10347, -12429, 12547, 1999, -17118, 4860, 12633, -11475, -4935, 15610, 367, -11701, 10052, 12603, -11277, -1420, 17359, -3781, -11427, 12102, 5792]
624E792k0839J5095J1722k1399k277K2327r289j8279K0282P630k3423O058K0200
637A3600j4685j1059K0601K590k1666R407J8010j9199p651K2893n616j9599J4673
650B299J0433k0302k179K0387r049j7235J7850P367k2416N406J8966j4414j0059
663a2946J9426K034j9440Q393J6824j6984p176K1921m756j8531J4386R982j8910
676e777j136J8390q333j6011J6163P141k1496M276J8218j4610r736J8582N43j8089
690a1875Q327J5421j5730o753K0633l747j7839J4055J0068j8243n45J7713p822
703C663j4501J4932O608j9635L566J7180j3609r854J7717J89j7124P795J3281
716A0208j4380o697J8998k961j6986J3178R676j7289O8J6749p915j2732J3749
$$ y = [5792, -15047, 48, 11770, -9629, -11906, 10421, 1132, -17147, 3135, 10765, -12658, -6600, 13600, -1085, -12144, 8457, 11047, -10619, -1212, 16798, -2401, -10052, 12841, 7225, -12374, 2299, 12732, -7570, -9749, 10638, 1589, -15646, 2204, 9571, -12845, -7439, 11527, -2887, -12946, 6480, 8514, -10926, -2533, 14291, -2693, -9869, 12052, 7296, -11235, 3151, 13133, -5777, -6913, 11477, 3144, -12867, 3296, 10437, -11059, -6783, 11435, -3175, -12911, 5671, 6214, -11875, -3548, 11873, -3857, -10610, 10023, 6276, -11563, 2492, 12560, -5683, -6228, 11485, 3663, -10838, 4094, 10702, -8933, -5367, 11813, -1796, -11650, 6067, 6256, -10868, -3073, 10208, -4172, -10869, 8129, 5168, -11818, 1360, 11036, -6253, -6185, 10564, 2649, -10083, 3666]
729C666O463j7999K832J6555j2719r719J7485k11j6536P649J2579j3532n755J6953
743G711k621j6384J2405R779j7339O9J6613q038j1928J3732N087j6575K657J5861
757A1029j1673r891J6799l24j6068Q175J0958j2955n082J5750k293j4963J1231
770F93R422j6222L16J5883q070j0617J2669M447j4794K372J4606j0699r547J5587
784F046K74j5739P735J0057j2401m553J4406k460j3870R836R151j4952j66J5585
798H949q207r831J3096M066j3968K657J3638r479q898J4939K90j5591P975J0010
812I646j2984l880J3445k866j3022R046Q659j4917o46J5115p743r637J2480L560
826F256j3318L418J2565q669q178J4116J313j4729P568R889j2471l168J2910k990
$$ y = [3666, 10129, -7870, -5038, 11517, -1202, -10921, 6564, 6353, -10183, -2534, 10045, -3487, -9242, 7711, 5090, -11294, 1111, 10890, -6449, -6380, 10233, 2195, -9733, 3999, 9086, -7489, -4832, 11029, -644, -10535, 6264, 5940, -10128, -1953, 9005, -3950, -9032, 6718, 4425, -10538, 693, 10115, -6107, -5791, 10092, 2022, -8595, 4074, 8521, -6273, -3901, 10705, 6, -9541, 6046, 6320, -9419, -1684, 8373, -4028, -8581, 5825, 3365, -10505, -669, 8482, -6470, -6636, 8949, 742, -9089, 4007, 8073, -5895, -3238, 10400, 921, -7977, 6962, 7252, -8339, -364, 9646, -3338, -7218, 6227, 3361, -9661, -615, 8044, -6873, -7519, 7596, -147, -9784, 2696, 6256, -7062, -3644, 8921, 252, -7926, 6190, 7503, -7226, 342, 10231, -2240, -5408, 7502, 4512]
840D512j2219Q162P738j3374j375J3877p355j0079J2324K856j3050L356J1744
853G117q416p266J2983J336j3565O905J0345j1790k921J2997l450j0704Q061P144
867H776j2301j405J3179o711j0103J1920K348j3143L556J0584q528o942J2021
880C251J140j2434O016J0073j1731k599J3139l512j0037Q107O210j0998q94J2375
894H106n818j0040J1477K893j2700L566R655q361o015J0971P06j2110N376R566
908G272j1129k904J2750l810r728Q630N577j0463o64J1412n001r545J1106K887
922F390j2636M041R661q528n184J0426K50j1149N114R156j0640l491J2633l789
936B254r570Q602N230j0716j36J0851m915q835R967L452j2309L891R526q764m901
$$ y = [4512, -7707, 455, 8193, -5181, -6556, 7321, -34, -10113, 2211, 5067, -7983, -4627, 7117, -1299, -8565, 4418, 5754, -7811, -906, 9439, -2351, -5272, 7725, 4275, -6429, 1632, 8776, -3525, -4930, 8249, 1538, -8565, 3355, 5703, -7440, -3884, 6700, -1828, -8770, 3251, 4391, -8043, -2027, 8046, -3685, -6284, 6855, 3343, -6694, 1413, 7623, -3375, -4269, 8106, 2288, -7752, 3725, 6618, -6082, -2516, 7139, -1222, -7237, 3734, 4440, -7670, -2294, 7272, -3857, -6761, 5989, 2179, -7549, 1081, 6658, -3805, -4469, 6943, 1942, -7603, 3503, 6390, -6246, -2205, 7456, -1072, -6256, 4170, 4420, -6729, -1615, 7541, -3099, -6590, 6043, 2254, -7316, 1286, 6516, -4200, -4336, 6515, 1600, -7235, 2732, 6184, -6125, -2234, 7292, -1472, -6373]
951f373J0314K1j0267M549Q518r739l215J2017l482r506Q429M839j0048L57R886
966F300m779p896R333L666j2019L306R735q829m322J0073j046r652M641P829r164
981b824l685J1396l137r608Q874M419j0195Q39R817m576p542Q846L442j0920K800
996b054R837q312m790J0090q69r201M886O617q311l528J0512k583r686P985M457
1011E050j0036J042R059m982o757Q339L524j0182K351R459p567m719J0370r03
1025D048r045N171O301q108k912R754k423r422P900M790j0711R61R045n551o033
1040f235P986K460r313K013R090p187n098J0299o75q941N494O038p810k388R305
1055E038k218q603P051M788j0217R57R067n517n952P801K071q778J953Q196o543
$$ y = [-6373, 3941, 3962, -6305, -1756, 6762, -2977, -6192, 5825, 2343, -7163, 1266, 6105, -3943, -3586, 6300, 1521, -6375, 2958, 6624, -5395, -2089, 7646, -1183, -5505, 4568, 3522, -6130, -1489, 6340, -2824, -6509, 4887, 1750, -7858, 1016, 5435, -4760, -3921, 5896, 1320, -6222, 2624, 6066, -4854, -2054, 7783, -529, -5319, 4771, 3902, -5299, -413, 6204, -2107, -5635, 4877, 2294, -7392, 593, 5050, -4986, -3944, 5115, 133, -6624, 1715, 5239, -4943, -2592, 6867, -700, -5419, 4951, 4048, -4997, 174, 6475, -1633, -4545, 5209, 2786, -6636, 1264, 6054, -4657, -3696, 5349, -202, -6235, 1751, 4211, -5102, -3089, 6001, -1186, -6284, 4015, 3340, -5601, -107, 5931, -1879, -4267, 5038, 2820, -5783, 1268, 6056, -4161, -3204, 5863, 346, -5606, 2195, 4266, -4512, -2559, 5637, -906]
1070i06n256R917k65r393N623N619p711j852Q708k081q232O542N043r468J08R422
1086E818n601n461P837J569q434K110P734n970n017R264k67r141N444N885q239
1101b469j642Q372k128p491N942M818r080L5R085n456n652P913J339p997K448
1116a963O936n567m808Q784K79r103N313N817q001j364Q349k634o910N947M466
1131E541q612j9Q505m885o306Q252J251q348K563O804n846m163Q375j10q560M666
1147h92O409q069j547Q565k989o224N682M069p738n23Q772m602o141Q086J256
1162D114q429L092O136n621m085P574M26q417M424O293q296j433Q347k943o388
1177e206N597L915p396l50Q250l881o060P654J415q080L006O270n872l210P268
$$ y = [-906, -6162, 3755, 3490, -5903, -280, 5339, -2372, -4224, 4484, 2403, -5829, 713, 5756, -3712, -3604, 5818, 217, -5244, 2593, 4162, -4272, -2162, 5572, -398, -5415, 3849, 3582, -5559, -115, 5770, -2469, -4111, 4261, 2133, -5358, 584, 5402, -3678, -3643, 5442, -14, -5666, 2247, 3586, -4411, -1963, 4973, -594, -5402, 3382, 3661, -5442, -129, 5688, -2313, -3677, 4672, 2038, -4872, 1075, 5541, -3071, -3090, 5415, 530, -5776, 2476, 3727, -4621, -2058, 4746, -1100, -5263, 3112, 3002, -5558, -892, 5517, -2552, -4099, 4466, 1477, -4747, 935, 5004, -2734, -3257, 5515, 913, -5228, 2858, 4114, -4315, -1223, 4913, -708, -4793, 2781, 3207, -5210, -786, 5507, -2789, -4222, 4125, 1182, -5206, 391, 4306, -3090, -3440, 4810, 929, -5131, 2523, 3938, -4142, -1136, 5134, -738, -3948, 3320]
1192C320K11p982L707O352p997j630Q481l171o425O003L345p185l65P718l939
1207D43o096P235K234q341L064O389n980l226O949K34p235L750O195p515j763
1222c663Q337k769o705O323L196p591J86P099l613n863O817K074q409K648O664
1237D731o258k901P205k29p202L569N839o735k193Q576k491o755O236K946p210
1252b872P01O618l348n619O522K457q560K389O636o205l012P301p27o872L549
1267a042N422o157k717Q053k175o446N977L136p253N88O641l166m991N979K377
1282D226p831K182O731n835l540P318p84o261L312M793n703k784P466j315p032
1297e057N438L742p533P04O812l732m902N828K646p481J401P085n608l648P492
$$ y = [3320, 3531, -4451, -744, 5608, -2389, -4019, 4462, 1291, -5134, 869, 4214, -2971, -3336, 4382, 443, -5653, 1582, 3816, -4525, -1461, 4928, -1052, -4278, 2671, 2905, -4330, -580, 5615, -1900, -3663, 4674, 1905, -4800, 1523, 4719, -2872, -2686, 4413, 800, -5063, 1754, 3828, -4581, -1933, 4731, -1527, -4428, 2777, 2548, -4654, -1085, 4754, -1981, -4174, 4402, 1911, -4844, 1392, 4338, -2872, -2171, 4447, 1099, -4520, 2002, 4459, -4101, -1712, 4924, -1281, -4293, 3008, 2281, -4591, -1042, 4380, -1777, -4494, 3559, 1384, -5062, 915, 4051, -3202, -2614, 4027, 861, -4130, 1849, 4226, -3605, -1423, 5308, -527, -4067, 3251, 2467, -3794, -482, 4311, -1392, -4176, 3290, 1975, -5057, 381, 4123, -3410, -2706, 4106, 374, -4528, 1300, 3946, -3535, -2134, 4951, -657, -4305, 3187]
1312C187n64o604L743M605n712k427P093j275o806N240L846p363L60O761l617
1327D67m533N552K063p101J541O644n187l805P558n65o697L717M491n522k034
1342c411O513j129o550M832M028p240K07O869l730m356N473J834o393J168O542
1357D657m695m107P299R6p246L842M476n557j934O203j360n971M409M021p051
1372b918k42O988l683m637N645J970o513J324O265m064m511P065L92o978L832
1387f5M595n649j722O076j076n858L819M207o599p38O861l504m802N612J470o121
1403c494J303N567l823m201O470Q63o790L447M691n370j354O112j274n487L671
1418C31M145n992q63O834l424m907N492J441o293J303N342l777l880N773Q74o738
$$ y = [3187, 2623, -3981, -238, 4367, -1345, -3772, 3321, 2046, -4760, 480, 4326, -3037, -2677, 4084, 467, -4066, 1486, 3549, -3552, -2011, 4633, -554, -4359, 3199, 2634, -4063, -346, 4145, -1377, -3411, 3102, 1973, -4577, 255, 4283, -2957, -2750, 4119, 389, -3967, 1506, 3340, -3053, -1885, 4657, -38, -4145, 3154, 3250, -3996, -154, 4322, -1235, -3169, 3034, 1674, -4297, 112, 4133, -2918, -3160, 3828, 145, -4492, 1153, 3123, -3390, -2066, 4199, 135, -4376, 2689, 3081, -3897, -65, 4530, -1119, -2841, 3235, 2159, -3699, 120, 4327, -2272, -3010, 3851, 347, -4455, 1157, 2627, -3494, -2191, 3376, -447, -4648, 1822, 2685, -4105, -658, 4033, -1337, -2691, 3421, 2147, -3340, 331, 4476, -1516, -2379, 4455, 1031, -3876, 1616, 3057, -3236, -1933, 3409, -368, -4248, 1525, 2399, -4339]
1434d339K916N288n791j382O147j261n189L972L857n789j000O846k846m882N432
1449A979J573o280J429N142l818l739N416J031o702K736N166n818j961O339j134
1464A359n311L790L508n309j148O693k121n398N405K334o293J194N375l893l392
1479c207N153J115o250J950N167n173k197O162j217n500L720L430n119r95N751
1494B790j667n128M876K674o453J293N311l514l255M789J075n528J744N110n079
1509i62k310O246j043n546L660L174m806j114N561j774m965M482K792n989R35
1524a659N209l752l032N025Q86n597J812M881m441k740O125r16n285L255L518
1539C289n173o16N050j524m856M294K865n833N69N465l487l247M946Q07m879J296
$$ y = [-4339, -1423, 3865, -1926, -3308, 2839, 1578, -3611, 361, 4218, -1571, -2571, 4275, 1429, -3453, 1979, 3552, -2728, -1299, 3843, 25, -3714, 1702, 2733, -3969, -1233, 3933, -1885, -3846, 2493, 1359, -3952, -162, 3346, -1963, -3111, 3582, 1461, -3937, 1468, 3802, -2491, -1297, 4078, 185, -3207, 1946, 3061, -3189, -1239, 3928, -1245, -3442, 2720, 1503, -3997, -277, 3153, -1966, -2961, 2790, 1123, -4005, 871, 3545, -2908, -1615, 3696, 182, -3073, 1716, 2791, -2737, -993, 4117, -962, -3272, 2974, 1931, -3615, 45, 3219, -1587, -2701, 2860, 1086, -3879, 603, 3395, -2594, -1659, 3550, -202, -3234, 1791, 2677, -2920, -1108, 3773, -668, -3408, 2717, 1801, -3484, -229, 3289, -1884, -2500, 2550, 1026, -3830, 464, 3329, -2504, -1935, 3530, 43, -3204, 1742, 2549, -2330, -1034]
1555a034M796m107k971N897m00n718L439L507n048r49N171j657m572L709L195
1570C258n819M63N338l208l277M936J062n183J528M209l484k836N302p5n330L150
1586C4L469m802r33M903j559m254L305K905n314j70N500l104l617M814J046n031
1602b808J731L895l147k623M930K77n311L012L768m958r52M928j337m059L050
1617C96K863m955l26M924k512l747M593J058n015J633L788l241k494M478N97n118
1633c078K359M022m791o98M708j380l840L180K369m345n18M961k030l799M267
1648A387J213m898J045M093l070k517M151M33m754K044L733m223j383N006j522
1663G38l754L325K083l921n44M614j703l920M304J371m823J440L717l028k227
$$ y = [-1034, 3762, -345, -3316, 2581, 2181, -3537, -98, 3409, -1639, -2588, 2583, 926, -3646, 63, 3258, -2561, -2098, 3240, 32, -3245, 1691, 2753, -2430, -902, 3307, -177, -3013, 2289, 2214, -3116, 34, 3503, -1299, -2232, 2671, 1112, -3142, 163, 3068, -2246, -2416, 3084, -20, -3637, 1177, 2223, -2808, -1077, 2818, -329, -2952, 1978, 2255, -3056, -44, 3724, -1234, -2186, 2742, 1405, -2654, 396, 3259, -1696, -2022, 2902, 390, -3357, 1236, 2294, -2721, -1088, 2700, -541, -3035, 1443, 2040, -3078, -719, 3303, -1488, -2186, 2522, 1142, -2698, 482, 2851, -1494, -2012, 2949, 919, -2880, 1387, 2600, -2298, -1253, 2840, -230, -2747, 1404, 1837, -2917, -873, 2860, -1363, -2746, 2260, 738, -3016, 309, 2392, -1529, -2073, 2541, 838, -3082, 1222, 2593, -2230, -790, 2927, -101, -2328]
1678b328L861M70m275J536L804m021j724M849r64l925K838K188l954n99M381j518
1694F19l652L730J751m813J108L931k829k312L955L37l834J361L648l338j960
1709b298M770j029m219L140K263l980m57L898j350l475L184J792m536R24L818
1724B445l030k088L899M67l779J240L394l104j997M446n59l909K811K254l754
1739a264k54L649j267l345K992K128m212L65L978k752k455L692M30l590Q48L081
1755B024k665k067M362k80m286K634K541l768m07L766j295k928K789J949l819
1770a450J43M059k322k562L637M43l708J228K761k413j911L546J8l791J942K599
1786B219l669m99L832j404k821K310J975l594K3L949k226k453L438O66l386J298
$$ y = [-2328, 1533, 2003, -2272, -736, 3068, -953, -2677, 2172, 1208, -2717, 121, 2309, -1645, -2244, 2137, 619, -3033, 697, 2448, -2365, -1257, 2674, -155, -2467, 1488, 1825, -2009, -648, 3000, -338, -2298, 2472, 1443, -2776, 364, 2627, -1353, -1810, 2088, 738, -2737, 447, 2239, -2297, -1373, 2445, -585, -2673, 1226, 1693, -2086, -846, 2548, -556, -2553, 1893, 1334, -2575, 236, 2490, -1264, -1518, 2131, 864, -2481, 511, 2639, -1573, -1208, 2770, 18, -2437, 1255, 1685, -1905, -1057, 2024, -641, -2708, 1654, 1374, -2912, -278, 2263, -1505, -1912, 1854, 559, -2369, 420, 2369, -1450, -1307, 2752, 430, -2132, 1505, 1948, -1760, -532, 2229, -184, -2095, 1451, 1469, -2322, -380, 2219, -1450, -1949, 1883, 479, -2342, -32, 1943, -1651, -1628, 2321, 95, -2358, 1080, 1746, -1640, -342]
1802c42K742k562j793L618R0l787J925K816l616r03L423j008k828K506J444l051
1818a326l54L705j903k612L479O38l752J277K848k427j419K951N23l705J519L158
1834B600l248p97L467j009k796K311J481l143k53L152j468k780L135R11l572J008
1850a001K814k195j602K968K72k976J078K594k592j107L648j074k773K368J687
1865B109k813l51K935j164k726K727J034l351Q89K681k289j408K640Q0k739J228
1881e18K484k562j206L255p52k542K136J219k474j05K601r95k431K510J024l159
1897a515O53K904k073j432K547L3k399N64K443k093j266K930m56k831K246J318
1913A573k495m4K163o81k343K169J190k859L23K902k142j394K559J28k384P92
$$ y = [-342, 2400, -162, -1955, 1663, 1753, -2034, -109, 2707, -909, -1812, 1611, 603, -2225, 281, 1725, -1326, -1680, 2025, 122, -2490, 989, 1627, -2125, -848, 2000, -427, -1846, 1105, 1628, -2077, -558, 2600, -648, -1445, 2022, 1013, -1783, 528, 2009, -1134, -1387, 1765, 297, -2483, 652, 1563, -2009, -1001, 1813, -382, -1984, 984, 1256, -1720, -642, 1952, -640, -1747, 1901, 827, -1946, 422, 2109, -704, -1055, 1880, 716, -2010, 717, 1751, -1600, -711, 1970, -319, -1727, 913, 993, -1746, -518, 1966, -596, -1802, 1453, 701, -1841, 295, 1514, -960, -1065, 1536, 541, -1890, 620, 1644, -1515, -862, 2042, -31, -1463, 1084, 1117, -1282, -718, 1725, -368, -1634, 1296, 840, -1991, 255, 1573, -922, -966, 1197, 516, -1827, 342, 1532, -1327, -1004, 1898, -244, -1638, 921, 1049, -1335, -543]
1929e43K074j777j464K879k30k617J794J591k452l44K548p32k019J513J325k691
1945a145J66K568j899j243K167J98k266Q80J819j677j210K569P2k740J901J279
1961A439k437lK356j113j431J496J411k563M0K504j224k002K530L87k547P96J717
1978A356j781q91K035J59k337J156J599k258k05K429j022j636J550J204k269J94
1994g17K242j379j584K377K53k252R59J562j650r19J889K66k253R34J855k410
2010h27l66K250r33j508J388Q88j692p5K018j136j704K374M27k194J129J376j515
2027a00p67J573K63j900P76J456j772m76K122q45j562J485O22j581j96J842q93
2044D7j287J621O32k060N51J729j370q30J571nj793Q60J630j623o82K060n49j437
$$ y = [-543, 1531, -246, -1710, 1169, 939, -1678, 116, 1707, -745, -1089, 1459, 727, -1292, 221, 1546, -1145, -979, 1589, -310, -1553, 614, 812, -1454, -574, 1245, -432, -1642, 927, 999, -1741, 160, 1439, -998, -1001, 1355, 242, -1189, 307, 1718, -845, -805, 1699, 475, -1527, 1003, 1390, -1157, -361, 1356, -425, -1316, 719, 878, -1459, -303, 1296, -962, -1167, 1262, 240, -1396, 154, 1358, -911, -717, 1525, 146, -1438, 939, 1192, -1060, -101, 1461, -189, -1108, 781, 1047, -1206, -272, 1583, -827, -1193, 1057, 124, -1384, 4, 892, -800, -875, 1143, 7, -1697, 677, 1104, -1090, 39, 1415, -100, -867, 706, 969, -931, -155, 1301, -471, -947, 1175, 330, -1232, 253, 875, -706, -902, 940, 47, -1240, 381, 1013, -1047, -496, 1233, -137, -967, 604, 599, -1194, -334, 1296, -327, -1009, 1051, 502, -935]
2062i35J244P70j641pJ472n58j594J775O08k112N50J579j331p83J645l13j174
2079h05M33J315j322q64K076n68j472J352Q35j599J37J219m15j206J283O54j924
2096h71M90J614j335o47J454j93j175N25J195j267p41J583l42j449J436O94j926
2113i55L89J386q77p57R53P12j619K7J840j324p98J662k42r54O55O07p06o99J563
2132H63P5j645R12N69j464N3J292p90q16R50O88j299J5J284r15o87J559k27j299
2151h82P24Q82q83m32J201P5j467J046P41j365J58J124q81p14J051M22j294P9
2169d15J091p84p60J349J4j261N96P20q87n40J183O6j179N66J019j421K21J300
2187H78q13o65Q75K91q17k24J264o73r32J263m1j096O37N74p31j14P81r6j137
$$ y = [-935, 309, 1079, -562, -569, 903, 345, -1249, 526, 1134, -978, -428, 1151, -180, -963, 682, 369, -805, -372, 943, -379, -1243, 833, 265, -1207, 145, 980, -619, -482, 737, 322, -884, 399, 1053, -871, -381, 1233, -102, -749, 705, 512, -663, -138, 1057, -210, -951, 632, 290, -1159, 277, 971, -955, -566, 820, -57, -814, 139, 851, -768, -741, 1099, -225, -1023, 639, 397, -557, 98, 705, -1, -700, 863, 938, -707, 205, 774, -690, -637, 655, -135, -951, -1, 687, -612, -597, 687, -228, -915, 644, 417, -882, -158, 724, -159, -591, 610, 685, -782, 264, 1005, -360, -202, 922, 41, -673, 378, 800, -494, -415, 676, -108, -868, 481, 495, -766, -170, 550, -337, -877, 306, 372, -807, -241, 778, -643, -422, 878, 65, -600, 275, 566, -251, -475, 789, 116, -816, 447, 406, -690, -53, 521, -210, -324, 457, 361, -776]
2206g76O20Q79j251p8J049m48n82P78J12o88j0J183o80j016J445j58j075N73O60
2225E37p02n2P09l1p92R3R03j107P6J154q66n95Q56L03p84J79N69k92q99Q38M41
2246E38j310P43L77o90OQ97m03p01M27O82r69L7J117o42m73Q45P2q83L14N03m34
2267E3o23O97M05j211M09P29r71K86M98l68m90M07M57o36j20R93k92q22J201m
2287E98q43K34M75l08l70M98J10p42K74O16q75j1P28o52j45K40L54n35j91Q48
2307C03l71o48R14J02p20K15N46l09j25O13Qp91J87P79p02j63O78m72k61M48K4
2328B55o50J81N76k96q30N96L60p37L61M18m86j5L61J51o54M49M07m88k34Q44
2348E69l97m96N26J37n27j04O71l70l25N40R3o19L34K48n65qN64j74n58L26M65
$$ y = [-776, -156, 723, -528, -606, 443, -5, -587, 191, 303, -385, -395, 788, 108, -908, 537, 379, -696, -123, 537, -165, -217, 492, 461, -331, -238, 665, -442, -366, 788, -78, -673, 183, 486, -298, -119, 450, 158, -741, 97, 538, -772, -29, 348, -342, -336, 561, 158, -543, -116, 566, -403, -366, 751, 109, -364, 481, 553, -330, -16, 487, 53, -570, 127, 532, -679, -270, 459, -512, -226, 272, -96, -586, -179, 278, -358, -478, 515, 223, -599, 602, 598, -245, -11, 464, 156, -214, 284, 394, -348, -74, 542, -333, -344, 384, -268, -413, -173, 181, -354, -545, 303, -68, -716, 198, 300, -420, -205, 341, 32, -93, 520, 528, -263, -76, 703, 1, -162, 516, 44, -217, 231, 255, -395, -214, 362, 66, -764, -168, 192, -545, -184, 234, -252, -267, 94, 245, -409, 40, 447, -41, -275, 569, 172, -324, 202, 339, -188, -292, 379, 9, -316, 224, 317, -302, 32, 280, -285, -293, 271, 97, -461, -135, 330]
2369C30m04l09N18j89m40R08k98j45N8L8j00l55M40K90o17J24N14o78J80M97m51
2390h9j74L58K63m12j92O44m48m29O44J08o06N11J07k17m11L27J76m64J28M51
2410B75n48M7M36l24r3L22J29k04j46N42l06n16P99k30k94L59K37n43%J22k4m05
2432c65K65N04p70J3M25k04k99L13J98r2p2K87k74l27P44j25n50L18M07n09K41
2453A28K45l74k4j5N78m97j88N21l59n26O97j78k17J13K77k42m50O55m6p60N44
2474a18M09o47K67K88k39j82K46J97k21r8M64k61n08O60r4k76K47n4k13J60l3
2495fK58n02L01J86o20J75M66l48k28L35L9l06J12K59M6o97P45l80j85M72J19
2516B41k68j0J91Rm95K85M60q35L05N49n92j80M42J30l36l11M75L0o09O65k13
$$ y = [330, -74, -383, 135, -54, -494, 414, 116, -29, 29, 67, -33, -388, 52, 342, -275, -151, 363, -315, -135, 362, -89, -263, 95, 358, -54, -246, 398, -50, -479, 165, 273, -333, 178, 285, 68, -343, -16, 160, -304, -176, 275, -273, -226, 210, -114, -207, 115, 244, 40, -106, 436, 130, -386, 413, 183, -111, 248, 485, -58, -58, 64, 40, -365, -100, 404, -366, -353, 72, -132, -431, -118, 80, -12, -84, 203, -71, -398, 346, 221, -329, -11, 396, -113, 128, 373, -1, -25, -40, 538, 41, -147, 374, 15, -511, 186, 8, -209, -96, 181, -61, -511, 144, 98, -662, -118, 291, -356, -89, 199, -40, -222, 24, 221, 0, -98, 366, 105, -403, 257, 163, -113, 134, 80, -133, 27, -6, 252, -250, 51, 237, -383, -208, 258, -90, -318, 17, 56, -250, -138, 121, 167, -530, 215, -165, -350, 122, 241, -27, -37, 154, 163, -332, -47, 413, -422, -117, 432, -160, -340, 102, 232, -104, -415, 60, 90, -519, 146, -67]
2537f7m82N37J07k43N7L38j35l03K65L51n20j75P23n00m2M63j40l62R6M73m20
2558B1l18N63J24j104P44K21o99J05O09l68k30L97O7n09j0O40k99k43N79k10l49
2579b69M07qj6l50L70K87q15M59M32p87J70N13m87n9K49J04n92o1M87j89m30N66
2601a9N7k45K33K20k64k67P24k72m33L65M19p25l0N97l63k07M34R8l63j48N98
2622D09m90l52P08L1o77K77L66m03k40M83K7o51J88P77p18L3P74l06m36K59K11
2643B70m51l8N99j53n66O74rp72N41M26p45N9L59p9m69L45N17r12J64L78k44k73
2665c79M29J30m05R4M06j33n04N65J73p21M18M00o33k18P11k43k85J26K54k13
2685b8l83Q96m38m96O29l6n49K45O43n54k62L91L23p55K35O61o26k40P29k39o34
$$ y = [-67, -549, -12, 95, -148, -91, 247, 112, -191, 74, 425, -95, -270, 453, -47, -89, 374, 234, -128, -32, 441, 21, -297, 266, 390, -714, 30, 251, -448, -343, 266, -102, -332, 65, 132, -377, -387, 253, -46, -289, 290, 80, -269, 138, 130, 114, -236, 134, 421, -394, 65, 497, -290, -120, 393, -94, -153, 96, 200, -392, -453, 34, -155, -585, -19, 38, -207, 26, 246, -18, -285, 439, 167, -266, 99, 518, -207, -237, 360, -3, -210, 224, 322, -41, -189, 409, -81, -433, 275, 306, -371, -94, 272, -131, -371, 112, 139, -512, -324, 453, -265, -232, 542, 236, -200, 59, 270, -181, -219, 380, 227, -339, 335, 326, -446, 95, 521, -224, -165, 194, 115, -354, -9, 508, -404, -240, 138, -106, -379, 50, 180, -225, -131, 275, 142, -362, 203, 376, -345, 73, 473, -160, -378, 333, 90, -195, -69, 185, -28, -411, 485, 47, -449, 180, 144, -405, -160, 483, -71, -333, 58, 381, -374, -139, 522, -104, -344, 385, 146, -488]
2706d88O82L77p70k9R74n58n29M84K74q87L00M58j54l63M11K16q66N01N80o97
2726h4l90J052m33m78L54L69m52k08O22j67p19O91J59o83L09L66k29m00O12L31
2746F22q15R7N98o08l70R16k32o73M93L16l28l47P03k16n78P23J72q32L09L83
2766C33o20j46N20K81p05P7O93l06n29R51m00l74L97K15l70k18M05R1q21O97J69
2787C40p04L8N74k96k75M98N0m80N0P58o07n45O31J93p38N26O20o93r8N61p8o06
2809b81M80K04n75j86R53n72l15N38j17o24K73N98m64n54Q65O7q81N12L95p87
2829d71J19P32k21o20L73M59p13L6J014o72m40P52J8o83K21O26n65l10M50K31
2849C36r94P92L07r16M02L82k72n53M05L85n10j22Q17m71m98P17O7m54J60O12
$$ y = [-488, 194, 571, -199, -228, 746, 188, -341, 143, 417, -470, -170, 288, 134, -229, 182, 398, -468, 33, 613, -84, -474, 578, 145, -333, 21, 390, -62, -270, 352, 185, -534, 157, 316, -367, -58, 308, 79, -321, 291, 622, -193, -96, 502, -106, -476, 440, 208, -465, 28, 344, 16, -331, 372, 156, -422, 301, 473, -359, -50, 333, -287, -433, 87, 368, -337, -260, 433, 127, -402, 549, 149, -225, 172, 387, 17, -201, 204, 295, -526, 171, 340, -364, -326, 248, -48, -323, 175, 225, -255, -205, 553, -54, -599, 32, 225, -513, 13, 633, -60, -158, 403, 325, -281, 199, 403, -172, -358, 595, 23, -292, 246, 129, -495, -222, 376, -88, -642, 223, 290, -591, -79, 316, -471, -352, 380, 159, -461, -88, 371, -342, -306, 708, 36, -404, 348, 366, -317, -96, 530, -35, -345, 105, 336, -658, 134, 441, -475, -73, 309, 37, -516, -111, 274, -236, -358, 459, -12, -510, 207, 274, -180, -20, 592]
2869E92m35o00P66J38j057P43N74j065m0O90k41m49L33N30q03j74P51k62q31J027
2889A87J02q73L02O41l22o45P04L19q88L10P56p20j87R06j40q55M28K36n54J29
2909a64P34k86q25P73K56q00J48O21m96m08N70J54p91M93O77r58j17Q06k25n10
2929c48L93L90n14m0O21k47o38N25M01q44K64N53m99k66N97O5o78k0P31o03n46
2950g03J100l66l79L63M09o04k6M98j01p51N88M16q48K58O48n73k24M96K86r68
2970d81L76N27n19m69P73K49p52L32M93n18l53O98j34o30L87L85o02p3J020j006
2990b97l12Q70j01n01J55O97o79k21N36J98q85O02M41q17K14M69p1m74L18M57
3010E99q44j32J136q67k63O99j4o47K46K66m05k33O68Pp62M06O22q31r3Q29J43
$$ y = [592, 157, -443, 323, 461, -596, 147, 721, -344, -384, 306, 65, -384, -51, 479, -324, -498, 253, -9, -840, 187, 289, -584, -282, 359, 37, -608, 96, 415, -473, -163, 593, -127, -314, 592, 452, -403, 25, 261, -293, -164, 570, 284, -541, 232, 488, -312, -164, 457, -39, -447, 123, 277, -514, -21, 656, -302, -419, 387, 162, -348, 45, 435, -79, -119, 502, 255, -383, 142, 543, -301, -37, 516, 17, -249, 348, 413, -265, -285, 446, -157, -703, 397, 31, -348, 15, 424, -180, -206, 292, 191, -560, 28, 444, -404, -146, 502, -71, -295, 201, 487, -481, -105, 422, -97, -566, 207, 456, -296, 36, 529, 11, -342, 356, 222, -408, -21, 364, -238, -311, 709, -297, -609, 261, 160, -341, -186, 511, -168, -389, 147, 345, -540, 62, 503, -314, -100, 369, 298, -176, 142, 599, -245, -377, 759, -108, -371, 328, 314, -333, -87, 179, -226, -459, 209, 216, -546, -140, 482, -349, -442, 387, 530]
3031E30q70N08N47q72o8P59m93k95N19J76p86Q8P45m21m12N78N0r68N04L56n02
3052c27mN54k71m23L67M80n50p7O23k73m13N07L39q40J49O08k40m49N62Q7p28
3073c19J43N69m28n18P18r0n26M24P5l11l03R36j76p46P91J27o54K22N64l45n93
3094d40O01J56n33L03L78n36k48Q54k82q02M55N76o62j08O61j64q53Q64K41r79
3114e18K67N40l14l19M71M33q73K64O62p01k27O63Kn46K28L55n42n9M37j34m86
3135c97N19K18n14k3N71m65m4N28j8n33n4N70m68m37Q62j4r37N93L70l00l40O04
3157B91j31o61N84L89p00RP28l33m30L21L17n44j98P38k85o70Q38L2r76N68N70
3178D57m05l36M01J30o33K71M14p42P9O31l16l77M99J43k20q8M35k31n23P77j34
$$ y = [530, -340, 168, 715, -157, -225, 534, 41, -254, 265, 441, -345, -257, 488, 67, -345, 233, 283, -685, -181, 175, -327, -331, 223, -48, -471, -104, 376, -174, -251, 372, 99, -314, 193, 532, -308, -159, 449, 209, -240, 322, 409, -319, -176, 393, -35, -553, 165, 75, -451, -27, 48, -263, -566, 370, 194, -552, 239, 366, -288, -66, 498, 153, -440, 161, 317, -216, 87, 465, -71, -319, 535, 253, -549, -94, 482, -180, -288, 373, 209, -644, 220, 461, -518, -251, 289, -25, -344, 127, 560, -313, -49, 613, -88, -315, 348, 350, -196, 32, 387, -155, -214, 223, 89, -397, 122, 340, -174, -197, 374, -91, -135, 393, 375, -158, -212, 358, -110, -547, 315, 301, -636, -43, 327, 27, -313, 291, 160, -501, 83, 472, -228, -219, 509, 176, -254, 67, 384, -160, -358, 380, 95, -575, 263, 295, -681, -113, 457, 52, -284, 117, 247, -386, -115, 299, -443, -364, 267, -49, -426, 73, 216, -4, -92, 343, 112, -411, 366, 232]
3199B32o76M15L92l51k87M79J39q53M91L96n71k26Q43l74m41L98m3l94Q9N21p7
3220A02o18O75N2n41J15O24l17m14Q20j72n30J52N40o64j29M70m9n71N69Q8n35
3241c33M7N49l03o07N98K47p81K66N41l41k16O45j45n63L68M37n15k93Q96j89
3261C08p88L37K53k59M7L15j16o31M04M88o22o2Q70o87q2M73k1m98R3N29k89l02
3283b40N64j65n91N84K01n08L05J69k22l14K07N01q05K09M24r9n95O57r6k61J12
3304C7L13l90m6K90N0n05M36J81o65Q8M92j02k06P4L77n00l62P97m35l22O82N0
3326C34o25J87L79l78j55M58J09n70K18M07n93l8P58l47n36L74L10m31j48M93
3346B06k07n13O81N5n39P9N17m87j62M51Ll27N6N32l95l48Q76n42l15N17J7m00
$$ y = [232, -444, -29, 363, 12, -275, 204, 343, -510, -19, 377, -194, -420, 423, 49, -392, 6, -37, -431, -342, 179, 102, -516, 159, 211, -330, -215, 409, 92, -322, 498, 326, -204, -52, 488, -176, -305, 165, 116, -455, 114, 202, -333, -286, 263, -40, -647, -49, 198, -583, -317, 224, -117, -333, 312, 167, -396, -28, 409, -106, -399, 497, 308, -480, -143, 110, -149, -102, 213, 97, -534, -130, 358, -264, -326, 544, -143, -225, 248, 227, -271, -178, 351, 62, -240, 324, 159, -432, 152, 353, -155, 150, 319, 97, -217, -10, 491, -314, -105, 319, 220, -375, 282, 186, -75, 37, 350, -40, -86, 204, 254, -251, 185, 366, -299, -211, 281, 179, -27, 47, 424, -76, -438, 359, -76, -398, 284, 334, -291, -104, 275, -103, -258, 200, 309, -261, -43, 364, -229, -267, 491, 144, -392, -18, 292, -139, -287, 206, -1, -514, 167, 222, -317, -238, 279, -208, -370, 81, 84, -243, -187, 345, -50, -398, 478, -64, -379, 138, 155, -245]
3368b45J48L36j52m70M51L8l35k4N13n30j19L74K11m20q9P03o12j50O78j57m88
3389c39M03K81j48k90L99k68k63K73M76p59N2O45n96j52K36M24p44J22L03k00
3409a45j48L53qo06O17K17m97K74J29l8k76K94L29o72O5M98l95k60M70j04k1k94
3431b18K86l15j00N29j13l82L11K94m03J2K99q3m55L75K93n44J35M29l52j87N20
3452C31j3m56L3L24J73n94L11J63n60M94K49o69J08J37L3n39L72L60n03L4M18
3473B06k22k31L35k3j69N5K00j78j67N45r8n27K88K10k60p3L86k44k94O8O32n37
3495i8l8L19k53l64M73o7k46J59K94j61l13K29M57l39k72M47k66j58N03k95j51
3516a40m5M82l56k21N46l10j55K55J31m07J12K27r1k64K39L26m71J65J55l45o6
$$ y = [-245, -97, 239, 87, -383, 68, 106, -229, -253, 260, -270, -389, -15, 196, -224, -313, 390, -222, -372, 306, 149, -339, 64, 345, 197, -93, 306, 38, -225, 48, 524, -235, -183, 462, -134, -286, -50, 374, -370, -248, 55, -145, -293, 60, 52, -554, 63, 280, -217, 57, 186, 148, -128, 166, 495, -177, -112, 386, -9, -269, 201, 97, 76, -218, 68, -247, -347, 182, 69, -313, -2, 292, -111, -99, 200, 117, -338, 37, 330, -214, -79, 350, -2, -189, 331, 318, -138, -105, 219, 392, -202, 109, 272, -288, 206, 455, -214, -106, 31, 64, -475, -103, 257, -246, -212, 206, -16, -247, 88, 65, -104, -49, 151, -27, -194, 351, 253, -274, 14, 224, -36, -109, 277, 33, -261, -193, 439, -98, -136, 183, -70, -434, 39, -28, -274, -115, 179, 18, -295, -66, 391, 52, -220, 227, -39, -197, 306, 11, -140, -185, 297, -59, -280, 266, -44, -199, 56, 187, -220, -108, 119, 28, -236, 3, 329, -142, 23, 178, -167, -233]
3537b33O41m07l32M30J32m66K8N28k41q4J18O9m17OL06M4j52J08J61k04j8J08
3559A25q1j06L12k8k53R6KP0l12L65J55m77L97j07l02m6K10J12l56K34P4p4k09
3582a99L31Q2n39M04O0l87M43l8j96R2m2P0l01L21K29k53k71K92k88L2J82J24
3604A48j45l11L89l5m03M70L6k71J55J63j28K48l13J3k19R3L53j60j81K90lm11
3626b22K86J7l9k59L95j56k70M6L28l21J65L7l6j57L85J3l25J93K48r0k57K64
3648B45j53k24K33j46o8O0MJ18j45J63k2l21J89K98l81o3J68K5L3k68K99j66j61
3671b83L66Q0l69K94J90n10L53l6k3n3K9P4j25j20J59m4k60L19j18J18j99K40
3693H2rk73K45j24j71N66j63j80j28K27N8o0j79K79k05j92L73j4k81K22j07j79
$$ y = [-233, 408, 1, -331, 99, 231, -235, -207, 321, 80, -4, 114, 183, -234, -228, 78, 122, -30, 78, 239, 35, 17, 125, 44, -62, 250, 222, -31, 65, 67, 137, -175, 190, 345, -132, 265, 158, -144, -190, 20, 132, -224, 10, 84, 10, -199, 132, 214, -325, 79, 139, -248, 195, 157, -39, 53, 11, 81, -220, 101, 330, 77, -194, 98, -190, -158, 24, 148, 3, -308, 81, 46, -357, 113, 149, -122, 33, 196, 68, 316, 3, 16, -203, -110, 243, 83, -98, 192, 189, -222, 64, 81, 42, -217, 178, 22, -248, -202, 126, -195, -30, 7, -29, -186, 199, 212, -113, 80, 328, 238, -19, 245, 92, -132, 101, -45, -113, -53, -49, 69, -76, 87, 65, -256, -67, 231, -150, -213, -45, -20, 13, -255, 44, -122, -283, 83, 163, -206, 88, 278, -232, 121, 85, 62, 9, 38, 112, -13, -133, 26, -18, -278, 41, -77, 41, -158, 82, 73, -200, 45, -79, -250, 316, 153, -27, -155, 72, 130, 70, -109, 170, -35, -227, 146, 132, -149, 73, -34, -213]
3715b13K64L5l5j01J24J59l50J63J09l31K27o5l3j7l2J47n5k14J39L27l93K14
3737F9Q5l12K42q9K3r8K40k8l49L5K90j62P4K5p8m8m9L64k11j52K44N8l19K11
3761F5k12Qp0K72L5j31q7Q8J16l34N53l63o7J67j61K30J08k11lKJ50M9j69j4K28
3786B49j27j71O0j27Q4J21Nl43J10L4q7J9J19M6k55L62r7k04J98n6J72k79J60
3809gK91l66J73j98J70j1P5o7K2k07J58Mj67J95j79J40j9o9o6j77J37L83k54o5
3833a04J72Qj35L7J16J8k09J57K07l54L5K37j61O9j51j11K86l03K34o7M0J32k74
3856a21j15M75k99j33K69j37P0j20k4K12k07K48Q1m13L51k40j6P7J36k97J61r7
3878a39K28K4r8O6J13k37J21O0j06L7j78L5K48k16J6q6L8K80k38J02Q9k12J8P
$$ y = [-213, 51, 86, 51, -50, 74, 233, -117, 46, 155, -176, 51, -14, -47, -64, -96, 51, -4, -218, -79, 248, -145, 69, 154, -158, 84, -5, 18, -80, 160, 132, -217, -182, 108, -54, 20, 45, -33, -81, -130, 234, 23, -129, 115, 173, -146, 65, -147, -139, -209, 63, 98, -33, -120, -32, 84, -250, 303, -60, -127, 40, -121, 109, 217, 6, 3, 5, 155, 204, 35, 21, 249, 122, -49, 11, -116, -32, 89, 94, -249, -139, -105, -192, -173, -54, -8, -263, 99, 2, -202, -4, -60, 112, -167, -7, 284, -82, 91, -107, 63, 52, 127, 60, 82, -125, 33, 37, -130, 65, -114, 26, 7, -62, -128, -305, -168, 215, -39, -104, 68, 76, -59, -22, 94, 112, -97, 60, 267, -87, -52, 185, 24, 93, -58, -169, 117, -186, 48, -19, 21, 153, -121, -236, 239, -60, -193, 76, -61, 9, -111, -135, 77, -130, 118, 199, -214, 137, -103, -119, -42, 94, -203, -42, -139, 89, 113, 15, 81, 194, -43, 78, 138, 32, 69, -109, -74, 174, -42, -26, -112, -74, 206, -32, 70, 159, -53, -35, -28]
3902b8J48m3l62L89l6K1j60L6j01P7J97l26L22r2M3k21j18L54Qkj82J51J9m2r7
3927d5J40P6j32K7j37J25R7j42k9k5K2J05J10jk01oK13Nk88K78j4p3q0j20KJ81
3953H8j2J34l73J40m9O5j12p2L42r9J6K1R5l32J50J52k85K08p7l2R5Ook8k86N12
3979B61l04Q3J66k55K06M6k08Q4k20J04R4k83L08j02o1K9k7o1L62k85K00j87J86
4002A36k99K61k49J83K3L0K6k65J51j98M7R4k4jJ49r3j17J94k87K50m6P9j02k9
4026h7K5R1l66J61L14j90O8J8J43j83m9P5j66N3K61j40j36K33j48m0J17j36j00
4049a82J40L0l2j31K13R2l28K24J88k54q2J01J30o8r1K1J35j82k9K37kJ4j25j70
4073a51L00l4j29l67M62p5K1o9L31j60k58R5R2O0l93L80K0k27K40N0l92K98M6
$$ y = [-28, 120, 77, -285, 104, 68, 89, -71, -35, -136, -59, 138, -188, 134, 42, 85, -136, -254, 100, 108, 106, -76, 75, 94, 52, -45, 95, 171, 39, 66, -71, 54, 151, 9, -20, -45, -23, 82, 192, 191, -10, -16, 197, 202, -86, 192, 178, 105, 25, -95, -93, 88, 76, 210, -163, -23, -72, -7, -119, -191, 151, 52, 68, 89, 184, -148, 2, 154, -131, 77, 0, -32, 63, 69, 63, 35, -251, 261, -43, 40, 206, -49, 157, 203, -5, 79, -141, -37, 57, -226, 82, -20, -81, -52, -79, -140, 222, -63, 137, -50, 136, -163, 98, -151, 32, 55, 85, 111, -154, -3, -201, -154, -60, -84, -85, 64, -29, -146, 48, -239, 11, -35, 44, -58, -87, -62, 29, -337, -176, 138, -52, 16, 34, 177, -6, -55, 20, -146, -93, 168, 28, -108, 125, -23, -63, 54, -82, -182, -42, -12, -44, -175, 38, 130, -198, 26, 214, -40, -122, -21, 109, 41, -50, -29, 106, -76, -105, 132, 130, 144, 19, -151, 149, 115, -14, -381, 81, 6, 27, -42, 289, 129, -129, -34, 58, 118, -275, 105, 125, -102, 138, 188, -204, 94, 140]
4096A40j94j56M20k52q0N2K02l7j74J92J7j55J73k94L7J57K3l1k65L38J3l80L33
4119G9p5o5J04p3J90j22k10L47j88j83K98j23Or2K12j90K04j86p4q2K23J38l30
4142a92J62k4N8j71Q7M9P3l7J77j62l16M00k8p1P9j81j1N3J6J13l57J90K36k94
4166a51R8J47M9q5p4K51l17J45J83m65R8K91p2j59J99j27R7j53M3k8j16J8J46
4189A8j71o6M70k11j24J93o1l6J63P2p3j37J71Q9n25M90j27k93O4J6p4N9m6K45
4213A06j87o3J74pr7jK14j99j77L88r3j25J63j20l5J45L2j11ML1j7m3l5J43j4
4238G6q8J06Q7n01L97mp9k48M17k84Lk8K78l02M5J28j73J44M0R2j51N3J01K8l82
4263b45J31K03j25m3L61j63p3M9q8r9O1N5r5P6J31K5l53L71l3k88K32j44J53j56
$$ y = [140, -54, -210, 210, -42, -122, -70, 132, 95, -79, 113, 130, -25, 148, -146, -109, 48, 71, 40, -225, 113, 126, -254, 79, 4, -61, 43, -30, 160, 38, -172, 175, -13, -196, 102, -21, -15, -107, 105, -85, 119, -67, -141, -223, 0, 138, -192, -30, -54, 4, -167, -80, -31, 42, 5, 182, 20, -296, 104, 76, 5, 84, -97, -108, -55, -39, 74, -283, -93, 143, -151, -53, 94, 143, 58, -16, 235, -82, 63, 246, -219, -121, 170, 98, -61, 138, 11, 108, -45, -2, -30, -146, -128, 18, -153, -219, 251, 40, -84, 109, 48, 12, 175, 247, 174, 37, 208, 297, -228, 262, 135, -158, -94, -78, -152, -93, -139, 106, -81, -144, 30, 23, -74, -75, 139, -60, -237, 151, 58, -67, 96, -24, -59, 86, 118, 7, 11, 42, 25, -18, -53, 90, 76, -12, 94, 181, -320, 77, 73, -6, -254, 163, -121, -118, -146, 132, -170, -125, 3, -170, -26, 14, 106, -45, 8, 109, 137, -245, -114, 89, -36, -79, 282, 119, 46, 95, 7, -92, -31, 24, -71, 5, 136, 161, -192, 179, 146, -142, 90, -54, 99, -57]
4287e7L6J20j88K90j21j81J96J80k82k6j9L51j39k53K69j2j81pJ0q2NJ03q5r7
4311a70P6K26j88M1J36k81r1L50m9m3j35k7NJ4J73J4r8P1p4lqK29k87N7R1j55
4337a26q6K08J43k05J28k8r4J24k7p8M5j98L66k82q1K25o9K1j43J78L6k44oK44
4361E1k09J61K05k28j06K52j77k01N08l82J66q9J93J2m85K00K20k95K22l0L7k54
4383b29L09P5k38j24M32k19oJ07j77J09n2QJ35j94jJ03k79M12j17j72r7N15m96
4406a96R8j7K17p7j46K1lr5K46Q3m51N29r2q7r7K91k6m78K55K34k51k6P9k7n8
4431g4L12k15j27k8L08k71L6K77j26k48L22l8j79MJ1J32J0j11J49k60mK89J5r7
4455H7n0j5jj4L0P7p4J1m9J98k60J12N3k65K58j55j88K52K98l85k00M18j25j86
$$ y = [-57, -21, 99, -89, 201, 80, -101, 95, 275, -7, -33, -52, 299, 160, -93, 176, 164, -17, -24, -14, -96, -91, 12, -73, -170, -94, 132, -56, -15, 121, -160, -251, 99, 50, 7, -128, -155, -150, -136, 37, 51, -47, 24, -50, -53, -61, 168, -119, -62, 29, -126, -212, -4, 139, -66, 62, 34, -60, 64, 37, -41, 4, -194, 172, -110, -191, 34, -35, -14, -157, 21, 57, -187, -193, 51, -158, 3, 208, -20, -126, 126, -51, -252, 256, -126, 40, -49, 144, 156, -329, -129, 91, -204, 18, -12, 25, -229, 80, 155, -83, -207, 225, 6, 0, 107, -70, 39, -13, -5, 130, -64, -65, 38, -241, 171, 54, -118, -215, 300, -196, -98, -115, 102, 25, -121, -100, -103, -198, 48, 131, -320, 209, 117, 30, -67, 224, 198, -280, -25, 209, -42, -68, 11, -16, -74, 238, 23, -104, -132, 176, -95, -59, 218, 92, -156, 166, 128, -51, -47, -36, 96, 106, -5, 144, -116, -120, 169, 184, 87, 37, 22, 21, 7, 37, 114, 40, 51, 2, 200, -60, 52, 105, -160, 98, -57, -245, 7, 305, -80, -280, 138, 13, -173]
4479a73K35o4k6pr5J97j93K64K2k13K41l0l28O1L17j69r8j50L51j96q9L29q0q1
4503B5p4L7No8K25j66o7O2j4m0P0K08j15o0J09k34m7J82K1l7JJ04o9j81K76M1
4529A94r3k50K53%k33R5K45k22j10K05j35l2J18j0k55L04K4j7l86L93R3l80J12
4552h7J50O6q3l4PK6m7p2J19j83M28l13k9J79q3j72j71K78n8j05J46L7k00K26
4576B5K06k73n3N6L9n6n2J58J10j74L1J01j29O8j9n3J31N5l7k95Q2Q9q9J96J07
4601B24j21j53K12k44qjJ86Q4l30J74o4q1K02j22o5R6Q6O1k96K58R7k10N7R7j57
4626a8j62L88j76o5m8J98l13O8J77J0j34Q0J01r9j84L47j59k43J46O1K2p3J68
4649I2j61n1J99Q1m35L29L57k66k80K41j26k58K88K27l94J5K80j78mk0L42l31
$$ y = [-173, 62, -2, -28, -35, -130, 67, -126, 138, 160, -53, 188, 158, -170, -109, 208, 39, -59, -209, 142, -54, -143, 186, 106, 25, -49, -12, -7, -75, 150, -16, -83, -21, -35, -75, -5, 203, 88, 28, 137, -97, -144, 38, 59, 22, 23, 127, 58, -123, 153, 194, 101, -149, 104, 104, -129, -34, 211, -11, -121, 84, -51, -83, 35, 25, -230, 74, 98, 81, -305, 88, 181, -199, -87, 63, 129, 46, 12, 19, 45, -2, -74, 45, -138, 290, -23, -52, 127, 44, -128, -299, -21, -79, -184, -38, -1, -201, 25, 231, -42, -95, -39, 0, -56, -108, 50, 160, -14, 17, 118, -11, 57, 38, -15, 116, 171, 134, -161, -79, 10, -79, 117, 224, 103, -50, 162, -82, -90, -91, 95, 179, -151, 23, -41, -122, 80, -42, -107, -11, 75, 136, -160, 98, 195, -15, 42, 139, -18, -180, 208, 32, -33, -81, 117, -196, -128, 49, 59, -75, 5, 106, 7, -177, 170, 11, -232, -86, -25, -3, -76, 92, -69, -120, 79, 160, -275, 54, 411, 145, -135, 106, -20, -278, 10, 237, -157, -142, 138, -40, -44, -64, 278, -53]
4671e3jJ93j34j20J64J35l56K12O3m3j17K50j11k13l5M34l16L1K38m31r4L01J1
4694Ho0m6L0J01r0K38k4l80P4K16j07p5J13J28k13Q2K21k21k6J60j11n8K54k65
4718e1J32j8Q2n1k71K45K50k40j12K06k07o1P7p0J35L5j2o1r3O4J03k75K11J31
4742A49j30N4j0n4j39K58j2o6J60j23r8J3J23n2o5j07K47j13k30pJ13j19P7K22
4766I1j16n6J71r8k64J89O7k31K67r8n9JR5L13m31K00p5J62k16j18K63j84K09
4789H2n9j33Q6J15j60o2R6J22j30o9J60J86l21N4J31q9j59K19k41Q8J40J36k10
4812a8L4o8M4J21L6j11j06j1J26J90m14L97N5n71L29L1j42K6O3K8l21K97P8n7
4836C6jK47j46r4r2K45l24J53l2j19M5J01K03j21k11K57r4j86K03K7j27r3K00
$$ y = [-53, -54, 139, 5, -115, 49, 184, -172, 40, 103, 60, -57, 193, 82, -131, -166, 268, -48, -17, 221, -210, -304, -3, 8, -52, -98, -68, 33, -57, 181, 157, -223, -149, 67, -40, -115, -2, 126, -87, -5, 216, -5, -31, 129, 18, -40, 214, -51, 81, 63, 145, 94, -177, 68, 318, 78, -34, 172, -35, -96, -19, -89, 46, 81, 69, 8, -85, -21, 82, -193, 18, 149, 19, 73, 63, 9, -130, 128, 116, 50, 210, 87, -11, 2, 125, 73, 8, -99, 148, 35, -195, -202, -89, -208, -131, 91, -25, -81, 90, -8, -272, -83, -16, -247, 20, -78, -137, -136, -41, 272, -159, 41, -34, 128, -88, -206, 57, -127, 82, 23, -110, -24, 91, -69, -131, -35, 87, -43, -112, 48, 234, -87, -33, 98, 9, -150, 69, -172, -84, 56, 192, -18, 16, -52, -8, 113, 149, 38, -68, -79, 47, 237, -177, 220, 275, -296, 33, 64, -78, -52, 11, 39, -282, 15, 93, 36, 35, 282, 136, 42, -50, 195, -129, 24, -8, -127, -82, 19, 222, 101, -110, 147, 53, -133, 70, 97, -30, -123, 77]
4859G7R1j25K1J44l96K96J54l57M1j2J25k41K83j13j63J82J20j52j48J85K4k36
4881b00L74J13j76j61M79k22m19L18j60j47K20J18J0m04L23Pj39R2Nj15Q0j13
4903a17J01L8J21r9p7M7P0j0j01O8K54j75P2L2l60J4K03l1p0j83K39n4j17L30
4927A95k56k24K84j20P5o7J80K3k34J00J03q9q7J54j17M1k4J32j90J05J66k71
4949a21J97j1j95M3R3q3j28P6J32P2k58K35P4j46L5j47K24j38l8R4J48k08J44
4972I4j7k75J35J11m4R1j65J02J37k16q0M9K8L3J4j83L63j02k08K67j27j06J25
4995B6p8P8j48R6M2k04J47O2J65j99L4p0J8Q9r9P8l55N22p0k50J35m0n5K2K55
5020B01j44j85K2Q6o3J32J25k96j41L75j36k03K96n2K8j26K5O1O5J80j14m0j66
$$ y = [77, 168, 43, 64, 208, -188, 108, 262, -95, -54, -66, 59, -182, 101, -12, -175, 7, 127, -25, -173, 12, 36, -200, 174, 287, 111, -50, 429, 207, -212, 106, -54, -201, 19, 137, 147, -257, 66, 73, -66, 26, 31, -84, -4, -117, -16, 22, 143, 44, -33, 14, 84, 74, -27, 41, 295, 120, 192, 224, -136, -122, 81, 50, -20, -203, 36, -18, -135, 195, -61, -285, -1, -121, -46, -113, 67, 90, -144, -44, 59, -30, -117, 37, -80, -39, -63, 69, -121, -16, 150, -121, 76, 65, -130, -87, 6, -77, -205, -129, 3, 75, -183, 52, 126, -20, 15, -132, 92, -46, -84, 10, 158, -50, 94, 77, -198, -63, 48, 4, 95, -70, 32, 169, -47, -127, -78, -50, -17, -3, -186, 177, 75, -133, 134, 7, -99, 26, -52, 26, -122, -26, 16, -188, -41, 21, 186, -13, 21, -49, -31, 58, -41, 37, -318, 204, 134, -116, 19, -21, -76, -54, 201, 57, -128, -106, -20, -83, 49, 174, -122, -263, 112, -24, -227, 69, 17, 45, -81, -56, 5, 70, 250, 136, 96, -70]
5043g0NP4j3J04q3k3p5J36j5j41R1O6j09O8J95k04n5j63M18l00J12l1m7p8K18
5068H0j72p3L22r3k08K45j35m3J8Q2n8N6O6O7j03k43K17M1n0JO4o5j29J52N0j07
5094a8p9K17k48J02o3JJ03Rn3q2K31J8M3k78J68L0j26Mk9Mj06L03r6m7O6l4r9
5121e9o8L88j39k43J64o7M4l2O2o4j71K43N4k08K34J8k89M4K47k65O4M3j34J85
5145E1q5J89q3j34M0Q2j52M0j16J44J09k2K24k20j32J59k73K53j9n2p1k8R4J88
5169A86m20K90j20j34J76O8K3O2M4J8k15q2R2J2k0R5r5p6J79J25j58j68L08j80
5193A0mR0k38j4M2L57l08m3J06P8j34o7K38j15q6J71p2NO4M3j92j4J62j74O7j4
5219d2J19j01PL0j15J48j5q4J26l9J00Qj60j3J62k39J36o8j84J72Q7k98K34M3
$$ y = [-70, -65, 9, -4, 100, 17, -6, -81, 55, 40, -101, -10, 56, -53, 15, 210, 6, -49, -212, 206, -94, 18, -13, -60, -138, 80, -92, -165, 157, 64, -144, 101, -34, -77, -59, 23, -35, 21, 87, 154, 51, -192, 25, 66, 16, 17, 81, 16, -113, 39, 89, -18, -97, 120, -128, -26, -89, -88, 15, 24, -29, -111, 120, 138, 181, -97, 71, 101, -25, -21, -50, -46, -152, 151, 55, 8, 74, 40, -59, -127, 261, 122, -121, 43, -24, 20, -12, 50, -14, -185, 58, 112, -96, 138, 156, -133, -89, 158, -107, -43, 0, -134, 51, -34, 155, 72, -62, -22, 60, -92, -52, -168, -24, 85, 63, 287, 67, -65, 94, -179, 74, 55, 3, -68, -96, -2, 186, -234, 56, -64, -198, -22, 46, 69, 131, 175, 193, -22, -104, -12, 0, -20, 75, -20, -96, 83, 208, 50, -118, 190, 10, 6, 96, -142, -156, -114, 243, -65, -108, -2, 76, -58, -125, 113, -2, -88, 83, 11, 16, 80, 123, -69, -83, 79, -95, -28, -42, 77, -24, -17, 13, -102, 46, 31, -53, 73, 34, 134, 142, -18, -31, 131, -108, 28, -40, -224, -52, 35, -263, -29, 14]
5243A4N0k30N8j0Q5O5J94r4j66J54%q0k0o8J30L4j07j86N5J70l11K97j3J12j46
5268a3L9K5Q5N9l17J83R8k74O1J21l5j23O5O3j40k5J68j30K63l3j44J35j16J72
5292A87j30l2j40K33j71P7N4j72J76j3JN9j79K07l20J7K07Lr0mq2J89l7k8j38
$$ y = [14, 64, -166, -108, -118, -33, 32, 226, 132, -34, 120, 120, 40, 20, -48, 82, 116, 9, -177, -122, 48, -263, 34, 21, 133, -13, 26, 51, 136, 195, -122, 61, 159, -115, -54, 67, 32, -91, -26, 37, -103, -128, 40, -90, 173, 140, -4, 131, 15, 187, 57, 25, -115, 118, -53, 24, 78, -94, 82, 69, 70, 129, -50, 157, -163, -146, 61, 64, -26, -30, -112, 77, 40, 12, -126]
$$ [...]
8191b13
##END NTUPLES=NMR FID
##END=
