##TITLE=1H_PhBBC 2508
 CDCl3, 8 sc, 
 26.8.2020
##JCAMPDX= 6.0         $$ Bruker NMR JCAMP-DX V2.0
##DATA TYPE= NMR FID
##DATA CLASS= NTUPLES
##ORIGIN= UXNMR, Bruker Analytische Messtechnik GmbH
##OWNER= root
$$ XWIN-NMR		Version 3.5
$$ Wed Aug 26 09:59:39 2020 Russian Standard Time (UT+4h)  she@DPX200
##.OBSERVE FREQUENCY= 200.1315066352
##.OBSERVE NUCLEUS= ^1H
##.DELAY= (6, 6)
##.ACQUISITION MODE= SIMULTANEOUS
##.ACQUISITION SCHEME= undefined
##.AVERAGES= 8
##.DIGITISER RES= 18
##SPECTROMETER/DATA SYSTEM= spect
##.PULSE SEQUENCE= zg30
##.SOLVENT NAME= CDCl3
##.SHIFT REFERENCE= (INTERNAL, CDCl3, 0, 15.7039)
##AUDIT TRAIL= $$ (NUMBER, WHEN, WHO, WHERE, WHAT)
$$ ##TITLE= Audit trail, XWIN-NMR		Version 3.5
$$ ##JCAMPDX= 5.01
$$ ##ORIGIN= Bruker BioSpin GmbH
$$ ##OWNER= she
$$ F:/spectra/data/she/nmr/H-F/1/audita.txt
$$ ##AUDIT TRAIL=  $$ (NUMBER, WHEN, WHO, WHERE, WHAT)
(   1,<2020-08-26 09:58:32.03 +0400>,<she>,<DPX200>,
      <created by zg, POWCHK disabled, PULCHK disabled
       configuration hash MD5:
       00 E9 B6 7A A2 85 ED C7 34 08 36 98 17 FE 4E 26
       data hash MD5: 16K
       56 E1 44 6C D7 3F CF F5 47 3D A8 CD E6 D0 45 F3>)
$$ ##END=
$$ 
$$ hash MD5
$$ 92 23 64 33 D4 55 76 38 5F 26 DA 32 37 63 4E 22
##$RELAX= 
##$RELAX= 
##$RELAX= 
##$RELAX= 
##$RELAX= 
##$RELAX= 
$$ Bruker specific parameters
$$ --------------------------
##$DU= <F:/spectra>
##$EXPNO= 1
##$NAME= <H-F>
##$PROCNO= 1
##$TYPE= <nmr>
##$USER= <she>
##$AMP= (0..31)
100 100 100 100 100 100 100 100 100 100 100 100 100 100 100 100 100 100 
100 100 100 100 100 100 100 100 100 100 100 100 100 100 
##$AQSEQ= 0
##$AQ_mod= 1
##$AUNM= <au_zg>
##$AUTOPOS= <>
##$BF1= 200.13
##$BF2= 200.13
##$BF3= 200.13
##$BF4= 200.13
##$BF5= 200.13
##$BF6= 200.13
##$BF7= 200.13
##$BF8= 200.13
##$BYTORDA= 1
##$CFDGTYP= 0
##$CFRGTYP= 5
##$CHEMSTR= <none>
##$CNST= (0..31)
1 1 145 1 1 1 1 1 1 1 1 1 1 1 1 1 1 1 1 1 1 1 1 1 1 1 1 1 1 1 1 1 
##$CPDPRG= <>
##$CPDPRG1= <>
##$CPDPRG2= <>
##$CPDPRG3= <>
##$CPDPRG4= <mlev>
##$CPDPRG5= <mlev>
##$CPDPRG6= <mlev>
##$CPDPRG7= <mlev>
##$CPDPRG8= <mlev>
##$CPDPRGB= <>
##$CPDPRGT= <>
##$D= (0..31)
0 1.2 0 0 0 0 0 0 0 0.06 0 0.03 0 0 0 0 0.0002 0 0 0 0 0 0 0 0 0 0 0 0 
0 0 0 
##$DATE= 1598421511
##$DBL= (0..7)
120 120 120 120 120 120 120 120 
##$DBP= (0..7)
150 150 150 150 150 150 150 150 
##$DBP07= 0
##$DBPNAM0= <>
##$DBPNAM1= <>
##$DBPNAM2= <>
##$DBPNAM3= <>
##$DBPNAM4= <>
##$DBPNAM5= <>
##$DBPNAM6= <>
##$DBPNAM7= <>
##$DBPOAL= (0..7)
0.5 0.5 0.5 0.5 0.5 0.5 0.5 0.5 
##$DBPOFFS= (0..7)
0 0 0 0 0 0 0 0 
##$DE= 6
##$DECBNUC= <off>
##$DECIM= 32
##$DECNUC= <off>
##$DECSTAT= 4
##$DIGMOD= 1
##$DIGTYP= 9
##$DL= (0..7)
0 120 120 120 120 120 120 120 
##$DP= (0..7)
150 150 150 150 150 150 150 150 
##$DP07= 0
##$DPNAME0= <>
##$DPNAME1= <>
##$DPNAME2= <>
##$DPNAME3= <>
##$DPNAME4= <>
##$DPNAME5= <>
##$DPNAME6= <>
##$DPNAME7= <>
##$DPOAL= (0..7)
0.5 0.5 0.5 0.5 0.5 0.5 0.5 0.5 
##$DPOFFS= (0..7)
0 0 0 0 0 0 0 0 
##$DQDMODE= 0
##$DR= 18
##$DS= 0
##$DSLIST= <SSSSSSSSSSSSSSS>
$$ [...]
##$SUBNAM2= <"">
##$SUBNAM3= <"">
##$SUBNAM4= <"">
##$SUBNAM5= <"">
##$SUBNAM6= <"">
##$SUBNAM7= <"">
##$SUBNAM8= <"">
##$SUBNAM9= <"">
##$SW= 16.880792210976
##$SWIBOX= (0..15)
0 0 2 0 0 0 0 0 0 0 0 0 0 0 0 0 
##$SW_h= 3378.37837837838
##$TD= 16384
##$TD0= 1
##$TE= 0
##$TE2= 300
##$TE3= 300
##$TEG= 300
##$TL= (0..7)
0 120 120 120 120 120 120 120 
##$TP= (0..7)
150 150 150 150 150 150 150 150 
##$TP07= 0
##$TPNAME0= <>
##$TPNAME1= <>
##$TPNAME2= <>
##$TPNAME3= <>
##$TPNAME4= <>
##$TPNAME5= <>
##$TPNAME6= <>
##$TPNAME7= <>
##$TPOAL= (0..7)
0.5 0.5 0.5 0.5 0.5 0.5 0.5 0.5 
##$TPOFFS= (0..7)
0 0 0 0 0 0 0 0 
##$TUNHIN= 0
##$TUNHOUT= 0
##$TUNXOUT= 0
##$USERA1= <user>
##$USERA2= <user>
##$USERA3= <user>
##$USERA4= <user>
##$USERA5= <user>
##$V9= 5
##$VALIST= <valist>
##$VCLIST= <CCCCCCCCCCCCCCC>
##$VD= 0
##$VDLIST= <DDDDDDDDDDDDDDD>
##$VPLIST= <PPPPPPPPPPPPPPP>
##$VTLIST= <TTTTTTTTTTTTTTT>
##$WBST= 1024
##$WBSW= 4
##$XGAIN= (0..3)
0 0 0 0 
##$XL= 0
##$YL= 0
##$YMAX_a= 416948
##$YMIN_a= -452350
##$ZGOPTNS= <>
##$ZL1= 120
##$ZL2= 120
##$ZL3= 120
##$ZL4= 120
##$ABSF1= 10
##$ABSF2= 0
##$ABSG= 5
##$ABSL= 3
##$ALPHA= 0
##$AQORDER= 0
##$ASSFAC= 0
##$ASSFACI= 0
##$ASSFACX= 0
##$ASSWID= 0
##$AUNMP= <proc_1d>
##$AZFE= 0.1
##$AZFW= 0.1
##$BCFW= 1
##$BC_mod= 2
##$BYTORDP= 1
##$COROFFS= 0
##$CY= 11.3945322036743
##$DATMOD= 1
##$DC= 2
##$DFILT= <>
##$DTYPP= 0
##$F1P= 16.9975609425685
##$F2P= -3.02152046262296
##$FCOR= 0.5
##$FTSIZE= 0
##$FT_mod= 4
##$GAMMA= 1
##$GB= 0.15
##$INTBC= 1
##$INTSCL= 1
##$ISEN= 128
##$LB= 0.24
##$LEV0= 0
##$LPBIN= 0
##$MAXI= 10000
##$MC2= 0
##$MEAN= 0
##$ME_mod= 0
##$MI= 1.114404
##$NCOEF= 0
##$NC_proc= 0
##$NLEV= 6
##$NOISF1= 3.799351
##$NOISF2= 2.8
##$NSP= 1
##$NTH_PI= 0
##$NZP= 0
##$OFFSET= 15.70392
##$PC= 1
##$PHC0= -9966.829
##$PHC1= 3.80092
##$PH_mod= 1
##$PKNL= yes
##$PPARMOD= 0
##$PSCAL= 0
##$PSIGN= 0
##$REVERSE= no
##$SF= 200.130013532006
##$SI= 16384
##$SIGF1= 3
##$SIGF2= 2
##$SINO= 400
##$SIOLD= 16384
##$SREGLST= <1H.CDCl3>
##$SSB= 0
##$STSI= 0
##$STSR= 0
##$SW_p= 3612.71676300578
##$SYMM= 0
##$S_DEV= 0
##$TDeff= 0
##$TDoff= 0
##$TI= <>
##$TILT= no
##$TM1= 0
##$TM2= 0
##$TOPLEV= 0
##$USERP1= <user>
##$USERP2= <user>
##$USERP3= <user>
##$USERP4= <user>
##$USERP5= <user>
##$WDW= 1
##$XDIM= 8192
##$YMAX_p= 0
##$YMIN_p= 0
$$ End of Bruker specific parameters
$$ ---------------------------------
##NTUPLES= NMR FID
##VAR_NAME=  TIME,          FID/REAL,        FID/IMAG
##SYMBOL=    X,             R,               I
##VAR_TYPE=  INDEPENDENT,   DEPENDENT,       DEPENDENT
##VAR_FORM=  AFFN,          ASDF,            ASDF
##VAR_DIM=   8192,          8192,            8192
##UNITS=     SECONDS,       ARBITRARY UNITS, ARBITRARY UNITS
##FACTOR=    0.000296,      1,               1
##FIRST=     0,             0,               0
##LAST=      2.424536,      0,               0
##MIN=       0,             -452350,         0
##MAX=       2.424536,      416948,          0
$$ Real data points
##PAGE= N=1
##DATA TABLE= (X++(R..R)), XYDATA
$$ [...]
$$ plain form
3483 -7791 9026 -3604 -4611 9267 -7362 -103 7403 -9282 4127 3683 -9019 7623 -615
3496 -615 -7030 9135 -4917 -3275 8653 -7893 1086 6332 -9209 5143 2640 -8529 7961
3509 7961 -1909 -6012 9116 -5902 -1893 8077 -8372 2331 5507 -9260 6238 1382 -7737
3522 -7737 8536 -3090 -4815 9117 -6396 -550 7527 -8706 3923 4359 -8807 6910 357
3535 357 -7112 8974 -4225 -3678 8718 -7108 540 6560 -8929 4548 3254 -8541 7627
3548 7627 -964 -6330 8866 -5202 -2897 8247 -7862 1538 5682 -8855 5161 1954 -8085
3561 -8085 7977 -2110 -5286 8886 -5951 -1373 7669 -8295 2311 4647 -8962 6242 805
3574 805 -7340 8381 -3297 -4347 8436 -6706 -332 7055 -8623 3712 3660 -8491 6850 -28
$$ packed form
3483g791J6817j2630j007J3878j6629P259P506j6685J3409m44j2702J6642q238
3496f15o415J6165j4052J642J1928j6546Q979N246j5541J4352k503j1169J6490
3509G961r870m103J5128j5018M009R970j6449J0703L176j4767J5498m856r119
3522g737J6273j1626j725J3932j5513N846Q077j6233J2629M36j3166J5717o553
3535C57p469J6086j3199N47J2396j5826P648O020j5489J3477j294j1795J6168
3548G627q591n366J5196j4068K305J1144j6109R400M144j4537J4016l207j0039
3561h085J6062j0087l176J4172j4837M578R042j5964J0606K336j3609J5204n437
3574H05q145J5721j1678j050J2783j5142O374P387j5678J2335n2j2151J5341o878
$$ plain form
3588 -28 -6567 8322 -3980 -3565 8334 -7034 702 6152 -8563 4697 2752 -7943 7536 -1026
3602 -1026 -5831 8775 -4828 -2323 7463 -7536 1971 5361 -8549 5425 1835 -7452 7876
3615 7876 -2380 -4671 8598 -5765 -1040 7419 -7905 2927 4175 -8381 6029 475 -6866
3628 -6866 8083 -3399 -3801 8135 -6548 28 6194 -8365 3746 3003 -8085 6662 -752
3641 -752 -6267 8508 -4520 -2885 7892 -7332 1063 5550 -8461 4634 2262 -7921 7510
3654 7510 -1668 -5204 8203 -5279 -1820 7280 -7538 2079 4645 -8372 5511 1458 -7098 7821
3668 7821 -2442 -4254 8119 -5752 -899 7012 -7741 3019 3867 -7880 6114 158 -6368
3681 -6368 7872 -3220 -3420 7977 -6442 499 6126 -7848 3940 2770 -7662 6636 -831
$$ packed form
3588b8o539J4889j2302M15J1899j5368P736N450j4715J3260j945j0695J5479q562
3602a026m805J4606j3603K505R786j4999R507L390j3910J3974l590r287J5328
3615G876j0256k291J3269j4363M725Q459j5324J0832J248j2556J4410n554p341
3628f866J4949j1482m02J1936j4683O576O166j4559J2111p43j1088J4747p414
3641g52n515J4775j3028J635J0777j5224Q395M487j4011J3095k372j0183J5431
3654G510r178l536J3407j3482L459R100j4818R617K566j3017J3883m053q556J4919
3668G821j0263j812J2373j3871M853P911j4753J0760Q48j1747J3994n956o526
3681f368J4240j1092k00J1397j4419O941N627j3974J1788j170j0432J4298p467
$$ plain form
3694 -831 -5841 8062 -4463 -2478 7409 -7064 1269 5356 -7973 4656 1815 -7165 7178 -2031
3708 -2031 -4774 7806 -5425 -1466 6933 -7579 2489 4339 -8009 5674 991 -6865 7515
3721 7515 -2846 -4036 7832 -6068 -589 6098 -7469 3328 3578 -7780 6086 -210 -6125
3734 -6125 7461 -3792 -3146 7492 -6612 412 5720 -7895 4103 2565 -7310 6689 -1176
3747 -1176 -5128 7906 -4728 -2166 7126 -6858 1691 5040 -7855 5204 1544 -6609 7241
3760 7241 -2094 -4148 7495 -5220 -1110 6374 -7076 2739 3829 -7800 5775 361 -6341 7282
3774 7282 -3006 -3458 7436 -5888 40 6021 -7314 3367 3079 -7498 6278 -506 -5576 7428
3788 7428 -3828 -2555 6903 -6588 987 4883 -7479 4036 2074 -6960 6572 -1533 -4795 7344
$$ packed form
3694h31n010J3903j2525J985R887j4473Q333M087j3329J2629k841q980J4343r209
3708b031k743J2580j3231L959Q399j4512J0068J850j2348J3683m683p856J4380
3721G515j0361j190J1868j3900N479O687j3567J0797K50j1358J3866o296n915
3734f125J3586j1253O46J0638j4104P024N308j3615J1998j538r875J3999p865
3747a176l952J3034j2634K562R292j3984Q549L349j2895J3059l660q153J3850
3760G241r335k054J1643j2715M110P484j3450R815J090j1629J3575n414o702J3623
3774G282j0288m52J0894j3324N928N981j3335J0681k88j0577J3776o784n070J3004
3788G428j1256J273R458j3491P575L896j2362J1515j962r034J3532q105l262J2139
$$ plain form
3802 7344 -4839 -1760 6662 -6834 1881 4220 -7493 5149 998 -6310 6867 -2441 -3966 7432
3816 7432 -5563 -333 6101 -6987 2725 3202 -7112 5949 55 -5925 7199 -3177 -2646 6909
3830 6909 -6074 173 5416 -7120 3938 2777 -6940 6012 -978 -4939 7350 -4147 -2181
3843 -2181 6853 -6292 1328 4673 -7306 4477 1542 -6479 6430 -1855 -4387 7307 -4671
3856 -4671 -1369 6315 -6703 2101 4054 -7169 4946 635 -6090 6734 -2428 -3646 6923 -5367
3870 -5367 -317 5695 -7050 2949 2903 -7062 5824 -27 -5447 6881 -3332 -2824 6623 -5654
3884 -5654 443 4867 -6919 3658 2303 -6512 6112 -1160 -4873 6871 -3894 -1663 6244 -6262
3898 -6262 1299 4282 -7004 4577 1301 -6101 6553 -1821 -3968 6981 -4767 -554 6075 -6523
$$ packed form
3802G344j2183L079Q422j3496Q715K339j1713J2642m151p308J3177r308j525J1398
3816G432j2995N230O434j3088R712M77j0314J3061n894n980J3124j0376N31R555
3830F909j2983O247N243j2536J1058j161r717J2952o990l961J2289j1497J966
3843b181R034j3145P620L345j1979J1783k935q021J2909q285k532J1694j1978
3856d671L302P684j3018Q804J953j1223J2115m311o725J2824r162j218J0569j2290
3870e367N050O012j2745R999m6r965J2886n851n420J2328j0213N08R447j2277
3884e654O097M424j1786J0577j355q815J2624p272l713J1744j0765K231P907j2506
3898f262P561K983j1286J1581l276p402J2654q374k147J0949j1748M213O629j2598
$$ plain form
3912 -6523 2555 3777 -6601 5054 608 -5686 6705 -2771 -3269 6841 -5265 -16 5352 -6789
3926 -6789 3176 2681 -6496 5636 -468 -5113 6869 -3321 -2253 6358 -6120 899 4526 -6846
3940 -6846 4036 1874 -6223 6006 -1500 -4319 6700 -4281 -1599 6055 -6211 1394 3790 -7136
3954 -7136 4327 1007 -5968 6375 -2028 -3707 6558 -4778 -897 5401 -6289 2512 3362 -6553
3968 -6553 4966 178 -5265 6554 -2592 -2883 6511 -5131 488 5035 -6505 3142 2330 -6188
3982 -6188 5579 -411 -4471 6612 -3466 -1820 6147 -5551 972 4194 -6362 4042 1767
3995 1767 -5894 5802 -1456 -3798 6628 -4305 -1261 5555 -6003 1884 3271 -6374 4416 626
4009 626 -5470 6107 -2355 -3169 6305 -5042 -158 5110 -6263 2710 2940 -5945 5005 -330 -4906
$$ packed form
3912f523R078J222j0378J1655m446o294J2391r476m98J0110j2106N249N368j2141
3926f789R965m95r177J2132o104m645J1982j0190J068Q611j2478P019L627j1372
3940f846J0882k162q097J2229p506k819J1019j0981K682P654j2266P605K396j0926
3954g136J1463l320o975J2343q403j679J0265j1336L881O298j1690Q801Q50r915
3968f553J1519m788n443J1819r146k91R394j1642N619M547j1540R647q12q518
3982f188J1767n990m060J1083j0078J646P967j1698O523L222j0556J0404k275
3995A767p661J1696p258k342J0426j0933L044O816j1558P887J387r645J0790l790
4009F26o096J1577q462q14R474j1347M884N268j1373Q973K30q885J0950n335m576
$$ plain form
4024 -4906 6413 -2944 -2591 5956 -5027 621 4480 -6275 3355 1955 -6079 5397 -1009 -4238
4038 -4238 6238 -3378 -1563 5939 -5615 1221 3937 -6327 3845 1194 -5465 5777 -1249 -3544
4052 -3544 6296 -4042 -896 5468 -5692 2175 3380 -6156 4765 599 -5189 5735 -2349 -2935
4066 -2935 6042 -4704 -94 4887 -5693 2750 2588 -5800 5004 -334 -4340 5899 -3284 -2265
4080 -2265 5872 -4911 547 4108 -6282 3665 1645 -5629 5311 -1151 -3911 6128 -3621 -1461
4094 -1461 5305 -5718 1497 3507 -6045 3923 1115 -5208 5341 -1892 -3395 5885 -4234 -440
4108 -440 4879 -5926 2318 2622 -5852 4676 228 -4478 5720 -2456 -2465 5857 -4608 203 4416
4123 4416 -5869 3078 2099 -5698 5274 -575 -4191 6140 -3146 -1798 5674 -5242 885 4054
$$ packed form
4024d906J1319r357L53Q547j0983N648L859j0755R630j400q034J1476o406l229
4038d238J0476r616J815P502j1554O836K716j0264J0172k651o659J1242p026k295
4052c544R840j0338L146O364j1160P867J205r536J0921m166n788J0924q084n86
4066b935Q977j0746M610M981j0580Q443j62q388J0804n338m006J0239r183J019
4080b265Q137j0783N458L561j0390R947k020p274J0940o462k760J0039r749K160
4094a461O766j1023P215K010r552R968k808o323J0549p233j503R280j0119L794
4108d40N319j0805Q244L04q474J0528m448m706J0198q176rQ322j0465M811M213
4123D416j0285Q947r79p797J0972n849l616J0331r286J348P472j0916O127L169
$$ plain form
4137 4054 -5619 3543 1496 -5276 5447 -1178 -3641 5953 -3709 -1158 5082 -5467 1640 3285
4151 3285 -5616 4225 790 -4879 5551 -2032 -3048 5656 -4264 -382 4577 -5805 1915 2522 -5592
4166 -5592 4521 -298 -4580 5480 -2738 -2240 5293 -4855 324 4161 -5651 2714 2023 -5274 4817
4181 4817 -1252 -4177 5766 -3460 -1382 5121 -5200 1098 3549 -5459 3523 1157 -4951 5122
4195 5122 -1416 -3150 5502 -3872 -833 4734 -5212 1774 2890 -5514 3951 462 -4743 5339 -2341
4210 -2341 -2547 5483 -4356 108 4629 -5238 2512 2374 -5383 4618 -316 -3918 5547 -2618 -1732
4225 -1732 5146 -4630 680 3881 -5494 3172 1389 -5154 4647 -1172 -3534 5253 -3260 -1095 4667
4240 4667 -4956 1151 3318 -5433 3740 750 -5006 4896 -1650 -3079 5284 -3984 -535 4551 -5246
$$ packed form
4137D054r673R162k047o772J0723o625k463R594r662K551O240j0549P107J645
4151C285q901R841l435n669J0430p583j016Q704r920L882M959j0382P720O07q114
4166e592J0113m819m282J0060q218M98P533j0148N179L837r812Q365o91p297J0091
4181D817o069k925R943r226K078O503j0321O298K451r008Q982k366o108J0073
4195E122o538j734Q652r374L039N567r946O986J116q404R465l489n205J0082p680
4210b341k06Q030r839M464M521r867P750j38p757J0001m934l602R465q165Q86
4225a732O878r776N310L201r375Q666j783o543R801n819k362Q787q513K165N762
4240D667r623O107K167q751R173k990n756R902o546j429Q363r268L449N086r797
$$ plain form
4255 -5246 1802 2582 -5505 3942 27 -4426 5324 -2497 -2333 5445 -4246 456 3795 -5064 2672
4270 2672 1944 -5099 4410 -585 -3705 5154 -2975 -1650 5035 -4386 885 3438 -5046 3285 1419
4285 1419 -4529 4868 -1232 -3296 5353 -3384 -973 4342 -4570 1539 2901 -4988 3589 476 -4201
4300 -4201 4787 -2250 -2723 5169 -3819 -77 4101 -5299 2164 2271 -5079 4260 -376 -4168 5086
4315 5086 -2722 -2105 4715 -4390 154 3693 -5107 2674 1614 -4954 4543 -680 -3571 5175 -3153
4330 -3153 -1209 4673 -4537 1414 3116 -5006 3312 1157 -4513 4698 -1640 -3040 5267 -3360 -413
4345 -413 4379 -4840 1582 2687 -4869 3407 460 -4086 4949 -1822 -2420 4810 -3688 -148 3765
4360 3765 -4691 2269 2010 -5131 3962 -339 -3626 4667 -2447 -1745 4498 -4309 658 3375 -4736
$$ packed form
4255e246P048P80q087R447l915m453R750p821J64P778r691M702L339q859P736
4270B672p28p043R509m995l120Q859q129J325O685r421N271K553q484Q331j866
4285A419n948R397o100k064Q649q737K411N315q912O109J362p889Q577l113m677
4300d201Q988p037m73P892q988L742M178r400P463J07p350R339m636l792R254
4315E086p808O17O820r105M544L539q800P781j060o568R497n223k891Q746q328
4330c153J944N882r210N951J702q122Q318k155n670R211o338j400Q307q627K947
4345d13M792r219O422J105p556Q276k947m546R035o771n98P230q498L540L913
4360C765q456O960k59p141R093m301l287Q293p114P02O243q807M967K717q111
$$ plain form
4375 -4736 2831 1487 -4500 4245 -1042 -3117 5061 -3132 -1160 4503 -4389 1316 2790 -4852 3129
4390 3129 854 -4040 4469 -1801 -2736 4779 -3630 -500 3771 -4601 1791 2218 -4771 3780 66
4405 66 -3745 4704 -2167 -2069 4633 -3872 376 3512 -4621 2540 1798 -4354 3859 -364 -3273 4906
4421 4906 -2913 -1384 4436 -4162 887 3197 -4934 2856 1059 -4058 4319 -1009 -2836 4866 -2972
4436 -2972 -970 4189 -4143 1421 2404 -4462 3052 405 -4077 4492 -1667 -2225 4621 -3524 -196
4451 -196 3655 -4451 1780 1822 -4561 3666 -211 -3454 4530 -2137 -1861 4370 -3847 338 3266 -4353
4467 -4353 2529 1177 -4050 3928 -758 -2938 4522 -2859 -1222 4076 -4126 1155 2721 -4438 2805
4482 2805 822 -4072 3945 -1179 -2597 4562 -3105 -566 3828 -4171 1415 2243 -4273 3481 452
$$ packed form
4375d736P567j344n987Q745n287k075Q178q193J972N663q892N705J474p642P981
4390C129k275m894Q509o270r35P515q409L130M271q372O392M27o989Q551l714
4405F6l811Q449o871R8O702q505M248L136q133P161p42o152Q213m223k909Q179
4421D906p819J529N820q598N049K310q131P790j797n117Q377n328j827P702p838
4436b972K002N159q332N564R83o866P514k647m482Q569o159n58O846q145L328
4451a96L851q106O231M2o383Q227l877l243P984o667K76O231q217M185K928p619
4467d353O882j352n227P978m686k180P460p381J637N298q202N281J566p159P243
4482B805j983m894Q017n124j418P159p667K539M394p999N586Q28o516P754l029
$$ plain form
4497 452 -3637 4443 -1687 -1910 4316 -3349 30 3396 -4415 2074 1921 -4217 3791 -291 -3274 4473
4513 4473 -2528 -1231 4164 -3792 694 2915 -4442 2632 1361 -4051 4007 -856 -3021 4292 -2894
4528 -2894 -873 3911 -4080 990 2546 -4244 3157 735 -3878 4323 -1483 -2266 4426 -3063 -337
4543 -337 3668 -4214 1715 1954 -4253 3145 115 -3303 4161 -1847 -1699 4097 -3571 131 3146 -4101
4559 -4101 2049 1566 -3971 3793 -614 -2981 4366 -2238 -1115 3975 -3572 895 2599 -4304 2947
4574 2947 843 -3651 3964 -814 -2518 4397 -2828 -449 3494 -3902 1427 2375 -4125 3094 548
4589 548 -3322 3756 -1620 -1902 4115 -3222 -129 3477 -4028 2124 1623 -3877 3034 -271 -3227 4011
4605 4011 -2238 -1552 3633 -3401 476 2760 -4140 2313 1200 -3887 3815 -578 -2581 4130 -2549
$$ packed form
4497D52m089Q080o130k23O226p665L379L366p811O489j53o138Q008m082k983P747
4513D473p001J297N395p956M486K221p357P074j271n412Q058m863k165P313p186
4528b894K021M784p991N070J556o790P401k422m613Q201n806p83O692p489K726
4543c37M005p882N929K39o207P398l030l418P464o008J48N796p668L702L015p247
4559d101O150m83n537P764m407k367P347o604J123N090p547M467J704o903P251
4574B947k104m494P615m778j704O915p225K379L943p396N329R48o500P219k546
4589E48l870P078n376k82O017p337L093L606p505O152n01n500O911l305k956P238
4605D011o249O86N185p034L877K284o900O453j113n087P702m393k003O711o679
$$ plain form
4620 -2549 -1089 3676 -3833 1098 2207 -4097 2555 1008 -3564 3754 -1207 -2290 4128 -2744 -242
4635 -242 3239 -4023 1597 1760 -3767 2751 -30 -3175 4019 -1667 -1766 3840 -3028 74 3034 -4010
4651 -4010 2138 1466 -3812 3536 -257 -2810 3862 -2081 -938 3593 -3562 483 2766 -3740 2377
4666 2377 817 -3671 3766 -889 -2387 3960 -2610 -488 3525 -3553 1222 2239 -3910 2534 228
4681 228 -3440 3841 -1543 -1996 3849 -2912 -319 3117 -3802 1638 1660 -4074 2802 -120 -3144 3785
4697 3785 -1945 -1549 3907 -3327 334 3004 -3816 2201 1279 -3561 3391 -547 -2640 3726 -2187
4712 -2187 -1126 3527 -3477 942 2364 -3651 2610 549 -3386 3525 -1123 -2263 3975 -2728 -458
4727 -458 3230 -3661 1160 1996 -3810 2676 259 -3184 3598 -1534 -1668 3560 -2772 63 2877 -3886
$$ packed form
4620b549J460M765p509M931J109o304O652j547m572P318m961j083O418o872K502
4635b42L481p262N620J63n527O518k781l145P194n686r9N606o868L102K960p044
4651d010O148o72n278P348l793k553O672n943J143M531p155M045K283o506O117
4666B377j560m488P437m655j498O347o570K122M013p078M775J017o149O444k306
4681B28l668P281n384m53N845o761K593L436o919N440K2n734O876k922l024O929
4697C785n730L96N456p234L661K670o820O017r22m840O952l938k093O366n913
4712b187J061M653p004M419J422o015O261k061l935O911m648j140O238o703K270
4727d58L688o891M821Q36n806O486k417l443O782n132j34N228o332K835K814o763
$$ plain form
4743 -3886 1748 1547 -3386 3021 -294 -2927 3668 -1942 -1423 3578 -3149 435 2439 -3797 2066
4758 2066 855 -3222 3212 -678 -2200 3634 -2407 -943 3255 -3386 924 1999 -3815 2401 528
4773 528 -3284 3387 -1219 -2172 3830 -2750 -421 3160 -3646 1402 1768 -3677 3033 90 -2691 3393
4789 3393 -1600 -1373 3613 -2880 499 2557 -3679 2044 1126 -3383 3058 -300 -2316 3566 -2033
4804 -2033 -896 3423 -3174 700 2206 -3493 2188 817 -3094 3215 -831 -2046 3593 -2423 -637
4819 -637 3025 -3326 1317 1885 -3471 2183 446 -2773 3418 -1329 -1749 3289 -2843 -70 2904 -3442
4835 -3442 1726 1565 -3281 2482 -217 -2702 3343 -1606 -1469 3176 -3015 592 2420 -3482 1919
4850 1919 960 -3313 3025 -532 -2117 3474 -2001 -870 3148 -3027 997 2117 -3539 2389 669
$$ packed form
4743c886N634k01m933O407l315k633O595n610N19N001o727L584K004o236N863
4758B066j211m077O434l890j522N834o041J464M198o641M310J075n814O216j873
4773E28l812O671m606r53O002o580K329L581o806N048L66n445O710k943k781O084
4789C393m993K27M986o493L379K058o236N723r18m509O441l358k016N882n599
4804b033J137M319o597L874J506n699N681j371l911O309m046j215N639o016J786
4819f37L662o351M643N68n356N654j737l219O191m747m20N038o132K773K974o346
4835c442N168j61m846N763k699k485O045m949J37M645o191L607J828n902N401
4850A919r59m273O338l557j585N591n475J131M018o175M024J120n656N928j720
$$ plain form
4865 669 -2954 2956 -844 -1988 3333 -2324 -333 2912 -3105 1228 1800 -3698 2580 139 -2572
4880 -2572 3336 -1385 -1355 3287 -2905 -47 2786 -3308 1664 1268 -3244 3057 -449 -2380 3428 -2154
4896 -2154 -883 2990 -2997 648 2250 -3419 2104 781 -2932 2927 -756 -1925 3142 -2380 -567
4911 -567 2739 -3201 829 1821 -3387 2491 377 -2811 3337 -1359 -1447 3264 -2525 -133 2778 -3175
4927 -3175 1617 1493 -3244 2788 -271 -2628 3236 -1642 -1203 3054 -2696 276 2393 -3046 1694
4942 1694 952 -2898 2724 -456 -2211 3252 -1769 -922 2848 -2983 752 1997 -3123 1997 596
4957 596 -2880 3022 -870 -1736 3177 -2294 -244 2612 -3052 1211 1516 -3215 2601 135 -2485 3073
4973 3073 -1481 -1320 2957 -2456 -67 2478 -3006 1541 1061 -2881 2620 -321 -2388 3006 -1684
$$ packed form
4865F69l623N910l800j144N321n657J991L245o017M333N72n498O278k441k711
4880b572N908m721L0M642o192K858K833o094M972l96m512O301l506j931N808n582
4896b154J271L873n987L645J602n669N523j323l713N859l683j169N067n522J813
4911e67L306n940M030R92n208N878k114l188O148m696q8M711n789K392K911n953
4927c175M792j24m737O032l059k357N864m878M39M257n750K972K117n439M740
4942A694p42l850N622l180j755N463n021Q47L770n831L735J245n120N120j401
4957E96l476N902l892q66M913n471K050K856n664M263L05m731N816k466k620N558
4973C073m554J61M277n413K389K545n484M547m80l942N501k941k067N394m690
$$ plain form
4988 -1684 -1012 2993 -2795 648 1958 -3378 1827 686 -2942 2686 -869 -1854 3033 -2317 -496
5003 -496 2571 -2974 770 1556 -3392 2203 504 -2590 3031 -1350 -1604 3046 -2525 -244 2706 -2701
5019 -2701 1280 1307 -2876 2682 -59 -2288 3109 -1468 -1144 3028 -2687 572 2357 -2876 1776 813
5035 813 -2685 2618 -661 -1998 3058 -1625 -981 2912 -2826 600 1856 -2985 1872 452 -2587
5050 -2587 2703 -863 -1766 3159 -2265 -448 2568 -3071 1124 1312 -3018 1936 270 -2197 3013
5065 3013 -1373 -1447 2830 -2541 -34 2351 -2901 1321 1028 -2802 2417 -287 -2023 2900 -1740 -828
5081 -828 2718 -2332 234 2093 -2929 1805 590 -2620 2803 -537 -1526 2927 -2006 -514 2660
5096 2660 -2633 973 1453 -2834 2072 372 -2450 2711 -946 -1414 3128 -2192 35 2475 -2563
$$ packed form
4988a684O72M005n788L443J310n336N205j141l628N628l555r85M887n350J821
5003d96L067n545L744P86m948N595j699l094N621m381k54M650n571K281K950n407
5019b701L981K7m183N558k741k229N397m577L24M172n715L259J785n233M652r63
5035H13l498N303l279j337N056m683O44L893n738L426J256m841M857j420l039
5050b587N290l566r03M925n424J817L016n639M195J88m330M954j666k467N210
5065C013m386p4M277n371K507K385n252M222k93l830N219k704j736M923m640R12
5081h28L546n050K566J859n022M734j215l210N423l340r89M453m933J492L174
5096B660n293L606M80m287M906j700k822N161l657m68M542n320K227K440n038
$$ plain form
5111 -2563 1157 1157 -2733 2513 -134 -2180 2770 -1301 -1083 2642 -2511 319 1980 -2914 1393 872
5127 872 -2856 2563 -450 -2000 2860 -1587 -827 2635 -2629 582 1608 -2805 1895 635 -2553
5142 -2553 2530 -862 -1770 2978 -1983 -515 2417 -2615 1093 1618 -2759 1998 252 -2274 2698
5157 2698 -1019 -1090 2736 -2188 63 2067 -2734 1294 967 -2631 2219 -355 -2115 2668 -1240 -1048
5173 -1048 2582 -2144 338 2049 -2808 1673 689 -2523 2544 -719 -1818 2824 -1650 -491 2668
5188 2668 -2504 968 1537 -2749 1881 298 -2432 2488 -813 -1387 2838 -2212 -204 2371 -2414
5203 -2414 1150 1341 -2614 2122 -298 -1873 2751 -1219 -1289 2667 -2042 334 2056 -2746 1368 898
5219 898 -2643 2370 -476 -2041 2766 -1672 -585 2478 -2271 773 1760 -2553 1655 499 -2479
$$ packed form
5111b563L720%l890N246k647k046M950m071K18L725n153K830J661m894M307n21
5127H72l728N419l013j550M860m447P60L462n264L211J026m413M700j260l188
5142b553N083l392r08M748m961J468K932n032L708N25m377M757j746k526M972
5157B698l717p1L826m924K251K004m801M028l27l598M850k574j760M783l908J92
5173a048L630m726K482J711m857M481r84l212N067l263j099M642m474J159L159
5188B668n172L472N69m286M630j583k730M920l301n74M225n050K008K575m785
5203b414L564J91l955M736k420j575M624l970p0L956m709K376J722m802M114m70
5219H98l541N013k846j565M807m438J087L063m749L044R87m313M208j156k978
$$ plain form
5234 -2479 2723 -784 -1527 2837 -1709 -349 2367 -2745 765 1533 -2551 1978 284 -2246 2503
5249 2503 -896 -983 2722 -1875 51 2198 -2607 1067 1207 -2485 2208 -10 -2029 2440 -1465 -770
5265 -770 2616 -2466 265 1842 -2513 1287 990 -2340 2407 -557 -1753 2494 -1780 -396 2424
5280 2424 -2390 646 1490 -2617 1629 562 -2281 2372 -677 -1333 2683 -2011 -68 2053 -2586
5295 -2586 1110 1436 -2471 1935 -153 -1936 2537 -1096 -1727 2526 -2060 229 1992 -2397 1162
5310 1162 869 -2461 2026 -251 -1805 2480 -1211 -584 2450 -1898 296 1765 -2448 1309 595 -2469
5326 -2469 2162 -264 -1836 2421 -1462 -519 2313 -2282 671 1528 -2251 1729 55 -1850 2441
5341 2441 -1047 -1385 2661 -1720 -274 2141 -2531 784 836 -2440 1854 72 -1912 2429 -1140 -911
$$ packed form
5234b479N202l507p43M364m546J360K716n112L510P68m084M529j694k530M749
5249B503l399q7L705m597J926K147m805L674J40l692M693k218k019M469l905O95
5265g70L386n082K731J577m355L800k97l330M747k964j196M247m274J384K820
5280B424m814L036Q44m107M246j067k843M653l049o56M016m694J943K121m639
5295b586L696L26l907M406k088j783M473l633o31M253m586K289J763m389L559
5310A162k93l330M487k277j554M285l691O27L034m348K194J469m213L757p14l064
5326b469M631k426j572M257l883R43K832m595K953Q57l779L980j674j905M291
5341B441l488l38M046m381J446K415m672L315N2l276M294j782j984M341l569K29
$$ plain form
5357 -911 2310 -2020 283 1741 -2486 1388 709 -2564 2242 -462 -1638 2515 -1237 -746 1971 -2217
5373 -2217 329 1648 -2311 1554 543 -2185 2369 -591 -1257 2662 -1787 -627 1913 -2397 792
5388 792 1298 -2408 1708 268 -2316 2327 -944 -1121 2112 -1826 -47 2017 -2436 1040 939 -2243
5404 -2243 1753 -54 -1737 2479 -1077 -859 2362 -1837 16 1886 -2129 1241 692 -2102 2082
5419 2082 -381 -1485 2315 -1256 -637 2175 -2157 421 1325 -2351 1336 478 -2333 2072 -754 -1394
5435 -1394 2348 -1671 -326 1899 -2375 772 854 -2442 1905 71 -2060 2370 -872 -875 2245 -1670
5451 -1670 142 1698 -2432 1143 859 -2102 2080 -124 -1757 2229 -1249 -705 2043 -1779 386
5466 386 1579 -2284 1573 550 -2184 2112 -597 -1259 2287 -1552 -328 1935 -2141 699 1266 -2167
$$ packed form
5357i11L221m330K303J458m227L874o79l273M806k704j176M153l752M91K717m188
5373b217K546J319l959L865j011k728M554k960o66L919m449J160K540m310L189
5388G92N06l706M116j440k584M643l271j77L233l938J779K064m453L476j01l182
5404b243L996j807j683M216l556K18L221m199J853J870m015L370n49k794M184
5419B082k463j104L800l571O19K812m332K578R04l676L687q58k811M405k826o40
5435a394L742m019J345K225m274L147Q2l296M347j834k131M430l242lL120l915
5451a670J812J556m130L575k84k961M182k204j633L986l478N44K748l822K165
5466C86J193l863L857j023k734M296k709o62L546l839J224K263m076K840N67l433
$$ plain form
5482 -2167 1688 343 -1831 2201 -883 -1028 2181 -1477 -211 1848 -2138 923 1034 -2194 1814
5497 1814 102 -1909 2183 -1204 -745 2110 -1822 139 1554 -2181 966 745 -2222 1682 -344
5512 -344 -1584 2263 -1263 -701 2023 -1972 248 1336 -2209 1258 665 -2242 2198 -684 -937 2043
5528 2043 -1420 -346 1802 -2133 790 1267 -2376 1524 82 -1837 2286 -1027 -1057 2120 -1839 -92
5544 -92 1775 -2049 847 1235 -2047 1913 -183 -1701 2116 -1243 -853 2134 -1634 441 1536 -2005
5560 -2005 1349 698 -1951 1566 -532 -1521 2232 -1327 -566 1914 -2025 347 1154 -2388 1341 340
5576 340 -2042 2060 -652 -1205 2084 -1596 -55 1763 -2136 747 980 -2153 1595 154 -1740 1912
5592 1912 -880 -1009 1835 -1805 208 1589 -2021 1007 910 -2016 1826 -242 -1309 2309 -1144 -597
$$ packed form
5482b167L855j345k174M032l084j45L209l658J266K059l986L061J11l228M008
5497A814j712k011M092l387M59K855l932J961J415l735L147k21k967L904k026
5512c44j240L847l526N62K724l995K220J088l545L467n93k907M440k882k53K980
5528B043l463J074K148l935K923M77l643L900j442j919M123l313l0L177l959J747
5544i2J867l824K896L88l282L960k096j518L817l359L90K987l768K075J095l541
5560b005L354o51k649L517k098r89L753l559P61K480l939K372Q07l542L729j001
5576C40k382M102k712n53L289l680J541J818l899K883K33l133L748j441j894L652
5592A912k792j29K844l640K013J381l610L028r7k926L842k068j067L618l453N47
$$ plain form
5608 -597 2020 -1864 56 1567 -2225 1206 352 -1918 1983 -548 -1279 2149 -1392 -315 1910 -2099
5624 -2099 451 1137 -2250 1330 196 -1920 1789 -634 -1166 2001 -1387 104 1702 -1877 830
5639 830 1020 -1844 1716 14 -1540 1931 -972 -494 2064 -1595 181 1355 -2080 1323 451 -1898
5655 -1898 1829 -153 -1215 2150 -1237 -220 1769 -1980 404 1135 -2177 1187 307 -1853 1785
5670 1785 -520 -1088 2052 -1161 -100 1680 -1986 735 881 -2101 1410 35 -1667 1919 -924
5685 -924 -1175 2169 -1666 -233 1648 -1887 888 726 -1952 1895 -174 -1440 1925 -1206 -886 1882
5701 1882 -1688 291 1524 -2122 1543 667 -1923 1650 -153 -1215 2080 -1291 -333 1834 -1817
5716 -1817 458 1259 -1896 1325 351 -1597 1872 -749 -1228 1972 -1454 -250 1649 -2283 876 1033
$$ packed form
5608e97K617l884J920J511l792L431q54k270L901k531p31L428l541J077K225m009
5624b099K550O86l387L580j134k116L709k423n32L167l388J491J598l579K707
5639H30J90k864L560j702j554L471k903M78K558l659J776J174l435L403q72k349
5655a898L727j982j062L365l387J017J989l749K384P31l312L364q80k160L638
5670A785k305n68L140l213J061J780l666K721J46k982L511j375j702L586k843
5685i24k51L344l835J433J881l535K775j62k678L847k069j266L365l131L20K768
5701A882l570J979J233l646L665q76k590L573j803j062L295l371R58K167l651
5716a817K275Q01l155L221r74j948L469k621m79L200l426J204J899l932L159J57
$$ plain form
5732 1033 -1522 1465 -15 -1437 1820 -834 -621 1825 -1685 13 1399 -1656 950 908 -1823 1624
5748 1624 -275 -1494 2113 -1269 -482 1922 -1656 215 1332 -1958 1134 387 -1722 1568 -459
5763 -459 -1008 1945 -1325 -514 1805 -1786 701 952 -1865 1346 279 -1438 1634 -768 -850 1739
5779 1739 -1480 109 1584 -1916 794 746 -1970 1655 -123 -1472 2055 -889 -788 1682 -1634 322
5795 322 1283 -1916 754 680 -1773 1297 -386 -1248 1872 -1066 -421 1673 -1631 282 1346 -1785
5811 -1785 1127 249 -1432 1653 -453 -1007 1847 -1285 -158 1562 -1704 669 1045 -1854 1327 218
5827 218 -1462 1966 -833 -724 1901 -1452 54 1785 -1596 687 655 -1471 1650 -44 -1060 1644
5843 1644 -926 -545 1860 -1376 294 997 -1687 1217 448 -1561 1688 -587 -967 1771 -1158 -191
$$ packed form
5732A033k555K987j480j422L257k654K13K446l510J698J386l055K606m2k731L447
5748A624j899j219L607l382P87K404l578J871J117l290L092p47k109L290k027
5763d59n49K953l270Q11K319l591K487K51k817L211j067j717L072k402q2K589
5779A739l219J589J475l500K710m8k716L625j778j349L527k944J01K470l316J956
5795C22R61l199K670p4k453L070j683q62L120k938O45K094l304J913J064l131
5811a785K912q78j681L085k106n54K854l132J127J720l266K373L76k899L181j109
5827B18j680L428k799J09K625l353J506J731l381K283l2k126L121j694j016K704
5843A644k570L81K405l236J670P03k684K904p69k009L249k275l80K738k929R67
$$ plain form
5859 -191 1759 -1674 839 967 -1773 1251 261 -1681 1798 -682 -805 1856 -1388 -34 1293 -1734
5875 -1734 703 1125 -2130 1421 -165 -1395 2020 -789 -762 1626 -1502 91 1248 -1886 995 643
5891 643 -1780 1424 -242 -1382 1778 -1126 -405 1875 -1509 361 1043 -1622 1226 336 -1803 1516
5907 1516 -485 -1032 1837 -1114 -338 1577 -1629 538 1006 -1892 1278 120 -1562 1677 -768 -704
5923 -704 1982 -1136 -274 1567 -1681 850 670 -1660 1437 -161 -1226 1806 -637 -604 1594 -1124
5939 -1124 117 1306 -1837 1082 416 -1642 1450 -187 -1087 2123 -972 -412 1678 -1425 387 898
5955 898 -1790 1201 407 -1562 1669 -467 -916 1685 -1307 -284 1633 -1603 672 746 -1648 1357
5971 1357 187 -1671 1617 -830 -631 1559 -1324 235 1582 -1652 969 765 -1641 1572 -345
$$ packed form
5859a91J950l433K513J28k740L024r90j942L479k480j23K661l244J354J327l027
5875a734K437M22l255L551j586j230L415k809K7K388l128J593J157l134K881l52
5891F43k423L204j666j140L160k904P21K280l384J870O82k665K848q90k139L319
5907A516k001n47K869k951P76J915l206K167M68k898L170j158j682L239k445O4
5923g04K686l118Q62J841l248K531j80k330L097j598j065L032k443L3K198k718
5939a124J241J189l143K919o66k058L092j637r00L210l095N60K090l103J812N11
5955H98k688K991p94j969L231k136m49K601k992J023J917l236K275P4k394L005
5971A357j170j858L288k447J99K190k883J559J347l234K621k04k406L213j917
$$ plain form
5986 -345 -1216 1506 -917 -372 1506 -1297 208 1013 -1451 1112 497 -1462 1257 -241 -902 1311
6002 1311 -897 -302 1444 -1655 461 926 -1572 1023 159 -1223 1553 -529 -689 1547 -1128 -27
6018 -27 1447 -1544 674 1107 -1545 1013 -120 -1264 1518 -911 -608 1489 -1129 82 1176 -1486
6034 -1486 927 714 -1582 1296 -253 -1131 1567 -855 -386 1382 -1420 303 845 -1425 1039 341
6050 341 -1433 1550 -393 -1054 1351 -1213 -158 1407 -1557 543 1021 -1548 1239 50 -1280 1411
6066 1411 -379 -826 1295 -1230 -186 1289 -1359 571 543 -1573 1202 -132 -1184 1623 -818 -481
6082 -481 1340 -1322 145 963 -1434 796 282 -1213 1372 -415 -776 1516 -754 -360 1274 -1459
6098 -1459 184 855 -1567 996 219 -1752 1450 -473 -975 1313 -1288 -192 1206 -1728 479 724
$$ packed form
5986c45q71K722k423N45J878k803J505Q05k464K563o15j959K719j498o61K213
6002A311k208N95J746l099K116M65k498K595q64j382K776k082j60K236k675J101
6018b7J474k991K218M33k652K558j133j144K782k429L03K097k618J211J094k662
6034a486K413k13k296K878j549q78K698k422M69J768k802J723N42k270K464o98
6050C41j774K983j943o61K405k564J055J565k964K100M78k569K787j189j330K691
6066A411j790m47K121k525J044J475k648J930k8k116K775j334j052K807k441L37
6082d81J821k662J467Q18k397K230n14j495K585j787l61K292k270L94J634k733
6098a459J643O71k422K563p77j971L202j923n02K288k601J096J398k934K207K45
$$ plain form
6114 724 -1431 1164 53 -1357 1510 -586 -626 1162 -1284 199 1018 -1564 862 527 -1262 989
6130 989 -338 -787 1655 -764 -491 1218 -1379 458 941 -1577 785 618 -1252 1560 -239 -875
6146 -875 1519 -1086 -277 1057 -1438 599 1022 -1610 1012 261 -1145 1270 -612 -603 1376 -1068 314
6163 314 1032 -1434 763 713 -1333 1425 -141 -1303 1237 -753 -439 1262 -1384 139 945 -1455
6179 -1455 835 310 -1262 1178 -412 -736 1473 -893 -460 1317 -1229 143 655 -1353 782 512
6195 512 -1487 1166 -716 -672 1526 -1197 -2 1319 -1458 588 829 -1254 1007 -20 -974 1524
6211 1524 -509 -417 1404 -932 154 1220 -1427 561 483 -1414 1155 -117 -1003 1449 -985 -501
6227 -501 1356 -1235 276 730 -1444 1020 452 -1468 1384 -406 -852 1307 -768 -63 1323 -1209
$$ packed form
6114G24k155K595j111j410K867k096m0J788k446J483Q19k582K426l35j789K251
6130I89j327m49K442k419K73J709k597J837M83k518K362j67j870K812j799o36
6146h75K394k605Q09J334k495K037M23k632K622p51j406K415j882RJ979k444J382
6163C14P18k466K197n0k046K758j566j162K540j990L14J701k646J523Q06k400
6179a455K290n25j572K440j590l24K209k366M33J777k546J372N12k008K135k70
6195E12j999K653j882M4K198k723J195J321k777K046K41k083K261j027r54K498
6211A524k033R2J821k336J086J066k647J988p8j897K569j272q86K452k434M84
6227e01J857k591J511M54k174K464n68j920K852j790m46K159k075P05J386k532
$$ plain form
6243 -1209 548 646 -1318 1050 170 -1146 1507 -742 -758 1213 -979 80 1086 -1264 616 511
6259 511 -1199 981 -117 -1174 1484 -909 -486 1367 -1218 47 1067 -1174 967 293 -1457 1228
6275 1228 -146 -875 1290 -835 -121 1155 -1139 388 1107 -1233 1098 441 -1223 1434 -538 -405
6291 -405 1281 -1074 -63 1081 -1175 682 588 -1161 1180 18 -1274 1128 -732 -621 1386 -1086
6307 -1086 -49 1091 -1338 385 352 -1408 1211 -347 -1047 1392 -758 -370 1234 -1126 178 984
6323 984 -1303 814 374 -1193 886 -260 -950 1365 -1046 -69 1055 -1297 336 806 -1284 1011
6339 1011 19 -1324 1366 -636 -513 1270 -1251 -50 796 -1389 579 460 -1200 936 -37 -1051
6355 -1051 1144 -648 -306 1084 -1227 214 903 -1092 642 464 -1383 1256 -73 -764 1420 -587
$$ packed form
6243a209J757R8j964K368q80j316K653k249j6J971k192J059J006k350J880j05
6259E11j710K180j098j057K658k393M23J853k585J265J020k241K141o74j750K685
6275A228j374p29K165k125P14J276k294J527P19k340K331o57j664K657j972J33
6291d05J686k355J011J144k256J857r4j749K341j162j292K402j860J11K007k472
6307a086J037J140k429J723l3j760K619j558p00K439k150L88J604k360J304Q06
6323I84k287K117m40j567K079j146o90K315k411R77J124k352J633M70k090K295
6339A011r92j343K690k002J23J783k521J201Q46k185J968j19j660K136r73j014
6355a051K195j792L42J390k311J441O89j995J734j78j847K639j329o91K184k007
$$ plain form
6371 -587 -205 1355 -777 -7 1144 -1250 963 338 -1042 1251 -410 -757 1313 -732 -121 1021
6387 1021 -1215 382 506 -1276 977 153 -1086 1194 -553 -674 1272 -877 188 1071 -1682 663
6403 663 254 -1268 937 -170 -930 1351 -410 -348 1043 -1119 124 1217 -1344 539 257 -1093
6419 -1093 984 -199 -680 1329 -599 -199 1058 -1138 382 859 -1109 904 263 -1041 1392 -408
6435 -408 -598 1182 -918 -35 906 -1040 436 555 -1077 980 154 -566 1189 -631 -426 1073 -1087
6452 -1087 229 1024 -1055 615 473 -1112 927 -136 -621 1133 -664 -318 1102 -1242 194 655
6468 655 -1233 868 -71 -1205 1190 -537 -688 1156 -493 -155 848 -1241 386 618 -1274 874
6484 874 -18 -860 1086 -435 -743 947 -962 -52 854 -1076 647 118 -963 1001 -146 -921 1207
$$ packed form
6371e87L82J560k132P70J151k394K213o25j380K293j661l47K070k045O11J142
6387A021k236J597J24j782K253q24j239K280j747j21J946k149J065Q83k753K345
6403F63m09j522K205j107p60K281j761O2J391k162J243J093k561J883k82j350
6419a093K077j183m81K009j928M00J257k196J520M77j968K013o41j304K433j800
6435d08j90J780k100Q83R41j946J476J19j632K057q26p20J755j820K05J499k160
6452a087J316P95k079J670j42j585K039j063m85J754j797L46J420k344J436M61
6468F55j888K101r39j134K395j727j51J844j649L38J003k089J627K32j892K148
6484H74q92q42J946j521l08J690j909R10R06j930J723n29j081J964j147p75K128
$$ plain form
6501 1207 -622 -162 1200 -974 -98 683 -1282 764 308 -1463 952 -300 -722 1235 -707 -232
6517 -232 1000 -1086 498 743 -1274 834 316 -919 1027 -329 -639 1219 -862 -264 767 -1144
6533 -1144 418 505 -1171 812 162 -1011 1118 -511 -641 1072 -984 -67 812 -1117 515 377 -1297
6550 -1297 799 -169 -756 930 -746 -155 1209 -980 226 841 -1147 787 277 -1414 1047 -422
6566 -422 -821 1208 -837 -281 980 -887 477 617 -1106 756 131 -802 1036 -465 -427 1086 -904
6583 -904 96 941 -1198 605 293 -1192 1122 79 -772 1087 -554 -189 991 -934 46 830 -1176
6600 -1176 504 286 -1362 992 -230 -816 1301 -524 -251 838 -940 259 838 -1002 614 107
6616 107 -1053 949 -460 -433 1237 -924 -48 1011 -1320 723 474 -1280 883 -176 -761 1014
$$ packed form
6501A207j829M60J362k174Q76P81j965K046m56j771K415j252m22J957j942M75
6517b32J232k086J584K45k017K108n18j235J946j356l10J858k081N98J031j911
6533a144J562Q7j676J983o50j173K129j629j30J713k056R17Q79j929J632j38j674
6550a297K096r68n87J686j676N91J364k189J206O15j988J934n10j691K461j469
6566d22l99K029k045N56J261j867J364J40j723J862o25r33J838j501L8J513j990
6583i04J000Q45k139J803l12j485K314j043q51J859j641L65J180j925R80P84k006
6600a176J680k18j648K354j222n86K117j825K73J089j778J199N79j840J616n07
6616A07j160K002j409K7J670k161Q76J059k331K043k49j754K163j059n85J775
$$ plain form
6632 1014 -386 -605 814 -966 11 769 -903 598 349 -858 1022 -211 -622 1325 -399 -260
6648 -260 1078 -956 354 836 -853 883 357 -1133 1073 -318 -296 1116 -626 -122 1010 -1174
6664 -1174 407 319 -975 888 198 -850 1025 -375 -623 1067 -839 180 983 -853 396 421 -1207
6681 -1207 892 33 -718 992 -666 -327 758 -859 94 1027 -1095 666 234 -1022 958 -243
6697 -243 -891 989 -604 -422 906 -1150 198 760 -1021 628 -6 -1049 1088 -395 -419 979 -923
6714 -923 -152 1050 -883 362 553 -741 772 156 -698 1384 -466 -252 843 -941 24 722 -1076
6731 -1076 666 324 -982 732 36 -517 788 -424 -516 912 -832 302 628 -1029 602 142 -1183
6748 -1183 959 -182 -452 1111 -657 -337 861 -1065 295 670 -598 656 3 -694 686 -333
$$ packed form
6632A014j400k19J419j780R77P58j672J501k49j207J880j233m11J947j724J39
6648b60J338k034J310M82j689J736n26j490K206j391K2J412j742N04J132k184
6664a174J581q8j294J863o90j048J875j400k48J690j906J019Q03j836J249K5j628
6681a207K099q59p51J710j658L39J085j617R53R33k122J761m32j256J980j201
6697b43o48J880j593J82J328k056J348N62j781J649o34j043K137j483k4J398j902
6714i23P71J202j933J245J91j294J513o16q54K082j850K14J095j784R65O98j798
6731a076J742l42j306J714o96n53J305j212r2J428j744J134L26j657J631m60j325
6748a183K142j141k70J563j768L20J198j926J360L75j268J254o53o97J380j019
$$ plain form
6764 -333 -604 898 -836 -30 889 -1080 426 690 -1101 689 -25 -742 999 -520 -442 1160 -743
6781 -743 33 770 -1083 582 262 -1202 872 -128 -869 1181 -581 -177 993 -972 200 591 -883
6798 -883 812 117 -971 773 -358 -711 985 -709 56 833 -934 262 662 -993 977 71 -923
6815 -923 1051 -169 -350 986 -668 -122 603 -913 458 426 -898 714 -142 -756 997 -363 -468
6832 -468 1058 -798 114 802 -963 637 443 -699 982 -39 -722 1035 -468 -176 716 -935 215
6849 215 669 -968 762 144 -676 986 -459 -413 1226 -733 96 989 -1074 392 320 -1028 651
6866 651 149 -620 760 -697 -455 1091 -765 131 476 -885 526 197 -910 812 -87 -590 905
6883 905 -650 -459 850 -779 -14 654 -1191 602 389 -597 969 -183 -723 985 -559 -222 769
$$ packed form
6764c33k71J502j734Q06R19j969J506K64j791J790p14p17J741j519P8J602j903
6781g43P76P37j853J665l20j464K074j000p41K050j762M04J170j965J172L91j474
6798h83J695o95j088J744j131l53J696j694P65P77j767J196M00j655J970r06r94
6815i23J974j220j81J336j654N46P25j516J371l2j324J612q56o14J753j360j05
6832d68J526j856R12O88j765J600j94j142J681j021o83J757j503K92Q92j651J150
6849B15M54j637J730o18q20J662j445M6J639j959Q29Q93k063J466p2j348J679
6866F51n02p69J380j457K42J546j856Q96L45j361J411l29j107J722q99n03J495
6883I05j555J91J309j629P65O68j845J793k13r86J566j152n40J708j544L37R91
$$ plain form
6900 769 -796 279 647 -907 668 -76 -683 949 -497 -614 983 -509 -86 856 -743 200 453
6917 453 -839 897 -101 -654 814 -720 -333 959 -744 -17 644 -1098 645 164 -1096 646 -173
6934 -173 -563 1065 -550 -397 638 -1022 -32 531 -858 665 115 -657 876 -341 -569 1056 -486
6951 -486 -241 668 -923 374 548 -987 882 125 -892 1116 -448 -529 832 -594 77 530 -900
6968 -900 292 411 -942 773 -154 -571 1184 -652 -239 883 -724 147 599 -1111 639 171 -640
6985 -640 777 -310 -731 654 -772 -223 587 -800 241 586 -994 645 157 -682 948 -278 -333
7002 -333 1027 -660 -23 931 -888 281 673 -890 838 -171 -896 1085 -568 -321 724 -726
7018 -726 303 769 -864 109 199 -745 763 242 -775 874 -429 -161 771 -611 178 492 -903 524
$$ packed form
6900G69j565J075L68j554J575p44o07J632j446j17J597j492M23R42j599R43K53
6917D53j292J736r98n53J468j534L87J292j703P27O61j742J743m81j260J742q19
6934a73l90J628j615J53J035j660R90N63j389J523n50p72J533j217k28J625j542
6951d86K45R09j591J297J74j535J869p57j017K008j564q1J361j426O71M53j430
6968i00J192J19j353J715r27m17J755j836M13J122j607Q71M52j710J750m68q11
6985f40J417j087m21J385j426N49Q10j387J041L45j580J639m88q39J630j226n5
7002c33J360j687O37R54j819J169L92j563J728j009p25J981j653K47J045j450
7018g26J029M66j633R73R0r44J508n21j017J649j303K68R32j382P89L14j395J427
$$ plain form
7036 524 267 -717 824 -333 -544 1208 -657 -227 889 -882 313 480 -956 510 121 -671 994
7053 994 -336 -467 911 -964 -59 601 -929 400 378 -904 518 118 -827 718 -441 -364 851
7070 851 -801 -184 961 -860 346 413 -936 373 -58 -369 769 -320 -352 873 -832 -4 514
7087 514 -961 788 102 -825 838 -393 -535 788 -502 -334 781 -989 199 458 -735 492
7103 492 -9 -821 928 -284 -498 704 -754 93 502 -1133 366 405 -968 777 22 -579 909
7120 909 -645 -178 993 -867 -83 686 -962 520 474 -812 718 -123 -757 988 -583 -530 816
7137 816 -751 216 447 -949 743 126 -669 730 -191 -731 963 -820 -382 658 -777 290 608
7154 608 -817 710 165 -662 951 -392 -350 903 -423 -12 734 -890 429 105 -839 707 -46
$$ packed form
7036E24k57r84J541j157k11J752j865M30J116j771J195J67j436J466l89p92J665
7053I94j330j31J378j875R05O60j530J329k2j282J422m00r45J545j159P7J215
7070H51j652O17J145j821J206O7j349J309m31l11J138j089l2J225j705Q28N18
7087E14j475J749o86r27J663j231j42J323j290J68J115j770J188K59j193J227
7103D92n01q12J749j212k14J202j458Q47M09j635J499L9j373J745p55o01J488
7120I09j554M67J171j860P84P69j648J482m6j286J530q41o34J745j571N3J346
7137H16j567R67K31j396J692o17p95J399r21n40J694j783M38J040j435J067L18
7154F08j425J527n45q27J613j343M2J253j326M11P46j624J319l24r44J546p53
$$ plain form
7171 -46 -618 805 -503 -185 846 -605 173 533 -1069 325 438 -252 828 -127 -562 845 -519
7188 -519 -312 697 -916 57 357 -877 530 92 -651 801 -117 -269 753 -280 30 617 -884
7205 -884 324 422 -911 900 -125 -661 748 -510 -187 895 -736 -80 683 -946 417 338 -781
7222 -781 856 9 -623 662 -290 -270 735 -674 -68 653 -937 505 171 -598 685 -93 -275 722
7240 722 -433 -364 711 -426 313 461 -841 728 251 -621 844 -480 -224 784 -416 -68 422
7257 422 -872 219 465 -708 483 -73 -505 796 -290 -116 756 -621 117 539 -1014 586 436
7274 436 -791 557 -63 -458 963 -463 -171 1001 -715 215 715 -765 338 -28 -478 768 -20
7291 -20 -449 774 -576 -102 870 -905 195 432 -868 423 215 -757 841 -174 -520 663 -456
$$ packed form
7171d6n72J423j308L18J031j451P78L60j602J394J13o90J080r55m35J407j364
7188e19K07J009j613R73L00j234J407m38p43J452r18j52J022j033L10N87j501
7205h84J208R8j333J811j025n36J409j258L23J082j631O56P63j629J363p9j119
7222g81J637q47o32J285r52K0J005j409O06P21j590J442l34p69J283p78j82R97
7240G22j155O9J075j137P39J48j302J569m77q72J465j324K56J008j200L48M90
7257D22j294J091K46j173J191n56m32J301j086J74Q72j377P38M22j553J600j50
7274D36j227J348o20l95J421j426K92J172j716R30N00j480J103l66m50J246p88
7291b0m29J223j350M74R72j775J100K37j300J291k08r72J598j015l46J183j119
$$ plain form
7308 -456 -52 703 -777 329 323 -1010 424 23 -695 533 -292 -158 657 -570 65 503 -721 667
7326 667 446 -851 689 -120 -492 736 -295 -157 742 -641 208 333 -804 352 68 -595 804
7343 804 -14 -193 699 -733 39 720 -559 -44 435 -806 466 101 -481 699 -289 -375 739 -607
7361 -607 278 640 -808 330 116 -597 576 -243 -466 775 -183 -329 682 -464 -54 592 -735 181
7379 181 401 -474 597 -112 -528 642 -498 -126 570 -645 42 137 -964 484 55 -725 800 -132
7397 -132 -342 517 -665 -247 547 -565 302 309 -783 434 263 -744 660 -344 -276 613 -597 179
7415 179 579 -909 119 71 -745 655 -51 -224 721 -257 -333 615 -646 231 238 -709 376 285 -583 635
7435 635 -223 -431 780 -278 -183 729 -577 288 512 -704 441 262 -426 719 37 -511 730 -753
$$ packed form
7308d56M04P55j480J106oj333J434m01p18J228q25J34Q15j227O35M38j224J388
7326F67k21j297J540q09l72J228j031J38Q99j383Q49J25j137J156k84o63J399
7343H04q18j79Q92j432P72O81j279N15M79j241J272l65n82J180r88q6J114j346
7361f07Q85L62j448J138k14p13J173q19k23J241r58j46J011j146M10O46j327R16
7379A81K20q75J071p09m16J170j140L72O96j215O87R5j101J448m29p80J525r32
7397a32k10Q59j182M18P94j112Q67Pj092J217j71j007J404j004O8Q89j210P76
7415A79M00j488J028m8q16J400p06j73R45r78p6R48j261Q77Pr47J085r1q68J218
7435F35q58k08J211j058R5R12j306Q65K24j216J145j79o88J145o82n48J241j483
$$ plain form
7453 -753 -92 504 -669 294 364 -804 695 76 -803 907 -321 -477 681 -663 -85 460 -642 288
7471 288 29 -719 586 -138 -591 801 -362 -197 692 -814 130 324 -721 634 237 -493 713 -228
7489 -228 -403 558 -386 15 418 -593 135 413 -767 755 89 -629 507 -210 -281 698 -423 171 546
7508 546 -843 147 459 -605 713 -18 -519 496 -625 -120 650 -826 85 692 -644 164 211 -704
7526 -704 623 -93 -516 685 -520 -144 499 -599 17 412 -678 578 145 -749 601 -78 -418 597
7544 597 -529 319 401 -637 365 310 -469 471 93 -681 722 -346 -214 722 -574 -115 556 -886
7562 -886 303 311 -731 588 -60 -331 395 -281 -190 529 -523 161 446 -687 427 53 -811 657 -381
7581 -381 -511 479 -447 -113 650 -751 69 71 -539 414 96 -401 467 -73 -538 824 -559 -65 641 -580
$$ packed form
7453g53O61N96j173R63P0j168J499o19q79J710j228j56J158j344N78N45j102R30
7471B88k59p48J305p24m53J392j163J65Q89j506R44J94j045J355l97p30J206r41
7489b28j75R61r44M01M03j011P28K78j180J522o66p18J136p17p1R79j121N94L75
7508E46j389R90L12j064J318p31n01J015j121N05P70j476R11O07j336Q08M7r15
7526g04J327p16m23J201j205L76O43j098O16L95j090J256m33q94J350o79l40J015
7544E97j126Q48Q2j038J002n5p79R40l78p74J403j068J32R36j296M59O71j442
7562h86J189Qj042J319o48k71P26o76R1P19j052O84K85j133J114l74q64J468j038
7581c81j30R90r26L34P63j401Q20Ko10R53l18m97Q68n40m65J362j383M94P06j221
$$ plain form
7601 -580 195 329 -649 706 120 -530 562 -317 -190 498 -427 13 466 -631 383 161 -414 310 -153
7620 -153 -384 493 -569 90 465 -514 160 430 -752 380 170 -674 825 -113 -176 490 -255 -51 424
7639 424 -517 219 241 -516 269 209 -607 563 7 -409 703 -703 -136 484 -437 256 214 -571 644 -130
7659 -130 -414 683 -428 -188 329 -594 7 344 -689 446 126 -596 459 -50 -465 538 -451 -424
7677 -424 785 -394 151 246 -754 435 78 -383 623 -170 -290 590 -361 3 567 -541 232 314 -668
7696 -668 497 132 -820 525 -247 -211 628 -561 212 346 -748 306 228 -491 364 -50 -155 518 -387
7715 -387 47 714 -563 302 195 -692 328 -39 -430 517 -174 -275 317 -170 -83 554 -374 194 136 -670
7735 -670 295 134 -503 693 -255 -409 737 -343 50 602 -694 178 387 -754 298 2 -284 531
$$ packed form
7601e80P75J34r78J355n86o50J092q79J27O88r25M40M53j097J014k22n75P24m63
7620a53k31Q77j062O59L75r79O74K70j182J132k10q44J499r38o3O66p45K04M75
7639D24r41P36K2p57P85o0q16J170n56m16J112j406N67O20r21O93m2p85J215p74
7659a30k84J097j111K40N17r23O01L37j033J135l20p22J055n09m15J003r89K7
7677d24J209j179N45R5j000J189l57m61J006p93j20Q80r51L64N64j108P73Q2r82
7696f68J165l65r52J345p72L6Q39j189P73J34j094J054p8p19Q55m14j05O73r05
7715c87M34O67j277Q65j07q87J020l67l91R47o91j01N92m87Q7O37r28N68n8q06
7735f70R65j61o37J196r48j54J146j080L93N52j296Q72K09j141J052k96k86Q15
$$ plain form
7753 531 -219 -191 340 -340 61 508 -735 302 384 -571 635 -325 -360 608 -76 -93 458 -550 341 239
7773 239 -918 339 -36 -583 486 -274 -309 534 -459 220 253 -586 29 352 -810 482 -15 -494 443
7792 443 -432 -188 476 -444 4 518 -698 308 188 -639 565 297 -472 425 -246 -170 283 -665 162
7811 162 62 -543 237 181 -510 739 -108 -49 788 -415 -114 601 -500 229 161 -578 534 -143 -828 450
7831 450 29 -256 356 -516 86 403 -371 224 57 -427 719 -232 -231 400 -384 -41 363 -486 -15 488
7851 488 -493 385 547 -287 477 -348 -321 695 -287 87 513 -462 200 349 -427 273 339 -486 687 87
7871 87 -454 542 -546 14 245 -454 386 387 -485 203 -135 -438 512 -216 -477 462 -460 26 499 -757
7891 -757 200 341 -578 459 -152 -99 374 -372 -82 432 -528 59 647 -530 419 -54 -291 504 -122 -232
$$ packed form
7753E31p50K8N31o80M01M47j243J037Q2r55J206r60l5R68o84j7N51j008Q91j02
7773B39j157J257l75n47J069p60l5Q43r93O79L3q39O15L23j162J292m97m79R37
7792D43q75K44O64r20M48N14j216J006j20q27J204k68p69Q97o71P6M53r48Q27
7811A62j00o05P80n6o91J249q47N9Q37j203L01P15j101P29o8p39J112o77o85J278
7831D50m21k85O12q72O02L17p74N95j67m84J146r51JO31p84L43M04q49M71N03
7851D88r81Q78J62q34P64q25K7J016r82L74M26r75O62J49p76P00O6q25J173o00
7871H7n41R96j088N60K31o99Q40Jq72O88l38l03R50p28k61R39r22M86M73j256
7891g57R57J41r19J037o11N3M73p46K90N14r60N87N88j177R49m73k37P95o26j10
$$ plain form
7911 -232 417 -194 -128 525 -407 51 467 -421 654 190 -319 636 -90 -366 680 -623 22 589 -683
7930 -683 308 312 -555 632 -3 -155 734 -445 -229 753 -512 132 244 -446 219 356 -454 346 -50 79
7950 79 612 -494 -307 535 -188 27 316 -526 253 194 -437 590 -59 -211 385 -518 45 328 -316 -111
7970 -111 398 -345 398 228 -565 425 -161 -16 619 -257 -40 543 -350 396 138 -323 527 -151 -305 611
7990 611 -215 -219 681 -354 -89 402 -578 231 367 -351 269 -77 -572 564 -411 -179 537 -546 548
8009 548 -179 -444 331 -200 -407 365 -230 -92 331 -380 -79 368 -710 182 465 -185 507 190 -230 416
8029 416 -289 -115 332 -332 36 280 -283 185 206 -609 297 66 -240 572 -251 -31 395 -374 121 229
8049 229 -353 148 32 -639 491 29 -329 317 -389 -154 367 -420 -100 -75 -487 423 55 -409 579 -317
$$ packed form
7911b32O49o11O6O53r32M58M16q88J075m64n09R55p26k76J046j303O45N67j272
7930f83R91Mq67J187o35j52Q89j179K16R82j265O44J12o90O65J37q10Q00l96J29
7950G9N33j106J87Q42p23K15K89q42P79n9o31J027o49j52N96r03N63K83o44K05
7970a11N09p43P43j70p93R90n86J45O35q76K17N83q93P46k58m61Q50o78j54R16
7990F11q26mR00j035K65M91r80Q09J36p18O20l46m95J136r75K32P16j083J094
8009E48p27k65P75n31k07P72n95J38M23p11L01M47j078Q92K83o50O92l17m20O46
8029D16p05J74M47o64L68K44n63M68K1q15R06k31l06Q12q23K20M26p69M95J08
8049B29n82N01j16o71J130m62l58O46p06K35N21p87L20K5m12R10l68m64R88q96
$$ plain form
8069 -317 -247 326 -203 84 80 -565 372 100 -155 396 -108 -462 672 -298 -264 569 -468 207 670 -424
8089 -424 502 147 -534 637 -182 -289 615 -264 -44 352 -347 -198 301 -406 307 -313 -406 378 -73 -133
8109 -133 191 -380 -144 335 -443 346 104 -437 352 20 -348 364 -45 -467 494 -275 116 701 -403 228
8129 228 399 -517 547 135 -82 438 -233 -196 531 -399 47 427 -335 218 42 -523 522 -227 -52 447
8149 447 -402 -141 360 -519 -148 288 -308 177 65 -582 667 -130 -186 682 -470 65 396 -531 276 266
8169 266 -476 310 57 -356 385 -355 -233 354 -366 84 333 -337 230 46 -418 456 -48 -367 205 -226
8189 -226 -147 400
$$ packed form
8069c17P0N73n29K87mo45R37k72k55N51n04l54J134r70L4Q33j037O75M63j094
8089d24R26l55o81J171q19j07R04q79K20L96o99J49M99p07P13o20r3P84m51o0
8109a33L24n71K36M79p78P89k42n41P89l32l68P12m09m22R61p69L91N85j104O31
8129B28J71r16J064m12k17N20o71L7P27r30M46L80p62N53j76n65J045p49J75M99
8149D47q49K61N01q79L71M36n96M85j12o47J249p97n6Q68j152N35L31r27Q07j0
8169B66p42P86k53m13P41p40J22N87p20M50K49o70N67j84m64Q74n04l19N72m31
8189b26P9N47
8191D00
$$ Imaginary data points
##PAGE= N=2
##DATA TABLE= (X++(I..I)), XYDATA
$$ plain form
0 0 0 0 0 0 0 0 0 0 -8 8 -8 8 -16 16 -24 32 -32 40 -48 59 -72 88 -104 120 -144 163 -192 221 -256 292 -334
31 -334 379 -429 486 -549 620 -695 780 -869 967 -1075 1195 -1324 1467 -1622 1789 -1974
47 -1974 2175 -2396 2640 -2908 3204 -3530 3895 -4304 4769 -5295 5906 -6612 7449 -8454
61 -8454 9692 -11256 13300 -16092 20140 -26536 38133 -65544 255934 74432 -295921 329206
73 329206 -284488 -56011 416948 -277866 37958 178835 -395098 285242 131638 -297183
83 -297183 288898 -140825 -204368 406685 -199987 -45578 254229 -354026 132792 224443
93 224443 -314836 233717 -15903 -285983 347140 -99931 -143915 301980 -285899 2513
103 2513 278043 -297019 149618 102922 -331093 272099 -1946 -219812 305462 -192154
$$ packed form
0@%%%%%%%%qJ6j6J6k4L2m0N6o4P2q8J07j31J60j92K24k64L07l55M13m77N48o26
31c34P13q08R15j035J169j315J475j649J836k042K270k519K791l089L411l763
47a974M149m571N036n548O112o734P425q199R073j0064J1201j2518J4061j5903
61h454J8146k0948K4556k9392L6232m6676O4669j03677L21478j81502l70353O25127
73C29206o13694K28477M72959o94814L15824J40877n73933O80340j53604m28821
83b97183N86081m29723o3543O11053o06672J54409K99807o08255M86818R1651
93B24443n39279N48553k49620k70080O33123m47071m3984M45895n87879K88412
103B513K75530n75062M46637m6696m34015O03192k74045k17866N25274m97616
$$ plain form
113 -192154 -114457 311394 -253712 48776 198129 -333101 180827 96918 -276730 272977
123 272977 -78060 -208939 311276 -182044 -59948 265956 -291452 71000 181833 -290670
133 -290670 203367 35518 -266273 276270 -86916 -149682 288840 -218731 -32143 242396
143 242396 -268902 111379 134800 -287172 212357 12545 -216868 275389 -124649 -124517 269215
154 269215 -216967 15523 207337 -277425 131661 101393 -256686 231571 -31158 -197420
164 -197420 268974 -147595 -79386 251438 -239440 41610 175364 -267922 162088 61638
174 61638 -246592 235628 -62614 -161354 263524 -174013 -52600 225930 -240599 75546
184 75546 143132 -259685 173987 28310 -214726 240134 -89422 -130902 245038 -184720
$$ packed form
113a92154P7697M25851n65106L02488J49353n31230N13928q3909l73648N49707
123B72977l51037j30879N20215m93320J22096L25904n57408L62452J10833m72503
133b90670M94037j67849l01791N42543l63186o2766M38522n07571J86588K74539
143B42396n11298L80281K3421m21972M99529j99812k29413M92257m00038J32L93732
154B69215m86182K32490J91814m84762M09086l0268l58079M88257k62729j66262
164a97420M66394m16569O8209L30824m90878K81050J33754m43286M30010j00450
174F1638l08230M82220k98242r8740M24878m37537J21413K78530m66529L16145
184G5546O7586m02817M33672j45677k43036M54860l29556m1480L75940m29758
$$ plain form
194 -184720 -14134 202343 -238558 95961 110711 -238012 189179 1371 -187423 233516
204 233516 -108984 -94000 231193 -192297 15009 174673 -232408 123394 83726 -221549
214 -221549 200853 -27128 -160439 236862 -129399 -65140 217378 -203332 46398 153141
224 153141 -229567 145386 52615 -204971 213453 -54967 -133950 231258 -151552 -34074
234 -34074 200256 -210562 72451 123817 -223448 161994 23224 -185821 214479 -81590
244 -81590 -108203 218943 -166078 -8197 176007 -212876 91726 95018 -211944 170151 -5562
255 -5562 -165272 210172 -103677 -82169 203135 -178589 17437 151730 -212869 112579
265 112579 66415 -200550 181473 -33034 -143822 210195 -124498 -56025 190584 -188097
$$ packed form
194a84720J70586K16477m40901L34519J4750l48723M27191j87808j88794M20939
204B33516l42500J4984L25193m23490K07306J59664m07081L55802l9668l05275
214b21549M22402k27981j33311L97301l66261O4259K82518m20710K49730J06743
224A53141l82708L74953r2771k57586M18424k68420p8983L65208l82810J17478
234c4074K34330m10818K83013N1366l47265L85442j38770k09045M00300k96069
244h1590k6613L27146l85021J57881J84204l88883L04602L292l06962L82095j75713
255e562j59710L75444l13849K1508K85304l81724J96026J34293l64599L25448
265A12579m6164k66965L82023k14507j10788L54017l34693O8473K46609l78681
$$ plain form
275 -188097 44261 129434 -209346 132715 39321 -183483 190843 -59015 -116684 206284
285 206284 -142612 -25534 174090 -192996 71649 104550 -200345 149758 12573 -162545
295 -162545 194458 -80376 -89200 195002 -154407 1907 152987 -191509 91956 77321
305 77321 -187357 160100 -13275 -140684 191876 -100684 -63496 181695 -165047 26278
315 26278 131242 -192363 110415 51543 -177834 169680 -38658 -123459 190589 -120074
325 -120074 -41216 168837 -175569 47863 109992 -190336 126895 25689 -163942 176498
335 176498 -63320 -100585 186046 -137504 -16157 152887 -180799 71674 87714 -183119
345 -183119 140403 1850 -144804 178853 -81484 -76036 176312 -146293 9069 134319
$$ packed form
275a88097K32358Q5173l38780L42061r3394k22804L74326k49858n7669L22968
285B06284l48896J17078J99624l67086K64645L2901l04895L50103j37185j75118
295a62545L57003k74834q824K84202l49409J56314J51080l44496K83465j4635
305G7321k64678L47457j73375j27409L32560k92560L7188K45191l46742J91325
315B6278J04964l23605L02778n8872k29377L47514k08338q4801L14048l10663
325a20074P8858K10053l44406K23432O2129l00328L17231j01206j89631L40440
335A76498k39818l7265K86631l23550J21347J69044l33686K52473J6040k70833
345a83119L23522j38553j46654L23657k60337N448K52348l22605J55362J25250
$$ plain form
355 134319 -177586 91034 64520 -169665 150940 -18634 -123681 178314 -97529 -51423
365 -51423 166128 -153098 31598 117167 -175032 108447 43685 -158377 160393 -39033
375 -39033 -105574 177233 -112744 -29948 155413 -160707 51666 98935 -171967 123208 20830
386 20830 -146195 165871 -60282 -86423 171440 -127725 -8584 139101 -166080 69697
396 69697 76838 -165644 131965 -2327 -130285 163836 -78182 -65827 158305 -137211 11707
407 11707 118615 -164509 84900 52938 -155393 138463 -24153 -112281 161461 -94873
417 -94873 -45462 147308 -144253 31531 101194 -162516 100409 33253 -143942 146643 -42696
428 -42696 -94222 160668 -108635 -24381 138826 -150058 51529 86088 -158687 115858 14987
$$ packed form
355A34319l11905K68620k6514k34185L20605j69574j05047L01995k75843M6106
365e1423K17551l19226J84696Q5569k92199K83479o4762k02062L18770j99426
375c9033o6541K82807k89977Q2796J85361l16120K12373M7269k70902K95175j02378
386B0830j67025L12066k26153k6141K57863k99165J19141J47685l05181K35777
396F9697P141k42482K97609j34292j27958K94121k42018J2355K24132k95516J48918
407A1707J06908k83124K49409l1962k08331K93856j62616q8128K73742k56334
417i4873M9411J92770k91561J75784O9663k63710K62925o7156j77195K90585j89339
428d2696n1526K54890k69303Q4254J63207k88884K01587L4559k44775K74545j00871
$$ plain form
439 14987 -132174 153393 -59526 -75935 157733 -119693 -4356 126690 -152669 67998
449 67998 68717 -151377 124312 -3571 -117108 152299 -73329 -56800 146776 -126399 14150
460 14150 109297 -150184 81394 48408 -140612 129425 -22278 -101174 149104 -86750 -39071
471 -39071 134987 -132166 30847 91832 -148038 93336 28149 -130512 134814 -41587
481 -41587 -85023 145989 -101673 -20062 124770 -139667 48424 75525 -146181 106182 9897
492 9897 -120239 139600 -58112 -68318 142449 -111753 -1938 112624 -140872 64319
502 64319 59344 -137779 114743 -6645 -104935 139499 -69504 -48841 133676 -116462 16400
513 16400 98402 -136298 77588 42464 -126490 121060 -21830 -88385 137195 -80160 -31101
$$ packed form
439A4987j47161K85567k12919j6409K33668k77426J15337J31046k79359K20667
449F7998P19k20094K75689j27883j13537K69407k25628J6529K03576k73175J40549
460A4150R5147k59481K31578l2986j89020K70037j51703p8896K50278k35854M7679
471c9071J74058k67153J63013O0985k39870K41374o5187j58661K65326j76401
481d1587m3436K31012k47662Q1611J44832k64437J88091K7101k21706K52363r6285
492I897j30136K59839j97712j0206K10767k54202J09815J14562k53496K05191
502F4319m975j97123K52522j21388r8290K44434k09003K0663J82517k50138J32862
513A6400Q2002k34700K13886l5124j68954K47550j42890o6555K25580k17355M9059
$$ plain form
524 -31101 123654 -120158 32639 82836 -132862 89397 23650 -115916 125887 -39842
534 -39842 -72561 134259 -94440 -13084 113304 -127546 48985 66005 -132193 100636 5307
545 5307 -106781 128867 -56966 -58108 128817 -105239 2656 99804 -130344 62331 49289
556 49289 -126552 107168 -11700 -94967 127585 -69419 -42951 120069 -111315 17548
566 17548 85545 -128310 73353 33614 -117025 111493 -26172 -80678 124655 -79001 -26607
577 -26607 110240 -113763 32149 71790 -123225 83397 17470 -105504 115876 -40435
587 -40435 -64761 122372 -88465 -9450 101643 -117388 47818 58375 -119858 94064 2360
598 2360 -94763 119333 -54038 -49482 117660 -97113 7208 90046 -119007 61215 43092
$$ packed form
524c1101J54755k43812J52797N0197k15698K22259o5747j39566K41803j65729
534c9842l2719K06820k28699Q1356J26388k40850J76531J7020j98198K32829r5329
545E307j12088K35648j85833j142J86925k34056J07895R7148k30148J92675j3042
556D9289j75841K33720j18868q3267K22552j97004K6468J63020k31384J28863
566A7548O7997k13855K01663l9739j50639K28518j37665n4506K05333k03656N2394
577b6607J36847k24003J45912L9641j95015K06622o5927j22974K21380j56311
587d0435k4326J87133k10837P9015J11093k19031J65206J0557j78233K13922r1704
598B360r7123K14096j73371M556J67142k14773J04321Q2838k09053J80222j8123
$$ plain form
609 43092 -113395 101161 -13134 -83258 118294 -65387 -35276 109655 -102440 19729
619 19729 76455 -116613 69728 27903 -105531 103588 -26896 -71406 114291 -74899 -21707
630 -21707 99697 -105989 31808 63316 -114033 78139 12589 -96762 107050 -40262
640 -40262 -58301 111458 -84532 -6790 91657 -109876 45566 50979 -110581 87871 -627
651 -627 -86807 110177 -52233 -43582 107945 -91391 8844 81546 -110217 58679 37818
662 37818 -104058 95548 -14134 -74678 110221 -62004 -29683 101301 -95005 21462
672 21462 70070 -107240 67283 24683 -95212 98069 -26027 -62713 107067 -70206 -16658
683 -16658 92550 -97811 32853 57563 -104358 74982 10503 -87538 100032 -38833 -51114
$$ packed form
609D3092j56487K14556j14295p0124K01552j83681L0111J44931k12095J22169
619A9729N6726j93068J86341m1825j33434K09119j30484m4510J85697j89190N3192
630b1707J21404k05686J37797L1508j77349J92172o5550j09351K03812j47312
640d0262j8039J69759j95990P7742R8447k01533J55442N413j61560J98452q8498
651f27q6180J96984j62410Q651J51527j99336J00235P2702j91763J68896k0861
662C7818j41876J99606j09682o0544J84899j72225L2321J30984j96306J16467
672B1462M8608j77310J74523m2600j19895J93281j24096l6686J69780j77273N3548
683a6658J09208j90361J30664K4710j61921J79340o4479r8041J87570j38865j2281
$$ plain form
694 -51114 102532 -79171 -3588 82647 -101466 44223 43628 -101219 82025 -4638 -78099
705 -78099 100875 -51871 -38164 96567 -87388 10198 71389 -103289 55553 30160 -96194
716 -96194 88321 -17929 -68002 100942 -61431 -25415 90829 -91185 22879 60715 -100610
727 -100610 64958 17456 -87250 92243 -29540 -55278 99381 -69434 -11053 83900 -93582
738 -93582 35242 50147 -97311 73767 5904 -78731 95955 -39921 -43106 96603 -76514
749 -76514 2318 76045 -95120 46677 38523 -93230 81293 -7250 -69730 97125 -51178
760 -51178 -30958 91443 -83149 14775 65587 -96421 56388 24894 -87811 85535 -19815
771 -19815 -59754 94881 -60324 -19439 83003 -86603 25066 53334 -93497 63068 11795
$$ packed form
694e1114J53646j81703P5583Q6235j84113J45689n95j44847J83244q6663p3461
705g8099J78974j52746J3707J34731j83955R7586O1191j74678J58842k5393j26354
716i6194J84515j06250n0073J68944j62373L6016J16244j82014J14064L7836j61325
727a00610J65568m7502j04706J79493j21783k5738J54659j68815N8381R4953j77482
738i3582J28824J4905j47458J71078o7863q4635J74686j35876l185J39709j73117
749g6514P8832P3727j71165J41797q154j31753J74523q8543o2480J66855j48303
760e1178K0220J22401j74592R7924N0812j62008J52809l1494j12705J73346j05350
771a9815l9939J54635j55205M0885J02442j69606J11669K8268j46831J56565n1273
$$ plain form
782 11795 -79829 87179 -31416 -48919 91227 -68100 -7272 75264 -89112 35625 42829
793 42829 -90515 69753 922 -71548 88896 -41147 -37209 88045 -74084 5415 67174
804 67174 -89995 46954 31584 -86002 77529 -11023 -62427 91068 -51066 -24907 84185
815 84185 -79237 17838 58802 -89470 56586 20434 -80011 82288 -21672 -52611 89460
826 89460 -58366 -13652 77168 -81950 27777 48266 -86584 62801 8833 -72555 83506
837 83506 -31781 -42360 85860 -65546 -3304 69429 -84327 36383 37545 -84233 67419
848 67419 -2411 -65867 83787 -41765 -32866 81003 -72106 7376 60583 -85643 45409
859 45409 26228 -80531 73142 -13929 -57789 84269 -50646 -22285 76239 -76129 17663
$$ packed form
782A1795r1624J67008j18595j7503J40146j59327O0828Q2536j64376J24737P204
793D2829j33344J60268o8831p2470J60444j30043L938J25254j62129P9499O1759
804F7174j57169J36949j5370j17586J63531q8552n1404J53495j42134K6159J09092
815H4185j63422R7075M0964j48272J46056l6152j00445J62299j03960l0939J42071
826H9460j47826M4714R0820j59118J09727K0489j34850J49385n3968q1388J56061
837H3506j15287j0579J28220j51406O2242P2733j53756J20710J162j21778J51652
848F7419o9830o3456J49654j25552Q899J13869j53109P9482N3207j46226J31052
859D5409j9181j06759J53673q7071m3860J42058j34915K8361R8524j52368R3792
$$ plain form
870 17663 51747 -84173 53204 15944 -74237 76222 -23105 -47736 82337 -56434 -11294
881 -11294 70479 -77110 27210 42943 -80334 59567 6212 -65931 78212 -31106 -37286
892 -37286 79569 -61094 -415 63376 -77610 36270 33778 -76423 64815 -3788 -58159
903 -58159 79149 -39841 -26913 75577 -66793 10183 55422 -79064 45336 22753 -73286
914 -73286 70309 -14923 -51005 79446 -48862 -17684 70805 -71714 19827 46382 -78679
925 -78679 52194 12070 -68221 72660 -24584 -42833 77508 -55663 -8285 64583 -74172
936 -74172 27653 37689 -76335 57031 2659 -61713 73857 -32210 -33702 73655 -59925
947 -59925 1316 57565 -74578 35904 28517 -71776 61711 -6388 -53524 74251 -39859
$$ packed form
870A7663L4084j35920J37377l7260r0181J50459r9327k4631J30073j38771M5140
881a1294Q1773j47589J04320J5733j23277J39901n3355p2143J44143j09318o180
892c7286J16855j40663O0679O3791j40986J13880k492j10201J41238o8603n4371
903e8159J37308j18990J2928J02490j42370P6976M5239j34486J24400k2583r6039
914g3286J43595q5232l6082J30451j28308L1178Q8489j42519R1541K6555j25061
925g8679J30873m0124q0291J40881r7244j8249J20341j33171M7378P2868j38755
936g4172J01825J0036j14024J33366n4372o4372J35570j06067j492J07357j33580
947e9925O1241N6249j32143J10482p387j00293J33487o8099m7136J27775j14110
$$ plain form
958 -39859 -23461 70320 -64203 12134 50211 -73865 44361 19597 -67070 66772 -15658
969 -15658 -45685 74506 -46494 -13600 65387 -67207 21173 42090 -72500 51055 9685
980 9685 -61466 69235 -24811 -37299 72385 -53249 -4711 59311 -69698 28295 33437 -70393
992 -70393 55054 308 -56095 69177 -32863 -29020 67777 -58047 3923 51665 -70592
1003 -70592 35512 23463 -67072 59317 -9717 -49182 69367 -40785 -19876 63685 -62750
1014 -62750 13062 43677 -70652 43330 14014 -62799 63482 -18774 -40674 69172 -47444
1025 -47444 -9964 59221 -65487 22603 36439 -68417 50480 5512 -56706 66560 -26451
1036 -26451 -32181 67916 -51998 -865 54474 -65961 30215 29611 -65137 54497 -2072 -49860
$$ packed form
958c9859J6398R3781j34523P6337L8077j24076J18226k4764q6667J33842q2430
969a5658l0027J20191j21000L2894P8987j32594Q8380K0917j14590J23555m1370
980I685p1151J30701r4046j2488J09684j25634M8538O4022j29009R7993N142j03830
992g0393J25447n4746n6403J25272j02040L843R6797j25824O1970M7742j22257
1003g0592J06104j2049r0535J26389o9034l9465J18549j10152K0909Q3561j26435
1014f2750P5812L0615j14329J13982k9316p6813J26281q2256k1900J09846j16616
1025d7444L7480O9185j24708Q8090J3836j04856J18897m4968o2218J23266r3011
1036b6451n730J00097j19914N1133N5339j20435R6176o04r4748J19634n6569m7788
$$ plain form
1048 -49860 66790 -32573 -23803 64275 -55096 7375 47522 -65878 37079 20473 -61313
1059 -61313 58242 -10600 -43588 66486 -39079 -15983 60025 -59282 15000 39936 -65709
1070 -65709 42627 11631 -57559 60545 -19535 -36452 64836 -45987 -7526 54497 -62220
1081 -62220 22812 32098 -64559 47889 2368 -52464 62242 -27489 -28982 62750 -51144 1068
1093 1068 48807 -63727 30081 24619 -61718 52186 -5412 -46053 62752 -33692 -20264 59357
1105 59357 -54321 9603 42809 -63015 36988 16860 -57503 56396 -12971 -39545 63344
1116 63344 -39634 -12191 56163 -57135 17548 36396 -62115 43256 8766 -52799 59473
1127 59473 -20694 -31773 62420 -45530 -3975 51382 -59867 24651 28664 -60859 48422
$$ packed form
1048d9860J16650r9363Q770Q8078j19371O2471M0147j13400J02957j6606q1786
1059f1313J19555o8842l2988J10074j05565K3096P6008j19307P4282K4936j05645
1070f5709J08336l0996o9190J18104q0080j6917J01288j10823L8461O2023j16717
1081f2220Q5032R286r6657J12448m5521n4832J14706q9731j493R1732j13894N2212
1093A068M7739j12534R3808n462q6337J13904n7598m0641J08805r6444J3428P9621
1105E9357j13678O3924L3206j05824J00003k0128p4363J13899o9367k6574J02889
1116F3344j02978K7443O8354j13298P4683J8848r8511J05371l4490o1565J12272
1127E9473q0167j1079R4193j07950M1555N5357j11249Q4518M013q9523J09281
$$ plain form
1138 48422 220 -48358 60623 -28178 -25272 59392 -50145 3271 45328 -61094 30518
1149 30518 21084 -58356 51182 -7566 -42913 59813 -34560 -18155 55305 -53699 10173
1160 10173 38677 -61141 36102 13414 -54746 54031 -15178 -36477 59282 -40115 -10539 51481
1172 51481 -55626 17825 32117 -59039 42017 6034 -49506 57021 -22084 -28931 58842
1183 58842 -44717 -1661 47579 -57663 25789 25742 -56824 47499 -1328 -43782 58357 -28461
1195 -28461 -21013 56289 -48598 6703 41690 -57455 32561 18252 -53659 50890 -8910 -37876
1207 -37876 58506 -34407 -13854 52658 -51762 13598 35298 -57651 37279 10535 -50430 53257
1219 53257 -16636 -32219 57203 -39929 -6989 48221 -54466 20070 28390 -56642 42139 2264
$$ packed form
1138D8422m8202m8578J08981q8801K906Q4664j09537N3416M2057j06422R1612
1149C0518r434p9440J09538n8748l5347J02726r4373J6405P3460j09004O3872
1160A0173K8504r9818R7243k2688o8160J08777o9209k1299R5759r9397K9576O2020
1172E1481j07107P3451J4292r1156J01056l5983n5540J06527p9105o847Q7773
1183E8842j03559M3056M9240j05242Q3452m7q2566J04323m8827m2454J02139q6818
1195b8461P448P7302j04887N5301L4987r9145R0016j4309p1911J04549n9800k8966
1207c7876R6382r2913K0553O6512j04420O5360K1700r2949R4930k6744o0965J03687
1219E3257o9893j5583Q9422r7132L2940N5210j02687P4536Q320q5032R8781l9875
$$ plain form
1231 2264 -46104 54927 -24317 -25619 55183 -45223 296 43781 -56014 26093 21742 -54482
1243 -54482 45939 -4289 -41073 55523 -29422 -18863 52487 -48499 7485 37995 -55954
1254 -55954 31990 14922 -50978 49551 -10761 -35087 55599 -34183 -11513 49399 -49975 14656
1266 14656 32418 -54501 37037 8301 -46609 51271 -17281 -28557 54047 -39044 -4009 44726
1278 44726 -51551 21142 25810 -53156 41483 898 -42382 52965 -24000 -22262 52512 -43646
1290 -43646 2518 40024 -53346 26602 18770 -51313 44490 -6237 -37677 52650 -29938 -16108
1302 -16108 49006 -47004 8877 34425 -53604 31945 12069 -48444 47345 -12753 -32799 52407
1314 52407 -34698 -10023 45906 -48775 15025 28898 -52469 35936 5901 -44445 49434 -18383
$$ packed form
1231B264m8368J01031p9244j302Q0802j00406M5519M3485r9795Q2107m351p6224
1243e4482J00421n0228l6784R6596q4945J0559P1350j00986N5984L0510r3949
1254e5954Q7944j7068o5900J00529o0312k4326R0686q9782K2670O0912r9374O4631
1266A4656J7762q6919R1538k8736n4910R7880o8552j1276Q2604r3091L5035M8735
1278D4726r6277P2693M668p8966R4639m0585m3280R5347p6965J738P4774r6158
1290d3646M6164L7506r3370P9948p832p0083R5803n0727l1440R0327q2588J3830
1302a6108O5114r6010N5881K5548q8029Q5549j9876o0513R5789o0098k0046Q5206
1314E2407q7105K4675N5929r4681O3800J3873q1367Q8405l0035n0346R3879o7817
$$ plain form
1326 -18383 -26478 51275 -38591 -2658 41961 -49916 21693 23521 -50177 40725 -389 -39099
1338 -39099 51081 -23984 -19568 50002 -42200 4422 37935 -50494 27408 17235 -47642 44131
1350 44131 -6806 -34087 51311 -29233 -13146 46836 -44720 10874 32196 -50240 32026 10628
1362 10628 -44658 45908 -13146 -28978 50173 -33838 -7123 42657 -46856 16157 25923 -49265
1374 -49265 35708 3772 -40783 47111 -19385 -23441 48155 -38303 -821 38185 -48124 21560
1386 21560 19872 -47811 39085 -2895 -36527 47963 -25135 -17014 45938 -41544 5832 33590
1398 33590 -48537 27084 13881 -44930 42836 -8907 -31332 48635 -29663 -10492 43689 -43934
1410 -43934 12223 29258 -48339 32219 8410 -41509 45433 -14405 -25844 48231 -33361 -4356
$$ packed form
1326a8383q095P7753q9866L5933M4619r1877P1609J828p3698R0902m1114l8710
1338c9099R0180p5065M416O9570r2202M6622L3513q8429P7902j0173o4877R1773
1350D4131n0937k7281Q5398q0544J6087N9982r1556N5594K1322q2436Q2266k1398
1362A0628n5286R0566n9054j5832P9151q4011K6715M9780q9513O3013R766p5188
1374d9265Q4973l1936m4555Q7894o6496m056P1596q6458L7482L9006q6309O9684
1386B1560j688o7683Q6896m1980l3632Q4490p3098Q121O2952q7482M7376K7758
1398C3590q2127P5621j3203n8811Q7766n1743k2425P9967p8298J9171N4181q7623
1410d3934N6157J7035p7597Q0558k3809m9919Q6942n9838j1439P4075q1592K9005
$$ plain form
1422 -4356 40473 -44954 17907 23743 -46556 36084 2084 -37868 46392 -20062 -20503 46455 -37464
1435 -37464 1291 35999 -46315 22689 17853 -45099 39067 -4305 -33748 46537 -25596 -14649
1447 -14649 43538 -40734 7300 30643 -46850 27511 10918 -42456 41456 -10882 -28729 45888
1459 45888 -30492 -8898 40153 -42937 12809 25546 -46016 31465 5062 -39204 43197 -16092
1471 -16092 -23456 45041 -33942 -2706 36699 -43803 18831 20075 -44335 35715 -535 -34662
1483 -34662 44565 -21145 -17295 43751 -37124 3776 33085 -44076 23819 15027 -41727 38784
1495 38784 -6270 -29767 45239 -25780 -11414 41136 -39632 9964 28112 -44729 29122 8901
1507 8901 -39555 41472 -12259 -25346 44947 -30664 -5795 37875 -42012 15205 22878 -44095
$$ packed form
1422d356M4829q5427O2861N836p0299Q2640l4000l9952Q4260o6454m41O6958q3919
1435c7464L8755L4708q2314O9004m836o2952Q4166m3372k9443Q0285p2133J0947
1447a4649N8187q4272M8034K3343p7493P4361j6593n3374Q3912n2338j7847P4617
1459D5888p6380K1594M9051q3090N5746J2737p1562P7481k6403m4266Q2401n9289
1471a6092p364O8497p8983L1236L9405q0502O2634J244o4410Q0050l6250l4127
1483c4662P9227o5710L850O1046q0875M0900K9309p7161O7895q792n6754Q0511
1495C8784m5054k3497P5006p1019J4366N2550q0768M9596J8148p2841P3851k0221
1507H901m8456Q1027n3731j3087P0293p5611K4869M3670p9887N7217P673o6973
$$ plain form
1519 -44095 32289 2841 -36405 42189 -17824 -20688 42730 -34134 -514 33766 -43420 19813
1531 19813 17253 -42448 35335 -3037 -32541 43067 -22594 -15150 41195 -37051 5129 29616
1543 29616 -43658 24288 11940 -39809 37879 -8580 -27572 42738 -26737 -8835 38319 -38959
1555 -38959 11282 25386 -42452 28901 6577 -36508 40506 -13495 -22480 42698 -30172 -3332
1567 -3332 35468 -40364 16050 20597 -41153 32234 935 -33001 41018 -18284 -17456 40933 -33437
1580 -33437 2125 31580 -41145 21052 15246 -39604 35279 -4614 -29064 41509 -23153 -12155
1592 -12155 38392 -36420 7304 26763 -41762 25044 9483 -37620 37435 -10491 -25219 41267
1604 41267 -27856 -6706 35490 -38686 12570 21936 -41323 28914 3779 -34728 38904 -15379
$$ packed form
1519d4095P6384k9448l9246P8594o0013k864O3418p6864L3620L4280p7186O3233
1531A9813k560n9701P7783l8372k9504P5608o5661P444N6345p8246M2180K4487
1543B9616p3274O7946j2348n1749P7688m6459j8992P0310o9475J7902M7154p7278
1555c8959N0241J4104o7838P1353k2324m3085P7014n4001q985O5178p2870K6840
1567c332L8800p5832N6414M547o1750P3387l1299l3936P4019n9302Q28N8389p4370
1580c3437L5562K9455p2725O2197n806n4850P4883l9893k4450P0573o4662J0998
1592a2155N0547p4812M3724J9459o8525O6806j5561m7103P5055m7926j4728O6486
1604D1267o9123K1150M2196p4176N1256R366o3259P0237k5135l8507P3632n4283
$$ plain form
1616 -15379 -20530 40257 -31256 -1746 32449 -39581 17284 17428 -39522 32164 -1432 -30837
1628 -30837 39841 -19569 -14974 38738 -33403 3641 29173 -39784 21917 13038 -37107 34872
1640 34872 -5911 -26479 40188 -23356 -9584 36468 -35194 9261 24757 -39477 25758 7951
1652 7951 -34715 36679 -11092 -22112 39341 -27008 -4835 33145 -37295 13836 20098 -38745
1664 -38745 28853 2254 -31850 37595 -16119 -17789 37857 -30706 144 29703 -38327 17909
1676 17909 14905 -37602 31646 -3025 -28350 37812 -20438 -13359 36116 -33270 4648 26109
1688 26109 -38525 21535 10575 -35581 33643 -7408 -24712 38060 -23760 -8337 33850 -34914
1700 -34914 9662 22526 -37966 25321 5989 -32854 35617 -11826 -20274 37798 -26928 -3026
$$ packed form
1616a5379n151O0787p1513K9510L4195p2030N6865J44n6950P1686l3596k9405
1628c0837P0678n9410M595N3712p2141L7044K5532o8957O1701q879n0145P1979
1640C4872m0783k0568O6667o3544J3772M6052p1662M4455J5496o4234O5235j7807
1652G951m2666P1394m7771j1020O1453o6349K2173L7980p0440N1131O262n8843
1664c8745O7598k6599l4104O9445n3714j670N5646o8563L0850K9559o8030N6236
1676A7909l004n2507O9248l4671k5325O6162n8250P079M9475o9386L7918K1461
1688B6109o4634O0060j0960m6156O9224m1051j7304O2772o1820J5423M2187o8764
1700c4914M4576J2864o0492O3287j9332l8843O8471m7443q448N8072o4726K3902
$$ plain form
1712 -3026 31270 -35594 14599 18367 -36563 28847 1266 -29320 36596 -15963 -15641 36688 -29482
1725 -29482 1619 28472 -36255 18657 13785 -35294 31212 -3770 -26064 37126 -20160 -11318
1737 -11318 34551 -32010 5970 24239 -36700 21852 8629 -33035 32663 -8538 -22300 35838
1749 35838 -24030 -6355 31236 -33671 10566 19488 -36451 25072 3561 -30796 33851 -13273
1761 -13273 -18228 35249 -27182 -1640 28476 -34683 14773 15495 -34829 27756 -928 -26943
1773 -26943 35033 -16906 -13418 33733 -29280 3315 25200 -34810 18985 11197 -32774 30488
1785 30488 -5191 -23199 35386 -20344 -8504 31993 -31105 7982 22015 -34749 22608 7086
1797 7086 -30452 32408 -9539 -19192 34789 -23792 -3991 29484 -32586 11897 17689 -34023
$$ packed form
1712c026L4296o6864N0193L768n4930O5410k7581l0586O5916n2559L22N2329o6170
1725b9482L1101K6853o4727N4912m872m9079O6506l4982k2294O3190n7286Q842
1737a1318M5869o6561L7980J8269o0939N8552j3223m1664O5698m1201j3762N8138
1749C5838n9868J7675L7591o4907M4237Q922n5939O1523k1511l4357O4647m7124
1761a3273m955N3477o2431K5542L0116o3159M9456P22n0324O2585k8684k6015
1773b6943O1976n1939L488M7151o3013L2595K1885o0010N3795p788m3971O3262
1785C0488l5679j8008N8585n5730J1840M0497o3098L9087J4033n6764N7357j5522
1797G086l7538O2860m1947r653N3981n8581J9801L3475o2070M4483N792n1712
$$ plain form
1809 -34023 25706 2173 -27873 33236 -13803 -15585 33441 -27062 -71 26195 -33659 15746
1821 15746 13066 -32883 27655 -2834 -24730 33218 -17894 -11537 31852 -29096 4520 22732
1833 22732 -33901 19136 8689 -31090 29342 -6823 -21198 33227 -21366 -6946 29520 -30697
1845 -30697 8781 19231 -32894 22488 4949 -28517 30922 -10555 -17742 32513 -23366 -2322
1857 -2322 27117 -31217 12842 15562 -31781 25145 697 -25311 32130 -14301 -12950 31874
1869 31874 -26074 2206 24187 -31721 16794 11456 -30264 27801 -3810 -22266 32437 -18111
1881 -18111 -8940 30027 -28469 6234 20884 -31930 19851 7148 -28594 29286 -8153 -19095
1893 -19095 31878 -21360 -5140 27527 -30150 9840 17050 -31672 22555 2589 -26956 30245
$$ packed form
1809c4023N9729k3533l0046O1109m7039j782M9026o0503K6991K6266n9854M9405
1821A5746k680m5949O0538l0489k1896N7948n1112O357M3389o0948L3616J8212
1833B2732n6633N3037j0447l9779O0432l6165j4375N4425n4593J4420L6466o0217
1845c0697L9478J0450n2125N5382j7539l3466N9439m1477p187N0255n5879K1044
1857b322K9439n8334M4059K720m7343N6926k4448k6008N7441m6431J351M4824
1869C1874n7948K8280K1981n5908M8515n338m1720N8065l1611j8456N4703n0548
1881a8111R171L8967n8496L4703J4650n2814N1781j2703l5742N7880l7439j0942
1893a9095N0973n3238J6220L2667n7677L9990P210m8722N4227j9966k9545N7201
$$ plain form
1905 30245 -12152 -15524 30917 -24165 -1137 24841 -30846 13552 13399 -30602 24456 -1142
1917 -1142 -23793 30574 -15646 -11828 29781 -26103 3176 22159 -30908 16747 9542 -28839
1929 -28839 26926 -5204 -20362 31029 -18628 -7359 28027 -27446 7064 18904 -30553 20053
1941 20053 5845 -26573 28392 -8817 -16747 30347 -21016 -2979 25703 -28638 11065 15027
1953 15027 -29756 22838 1521 -24092 29379 -12492 -13309 29124 -23569 596 22794 -29512
1965 -29512 14229 11312 -28590 24485 -3034 -21622 29468 -16221 -9374 27693 -25747 4493
1977 4493 19495 -30090 17089 7264 -27163 26332 -6836 -18633 29335 -19130 -5866 25875
1989 25875 -27405 7805 16453 -29505 19965 3771 -25084 27533 -9913 -15239 29095 -21402
$$ packed form
1905C0245m2397l372M6441n5082K3028K5978n5687M4398j53m4001N5058k5598
1917a142k2651N4367m6220L818M1609n5884K9279J8983n3067M7655p205l8381
1929b8839N5765l2130j5158N1391m9657J1269L5386n5473L4510J1840m9457N0606
1941B0053j4208l2418N4965l7209p930M7094n1363J8037K8682n4341L9703L962
1953A5027m4783N2594k1317k5613N3471m1871q17M2433n2693K4165K2198n2306
1965b9512M3741k917l9902N3075k7519j8588N1090m5689O847L7067n3440L0240
1977D493J5002m9585M7179r825l4427N3495l3168j1797M7968m8465J3264L1741
1989B5875n3280L5210Q648m5958M9470j6194k8855N2617l7446n326M4334n0497
$$ plain form
2001 -21402 -1822 23698 -28056 11553 13461 -28730 22708 418 -22674 28504 -12825 -11628
2013 -11628 28211 -23290 1738 21711 -28113 14853 10493 -26843 24465 -3249 -19673 28742
2025 28742 -15936 -8306 26701 -24785 5153 18741 -28413 17162 6587 -25283 25604 -6605
2037 -6605 -16879 28010 -18755 -4720 24348 -25849 8176 15448 -27828 19540 2691 -23334
2049 -23334 26401 -10100 -13808 27055 -21104 -1388 21953 -27190 11177 11815 -26954 21503
2061 21503 -949 -20950 26667 -13519 -10635 25988 -22948 2148 19444 -27068 14562 8776
2073 8776 -25391 23710 -3954 -18138 27051 -16280 -7012 25102 -24136 5940 16989 -26819
2085 -26819 17284 5762 -23526 24757 -6997 -15172 27207 -18298 -3224 23173 -25131 9189
$$ packed form
2001b1402J9580K5520n1754L9609J908m2191N1438k2290k3092N1178m1329J197
2013a1628L9839n1501K5028J9973m9824M2966m360l7336N1308k7714j6424M8415
2025B8742m4678P630L5007n1486K9938J3588m7154M5575j0575l1870N0887l2209
2037f605j0274M4889m6765J4035K9068n0197L4025P272m3276M7368j6849k6025
2049b3334M9735l6501l708M0863m8159J9716K3341m9143L8367O38l8769M8457
2061B1503k2452k0001M7617m0186K884L6623m8936K5096J7296m6512M1630n786
2073H776l4167M9101k7664j4184M5189m3331R268L2114m9238L0076J1049m3808
2085b6819M4103j1522k9288M8283l1754q175M2379m5505J5074K6397m8304L4320
$$ plain form
2097 9189 14144 -26325 19890 2366 -21543 25658 -10096 -12287 26336 -20324 -64 20625
2109 20625 -25825 11864 10587 -25392 21277 -1425 -19386 25838 -13456 -9184 24408 -22169
2121 -22169 2731 18053 -26328 14556 7385 -24456 22338 -4747 -16921 25782 -16061 -6517
2133 -6517 23116 -23488 5785 15465 -25928 16475 4344 -22430 23364 -7491 -14226 25332
2145 25332 -17861 -2884 21028 -24171 9191 12516 -25056 19028 1182 -20231 24490 -10351
2157 -10351 -10897 24303 -19438 502 19050 -24296 11886 9835 -23837 20629 -1705 -17670
2169 -17670 24723 -13047 -7660 23250 -20957 3863 16827 -24576 14601 6654 -22243 22234
2181 22234 -4971 -15256 24618 -15831 -4606 21763 -22452 6730 14001 -24530 16603 2959
$$ packed form
2097I189M955m0469M6215j7524k3909M7201l5754k191L8623m6660K0260K0689
2109B0625m6450L7689j277l5979M6669k2702j7961M5224l9294M272L3592m6577
2121b2169K4900J5322m4381M0884p171l1841M6794k7085j2174M2703m1843R544
2133f517K9633m6604K9273R680m1393M2403j2131k6774M5794l0855o735L9558
2145B5332m3193J4977K3912m5199L3362L325l7572M4084j7846k1413M4721l4841
2157a0351n46L5200m3741J9940J8548m3346L6182k051l3672M4466k2334j5965
2169a7670M2393l7770N387L0910m4207K4820J2964m1403L9177p947k8897M4477
2181B2234k7205j0285L9874m0449J1225K6369m4215K9182P271l8531M1133j3644
$$ plain form
2193 2959 -20944 23008 -8598 -12714 23992 -17862 -1915 19456 -23776 9475 10940 -24004
2205 -24004 18519 -256 -19188 23614 -11085 -10361 23193 -19529 1067 17566 -23783 11972
2217 11972 8030 -22732 20042 -3077 -16454 23867 -13317 -6914 22033 -20794 4413 15423
2229 15423 -23342 14433 5410 -20844 21259 -5771 -13721 23327 -15380 -3425 20255 -21668
2241 -21668 7567 12429 -22867 16708 2261 -19056 22296 -8643 -10777 22515 -17339 -510
2253 -510 18170 -22185 10386 9398 -22334 18491 -1129 -17380 22830 -11483 -8452 21804 -19161
2266 -19161 2416 16043 -22895 12674 6523 -21334 19667 -4045 -15200 22606 -14134 -5708
2278 -5708 20414 -20773 5201 13351 -22876 14354 3580 -19867 20818 -6938 -12663 22141
$$ packed form
2193B959k3903M3952l1606m116L6706m1854J5947K1371m3232L3251J465l4944
2205b4004M2523j8775j8932M2802l4699P24L3554m2722K0596J6499m1349L5755
2217A1972l942l0762M2774k3119j3377M0321l7184O403K8947m2827K5207J1010
2229A5423l8765L7775r023k6254M2103k7030p950L7048l8707J1955K3680m1923
2241b1668K9235M862l5296L9575j4447k1317M1352l0939k134L3292l9854J6829
2253e10J8680m0355L2571r88l1732M0825j9620j6251M0210l4313L031L0256m0965
2266a9161K1577J3627l8938L5569o151k7857M1001k3712j1155L7806l6740Q426
2278e708K6122m1187K5974Q150l6227L7230j0774k3447M0685k7756n725L4804
$$ plain form
2290 22141 -16055 -2563 18609 -21399 8003 11063 -22015 16784 1107 -17947 21703 -9085
2302 -9085 -9751 21802 -17029 484 17188 -21543 10498 8521 -21201 18147 -1847 -15932 22063
2315 22063 -11565 -6820 20711 -18475 3209 14897 -21417 12919 6097 -19663 19453 -4223
2327 -4223 -13459 22008 -13476 -4278 19464 -19685 5815 12694 -21428 14497 3178 -18467 20125
2340 20125 -7061 -11380 21199 -15463 -1683 17635 -20501 8169 9937 -21075 15974 6
2352 6 -17025 20700 -9568 -9084 20014 -17224 1066 15627 -21037 10614 7224 -20099 17592
2365 17592 -2532 -14772 20854 -12001 -6274 19575 -18488 3965 13372 -20980 12885 4801
2377 4801 -18864 19132 -4840 -12473 21034 -13531 -3389 18309 -19242 6384 11853 -20513
$$ packed form
2290B2141l8196J3492K1172m0008K9402L060l3078L8799j5677j9054L9650l0788
2302i085o66L1553l8831J7513J6704l8731L2041j977k9722L9348j9994j4085L7995
2315B2063l3628M745K7531l9186K1684J1688l6314L4336o822k5760L9116k3676
2327d223r236L5467l5484R198K3742l9149K5500O879l4122L5925j1319k1645L8592
2340B0125k7186m319L2579l6662J3780J9318l8136K8670J768l1012L7049j5968
2352Fj7031L7725l0268M84K9098l7238J8290J4561l6664L1651l390k7323L7691
2365A7592k0124j2240L5626l2855N727K5849l8063K2453R407l4352L3865q084
2377D801k3665L7996k3972p633L3507l4565J0142K1698l7551K5626N469l2366
$$ plain form
2389 -20513 14573 2574 -17361 19799 -7088 -10441 20718 -15202 -1041 16825 -19806 8424
2401 8424 9480 -20087 16262 71 -15844 20186 -9316 -7988 19893 -16595 1460 14770
2413 14770 -20164 10440 6709 -19103 17173 -2745 -13896 19980 -11641 -5933 18493 -17935
2425 -17935 3582 12893 -20037 12187 3995 -18242 18303 -5277 -11866 19651 -13324 -3379 16910
2438 16910 -18622 6188 10242 -20024 14006 1800 -16499 18827 -7576 -9390 19460 -14932
2450 -14932 -717 15797 -19021 8579 8246 -18780 15790 -507 -14722 19505 -9247 -7122
2462 -7122 18720 -15792 1897 14052 -19115 10700 6129 -17775 16833 -2804 -12718 19318
2474 19318 -11232 -4707 17733 -17314 4412 12125 -19165 12342 3559 -16762 17705 -5387
$$ packed form
2389b0513L5086j1999j9935L7160k6887l353L1159l5920J4161J7866l6631K8230
2401H424J056k9567L6349j6191j5915L6030k9502J328K7881l6488J8055J3310
2413A4770l4934L0604l731k5812L6276j9918j1151L3876l1621N708K4426l6428
2425a7935K1517R311l2930L2224q192k2237L6545k3580o589L1517l2975R945K0289
2438A6910l5532K4810M054l0266L4030j2206j8299L5326k6403j814K8850l4392
2450a4932J4215J6514l4818K7600l33k7026L4570j6297j4215L4227k8752K125
2462g122K5842l4512J7689J2155l3167K9815m571k3904L4608j9637r914L2036
2474A9318l0550O525K2440l5047K1726P713l1290L1507q783k0321L4467k3092
$$ plain form
2486 -5387 -10748 18956 -13213 -2300 16144 -17980 6445 9335 -19001 13961 993 -15458
2498 -15458 18170 -7575 -8742 18404 -15013 -91 14130 -18547 8846 7325 -18025 15281
2510 15281 -1451 -13903 18197 -10071 -6188 17413 -15784 2394 12712 -18614 10563 4752
2522 4752 -16910 16274 -3625 -11746 18547 -11539 -3714 16668 -16402 4791 10901 -18001 12220
2535 12220 2742 -15425 16968 -5669 -9578 18268 -12699 -1278 14993 -17128 7111 8628
2547 8628 -17531 13999 382 -13967 17549 -7791 -7378 17345 -14246 874 13648 -17761
2559 -17761 9093 6176 -17056 15213 -2104 -12667 17726 -10156 -5246 16423 -15335 3002
2571 3002 11422 -17921 10629 3990 -16280 15926 -4235 -10821 17411 -11734 -3334 15318 -16568
$$ packed form
2486e387n361K9704l2169J0913J8444l4124K4425K890k8336L2962j2968j6451
2498a5458L3628k5745j167K7146l3417J4922J4221l2677K7393j521k5350L3306
2510A5281j6732j2452L2100k8268L883K3601l3197J8178J0318l1326K9177n811
2522D752k1662L3184j9899q121L0293l0086P825K0382l3070K1193O110k8902L0221
2535A2220r478j8167L2393k2637l909K7846l0967J1421J6271l2121K4239J517
2547H628k6159L1530j3617j4349L1516k5340M13K4723l1591J5120J2774l1409
2559a7761K6854k917k3232L2269j7317j0563L0393k7882M910K1669l1758J8337
2571C002Q420k9343K8550o639k0270L2206k0161o586K8232k9145Q400J8652l1886
$$ plain form
2584 -16568 5151 9411 -17786 12332 1675 -14594 16700 -6437 -8771 17270 -12989 -551
2596 -551 14039 -16690 7287 7405 -17115 14020 -253 -13089 17257 -8039 -6556 16493 -14179
2609 -14179 1754 12320 -16967 9520 5325 -15879 14939 -2346 -11241 17042 -9869 -4146
2621 -4146 15681 -15216 4085 10555 -16909 10884 3233 -14903 15669 -4938 -9438 16889 -11463
2634 -11463 -2042 14159 -15959 5668 8464 -16762 12177 1048 -13726 15756 -6950 -7745 16513
2647 16513 -13193 -287 12725 -16437 7366 6438 -16271 13644 -1450 -12224 16256 -8674
2659 -8674 -5708 15362 -14089 2247 11165 -16362 9351 4117 -15077 14420 -3590 -10279 16222
2672 16222 -10587 -3401 14496 -14745 4135 9753 -16216 10834 2452 -13737 15367 -4979
$$ packed form
2584a6568K1719M260k7197L0118j0657j6269L1294k3137k334K6041l0259J2438
2596e51J4590l0729K3977J18k4520L1135j4273j2836L0346k5296J483K3049l0672
2609a4179J5933J0566k9287K6487m195k1204L0818j7285q895K8283k6911N723
2621d146J9827l0897J9301O470k7464K7793p651j8136L0572k0607m500K6327k8352
2634a1463R421J6201l0118K1627K796k5226K8939j1129j4774K9482k2706p95K4258
2647A6513k9706J2906J3012k9162K3803r28k2709K9915j5094j0774K8480k4930
2659h674K966K1070k9451J6336Q918k7527K5713n234j9194K9497j8010o689K6501
2672A6222k6809P186J7897k9241J8880N618k5969K7050q382j6189K9104k0346
$$ plain form
2684 -4979 -8507 16336 -11515 -1267 13425 -15370 6286 7828 -15811 12599 478 -12742
2696 -12742 15966 -6978 -6382 15784 -12955 692 12343 -15712 7887 5998 -15195 13450
2708 13450 -1677 -11306 15924 -8772 -4931 14786 -13683 2962 10461 -16017 9526 3643 -14443
2721 -14443 14025 -3814 -9450 15519 -10732 -2990 13671 -14851 4636 8421 -15707 10887
2733 10887 1320 -13346 14766 -6063 -7686 15273 -11743 -731 12514 -15127 6486 6570 -15137
2746 -15137 12291 -311 -11812 15164 -7432 -5966 14864 -12773 1158 11029 -15407 8225
2758 8225 5054 -14300 13326 -2298 -10405 15642 -8558 -3871 13979 -13718 3569 9852 -15305
2771 -15305 9681 3134 -13419 14063 -4055 -8774 15346 -10280 -1950 13002 -14518 4979
$$ packed form
2684d979l528K4843k7851J0248J4692k8795K1656J542k3639K8410j2121j3220
2696a2742K8708k2944N96K2166k8739J3647J1651k8055K3599j889k1193K8645
2708A3450j5127r629K7230k4696L841J9717k8469J6645P499k6478K5543n883j8086
2721a4443K8468j7839n636K4969k6251P742J6661k8522J9487L785k4128K6594
2733A0887r567j4666K8112k0829j623K2959k7016J1012J3245k7641K1613Q4k1707
2746a5137K7428j2602j1501K6976k2596J466K0830k7637J3931R871k6436K3632
2758H225l171j9354K7626j5624q107K6047k4200M687J7850k7697J7287O283k5157
2771a5305K4986o547j6553K7482j8118m719K4120k5626Q330J4952k7520J9497
$$ plain form
2783 4979 7639 -14971 11107 1018 -12300 14418 -6126 -7179 14657 -11571 -94 11505
2795 11505 -14731 6868 6044 -14490 12098 -1057 -11151 14592 -7635 -5245 14165 -12826
2807 -12826 1523 10177 -15166 8517 4146 -13866 12909 -2791 -9625 14817 -8985 -3441 13274
2820 13274 -13157 3811 9120 -14621 9836 2539 -12826 13668 -4426 -7772 14641 -10351
2832 -10351 -1304 12223 -13563 5288 7130 -14059 10707 585 -11501 13839 -5913 -6066 13901
2845 13901 -11204 692 11061 -13921 7157 5370 -13431 11898 -1100 -10012 14491 -7505
2857 -7505 -4417 13508 -12512 2004 9462 -14166 8259 3424 -12895 12553 -3250 -8946 14235
2870 14235 -9242 -2865 12588 -13311 3827 7972 -14285 9568 1788 -12326 12991 -4903
$$ packed form
2783D979K660k2610K6078j0089j3318K6718k0544j053K1836k6228J1477J1599
2795A1505k6236K1599q24k0534K6588j3155j0094K5743k2227K390J9410k6991
2807a2826J4349Q654k5343K3683m371j8012K6775j5700o834K4442k3802N544J6715
2820A3274k6431J6968N309k3741K4457p297j5365K6494j8094l346K2413k4992
2832a0351R047J3527k5786J8851J842k1189K4766j0122j2086K5340j9752j53J9967
2845A3901k5105J1896J0369k4982K1078j787j8801K5329j2998q912K4503k1996
2857g505L088J7925k6020J4516P458k3628K2425m835j6319K5448j5803n696K3181
2870A4235k3477O377J5453k5899J7138M145k2257K3853p780j4114K5317j7894
$$ plain form
2882 -4903 -7434 13769 -10571 -1079 11149 -13605 5146 6615 -13758 10842 -106 -11050 13365
2895 13365 -6298 -5799 13232 -11179 975 10397 -13529 7116 4957 -12872 11753 -1817 -9202
2908 -9202 13458 -7750 -3582 12876 -11933 2820 8896 -13372 8800 3074 -11954 12779 -3385
2921 -3385 -7711 13667 -9062 -2200 11574 -12334 4609 7305 -13461 9918 1017 -11221 12998
2934 12998 -5131 -6098 13241 -10193 69 10204 -13239 6056 5523 -13075 10901 -853 -9949
2947 -9949 13045 -6953 -4860 12710 -11553 1489 9302 -13576 7428 3806 -12407 11630 -2583
2960 -2583 -8615 12764 -8371 -2975 11863 -11988 3009 7804 -13198 8521 2092 -11217 12475
2973 12475 -3983 -7198 13409 -9280 -1148 11302 -12413 5031 6426 -12845 10121 407 -10311
$$ packed form
2882d903k531K1203k4340R492J2228k4754J8751J469k0373K4600j0948j0944K4415
2895A3365j9663M99J9031k4411J2154R422k3926K0645k159j7829K4625j3570p385
2908i202K2660k1208M168J6458k4809J4753O076k2268K2172n726j5028K4733j6164
2921c385m326K1378k2729O862J3774k3908J6943K696k0766K3379q901j2238K4219
2934A2998j8129r67J9339k3434J0262J0135k3443J9295n33j8598K3976j1754r096
2947i949K2994j9998K093J7570k4263J3042P813k2878K1004l622j6213K4037j4213
2960b583o032K1379k1135N396J4838k3851J4997M795k1002K1719o429j3309K3692
2973A2475j6458l215K0607k2689Q132J2450k3715J7444J395j9271K2966r714j0718
$$ plain form
2986 -10311 12953 -5561 -5467 12843 -10470 526 9931 -12780 6424 4967 -12253 11037 -1058
2999 -1058 -9223 13149 -6921 -4033 12178 -11010 1930 8654 -12930 7428 3368 -11715 11488
3012 11488 -2930 -7843 12786 -8029 -2561 10995 -11792 3622 7278 -12514 8697 1737 -10867
3025 -10867 11970 -4523 -6460 12487 -9398 -774 10018 -12409 4976 5607 -12355 9589 -383
3038 -383 -9829 12135 -5926 -5050 11770 -10278 919 9223 -12448 6648 4205 -11972 10698
3051 10698 -1540 -8440 12548 -7002 -3271 11398 -11099 2907 7924 -12162 7846 2479 -10613
3064 -10613 11429 -3420 -6812 12346 -8467 -1721 10483 -11585 4152 6482 -12133 8843
3076 8843 1067 -9923 12187 -4613 -5669 12038 -9115 -93 9555 -11811 5571 4895 -11757
$$ packed form
2986a0311K3264j8514R4J8310k3313J0996R405k2711J9204j457j7220K3290j2095
2999a058q165K2372k0070K888J6211k3188J2940O724k1584K0358m060j5083K3203
3012A1488j4418m913K0629k0815N468J3556k2787J5414L656j9792K1211o960j2604
3025a0867K2837j6493j937J8947k1885Q624J0792k2427J7385O31j7962K1944r972
3038c83r446K1964j8061Q76J6820k2048J1197Q304k1671J9096k443j6177K2670
3051A0698j2238o900K0988j9550L731J4669k2497J4006N017k0086K0008n367j3092
3064a0613K2042j4849l392J9158k0813O746J2204k2068J5737K330j8615K0976
3076H843p776j0990K2110j6800j056J7707k1153R022R648k1366J7382o76j6652
$$ plain form
3089 -11757 9618 -773 -9204 12021 -6304 -4225 11345 -10491 1527 8305 -12085 6736
3101 6736 3341 -11366 10570 -2183 -8031 12084 -7620 -2994 10631 -10962 2643 7156 -11944
3114 -11944 7871 1793 -10356 11246 -3888 -6383 11965 -8458 -1143 10102 -11498 4670
3126 4670 5900 -11642 9005 492 -9076 11461 -5010 -5055 11510 -9312 746 8956 -11321
3139 -11321 6048 4108 -10999 10033 -944 -8265 11777 -6287 -3369 10791 -9958 2253
3151 2253 7630 -11494 7078 2859 -10497 10590 -2688 -7012 11433 -7689 -2202 10275 -10753
3164 -10753 3411 6199 -11486 8005 1435 -9907 10984 -4277 -5902 11319 -8815 -800 9057
3177 9057 -11295 4613 5131 -11552 8889 -262 -8976 11060 -5458 -4397 11102 -9603 872
$$ packed form
3089a1757K1375j0391q431K1225j8325K079J5570k1836J2018O778k0390J8821
3101F736l395j4707K1936j2753n848K0115j9704M626J3625k1593J3605M513j9100
3114a1944J9815o078j2149K1602j5134k495J8348k0423P315J1245k1600J6168
3126D670J230j7542K0647q513r568K0537j6471m5J6565k0822J0058Q210k0277
3139a1321J7369j940j5107K1032j0977p321K0042j8064K918J4160k0749J2211
3151B253N377j9124J8572m219j3356K1087j3278m324J8445j9122N487J2477k1028
3164a0753J4164K788j7685J9491o570j1342K0891j5261j625J7221k0134Q015R857
3177I057k0352J5908N18j6683K0441r151q714K0036j6518J061J5499k0705J0475
$$ plain form
3190 872 8140 -11333 5956 3735 -10839 9675 -1457 -7662 11314 -6466 -3180 10430 -10010
3203 -10010 2634 7276 -11218 6961 2482 -9807 10208 -2743 -6252 11059 -7759 -1247 9754
3216 9754 -10477 3838 5899 -10857 8139 804 -8753 10688 -4446 -4904 10909 -8393 -28
3229 -28 8520 -11094 4949 4603 -10626 9003 -715 -8153 10642 -5885 -3574 10483 -9470 1491
3243 1491 7441 -10954 6468 2710 -10407 9561 -2232 -7210 10721 -7061 -2199 9523 -10101
3256 -10101 2806 6100 -10839 7026 1575 -9445 10227 -3431 -5809 10703 -8017 -902 8905
3269 8905 -10424 4254 4943 -10517 8369 -244 -8221 10478 -4884 -4306 10655 -8448 676
3282 676 7678 -10515 5406 4003 -10167 9023 -1292 -7305 10680 -6090 -3025 9813 -9183
$$ packed form
3190H72P268j9473J7289k221j4574K0514j1132o205J8976j7780L286J3610k0440
3203a0010J2644M642j8494J8179m479j2289K0015j2951l509J7311j8818O512J1001
3216I754k0231J4315K061j6756J8996p335r557J9441j5134m58J5813j9302Q365
3229b8Q548j9614J6043l46j5229J9629r718p438J8795j6527K311J4057j9953J0961
3243A491N950j8395J7422l758j3117J9968j1793m978J7931j7782M862J1722j9624
3256a0101J2907L294j6939J7865n451j1020J9672j3658k378J6512j8720P115R807
3269H905j9329J4678O89j5460J8886q613p977J8699j5362N78J4961j9103R124
3282F76P002j8193J5921j403j4170J9190j0315o013J7985j6770L065J2838j8996
$$ plain form
3295 -9183 1973 6915 -10372 6596 2277 -9179 9798 -2370 -6172 10448 -6842 -1831 9270
3308 9270 -9735 3020 5518 -10493 7629 984 -8798 10000 -3725 -5107 10051 -7814 -451
3321 -451 8145 -10209 4246 4409 -10113 8223 -739 -7816 10238 -5267 -3815 9694 -8690
3334 -8690 1047 7046 -10445 5701 2891 -9316 9074 -1870 -6495 10286 -6323 -2236 9205
3347 9205 -9328 2500 6036 -10206 6863 1956 -8896 9504 -3142 -5460 10245 -7333 -771
3360 -771 8554 -9774 3690 5272 -9907 7845 318 -8145 9826 -4334 -4409 10079 -8040 380
3374 380 7860 -9759 4868 3948 -9506 8071 -788 -7012 9879 -5274 -3243 9325 -8643
3387 -8643 1576 6354 -9909 5729 2443 -9214 8893 -2423 -6300 9785 -6393 -1957 8490
$$ packed form
3295i183J1156M942j7287J6968m319j1456J8977j2168l802J6620j7290N011J1101
3308I270j9005J2755K498j6011J8122o645r782J8798j3725j382J5158j7865P363
3321d51Q596j8354J4455J63j4522J8336q962p077J8054j5505J452J3509j8384
3334h690R737N999j7491J6146k810j2207J8390j0944m625J6781j6609M087J1441
3347I205j8533J1828L536j6242J7069m907j0852J8400j2646k318J5705j7578O562
3360g71R325j8328J3464J582j5179J7752p527q463J7971j4160p5J4488j8119Q420
3374C80P480j7619J4627r20j3454J7577q859o224J6891j5153K031J2568j7968
3387h643J0219M778j6263J5638l286j1657J8107j1316l877J6085j6178M436J0447
$$ plain form
3400 8490 -9316 2573 5517 -9980 6574 1216 -8363 9202 -3676 -4830 9525 -7648 -324
3413 -324 7958 -9114 3827 4358 -9458 7650 -361 -7335 9645 -4583 -3558 9571 -7947
3426 -7947 869 7220 -9221 5226 3082 -8991 8372 -1280 -6332 9662 -5656 -2327 8777
3439 8777 -8627 2188 6015 -9288 6252 1905 -8119 8915 -2548 -5206 9639 -6336 -1148
3452 -1148 8237 -8919 3208 4960 -9385 7031 444 -7870 9276 -3798 -4303 9085 -7625
3465 -7625 -65 7220 -9613 4555 3789 -9042 7711 -854 -7036 9349 -4963 -3148 8781
3478 8781 -8255 1255 6268 -9394 5370 2414 -8765 8157 -1860 -6104 9045 -5761 -1932
3491 -1932 8415 -8749 2350 5234 -9160 6406 1364 -7831 8750 -2835 -4950 9077 -6754
$$ packed form
3400H490j7806J1889K944j5497J6554n358r579J7565j2878j154J4355j7173P324
3413c24Q282j7072J2941N31j3816J7108q011o974J6980j4228J025J3129j7518
3426g947Q816O351j6441J4447k144j2073J7363r652n052J5994j5318L329J1104
3439H777j7404J0815L827j5303J5540m347j0024J7034j1463k658J4845j5975N188
3452a148R385j7156J2127J752j4345J6416o587q314J7146j3074n05J3388j6710
3465g625P560P285j6833J4168p66j2831J6753q565o182J6385j4312J815J1929
3478H781j7036R510N013j5662J4764k956j1179J6922j0017m244J5149j4806L829
3491a932J0347j7164J1099K884j4394J5566n042r195J6581j1585k115J4027j5831
$$ plain form
3504 -6754 -604 7614 -8959 3624 4422 -8865 6978 59 -7119 9320 -3989 -3651 8678 -7445
3518 -7445 625 6874 -8979 4735 3429 -8305 7788 -1081 -6115 8829 -5298 -2386 8341
3531 8341 -7978 1965 5639 -9043 5491 1929 -8262 8366 -2587 -5328 9049 -6022 -1615
3544 -1615 7696 -8565 2955 5023 -8957 6478 781 -7682 8607 -3704 -4365 8884 -6779
3557 -6779 -265 6989 -8788 3921 3729 -8868 7143 -648 -6698 8648 -4430 -3345 8554
3570 8554 -7504 1097 6091 -8774 4743 2774 -8248 7892 -1388 -5725 8828 -5238 -1771
3583 -1771 8023 -7864 2095 5204 -8444 5710 1595 -7313 8208 -2417 -4875 8945 -5529
3596 -5529 -1229 7163 -7965 3185 4466 -8409 6183 666 -6940 8243 -3392 -3814 8269
$$ packed form
3504f754O150Q218j6573J2583P98j3287J5843o919p178J6439j3309L38J2329j6123
3518g445Q070O249j5853J3714j306j1734J6093q869n034J4944j4127K912J0727
3531H341j6319R943L674j4682J4534l562j0191J6628j0953k741J4377j5071M407
3544a615R311j6261J1520K068j3980J5435n697q463J6289j2311o61J3249j5663
3557f779O514P254j5777J2709j92j2597J6011p791o050J5346j3078J085J1899
3570H554j6058Q601M994j4865J3517j969j1022J6140r280m337J4553j4066L467
3583a771R794j5887R959L109j3648J4154m115q908J5521j0625k458J3820j4474
3596e529M300Q392j5128J1150J281j2875J4592n517p606J5183j1635m22J2083
$$ plain form
3609 8269 -6710 -86 6634 -8510 4022 3143 -8393 7094 -881 -6101 8453 -4486 -2654
3622 -2654 7841 -7453 1149 5634 -8336 4960 2096 -7860 7463 -1737 -5319 8350 -5538
3635 -5538 -1600 7409 -7831 2271 4728 -8114 5797 935 -7146 7791 -2894 -4294 8384
3648 8384 -5915 -469 6927 -7879 3220 3948 -8014 6471 267 -6629 8151 -3562 -3175 8065
3662 8065 -6696 452 5985 -8047 4248 3015 -7738 6761 -779 -5651 8146 -4528 -2378
$$ packed form
3609H269j4979O624O720j5144J2532q79j1536J5487p975n220J4554j2939J832
3622b654J0495j5294Q602M485j3970J3296k864r956J5323r200l582J3669j3888
3635e538L938R009j5240J0102K457j2842J3911m862q081J4937j0685j400J2678
3648H384j4299N446P396j4806J1099P28j1962J4485o204o896J4780j1713L87J1240
3662H065j4761P148N533j4032J2295j233j0753J4499p540m872J3797j2674K150
$$ [...]
8191A0
##END NTUPLES=NMR FID
##END=
