##TITLE=1H_PbPA2309M
 CDCl3, 8 sc, 
 24.9.2019
##JCAMPDX= 6.0         $$ Bruker NMR JCAMP-DX V2.0
##DATA TYPE= NMR FID
##DATA CLASS= NTUPLES
##ORIGIN= UXNMR, Bruker Analytische Messtechnik GmbH
##OWNER= root
$$ XWIN-NMR		Version 3.5
$$ Tue Sep 24 14:25:14 2019 Russian Standard Time (UT+4h)  she@DPX200
##.OBSERVE FREQUENCY= 200.1315
##.OBSERVE NUCLEUS= ^1H
##.DELAY= (6, 6)
##.ACQUISITION MODE= SIMULTANEOUS
##.ACQUISITION SCHEME= undefined
##.AVERAGES= 8
##.DIGITISER RES= 18
##SPECTROMETER/DATA SYSTEM= spect
##.PULSE SEQUENCE= zg30
##.SOLVENT NAME= CDCl3
##.SHIFT REFERENCE= (INTERNAL, CDCl3, 0, 15.7039)
##AUDIT TRAIL= $$ (NUMBER, WHEN, WHO, WHERE, WHAT)
$$ ##TITLE= Audit trail, XWIN-NMR		Version 3.5
$$ ##JCAMPDX= 5.01
$$ ##ORIGIN= Bruker BioSpin GmbH
$$ ##OWNER= she
$$ F:/spectra/data/she/nmr/H-F/1/audita.txt
$$ ##AUDIT TRAIL=  $$ (NUMBER, WHEN, WHO, WHERE, WHAT)
(   1,<2019-09-24 14:23:30.59 +0400>,<she>,<DPX200>,
      <created by zg, POWCHK disabled, PULCHK disabled
       configuration hash MD5:
       00 E9 B6 7A A2 85 ED C7 34 08 36 98 17 FE 4E 26
       data hash MD5: 16K
       10 B1 6D 49 9A B6 FC B1 CF 82 5B 44 1A B8 2A 93>)
$$ ##END=
$$ 
$$ hash MD5
$$ 1A E9 79 01 E1 6A 89 DE B7 C8 39 9D 99 DF 78 D2
##$RELAX= 
##$RELAX= 
##$RELAX= 
##$RELAX= 
##$RELAX= 
##$RELAX= 
$$ Bruker specific parameters
$$ --------------------------
##$DU= <F:/spectra>
##$EXPNO= 1
##$NAME= <H-F>
##$PROCNO= 1
##$TYPE= <nmr>
##$USER= <she>
##$AMP= (0..31)
100 100 100 100 100 100 100 100 100 100 100 100 100 100 100 100 100 100 
100 100 100 100 100 100 100 100 100 100 100 100 100 100 
##$AQSEQ= 0
##$AQ_mod= 1
##$AUNM= <au_zg>
##$AUTOPOS= <>
##$BF1= 200.13
##$BF2= 200.13
##$BF3= 200.13
##$BF4= 200.13
##$BF5= 200.13
##$BF6= 200.13
##$BF7= 200.13
##$BF8= 200.13
##$BYTORDA= 1
##$CFDGTYP= 0
##$CFRGTYP= 5
##$CHEMSTR= <none>
##$CNST= (0..31)
1 1 145 1 1 1 1 1 1 1 1 1 1 1 1 1 1 1 1 1 1 1 1 1 1 1 1 1 1 1 1 1 
##$CPDPRG= <>
##$CPDPRG1= <>
##$CPDPRG2= <>
##$CPDPRG3= <>
##$CPDPRG4= <mlev>
##$CPDPRG5= <mlev>
##$CPDPRG6= <mlev>
##$CPDPRG7= <mlev>
##$CPDPRG8= <mlev>
##$CPDPRGB= <>
##$CPDPRGT= <>
##$D= (0..31)
0 1.2 0 0 0 0 0 0 0 0.06 0 0.03 0 0 0 0 0.0002 0 0 0 0 0 0 0 0 0 0 0 0 
0 0 0 
##$DATE= 1569320609
##$DBL= (0..7)
120 120 120 120 120 120 120 120 
##$DBP= (0..7)
150 150 150 150 150 150 150 150 
##$DBP07= 0
##$DBPNAM0= <>
##$DBPNAM1= <>
##$DBPNAM2= <>
##$DBPNAM3= <>
##$DBPNAM4= <>
##$DBPNAM5= <>
##$DBPNAM6= <>
##$DBPNAM7= <>
##$DBPOAL= (0..7)
0.5 0.5 0.5 0.5 0.5 0.5 0.5 0.5 
##$DBPOFFS= (0..7)
0 0 0 0 0 0 0 0 
##$DE= 6
##$DECBNUC= <off>
##$DECIM= 24
##$DECNUC= <off>
##$DECSTAT= 4
##$DIGMOD= 1
##$DIGTYP= 9
##$DL= (0..7)
0 120 120 120 120 120 120 120 
##$DP= (0..7)
150 150 150 150 150 150 150 150 
##$DP07= 0
##$DPNAME0= <>
##$DPNAME1= <>
##$DPNAME2= <>
##$DPNAME3= <>
##$DPNAME4= <>
##$DPNAME5= <>
##$DPNAME6= <>
##$DPNAME7= <>
##$DPOAL= (0..7)
0.5 0.5 0.5 0.5 0.5 0.5 0.5 0.5 
##$DPOFFS= (0..7)
0 0 0 0 0 0 0 0 
##$DQDMODE= 0
##$DR= 18
##$DS= 0
##$DSLIST= <SSSSSSSSSSSSSSS>
$$ [...]
##$SUBNAM2= <"">
##$SUBNAM3= <"">
##$SUBNAM4= <"">
##$SUBNAM5= <"">
##$SUBNAM6= <"">
##$SUBNAM7= <"">
##$SUBNAM8= <"">
##$SUBNAM9= <"">
##$SW= 24.0689530833862
##$SWIBOX= (0..15)
0 0 2 0 0 0 0 0 0 0 0 0 0 0 0 0 
##$SW_h= 4816.95568400771
##$TD= 16384
##$TD0= 1
##$TE= 0
##$TE2= 300
##$TE3= 300
##$TEG= 300
##$TL= (0..7)
0 120 120 120 120 120 120 120 
##$TP= (0..7)
150 150 150 150 150 150 150 150 
##$TP07= 0
##$TPNAME0= <>
##$TPNAME1= <>
##$TPNAME2= <>
##$TPNAME3= <>
##$TPNAME4= <>
##$TPNAME5= <>
##$TPNAME6= <>
##$TPNAME7= <>
##$TPOAL= (0..7)
0.5 0.5 0.5 0.5 0.5 0.5 0.5 0.5 
##$TPOFFS= (0..7)
0 0 0 0 0 0 0 0 
##$TUNHIN= 0
##$TUNHOUT= 0
##$TUNXOUT= 0
##$USERA1= <user>
##$USERA2= <user>
##$USERA3= <user>
##$USERA4= <user>
##$USERA5= <user>
##$V9= 5
##$VALIST= <valist>
##$VCLIST= <CCCCCCCCCCCCCCC>
##$VD= 0
##$VDLIST= <DDDDDDDDDDDDDDD>
##$VPLIST= <PPPPPPPPPPPPPPP>
##$VTLIST= <TTTTTTTTTTTTTTT>
##$WBST= 1024
##$WBSW= 4
##$XGAIN= (0..3)
0 0 0 0 
##$XL= 0
##$YL= 0
##$YMAX_a= 345039
##$YMIN_a= -300031
##$ZGOPTNS= <>
##$ZL1= 120
##$ZL2= 120
##$ZL3= 120
##$ZL4= 120
##$ABSF1= 10
##$ABSF2= 0
##$ABSG= 5
##$ABSL= 3
##$ALPHA= 0
##$AQORDER= 0
##$ASSFAC= 0
##$ASSFACI= 0
##$ASSFACX= 0
##$ASSWID= 0
##$AUNMP= <proc_1d>
##$AZFE= 0.1
##$AZFW= 0.1
##$BCFW= 1
##$BC_mod= 2
##$BYTORDP= 1
##$COROFFS= 0
##$CY= 11.3945322036743
##$DATMOD= 1
##$DC= 2
##$DFILT= <>
##$DTYPP= 0
##$F1P= 20.1720416913024
##$F2P= 0.152960286110954
##$FCOR= 0.5
##$FTSIZE= 0
##$FT_mod= 4
##$GAMMA= 1
##$GB= 0.15
##$INTBC= 1
##$INTSCL= 1
##$ISEN= 128
##$LB= 0.24
##$LEV0= 0
##$LPBIN= 0
##$MAXI= 10000
##$MC2= 0
##$MEAN= 0
##$ME_mod= 0
##$MI= 1.114404
##$NCOEF= 0
##$NC_proc= 0
##$NLEV= 6
##$NOISF1= 3.799351
##$NOISF2= 2.8
##$NSP= 1
##$NTH_PI= 0
##$NZP= 0
##$OFFSET= 15.70392
##$PC= 1
##$PHC0= -9725.252
##$PHC1= 8.60095
##$PH_mod= 1
##$PKNL= yes
##$PPARMOD= 0
##$PSCAL= 0
##$PSIGN= 0
##$REVERSE= no
##$SF= 200.130013532006
##$SI= 16384
##$SIGF1= 3
##$SIGF2= 2
##$SINO= 400
##$SIOLD= 16384
##$SREGLST= <1H.CDCl3>
##$SSB= 0
##$STSI= 0
##$STSR= 0
##$SW_p= 3612.71676300578
##$SYMM= 0
##$S_DEV= 0
##$TDeff= 0
##$TDoff= 0
##$TI= <>
##$TILT= no
##$TM1= 0
##$TM2= 0
##$TOPLEV= 0
##$USERP1= <user>
##$USERP2= <user>
##$USERP3= <user>
##$USERP4= <user>
##$USERP5= <user>
##$WDW= 1
##$XDIM= 8192
##$YMAX_p= 0
##$YMIN_p= 0
$$ End of Bruker specific parameters
$$ ---------------------------------
##NTUPLES= NMR FID
##VAR_NAME=  TIME,          FID/REAL,        FID/IMAG
##SYMBOL=    X,             R,               I
##VAR_TYPE=  INDEPENDENT,   DEPENDENT,       DEPENDENT
##VAR_FORM=  AFFN,          ASDF,            ASDF
##VAR_DIM=   8192,          8192,            8192
##UNITS=     SECONDS,       ARBITRARY UNITS, ARBITRARY UNITS
##FACTOR=    0.0002076,     1,               1
##FIRST=     0,             0,               0
##LAST=      1.7004516,     0,               0
##MIN=       0,             -300031,         0
##MAX=       1.7004516,     345039,          0
$$ Real data points
##PAGE= N=1
##DATA TABLE= (X++(R..R)), XYDATA
$$ plain form
0 0 0 0 0 3 -8 8 -8 8 -16 16 -24 32 -40 48 -56 68 -80 96 -113 136 -160 184 -213 246 -281 322 -369 417
28 417 -473 537 -604 678 -760 852 -950 1058 -1176 1307 -1450 1608 -1779 1970 -2181 2416
44 2416 -2677 2969 -3301 3676 -4108 4611 -5204 5917 -6789 7894 -9337 11314 -14204 18844
58 18844 -27526 49384 -217214 -300031 182348 70387 -165606 -126290 81575 -42821 -201692
69 -201692 -83942 135433 56963 -126288 -159547 -77643 -59406 -28942 16755 8392 -44020 -26744
81 -26744 -21652 -86578 -96446 38445 113990 14104 -90065 -58520 -25479 -49941 -7812 97907
93 97907 78894 -49815 -79942 12404 58607 44005 62350 64896 -21585 -79272 -12645 62281
105 62281 56811 63269 99486 53325 -25450 28739 130130 68145 -48998 21246 142473 34026
$$ packed form
0@%%%Lj1J6j6J6k4L2m0N6p2Q8j04J24j48J76k09K49k96L44l97M59n27O03o91P86
28D17q90J010j141J282j438J612j802K008k234K483k757L058l387L749m151M597
44B416n093N646o270O977p784Q719r815J1121j2706J4683j7231K0651k5518L3048
58A8844m6370P6910k66598q2817M82379j11961k35993L9316K07865j24396j58871
69b01692J17750K19375p8470j83251l3259Q1904J8237L0464M5697q363n2412J7276
81b6744N092o4926r868J34891P5545r9886j04169L1545L3041k4462M2129J05719
93I7907j9013j28709l0127R2346M6203j4602J8345K546q6481n7687O6627P4926
105F2281n470O458L6217m6161p8775N4189J01391o1985j17143P0244J21227j08447
$$ plain form
117 34026 -141679 -42654 183881 148558 -53555 -37431 139702 116562 -63116 -45671 152367
128 152367 179104 -16051 -124432 -19766 95793 74363 2775 -8752 23911 35047 6375
139 6375 -16122 18904 73456 45421 -53978 -77285 18366 77717 11228 -50262 -819 53683
151 53683 8702 -49873 -23585 22317 5080 -30136 -26991 -19991 -34511 -30235 1131 12395 -4833
164 -4833 -16715 -21793 -28968 -12666 22193 13298 -43411 -64352 -28762 -16444 -42573 -26301 25493
177 25493 5745 -71641 -60364 46692 74313 -26927 -82689 -4032 55262 -17728 -89433 -24137
189 -24137 70304 33782 -67431 -61032 36345 58463 -24009 -63462 9826 72306 14908 -75279
201 -75279 -54219 50512 84712 8104 -54241 -17315 40779 24997 -20089 -2324 49648 34840
$$ packed form
117C4026j75705R9025K26535l5323k02113J6124J77133k3140j79678J7445J98038
128A52367K6737j95155j08381J04666J15559k1430p1588j1527L2663J1136k8672
139F375k2497L5026N4552k8035r9399k3307R5651N9351o6489o1490M9443N4502
151E3683m4981n8575K6288M5902j7237l5216L145P000j4520M276L1366J1264j7228
164d833j1882n078p175J6302L4859q895n6709k0941L5590J2318k6129J6272N1794
177B5493j9748p7386J1277J07056K7621j01240n5762P8657N9294p2990p1705O5296
189b4137R4441l6522j01213O399R7377K2118q2472l9453P3288O2480n7398r0187
201g5279K1060J04731L4200p6608o2345L6926N8094j5782m5086J7765N1972j4808
$$ plain form
213 34840 -40050 -61626 8069 69277 41896 -18331 -20708 22978 37745 12435 2548 25116
225 25116 33236 2229 -27402 -17573 9422 14397 3481 5800 15668 5122 -17982 -14114 20385
238 20385 38933 15071 -15095 -14168 -1456 -7989 -12708 15059 38573 2867 -55986 -46983 24574
251 24574 51867 -3313 -46414 -11772 27324 -6281 -52758 -20702 45374 35463 -37880 -57585
263 -57585 3917 43172 -857 -50761 -23923 31205 16567 -52962 -67557 3635 58204 17954
275 17954 -49404 -39781 21547 30024 -19737 -31981 17218 35923 -19619 -63028 -22224 39264
287 39264 29026 -27434 -40177 5 23448 2828 -15578 565 21033 10764 -14145 -16081
299 -16081 4499 14217 1970 -6587 3913 11467 -2177 -14155 892 21334 13083 -9575 -8780
$$ packed form
213C4840p4890k1576O9695O1208k7381o0227k377M3686J4767k5310r887K2568
225B5116Q120l1007k9631R829K6995M975j0916K319R868j0546k3104L868L4499
238B0385J8548k3862l0166R27J2712o533m719K7767K3514l5706n8853R003P1557
251B4574K7293n5180m3101L4642L9096l3605m6477L2056O6076r911p3343j9705
263e7585O1502L9255m4029m9904K6838N5128j4638o9529j4595P1192N4569m0250
275A7954o7358R623O1328Q477m9761j2244M9199J8705n5542m3409M0804O1488
287C9264j0238n6460j2743M0182K3443k0620j8406J6143K0468j0269k4909j936
299a6081K0580R718j2247q557J0500P554j3644j1978J5047K0442q251k2658P95
$$ plain form
312 -8780 8584 6941 -6430 5792 32332 22395 -19169 -26391 17162 42800 8413 -29879 -11720
325 -11720 26655 17129 -22770 -21151 23988 38296 -4520 -35530 -1863 44539 28949 -23741
337 -23741 -27489 23367 41367 -9315 -48802 -10814 45207 28875 -31992 -37772 17872 41002
349 41002 -2798 -34699 -744 37411 11357 -36584 -26191 26142 36547 -9199 -36915 -7773
361 -7773 25223 10154 -21838 -16661 12936 14770 -12359 -20502 3301 17609 738 -14307 -1786
374 -1786 12738 1765 -13736 -4362 12855 5441 -14300 -12356 4804 3256 -14165 -11331 13157
387 13157 17509 -9661 -23823 2468 29162 11911 -22800 -18669 16211 21367 -14396 -30784 3570
400 3570 33197 5863 -36073 -21621 28426 31811 -17399 -36133 8470 41824 6302 -39752
$$ packed form
312h780J7364j643j3371J2222K6540r937m1564p222M3553K5638l4387l8292J8159
325a1720L8375r526l9899J619M5139J4308m2816l1010L3667M6402j5590n2690
337b3741l748N0856J8000n0682l9487L7988N6021j6332o0867n780N5644K3130
349D1002m3800l1901L3955L8155k6054m7941J0393N2333J0405m5746k7716K9142
361g773L2996j5069l1992N177K9597J834k7129q143K3803J4308j6871j5045J2521
374a786J4524j0973j5501R374J7217p414j9741J944J7160j548j7421K834K4488
387A3157M352k7170j4162K6291K6694j7251l4711M131L4880N156l5763j6388L4354
400C570K9627k7334m1936J4452N0047L385m9210j8734M4603L3354l5522m6054
$$ plain form
412 -39752 -18812 35491 33572 -21080 -39162 6402 38277 5432 -34633 -15659 28237 22217
424 22217 -23107 -31432 11574 35888 3630 -30325 -12187 24195 18615 -15544 -20053 8329 18391
437 18391 -5154 -20020 -2970 13678 3193 -11744 -4483 9303 4693 -7119 -2651 9776 6838
450 6838 -6817 -7013 5062 5043 -9293 -11780 5586 14097 -3825 -20080 -4662 20437 12675 -18142
464 -18142 -20356 12421 25733 -5041 -28599 -2146 31601 13955 -28147 -24032 20128 29361 -12801
477 -12801 -35655 129 35440 12236 -30611 -22151 23666 32283 -9051 -32437 -509 33970
489 33970 14971 -25487 -20740 20203 27697 -11426 -31719 995 31149 8682 -26479 -14476
501 -14476 22675 22655 -9920 -18039 7152 18303 -732 -12792 1021 12756 2959 -8351 -2865
$$ packed form
412c9752K0940N4303j919n4652j8082M5564L1875l2845m0065J8974M3896o020
424B2217m5324q325M3006K4314l2258l3955J8138L6382n580l4159m509K8382J0062
437A8391k3545j4866J7050J6648j0485j4937P261J3786m610j1812M468J2427k938
450F838j3655j96J2075j9j4336k487J7366Q511j7922j6255J5418K5099p762l0817
464a8142k214L2777J3312l0774k3558K6453L3747j7646m2102M115M4160R233m2162
477a2801k2854L5784L5311k3204m2847Q460M5817Q617m1334k3386L1928L4479
489C3970j8999m0458M747M0943P494l9123k0293L2714L0154k2467l5161J2003
501a4476L7151k0l2575q119K5191J1151j9035j2060J3813J1735r797j1310N486
$$ plain form
514 -2865 6527 4087 -2507 -663 4885 3180 -3381 -2947 5693 9161 -355 -8522 251 12380 3495
529 3495 -15253 -8537 18149 17855 -15314 -26661 6261 28220 728 -27513 -5706 27653 12210
542 12210 -25671 -20003 20447 28339 -8141 -30034 -6292 21830 11494 -18246 -20023 8996 23083
555 23083 -2579 -29507 -12640 24327 21754 -16965 -26524 8199 24525 -6944 -29058 -1060
567 -1060 27274 6324 -26547 -18072 10467 11180 -6391 -7482 2588 232 -7656 -4669 1808 1235
581 1235 495 2359 -1892 -8726 -5570 3043 3394 -708 -530 -2021 -7280 -3944 5450 1319 -9341 86
597 86 17126 3735 -24705 -15154 22733 23797 -14578 -24606 8577 21159 -9186 -24559 4070
610 4070 26912 6971 -20671 -15372 9060 18050 4879 -11007 -8499 11212 17959 -5877 -25046
$$ packed form
514b865R392k440o594J844N548j705o561M34Q640L468r516q167Q773J2129q885
529C495j8748O716K6686k94l3169j1347L2922K1959k7492k8241K1807L3359j5443
542A2210l7881N668M0450P892l6480k1893K3742K8122j0336k9740j777K9019J4087
555B3083k5662k6928J6867L6967k573l8719r559L4723J6326l1469k2114K7998
567a060K8334k0950l2871Q475K8539P13j7571j091J0070k356p888K987O477n73
581A235p40J864m251o834L156Q613L51m102J78j491n259L336R394m131j0660R427
597H6J7040j3391k8440R551L7887J064l8375j0028L3183J2582l0345j5373K8629
610D070K2842j9941k7642N299K4432Q990j3171j5886K508J9711O747k3836j9169
$$ plain form
623 -25046 -1244 31800 15722 -25368 -20479 20052 21489 -16270 -19987 18364 27579 -8323 -25278
636 -25278 471 19312 7508 -3266 1110 682 -4426 1296 6544 -1768 -4427 9164 11382 -8015
650 -8015 -14374 4851 13906 -481 -5372 7134 6625 -8121 -6599 6998 4026 -4116 6894 13098
664 13098 -10955 -26073 2772 29582 6855 -22809 -6743 19387 4100 -21238 -7370 20189
676 20189 14833 -9060 -14313 -3855 3536 6294 3093 -6980 -5662 11444 9403 -20939 -26379 15366
690 15366 37869 -768 -35619 -9509 23369 3898 -22119 346 27574 5340 -27931 -18215
702 -18215 10029 12744 2224 989 -2835 -11976 -6073 7571 2631 -7916 4258 17164 -2185
715 -2185 -25047 -10348 16010 11544 -4567 -306 4467 -10674 -16611 3623 15751 3651 -1902
$$ packed form
623b5046K3802L3044j6078m1090M889M0531J437l7759l717L8351R215l5902j6955
636b5278K5749J8841j1804j0774M376m28n108N722N248q312k659J3591K218j9397
650h015o359J9225R055j4387m891J2506n09j4746J522J3597k972q142J1010O204
664A3098k4053j5118K8845K6810k2727k9664J6066K6130j5287k5338J3868K7559
676B0189n356k3893n253J0458P391K758l201j0073J318J7106k041l0342n440M1745
690A5366K2503l8637l4851K6110L2878j9471k6017K2465K7228k2234l3271R716
702a8215K8244K715j0520j235l824r141N903J3644m940j0547J2174J2906j9349
715b185k2862J4699K6358m466j6111M261M773j5141n937K0234J2128j2100n553
$$ plain form
728 -1902 5702 -4980 -24255 -7538 28970 24198 -14755 -22885 4157 10830 -8380 -7888 13751
741 13751 15578 -4641 -14305 -8189 -1215 7783 15782 5118 -13238 -7246 10949 1106 -19438 -945
755 -945 34129 19157 -29722 -33295 10693 27709 1553 -10583 6043 7808 -12399 -15405 5228
768 5228 16724 9978 818 -7726 -14368 -4754 14640 12799 -7272 -8246 9907 7252 -15880 -15124
782 -15124 11957 20236 602 -10160 -2865 -2088 -6786 3087 14662 5140 -9029 -4425 1938 -7403
796 -7403 -8290 13139 20767 -5899 -25528 -6672 16677 8577 -8859 -5115 6265 3775 -4687 -6205
810 -6205 -3765 1538 9439 6420 -10018 -13984 4667 12439 -7251 -16367 7991 22880 -4228 -29808
824 -29808 -9113 23714 16617 -12676 -16341 2741 8917 -1811 -7354 -1500 4727 4485 -2190 -9398
$$ packed form
728a902P604j0682j9275J6717L6508m772l8953q130K7042O673j9210M92K1639
741A3751J827k0219r664O116O974Q998P999j0664j8356N992J8195r843k0544J8493
755i45L5074j4972m8879l573M3988J7016k6156j2136J6626J765k0207l006K0633
768E228J1496o746r160q544o642R614J9394j841k0071r74J8153k655k3132P56
782a5124K7081Q279j9634j0762P295P77m698R873J1575r522j4169M604O363r341
796g403q87K1429P628k6666j9629J8856K3349q100j7436L744J1380k490q462j518
810f205K440N303P901l019j6438l966J8651P772j9690r116K4358J4889k7108k5580
824b9808K0695L2827p097k9293l665J9082O176j0728n543N854O227k42o675p208
$$ plain form
838 -9398 -5100 8370 8954 -7997 -13376 6132 17398 -2118 -20084 -5787 15696 9925 -7542
851 -7542 -6882 2386 -153 -4220 2973 7231 -1300 -5620 2244 3701 -5265 -3914 9320 9036 -6966
866 -6966 -9886 5809 11529 -2702 -11007 433 12272 7707 -4799 -10395 -4409 7951 13438 2812
880 2812 -10439 -5305 9423 6100 -9392 -4952 15994 14296 -12909 -20746 5466 23069 5314
893 5314 -15796 -7714 11511 10242 -6094 -10959 1300 12865 8352 -6324 -11764 92 11037
906 11037 3235 -8966 -1990 12543 4923 -15943 -13419 11354 18482 -1538 -14559 -4499 5014
919 5014 599 -1618 4452 3406 -5713 -6172 2109 2443 -4065 -1631 5940 2028 -8499 -7138 3676
934 3676 5447 -2817 -5505 863 4583 -741 -8058 -7580 2672 11737 5254 -12066 -15728 2002 14653
$$ packed form
838i398M298J3470N84j6951n379J9508J1266j9516j7966J4297K1483n771j7467
851g542O60R268k539m067P193M258q531m320P864J457q966J351J3234k84j6002
866f966k920J5695N720j4231q305J1440J1839m565j2506n596N986J2360N487j0626
880B812j3251N134J4728l323j5492M440K0946j698k7205p837K6212J7603j7755
893E314k1110Q082J9225j269j6336m865J2259J1565m513j4676n440J1856J0945
906A1037p802j2201O976J4533p620k0866K524K4773P128k0020j3021J0060R513
919E014m415k217O070j046r119m59Q281L34o508K434P571l912j0527J361J0814
934C676J771q264k688O368L720n324p317M78J0252R065o483j7320l662J7730J2651
$$ plain form
949 14653 2312 -12889 -4747 10327 3192 -14334 -9230 12718 15014 -7070 -18998 -3302 14788
962 14788 8894 -9858 -12584 3755 13522 921 -14735 -7969 11809 12831 -6536 -13944 2418
975 2418 13258 -273 -12830 -952 14666 6196 -12174 -10133 6975 11606 662 -5858 -1762
988 -1762 1573 407 1364 3922 1769 -2566 -1646 2718 3061 -473 -1031 2677 3631 -850 -3827 454
1004 454 6398 3877 -4642 -5141 5155 9900 -981 -11419 -2516 13695 10600 -8688 -13763 3658
1018 3658 15398 3080 -12168 -5409 10901 8368 -9149 -11677 6799 16506 -114 -17907 -7933
1031 -7933 14885 14476 -8313 -16896 1855 16342 2947 -14904 -7411 11831 10196 -8737 -12825
1044 -12825 3806 12195 -1009 -12266 -3160 9957 5399 -8298 -8877 3073 7862 -81 -6412
$$ packed form
949A4653j2341j5201Q142J5074p135j7526N104K1948K296k2084j1928J5696J8090
962A4788n894j8752k726J6339R767j2601j5656O766J9778J022j9367p408J6362
975B418J0840j3531j2557J1878J5618q470j8370K041J7108M631j0944o520M096
988a762L335j166R57K558k153m335R20M364L43l534n58L708R54m481k977M281
1004D54N944k521q519m99J0296M745j0881j0438Q903J6211l095j9288n075J7421
1018C658J1740j2318j5248O759J6310k533j7517k528J8476R707j6620j7793R974
1031g933K2818m09k2789q583J8751J4487j3395j7851P493J9242j635j8933m088
1044a2825J6631Q389j3204j1257R106J3117m558j3697n79J1950M789p943o331
$$ plain form
1057 -6412 -2938 1713 174 -1979 323 1857 -2003 -4707 -740 3710 672 -4290 -2012 3360 1241
1072 1241 -5296 -3874 4845 5489 -4859 -9272 1101 10107 1689 -11348 -7138 8898 10643 -5657
1086 -5657 -13725 -70 13328 4590 -11723 -8419 8973 11026 -6258 -13796 2034 15711 3922
1099 3922 -14857 -9927 11227 14508 -5065 -15401 -294 14702 5324 -11627 -7973 9292 10984
1112 10984 -4873 -11165 1863 11694 2578 -9451 -4584 7900 7547 -3751 -7096 1646 7248 1716
1126 1716 -4317 -1469 3697 2166 -1948 -419 3382 1474 -2909 -1165 4140 2894 -3392 -3075 4175
1141 4175 5016 -3101 -5585 3342 8282 -962 -9276 -1318 10459 5787 -8613 -8854 5918 11473 -1466
1156 -1466 -11748 -2655 10992 6750 -8953 -10538 5366 13154 -643 -14176 -4459 13007 8817
$$ packed form
1057f412L474M651j539k153K302J534l860k704L967M450l038m962K278N372k119
1072A241o537J422Q719O44j0348m413J0373R006q418j3037M210J6036J745j6300
1086e657q068J3655J3398q738j6313L304J7392K053j7284p538J5830J3677j1789
1099C922j8779M930K1154L281j9573j0336J5107J4996r378j6951L654J7265J692
1112A0984j5857o292J3028R831r116j2029M867J2484l53j1298l345Q742N602n532
1126A716o033K848N166j531m114J529L801j908m383J744N305j246o286L17P250
1141D175Q41q117k484Q927M940r244q314P958J1777m672j4400k41J4772N555j2939
1156a466j0282R093J3647m242j5703j585J5904P788j3797j3533R717J7466m190
$$ plain form
1169 8817 -11170 -13232 6855 15352 -2235 -16626 -4041 13609 7380 -10625 -10144 6021 9904
1182 9904 -3528 -11158 -1205 9267 4266 -7483 -8040 2424 7176 -420 -7515 -2602 5616 2916
1196 2916 -6185 -5547 3542 4918 -2920 -4720 1754 2452 -4268 -4024 4381 4756 -4544 -6234 2936 5049
1212 5049 -4036 -6519 3581 8137 -1840 -9776 -2678 7545 5371 -4373 -6494 1564 7085 1041
1226 1041 -8501 -5481 8305 11248 -4290 -14353 -873 14619 5024 -13142 -6827 13458 11061
1239 11061 -11077 -14590 6732 16959 1021 -12790 -4119 9271 6250 -5204 -6291 3649 9747
1252 9747 2643 -8633 -7689 5969 11923 14 -10042 -798 10646 2283 -10783 -3415 12079
1265 12079 7959 -7726 -7377 4868 5038 -3625 -1410 6844 2988 -6386 -3734 4550 2880 -2645 392
$$ packed form
1169H817j9987k062K0087Q497j7587j4391J2585J7650o229j8005M81J6165L883
1182I904j3432p630R953J0472n001j1749n57J0464M752p596p095M913Q218k700
1196B916r101O38R089J376p838j800O474O98o720K44Q405L75r300j690R170K113
1212E049r085k483J0100M556r977p936P098J0223k174r744k121Q058N521o044
1226A041r542L020J3786K943j5538j0063J3480J5492r595j8166O315K0285k397
1239A1061k2138l513K1322J0227j5938j3811Q671J3390l021j1454j087R940O098
1252I747p104j1276R44J3658N954j1909j0056R244J1444q363j3066P368J5494
1265A2079m120j5685L49J2245J70q663K215Q254l856r374K652Q284j670n525L037
$$ plain form
1280 392 4976 410 -5709 -3137 2895 4028 1979 -749 -3635 -2494 2991 2656 -4875 -3732 8341
1295 8341 8165 -9581 -14917 4691 16289 -473 -15171 -1686 13407 1308 -15445 -6052 13005
1308 13005 10036 -7439 -11843 -953 6598 3006 -4076 -5299 1669 7366 -121 -12621 -7599 11160
1322 11160 12695 -7772 -15104 3085 12549 -4176 -14249 2599 15281 591 -14483 -5207 7924
1335 7924 3185 -4544 255 4395 -1901 -5686 -433 2513 -276 696 3811 -349 -5715 -2289 2803
1350 2803 1081 142 3935 1710 -6254 -4295 5621 3917 -5823 -951 11315 3695 -14696 -9467 13047
1365 13047 13754 -7083 -10877 6488 9986 -6620 -11563 4535 14173 3963 -7942 -7174 615 5914
1379 5914 4754 -1989 -4292 4199 8928 -3988 -15171 -614 19624 9993 -14399 -12043 9992
$$ packed form
1280C92M584m566o119K572O032J133k049k728k886J141N485l35p531J143J2073
1295H341j76j7746n336J9608J1598j6762j4698J3485J5093j2099j6753R393J9057
1308A3005k969j7475m404J0890P551l592p082j223O968N697p487j2500N022J8759
1322A1160J535k0467p332J8189R464j6725j0073J6848J2682j4690j5074R276J3131
1335G924m739p729M799M140o296l785N253K946k789R72L115m160n366L426N092
1350B803j722r39L793k225p964J959R916j704r740M872J2266p620j8391N229K2514
1365A3047P07k0837l794J7365L498j6606m943J6098R638j0210j1905P68P789N299
1379E914j160o743k303Q491M729j2916j1183J4557K0238r631k4392K356K2035
$$ plain form
1392 9992 10072 -9364 -8758 11762 13825 -6780 -14860 -761 8999 3874 -665 663 -660 -3409 -1526
1407 -1526 610 -335 2369 6748 1161 -9118 -6730 4598 5547 -1532 95 4849 -2153 -10346 -2350
1422 -2350 8786 3371 -5083 988 5990 -6044 -13819 1768 16321 4679 -12263 -6918 6031
1435 6031 2204 -7301 -2062 8470 5763 -4889 -8664 -4446 2415 7385 4109 -5721 -7056 3692
1449 3692 5857 -7405 -10648 7977 17156 -2744 -19910 -5575 14231 6866 -9599 -4623 9348
1462 9348 4357 -10396 -9046 5000 10189 2776 -4942 -6305 -2011 3927 3908 -2248 -3168 4363 5223
1477 5223 -5657 -9334 2785 10325 779 -6773 383 5024 -3224 -6561 3948 8665 -1230 -6085
1491 -6085 1909 3675 -5085 -4519 7889 9166 -4816 -9942 1212 7659 459 -4525 675 4616
$$ packed form
1392I992Q0j9436O06K0520K063k0605q080J4099R760n125m539J328j323k749J883
1407a526K136r45K704M379n587j0279K388J1328R49p079J627M754p002q193P996
1422b350J1136n415q454O071N002j2034p775J5587J4553j1642j6942N345J2949
1435F031l827r505N239J0532k707j0652l775M218O861M970l276r830j335J0748
1449C692K165j3262l243J8625R179j9900j7166J4335J9806p365j6465M976J3971
1462I348m991j4753J350J4046N189p413p718j363M294N938j9o156r20P531Q60
1477E223j0880l677J2119P540r546p552P156M641q248l337J0509M717r895m855
1491f085P994J766q760N66J2408J277j3982n126J1154O447p200m984N200L941
$$ plain form
1505 4616 1198 -2729 -2946 -838 3331 5724 20 -6927 -1937 7959 3427 -9167 -5299 11205 10544
1520 10544 -8413 -13721 3472 13206 1116 -9546 -1770 8023 2898 -6657 -5227 3728 7382 1735
1534 1735 -5690 -5556 2647 7018 -482 -7844 -891 9496 3962 -9619 -7676 6220 8140 -2694
1548 -2694 -5210 2470 2821 -4738 -4047 4347 4922 -2099 -2990 875 -915 -4161 895 6535 1445 -6382
1564 -6382 -3780 3392 2415 -2889 -2316 2336 2951 -653 -3603 -3900 -373 4799 4308 -3106 -6348 412
1580 412 4926 -1634 -6562 1781 9478 865 -11624 -7114 7442 9426 -2199 -8221 -1559 5083
1594 5083 1848 -4750 -3909 3616 6704 -536 -8642 -4523 6734 7192 -4187 -7966 2797 8685 -1567
1609 -1567 -10410 -1738 10184 5904 -6141 -6709 1859 4395 -82 -1264 1761 1795 -1461 -2265 -229
$$ packed form
1505D616l418l927k17K108M169K393n704o947M990R896m532j2594L868J6504o61
1520A0544j8957n308J7193R734j2090j0662P776R793n125r555J430Q955L654n647
1534A735p425J34Q203M371p500p362O953J0387n534j3581J943J3896J920j0834
1548b694k516P680L51p559O91Q394N75p021q91L865j790l246N056N640n090p827
1564f382K602P172r77n304N73M652O15l604k950k97L527N172m91p414l242O760
1580D12M514o560m928Q343P697q613j2489M510J4556J984j1625o022O662O642
1594E083l235o598Q41P525L088p240q106M119J1257M58j1379l779J0763N888j0252
1609a567q843Q672J1922m280j2045n68Q568K536m477j182L025L4l256q04K036
$$ plain form
1624 -229 1686 2590 1959 -693 -3111 -1463 2558 3497 572 -1606 -865 940 1681 763 -1294 -1069 2346
1641 2346 4051 -492 -4975 -1367 5444 4185 -3226 -4004 2760 4615 -2067 -5225 1345 7262 2384
1656 2384 -6265 -5750 2989 7499 1824 -5667 -4368 3237 5199 -1488 -5585 266 6564 1782 -7074
1671 -7074 -4878 5571 6989 -3075 -8066 -20 7241 1806 -6737 -4476 4505 5595 -2198 -6353
1685 -6353 -1555 3798 2219 -2300 -2516 582 981 -1746 -2388 518 2336 482 -2514 -2774 -883 1113
1701 1113 1949 778 -2248 -3664 -712 3015 1762 -2673 -3190 1374 3059 -1299 -4321 -554 4028
1716 4028 1952 -3352 -3354 1619 3315 -702 -3608 -517 3955 2639 -3113 -5022 259 5989 3657 -3677
1732 -3677 -5589 853 5603 1562 -4092 -1767 4504 3273 -4030 -4906 3271 7537 548 -6796 -2993
$$ packed form
1624b29J915R04o31k652k418J648M021R39k925k178P41J805P41r18k057K25L415
1641B346J705m543m483L608O811j259p411p78O764J855o682l158O570N917m878
1656B384q649N15Q739M510n675p491J299P605J962o687m097N851O298m782q856
1671g074K196J0449J418j0064m991Q046P261n435q543K261Q981J090p793m155
1685f353M798N353j579m519k16L098L99k727o42K906J818j854k996k60J891J996
1701A113Q36j171l026j416K952L727j253m435n17M564J685m358l022L767M582
1716D028k076n304kM973J696m017k906L091M472j316n752j909N281N730k332p334
1732c677j912O442M750m041n654K325O271j231p303q76Q177M266o989p344L803
$$ plain form
1747 -2993 5713 5377 -2636 -5031 1585 5843 1115 -4449 -2285 3550 3938 -486 -2577 -49 2137
1762 2137 896 -948 -294 1596 1962 131 -1911 -1778 1140 3663 1985 -2397 -3695 359 3990 1837
1778 1837 -2506 -2196 1742 2391 -1277 -2864 543 3350 927 -2784 -2342 1204 2548 189 -2433 -1550
1794 -1550 1610 2503 -767 -3994 -1767 3546 3744 -2289 -5603 -761 4603 2018 -3886 -3127 2577 3110
1810 3110 -2632 -4803 754 5181 1338 -5205 -4491 2324 4874 -279 -4951 -2171 3255 2565 -2707
1825 -2707 -3802 1006 3668 71 -3714 -2039 1828 1979 -780 -2068 -584 1238 1137 -1193 -2668
1840 -2668 -408 3517 2429 -3180 -4806 884 5022 1192 -3876 -1814 2716 1453 -2509 -1551 2502
1855 2502 2470 -1101 -2312 -506 1016 1621 1358 -465 -2114 -257 2597 1102 -2445 -1410 3075 3047
$$ packed form
1747b993Q706l36q013k395O616M258m728n564K164N835L88m424k091K528K186
1762B137j241j844O54J890L66j831k042J33K918K523j678m382j298M054L631k153
1778A837m343L10L938O49l668j587L407K807k423l711M42L546J344k359k622Q83
1794a550L160Q93l270l227K227N313J98o033l314M842N364k585n904P59N704N33
1810C110n742k171N557M427l843o543P14O815K550n153m672K780N426o90n272
1825b707j095M808K662l597l785J675L867J51k759j288J484J822j01k330j475
1840b668K260L925j088n609j626N690M138l830n068K062M530j263l962R58M053
1855B502l2l571j211J806J522O05k63j823j649J857K854j495l547J035M485k8
$$ plain form
1871 3047 -1838 -3659 269 3336 1818 -899 -1359 69 1179 665 -1166 -1008 2383 3767 -1120 -5525
1887 -5525 -1225 5814 4101 -3386 -4020 2342 3818 -1538 -3538 1098 4159 1273 -2333 -2466 -148
1902 -148 2237 2538 -487 -2922 50 3728 285 -5270 -1828 6316 4841 -4777 -6153 2122 5251
1917 5251 -977 -3647 1209 3480 -1137 -3639 -407 1935 987 423 150 -1895 -2238 1116 2312 -1104
1933 -1104 -2282 1468 2502 -2099 -3884 223 2847 587 -888 -169 -1242 -2413 563 2741 -626
1948 -626 -2894 1235 3295 -2781 -6038 1220 6931 769 -6379 -2408 4271 1611 -4000 -2110 3050
1963 3050 2739 -1064 -2872 -2296 -96 3128 2706 -2523 -3981 1980 4248 -2868 -6264 2593 8821 -5
1979 -5 -8958 -2801 6621 3288 -4494 -2148 4318 2362 -3508 -3134 1234 2452 1622 962 -1337 -2871
$$ packed form
1871C047m885j821L928L067j518k717m60J428J110n14j831J58L391J384m887m405
1887e525M300P039j713p487o34O362J476n356k000M636L061k886l606j33K318
1902a48K385L01l025k435K972L678l443n555L442Q144j475r618j376Q275L129
1917E251o228k670M856K271m617k502L232K342r48n64k73k045l43L354J196l416
1933a104j178L750J034m601j785M107K624k260j475P19j073j171K976K178l367
1948f26k268M129K060o076l257P258N711o162p148L971O679k660n611J890N160
1963C050l11l803j808N76K200L224m22n229j458N961K268p116l396Q857O228q826
1979eq953O157R422l333p782K346O466j956n870L74M368J218q30o60k299j534
$$ plain form
1995 -2871 168 3159 364 -2467 1473 4577 -898 -5771 -865 5264 2562 -2116 -199 1761 -1895
2010 -1895 -2931 2428 4396 -703 -2222 2110 1640 -4178 -2999 5177 5795 -2174 -4943 653 2882
2025 2882 -983 -1743 2172 3079 127 -1791 -2364 -2151 1752 5799 2066 -5330 -3757 4082 2826 -5096
2041 -5096 -2997 7425 6310 -6380 -9228 2129 7741 391 -4553 377 3458 -1345 -4601 -1349
2055 -1349 2616 3355 1761 -1903 -5117 -2571 3400 3323 -2166 -1785 3332 1339 -6427 -5153 4664 6692
2071 6692 -1265 -4629 -288 550 -3122 -1278 4264 3042 -2852 -2870 480 -1061 -3118 1599 5831 987
2087 987 -5405 -3488 1327 987 -488 1538 2301 -1139 -2850 -1370 -1074 -405 3904 5124 -2295 -7870
2103 -7870 -1379 6230 1734 -4863 266 7079 572 -9050 -4417 6862 6689 -2051 -4169 490 1662
$$ packed form
1995b871L039K991k795k831L940L104n475m873M906O129k702m678J917J960l656
2010a895j036N359J968n099j519M332m70n818J179Q176O18p969k769N596K229
2025B882l865p60L915R07k952j918n73K13L903M047l733p396J573P839j256p922
2041e096K099J0422j115j2690k848J1357N612p350m944M930L081m803l256L252
2055a349L965P39j594l664l214K546N971p7n489L81N117j993p766J274R817K028
2071F692p957l364M341Q38l672J844N542j222n894j8L350j541k057M717M232m844
2087I87o392J917M815l40j475K026P63l440j711J480K96O69M309J220p419n575
2103g870O491P609m496o597N129O813o507r622M633J1279j73q740k118M659J172
$$ plain form
2118 1662 -1281 -1614 849 2755 3042 501 -4470 -4895 2518 7340 1364 -5146 -1004 4720 -133 -6126
2134 -6126 -350 8120 4060 -5147 -4575 2068 2651 -755 513 2666 270 -2163 -464 744 -755
2149 -755 458 3738 1865 -3408 -2981 1847 2184 -748 235 2505 -55 -3140 -661 1961 -156 -781
2165 -781 3043 2250 -4390 -4862 3395 5818 -2026 -5442 1732 5228 -1971 -6253 186 5714 1692 -3857
2181 -3857 -2757 1042 1571 2 -1657 -1673 1157 3467 -320 -6087 -3094 5607 5058 -4646 -6443 2814
2197 2814 5933 -2994 -7076 1335 6888 344 -6291 -2338 3515 1842 -2239 -1853 757 1350 273
2212 273 -1494 -2689 -702 3036 2496 -2337 -3380 948 2134 -1648 -2005 2480 2884 -2184 -3383 848
2228 848 1875 -1026 -431 2852 693 -3886 -1899 3541 2457 -2781 -1741 3368 2433 -3195 -3673 1705
$$ packed form
2118A662k943l33K463J906K87k541m971m25P413M822n976o510M142N724m853n993
2134f126N776Q470m060r207N72O643N83l406J268K153k396k433J699J208j499
2149g55J213L280j873n273M27M828L37k932R83K270k560l085K479K622k117o25
2165g81L824p93o640m72Q257K423p844l416P174L496p199m282O439N528m022n549
2181c857J100L799N29j569j659j6K830K310l787n767K993Q701n49r704j797R257
2197B814L119q927m082Q411N553o544o635L953N853j673m081L86K610N93j077
2212B73j767j195J987L738n40m833j043M328J186l782l57M485M04n068j199M231
2228H48J027k901N95L283k159m579J987N440j084n238J040N109r35n628m78N378
$$ plain form
2244 1705 4233 1431 -1761 -2084 -151 1717 1328 -1190 -1025 3125 3543 -3164 -6396 1385 8443 2580
2260 2580 -6683 -3867 5372 4283 -4363 -4293 4380 6260 -1668 -6208 -1032 4632 2977 -1724 -2304 998
2276 998 2673 -141 -3440 -1520 3936 4521 -1521 -5334 -1083 3954 1812 -2205 -530 2537 35
2291 35 -3557 -1372 3000 2318 -1249 -1369 412 -512 -1693 395 2483 593 -2229 -1510 1004 813 -1107
2308 -1107 -1269 838 2059 152 -3137 -3097 1376 4260 581 -4454 -2432 3235 2336 -3934 -3609 4005
2324 4005 5494 -3170 -7928 -311 7404 2806 -5904 -4550 3521 4444 -2610 -5374 704 5495 1274
2339 1274 -5234 -3901 2988 4651 -1153 -4859 -472 4522 1443 -4557 -3259 3490 4624 -1455 -4789
2354 -4789 -745 3296 1290 -1867 -760 1739 558 -2067 -1262 1673 2176 -249 -1492 -307 536 58
$$ packed form
2244A705K528k802l192l23J933J868l89k518J65M150M18o707l232P781P058n863
2260B580r263K816R239j089q646P0Q673J880p928m540N176N664j655m701n80L302
2276I98J675k814l299J920N456N85o042l813M251N037k142m017J675L067k502
2291C5l592K185M372o82l567j20J781r24j181K088K088j890k822P19K514j91j920
2308a107j62K107J221j907l289M0M473K884l679n035K022N667q99o270L25P614
2324D005J489q664m758P617P715m598q710J354Q071R23p054k764O078M791m221
2339A274o508J333O889J663n804l706M387M994l079o000J298O749J134o079l334
2354d789M044M041k006l157J107K499j181k625Q05K935N03k425j243J185Q43m78
$$ plain form
2370 58 -69 1138 1196 -754 -1960 204 2635 1071 -2240 -1367 2713 2783 -2242 -3921 1470 5337 940
2387 940 -4913 -2219 4255 3373 -3273 -3829 3199 5638 -1383 -6657 -1189 6576 4471 -4009 -5484 1759
2403 1759 5529 173 -4722 -1023 4930 2816 -4136 -4420 2616 5629 -133 -5112 -1552 4284 2700
2418 2700 -3189 -3442 2156 4142 -527 -4054 -1173 2717 1629 -1468 -1279 1094 778 -1643 -1626 1213
2434 1213 2008 -335 -1984 -760 702 -24 -669 596 1262 -1018 -2812 -577 2895 1520 -2713 -2668
2450 -2668 1777 2896 -1543 -4129 168 4315 1151 -4314 -3035 2881 3402 -2162 -4336 864 4721
2465 4721 295 -5407 -2996 4144 4911 -2023 -5825 -658 4819 2002 -4034 -2854 3231 3796 -2579
2480 -2579 -4961 931 5473 1101 -4774 -2678 3453 3429 -1850 -3443 815 3419 539 -2594 -1265
$$ packed form
2370E8j27J207N8j950j206K164K431j564l311Q73M080P0n025j679N391L867m397
2387I40n853K694O474q82o646n56P028K439p021n274N468P765k105q480j475P243
2403A759L770n356m895L699N953k114o952k84P036L013n762m979L560N836j584
2418B700n889k53N598J986m669l527K881L890j088l097J89K373l16k421J7K839
2434A213P95k343j649J224J462p26o45J265O66k280j794K235L472j375m233M5
2450b668M445J119m439k586M297M147l164n465J279N916N21n564k174N200L857
2465D721m426n702K411P140P67o934l802N167N477k817o036J180O085N65o375
2480b579k382N892M542m372n875K096O131k4n279j593M258K604k880l133J329
$$ plain form
2495 -1265 1844 1767 -544 -1202 525 1266 -233 -1037 403 1751 567 -1173 -552 1155 730 -559 382
2512 382 1719 1 -2414 -544 3294 2448 -2248 -2844 1677 3527 -401 -3155 53 3576 1311 -3042
2528 -3042 -2299 2237 3558 -402 -3509 -845 3517 2479 -2915 -3788 1955 5333 37 -5742 -2240
2543 -2240 4855 3742 -3277 -4111 2115 3853 -1768 -4463 432 4640 1343 -3835 -3129 1433 2895
2558 2895 107 -2297 -1247 1299 1185 -1516 -2366 490 2646 266 -2737 -1450 1455 670 -1707 -625
2574 -625 1814 402 -2348 -1421 1211 653 -1119 174 1628 -909 -3415 -720 3099 1751 -2080 -2139
2590 -2139 608 1074 -725 -1305 288 1631 966 -1346 -2810 -601 3001 2208 -2383 -2950 2069 3510
2606 3510 -2215 -4963 1348 6275 1081 -5539 -2884 3689 3081 -2068 -2197 2059 2708 -1149 -3137 -682
$$ packed form
2495a265L109p7k311o58J727P41j499q04J440J348j184j740O21J707m25j289R41
2512C82J337j718k415J870L838q46m696n96M521J850l928k754L208L523k265m353
2528c042P43M536J321l960l107K664M362j038n394q73N743L378n296n779L502
2543b240P095j113p019q34O226J738n621k695M895M208l297n178P06M562J462
2558B895k788k404J050K546j14k701q50K856K156k380l003J287K905p85k377J082
2574f25K439j412k750R27K632n58j772J293J454k537k506K695L819j348l831n9
2590b139K747M66j799n80J593J343o65k312j464K209L602p93m591n67N019J441
2606C510n725k748O311M927n194o620K655O573o08n149j29M256O49l857j988K455
$$ plain form
2622 -682 2699 3098 80 -2913 -1531 2349 2548 -1707 -2379 2468 4005 -1431 -4543 177 4317 1112
2638 1112 -2487 38 2666 -404 -2965 218 3120 1072 -1238 8 589 -1438 -1189 2089 2536 -447
2654 -447 -1824 -132 514 -279 190 1047 285 -160 547 -508 -2477 -302 3812 2228 -3337 -2802 2752
2671 2752 2442 -3594 -3245 4034 5017 -2815 -6032 47 4388 904 -2651 -688 1823 406 -1864 -1970
2687 -1970 -197 2212 2631 -897 -4196 -1463 3369 1615 -3747 -1787 4297 2713 -5005 -4964 2887 4735
2703 4735 -1343 -3403 996 1765 -2433 -2765 1830 2781 -545 -1449 -144 -878 -1649 784 2517 176
2719 176 -1862 -421 330 -1405 -819 1991 1688 -1293 -1080 928 -1023 -2739 1353 4909 377 -4881
2735 -4881 -1363 3800 617 -4011 112 5763 1572 -5645 -3576 3336 3764 -715 -1531 760 837 -684
$$ packed form
2622f82L381L99l018k993J382L880J99m255o72M847J537n436l112M720M140l205
2638A112l599K525K628l070k561L183K902k048k310J246N81k027K49L278M47k983
2654d47j377J692O46p93M69Q57p62m45P07j055j969K175M114j584n565N35N554
2671B752l10o036L49P279R83p832l217O079M341l484l555J963K511j417k270j06
2687a970J773K409M19l528l299K733M832j754n362J960O084j584p718M1P851J848
2703D735o078k060M399P69m198l32M595R51l326r04J305p34p71K433J733k341
2719A76k038J441P51j735N86K810l03k981K13K008j951j716M092L556m532n258
2735d881L518N163l183m628M123N651m191p217K069O912M28m479q16K291P7j521
$$ plain form
2751 -684 -1129 -520 831 3154 2301 -2849 -4653 1090 5141 252 -4027 815 5117 -689 -6599 -1065
2767 -1065 6590 3527 -3540 -2741 1930 892 -2230 -167 3058 1634 -1204 -1267 -814 -958 917 3077
2783 3077 1036 -2171 -1104 1000 -535 -1587 1718 3483 -431 -3329 -381 1491 -1093 -1100 3449 3085
2799 3085 -3366 -4836 1534 3918 -1037 -2659 2325 3332 -2896 -5157 572 4464 1447 -2026 -1456
2814 -1456 -91 -261 -302 -158 -236 1082 2316 -817 -4821 -2169 4391 3662 -3070 -3616 2569 2722 -3820
2831 -3820 -4309 3072 5472 -1072 -5007 -1082 2347 315 -1279 513 1321 -443 -1336 -1019 -623 454
2847 454 2050 1045 -1950 -1898 888 909 -1339 -374 2474 1012 -2615 -1723 1733 956 -1565 510 3066
2864 3066 -246 -4050 -917 3904 1676 -2907 -1141 3057 1196 -3191 -1846 2780 2872 -741 -2015
$$ packed form
2751f84m45O09J351K323q53n150j804N743M051m889m279M842M302n806n910N534
2767a065P655l063p067P99M671j038l122K063L225j424k838o3M53j44J875K160
2783C077k041l207J067K104j535j052L305J765l914k898K948J872k584pM549l64
2799C085o451j470O370K384m955j622M984J007o228k261N729L892l017l473N70
2814a456J365j70m1J44p8J318J234l133m004K652O560p29o732n46O185J53o542
2831c820m89P381K400o544l935L925L429k032j594J792Q08j764q93L17L96J077
2847D54J596j005k995N2K786K1k248R65K848j462l627Q92L456p77k521K075K556
2864C066l312l804L133M821k228m583J766M198j861m387J345M626R2l613j274
$$ plain form
2879 -2015 -198 1223 848 -181 -1029 -10 2307 1662 -2324 -3132 1745 4389 -70 -3968 -227 4011
2895 4011 816 -3992 -1279 4063 2709 -2631 -2760 1224 2398 -117 -1305 0 1086 732 -318
2910 -318 -1171 -591 1293 1660 -500 -1689 193 1333 -470 -1453 807 1961 -383 -1907 -55 1045
2926 1045 -589 -763 1584 1320 -2054 -2363 1357 2400 -1111 -2403 926 2417 -916 -3101 -468 2505
2942 2505 1226 -1609 -1791 199 1138 -57 -1528 -927 1535 2042 -1226 -3670 -902 3361 2137 -2604
2958 -2604 -2865 1512 2488 -1597 -3141 855 3423 281 -3384 -1898 1715 1921 -709 -1734 -67 1330
2974 1330 433 -1596 -1493 954 2212 190 -1943 -1044 1033 842 -671 -279 1202 445 -1468 -907 1043
2991 1043 1010 -293 64 821 -426 -1613 198 2396 1043 -1783 -1353 1570 1690 -1055 -1608 1059 2449
$$ packed form
2879b015J817J421l75j029q48J019K317o45l986q08M877K644m459l898L741M238
2895D011l195m808K713N342j354n340j29L984J174k515j188J305J086l54j050
2910c18q53N80J884L67k160j189J882J140j803r83K260J154k344j524J852J100
2926A045j634j74K347k64l374l09L720J043l511j292L329J491l333k185K633K973
2942B505j279k835j82J990R39j195j471O01K462N07l268k444K768M263j224m741
2958b604k61M377R76m085j544L996K568l142l665J486L613K06k630j025J667J397
2974A330q97k029J03K447J258k022k133Q99K077j91j513L92J481p57j913N61J950
2991A043l3j303L57P57j247j187J811K198j353k826M30K923J20k745n53K667J390
$$ plain form
3008 2449 266 -2228 -1122 1746 2102 -388 -1787 116 2263 746 -2202 -1484 2295 3130 -774 -3404
3024 -3404 -582 3210 1877 -1890 -1907 1432 2133 -698 -2269 234 2613 1078 -1890 -1921 1013 2225
3040 2225 175 -1927 -686 1656 1176 -1280 -1628 696 1660 65 -1364 -435 626 104 -590 120 695
3057 695 -290 -1038 -302 534 -54 -513 304 650 -845 -1753 -40 1896 731 -1983 -1848 803 1707 -471
3075 -471 -2131 -391 1816 779 -2016 -2035 1030 2182 -390 -2644 -821 2194 1141 -2229 -2256 1287
3091 1287 2839 -331 -3285 -1445 2268 2122 -1251 -2361 226 2009 56 -2093 -728 1989 1529
3106 1529 -1538 -2398 328 2588 819 -1855 -1343 1300 1564 -643 -1414 382 1528 272 -977 -306
3122 -306 667 265 -319 219 739 -20 -652 -1 697 236 -251 417 926 -209 -1280 -159 1841 1602 -934
$$ packed form
3008B449k183k494J106K868L56k490j399J903K147j517k948P18L779Q35l904k630
3024c404K822L792j333l767j7L339P01k831j571K503K379j535k968l1K934J212
3040B225k050k102J241K342m80k456l48K324R64j595j429R29J061n22o94P10N75
3057F95r85p48P36Q36n88m59Q17L46j495r08J713J936j165k714J35K651R04k178
3075d71j660J740K207j037k795j9L065J152k572k254J823L015j053l370k7L543
3091A287J552l170k954J840L713j46l373j110K587J783j953k149J365K717m60
3106A529l067q60K726K260j769k674N12K643K64k207p71J796J146j256j249O71
3122c06R73m02n84N38N20p59o32O51O98m61m87O68N09j135j071J121K000k39k536
$$ plain form
3141 -934 -1991 131 2267 1048 -1651 -1202 1618 2028 -930 -2374 537 2983 763 -2729 -1444 2455
3157 2455 2382 -1571 -2834 703 3223 764 -2781 -1822 1788 2575 -466 -2430 -432 2067 1025 -1881
3173 -1881 -1697 1575 2365 -902 -3083 -343 2779 1196 -2282 -1901 1276 1711 -865 -1646 211 1065
3189 1065 -235 -1109 -59 648 -151 -821 -336 336 42 -548 -382 61 138 -393 -502 217 539 -547 -1365
3208 -1365 72 1768 241 -2494 -1519 2159 2384 -1786 -3146 834 2910 -307 -3088 -274 3083
3223 3083 842 -3035 -2060 2074 2804 -716 -2813 -735 2176 1572 -1439 -2270 597 2895 631 -3037
3239 -3037 -1710 2551 2508 -1668 -2660 1429 2977 -872 -3228 242 3447 1142 -2313 -1552 1151 1409
3255 1409 -173 -337 549 485 -224 -506 -110 872 1068 150 -834 -120 1024 212 -898 362 1991 283
$$ packed form
3141i34j057K122K136j219k699M49K820M10k958j444K911K446k220l492J285L899
3157B455p3l953j263L537K520k459l545R59L610P87l041j964J998K499j042k906
3173a881J84L272P90l267k181K740L122j583l478L81L177M35k576p81J857Q54
3189A065j300q74J050P07p99o70M85O72k94n90J66M43P7n31j09P19L22j086q18
3208a365J437J696j527k735R75L678K25m170j360L980K076l217k781K814L357
3223C083k241l877R75M134P30l520k097K078K911o04l011q31K867K298k264l668
3239c037J327M261m3m176r92M089J548l849k356L470L205k305l455P61K703K58
3255A409j582j64Q86o4p09k82L96R82J96r18r84P14J144q12j110J260J629j708
$$ plain form
3273 283 -2085 -495 2246 727 -2266 -386 3366 1475 -3562 -2638 2933 3580 -1282 -3055 717 2558
3289 2558 -465 -2527 -116 2750 1584 -1673 -2656 -188 2594 1601 -1884 -2388 1430 3084 -1195 -4276
3305 -4276 -157 4642 1617 -4049 -2677 2730 2322 -2620 -2494 2244 2977 -1543 -3516 -424 2242 1202
3321 1202 -851 -1121 -302 304 -47 -930 -672 1132 1380 -1101 -2334 68 1785 -401 -1901 781 2386
3338 2386 -1087 -3488 -17 3150 178 -2767 111 2816 -619 -4042 -523 4065 1936 -2862 -2407
3353 -2407 1353 1706 -996 -1465 668 2030 687 -1874 -2440 352 3166 1275 -2685 -1831 2704 2291
3369 2291 -3113 -3556 2899 5271 -1066 -5187 -488 4092 1061 -2880 -463 3310 1335 -2805 -2345
3384 -2345 1248 2690 998 -990 -1251 123 1226 194 -1279 167 2799 1370 -2696 -2448 1902
$$ packed form
3273B83k368J590K741j519k993J880L752j891n037R24N571O47m862j773L772J841
3289B558l023k062K411K866j166l257r83K468K782r93l485n04L818J654m279l081
3305d276M119M799l025n666J372N407m08m942J26M738P33m520j973L092K666j040
3321A202k053k70Q19O06l51q83K58J804K48k481j233K402J717k186j500K682J605
3338B386l473k401L471L167k972k945K878K705l435l423L519M588k129m798M55
3353b407L760L53k702m69K133J362j343k561n66K792K814j891l960Q54M535m13
3369B291n404m43O455K372o337m121M699M580l031l941K417L773j975m140M60
3384b345L593J442j692j988k61J374J103j032j473J446K632j429m066K48M350
$$ plain form
3399 1902 2622 -1019 -1489 2131 1958 -2726 -3074 2107 3698 -494 -2449 730 1774 -1633 -2427 1577
3415 1577 3504 117 -2743 -1367 1049 1035 -239 -515 409 1180 195 -2228 -2433 1419 3868 265 -3842
3432 -3842 -1289 3134 818 -3936 -1413 4622 3044 -4035 -4776 1600 4018 -407 -2868 267 2224
3447 2224 -497 -2849 -1182 1793 2360 168 -2270 -2116 650 1827 -535 -1992 766 2911 -693
3462 -693 -4306 -1223 3691 2031 -2595 -1618 2037 615 -3098 -1428 3109 2435 -1952 -2431 627 1011
3478 1011 -933 -679 1461 1371 -865 -1825 -768 767 1407 474 -945 -624 1089 503 -2046 -1371 2820
3495 2820 3374 -1787 -4113 593 3867 -118 -3394 476 4370 390 -4556 -1952 3656 3134 -1482
3510 -1482 -2410 659 1847 -123 -1516 -313 1831 2153 -405 -2831 -1129 2616 2432 -1720 -2152 1917
$$ packed form
3399A902P20l641m70L620j73m684l48N181J591m192j955L179J044l407p94M004
3415A577J927l387k860J376K416j4j274k76R24P71r85k423k05L852K449l603m107
3432c842K553M423k316m754K523O035j578p079p41O376K418m425k461L135J957
3447B224k721k352J667K975N67k192k438J54K766J177k362j457K758K145l604
3462f93l613L083M914j660m626R77L655j422l713J670M537o74m387m79L058L84
3478A011j944K54K140r0k236r60J057J535O40r33j419L21J713n86k549O75M191
3495B820N54n161k326M706L274l985l276L870L894l980m946K604N608n22m616
3510a482r28L069J188j970j393J203K144L22k558k426J702L745j84m152m32M069
$$ plain form
3526 1917 2780 -1873 -3672 1253 4405 515 -3469 -883 2548 600 -2177 -330 2494 1091 -1836
3541 -1836 -1598 577 1196 178 -340 -40 268 82 -708 -952 517 1749 210 -1881 -843 1614 501
3558 501 -2242 -792 2886 1702 -3040 -2873 2037 2917 -1533 -2917 1238 2794 -1179 -3533 -217 3020
3574 3020 1275 -2111 -2026 681 1575 -182 -1858 -832 1744 1734 -1550 -3194 33 3336 879 -3146
3590 -3146 -1629 2799 1852 -3032 -2875 2320 3537 -1212 -3643 -96 2756 497 -2123 -757 1797
3605 1797 1155 -1343 -1713 297 1798 640 -1330 -979 1046 1181 -982 -1652 921 2317 -359 -2429
3621 -2429 -90 2285 340 -2049 42 2702 626 -2722 -1222 2607 2005 -1643 -1827 1449 2092 -844
3637 -844 -2144 489 2500 799 -1814 -1466 1302 2116 -229 -2172 -267 2552 1528 -2293 -2362 1863
$$ packed form
3526A917Q63m653j799M925L152l890l984K586L431j948k777J847K824j403k927
3541a836K38K175O19j018n18L00L08j86p90k44J469J232j539k091J038K457j113
3558E01k743J450L678j184m742J67M910Q80m450j384M155J556l973k354L316L237
3574C020j745l386Q5K707Q94j757j676J026K576j0l284j644L227L303k457m025
3590c146J517M428r47m884J57N195J217m749k431L547K852k259k620J366K554
3605A797o42k498l70K010J501j158j970L51K025J35k163o70K573J396k676k070
3621b429K339K375j945k389K091K660k076l348J500L829o02l648j84L276O43k936
3637h44j300K633K011j701k613L48K768Q14k345j943J905K819j024l821o9M225
$$ plain form
3653 1863 3449 -551 -3338 -212 3332 1051 -2959 -1594 2818 2566 -1850 -2990 846 3145 414
3668 414 -2581 -1206 2002 1730 -1402 -2210 744 2478 149 -2460 -870 2060 1284 -1853 -1727 1494
3684 1494 1975 -1270 -2339 613 2138 -279 -2191 -102 1768 -1 -2117 -535 1848 794 -1898
3699 -1898 -1451 1313 1625 -1016 -2044 148 1899 181 -2113 -1078 1606 1512 -1481 -2412 614 2600
3715 2600 57 -2934 -1262 2538 1984 -2085 -2921 1048 3064 -203 -3265 -892 2823 1587 -2377
3730 -2377 -2422 1611 2943 -620 -3207 -462 2965 1547 -2416 -2319 1602 2856 -669 -2811 15 2708
3746 2708 736 -2413 -1205 2281 1872 -1542 -1966 1087 2309 -283 -1901 132 2022 448 -1501
3761 -1501 -391 1633 877 -1247 -862 1344 1458 -907 -1615 769 2118 182 -1841 -565 1925 1291
$$ packed form
3653A863J586m000k787L126L544k281m010J365M412k52m416j140L836K299k731
3668D14k995J375L208k72l132q08K954J734k329k609J590K930p76l137J26L221
3684A494M81l245j069K952J525k417j912K089J870j769k116J582K383j054k692
3699a898M47K764L12k641j028K192J751j718k294J035K684r4k993r31L026J986
3715B600k543k991J672L800n54m069q36L969K016l267l062K373L715j236l964
3730b377m5M033J332l563k587K745L427j418l963R7L921J254l525k142K826K693
3746B708j972l149J208L486m09l414m24L053J222k592j618K033J890j574j949
3761a501J110K024p56k124L85K206J14k365p08K384J349j936k023J276K490o34
$$ plain form
3777 1291 -1397 -1479 1364 2183 -720 -2500 211 3024 987 -2609 -1775 2069 2639 -1144 -2877 285
3793 285 3035 683 -2715 -1698 2226 2317 -1486 -2798 489 2952 418 -2914 -1505 2452 2310 -1712
3809 -1712 -2960 675 2781 120 -2668 -870 2179 1033 -1971 -1627 1453 1786 -1095 -2163 158
3824 158 1866 130 -1712 -686 1179 561 -1195 -928 844 910 -956 -1387 441 1416 -327 -1936 -279
3841 -279 1869 650 -1991 -1387 1552 1656 -1339 -2208 764 2357 -436 -2771 -475 2690 1340 -2360
3857 -2360 -2192 1408 2664 -339 -2547 -560 2256 1290 -1900 -1941 1407 2722 -376 -2881 -590 2868
3873 2868 1627 -2181 -2071 1787 2797 -793 -2853 166 2819 912 -1927 -1163 1468 1395 -887 -1254
3889 -1254 862 1801 -47 -1615 -544 1466 1317 -548 -1001 423 1017 -286 -1102 559 1694 -52
$$ packed form
3777A291k688q2K843Q19k903j780K711K813k037l596Q34L844N70l783j733L162
3793B85K750k352l398J017L924R1l803j312L287K463k534l332J409L957j42m022
3809a712j248L635K106k661k788J798L049j146l004L44L080L33k881j068K321
3824A58J708j736j842J026J865o18j756K67J772O6j866m31J828R75j743j609J657
3841b79K148j219k641O04K939J04k995q69K972J593k793k335K296L165j350l700
3857b360J68L600J256l003k208J987K816r66l190m1L348J315l098k505K291L458
3873B868j241l808J10L858J010l590k060L019K653j907k839P64K631p3k282l67
3889a254K116R39j848j568J071K010j49j865m53J424N94j303q16J661J135j746
$$ plain form
3905 -52 -1721 -149 1832 504 -1774 -498 2158 1254 -1963 -1711 1544 2060 -816 -1836 629 1909
3921 1909 -277 -2227 -538 2138 1701 -1227 -2331 -136 2096 994 -1679 -1479 1344 1879 -1314 -2894
3937 -2894 375 3143 618 -2951 -1567 2242 1637 -2026 -2273 1259 2424 -539 -2618 -891 1461
3952 1461 1073 -802 -1174 97 930 -293 -1415 -512 1522 1211 -1317 -1976 425 1645 -406 -1657
3968 -1657 348 1678 -409 -2030 -49 1875 -32 -1855 -5 1957 -54 -2302 -658 1994 1177
3983 1177 -1283 -1122 768 870 -690 -991 375 1409 631 -1177 -1553 307 2085 745 -1892 -1085
3999 -1085 2018 1781 -1896 -2387 1611 3215 -486 -2834 -41 2649 567 -2270 -605 2249 1548 -1249
4015 -1249 -1790 113 1561 1103 -345 -1033 58 1229 271 -1447 -401 2111 1483 -1711 -1822 1301
$$ packed form
3905e2j669J572J981j328k278J276K656r04l217K52L255N16k876j020K465J280
3921A909k186j950J689K676m37k928j104K195K232j102k673K00K823N35l193j580
3937b894L269K768k525l569J384L809o05l663k47L532J165k963k079J727K352
3952A461l88j875l72J271Q33j223j122R03K034l11k528o59K401J220k051j251
3968a657K005J330k087j621J981J924j907j823J850J962k011k248J644K652q17
3983A177k460J61J890J02j560l01J366J034p78j808l76J860J778j340k637Q07
3999a085L103k37l677m91L998J604l701k348K793K690k082k837J665K854p01k797
4015a249n41J903J448m58j448o88J091J171r58j718J046K512o28l194j11L123
$$ plain form
4031 1301 1960 -938 -1651 1402 1988 -1075 -2188 628 1935 -261 -1147 789 1179 -1109 -1752 700
4047 700 1891 289 -1072 -514 184 8 -99 66 276 710 416 -1181 -1790 436 2349 331 -2349
4064 -2349 -678 2157 485 -3036 -1308 3069 2341 -2233 -2927 707 1862 -576 -1421 528 1456 -395
4080 -395 -1793 -1105 460 1496 1019 -1016 -2039 -160 1572 -17 -1777 163 2524 256 -3137 -1512
4096 -1512 2400 1673 -1605 -1128 1599 637 -2233 -1326 1756 1757 -654 -940 181 -182 -1011 148 1457
4113 1457 758 -615 -736 -490 -361 571 1060 134 -674 282 466 -1195 -1237 1682 2490 -715 -2572 358
4131 358 2219 -389 -2213 880 3189 217 -2990 -1193 2020 1563 -598 -518 605 370 -544 -520 -45
4148 -45 897 1540 459 -1733 -1519 1399 2008 -751 -1591 1317 2182 -1204 -2732 570 2961 487 -1931
$$ packed form
4031A301O59k898p13L053N86l063j113K816J307k196q86J936L90k288o43K452
4047G00J191j602j361N58O98j76j07J65K10M34k94j597o09K226J913k018k680
4064b349J671K835j672l521J728M377p28m574o94L634J155k438q45J949R28j851
4080c95j398O88J565J036m77k035j023J879J732j589j760J940K361k268l393J625
4096a512L912p27l278M77K727r62k870R07L082Jk411k86J121l63q29J159J309
4113A457o99j373j21K46J29R32M89r26q08R56J84j661m2K919Q08l205j857K930
4131C58J861k608j824L093K309k972l207J797L213m57k161Q0J123k35r14K4M75
4148d5R42O43j081k192K14K918O09k759q40K908Q65l386j528L302K391k474k418
$$ plain form
4165 -1931 -233 1461 -197 -1585 211 1726 577 -961 -615 13 -147 165 738 307 -492 -216 -109
4182 -109 -594 -210 1005 700 -942 -875 741 333 -1380 -604 1904 1071 -1937 -1700 1210 1355 -1323 -1348
4200 -1348 1286 1528 -1315 -2186 244 1618 301 -894 -618 41 184 -150 -516 -430 659 1141 -558
4217 -558 -1952 -278 1867 640 -1885 -879 1789 971 -1989 -1587 1521 1846 -797 -1570 250 943
4233 943 -361 -692 411 753 26 -510 -509 -166 342 661 80 -583 -80 532 -69 -695 225 1078 141 -936
4253 -936 -99 950 -133 -932 464 1609 0 -1578 -288 1427 590 -993 -155 1321 536 -1128
4269 -1128 -715 869 1232 71 -662 -285 469 618 11 -586 53 1245 671 -1192 -1146 1053 1636 -391
4287 -391 -1474 381 1603 -207 -1715 -153 1763 849 -1153 -1071 494 814 -183 -537 141 496 85
$$ packed form
4165a931J698J694j658j388J796J515j149j538L46O28j60L12N73m31p99K76J07
4182a09m85L84J215l05j642O7J616m08j713P76K508q33l008K37K910J45k678k5
4200a348K634K42k843q71K430J374j317j195K76O59J43l34l66Q6J089M82j699
4217e58j394J674K145j227k525J006K668q18k960M02L108L25k643p73J820O93
4233I43j304l31J103L42p27n36JL43N08L19n81o63N03O12o01o26R20Q53r37j077
4253i36Q37J049j083p99J396J145j609j578J290J715q37j583Q38J476p85j664
4269a128M13J584L63j161p33L77P54J49o07n97O39J192n74j863M6K199N83k027
4287c91j083J855J222j810j508J562J916r14k002Q2J565L20r97l54O78L55m11
$$ plain form
4304 85 -495 -589 94 752 304 -681 -645 308 432 -472 -613 448 704 -509 -919 74 471 -310 -479 436
4324 436 509 -625 -961 271 836 -82 -805 -100 493 -173 -739 -155 618 431 -462 -830 -161 621 318 -622
4344 -622 -735 358 835 -310 -1240 -159 1276 561 -1174 -972 769 903 -677 -1130 445 1201 -89
4361 -89 -1221 -422 917 784 -331 -679 9 637 204 -462 -350 509 644 -277 -747 50 863 345 -532
4380 -532 -268 605 495 -293 -349 447 583 -41 -246 249 294 -75 -37 393 413 -182 -301 289 601 143 -294
4401 -294 -49 480 253 -347 -265 512 742 -89 -798 -153 928 602 -677 -774 566 1032 -273 -1088 -72
4420 -72 1224 519 -999 -632 780 861 -395 -965 100 954 168 -930 -620 580 789 -206 -1002 -362
4438 -362 570 420 -536 -564 265 498 -337 -897 -64 667 167 -701 -545 245 193 -273 -269 153 129 -242 -325 18
$$ packed form
4304H5n80r4O83O58m48r85L6R53J24r04j41J061K56j213m10R93L97p81j69R15
4324D36P3j134l36J232N65r18p23P05N93o66n66N84P73j87q93l68O69P82l03r40
4344f22j13J093M77j145r30J081J435p15j735K02J741J34j580m53J575P56j290
4361h9j132P99J339j33j115l48O88O28m33o66J12Q59J35r21m70P97Q13n18q77
4380e32K64Q73j10p88n6P96J36o24k05M95M5l69L8M30K0n95j19N90L12m58m37
4401b94K45N29k27o00Q2P77K30q31p09O45J081l26j279r7J340M66j305q15J016
4420g2J296p05j518L67J412Q1j256n70J065Q54p86j098L10J200K09r95p96O40
4438c62R32j50r56k8Q29K33q35n60Q33P31n00q68J56P90n2m66MM22k4l71q3L43
$$ plain form
4460 18 7 -264 -217 166 158 -400 -554 -1 389 45 -598 -369 340 312 -489 -541 385 864 -257 -1198 -354 1074
4482 1074 742 -912 -947 526 963 -374 -1144 17 1108 432 -912 -681 654 883 -113 -866 -65 863
4500 863 497 -624 -752 425 1074 236 -896 -411 778 729 -372 -562 424 672 -208 -643 161 779 325
4519 325 -341 -227 304 288 72 142 230 80 63 201 218 90 -56 26 189 263 12 -313 55 580 341 -540
4541 -540 -509 579 812 -406 -891 399 1241 -178 -1378 -320 1341 763 -1001 -1039 484 959 -267
4558 -267 -900 -95 728 332 -765 -789 263 895 158 -1046 -797 648 904 -536 -1153 212 1048 -76
4576 -76 -1316 -457 856 444 -696 -518 296 161 -549 -322 226 276 -139 -298 -293 -329 48 355 121 -282 -363
4597 -363 -146 -164 18 407 107 -472 -332 400 128 -762 -258 1103 695 -1113 -1133 768 1257 -526 -1108
$$ packed form
4460A8j1k71M7L83qn58j54N53L90l44o43K29P09k8q01n2R26M79j121r41Q44J428
4482A074l32j654l5J473M37j337p70J161J091o76j344K31J335K29r96p53Q01R28
4500H63l66j121j28J177O49q38j132M85J189m9j101j90R86K48q80m35Q04O18m54
4519C25o66J14N31j6k16P0Q8j50j7J38J7j28j46Q2J63P4k51l25L68N25k39q81
4541e40L1J088K33j218m85J290Q42j419j200J058J661n78j764l8J523M75j226
4558b67o33Q05Q23l96j097k4J052O32p37j204K49J445K56j440o17J365Q36j124
4576g6j240Q59J313m12j140J78Q14j35p10K27N48N0m15j59Nl6L77L07k34m03q1
4597c63K17j8J82L89l00n79J40P32k72q90N04J361m08j808k0J901M89j783n82
$$ plain form
4616 -1108 699 1317 -407 -1599 -193 1401 884 -547 -862 -2 580 324 -253 -346 558 854 -328 -1387
4634 -1387 -167 1691 1009 -1099 -948 930 1056 -758 -970 843 1381 -189 -1010 -63 630 162 50
4651 50 499 314 -303 -138 122 -31 118 733 486 -618 -708 273 512 -64 62 553 -30 -868 -150 897
4671 897 168 -803 136 1189 -59 -1634 -449 1474 724 -1116 -711 907 513 -1101 -850 681 1112
4688 1112 14 -892 -732 80 734 375 -693 -641 636 734 -968 -1471 616 1744 -208 -1838 -305
4705 -305 1421 136 -1532 -470 1305 613 -1069 -926 207 234 -79 139 175 -338 -393 32 -140 -407 275
4724 275 880 -198 -1137 -265 728 45 -654 250 816 -360 -1046 207 822 -347 -670 793 1074 -777
4742 -777 -1575 413 1476 210 -894 27 740 -138 -849 -60 945 825 6 -701 -738 333 1131 410
$$ packed form
4616a108J807O18j724j192J406J594n17j431l15Q60N82k56n77r3R04K96j182j059
4634a387J220J858o82k108J51J878J26j814k12J813N38j570q21R47O93m68j12
4651E0M49j85o17J65K60j53J49O15k47j104r0R81K39n76J26M91n83q38P18J047
4671H97p29r71R39J053j248j575J185J923p50j840M05J618l94j614K51J531M31
4688A112j098r06J60Q12O54l59j068N2J277R8j702n03K087J128j952j630J533
4705c05J726j285j668J062J775o92j682J43J133K7l13K18L6n13n5M25j72k67O82
4724B75O05j078r39Q72R93o83o99R04N66j176o86J253O15j169l23J463K81j851
4742g77p98J988J063j266j104R21P13q78p11P89J005j20q19p07l7J071P98p21
$$ plain form
4760 410 -821 -236 1236 497 -1556 -881 1694 1759 -843 -1478 514 1277 -432 -1003 736 1499 14
4777 14 -1251 -514 436 583 505 324 -274 -554 160 286 -274 7 1046 632 -993 -1069 584 985 -208
4796 -208 -437 759 414 -1066 -902 849 934 -370 -336 588 20 -1285 -618 1148 1089 -456 -891 -202 96
4815 96 -162 36 321 293 107 -336 -930 -628 702 1318 -271 -1522 -179 1053 -134 -1644 -13 1926
4833 1926 512 -1905 -1343 940 1016 -594 -636 591 447 -806 -944 -61 608 636 136 -725 -924 -72 729
4852 729 27 -622 186 908 -234 -1473 -231 1319 614 -805 -303 697 -25 -1095 -123 1159 486
4869 486 -646 -362 326 -116 -414 259 924 226 -583 -363 146 282 401 336 -185 -149 354 146 -618 -210
4889 -210 1166 1015 -856 -1161 758 1331 -459 -1152 683 1669 -230 -1628 -257 1427 792 -661 -496
$$ packed form
4760D10j231N85J472p39k053O75K575O5k602o35J992P63j709n71J739P63j485
4777A4j265P37R50J47p8j81n98k80P14J26n60K81J039m14j625p6J653M01j193
4796b08k29J196l45j480J64J751Q5j304L4R24n68j305O67J766n9j545m35O89K98
4815I6k58J98K85k8j86m43n94L02J330O16j589j251J343J232j187j510J631J939
4833A926j414k417N62K283P6j610m2J227j44j253j38Q83O69K8n00q61j99Q52Q01
4852G29p02o49Q08P22j142j239J242J550p05j419N02J000p22j070R72J282o73
4869D86j132K84O88m42k98O73O65o98q09K20N09J36J19o5n21L6N03k08p64M08
4889b10J376j51j871l05J919N73j790o93J835R86j899j398J371J684o35j453J65
$$ plain form
4906 -496 532 529 -250 -466 38 636 626 -164 -906 -230 946 593 -847 -611 851 967 -777 -1149 575
4925 575 1279 -194 -993 170 872 -219 -816 129 774 91 -604 -241 140 47 -162 52 81 -39 -139 -224
4945 -224 -245 11 409 -59 -631 -147 601 -65 -986 -173 962 356 -1203 -799 832 653 -877 -853 760
4964 760 891 -699 -1285 69 1028 232 -867 -538 376 397 -258 -773 -86 797 453 -680 -902 348 999
4983 999 -85 -1057 -123 1152 240 -1176 -579 1014 836 -621 -815 348 668 -254 -502 218 631 73
5001 73 -464 -245 315 342 200 -168 -53 289 194 -220 -220 452 600 -227 -540 239 703 -197 -610 317 871 -35
5023 -35 -932 -136 978 464 -687 -394 665 517 -513 -602 480 967 73 -753 -339 692 622 -372 -718
5042 -718 222 909 98 -983 -397 884 770 -672 -928 442 957 -182 -977 -53 1065 338 -886 -644
$$ packed form
4906d96J028lp79k16N04N98j0p90p42O76J176l53j440K36J462J16j744l72J724
4925E75P04j473p99J163P02j091n97R45O45o83o95L63L81r3k09K14K9j20j00q5
4945b24k1K56L98m68n72M84P48o66r21Q13J135o06j559M04J631j79j530K4J613
4964G60J31j590n86J354R59p96j099L29R14K1o55n15O87Q83l44j133k22J250O51
4983I99j084r72R34J275r12j416N97J593j78j457j94J163L20r22k48P20M13n58
5001G3n37K19N60K7j42l68J15L42r5m14%O72J48q27l13P79M64r00m13R27N54r06
5023c5q97P96J114n14j151K93J059j48j030q9J082M87q94q26M14J031p0r94l46
5042g18R40O87q11j081N86J281j14j442k56J370N15j139p95R24J118p27j224K42
$$ plain form
5060 -644 533 679 -318 -641 3 459 -14 -527 -327 306 350 -297 -661 -101 450 159 -537 -331 318 237
5080 237 -441 -590 267 419 -379 -586 31 399 -190 -598 31 596 -80 -665 -323 397 343 -351 -514 264
5100 264 454 -188 -691 -81 671 283 -661 -661 421 776 -280 -901 5 918 254 -884 -437 751 696 -546
5120 -546 -817 318 872 43 -728 -165 733 508 -425 -566 284 710 67 -512 -224 446 461 -255 -357 296
5140 296 592 111 -522 -136 617 458 -286 -322 308 495 -115 -263 247 523 69 -309 62 387 153 -234
5160 -234 -37 376 247 -221 -253 289 418 15 -374 -21 453 163 -414 -289 551 515 -481 -693 245 820 -39
5181 -39 -726 -127 638 291 -691 -543 469 637 -267 -764 -82 597 211 -555 -539 195 550 -70 -741 -309
5201 -309 509 408 -502 -697 125 595 -235 -722 -119 561 129 -615 -458 327 373 -245 -464 -48 216 13
$$ packed form
5060f44J177J46r97l23O44M56m73n13K00O33M4o47l64N60N51k91o96K06O49q1
5080B37o78j49Q57J52p98k07O17L68n89m08O29N65o76n85L42P20n4o94j63P78
5100B64J90o42n03O10P52l88r44%J082L55j056o21R06R13o64j138M47J188n5j242
5120e46k71J135N54q29p71N63Q98k25r33j41Q50M26o43n79K88O70J5p16j02O53
5140B96K96m81o33L86P53j59p44l6O30J87o10j48N10K76m54l78L71L25k34l87
5160b34J97M13j29m68l2N42J29m03l89L53M74k90n77J25Q40l6r96k12R38N75q59
5181c9o87N99P65l47r82J48J012J68r04m97O82O79l86p66J6P34L55o20o71M32
5201c09Q18j01r10j95Q22M70q30m87O03O80m32p44J57P85M6o18k19M16K64k03
$$ plain form
5221 13 -235 -199 107 151 -119 -168 -48 200 -12 -277 -114 297 166 -271 -198 323 161 -414 -215 472 347 -435
5243 -435 -482 438 617 -269 -623 213 731 42 -645 -158 573 417 -217 -329 151 479 110 -357 -241 457
5263 457 753 -65 -816 -118 826 544 -611 -446 738 711 -436 -653 312 885 183 -540 -144 400 293
5282 293 -167 -87 174 421 232 -239 -464 104 642 242 -419 -214 457 125 -490 -79 636 336 -529 -386
5302 -386 327 270 -356 -29 547 157 -649 -431 425 259 -330 -245 353 222 -432 -512 139 405 180 -202 -387
5323 -387 -298 163 283 -277 -349 352 422 -546 -1047 138 1071 173 -1039 -450 659 180 -829 -462 631
5342 631 606 -357 -662 -167 260 194 26 -233 -217 187 183 -493 -570 477 967 -161 -1069 -197 800 120 -606
5363 -606 90 765 -27 -914 -240 667 242 -280 77 398 -219 -543 122 555 100 -222 133 172 -253 -236 209
$$ packed form
5221A3k48L6L06M4k70m9J20K48k12k65J63M11j31m37P3N21j62n75J99O87j25p82
5243d35m7R20J79q86l54Q36N18o89o87M87P31j56o34j12M80L28l69m67J16O98
5263D57K96q18p51O98R44k82j155J65J184k7j147k17R65N73p02p23L96N44j07
5282B93m60Q0K61K47j89m71k25N68N38m00o61K05O71l32o15M11P15l00q65J43
5302c86P13n7o26L27N76l90q06K18Q56j66n89Q5N98j31o54q0O51K66k25l82j85
5323c87Q9M61J20n60p2P01P0r68n01J185R33q98j212N89J109m79j009L67J093
5342F31k5r63l05M95M27o6j68k59J6M04mo76p7J047M90j128r08Q72R97o80p26
5363f06O96O75p92q87O74R07m25n22L57L21o17l24O65M33m55l22L55L9m25J7M45
$$ plain form
5384 209 352 224 211 1 -486 -227 718 587 -366 -408 653 520 -763 -695 893 1165 -412 -964 252
5403 252 928 -68 -538 285 851 178 -437 -264 -32 244 534 307 -433 -326 430 355 -586 -297 1017 809
5423 809 -811 -1103 421 988 -199 -612 393 650 -482 -712 184 545 -34 -139 230 -92 -613 -225
5441 -225 393 138 -226 101 282 -465 -580 152 525 -9 -167 2 -259 -699 -72 881 158 -777 -246 660
5461 660 -80 -1088 -174 1179 478 -982 -709 424 313 -528 -240 486 240 -347 -441 -308 -156 401 702
5480 702 -67 -966 -297 644 44 -769 55 1159 134 -1273 -622 896 647 -465 -343 435 188 -579
5498 -579 -224 377 294 32 117 -17 -494 -191 552 472 -202 -55 413 -40 -672 8 873 418 -362 -92 328
5519 328 -121 -360 500 859 -173 -672 204 529 -220 -500 526 880 -237 -747 20 544 68 -130 252
$$ packed form
5384B09J43j28j3k10m87K59R45j31r53m2J061j33j283O8J588K72j577n52J216
5403B52O76r96m70Q23N66o73o15J73K32K76K90k27p40J07P56p5r41K89J314k08
5423H09j620k92J524N67j187m13J005K57j132k30Q96L61n79j05L69l22n21L88
5441b25O18k55l64L27J81p47j15P32L73n34j58J69k61m40O27R53p23r35N31R06
5461F60p40j008R14J353p01j460K73J133j11q41K88P26k46n87r4J33J52N57L01
5480G02p69q99O69R41o00q13Q24J104j025j407O51J518k49j112J22P78k47p67
5498e79L55O01q3k62Q5j34m77L03P43q0o74J47M68m53o32O80Q65m55p80K70M20
5519C28m49k39Q60L59j032m99Q76L25p49k80J026L54j117n10P67N24m76j98L82
$$ plain form
5538 252 204 -197 -197 21 -83 -50 635 468 -688 -755 410 895 -222 -594 306 754 -325 -975 62 836
5558 836 164 -487 -147 190 -21 -173 138 89 1 172 -8 -460 -550 337 652 -179 -625 -35 298 -359 -531
5579 -531 247 591 -192 -601 -28 198 -176 -135 305 116 -481 -363 220 94 -345 -90 481 81 -495 -326
5599 -326 211 161 -66 -7 22 -224 -194 124 62 -255 29 401 -6 -698 -314 658 421 -443 -390 373 344 -372
5621 -372 -399 249 545 62 -247 -102 141 181 98 -53 -109 200 378 -79 -475 16 753 368 -468 -326 443
5642 443 405 -310 -232 479 433 -183 -330 127 288 90 21 120 118 -48 43 138 -44 -21 268 262 -144 -171 113 194 30
5667 30 83 192 -35 -131 -11 339 12 -206 98 306 -91 -389 55 469 60 -383 -161 312 181 -248 -246 77
5689 77 224 -2 -248 -266 35 254 33 -331 -236 239 228 -376 -445 214 548 -205 -712 -187 413 91 -456 -281
$$ packed form
5538B52m8m01%K18j04L3O85j67j156o7J165M85j117l72R00M48j079o50J037P74
5558H36o72o51L40L37k11j52L11m9q8J71j80m52r0Q87L15q31m46N90L33o57j72
5579e31P78L44p83m09N73K26l74M1M40j89n97J18N83j26m39K55N71m00n76J69
5599c26N37n0k27N9K9k46L0L18o2l17K84L72m07o92L84R72k37q64N3P63k9p16
5621c72k7O48K96m83l09J45K43M0q3j51n6L09J78m57l96M91P37l85q36J42P69
5642D43l8p15P8P11m6o16j47M57J61j98o9R9kj66R1R5j82K3K89om06k7K84Q1j64
5667C0N3J09k27r6J20L50l27k18L04K08l97k98M44M14m09m43K22M73j31m29KL23
5689G7J47k26k46j8L01K19k21l64R5M75j1o04o9O59L34p53n07N25O00l22n47J75
$$ plain form
5711 -281 229 179 -320 -357 38 261 -31 -257 -210 23 83 -70 -264 -51 139 92 -277 -263 40 137 -66 -156 -15
5734 -15 31 -77 -174 107 129 -90 -171 27 200 -27 -102 133 206 -53 -202 -14 206 113 -116 -175 93 287 56
5757 56 -179 -50 247 279 -51 -205 59 367 93 -281 -152 372 361 -201 -326 199 512 40 -279 -69 421
5778 421 273 -218 -202 230 359 43 -205 -84 265 239 -46 -265 80 342 85 -244 -124 297 253 -225 -197
5799 -197 126 257 -45 -166 125 175 -87 -74 25 113 -41 -153 -27 37 -4 -52 -49 60 -37 -118 -99 85 34 -13 -168
5824 -168 -184 -4 61 -152 -302 1 206 -80 -398 -152 273 110 -307 -241 116 180 -193 -342 -37 246 34
5845 34 -354 -313 43 253 -76 -279 -139 233 123 -301 -287 138 374 -93 -463 -38 314 69 -369 -94 260
5866 260 183 -141 -228 111 185 21 -27 3 18 82 20 -109 0 121 155 -23 -141 46 225 95 -100 91 192
$$ packed form
5711b81N10n0m99l7L95K23k92k26M7K33O0j53j94K13J90m7l69J4L03R7k03r0J41
5734a5M6j08r7K81K2k19q1J98J73k27p5K35P3k59j49J88K20r3k29n9K68J94k31
5757E6k35J29K97L2l30j54K64L08k74l74J29N24j1n62j25N25L13m72l19K10M90
5778D21j48m91J6M32J29l16k48J21L49k6k85k19L45K62k57l29J20M21m4m78K8
5799a97L23J31l02j21K91N0k62J3R9Q8j54j12J26O4m1m8LJ09r7q1J9J84n1m7j55
5824a68j6J80O5k13j50L03K05k86l18K46M25j63m17O6L57O4l73j49L05K83k12
5845C4l88M1L56K10l29k03J40L72j10m24J4M25K36m67l70M25L52k45m38K75L54
5866B60p7l24q7L39P4j64m8L0J5O4o2j29J09J21L4j78j18J87J79j30j95J91J01
$$ plain form
5889 192 74 -132 66 188 40 -95 130 246 -31 -189 143 343 112 -98 8 228 64 -115 34 159
5909 159 237 68 10 -83 156 304 59 -226 -59 375 252 -315 -271 383 461 -140 -447 170 407 -138 -364 67
5931 67 418 67 -204 -145 65 143 91 -54 -196 -44 171 -29 -315 -100 316 192 -324 -387 202 243 -301 -322
5953 -322 197 210 -258 -347 47 174 -109 -121 85 -70 -290 -163 111 43 -154 -56 -2 -154 -253 -10 161 -57
5975 -57 -71 79 -102 -356 -19 393 64 -421 -76 363 -69 -612 -51 597 247 -555 -373 288 301 -207 -197
5996 -197 249 238 -143 -301 -74 124 326 351 -220 -385 133 436 -33 -368 160 687 66 -689 -189 601 336
6017 336 -351 -65 450 172 -404 -161 305 342 38 34 63 -205 -58 265 309 -83 -2 212 14 -310 146 494
6039 494 109 -256 23 212 -170 -255 208 517 -125 -434 223 435 -233 -377 340 655 -54 -562 -145 391
$$ packed form
5889A92j18k06J98J22j48j35K25J16k77j58L32K00k31k10J06K20j64j79J49J25
5909A59P8j69n8r3K39J48k45k85J67M34j23n67M4O54P8o01l07O17K37n45k26M31
5931F7L51l51k71N9K10P8n2j45j42J52K15k00k86K15M16j24n16o3N89M1n44k1
5953c22N19J3m68q9L94J27k83j2K06j55k20J27K74o8j97R8N4j52r9K43J71k18
5975e7j4J50j81k54L37M12l29m85L45M39m32n43N61O48l50q02J82O61J3n08J0
5996a97M46j1l81j58K27J98K02K5n71j65N18L03m69l35N28N27o21p55N00P90k65
6017C36o87K86N15k78n76K43M66L7l04mK9k68J47L23M4l92Q1K14j98l24M56L48
6039D94l85l65K79J89l82q5M63L09o42l09O57K12o68j44P17L15p09n08M17N36
$$ plain form
6059 391 120 -112 27 135 -75 -188 -117 -173 91 427 131 -542 -403 385 345 -461 -488 435 477 -640 -784
6080 -784 137 656 7 -514 -45 234 -183 -363 -1 270 70 -88 -91 -366 -250 247 294 -186 -334 71 143
6101 143 -363 -319 319 370 -250 -463 131 60 -345 -103 472 334 -516 -407 246 215 -322 -29 578 236 -469
6122 -469 -450 177 365 83 14 -59 -77 -16 34 -64 -40 348 552 -190 -785 -55 765 256 -547 -100 676 204 -776
6145 -776 -349 614 634 -162 -305 40 208 -81 85 270 227 30 54 -161 -325 136 666 235 -455 -162 347
6166 347 57 -371 7 633 189 -505 -252 249 72 -210 210 442 -59 -552 -118 269 10 -172 117 273
6186 273 -168 -480 -95 269 163 38 -71 -199 -230 54 152 -187 -116 326 238 -578 -631 269 682 -169 -607 77
6208 77 438 -266 -699 88 560 144 -483 -334 -15 -18 36 52 -121 -118 19 13 -394 -294 362 452 -279 -624 56
$$ packed form
6059C91k71k32J39J08k10j13P1n6K64L36k96o73J39P88m0q06k7R23M2j117j44
6080g84R21N19o49n21M69K79m17j80L62K71k00j58lk75J16M97M7m80j48M05P2
6101A43n06M4O38N1o20k13N94p1m05K42N75j38q50J09O53l1n37K93O07l42p05
6122d69J9O27J88k82o9p3j8O1N0r8K4L88K04p42n95P30Q20n09q03M47P76m72r80
6145g76M27R63K0p96j43L45J68k89J66J85m3j97K4k15j64M61N30m31o90K93N09
6166C47k90m28L78O26m44o94K53N01j77k82M20K32n01m93M34L87k59j82K89J56
6186B73m41l12L85L64j06j25j09j28l1K84R8l39P1M42q8q16n3R00M13q51m38O84
6208G7L61p04m33P87M72m16o27J49L19lN4J6j73LJ37om07J00O56R0p31l45O80
$$ plain form
6231 56 471 -173 -414 158 496 -103 -499 -3 287 21 -63 204 123 -247 -278 224 236 -113 -2 202 -8 -251
6253 -251 -69 199 109 45 68 26 -227 11 358 132 -136 -15 475 113 -577 -181 613 503 -243 -346 365
6274 365 384 -199 -225 324 442 -12 -299 -71 113 217 173 58 -168 77 333 2 -269 -55 561 250 -444
6295 -444 -268 386 378 -223 -255 364 259 -318 -271 54 226 1 -30 41 -131 -225 18 105 -25 -104 57 56 -172 -118
6319 -118 89 93 -148 -72 51 -143 -209 64 215 -154 -337 5 208 -223 -482 -29 478 63 -506 -191 211
6340 211 138 -208 -201 105 124 -132 -266 -120 95 260 -52 -315 -183 207 240 -236 -314 104 374 -69 -404 -49
6362 -49 353 140 -245 -109 176 117 -168 -136 88 163 52 -38 -91 -51 62 192 28 -113 74 157 -35 -77 102
6385 102 136 37 -74 124 108 -1 -43 139 179 -94 -41 188 192 -120 -117 206 351 35 -321 54 411 191 -121
$$ packed form
6231E6M15o44k41N72L38n99l96M96K90k66q4K67q1l70l1N02J2l49J11K04k10k43
6253b51J82K68r0o4K3m2k53K38L47k26k68J21M90l62o90L96P94j10p46j03P11
6274C65J9n83k6N49J18m54k87K28J84J04m4j15k26K45K56l31k71K14O16l11o94
6295d44J76O54qo01l2O19j05n77M7L25J72k25l1P1j72r4K43Q7j30p9J61jk28N4
6319a18K07Mk41P6J23j94o6K73J51l69j83L42K03m31k59M53N07m15n69L15M02
6340B11p3l46PL06J9k56j34J46K15J65l12k63J32L90L3m76p8M18K70m43l35L55
6362d9M02k13l85J36K85n9k85L2K24P5j11r0n3M0J13J30j64j41J87Q3j92m2J79
6385A02L4r9j11J98j6j09m2J82M0k73N3K29Ml12LL23J45l16l56L75L57k20l12
$$ plain form
6408 -121 -73 145 203 26 -123 40 164 248 -75 -227 72 273 65 -277 -103 330 253 -203 -267 145 326 23
6430 23 -230 -39 172 130 -138 -156 75 70 -36 -107 -133 107 78 -51 -162 -90 172 77 -132 -121 70 18 -154 -129
6454 -129 64 0 -122 -85 18 20 -174 -156 101 27 -123 -123 50 93 -208 -204 41 152 -76 -260 -85 84 36 -90
6478 -90 -190 -46 50 -2 -142 -138 31 118 -146 -334 49 268 17 -250 -121 227 141 -119 -138 53 207 54 -120
6501 -120 6 89 97 2 -81 14 116 110 -16 -18 93 227 55 -170 12 178 84 -46 40 189 -1 9 35 174 44
6526 44 -50 48 121 22 -98 52 177 78 -53 6 189 18 -35 -67 64 182 0 -74 -84 79 173 2 -173 -54
6550 -54 238 65 -148 -105 153 180 -120 -200 66 170 -58 -210 -12 146 4 -64 -54 -23 -28 -41 4 -110 26 80
6574 80 -46 -157 -106 177 16 -177 -137 32 12 -147 -137 17 31 -175 -120 -14 -28 -147 -40 45 -16 -171 -119 9
$$ packed form
6408a21M8K18N8j77j49J63J24Q4l23j52K99K01k08l42J74M33p7m56o4M12J81l03
6430B3k53J91K11m2k68j8K31nj06p1k6K40k9j29j11P2K62r5k09J1J91n2j72K5
6454a29J93o4j22L7J03Kj94J8K57p4j50%J73M3l01MK45J11k28j84J75J69m8j26
6478i0j00J44R6n2j40MJ69Q7k64j88L83K19k51k67J29L48q6k60j9J91J54j53j74
6501a20J26Q3Qr5q3R5J02oj26kJ11J34j72k25J82J66r4j30Q6J49j90J0K6J39j30
6526D4r4R8P3r9j20J50J25r9j31N9J83j71n3l2J31J18j82p4j0J63R4j71j75J19
6550e4K92j73k13M3K58K7l00q0K66J04k28j52J98J58j42o8J0L1nj3M5j14J36N4
6574H0j26j11N1K83j61j93M0J69k0j59J0J54J4k06N5J06j4j19J07Q5o1j55N2J28
$$ plain form
6598 9 18 -126 -92 125 -82 -142 -27 0 -3 9 -5 -113 -153 68 101 -92 -123 33 168 -114 -204 101 309 5 -266
6623 -266 -35 182 79 -200 -20 224 78 -146 -96 30 105 10 97 21 -16 67 128 -17 -43 148 207 64 -213
6646 -213 7 288 91 -80 154 230 -67 -149 29 222 57 17 186 117 -132 -113 189 275 -15 6 145 -34
6668 -34 -143 -86 151 76 -25 -22 -43 -140 -25 182 141 -184 -109 204 6 -324 -141 403 270 -232 -331 177 209 -177
6692 -177 -147 200 150 -186 -294 -46 46 36 82 52 -155 -179 64 3 -140 -100 188 59 -418 -310 127 221 -138
6715 -138 -165 133 6 -295 -176 109 29 -183 -81 87 -194 -395 31 313 16 -211 -37 104 -263 -214 84
6736 84 212 -81 -188 19 -115 -162 112 348 -1 -287 3 312 -86 -396 167 520 43 -519 -124 282 70
6757 70 -177 110 331 31 -286 -72 145 133 125 285 -9 -206 13 255 -29 -184 273 381 -137 -511 23
$$ packed form
6598IRj44L4K17k07o0J15K7lJ2j4j08m0K21L3j93l1J56J35k82r0L05K08l04k71
6623b66K31K17j03k79J80K44j46k24N0J26P5r5Q7p6l7Q3O1j45k6J91N9j43k77
6646b13K20K81j97j71K34P6k97q2J78J93j65m0J69o9k49J9L02Q6k90K1J39j79
6668c4j09N7K37p5j01Lk1r7J15K07m1l25P5L13j98l30J83N44j33n02r9N08L2l86
6692a77L0L47n0l36j08K48R2j0M6l0k07k4K43o1j43M0K88j29m77J08M37R4l59
6715a38k7K98j27l01J19K85q0k12J02J68k81k01M26K82k97k27J74J41l67M9K98
6736H4J28k93j07K07j34m7K74K36l49k86K90L09l98l10N63L53m77n62L95M06k12
6757G0k47K87K21l00l17K14K17j2qJ60k94j97K19K42k84j55M57J08n18l74N34
$$ plain form
6778 23 453 58 -240 102 334 -97 -371 75 372 29 -91 169 45 -295 -150 311 233 -214 -176 123 -11
6799 -11 -280 85 359 144 -186 -38 70 -119 -158 287 342 -199 -306 176 237 -343 -232 431 350 -384 -514 154
6821 154 308 -39 -163 92 157 -212 -245 -9 58 59 147 -66 -376 -226 254 170 -331 -200 343 159 -481 -448 349
6844 349 379 -234 -362 110 97 -343 -219 250 221 -179 -201 -52 -78 -183 124 310 -115 -346 -34 80 -192 -89
6866 -89 288 194 -227 -177 136 64 -168 82 411 75 -455 -79 360 160 -327 75 438 78 -485 -169 352
6887 352 353 -61 -119 53 27 35 -9 8 29 270 185 -185 -376 261 541 -11 -411 71 526 -60 -498 11 559
6910 559 246 -352 -168 278 127 -93 81 254 91 -84 -21 72 -46 67 217 55 -218 -40 158 -36 -177
6931 -177 78 263 -54 -304 28 179 -92 -194 212 227 -207 -363 142 292 -59 -270 39 121 -80 -351 -53
$$ packed form
6778B3M30l95k98L42K32m31k74M46K97l43j20K60j24l40J45M61p8m47L8K99j34
6799a1k69L65K74k15l30J48J08j89l9M45N5n41j07M82O1n80J11O63q1p34j30O68
6821A54J54l47j24K55O5l69l3K36O7JQ8k13l10J50M80q4n01J31N43j84o40L3P97
6844C49L0o13j28M72j3m40J24M69k9m00k2J49k6j05L07J86m25k31L12J14k72J03
6866h9L77r4m21N0L13p2k32K50L29l36n30L76M39k00m87M02L63l60n63L16N21
6887C52Jm14n8J72k6Qm4J7K1K41q5l70j91O37K80n52m00M82M55n86m38N09N48
6910E59l13n98J84M46j51k20J74J73j63j75O3R3j18J13J50j62k73J78J98j94j41
6931a77K55J85l17k50L32J51k71j02M06J5m34j56N05J50l51k11L09Q2k01k71K98
$$ plain form
6952 -53 223 71 -74 -159 -125 37 12 -94 -255 -23 275 -13 -461 -266 400 250 -429 -375 168 375 -266 -480
6974 -480 138 427 -68 -484 -147 205 107 -184 -125 111 103 -4 -180 -91 74 143 55 -175 -88 210 80 -179 -83
6997 -83 192 142 -153 -163 157 91 -176 -61 188 160 -209 -118 216 262 -1 -144 21 164 -47 -162 24 148
7019 148 154 5 -165 -58 204 145 -106 -153 233 340 -116 -423 81 500 161 -332 -145 309 218 -239 -263 247
7041 247 363 -16 -336 12 298 163 -84 -162 127 193 -43 -168 -36 146 174 -165 -256 62 237 -60 -218
7062 -218 39 211 52 -244 -40 177 94 -120 -113 86 10 -182 -131 125 105 -98 -242 -61 104 -78 -121 -116 127
7085 127 105 -159 -258 23 214 21 -318 -240 179 137 -274 -371 167 294 -140 -431 -47 321 114 -371 -217 220
7107 220 275 -193 -312 49 311 118 -333 -210 222 156 -89 -259 8 273 99 -277 -126 247 196 -98 -243
$$ packed form
6952e3K76j52j45q5L4J62k5j06j61K32K98k88m48J95O66j50o79N4N43K07o41k14
6974d80O18K89m95m16L37L52r8k91N9K36qj07j76Q9J65O9q8k30Q7K98j30k59R6
6997h3K75n0k95j0L20o6k67J15K49k8l69R1L34M6k63j43J65J43k11j15J86J24
7019A48Oj49j70J07K62n9k51m7L86J07m56l07N04M19l39m93J87M54r1m57k4N10
7041B47J16l79l20L48K86j35k47p8K89O6k36j25J32J82K8l39r1L18J75k97j58
7062b18K57J72j59k96K04K17q3k14PJ99p6j92N1K56k0k03j44J81J65j82m3NK43
7085A27k2k64r9K81J91j93l39P8M19m2m11r7N38J27m34k91L84L68k07m85J54M37
7107B20N5m68j19L61K62j93m51J23M32o6k45j70K67K65j74l76J51L73n1k94j45
$$ plain form
7128 -243 92 223 -48 -293 83 201 89 -122 -49 185 79 -79 -141 99 137 -134 -119 101 189 16 -98 -84
7150 -84 201 234 -93 -158 88 269 32 -260 45 380 149 -319 -196 273 311 -117 -313 97 403 92 -311
7171 -311 -131 276 210 -148 -230 65 366 49 -259 -62 183 209 -253 -298 112 391 6 -340 -166 284 123
7192 123 -210 -203 190 229 -169 -208 3 248 -51 -292 -111 122 -42 -163 -107 -5 80 -106 -210 -32 51 77 -270
7215 -270 -98 115 106 -179 -254 23 194 -157 -358 43 276 -16 -379 -104 273 145 -290 -272 168 284 -57
7236 -57 -257 -83 252 97 -222 -276 78 313 -55 -277 -113 341 191 -298 -255 199 421 -110 -351 -4 372
7257 372 48 -373 -121 310 169 -163 -236 147 231 -14 -171 114 212 42 -150 -80 169 273 39 -204 -31
7278 -31 300 107 -201 -81 361 337 -225 -202 250 313 -56 -189 152 268 -27 -286 3 297 70 -240 -155 157
$$ packed form
7128b43L35J31k71k45L76J18j12k11P3K34j06j58o2K40L8k71J5K20Q8j73j14J4
7150h4K85L3l27o5K46J81k37k92L05L35k31m68J23M69L8m28j96M10L06l11m03
7171c11J80M07o6l58q2K95L01l17l08J97K45K6m62m5M10K79l85l46J74M50j61
7192A23l33PL93L9l98l9K11K45k99k41J81K33j64j21N6J02Q5j86j04J78Q3K6l47
7215b70J72K13rk85p5K77J71l51k01M01K33k92l63K75L77j28m35J8M40J16l41
7236e7k00J74L35j55l19n4L54K35l68k22J64M54j50m89M3M54K22n31k41L47L76
7257C72l24m21K52M31j41l32p3L83Q4k45j57K85R8j70j92P0K49J04k34k43J73
7278c1L31j93l08J20M42k4n62K3M52O3l69j33L41J16k95k59K89K94k27l10Q5L12
$$ plain form
7300 157 138 -34 -140 33 267 149 -176 -193 86 363 -15 -316 -47 423 80 -419 -285 416 276 -305 -342
7321 -342 127 282 -245 -383 96 311 12 -315 -191 104 146 -43 -100 -61 108 98 -287 -253 166 330 -134 -439
7343 -439 -53 355 44 -383 -113 369 37 -456 -202 298 138 -233 -194 167 140 -229 -165 118 204 19 -111
7364 -111 -142 -34 26 33 -80 -81 207 120 -293 -311 171 363 -84 -394 123 390 -85 -472 80 499 106 -411 -161
7387 -161 321 232 -224 -75 162 230 -123 -305 -75 195 204 81 -180 -75 302 149 -217 -141 407 319 -276 -400
7409 -400 240 570 -49 -333 138 407 -64 -433 13 443 175 -200 -93 132 38 -63 -19 30 117 11 -141
7430 -141 -246 -6 238 103 -198 -75 187 41 -375 -167 382 375 -309 -378 237 309 -246 -333 228 323 -229 -552
7452 -552 -20 220 37 -152 -66 47 8 -180 -210 -33 177 190 -155 -396 -37 326 24 -467 -13 438 83
$$ packed form
7300A57j9j72j06J73K34j18l25j7K79K77l78l01K69M70l43m99J34P01j40n81l7
7321c42M69J55n27j38M79K15k99l27J24K95M2j89n7L9J69j0l85L4M19J64m64l05
7343d39L86M08l11m27K70M82l32m93K54N00j60l71L9L61k7l69O4K83Q6j85j30
7364a11l1J08O0Pj13jK88q7m13j8M82J92m47l10N17K67m75l87N52M19l93n17K50
7387a61M82q9m56J49K37O8l53j82K30K70Rj23k61J05L77j53l66P6N48q8n95j24
7409d00O40L30o19k84M71K69m71l69M46M30k68l75J07K25r4j01M4M9Q7j06j52
7430a41j05K40K44j35l01J23K62j46m16K08N49po84o9O15P2n55q7N61R5n52l23
7452e52N32K40j83j89Q6J13l9j88l0J77K10J3l45k41L59L63l02m91M54M51l55
$$ plain form
7473 83 -522 -297 404 325 -299 -267 166 236 -260 -401 179 293 74 -194 -151 -21 46 22 -12 32 144 -2 -160
7496 -160 -253 58 388 30 -325 0 275 39 -341 46 452 143 -324 -185 228 152 -245 -40 361 199 -236
7517 -236 -267 78 114 87 -19 -87 42 75 26 -83 31 321 246 -245 -256 233 402 -96 -353 168 434 -122 -531
7540 -531 47 557 255 -320 -182 261 107 -198 -123 116 209 31 -127 -157 91 225 184 -186 -111 98 53 -298
7562 -298 -220 215 299 -249 -346 28 302 -173 -240 113 322 -159 -346 -38 231 36 -155 -19 140 -104 -214
7583 -214 -118 46 122 28 -37 -245 -60 132 4 -234 -4 301 -36 -445 -230 336 264 -300 -303 217 234 -303 -438
7606 -438 103 419 -83 -349 -131 242 103 -197 -121 69 195 -47 -267 -153 134 255 -46 -321 -37 249
7626 249 38 -278 -136 284 155 -274 -195 255 248 -115 -99 180 193 -86 -119 82 147 14 -67 104 38 -54 29 47
$$ packed form
7473H3o05K25P01p9o24L2M33P0m96j41N80J14k19k68M3J30O7k4l4M4J12j46j58
7496a60r3L11L30l58l55L25K75k36l80L87M06l09m67J39M13p6l97K05M01j62m35
7517b36l1L45L6k7j06o8J29L3m9j09J14K90p5m91j1M89J69m98k57N21K66n56m09
7540e31N78N10l02n75J38M43j54l05P5K39R3j78j58l0K48J34m1l70P5K09m5l51
7562b98P8M35Q4n48r7L74K74m75o7L53K09m81j87L08K69j95j91J36J59k44j10
7583b14R6J64P6r4o5k08J85J92j28k38K30L05l37m09K15N66p2n64lN20J7n37j35
7606d38N41L16n02k66K18L73j39l00P6J90J26k42k20J14K87J21l01k75K84K86
7626B49k11l16J42M20j29m29P9M50pl63J6K79J3k79l3K01O5j33q1J71o6r2Q3J8
$$ plain form
7650 47 105 138 101 -98 -136 120 252 4 -191 108 301 -61 -305 48 454 107 -324 -112 362 215 -286 -126
7672 -126 264 287 -37 -263 -47 175 120 -122 -159 57 152 22 -268 -104 222 190 -157 -225 38 289 -66 -321
7694 -321 -36 312 73 -273 -92 133 78 -170 -164 96 174 -17 -121 -19 93 -28 -100 -101 -67 -22 -4 -76 14 38
7718 38 -47 -212 -178 141 131 -209 -245 133 149 -193 -278 11 334 -99 -282 -48 269 43 -314 -203 175 209 -153
7741 -153 -284 -34 277 24 -258 -181 132 221 -58 -256 -15 287 141 -280 -170 228 286 -74 -189 123 328
7762 328 57 -169 -31 243 129 -96 -47 107 104 48 -47 65 132 96 -17 -22 93 71 52 5 33 84 2 -120 2
7787 2 177 16 -138 -62 235 189 -160 -195 180 205 -118 -209 96 232 52 -161 -2 241 149 -217 -210 116 280
7810 280 49 -218 -93 151 247 -106 -264 80 195 7 -202 -40 197 173 -206 -177 120 149 -133 -174 20 174
$$ packed form
7650D7N8L3l7j99l8K56J32k48j95K99J93l62k44L53M06l47m31K12M74j47n01J60
7672a26L90K3l24k26K16K22n5k42l7K16R5j30k90J64L26l2l47o8K63K51l55k55
7694c21K85L48k39l46J81K25n5k48OK60P8j91j04J02J12j21p2jL4M5J8p2R0K4
7718C8q5j65L4L19j0l40l6L78J6l42q5K89L23m33j83K34L17k26l57J11L78L4l62
7741a53j31K50L11k53k82P7L13Q9k79j98K41L02j46m21J10L98N8l60j15L12K05
7762C28k71k26J38K74j14k25M9J54ln6r5J12O7l6j13nJ15k2j9m7K8N1q2j22J22
7787BJ75j61j54P6K97m6l49l5L75K5l23r1L05J36j80k13J59K43r2l66PL26J64
7810B80k31k67J25K44R6l53j58L44J15j88k09J62K37k4l79K9K97K9k82m1J94J54
$$ plain form
7832 174 -85 -169 -101 17 54 -55 -93 8 54 -60 -112 -31 20 40 -105 -118 22 56 -115 -129 8 8 15 -171 24
7857 24 163 19 -181 -102 92 86 -230 -147 109 166 -89 -228 -43 142 86 -121 -137 31 104 -51 -259 -39 259
7880 259 129 -127 -174 167 221 -48 -173 123 226 25 -216 -10 184 79 -132 -110 89 192 16 -85 42
7901 42 86 105 -13 -68 58 137 47 -34 6 71 14 -66 -2 125 109 -166 -58 57 98 -28 -67 77 73 -77 -105 63
7927 63 163 33 -70 -15 92 130 -71 -53 74 83 77 -117 -71 51 111 -30 -195 65 199 34 -220 -86 144
7950 144 114 -190 -226 71 149 -114 -167 0 101 -56 -108 -74 -71 24 -8 -85 -63 -8 33 -21 -142 66 121 -97 -142 -65
7976 -65 88 -3 -157 -5 63 -79 -190 4 95 -23 -94 68 114 -33 -114 -33 76 35 -57 -79 -9 -29 21 -71 -7
8001 -7 31 146 50 -110 -93 98 223 -76 -108 32 134 -86 -133 111 254 55 -175 -68 132 14 -109 74
$$ packed form
7832A74k59q4O8J18L7j09l8J01M6j14n2Q1N1K0j45j3J40L4j71j4J37%Pj86J95
7857B4J39j44k00P9J94ol16Q3K56N7k55j39J85J85n6k07j6J68P3j55k08K20K98
7880B59j30k56m7L41N4k69j25K96J03k01k41K06J94j05k11K2J99J03j76j01J27
7901D2M4J9j18n5J26P9r0q1M0O5n7q0O4J27j6k75J08J15M1j26l9J44mj50k8J68
7927F3J00j30j03N5J07L8k01J8J27Roj94M6J22O0j41j65K60J34j65k54J34K30
7950A44l0l04l6K97P8k63n3J67J01j57n2L4LR5l2p7K2N5M1n4j21K08N5k18m5P7
7976f5J53r1j54J52O8j42j11J94R1j18p1J62M6j47q1Q1J09m1r2k2P0k0N0r2O4
8001gL8J15r6j60J7J91J25k99l2J40J02k20m7K44J43j99k30J07K00j18j23J83
$$ plain form
8023 74 120 104 -10 7 -15 51 120 126 -35 15 59 34 -95 -41 158 108 -34 -94 69 142 -17 -42 113 108 -44 -133 87
8050 87 143 -35 -95 68 120 -84 19 84 65 3 27 63 -37 -121 16 70 -36 -47 41 -18 -153 -93 184 155 -142
8075 -142 -133 154 16 -202 -97 209 138 -212 -202 -54 21 -81 -71 -31 32 -86 -97 -12 -89 62 72 46 -243 -92
8099 -92 126 -30 -121 52 238 -10 -218 -118 147 78 -136 -30 123 91 -201 -130 129 34 -154 46 50 -84 -188
8122 -188 40 134 4 -31 11 -28 -127 -13 129 154 -72 -4 122 -116 -178 32 207 65 -206 -38 120 -1 -200
8145 -200 152 234 6 -198 -30 164 10 -29 78 133 -52 -54 33 14 -11 110 125 -118 -127 55 167 -1 -132 219
8169 219 213 -153 -275 80 323 4 -119 83 121 -112 -175 128 155 9 -53 35 9 -76 -39 148 16 -52
$$ packed form
8023G4M6j6j14J7k2O6O9Oj61N0M4k5j29N4J99n0j42o0J63P3j59k5J55nj52q9K20
8050H7N6j78o0J63N2k04J03O5j9o2K4L6j00q4J37N4j06j1Q8n9j35O0K77k9k97
8075a42RK87j38k18J05L06p1l50J0J48P5j02J0M0O3j18j1Q5p7J51J0k6k89J51
8099i2K18j56r1J73J86k48k08J00K65o9k14J06J53l2k92P1K59r5j88K00Mj34j04
8122a88K28R4j30l5M2l9r9J14J42K5k26O8J26k38o2K10J75j42k71J68J58j21j99
8145b00L52Q2k28k04J68J94j54l9J07N5j85kQ7j9k5J21J5k43rJ82J12j68j31L51
8169B19ol66j22L55K43l19j23K02L8k33o3L03K7j46o2Q8k6q5L7J87j32o8
8191e2
$$ Imaginary data points
##PAGE= N=2
##DATA TABLE= (X++(I..I)), XYDATA
$$ plain form
0 0 0 0 0 0 0 0 0 0 0 0 0 0 0 0 0 0 -3 4 -4 8 -8 8 -10 12 -12 15 -20 21 -23 29 -31 38 -41 48 -52 60 -68 74 -82
39 -82 93 -101 114 -127 140 -153 170 -189 205 -225 248 -269 293 -317 338 -349 340 -277 55 672 -3752
60 -3752 36702 345039 214739 -141024 -87990 125751 45637 -124675 9083 203432 100953
71 100953 -106886 -82984 62957 108209 96690 111440 80666 15963 16181 39443 514 29
83 29 105302 145293 17866 -79942 -10978 73245 65567 84687 152165 113272 -13924 -22708 91622
96 91622 133229 74953 46556 37096 -27615 -57988 29008 108399 78997 42100 55186 22460
108 22460 -36795 15041 106413 46747 -66940 -7214 105260 11725 -135568 -26448 177614
119 177614 105830 -118717 -103085 80728 60328 -114895 -90576 98628 97823 -106010 -174751
$$ packed form
0@%%%%%%%%%%%%%%%%lPqJ2j6J6j8K2k4K7l5M1m4N2o0O9p9Q9j00J12j28J42j56
39h2J75j94K15k41K67k93L23l59L94m30M73n17N62o10O55o87O89o17L32O17m424
60c752M0454L08337j30300l55763N3034K13741q0114j70312J33758J94349j02479
71A00953k07839K3902J45941M5252j1519J4750l0774o4703K18K3262l8929m85
83B9J05273L9991j27427r7808O8964Q4223p678J9120O7478l8893j27196q784J14330
96I1622M1607n8276k8397r460o4711l0373Q6996P9391k9402l6897J3086l2726
108B2460n9255N1836R1372n9666j13687N9726J12474r3535j47293J09120K04062
119A77614p1784k24547J5632J83813k0400j75223K4319J89204q05k03833o8741
$$ plain form
130 -174751 -16903 105793 47188 -51711 -56803 -12775 -5238 -36809 -54709 -25670 8245 -28070
142 -28070 -106000 -97965 9776 59865 -17591 -78133 -20689 37304 -10634 -68740 -34545 16059
154 16059 -8248 -52575 -45597 -24870 -30590 -26803 554 5995 -18281 -29402 -20296 -12830 2529
167 2529 24910 10118 -38828 -45566 3638 25191 -1787 195 35774 14120 -50874 -32392 62452
180 62452 70123 -36465 -79047 13277 75341 4440 -56320 16574 100714 47525 -53939 -34878
192 -34878 63279 69546 -23229 -56653 19435 68639 2018 -72881 -28097 76123 85620 -7260
204 -7260 -58713 -1932 61314 37514 -14743 -2113 40124 17731 -48836 -50687 25860 69599
216 69599 19036 -45987 -35727 17848 29799 -2609 -15298 6446 12904 -15973 -35301 -13345
$$ packed form
130a74751J57848J22696n8605r8899n092M4028P537l1571j7900K9039L3915l6315
142b8070p7930Q035J07741N0089p7456o0542N7444N7993m7938n8106L4195N0604
154A6059k4307m4327O978K0727n720L787K7357N441k4276j1121R106P466J5359
167B529K2381j4792m8946o738M9204K1553k6978J982L5579k1654o4994J8482R4844
180F2452P671j06588m2582R2324O2064p0901o0760P2894Q4140n3189j01464J9061
192c4878R8157O267r2775l3424P6088M9204o6621p4899M4784J04220R497r2880
204g260n1453N6781O3246k3800n2257J2630M2237k2393o6567j851P6547M3739
216F9599n0563o5023J0260N3575J1951l2408j2689K1744O458k8877j9328K1956
$$ plain form
228 -13345 17327 16066 -4429 -9730 -3868 -13093 -29598 -20227 10562 17795 -13297 -39558 -26756
241 -26756 -1538 181 -4315 13249 23590 -12570 -55407 -31085 36612 45087 -22429 -62425 -19739
254 -19739 22191 -9009 -47615 -10842 47727 26577 -43898 -47887 22219 53648 495 -45662
266 -45662 -11884 38982 16488 -46280 -44018 29749 65611 7795 -56160 -31390 35978 39067
278 39067 -14348 -24213 24581 38817 -14031 -43802 7240 61540 34641 -27902 -31849 16347
290 16347 35803 5971 -15604 1667 20624 7382 -14516 -8600 16671 24895 9458 -266 9830
303 9830 16401 3225 -7151 6238 21057 7372 -16305 -12778 7959 8840 -4235 3546 22796
316 22796 10351 -23914 -20969 23611 40319 -631 -35034 -10112 27636 13372 -26141 -20755
$$ packed form
228a3345L0672j261k0495n301N862r225j6505R371L0789P233l1092k6261J2802
241b6756K5218J719m496J7564J0341l6160m2837K4322O7697Q475o7516l9996M2686
254a9739M1930l1200l8606L6773N8569k1150p0475l989P0106L1429n3153m6157
266d5662L3778N0866k2494o2768K262P3767L5862n7816o3955K4770O7368L089
278C9067n3415r865M8794J4236n2848k9771N1042N4300k6899o2543l947M8196
290A6347J9456k9832k1575J7271J8957j3242k1898N916K5271Q224j5437r724J0096
303I830O571j3176j0376J3389J4819j3685k3677L527K0737Q81j3075P781J9250
316B2796j2445l4265K945M4580J6708m0950l4403K4922L7748j4264l9513N386
$$ plain form
328 -20755 21399 26651 -18381 -40806 -940 39208 14576 -35592 -29522 22902 33853 -17383
340 -17383 -45917 -311 47918 19185 -41855 -38061 20322 35009 -15298 -43589 -4823 30592
352 30592 1325 -40411 -19965 32504 33114 -17150 -37305 388 31537 9273 -24556 -15869 14254
365 14254 12147 -16662 -21603 4519 16717 -2908 -17068 -1832 13864 3125 -11143 -642
377 -642 15322 6264 -13165 -9310 8819 7164 -9784 -7459 13029 12871 -13297 -22014 6039 27264
391 27264 5243 -25742 -14612 21253 22403 -12880 -23325 11762 33887 1475 -35363 -14379
403 -14379 31998 26049 -24528 -35825 11887 38633 -1481 -40819 -11144 40398 28961 -26627
415 -26627 -35181 15483 40689 522 -36970 -11976 29823 16716 -28330 -29109 16329 33364 -4677
$$ packed form
328b0755M2154N252m5032k2425L9866M0148k4632n0168O070N2424J0951n1236
340a7383k8534M5606M8229k8733o1040L794N8383J4687n0307k8291L8766L5415
352C0592k9267m1736K0446N2469O10n0264k0155L7693L1149k2264l3829Q687L0123
365A4254k107k8809m941K6122J2198j9625j4160J5236J5696j0739j4268J0501
377f42J5964r058j9429L855J8129j655j6948K325K0488j58k6168q717K8053K1225
391B7264k2021l0985J1130L5865J150l5283j0445L5087K2125l2412l6838K0984
403a4379M6377n949n0577j1297M7712K6746m0114l9338K9675N1542j1437n5588
415b6627q554N0664K5206m0167l7492K4994M1799j3107m5046p79M5438J7035l8041
$$ plain form
428 -4677 -34191 -8324 28241 17162 -18316 -18083 13241 20609 -5910 -19064 806 16484 2444
441 2444 -13898 -5481 8841 3386 -8952 -4110 8323 4761 -8016 -6370 6769 7256 -5623 -6475
455 -6475 9260 14009 -4587 -17318 -614 19876 7528 -20889 -17783 14914 23316 -8082 -25973
468 -25973 3569 32663 10158 -28280 -17180 26244 28493 -15650 -32199 6982 36089 5782
480 5782 -34136 -17878 27295 27721 -16191 -32294 5468 35373 9850 -28241 -16500 24425 25591
493 25591 -15308 -29767 6285 31593 3479 -29876 -12570 24213 18446 -16903 -21265 8051
505 8051 18514 -2985 -14487 1843 13853 1964 -9969 -2813 7210 2977 -5370 -4062 1527
518 1527 -439 -6220 -4699 3181 4716 -4184 -9694 -362 9900 1174 -13934 -5830 16447 11947
$$ packed form
428d677k9514K5867L6565j1079l5478K33L1324P368k6519j3154J9870J5678j4040
441B444j6342Q417J4322n455j2338M842J2433l562j2777J646J3139M87j2879q52
455f475J5735M749j8596j2731J6704K0490j2348k8417L106L2697Q402l1398j7891
468b5973K9542K9094k2505l8438J1100M3424K249m4143j6549L9181K9107l0307
480E782l9918J6258M5173M26m3912j6103L7762K9905k5523l8091J1741M0925J166
493B5591m0899j4459L6052K5308k8114l3355J7306L6783n767l5349m362K9316
505H051J0463k1499j1502J6330J2010j1889j1933P156J0023m233q347J308N589
518A527j966n781J521P880J535q900n510R332J0262q726j5108Q104K2277m500
$$ plain form
532 11947 -18936 -24502 9087 25875 -4756 -30421 -5711 25280 6844 -28436 -17112 22932
544 22932 23977 -15522 -30864 -173 25796 8775 -20850 -16905 12349 19923 -8087 -28713 -6620
557 -6620 26280 16458 -22221 -26051 11284 25231 -7431 -26311 3766 28924 3604 -27852 -13002
570 -13002 18683 15507 -7903 -10003 3038 2469 -5827 -2400 5469 4134 626 1427 -532 -4551 -9
585 -9 8475 7043 -78 -1102 -436 -3243 -488 7188 3806 -6120 382 13528 1791 -20363 -7456
600 -7456 26841 22410 -16758 -22956 12974 24559 -6758 -20457 9190 27819 2075 -24117 -11062
613 -11062 16110 18687 -397 -13551 -5840 12146 14221 -7476 -19869 4830 31063 10030 -28443
626 -28443 -18420 23030 21792 -17340 -20098 17703 23520 -14451 -27545 4302 23652 5214 -10421
$$ packed form
532A1947l0883n566L3589J6788l0631k5665K4710L0991j8436l5280J1324M0044
544B2932J045l9499j5342L0691K5969j7021k9625L945K9254P574k8010k0626K2093
557f620L2900r822l8679l830L7335J3947l2662j8880L0077K5158k5320l1456J4850
570a3002L1685l176k3410k100J3041n69q296L427P869j335l508Q01j959m019M542
585iQ484j432p121j024O66k807K755P676l382r926O502J3146j1737k2154J2907
600g456L4297m431l9168o198L5930J1585l1317j3699K9647J8629k5744k6192J3055
613a1062K7172K577j9084j3154P711J7986K075k1697j2393K4699K6233k1033l8473
626b8443J0023M1450j238l9132k758L7801N817l7971j3094L1847J9350j8438j5635
$$ plain form
639 -10421 -3532 1235 -2912 791 6266 -892 -5247 5076 6605 -10527 -14535 5613 13973 -2824
653 -2824 -10445 2436 4461 -9044 -7386 7609 6030 -5058 842 6609 -11193 -20953 6970 28333
667 28333 1572 -28056 -9386 18695 3645 -21231 -5851 20914 10596 -16244 -16624 1423
679 1423 9164 5929 286 -6873 -5313 7436 5300 -17870 -18042 19160 32763 -9328 -39525 -6656
693 -6656 28931 7817 -20938 -521 24822 1117 -29578 -12435 20296 17768 -2437 -6465 -4659
706 -4659 -8519 -2402 10482 5799 -6400 1419 11992 -4562 -22069 -3302 23063 13883 -8760
719 -8760 -6303 2972 -6343 -10175 9185 18826 1502 -9349 -1173 -3656 -15000 1217 30031 17932
733 17932 -22272 -25147 8571 17648 -3960 -6707 12980 12007 -10541 -16860 -2427 7804 10359
$$ packed form
639a0421O889M767m147L703N475p158m355J0323J529j7132m008K0148Q360j6797
653b824p621J2881K025j3505J658J4995j579j1088N900N767j7802r760K7923K1363
667B8333k6761k9628J8670K8081j5050k4876J5380K6765j0318k6840l80J8047
679A423P741l235n643p159J560J2749k136k3170j72L7202J3603m2091l0197L2869
693f656L5587k1114k8755K0417K5343k3705l0695J7143L2731k528k0205m028J806
706d659l860O117J2884m683j2199P819J0573j6554j7507J8767K6365r180k2643
719h760K457R275r315l832J9360R641j7324j0851Q176k483j1344J6217K8814j2099
733A7932m0204k875L3718R077k1608k747J9687r73k2548o319J4433J0231K555
$$ plain form
746 10359 10232 -1259 -15875 -7769 11419 5046 -12937 1660 28310 9119 -34375 -27815 21044
759 21044 33221 -2183 -18997 300 6536 -10987 -11571 10458 18081 2996 -9477 -11397 -9226
772 -9226 1894 16356 10420 -10623 -11483 6967 6094 -13955 -11067 14902 18481 -6437 -17553 -4376
786 -4376 2601 -1645 3949 11779 793 -13501 -6863 4158 -1285 -3763 11405 14126 -11639 -25782
800 -25782 -1812 21253 8260 -12738 -7697 6380 3213 -6404 -5443 814 4742 7170 2137 -10819
814 -10819 -11233 6869 13294 -5575 -13902 7820 18843 -7684 -27515 -2234 28117 14113 -18243
827 -18243 -17324 7227 13024 -1236 -7098 1081 6663 3377 -3488 -6887 -1004 9586 7768 -7680
841 -7680 -10648 7798 15961 -3909 -18581 -940 19754 9681 -10797 -8376 5044 4159 -1839
$$ packed form
746A0359j27j1491j4616Q106J9188o373j7983J4597K6650j9191m3494O560M8859
759B1044J2177l5404j6814J9297O236j7523n84K2029P623j5085j2473j920K171
772i226J1120J4462n936k1043q60J8450q73k0049K888K5969L579k4918j1116J3177
786d376O977m246N594P830j0986j4294O638J1021n443k478J5168K721k5765j4143
800b5782K3970K3065j2993k0998N041J4077l167r617R61O257L928K428n033j2956
814a0819m14J8102O425j8869q327K1722J1023k6527j9831K5281L0351j4004l2356
827a8243R19K4551N797j4260n862Q179N582l286o865l399N883J0590j818j5448
841g680k968J8446Q163j9870j4672J7641K0694j0073k0478K421J3420q85n998
$$ plain form
854 -1839 3127 6772 -1730 -6317 1833 5074 -2916 -2595 8447 7173 -7792 -9026 7120 11518 -3579
869 -3579 -10509 2573 12604 3941 -9091 -9571 520 10312 9942 -2583 -12826 -5004 9612 6049
883 6049 -8569 -4702 12871 8863 -15613 -18249 9579 22643 98 -20302 -7732 12654 8194
896 8194 -9571 -11308 3351 11629 2714 -11064 -11653 2282 11144 1598 -10314 -3457 9396 1765
910 1765 -15755 -9840 13804 15914 -7580 -18741 -3597 8706 2557 -3117 1584 1410 -6485 -5948
924 -5948 3258 4164 -3044 -2170 4426 739 -8377 -5384 5808 6237 -3341 -5784 1336 4348 -1536 -6683
940 -6683 -2993 6382 10460 1117 -12769 -10981 7670 16458 1089 -13483 -3804 11399 3955 -11820
954 -11820 -5168 14766 12784 -9889 -17179 2544 18285 7475 -11464 -10214 7569 13916 -699
$$ packed form
854a839M966L645q502m587Q150L241p990L21J1042j274j4965j234J6146M398j5097
869c579o930J3082J0031q663j3032m80J0091R792l70j2525j0243P822J4616l563
883F049j4618L867J7573m008k4476k636K7828J3064k2545k0400J2570K0386m460
896H194j7765j737J4659Q278q915j3778n89J3935Q862r546j1912O857J2853p631
910A765j7520N915K3644K110k3494j1161J5144J2303o149n674M701j74p895N37
924e948R206R06p208Q74O596l687r116K993J1192M29r578k443P120L012n884n147
940f683L690R375M078r343j3886J788J8651Q788j5369j4572R679J5203p444j5775
954a1820O652J9934j982k2673p290J9723J5741j0810j8939J250J7783O347j4615
$$ plain form
967 -699 -13587 -3597 14606 11604 -8496 -13105 5006 14477 -249 -11891 749 14745 4148
980 4148 -13106 -7603 10803 12335 -2195 -8603 -1383 3981 1983 925 2285 286 -3254 -1628
994 -1628 2948 2778 -1199 -1661 1831 2296 -1777 -3615 865 5261 1644 -5753 -4772 4702 7235 -3715
1010 -3715 -11224 -825 12640 6042 -12122 -13056 5822 14674 -456 -14402 -5030 10810 6178
1023 6178 -10711 -10482 7654 13430 -4653 -18562 -4710 16241 10898 -12475 -16872 4314 16236
1036 16236 131 -16242 -5853 12931 8433 -11044 -12308 5644 12047 -2917 -12865 -1707 10739
1049 10739 3855 -9870 -7749 5444 8417 -1627 -7571 -2035 3808 1704 -1595 115 1619 -1462
1063 -1462 -3428 699 4444 855 -3909 -1355 3852 1738 -4083 -2072 5567 4861 -4722 -7058 3518
$$ packed form
967f99j2888R990J8203l002k0100m609J8111R471j4726j1642J2640J3996j0597
980D148j7254N503J8406J532j4530o408P220N364j998j058J360j999l540J626
994a628M576j70l977m62L492M65m073j838M480M396l617p397R81R474K533j0950
1010c715p509J0399J3465o598j8164r34J8878Q852j5130j3946R372J5840m632
1023F178j6889K29J8136N776j8083j3909J3852K0951n343k3373m397K1186J1922
1036A6236j6105j6373J0389J8784m498j9477j264J7952O403j4964r948J1158J2446
1049A0739o884j3725K121J3193K973j0044n944N536N843k104l299J710J504l081
1063a462j966M127L745l589m764K554N207k114n821K011P639p06r583k336J0576
$$ plain form
1078 3518 10229 540 -10499 -3936 10847 9442 -7093 -11995 3252 14368 3031 -12137 -6115
1091 -6115 10925 10358 -7114 -11779 4984 15505 1365 -15100 -6489 13906 12924 -7852 -14863
1104 -14863 2680 15665 3422 -12785 -6341 10933 9990 -6793 -10860 3656 11999 762 -10282
1117 -10282 -3373 8994 6408 -5763 -7381 2745 7421 219 -5774 -1770 3882 1871 -2648 -1270
1131 -1270 2489 788 -3255 -1434 3358 1747 -4012 -3228 3540 3640 -4006 -5620 2941 6548 -2672
1146 -2672 -9277 -461 9658 3084 -10182 -7829 6984 9895 -4169 -12231 -1148 10963 4184
1159 4184 -10749 -9212 6755 11471 -3688 -14408 -2396 13271 6222 -12694 -11564 8716 14080
1172 14080 -5091 -16756 -1315 15066 5585 -12618 -9386 7901 9797 -5126 -10943 1029 10243
$$ packed form
1078C518O711r689j1039O563J4783j405j6535m902J5247J1116j1337j5168O022
1091f115J7040n67j7472m665J6763J0521j4140j6465Q611K0395r82k0776p011
1104a4863J7543J2985j2243j6207O444J7274r43j6783m067J4516Q343j1237j1044
1117a0282O909J2367k586j2171j618J0126M676p202n993M004N652k011m519J378
1131a270L759j701m043J821M792j611n759P84O768J00p646j614Q561L607r220
1146b672o605Q816J0119o574j3266K353J4813K911j4064q062J1083J2111o779
1159D184j4933J537J5967M716j5159j0720J2012J5667p049j8916J130K0280N364
1172A4080j9171j1665J5441J6381r481j8203L232J7287J896j4923n817J1972R214
$$ plain form
1185 10243 2608 -8779 -6513 4879 7806 -1260 -7413 -1218 6553 2728 -5980 -4191 5056 5587
1199 5587 -2942 -4786 2309 3724 -2696 -2724 4858 4758 -4208 -5208 4075 6090 -2863 -5123 4487 7755
1215 7755 -2577 -8732 114 9570 4839 -5504 -5525 3365 7220 132 -7238 -2406 9347 8980 -6195
1230 -6195 -12788 2167 15326 3670 -13324 -5518 13696 9097 -12271 -12499 9693 16680 -2416
1243 -2416 -14983 -2834 11233 5656 -6745 -5869 4836 8232 -730 -9618 -5257 7753 10355 -2798
1257 -2798 -11287 -821 10035 1376 -10668 -2655 11722 5526 -10612 -8473 5785 6219 -4088
1270 -4088 -3233 4813 1384 -7453 -4010 5078 3213 -3723 -1638 3128 -1013 -6352 -2226 4264 3579
1285 3579 -867 -3305 -3864 -1779 2773 2300 -4122 -3338 5990 4910 -10158 -12224 7048 15865 -2687
$$ packed form
1185A0243p635j1387K266J1392K927r066o153O195P771l825q708J789R247N31
1199E587q529j844P095J415o420k8P582j00q966j000R283K015q953k260R610L268
1215G755j0332o155Q846R456m731j0343k1Q890L855p088p370M832J1753l67j5175
1230f195o593J4955J3159j1656j6994P806J9214m599k1368k28K2192O987j9096
1243b416j2567J2149J4067n577j2401Q76J0705L396q962q888M361J3010K602j3153
1257b798q489J0466J0856q659j2044Q013J4377o196j6138K139J4258M34j0307
1270d088Q55Q046l429q837L443R088j865o936K085M766m141n339M126O490o85
1285C579m446k438n59K085M552m73o422P84R328j080j5068k066J9272Q817j8552
$$ plain form
1300 -2687 -16402 -1379 13516 864 -14759 -3600 14475 8012 -10981 -11986 2693 9317 2358
1313 2358 -5135 -4280 2611 5887 -1351 -10187 -3346 12698 10723 -9569 -14434 5089 13979 -3150
1327 -3150 -12744 4008 15176 -1071 -15286 -2959 11798 5305 -5239 -935 4533 -1170 -4950
1340 -4950 1272 5026 1148 -12 2446 -602 -4838 -601 5191 2927 -365 1828 716 -5158 -2748
1355 -2748 6648 5127 -4614 -1682 8685 1971 -13202 -6070 15053 12646 -9640 -12496 6440 10239
1369 10239 -6395 -10189 6547 13649 -171 -11838 -6342 4220 7195 2869 -3540 -4570 2574
1382 2574 5792 -4749 -12115 2335 18152 5285 -17996 -12246 11448 11011 -9313 -8990 10621
1395 10621 10732 -10550 -15656 2401 12336 3049 -4716 -2473 -1397 -3248 -947 2170 907 997 3019
$$ packed form
1300b687j3715J5023J4895j2652j5623J1159J8075o463j8993j005J4679O624o959
1313B358p493Q55O891L276p238q836O841J6044j975k0292m865J9523Q890j7129
1327c150r594J6752J1168j6247j4215J2327J4757o493j0544M304N468n703l780
1340d950O222L754l878j160K458l048m236M237N792k264l292K193j112n874K410
1355b748R396j521r741K932J0367o714j5173P132K1123k407k2286k856J8936L799
1369A0239j6634l794J6736P102j3820j1667N496J0562K975m326o409j030P144
1382B574L218j0541p366J4450J5817j2867k3281N750K3694m37k0324L23J9611
1395A0621J11k1282n106J8057R935r287p765K243J076j851K301L117j263R0K022
$$ plain form
1410 3019 -1822 -9337 -4829 6893 6654 -2783 -3235 1985 -2418 -8481 -121 10110 3336 -7038 -2140
1425 -2140 4192 -4581 -9984 4683 15886 1544 -15175 -7008 8423 4636 -6048 -1391 8252
1438 8252 3578 -7640 -8123 91 6358 6876 1273 -6905 -6216 4240 6353 -5074 -7323 8637 14173
1453 14173 -5923 -19361 -1585 17893 7449 -11115 -5582 9132 4070 -10049 -6243 8764
1465 8764 10832 -655 -8024 -5199 1506 5766 3942 -2236 -3208 3303 3952 -5128 -6973 5027 10842
1480 10842 -399 -8540 -482 5686 -1630 -5237 4432 8193 -2435 -7554 1135 4802 -3051 -3319
1494 -3319 7173 6968 -6797 -10003 3034 9225 145 -5826 234 4505 17 -3933 -2124 1212
$$ packed form
1410C019m841p515M508J1722k39r437m52N220m403o063Q360J0231o774j0374M898
1425b140O332q773n403J4667J1203j4342j6719Q167J5431l787j0684M657R643
1438H252m674j1218m83Q214O267N18n603q178O89J0456K113j1427k249J5960N536
1453A4173k0096j3438J7776J9478j0444j8564N533J4714n062j4119L806J5007
1465H764K068j1487p369K825O705M260j824o178r72O511O49r080j845J2000N815
1480A0842j1241q141Q058O168p316l607R669L761j0628n119Q689L667p853k68
1494c319J0492k05j3765l206J3037O191r080n971O060M271m488l950J809L336
$$ [...]
8191H
##END NTUPLES=NMR FID
##END=
