##TITLE=1H_PR_III
 D2O,8 sc, 
 1.10.2021
##JCAMPDX= 6.0         $$ Bruker NMR JCAMP-DX V2.0
##DATA TYPE= NMR FID
##DATA CLASS= NTUPLES
##ORIGIN= UXNMR, Bruker Analytische Messtechnik GmbH
##OWNER= root
$$ XWIN-NMR		Version 3.5
$$ Fri Oct  1 13:37:55 2021 Russian Standard Time (UT+4h)  she@DPX200
##.OBSERVE FREQUENCY= 200.1313468511
##.OBSERVE NUCLEUS= ^1H
##.DELAY= (6, 6)
##.ACQUISITION MODE= SIMULTANEOUS
##.ACQUISITION SCHEME= undefined
##.AVERAGES= 8
##.DIGITISER RES= 18
##SPECTROMETER/DATA SYSTEM= spect
##.PULSE SEQUENCE= zg30
##.SOLVENT NAME= D2O
##.SHIFT REFERENCE= (INTERNAL, D2O, 0, 15.7039)
##AUDIT TRAIL= $$ (NUMBER, WHEN, WHO, WHERE, WHAT)
$$ ##TITLE= Audit trail, XWIN-NMR		Version 3.5
$$ ##JCAMPDX= 5.01
$$ ##ORIGIN= Bruker BioSpin GmbH
$$ ##OWNER= she
$$ F:/spectra/data/she/nmr/H-F/1/audita.txt
$$ ##AUDIT TRAIL=  $$ (NUMBER, WHEN, WHO, WHERE, WHAT)
(   1,<2021-10-01 13:36:45.06 +0400>,<she>,<DPX200>,
      <created by zg, POWCHK disabled, PULCHK disabled
       configuration hash MD5:
       00 E9 B6 7A A2 85 ED C7 34 08 36 98 17 FE 4E 26
       data hash MD5: 16K
       9D E0 BC 00 1C E6 F2 84 7D 75 E2 52 BC 06 0A B0>)
$$ ##END=
$$ 
$$ hash MD5
$$ 05 E1 3B 9E E4 11 B1 2E B2 59 A2 5C 74 B3 DB FA
##$RELAX= 
##$RELAX= 
##$RELAX= 
##$RELAX= 
##$RELAX= 
##$RELAX= 
$$ Bruker specific parameters
$$ --------------------------
##$DU= <F:/spectra>
##$EXPNO= 1
##$NAME= <H-F>
##$PROCNO= 1
##$TYPE= <nmr>
##$USER= <she>
##$AMP= (0..31)
100 100 100 100 100 100 100 100 100 100 100 100 100 100 100 100 100 100 
100 100 100 100 100 100 100 100 100 100 100 100 100 100 
##$AQSEQ= 0
##$AQ_mod= 1
##$AUNM= <au_zg>
##$AUTOPOS= <>
##$BF1= 200.13
##$BF2= 200.13
##$BF3= 200.13
##$BF4= 200.13
##$BF5= 200.13
##$BF6= 200.13
##$BF7= 200.13
##$BF8= 200.13
##$BYTORDA= 1
##$CFDGTYP= 0
##$CFRGTYP= 5
##$CHEMSTR= <none>
##$CNST= (0..31)
1 1 145 1 1 1 1 1 1 1 1 1 1 1 1 1 1 1 1 1 1 1 1 1 1 1 1 1 1 1 1 1 
##$CPDPRG= <>
##$CPDPRG1= <>
##$CPDPRG2= <>
##$CPDPRG3= <>
##$CPDPRG4= <mlev>
##$CPDPRG5= <mlev>
##$CPDPRG6= <mlev>
##$CPDPRG7= <mlev>
##$CPDPRG8= <mlev>
##$CPDPRGB= <>
##$CPDPRGT= <>
##$D= (0..31)
0 1.2 0 0 0 0 0 0 0 0.06 0 0.03 0 0 0 0 0.0002 0 0 0 0 0 0 0 0 0 0 0 0 
0 0 0 
##$DATE= 1633081004
##$DBL= (0..7)
120 120 120 120 120 120 120 120 
##$DBP= (0..7)
150 150 150 150 150 150 150 150 
##$DBP07= 0
##$DBPNAM0= <>
##$DBPNAM1= <>
##$DBPNAM2= <>
##$DBPNAM3= <>
##$DBPNAM4= <>
##$DBPNAM5= <>
##$DBPNAM6= <>
##$DBPNAM7= <>
##$DBPOAL= (0..7)
0.5 0.5 0.5 0.5 0.5 0.5 0.5 0.5 
##$DBPOFFS= (0..7)
0 0 0 0 0 0 0 0 
##$DE= 6
##$DECBNUC= <off>
##$DECIM= 32
##$DECNUC= <off>
##$DECSTAT= 4
##$DIGMOD= 1
##$DIGTYP= 9
##$DL= (0..7)
0 120 120 120 120 120 120 120 
##$DP= (0..7)
150 150 150 150 150 150 150 150 
##$DP07= 0
##$DPNAME0= <>
##$DPNAME1= <>
##$DPNAME2= <>
##$DPNAME3= <>
##$DPNAME4= <>
##$DPNAME5= <>
##$DPNAME6= <>
##$DPNAME7= <>
##$DPOAL= (0..7)
0.5 0.5 0.5 0.5 0.5 0.5 0.5 0.5 
##$DPOFFS= (0..7)
0 0 0 0 0 0 0 0 
##$DQDMODE= 0
##$DR= 18
##$DS= 0
##$DSLIST= <SSSSSSSSSSSSSSS>
$$ [...]
##$SUBNAM2= <"">
##$SUBNAM3= <"">
##$SUBNAM4= <"">
##$SUBNAM5= <"">
##$SUBNAM6= <"">
##$SUBNAM7= <"">
##$SUBNAM8= <"">
##$SUBNAM9= <"">
##$SW= 18.0517286264689
##$SWIBOX= (0..15)
0 0 2 0 0 0 0 0 0 0 0 0 0 0 0 0 
##$SW_h= 3612.71676300578
##$TD= 16384
##$TD0= 1
##$TE= 0
##$TE2= 300
##$TE3= 300
##$TEG= 300
##$TL= (0..7)
0 120 120 120 120 120 120 120 
##$TP= (0..7)
150 150 150 150 150 150 150 150 
##$TP07= 0
##$TPNAME0= <>
##$TPNAME1= <>
##$TPNAME2= <>
##$TPNAME3= <>
##$TPNAME4= <>
##$TPNAME5= <>
##$TPNAME6= <>
##$TPNAME7= <>
##$TPOAL= (0..7)
0.5 0.5 0.5 0.5 0.5 0.5 0.5 0.5 
##$TPOFFS= (0..7)
0 0 0 0 0 0 0 0 
##$TUNHIN= 0
##$TUNHOUT= 0
##$TUNXOUT= 0
##$USERA1= <user>
##$USERA2= <user>
##$USERA3= <user>
##$USERA4= <user>
##$USERA5= <user>
##$V9= 5
##$VALIST= <valist>
##$VCLIST= <CCCCCCCCCCCCCCC>
##$VD= 0
##$VDLIST= <DDDDDDDDDDDDDDD>
##$VPLIST= <PPPPPPPPPPPPPPP>
##$VTLIST= <TTTTTTTTTTTTTTT>
##$WBST= 1024
##$WBSW= 4
##$XGAIN= (0..3)
0 0 0 0 
##$XL= 0
##$YL= 0
##$YMAX_a= 515910
##$YMIN_a= -703925
##$ZGOPTNS= <>
##$ZL1= 120
##$ZL2= 120
##$ZL3= 120
##$ZL4= 120
##$ABSF1= 10
##$ABSF2= 0
##$ABSG= 5
##$ABSL= 3
##$ALPHA= 0
##$AQORDER= 0
##$ASSFAC= 0
##$ASSFACI= 0
##$ASSFACX= 0
##$ASSWID= 0
##$AUNMP= <proc_1d>
##$AZFE= 0.1
##$AZFW= 0.1
##$BCFW= 1
##$BC_mod= 2
##$BYTORDP= 1
##$COROFFS= 0
##$CY= 11.3945322036743
##$DATMOD= 1
##$DC= 2
##$DFILT= <>
##$DTYPP= 0
##$F1P= 2.36226072786647
##$F2P= -0.459571619588291
##$FCOR= 0.5
##$FTSIZE= 0
##$FT_mod= 4
##$GAMMA= 1
##$GB= 0.15
##$INTBC= 1
##$INTSCL= 1
##$ISEN= 128
##$LB= 0.24
##$LEV0= 0
##$LPBIN= 0
##$MAXI= 10000
##$MC2= 0
##$MEAN= 0
##$ME_mod= 0
##$MI= 1.114404
##$NCOEF= 0
##$NC_proc= 0
##$NLEV= 6
##$NOISF1= 3.799351
##$NOISF2= 2.8
##$NSP= 1
##$NTH_PI= 0
##$NZP= 0
##$OFFSET= 15.70392
##$PC= 1
##$PHC0= -14799.28
##$PHC1= 11.20083
##$PH_mod= 1
##$PKNL= yes
##$PPARMOD= 0
##$PSCAL= 0
##$PSIGN= 0
##$REVERSE= no
##$SF= 200.130013532006
##$SI= 16384
##$SIGF1= 3
##$SIGF2= 2
##$SINO= 400
##$SIOLD= 16384
##$SREGLST= <1H.CDCl3>
##$SSB= 0
##$STSI= 0
##$STSR= 0
##$SW_p= 3612.71676300578
##$SYMM= 0
##$S_DEV= 0
##$TDeff= 0
##$TDoff= 0
##$TI= <>
##$TILT= no
##$TM1= 0
##$TM2= 0
##$TOPLEV= 0
##$USERP1= <user>
##$USERP2= <user>
##$USERP3= <user>
##$USERP4= <user>
##$USERP5= <user>
##$WDW= 1
##$XDIM= 8192
##$YMAX_p= 0
##$YMIN_p= 0
$$ End of Bruker specific parameters
$$ ---------------------------------
##NTUPLES= NMR FID
##VAR_NAME=  TIME,          FID/REAL,        FID/IMAG
##SYMBOL=    X,             R,               I
##VAR_TYPE=  INDEPENDENT,   DEPENDENT,       DEPENDENT
##VAR_FORM=  AFFN,          ASDF,            ASDF
##VAR_DIM=   8192,          8192,            8192
##UNITS=     SECONDS,       ARBITRARY UNITS, ARBITRARY UNITS
##FACTOR=    0.0002768,     1,               1
##FIRST=     0,             0,               0
##LAST=      2.2672688,     0,               0
##MIN=       0,             -703925,         0
##MAX=       2.2672688,     515910,          0
$$ Real data points
##PAGE= N=1
##DATA TABLE= (X++(R..R)), XYDATA
$$ plain form
0 0 0 0 0 0 0 0 0 0 0 8 -8 8 -16 16 -24 24 -32 40 -48 56 -64 80 -96 112 -134 152 -176 208 -240 275 -315
31 -315 358 -408 462 -522 590 -661 742 -830 924 -1030 1144 -1270 1406 -1554 1718 -1894 2091
48 2091 -2306 2539 -2797 3080 -3396 3748 -4138 4582 -5084 5660 -6331 7115 -8061 9213
62 9213 -10660 12543 -15097 18784 -24604 35214 -60923 263756 113190 -365170 -237219 -426535
74 -426535 -345271 85588 294831 272221 500741 292824 -338883 -512567 -279074 -285149 -82307
85 -82307 380281 446856 248726 235378 -51716 -521788 -467051 -112463 5548 233091 515910
96 515910 329049 -20449 -99912 -291828 -521972 -270575 140097 247832 345198 405991 87348
107 87348 -252466 -275452 -313937 -311997 55794 390538 334706 238452 151661 -174645 -423224
$$ packed form
0@%%%%%%%%%Qj6J6k4L2m0M8n6P2q8J04j20J44j76K08k46K86l28L84m48N15n90
31c15O73p66Q70r84J112j251J403j572J754j954K174k414K676k960L272l612L985
48B091m397M845n336N877o476P144p886Q720r666J0744j1991J3446j5176J7274
62I213j9873K3203k7640L3881m3388N9818r6137L24679j50566m78360J27951j89316
74d26535Q1264M30859K09243k2610K28520k07917o31707j73684K33493o075K02842
85h2307M62588O6575j98130j3348k87094m70072N4737L54588J18011K27543K82819
96E15910j86861l49498p9463j91916k30144K51397M10672J07735R7366O0793l18643
107H7348l39814k2986l8485J940L67791L34744n5832r6254q6791l26306k48579
$$ plain form
118 -423224 -319639 -169113 -19604 286634 420640 210357 36053 -66778 -320087 -423997
128 -423997 -154783 125117 249044 353330 285888 728 -175146 -230479 -341909 -269734
138 -269734 88740 321628 289933 217839 67970 -188658 -292777 -233748 -182435 -7087 300119
149 300119 384774 200949 19337 -150858 -318668 -280620 -90649 32827 166640 329839
159 329839 270406 7341 -187118 -277934 -281609 -104370 120319 198526 233433 258224 89475
170 89475 -191364 -311117 -255626 -113675 95257 239168 222820 158434 69607 -130833 -304965
181 -304965 -266047 -89570 89805 232403 267519 166747 18453 -129471 -254167 -252919 -99440
192 -99440 85445 210947 249314 169719 1687 -162406 -250298 -220772 -82975 81045 202022
$$ packed form
118d23224J03585J50526J49509L06238J34006k10283j74304j02831k53309j03910
128d23997K69214K79900J23927J04286o7442k85160j75874n5333j11430P2175
138b69734L58474K32888l1695p2094j49869k56628j04119N9029N1313J75348L07206
149C00119Q4655j83825j81612j70195j67810L8048J89971J23476J33813J63199
159C29839n9433k63065j94459r0816l675J77239K24689P8207L4907K4791j68749
170H9475k80839j19753N5491J41951K08932J43911j6348o4386q8827k00440j74132
181c04965L8918J76477J79375J42598L5116j00772j48294j47924j24696J248J53479
192i9440J84885J25502L8367p9595j68032j64093q7892K9526J37797J64020J20977
$$ plain form
203 202022 247215 176041 8428 -153696 -239856 -218858 -77866 98018 196875 215463 158599
214 158599 -406 -168625 -225425 -195608 -100320 83549 233005 222849 125881 5277 -148191
225 -148191 -227186 -163957 -69514 39320 207298 268034 117949 -53469 -141791 -208550 -186264
236 -186264 -44513 69351 147583 242404 184747 -50706 -190059 -174995 -154630 -71497 100841
247 100841 180274 165108 152827 23891 -197187 -240365 -124292 -47683 58673 207396 194311
258 194311 71558 8852 -98823 -242970 -185488 409 90298 157973 217857 99969 -73112
269 -73112 -109617 -150178 -208905 -69401 140876 175058 150276 127285 -31845 -181516 -148802
280 -148802 -109141 -92197 81861 236120 159030 53017 6771 -134800 -228796 -113634 -2446
$$ packed form
203B02022M5193p1174j67613j62124q6160K0998J40992J75884R8857J8588n6864
214A58599j59005j68219n6800K9817R5288J83869J49456j0156r6968j20604j53468
225a48191p8995O3229R4443J08834J67978O0736j50085j71418q8322o6759K2286
236a86264J41751J13864P8232R4821n7657k35453j39353J5064K0365Q3133J72338
247A00841P9433j5166j2281j28936k21078m3178J16073P6609J06356J48723j3085
258A94311j22753o2706j07675j44147N7482J85897Q9889O7675N9884j17888j73081
269g3112l6505m0561n8727J39504K10277L4182k4782k2991j59130j49671L2714
280a48802L9661J6944J74058J54259p7090j06013m6246j41571r3996J15162J11188
$$ plain form
291 -2446 42266 170587 217907 51289 -67983 -81655 -174126 -190468 2226 134074 127378
302 127378 160919 120478 -72808 -156257 -113024 -138130 -84826 128250 203130 108300 71018
313 71018 -1889 -170013 -182868 -62498 -30699 37611 199656 187076 26839 -37933 -99096
324 -99096 -203789 -126279 48360 74751 92841 181876 103642 -84237 -132517 -134290 -148532 -7474
336 -7474 155928 122789 79489 112207 -2347 -176493 -160379 -79100 -35092 98133 196403
347 196403 97302 9154 8971 -100050 -204993 -100588 29652 66704 145008 172041 25182
358 25182 -83111 -77077 -128242 -143662 8903 122652 110256 123604 89745 -76794 -158980
369 -158980 -99596 -78362 -39012 104305 163312 91573 48473 -15352 -148736 -161486 -46109
$$ packed form
291b446M4712J28321M7320j66618j19272j3672r2471j6342J92694J31848o696
302A27378L3541m0441j93286q3449M3233k5106N3304K13076P4880r4830l7282
313G1018p2907j68124j2855J20370L1799O8310J62045j2580j60237o4772o1163
324i9096j04693P7510J74639K6391J8090Q9035p8234j87879m8280j773j4242J41058
336g474J63402l3139m3300L2718j14554j74146J6114Q1279M4008J33225R8270
347A96403r9101q8148j83j09021j04943J04405J30240L7052P8304K7033j46859
358B5182j08293O034n1165j5420J52565J13749j2396J3348l3859j66539q2186
369a58980N9384K1234L9350J43317N9007p1739m3100o3825j33384j2750J15377
$$ plain form
380 -46109 10471 55055 152765 139279 10670 -55215 -91701 -150922 -99692 34689 87609 107211
392 107211 137853 53270 -91924 -119835 -90860 -86966 -11138 107135 129258 97746 57741 -56491
404 -56491 -156853 -114216 -34412 -3888 64242 140040 110300 27804 -43322 -125175 -146817 -49768
416 -49768 45722 71431 101284 112732 36656 -58710 -107771 -128489 -84451 33791 113221 104367
428 104367 75301 32918 -47441 -108359 -111930 -75173 7574 109665 137213 74875 1780 -50434
440 -50434 -94296 -106495 -67244 6673 90108 134012 93896 818 -71511 -98326 -92138 -56213
452 -56213 11272 85842 121960 90132 10826 -66433 -107437 -97864 -45242 21962 81066 112280
464 112280 85350 7317 -64242 -98917 -99957 -54010 31526 94029 103326 75370 11129 -68310
$$ packed form
380d6109N6580M4584R7710j3486j28609o5885l6486n9221N1230J34381N2920J9602
392A07211L0642q4583j45194k7911K8975L894P5828J18273K2123l1512m0005j14232
404e6491j00362M2637P9804L0524O8130P5798k9740q2496p1126q1853k1642R7049
416d9768R5490K5709K9853J1448p6076r5366m9061k0718M4038J18242P9430q854
428A04367k9066m2383q0359o0918l571L6757Q2747J02091K7548o2338p3095n2214
440e0434m3862j2199L9251P3917Q3435M3904m0116r3078p2329k6815O188L5925
452e6213O7485P4570L6118l1828p9306p7259m1004R573N2622O7204N9104L1214
464A12280k6930p8033p1559l4675j040M5947Q5536O2503R297k7956o4241p9439
$$ plain form
476 -68310 -100935 -82319 -48000 14567 93166 113713 65611 5000 -58808 -110416 -91868 -22949
488 -22949 25672 67645 109059 82264 -2379 -63668 -96665 -100652 -32248 55735 74098 69747
500 69747 77558 24521 -70696 -105250 -85851 -44552 43018 109575 76407 31271 23179 -36314
512 -36314 -114449 -93915 -21842 28620 89894 111864 35757 -27171 -29001 -71853 -110681 -37530
524 -37530 51783 73133 92856 77648 -25401 -86030 -57438 -60987 -58002 36754 99991 70755
536 70755 53659 18867 -82314 -109973 -39956 -15047 1252 85272 106519 31687 -6555 -37630
548 -37630 -108567 -88444 13386 40304 44634 96479 67562 -35527 -61263 -56256 -85436 -35691
560 -35691 64763 72536 53482 69034 3913 -96113 -80275 -32673 -34191 21040 100258 74428
$$ packed form
476f8310l2625J8616L4319O2567P8599K0547m8102o0611o3808n1608J8548O8919
488b2949M8621M1973M1414k6795q4643o1289l2997l987O8404Q7983J8363m351
500F9747P811n3037r5217l4554J9399M1299Q7570O6557l3168m5136q092n9493
512c6314p8135K0534P2073N0462O1274K1970p6107o2928j830m2852l8828P3151
524c7530Q9313K1350J9723j5208j03049o0629K8592l549K985R4756O3237k9236
536G0755j7096l4792j01181k7659P0017K4909J6299Q4020K1247p4832l8242l1075
548c7630p0937K0123J01830K6918M330N1845k8917j03089k5736N007k9180M9745
560c5691J00454P773j9054J5552o5121j00026J5838M7602j518N5231P9218k5830
$$ plain form
572 74428 22947 9700 -55904 -113695 -49569 18226 14299 52833 99609 41372 -28148 -41858
584 -41858 -79522 -90053 3345 69655 48214 54922 62651 -15533 -75613 -59392 -57707 -36775 57169
597 57169 97065 42515 18556 9557 -57671 -88178 -41819 -13404 17624 91765 92094 3633 -33702
610 -33702 -31945 -69362 -66626 2632 37735 51499 84769 48215 -48353 -68498 -40644 -50621 -25408
623 -25408 51273 70287 48005 44351 -6020 -84472 -73841 -20016 -9194 23399 81031 62405
635 62405 8074 -7060 -42957 -88440 -49126 17888 32397 53269 76007 23872 -39485 -44400
647 -44400 -53083 -61988 -2346 59279 54999 46934 37657 -24591 -71702 -50904 -31168 -14979 41493
660 41493 74497 44340 17422 -5987 -60325 -77957 -28568 12417 32242 60693 56789 9834
$$ packed form
572G4428n1481j3247o5604n7791O4126O7795l927L8534M6776n8237o9520j3710
584d1858l7664j0531R3398O6310k1441O708P729p8184o0080J6221J685K0932R3944
597E7169L9896n4550k3959q999o7228l0507M6359K8415L1028P4141L29q8461l7335
610c3702J757l7417K736O9258L5103J3764L3270l6554r6568k0145K7854r977K5213
623b5408P6681J9014k2282l654n0371p8452J0631N3825J0822L2593N7632j8626
635F2405n4331j5134l5897m5483L9314O7014J4509K0872K2738n2135o3357m915
647d4400q683q905N9642O1625m280q065r277o2248m7111K0798J9736J6189N6472
660D1493L3004l0157k6918k3409n4338j7632M9389M0985J9825K8451l904m6955
$$ plain form
672 9834 -20915 -40132 -68963 -50972 15194 51938 50722 46061 19201 -26591 -47307 -50606 -46879
685 -46879 -4552 54697 67158 39450 10010 -23905 -52055 -50474 -30122 -3938 36745 66899
697 66899 51528 7606 -30078 -52146 -51489 -26258 5953 33713 54417 51798 16596 -29458 -57571
710 -57571 -53585 -22867 12256 36386 49136 44303 15384 -23157 -52740 -57624 -27541 16682 41919
723 41919 45981 40063 13683 -26641 -49936 -48698 -30222 9418 47482 51160 32597 11560 -23408
736 -23408 -54924 -47097 -18037 6220 36058 57281 37306 1364 -22113 -46812 -55343 -19340
748 -19340 21370 33124 43361 43856 5333 -33453 -41286 -44019 -31846 17462 51095 39208 26841
761 26841 13099 -28106 -52062 -35566 -20620 600 47410 60686 20983 -6472 -17801 -44986
$$ packed form
672I834l0749j9217k8831J7991O6166L6744j216m661k6860m5792k0716l299L727
685d6879M2327N9249J2461k7708k9440l3915k8150J581K0352K6184M0683L0154
697F6899j5371m3922l7684k2068O57K5231L2211K7760K0704k619l5202m6054k8113
710e7571L986L0718L5123K4130J2750m833k8919l8541k9583m884L0083M4223K5237
723D1919M062n918k6380m0324k3295J238J8476L9640L8064L678j8563k1037l4968
736b3408l1516P827K9060K4257K9838K1223j9975l5942k3477k4699q531L6003
748a9340M0710J1754J0237M95l8523l8786p833k733J2173M9308L3633j1887j2367
761B6841j3742m1205k3956J6496J4946K1220M6810J3276l9703k7455j1329k7185
$$ plain form
773 -44986 -46671 -10198 10295 26098 57809 44855 -14690 -37681 -30393 -38820 -23605 21332 35347
786 35347 33406 43389 11915 -48185 -50483 -20714 -16365 5145 46808 41780 16574 12528 -18965
799 -18965 -63046 -40637 4768 11222 27568 53072 25248 -14053 -15960 -33676 -55221 -13847
811 -13847 34759 30575 31039 37925 -3899 -41573 -29084 -27304 -30239 18249 54316 29804 14340
824 14340 11766 -29913 -54252 -22284 -3476 1427 39962 52860 9801 -10497 -10900 -42658 -47991
837 -47991 1893 26035 22807 39819 31092 -17684 -30696 -20386 -37423 -24956 31508 45190
849 45190 22691 20771 2485 -39466 -37001 -13024 -16981 3382 50418 43995 3785 -5917 -20926
862 -20926 -46509 -25232 8338 7048 21338 50622 24884 -22042 -27572 -28835 -34650 -1291 30610
$$ packed form
773d4986j685L6473K0493J5803L1711j2954n9545k2991P288q427J5215M4937J4015
786C5347j941R983l1474o0100k298K9769M349K1510M1663n028k5206m046l1493
799a8965m4081K2409M5405O454J6346K5504k7824l9301j907j7716k1545M1374
811a3847M8606m184M64O886m1824l7674J2489J780k935M8488L6067k4512j5464
824A4340k574m1679k4339L1968J8808M903L8535J2898m3059k0298m03l1758n333
837d7991M9884K4142l228J7012q727m8776j3012J0310j7037J2467N6464J3682
849D5190k2499j920j8286m1951K465K3977l957K0363M7036o423m0210r702j5009
862b0926k5583K1277L3570j290J4290K9284k5738m6926n530j263n815L3359L1901
$$ plain form
875 30610 21078 22266 33555 -2295 -43792 -34250 -17921 -9778 22374 41861 19200 8124 8539
888 8539 -25437 -49459 -21616 5361 13370 33753 36996 4217 -12887 -13535 -33673 -36108 2769
901 2769 26785 24380 30417 20101 -16925 -30874 -21978 -23351 -10947 25505 36253 19977 13404
914 13404 -2909 -33296 -35004 -13067 -1908 13630 36546 29195 3321 -7926 -19597 -35864
926 -35864 -24077 5640 20007 27337 30402 8972 -18038 -22492 -22673 -23625 -4012 23937 31295 24553
940 24553 10804 -14810 -31014 -22900 -11641 -4064 14796 32957 28265 7828 -13462 -30340 -28787
953 -28787 -9963 5851 14122 24047 27277 11310 -12965 -29589 -30383 -13745 8580 20967 22390
966 22390 19724 9484 -8870 -26604 -30456 -16304 7526 23825 25810 17519 4278 -10506 -21310
$$ packed form
875C0610r532J188J1289l5850m1497R542J6329Q143L2152J9487k2661j1076M15
888H539l3976k4022K7843K6977Q009K0383L243l2779j7104o48k0138k435L8877
901B769K4016k405O037j0316l7026j3949Q896j373J2404L6452J0748j6276o573
914A3404j6313l0387j708K1937J1159J5538K2916p351k5874j1247j1671j6267
926c5864J1787K9717J4367P330L065k1430k7010m454j81r52J9613K7949P358o742
940B4553j3749k5614j6204Q114J1259P577J8860J8161m692k0437k1290j6878J553
953b8787J8824J5814Q271R925L230j5967k4275j6624p94J6638K2325J2387J423
966B2390k666j0240j8354j7734l852J4152K3830J6299J985q291j3241j4784j0804
$$ plain form
979 -21310 -26328 -18887 3646 25303 28267 17590 3300 -13976 -24719 -21313 -12559 -77 20730
992 20730 30857 18020 657 -11385 -24348 -25793 -9006 6357 15124 26521 23272 -110 -16283
1005 -16283 -19599 -24439 -16175 10538 23611 19459 17723 5925 -17710 -23861 -15612 -13878 -631
1018 -631 26064 28450 10519 1867 -10317 -27663 -20741 -2609 1612 13559 31995 19644 -7361
1031 -7361 -14041 -18484 -24789 -6775 13595 12013 16833 26183 3803 -23747 -21756 -15806 -12460 10523
1045 10523 25941 13716 9528 11370 -13378 -32534 -16684 -1713 3365 21566 26305 4458 -3541
1058 -3541 -1933 -21973 -29883 -3099 14028 14194 23311 17963 -10075 -17130 -9686 -19327 -16088 14305
1072 14305 24371 13174 13997 4014 -22132 -22696 -6428 -7883 -439 25292 24551 3987 45 -9084
$$ packed form
979b1310n018P441K2533K1657K964j0677j4290j7276j0743L406Q754J2482K0807
992B0730J0127j2837j7363j2042j2963j445J6787J5363Q767J1397l249k3382j6173
1005a6283l316m840Q264K6713J3073m152j736j1798k3635o151Q249J734J3247
1018f31K6695K386j7931q652j2184j7346O922J8132M221J1947J8436j2351k7005
1031g361o680m443o305J8014K0370j582M820R350k2380k7550J991N950L346K2983
1045A0523J5418j2225m188J842k4748j9156J5850J4971N078J8201M739k1847p999
1058c541J608k0040p910K6784J7127J66R117n348k8038p055P444r641L239L0393
1072A4305J0066j1197Q23r983k6146n64J6268j455P444K5731p41k0564l942r129
$$ plain form
1086 -9084 -28289 -18554 5798 7024 10473 25592 13689 -11065 -11443 -12932 -23580 -6977 18546
1099 18546 15941 12021 17454 -1008 -23829 -15855 -7743 -11444 6728 27432 16249 3479 2906
1112 2906 -14369 -26800 -9012 3871 240 14635 26742 7608 -9154 -9225 -19643 -21377 4358
1125 4358 16052 7909 15162 17459 -6245 -19766 -13148 -14075 -7507 17424 21270 6154 7064 4739
1139 4739 -17165 -22470 -8426 -2985 6079 24576 18457 -2938 -4743 -6490 -20534 -15831 3457
1152 3457 8306 13373 21857 7392 -13898 -13049 -9635 -15126 -3995 14573 15242 12426 11326 -5702
1166 -5702 -21360 -14180 -5099 -3442 8520 20357 12697 3148 -1632 -14246 -20829 -8123 4015
1179 4015 7675 15131 16968 3535 -8652 -11289 -15161 -13110 2433 13164 13449 12980 7029 -8203
$$ packed form
1086i084j9205R735K4352J226L449J5119j1903k4754l78j489j0648J6603K5523
1099A8546k605l920N433j8462k2821P974Q112l701J8172K0704j1183j2770n73
1112B906j7275j2431J7788J2883l631J4395J2107j9134j6762p1j0418j734K5735
1125D358J1694q143P253K297k3704j3521O618r27O568K4931L846j5116R10k325
1139D739k1904n305J4044N441R064J8497o119k1395j805j747j4044M703J9288
1152C457M849N067Q484j4465k1290Q49L414n491J1131J8568O69k816j100j7028
1166e702j5658P180R081J657J1962J1837p660r549m780j2614o583J2706J2138
1179D015L660P456J837j3433j2187k637l872K051J5543J0731K85m69n951j5232
$$ plain form
1193 -8203 -16004 -12480 -8031 -1170 10994 16386 11419 4797 -4800 -16096 -16868 -6153 2986 9224
1207 9224 14336 12326 3761 -5654 -13262 -16647 -9468 4305 13018 13189 9812 3156 -5259 -12411 -15095
1222 -15095 -9923 2282 13417 15958 9391 52 -6814 -10831 -12778 -9294 1015 11833 15851 11412
1236 11412 913 -9488 -12451 -9967 -6979 33 11004 15524 10488 1962 -8123 -15441 -11781 -2640
1250 -2640 2225 7632 14400 11374 536 -7194 -12891 -14529 -5075 7005 9173 10052 11770 2503 -10093
1265 -10093 -12112 -10419 -7657 3886 14450 11232 6255 3852 -6986 -16173 -9673 -2119 510 10159
1279 10159 16031 6685 -1927 -4740 -12742 -15088 -1553 7348 6171 10940 12223 -1068 -9942 -8843
1293 -8843 -11817 -8015 8525 13804 6149 6470 4583 -9138 -14043 -7233 -5280 1201 15852 14308
$$ packed form
1193h203p801L524M449O861J2164N392m967o622r597j1296p72J0715R139O238
1207I224N112k010q565r415p608l385P179J3773Q713J71l377o656q415p152k684
1222a5095N172J2205J1135K541o567r339o866m017j947L484J0309J0818M018m439
1236A1412j0499j0401k963K484K988P012J0971M520n036q526j0085p318L660R141
1250b640M865N407O768l026j0838p730n697j638R454J2080K168Q79J718r267j2596
1265a0093k019J693K762J1543J0564l218m977k403j0838r187O500P554K629R649
1279A0159N872r346q612k813q002k346J3535Q901j177M769J283j3291q874J099
1293h843k974L802J6540N279p655L21j887j3721m905O810J953O481J4651j544
$$ plain form
1307 14308 323 -1282 -2366 -13158 -12431 -71 2657 7555 16858 8399 -8164 -7813 -5117 -11481
1321 -11481 -5827 7988 8588 8308 11811 -668 -15454 -9523 -2710 -5601 2234 14049 9193 3473
1335 3473 3733 -8174 -17757 -5864 3384 1012 7571 14764 3941 -4658 -3199 -11045 -14214 1202
1349 1202 10356 4986 8464 10222 -4255 -11688 -5469 -7863 -6722 8567 13695 4669 4364 3025 -11550
1364 -11550 -13903 -2511 -772 521 12437 12519 195 -1884 -3284 -13934 -10475 4826 6303 4672
1378 4672 11200 6664 -6539 -6811 -6296 -11708 -3422 11906 9994 3655 5447 -719 -11104 -7912 -4109
1393 -4109 -4842 4027 15574 8408 -1474 -1447 -5769 -11655 -5063 1740 1509 8634 13656 2381 -8169
1408 -8169 -6155 -7023 -7979 1115 6846 4863 8035 7955 -4756 -12338 -6495 -3698 -1429 7212 9771 4420
$$ packed form
1307A4308j3985j605j084j0792P27J2360K728M898R303q459j6563L51K696o364
1321a1481N654J3815O00k80L503j2479j4786N931O813k891P835J1815m856n720
1335C473K60j1907r583J1893R248k372O559P193j0823q599J459p846l169J5416
1349A202R154n370L478J758j4477p433O219k394J141J5289N128r026l05j339j4575
1364a1550k353J1392J739J293J1916Q2j2324k079j400j0650L459J5301J477j631
1378D672O528m536j3203k72N15n412Q286J5328j912o339J792o166j0385L192L803
1393d109p33Q869J1547p166r882K7m322n886O592O803k31P125N022j1275j0550
1408h169K014q68r56R094N731j983L172q0j2711p582N843K797K269Q641K559n351
$$ plain form
1424 4420 3209 545 -10023 -11996 -2860 2322 4332 9595 8053 -45 -3036 -5053 -10085 -7516 3045
1439 3045 7012 6757 7843 3270 -6009 -7568 -6014 -6133 -532 7794 8752 4998 3185 -3229 -9619 -8290
1455 -8290 -2618 569 5479 9161 6011 935 -2452 -7056 -9536 -4474 2890 6369 7774 5951 869
1470 869 -3819 -6053 -7577 -5623 1010 7651 8738 5584 53 -4660 -6624 -6339 -4196 476 6339
1485 6339 8787 6863 287 -5873 -7890 -5546 -2776 904 5219 7512 6255 2046 -5104 -9444 -6386
1500 -6386 -1276 2012 5038 7622 5299 982 -2809 -8276 -8802 -1485 4531 5050 6124 5648 304 -4532
1516 -4532 -5488 -7349 -5241 3834 8412 5503 3869 1471 -5259 -7578 -4195 -3086 191 7810 8835
1531 8835 2198 -364 -2674 -8257 -6747 -84 1599 3755 8777 5757 -2694 -4543 -4602 -7730 -3094
$$ packed form
1424D420j211k664j0568j973R136N182K010N263j542q098k991k017n032K569J0561
1439C045L967k55J086m573r279j559J554j19N601Q326R58l754j813o414o390J329
1455h290N672L187M910L682l150n076l387m604k480N062P364L479J405j823n082
1470H69m688k234j524J954O633O641J087l154n531m713j964K85K143M672N863
1485F339K448j924o576o160k017K344K770L680M315K293j257m209p150m340L058
1500f386N110L288L026K584k323m317l791n467n26P317O016N19J074m76n344m836
1516d532r56j861K108R075M578k909j634k398o730k319L383J109L277P619J025
1531H835o637k562k310n583J510O663J683K156N022l020q451j849n9l128M636
$$ plain form
1546 -3094 5673 5690 3962 5740 916 -7018 -5949 -3670 -4536 1546 9621 6214 925 1116 -3566 -8842
1562 -8842 -4581 53 -6 5300 10100 2915 -4120 -2729 -4870 -7382 -630 4483 2774 5635 7874
1577 7874 -1855 -8316 -4678 -3558 -3411 4223 7076 2698 3118 3077 -6081 -9840 -2278 343 699 6857
1593 6857 7021 -229 -550 -741 -8554 -8256 2335 4358 3039 6830 4215 -4757 -4121 -2096 -6693 -3429
1609 -3429 6788 6427 2729 4150 -124 -7828 -5253 -1064 -3642 1136 9127 5682 -851 463 -3578
1624 -3578 -8951 -3447 2535 867 3756 8156 1862 -4737 -2154 -4389 -7335 106 6421 3332 3692
1639 3692 5070 -2847 -7397 -2864 -2536 -3510 4140 8075 2642 855 544 -5879 -6860 -586 541 -18
1655 -18 6282 7396 316 -2906 -2882 -6390 -4331 3108 3512 1877 5278 4201 -3518 -5497 -3727 -3971
$$ packed form
1546c094Q767J7j728J778m824p934J069K279q66O082Q075l407n289J91m682n276
1562h842M261M634n9N306M800p185p035J391k141k512O752N113j709K861K239
1577G874r729o461L638J120J47P634K853m378M20m1r158l759P562K621L56O158
1593F857J64p250l21j91p813K98J0591K023j319L791k615q972O36K025m597L264
1609c429J0217l61l698J421m274p704K575M189k578M778P991l445o533J314m041
1624c578n373N504N982j668K889M400o294o599K583k235k946P441O315l089L60
1639C692J378p917m550M533L28r74P650L935n433j787l11o423r81O274J127n59
1655a8O300J114p080l222K4l508K059P439M04j635L401j077p719j979J770k44
$$ plain form
1671 -3971 -309 5943 4514 1542 2772 157 -6366 -5783 -1850 -99 3683 6645 3379 -1032 -579
1686 -579 -2823 -6088 -3881 1623 3193 4719 5464 483 -3908 -3128 -3697 -4508 124 4669 4557 3267
1702 3267 1744 -3210 -5299 -3249 -1785 -592 3489 5765 3318 676 -1750 -4713 -5200 -1703 1227
1717 1227 2744 4848 4102 236 -2693 -3621 -4420 -2671 909 3812 4390 3617 905 -3011 -4498 -3442
1733 -3442 -1850 697 3415 4698 3551 740 -2986 -4953 -3776 -1396 1489 3046 3840 3485 1097
1748 1097 -2558 -5059 -4063 -1216 1552 3729 3658 2078 921 -841 -4522 -5002 -1366 2194 3600 4125
1764 4125 2422 -571 -1982 -2812 -4371 -3086 2173 4282 3850 2820 -58 -3537 -3580 -2110 -2485 432
1780 432 4734 4471 1626 450 -2331 -5175 -2568 153 -237 2455 5273 2539 -1412 -1897 -3287 -4583
$$ packed form
1671c971L662O252j429k972J230k615o523N83L933J751L782K962l266m411M53
1686e79k244l265K207N504J570J526P45m981m391P80n69q11M632M545j12j290
1702C267j523m954k089K050J464J193M081K276k447k642k426k963m87L497K930
1717A227J517K104p46l866k929r28p99J749L580K903N78p73k712l916j487J056
1733c442J592K547K718J283j147k811l726j967J177K380K885J557P94l55k388
1748A097l655k501R96K847K768K177p1j580j157j762l681m80L636L560J406N25
1764D125j703k993j411q30j559J285N259K109m32j030k878l479m3J470l75K917
1780D32M302k63k845j176k781k844K607K721l90K692K818k734l951m85j390j296
$$ plain form
1796 -4583 -578 2692 2123 3031 3841 -642 -3858 -2763 -2808 -2526 2113 5205 2553 1714 1377 -3152 -4887
1813 -4887 -1450 -514 -415 3947 5091 905 -1114 -1327 -4674 -4074 1062 1950 886 4036 3939 -1976 -3105
1830 -3105 -2065 -3568 -1621 3699 3097 607 2596 1631 -4220 -4134 -1485 -1504 1101 5453 3013 -831
1846 -831 693 -748 -5203 -3408 730 935 2596 5130 985 -3216 -836 -1228 -4731 -1012 3281 2319
1862 2319 3003 3248 -1604 -4829 -1570 -791 -2627 1444 4697 1970 1073 1032 -3549 -5201 -415 706
1878 706 -429 3155 4715 201 -1248 -922 -3783 -3918 1860 2845 1091 3241 2809 -2364 -2912 -1119
1894 -1119 -2776 -1570 3571 3706 804 2055 673 -4375 -3322 97 -783 269 4356 3259 -297
1909 -297 -241 -1619 -4570 -1981 1845 1218 1389 3802 1311 -2456 -1808 -2188 -3296 195 3802 2112 976
$$ packed form
1796d583M005L270n69R08Q10m483l216J095m5K82M639L092k652q39l37m529j735
1813d887L437R36R9M362J144m186k019k13l347O00N136Q88j064L150r7n915j129
1830c105J040j503J947N320o02k490J989r65n851Q6K649j9K605M352k440l844
1846h31J524j441m455J795M138K05J661K534m145m201K380l92l503L719M293r62
1862B319O84K45m852l225L259P79j836M071L253k727q97m1m581j652M786J121
1878G06j135L584J560m514j449L26k861j35N778R85j754K150m32n173n48J793
1894a119j657J206N141J35k902J251j382n048J053L419q80J052M087j097l556
1909b97N6j378k951K589L826o27J71K413k491l767O48l80j108L491L607j690j136
$$ plain form
1926 976 2120 -849 -3641 -2070 -1700 -1233 2448 4361 1482 -766 -33 -1908 -3562 -1118 252 1003
1942 1003 3507 3434 -522 -2194 -1542 -2109 -2309 518 1942 1767 3172 1696 -2205 -3307 -1519 -1103 -272
1959 -272 2260 2658 1451 1180 -899 -3486 -2883 -325 474 1529 2586 2040 86 -970 -2014 -3338
1975 -3338 -1499 902 2347 2202 2055 273 -1441 -2279 -2366 -1605 229 1858 2425 1830 417 -1285 -2480
1992 -2480 -2247 -999 682 1859 2280 1822 578 -1540 -2702 -2330 -975 787 2326 2115 1077 495
2008 495 -910 -2290 -2475 -1175 592 2288 2703 1380 -520 -985 -1581 -2505 -1106 919 1720 2396 2351
2025 2351 -361 -2441 -1679 -1189 -1680 350 2355 2103 1509 739 -2104 -3102 -1188 -105 62 1709 2895
2042 2895 1352 80 -747 -2571 -2602 531 1482 618 2203 2072 -502 -1442 -1444 -2539 -1304 1886 2299 824
$$ packed form
1926I76J144k969k792J571L70M67L681J913k879k248P33j875j654K444J370P51
1942A003K504p3l956j672O52n67k00K827J424j75J405j476l901j102J788M16Q31
1959b72K532L98j207k71k079k587O03K558P99J055J057n46j954j056j044j324
1975c338J839K401J445j45j47j782j714q38q7P61J834J629N67n95j413j702j195
1992b480K33J248J681J177M21m58j244k118j162L72J355J762J539k11j038n82
2008D95j405j380j85J300J767J696M15j323j900m65n96r24J399K025Q01O76m5
2025B351k712k080P62M90m91K030K005k52n94p70k843r98J914J083J67J647J186
2042B895j543j272q27j824l1L133R51q64J585j31k574r40kj095J235L190M13j475
$$ plain form
2060 824 1138 755 -2129 -2340 -938 -1133 241 2818 2099 -10 239 -684 -3071 -1818 383 319 1215 3188
2078 3188 1218 -1187 -966 -1266 -2937 -439 2170 1252 1070 2010 -5 -2461 -1449 -985 -1958 1328 3040
2095 3040 1392 88 965 -855 -2920 -854 59 -252 2080 3589 -183 -1498 -294 -1649 -2551 -54
2111 -54 1087 375 2170 2545 -1405 -2625 -530 -1227 -1132 1720 2134 365 1364 763 -2710 -2674 -12 -26
2129 -26 51 2174 1972 -264 333 -401 -3258 -2020 1290 840 785 2348 1121 -1511 -861 -724 -2471 -585
2147 -585 2147 1438 536 1418 -273 -2478 -1216 -659 -1189 825 2992 1128 -93 203 -1484 -2753 -819
2164 -819 679 173 1464 2391 -70 -1026 -659 -1455 -2428 327 1652 851 1177 1339 -1031 -1980 -599 -1049
2182 -1049 -919 1538 2462 818 397 19 -1736 -1733 56 -334 136 2126 2090 -170 -828 -1066 -1887 -1042 927
$$ packed form
2060H24L14l83k884k11J402j95J374K577p19k109K49r23k387J253K201o4Q96J973
2078C188j970k405K21l00j671K498K609r18j82R40k015k456J012M64r73L286J712
2095C040j648j304Q77j820k065K066R13l11K332J509l772j315J204j355r02K497
2111e4J141p12J795L75l950j220K095o97R5K852M14j769R99o01l473L6K662j4
2129b6P7K123k02k236N97p34k857J238L310m50n5J563j227k632O50J37j747J886
2147e85K732p09r02Q82j691k205J262N57n30K014K167j864j221K96j687j269J934
2164h19J498n06J291R27k461r56L67p96r73K755J325q01L26J62k370r49J381m50
2182a049J30K457R24j644m21l78j755LJ789l90M70J990l6k260o58k38q21Q45J969
$$ plain form
2201 927 773 577 1885 978 -1085 -1618 -1059 -1215 128 1497 1224 990 983 -60 -1997 -1454 -469 0 1038
2220 1038 1663 712 -39 -112 -798 -1871 -791 520 926 1551 1719 74 -906 -925 -1382 -1081 138 1317
2238 1317 1172 1293 354 -686 -1615 -808 -464 179 1009 1489 1109 197 -724 -1349 -919 -779 249 949 1286
2257 1286 1116 70 -851 -1139 -1127 -628 16 1384 1635 674 -134 -650 -1114 -1164 -310 131 539 1669 1488
2276 1488 130 -1204 -965 -1137 -794 357 953 828 1065 853 -1364 -1315 -432 -307 51 1187 1194 453 403
2295 403 -332 -1802 -1532 96 579 605 1421 722 -369 -292 -817 -1434 -814 1105 1379 809 1166 -81 -1201
2314 -1201 -1051 -556 -1244 240 1845 1333 326 344 -639 -1567 -452 196 -557 851 1818 588 -422 -113
2332 -113 -1035 -1662 -45 773 243 1140 1357 -124 -1328 -718 -1081 -1134 937 1574 284 585 591 -1251 -1460
$$ packed form
2201I27j54j96J308r07k063n33N59j56J343J369k73k34pj043j937N43R85M69J038
2220A038O25r51p51p3o86j073J080J311M06O25J68j645r80j9m57L01J219J179
2238A317j45J21r39j040r29Q07L44O43Q30M80l80r12r21o25M30J40J028P00L37
2257A286j70j046r21k88J2M99O44J368K51r61q08n16m64n0Q54M41M08J130j81
2276A488j358j334K39j72L43J151N96j25K37k12k217M9Q83J25L58J136Pp41n0
2295D03p35j470K70J628M83K6Q16o99j091P7n25o17O20J919K74n70L57j247j120
2314a201J50M95o88J484J605n12j007J8r83r28J115O48p53J408R67j230j010L09
2332a13r22o27J617Q18n30Q97K17j481j204O10l63n3K071O37j290L01Oj842k09
$$ plain form
2351 -1460 -354 -135 -349 1666 1474 -177 -126 -197 -1491 -1380 375 85 226 1821 1169 -772 -986 -302
2369 -302 -1259 -316 1323 746 324 1288 488 -1682 -1133 -300 -795 231 1604 606 -253 861 -423 -1964
2387 -1964 -770 433 36 834 1575 68 -696 157 -806 -1937 -277 912 448 650 970 -695 -1122
2404 -1122 -40 -602 -1180 540 1656 679 354 375 -958 -1523 72 134 -263 1375 1568 -31 -397 -222
2422 -222 -975 -1224 657 444 240 1333 727 -701 -675 -297 -1123 -544 1051 839 207 676 101 -1262 -956
2441 -956 -104 -371 103 1419 906 -77 -87 -687 -1629 -454 539 24 536 1401 376 -566 -458 -589 -1016
2460 -1016 341 856 503 335 704 -343 -993 -730 -582 -391 796 1302 347 -31 132 -497 -1099 -355 215
2479 215 583 872 859 -104 -455 -610 -777 -588 -73 587 774 762 499 -410 -624 -418 -292 -234 420 777 738
$$ packed form
2351a460J106K19k14K015j92j651N1p1j294J11J755k90J41J595o52j941k14O84
2369c02r57R43J639n77m22R64q00k170N49Q33m95J026J373r98q59J114j284j541
2387a964J194J203l97P98P41j507p64Q53r63j131J660J189m64K02L20j665m27
2404a122J082n62n78J720J116r77l25K1j333n65J595O2l97J638J93j599l66J75
2422b22p53k49J881k13k04J093o06j428K6L78q26N79J595k12o32M69n75j363L06
2441i56Q52k67M74J316n13r83j0o00r42J175R93n15N12Q65j025r42J08j31m27
2460a016J357N15l53j68L69j047o50K63J48J91J187N06r55l78J63o29o02P44N70
2479B15L68K89j3r63l51j55j67J89N15O60J87j2k63r09k14K06J26N8O54L57l9
$$ plain form
2500 738 427 -508 -905 -760 -377 141 444 629 621 352 -149 -569 -707 -274 199 769 848 542 217 -172 -492
2521 -492 -597 -250 139 465 864 721 78 -208 -605 -1009 -512 335 493 665 756 111 -520 -685 -507 -569 154
2542 154 828 510 418 590 -205 -930 -806 -192 50 433 705 330 -238 -80 -236 -845 -81 387 311 970 620
2563 620 -170 -818 -375 -262 -864 54 1035 555 329 219 -787 -850 -165 -14 -186 653 843 66 -181 -190 -741
2584 -741 -909 318 332 -60 778 657 -69 -292 -460 -448 -517 730 324 -141 738 308 -955 -688 -40 -526
2604 -526 -44 1090 267 -37 278 -72 -1164 -633 305 -204 670 966 494 -558 -101 -308 -1061 -86 954
2623 954 2 314 1115 -123 -792 -340 -397 -788 443 956 42 132 522 -613 -1024 -131 -152 -189 864 1009
2643 1009 -505 -446 119 -707 -751 307 138 71 791 641 -653 -702 30 -469 -778 572 755 189 387 252
$$ packed form
2500G38l11r35l97J45L83N18L03J85qk69n01m20j38M33M73N70P9l06l25l89l20
2521d92j05L47L89L26L99j43o43k86l97m04M97Q47J58J72R1o45o31j65J78o2P23
2542A54O74l18r2J72p95p25J24O14K42L83K72l75n68J58j56o09P64M68p6O59l50
2563F20p90o48M43J13o02R18R81m80k26j10j006o3O85J51j72Q39J90p77k47rn51
2584g41j68J227J4l92Q38j21p26k23j68J2o9J247m06m65Q79m30j263K67O48m86
2604e26M82J134q23l04L15l50j092N31R38n09Q74K96m72j052M57k07p53R75J040
2623I54r52L12Q01j238o69M52n7l91J231N13r14R0L90j135m11Q93k1l7J053J45
2643A009j514N9N65q26m4J058j69o7P20j50j294m9P32m99l09J350J83n66J98j35
$$ plain form
2663 252 -950 -588 74 -270 142 647 654 103 253 -236 -1234 -539 351 190 404 948 297 -164 -245 -556 -900
2684 -900 142 864 321 478 524 -45 -836 -442 -471 -696 256 805 278 82 245 -351 -759 228 83 -194
2704 -194 489 805 15 -16 -45 -500 -596 390 298 433 419 455 -222 -617 -123 -561 -227 521 553 107 -16 199
2726 199 -534 -492 -152 -284 437 811 654 -84 -361 -328 -274 31 59 339 351 551 310 -479 -438 126 -446 34
2748 34 295 336 232 364 -197 -519 -382 -109 -173 299 587 221 240 -98 -483 -776 78 0 387 452 372 62
2770 62 -218 -438 -295 -272 259 288 446 342 11 -295 -195 -147 -165 117 320 460 595 75 -523 -563 -468 -325
2792 -325 7 409 353 248 -53 -255 -454 -407 -17 85 421 283 -17 11 -46 -367 -377 -75 297 449 568 484
2814 484 -363 -367 -187 -365 -289 192 438 449 506 186 -451 -490 116 -290 18 385 568 146 191 89 -782 -471
$$ packed form
2663B52j202L62O62l44M12N05Pn51J50m89r98O95Q90j61K14N44o51m61q1l11l44
2684i00J042P22n43J57M6n69p91L94k9k25R52N49n27j96J63n96m08R87j45k77
2704a94O83L16p90l1k9m55r6R86r2J35j4L6o77l95M94m38L34P48L2m46j23K15
2726A99p33M2L40j32P21L74j57p38k77L3N4L05K8K80J2K00k41p89M1N64n72M80
2748C4K61M1j04J32n61l22J37K73o4M72K88l66J9l38l85k93Q54p8L87O5q0l10
2770F2k80k20J43K3N31K9J58j04l31l06J00M8j8K82K03J40J35n20n98m0R5J43
2792c25L32M02n6j05l01k02j99M7L90J02L36j38l00K8n7l21j0L02L72J52J19q4
2814D84q47mJ80j78P6M81K46J1N7l20o37l9O06m06L08L67J83m22M5j02q71L11
$$ plain form
2836 -471 210 356 -71 658 508 -370 -179 -124 -593 -2 762 -103 312 538 198 -521 126 -467 -474 72 769
2857 769 297 -154 185 -303 -493 -63 -168 -269 444 668 -85 -124 -184 -255 -484 308 416 26 447 711 -135
2878 -135 -448 -318 -169 -372 382 584 32 293 210 -549 -496 -13 -213 12 917 517 -71 148 182 -360 -269
2899 -269 244 71 125 479 258 -390 -125 -137 -512 97 206 111 91 778 -107 -440 -230 -86 -330 300 665
2920 665 102 -47 264 -574 -846 -369 333 -1 255 688 -167 -267 100 -279 -556 172 603 80 233 381
2940 381 -392 -323 -29 -185 -608 533 494 1 -41 278 -362 -357 100 -208 -108 353 439 -98 11 40 -348 -130
2962 -130 236 -13 -102 600 144 -143 -168 -84 -316 -160 359 479 326 184 -108 -364 -378 -66 27 98 331 55
2984 55 -9 227 12 -528 -10 194 199 461 465 202 -309 -175 -352 -420 183 192 255 240 183 -105 -344 -545 -35 108
$$ packed form
2836d71O81J46m27P29j50q78J91N5m69N91P64q65M15K26l40p19O47n93pN46O97
2857G69m72m51L39m88j90M30j05j01P13K24p53l9o0p1k29P92J08l90M21K64q46
2878a35l13J30J49k03P54K02n52K61q3p59N3M83k00K25R05m00n88K19L4n42R1
2899b69N13j73N4L54k21o48K65j2l75O09J09r5k0O87q85l33K10J44k44O30L65
2920F65n63j49L11q38k72M77P02l34K56M33q55j00L67l79k77P28M31n23J53J48
2940C81p73O9K94j56m23J141l9m93m2L19o40NM57l08J00M61Q6n37J09K9l88K18
2962a30L66k49q9P02m56k87k5Q4k32J56N19J20j53j42k92k56j4L12R3P1K33k76
2984E5o4K36k15n40N18K04NK62Mk63n11J34j77o8O03RO3j5n7k88k39k01N10J43
$$ plain form
3008 108 278 276 176 51 9 -242 -161 -315 -170 59 281 212 184 138 -340 -540 -164 104 319 453 213 249 -243
3031 -243 -287 -96 -199 84 125 209 373 13 110 -240 82 -39 158 -52 -198 604 464 -472 -377 -345 -328 75
3053 75 346 342 4 17 -65 -429 25 -32 -152 9 376 180 -202 -232 -177 -318 -37 285 68 413 402 133 -591
3076 -591 -278 -71 10 -100 342 -185 -64 136 24 -457 -214 -60 13 197 505 62 54 73 -426 -372 77 160
3098 160 73 321 419 -280 -124 247 -79 -180 295 609 33 201 228 -199 -270 127 -65 -246 174 659 -274
3119 -274 293 229 -539 -292 350 4 97 476 150 -105 90 -60 -447 -165 263 80 -144 361 62 -460 -201
3140 -201 -280 -606 -91 807 296 -96 195 65 -421 120 111 -314 332 515 200 -333 50 -70 -497 196 314
3161 314 41 -132 293 46 -543 -126 -371 -160 210 295 -77 156 102 -129 -268 97 -20 -130 255 96 26
$$ packed form
3008A08J70kj00j25m2k51Q1j54J45K29K22o9k8m6m78k00L76K68K15J34k40L6m92
3031b43m4J91j03K83M1Q4J64l60R7l50L22j21J97k10j46Q02j40r36R5L2J7M03
3053G5K71ml38J3q2l64M54n7j20J61L67j96l82l0N5j41K81L22k17L45j1k69p24
3076e91L13K07Q1j10M42n27J21K00j12m81K43J54P3J84L08m43qJ9m99N4M49Q3
3098A60q7K48R8o99J56L71l26j01M75L14n76J68K7m27p1L97j92j81M20M85r33
3119b74N67o4p68K47O42l46R3L79l26k55J95j50l87K82M28j83k24N05k99n22K59
3140b01p9l26N15Q98n11l92K91j30m86N41rm25O46J83l15n33L83j20m27O93J18
3161C14k73j73M25k47n89M17k45K11L70Q5l72K33n4k31j39L65j17j10L85j59p0
$$ plain form
3182 26 -82 101 -380 -395 -11 223 -100 272 358 -346 -223 76 -245 -199 179 379 118 361 -23 -433 -100
3203 -100 138 -57 -170 330 0 -200 2 -229 -363 93 3 -8 -29 150 72 -71 -197 -450 -498 128 -114 -105
3225 -105 39 147 75 -257 -76 -233 -309 68 332 232 -71 56 10 -393 -45 174 -132 90 349 -165 -161 -235
3247 -235 -339 -102 -127 -165 89 181 210 44 -130 -190 -266 6 268 322 222 -102 -19 -227 -281 -143 -201 63 209
3270 209 253 -208 -40 -17 -242 -496 -132 160 440 556 51 -158 -191 -281 -124 17 -196 22 120 127 -171 -12
3292 -12 -183 -111 -77 128 227 295 31 -147 -40 -231 35 -112 -72 296 134 -94 -48 -186 -159 -99 51 278 516
3315 516 67 -243 -73 -59 -191 26 -194 -5 -70 194 -136 -325 73 -40 -5 32 75 -75 -169 248 -234 -488
3337 -488 96 -87 -57 341 133 -110 153 -59 -202 -140 225 -113 139 442 70 -175 11 -41 -102 -159 130 178
$$ packed form
3182B6j08J83m81j5L84K34l23L72Q6p04J23K99l21M6L78K00k61K43l84m10L33
3203a00K38j95j13N00l30k00K02k31j34M56r0j1k1J79p8j43j26k53m8O26k42R
3225a05J44J08p2l32J81j57p6L77K64j00l03J27m6m03L48K19l06K22K59n14Mp4
3247b35j04K37k5l8K54R2K9j66j74o0p6K72K62N4j00l24Q3k08n4J38n8K64J46
3270B09M4m61J68K3k25k54L64K92K80J16n05k09l3r0J57J41k13K18R8Pk98J59
3292a2j71P2L4K05R9O8k64j78J07j91K66j47M0L68j62k28M6j38K7O0J50K27K38
3315E16m49l10J70J4j32K17k20J89o5K64l30j89L98j13L5L7M3j50r4M17m82k54
3337d88N84j83L0L98k08k43K63k12j43O2L65l38K52L03l72k45J86n2o1n7K89M8
$$ plain form
3359 178 34 240 221 -458 -12 59 -249 153 62 244 41 114 -86 -324 -170 175 -151 163 121 310 65 159
3381 159 -46 -427 55 179 31 40 510 -185 -14 -61 -202 -354 228 187 77 278 125 -81 -28 53 -4 -329
3403 -329 177 552 201 96 229 26 -337 130 66 -310 286 -5 -216 -188 14 -242 -540 277 201 12 61
3424 61 74 -68 -55 253 -124 -127 413 178 -192 100 138 -151 -118 160 11 -96 231 172 -261 54 -138 -392 6
3447 6 191 -6 77 270 -65 -28 59 -92 -29 340 243 -72 53 164 81 -266 -72 19 -16 291 274 -18 10 244
3471 244 48 -390 306 132 -127 251 199 -271 -145 -101 -274 -280 160 462 -56 -73 5 -152 -243 -269 193 -34 516
3494 516 -26 222 207 254 -266 -79 122 11 38 106 242 54 148 -67 -167 -2 69 352 -14 -264 68 -70
3516 -70 166 109 -188 -31 309 -13 91 207 -252 -161 41 -46 -136 -15 -149 157 -25 -322 -312 143 -6 207
$$ packed form
3359A78j44K06j9o79M46P1l08M02r1J82k03P3k00k38J54L45l26L14m2J89k45R4
3381A59k05l81M82J24j48RM70o95J71m7j41j52N82m1j10K01j53k06N3Q1n7l25
3403c29N06L75l51j05J33k03l63M67o4l76N96k91k11K8K02k56k98Q17p6j89M9
3424F1J3j42J3L08l77lN40k35l70K92L8k89L3K78j49j07L27n9m33L15j92k54L98
3447FJ85j97Q3J93l35L7Q7j51O3L69r7l15J25J11q3l47J94R1l5L07j7k92K8K34
3471B44j96m38O96j74k59L78n2m70J26M4j73oM40L02n18j7P8j57r1k6M62k27N50
3494E16n42K48j5M7n20J87K01j11K7O8J36j88R4k15j00J65P1K83l66k50L32j38
3516g0K36n7k97J57L40l22J04J16m59R1K02q7r0J21j34L06j82k97J0M55j49K13
$$ plain form
3538 207 44 124 276 -21 -52 -162 -202 -89 32 70 186 225 -121 -35 -167 -345 91 221 199 344 148 -140
3560 -140 156 69 20 -17 -166 101 17 145 37 -305 -377 -96 -95 -166 157 142 -55 -129 -83 -15 -319 1 -12 -9 251
3585 251 180 -198 -231 -142 -142 -104 160 121 -205 254 202 -71 -46 -152 -65 -142 288 142 -112 -1 7 -347 -188 -113 17
3610 17 167 147 153 -349 -105 -22 -11 11 173 -89 39 367 -6 -172 -262 -157 -348 -156 153 -282 -51 128 -419
3633 -419 -294 149 122 73 157 155 35 -76 90 -114 -288 133 82 290 210 291 -266 -73 110 -207 -122 272 287
3656 287 103 59 -196 -219 -96 224 174 63 184 209 -110 171 210 -205 -62 70 137 109 207 65 -104 6 -113
3679 -113 152 -257 223 112 163 289 -51 -392 16 100 -140 146 358 -5 10 216 -249 -323 116 -129 235
3700 235 162 245 12 143 -239 -103 -279 26 12 104 217 110 85 -181 -156 -69 0 -7 449 -94 -25 11 -344 -5
$$ packed form
3538B07j63Q0J52k97l1j10m0J13J21L8J16L9l46Q6j32j78M36J30k2J45j96k88
3560a40K96q7m9l7j49K67q4J28j08l42p2K81Jp1L23j5j97p4M6O8l04L20j3LK60
3585B51p1l78l3Q9%L8K64l9l26M59n2k73K5j06Q7p7M30j46k54J11Ql54J59P5J30
3610A7J50k0On02K44Q3J1K2J62k62J28L28l73j66r0J05j91J92L09m35K31J79n47
3633d19J25M43k7m9Q4kj20j11J66k04j74M21n1K08q0Q1n57J93J83l17Q5L94J5
3656B87j84m4k55k3J23L20n0j11J21K5l19K81L9m15J43J32O7k8R8j42j69J10j19
3679a13K65m09M80j11N1J26l40l41M08Q4k40K86K12l63J5K06m65p4M39k45L64
3700B35p3Q3k33J31l82J36j76L05j4R2J13j07k5k66K5Q7O9pM56n43O9L6l55L39
$$ plain form
3724 -5 249 -90 251 83 68 -89 120 50 -84 245 160 178 10 213 -89 -193 -75 139 -295 -90 49 199
3746 199 -192 1 4 83 59 144 46 -111 174 -40 68 72 -11 16 73 -19 405 -43 -41 -107 215 -150 -254 -236 51
3771 51 -55 337 177 183 -59 15 133 -50 78 127 -15 -64 -247 -111 -76 -138 -84 36 278 234 -50 62 -179
3794 -179 -127 -4 -85 -94 29 332 265 39 -360 -241 -249 -117 99 -45 -176 -112 21 112 -51 -237 -114 -107 3 133
3818 133 275 134 44 146 -214 -26 77 34 -75 -16 22 -125 66 -260 53 -13 143 255 241 20 -289 -92
3840 -92 71 33 43 22 156 364 -18 -175 -10 -91 -108 125 261 -66 72 7 -306 -192 43 20 50 26 107 78
3864 78 -156 -9 -213 -217 -192 -72 29 -17 93 -7 58 146 68 -58 220 180 71 -45 162 -296 -144 -104 -161 40
3888 40 163 276 6 218 74 -398 32 -6 7 89 300 195 122 -75 91 -150 129 214 128 -148 -6 2 -58
$$ packed form
3724eK54l39L41j68j5j57K09p0j34L29q5J8j68K03l02j04J18K14m34K05J39J50
3746A99l91J93LP9k4Q5r8j57K85k14J08Mq3K7N7r2M24m48Ko6L22l65j04J8K87
3771E1j06L92j60Ok42P4J18j83J28M9j42m9j83J36L5o2N4J20K42m4k84J12k41
3794a79N2J23q1rJ23L03o7k26l99J19qJ32K16j44j31O4J33R1j63j86J23PJ10J30
3818A33J42j41r0J02l60J88J03m3j09N9L8j47J91l26L13o6J56J12j4k21l09J97
3840i2J63l8J0k1J34K08l82j57J65q1j7K33J36l27J38o5l13J14K35k3L0k4Q1k9
3864G8k34J47k04mK5J20J01m6J10j00O5Q8p8j26K78m0j09j16K07m58J52M0n7K01
3888D0J23J13k70K12j44m72M30l8J3Q2K11j05p3j97J66k41K79Q5q6k76J42Qo0
$$ plain form
3911 -58 107 -20 -283 -64 249 -76 -38 61 32 -92 57 151 -57 187 67 68 -93 154 4 -117 191 67
3933 67 -47 13 345 147 -274 244 201 -21 177 202 -130 -14 124 16 -239 44 42 -4 54 247 6 -126 109
3956 109 -132 -103 64 291 162 -30 269 -401 -53 -59 -90 81 75 9 -26 126 -13 -56 -118 123 -16 85 24 271
3980 271 -192 -274 -150 -24 -266 1 47 36 145 -201 -311 121 -120 -162 -43 101 -92 -15 30 -269 -269 172 175
4003 175 -41 88 184 -103 -187 -247 -181 -162 221 219 -59 -105 54 -258 -143 69 -127 -50 -126 187 5 89 -122 37
4027 37 14 71 -85 183 -94 -87 19 135 -118 16 305 165 147 28 160 -163 -262 -98 -136 50 -76 -13 146
4050 146 303 -369 -232 -180 -183 -220 62 -14 -33 320 -89 -51 85 5 -220 233 -15 178 222 4 -164 -46 -357
4073 -357 37 60 -21 190 324 116 -108 -65 -142 -40 55 -101 243 70 -20 -1 209 -4 -325 154 47 6 -108
$$ packed form
3911e8J65j27k63K19L13l25L8R9k9j24J49R4k08K44j20Jj61K47j50j21L08j24
3933F7j14O0L32j98m21N18m3k22J98K5l32J16J38j08k55K83km6N8J93k41j32K35
3956A09k41K9J67K27j29j92K99o70L48ol1J71oo6l5J52j39m3o2K41j39J01o1K47
3980B71m63q2J24J26k42K67M6j1J09l46j10M32k41m2J19J44j93P7M5k99%M41L
4003A75k16J29R6k87q4o0O6J9L83kk78m6J59l12J15K12j96P7p6L13j82Q4k11J59
4027C7k3N7j56K68k77PJ06J16k53J34K89j40j8j19J32l23r9J64l8J86j26O3J59
4050A46J57o72J37N2ll7K82p6j9L53m09L8J36q0k25M53k48J93M4k18j68J18l11
4073c57L94K3q1K11J34k08k24M3p7J02R5j56L44j73r0J9K10k13l21M79j07m1j14
$$ plain form
4096 -108 -21 -24 61 -3 -101 -301 -81 104 46 291 180 69 -174 -129 -51 -188 -69 -63 -11 -67 43 -167 -215 -165 79
4121 79 186 330 -125 60 -309 -26 -114 -199 188 32 94 0 -18 -259 -14 -44 226 2 111 -140 34 157
4143 157 -166 -360 11 36 116 29 119 119 -68 27 10 74 -289 283 -54 237 98 -139 79 -92 118 -128 198
4166 198 290 156 -101 35 -31 95 -53 310 -59 136 129 -120 388 139 46 -294 164 -135 79 72 75 -281 5
4189 5 98 -124 -202 210 118 188 -75 189 -232 115 -85 -65 -194 30 -189 -86 95 8 -290 -254 -71 86 20
4212 20 421 -107 -21 -51 -89 -342 330 279 200 -7 -120 56 -346 159 -96 70 -39 324 126 -33 13 -172
4234 -172 -338 -109 -53 13 194 118 -197 437 61 25 -62 70 -36 201 -11 39 -23 -68 28 109 9 71 14 43
4258 43 94 175 -11 179 156 113 162 114 190 148 67 106 -167 -50 80 87 -228 -23 -55 -98 -87 118 -93 91 -66
$$ packed form
4096a08Q7lQ5o4r8k00K20J85n8K45j11j11k43M5P8j37J19ON2n6J10k10m8N0K44
4121G9J07J44m55J85l69K83q8q5L87j56O2r4j8k41K45l0K70k24J09k51J74J23
4143A57l23j94L71K5Q0q7R0%j87R5j7O4l63N72l37K91j39k37K18j71K10k46L26
4166A98R2j34k57J36o6J26j48L63l69J95pk49N08k49r3l40M58k99K14pLl56K86
4189ER3k22p8M12r2P0k63K64m21L47k00K0j29K24k19J03J81q7k98L6J83J57o6
4212B0M01n28Q6l0l8k53O72n1p9k07j13J76m02N05k55J66j09L63j98j59M6j85
4234a72j66K29N6O6J81p6l15O34l76l6q7J32j06K37k12N0o2m5R6Q1j00O2n7K9
4258D3N1Q1j86J90k3m3M9m8P6m2q1L9k73J17J30Pl15K05l2m3J1K05k11J84j57
$$ plain form
4283 -66 29 -104 130 -319 11 269 20 122 -109 95 -319 97 169 58 -147 126 -28 -33 273 8 114 -160
4305 -160 -154 -346 -78 -16 82 -141 -202 144 -82 -160 -202 152 40 -77 24 156 -166 47 -412 -63 69 -6 -7
4328 -7 81 177 -33 119 -151 145 -143 -2 103 -358 27 -335 -6 -226 -154 -82 212 38 108 54 8 291 149
4351 149 12 -45 119 -162 99 94 2 87 272 -70 51 26 63 83 -155 -10 -158 17 315 138 -171 56 -21
4374 -21 -74 -52 -126 7 -312 52 12 187 98 113 79 -390 -270 259 -368 256 -300 41 131 339 166 -76 -83 -15
4398 -15 39 166 92 99 -97 21 -184 -22 41 152 56 136 -144 -235 11 46 152 -66 -293 -47 -19 165 175 -232
4422 -232 -10 57 -20 19 24 136 106 169 -190 -106 74 -158 -78 153 195 -106 85 -179 85 38 12 -53 -22 -76 60
4447 60 39 81 -15 144 -195 -330 218 -36 -64 127 -11 -262 206 263 28 36 98 -195 -59 -89 -57 -160 119 -9
$$ packed form
4283f6R5j33K34m49L30K58k49J02k31K04m14M16P2j11k05K73j54nL06k65J06k74
4305a60Oj92K68O2R8k23o1L46k26p8m2L54j12j17J01J32l22K13m59L49J32p5j
4328gQ8R6k10J52k70K96k88J41J05m61L85l62L29k20P2P2K94j74P0n4m6K83j42
4351A49j37n7J64k81K61nr2Q5J85l42J21k5L7K0k38J45j48J75K98j77l09K27p7
4374b1n3K2p4J33l19L64m0J75q9J5l4m69J20N29o27O24n56L41R0K08j73k42pO8
4398a5N4J27p4Pj96J18k05J62O3J11r6Q0k80r1K46L5J06k18k27K46K8J84J0m07
4422b32K22O7p7L9NJ12l0O3l59Q4J80k32Q0K31M2l01J91k64K64m7k6o5L1n4J36
4447F0k1M2r6J59l39j35N48k54k8J91j38k51M68N7k35QO2k93J36l0L2j03K79j28
$$ plain form
4471 -9 50 109 114 55 -47 -84 -61 -98 -93 -124 58 -259 70 -95 105 72 -102 -51 -264 107 21 -13 80 -285 -191 -27
4497 -27 -130 -88 -84 6 37 79 24 -290 -274 251 7 -83 -66 47 -87 197 298 -103 419 -56 -179 9 -63 283
4521 283 -160 -2 31 -30 -96 -88 -186 -168 -124 193 -276 -31 51 -208 207 73 -99 104 113 -78 29 -19 -130 72
4545 72 -114 5 45 92 -105 -39 60 -20 -39 -307 -106 -38 -89 -151 21 -198 223 -45 281 -65 -112 -179 -92 108
4569 108 45 2 -44 176 -248 -126 -297 76 48 -317 -22 159 -112 -52 112 -195 -41 -35 225 107 56 281 -28
4592 -28 194 -162 -33 182 -98 347 -62 255 -68 -112 -66 -124 58 312 -11 0 -5 -87 170 -30 -70 25 -216
4615 -216 12 338 155 234 -106 23 117 -151 -16 -47 13 -160 -96 -88 224 -201 105 1 -63 112 -58 -22 -139
4638 -139 22 -211 36 -30 -129 80 153 -77 -96 0 -11 166 214 105 -15 -131 70 79 -77 -247 -231 -6 269
$$ packed form
4471iN9N9Nn9j02l7K3l7Nl1J82l17L29j65K00l3j74N1k13L71q6l4R3l65R4J64
4497b7j03M2MR0L1M2n5l14J6N25k44r0J7J13j34K84J01m01N22m75j23J88p2L46
4521B83m43J58L3o1o6Qr8J8M4L17m69K45Q2k59M15j34j72K03Rj91J07m8j11K02
4545G2j86J19M0M7j97O6R9q0j9k68K01O8n1o2J72k19M21k68L26l46m7o7Q7K00
4569A08o3m3m6K20m24J22j71L73k8l65K95J81k71O0J64l07J54OK60j18n1K25l09
4592b8K22l56J29K15k80M45m09L17l23m4M6n8J82K54l23J1nq2K57k00m0R5k41
4615b16K28L26j83P9l40J29R4k68J35l1O0j73O4QL12m25L06j04o4J75j70L6j17
4638a39J61k33K47o6r9K09P3k30j9R6j1J77M8j09j20j16K01Rj56j70J6K25K75
$$ plain form
4661 269 -28 25 -41 56 -26 -124 109 30 -233 -108 116 30 -249 203 -311 34 142 -44 -78 -49 -52 -133 121 154
4685 154 59 24 176 50 -54 -133 -92 97 -31 -72 98 80 167 -129 83 211 -129 164 -30 -119 56 -202 -57
4708 -57 21 -110 93 47 62 159 -45 -264 -6 -48 -167 2 70 -234 -123 72 4 -177 -7 -12 44 -76 21 180
4732 180 33 96 -56 -159 -135 255 74 223 -165 -152 -124 -117 -4 -45 126 -135 167 -32 -217 161 -165 109
4754 109 90 91 -118 258 -58 122 12 -72 253 -39 33 -243 -3 138 171 192 8 13 -297 414 -220 -24 42
4777 42 -51 -147 74 4 -69 -48 -235 106 -87 6 -4 55 74 -137 43 -27 -274 -254 -171 148 -99 -48 -331 -249 90
4802 90 -211 80 238 134 64 13 69 20 143 32 -97 15 165 92 201 -188 9 109 -25 192 9 392
4824 392 -134 98 79 333 196 -41 2 -46 -2 29 7 -134 -198 76 274 423 50 -248 -92 -59 104 61 71
$$ packed form
4661B69k97N3o6R7q2r8K33p9k63J25K24q6k79M52n14L45J08j86l4K9lq1K54L3
4685A54r5l5J52j26j04p9M1J89j28m1J70j8Q7k96K12J28l40K93j94q9J75k58J45
4708e7P8j31K03m6J5R7k04k19K58m2j19J69O8l04J11J95o8j81J70nN6j20R7J59
4732A80j47O3j52j03K4L90j81J49l88J3K8PJ13m1J71k61L02j99j85L78l26K74
4754A09j9Jk09L76l16J80j10q4L25k92P2k76K40J41L3K1j84Nl10P11o34J96O6
4777D2r3r6K21p0p3K1j87L41j93R3j0N9J9k11J80p0k47K0Q3L19k47N1k83Q2L39
4802I0l01K91J58j04p0n1N6m9J23j11j29J12J50p3J09l89J97J00j34K17j83L83
4824C92n26K32j9K54j37k37M3m8M4L1k2j41o4K74J98J49l73k98J56L3J63m3J0
$$ plain form
4847 71 -81 26 -367 -117 -109 -117 -95 -54 52 -4 122 -21 28 -79 6 -15 -92 187 151 90 10 159 -190 -102 75
4872 75 -224 82 85 72 -170 -91 -4 -89 -97 16 273 92 206 138 -147 34 133 238 -97 -9 -39 -188 53 58 -233
4897 -233 -4 1 -142 159 87 127 40 211 -40 -304 -50 77 -149 76 73 -48 -97 -105 173 227 220 68 87 181 181 -28
4923 -28 102 181 -103 -59 -213 54 -386 102 261 71 -220 102 -68 -2 6 8 226 -65 73 -102 -35 -56 -26 -77
4947 -77 -115 73 -109 32 -366 -147 35 -132 42 -180 317 47 31 37 58 -33 -20 -330 40 -124 33 95 7
4970 7 -85 21 126 96 166 0 -253 52 112 -174 -102 -67 158 203 -84 57 -106 -49 81 -394 189 269 1 -209
4994 -209 -78 -143 -186 204 59 201 79 -41 -53 -77 40 -145 159 -18 34 -16 -226 -12 83 -159 -28 -7 -66
5017 -66 212 -66 183 -30 -120 -76 34 -155 -216 -61 71 -31 -131 -55 54 -187 31 61 35 244 60 237
$$ packed form
4847G1j52J07l93K50QqK2M1J06n6J26j43M9j07Q5k1p7K79l6o1q0J49l49Q8J77
4872G5k99L06Lj3k42P9Q7q5qJ13K57j81J14o8k85J81R9J05l35Q8l0j49K41Nk91
4897b33K29Nj43L01p2M0q7J71k51k64K54J27k26K25lj21m9qK78N4pj52J9R4%k09
4923b8J30P9k84M4j54K67m40M88J59j90k91L22j70O6QKK18k91J38j75O7k1L0n1
4947g7l8J88j82J41l98K19J82j67J74k22M97k70j6OK1r1J3l10L70j64J57O2q8
4970Gr2J06J05l0P0j66k53L05O0k86P2L5K25M5k87J41j63N7J30m75N83Q0k68k10
4994b09J31o5m3L90j45J42j22j20j2k4J17j85L04j77N2n0k10K14R5k42J31K1n9
5017f6K78k78K49k13r0M4J10j89o1J55J32j02j00P6J09k41K18L0k6K09j84J77
$$ plain form
5039 237 3 -184 91 265 173 -131 200 -148 39 118 -357 0 60 231 -134 24 -90 -340 -76 25 -60
5060 -60 179 -139 175 -16 -137 34 -56 12 -103 142 70 111 100 -19 -139 -87 -85 87 143 -41 -51 34 -218 -26
5084 -26 -5 -234 116 336 53 -124 150 25 -133 -14 -64 5 37 -205 136 -58 9 2 -98 -114 220 -92 -91 304
5108 304 -165 124 -128 -144 25 241 68 67 -117 180 -17 -6 239 132 124 -29 30 -77 -248 -32 -203 -165 -255
5131 -255 -108 89 -256 11 219 -160 -116 221 -29 -217 -75 56 -103 98 52 245 -150 177 76 -136 27
5152 27 118 155 -107 114 -208 -87 -120 343 -89 275 191 -240 64 -181 11 182 -182 -15 24 -72 22 192 -100
5175 -100 3 173 -42 280 100 -75 -40 128 56 90 -136 -149 144 12 64 -126 54 -66 173 286 135 56
5197 56 -44 147 -97 39 160 68 -69 86 185 -35 91 104 -111 -2 -119 -56 -201 -35 47 93 -51 -42 -287
$$ packed form
5039B37k34j87K75J74r2l04L31l48J87P9m75L57O0J71l65J58j14k50K64J01q5
5060f0K39l18L14j91j21J71r0O8j15K45p2M1j1j19j20N2KJ72N6j84j0Q5k52J92
5084b6K1k29L50K20k83j77K74j25j58J19n0O9L2k42L41j94O7pj00j6L34l12JL95
5108C04m69K89k52j6J69K16j73jj84K97j97J1K45j07qj53N9j07j71K16j71L8r0
5131b55J47J97l45K67K08l79M4L37k50j88J42J31j59K01m6J93l95L27j01k12J63
5152B7R1L7k62K21l22J21l3M63m32L64q4m31L04k45J92J71l64J67L9r6R4J70k92
5175a00J03J70k15L22j80j75L5J68p2L4k26j3K93j32N2j90J80j20K39J13j51p9
5197E6j00J91k44J36J21r2j37J55R9k20J26J3k15J09j17O3j45J66Q2M6j44Rk45
$$ plain form
5220 -287 -4 87 -369 -158 141 -17 -245 -93 -149 66 -143 169 12 -21 -124 27 -158 -180 -21 -73 -18 114
5242 114 14 -247 -27 92 -41 2 208 -10 -87 -144 -40 28 -13 -86 163 -106 -4 207 -85 10 -127 -298
5264 -298 14 217 48 146 -87 -5 226 -174 -37 -64 -87 156 88 -159 20 -31 219 -195 -101 -134 -37 -166 -225
5287 -225 257 236 178 156 309 -92 -113 -31 -65 298 279 138 61 154 116 118 9 -80 90 -239 36 54 200 -48 -100
5312 -100 90 11 38 8 135 -190 -2 -142 98 -106 103 179 -113 -4 -17 -1 208 -50 36 -52 -93 -64 129
5335 129 132 113 198 30 53 102 7 -40 74 -4 53 -226 10 -45 -140 18 -63 -16 -236 -114 -91 -145 6 273 112
5360 112 16 85 -164 14 146 -289 225 -70 40 44 110 -131 -116 149 85 257 -115 266 134 -65 195 -77
5382 -77 -111 59 121 170 6 -234 47 -209 -339 -184 -55 80 -20 138 195 115 167 -23 93 26 173 121 -189
$$ packed form
5220b87K83R1m56K11K99j58k28J52n6K15k09L12j57l3j03J51j85k2J59n2N5J32
5242A14j00k61K20J19j33M3K06k18p7n7J04O8m1p3K49k69J02K11k92R5j37j71
5264b98L12K03j69R8k33Q2K31m00J37k7k3K43o8k47J79n1K50m14R4l3R7j29n9
5287b25M82k1n8k2J53m01k1Q2l4L63j9j41p7R3l8Kj09q9J70l29K75J8J46k48n2
5312a00J90p9K7l0J27l25J88j40K40k04K09P6k92J09j3J6K09k58Q6q8m1K9J93
5335A29Lj9Q5j68K3M9r5m7J14p8N7k79K36n5r5J58q1M7k20J22K3n4J51K67j61
5360A12r6O9k49J78J32m35N14k95J10MO6k41J5K65o4J72l72L81j32j99K60k72
5382g7l4J70O2M9j64k40K81k56j30J55J29J35j00J58N7q0N2j90J16o7J47n2l10
$$ plain form
5405 -189 -42 -76 38 -280 40 -81 -138 77 60 -8 -213 59 -175 -254 -29 -137 -73 106 50 43 -170 5 -184
5428 -184 -235 267 -53 -108 27 -160 -226 30 -344 -22 -117 -54 305 -125 64 30 62 -116 27 -114 63 -11 253
5451 253 112 86 50 80 252 75 14 -36 -174 114 -94 171 30 -299 -68 -30 -22 2 26 -138 -106 25 -237 -31
5475 -31 115 -130 -2 97 106 110 -106 363 -207 52 50 -53 10 8 105 135 110 67 -4 -37 -44 110 -9 -74 -161 -2 -288
5502 -288 161 -22 146 243 -157 -82 -163 104 8 -32 125 -45 -121 -135 114 37 -75 -84 -195 43 -1 71 -75 -121
5526 -121 218 182 -12 -209 201 -87 -51 -92 -120 158 1 82 -12 -174 76 -147 314 -104 -37 93 -35 9 188
5549 188 116 42 247 187 59 271 -71 -144 -64 77 73 62 -145 10 266 1 -80 61 -21 145 -118 12 -40 -213
5573 -213 -3 21 -97 -1 110 -19 -3 -224 -158 -74 -242 -398 89 344 20 296 -134 -114 37 19 180 70
$$ packed form
5405a89J47l4J14l18L20j21n7K15j7o8k05K72k34p9K25j08O4J79n6pk13J75j89
5428a84n1N02l20n5J35j87o6K56l74L22r5O3L59m30J89l4L2j78J43j41J77p4K64
5451B53j41k6l6L0J72j77o1n0j38K88k08K65j41l29K31L8QK4K4j64L2J31k62K06
5475c1J46k45J28R9RMk16M69n70K59kj03O3kR7L0k5m3p1l3pJ54j19o5q7J59k86
5502b88M49j83J68R7m00P5q1K67r6m0J57j70p6j4K49p7j12rj11K38m4P2j46m6
5526a21L39l6j94j97M10k88L6m1k8K78j57Q1r4j62K50k23M61m18O7J30j28M4J79
5549A88p2p4K05o0j28K12l42p3Q0J41mj1k07J55K56k65q1J41q2J66k63J30n2j73
5573b13K10K4j18R6J11j29J6k21O6Q4j68j56M87K55l24K76m30K0J51j8J61j10
$$ plain form
5595 70 12 -109 -101 -108 127 233 -33 44 28 66 -159 -113 244 37 -22 19 60 252 263 21 93 -194 12 53 -35 277
5621 277 9 62 -148 -146 -119 155 72 14 136 -86 -28 -198 -79 98 -114 6 -72 33 -76 -195 -285 77 217
5644 217 41 -244 207 106 25 40 102 127 37 157 196 -93 -106 -159 -14 21 199 231 -40 258 -41 152 34
5667 34 -292 71 66 -182 -332 -136 -142 -34 -26 22 -19 100 77 -313 -99 130 -204 149 -172 286 134 160 -110 -82
5691 -82 -128 -273 -176 25 72 -280 277 74 116 286 20 67 -70 -82 -52 -63 266 -51 -20 -116 -214 -109 -163 7
5715 7 61 179 -172 -185 264 5 135 139 -60 27 154 169 -50 108 -28 -89 -20 -16 -23 -5 120 -182 117 -143 -262
5740 -262 -86 -130 -38 -42 4 -22 -16 147 -103 32 -67 -8 134 79 91 -10 -47 8 -37 38 -90 -103 -186 -241 -201 94 -162
5767 -162 -23 90 4 48 -127 148 115 25 -83 -57 8 61 -96 75 -29 194 -69 161 114 -15 -80 -263 169
$$ packed form
5595G0n8j21QpK35J06k66P7j6L8k25M6L57k07n9M1M1J92J1k42P2k87K06M1q8L12
5621B77k68N3k10KK7K74q3n8J22k22N8j70J19J77k12J20p8J05j09j19r0L62J40
5644B17j76k85M51j01q1J5O2K5r0J20L9k89j3n3J45L5J78L2k71K98k99J93j18
5667C4l26L63nk48j50J96oJ08QM8m1J19k3l90K14K29l34L53l21M58j52K6k70K8
5691h2m6j45R7K01M7l52N57k03M2J70k66M7j37j2L0j1L29l17L1r6r8J05n4J70
5715GN4J18l51j3M49k59J30Mj99Q7J27J5k19J58j36o1O9MpJ8J25l02K99k60j19
5740b62J76m4R2mM6k6OJ63k50J35r9N9J42n5J2j01l7N5m5P5j28j3q3n5M0K95k56
5767a62J39J13q6M4j75K75l3r0j08K6O5N3j57J71j04K23k63K30m7j29o5j83M32
$$ plain form
5790 169 -87 12 -67 182 -67 -143 270 351 -32 176 265 21 38 -135 56 -25 275 -77 71 205 28 -46 323
5813 323 148 -82 86 -28 -24 -255 253 -203 85 183 14 28 189 55 259 58 -177 43 -75 -34 247 66
5835 66 21 40 142 55 -164 38 -24 115 96 -63 -115 -63 -131 40 200 -336 121 123 -62 -60 -102 198 58 46 13
5860 13 12 -49 78 -9 196 161 10 -42 292 45 -173 -140 -282 -23 84 277 -186 -19 -191 -148 -40 -76 -16 126
5884 126 -45 36 95 40 255 -118 261 -69 -20 -294 34 40 -22 164 82 34 -30 -86 31 12 -64 -334 145 -4
5908 -4 -31 9 116 -79 16 -32 -152 -124 -2 118 -11 -155 -171 -54 -175 -30 -189 211 -111 220 -207 38 71
5931 71 -173 20 -166 -94 -88 -1 -183 -80 -130 141 70 255 104 45 144 81 -78 135 139 -184 -180 36 104 -56 130
5956 130 -54 -319 -134 -233 -66 -94 146 76 -56 117 -87 130 54 -122 -177 -188 51 -25 98 -30 -165 -62
$$ packed form
5790A69k56R9p9K49k49p6M13Q1l83K08Q9k44J7j73J91q1L00l52J48J34j77p4L69
5813C23j75k30J68j14Mk31N08m56K88R8j69J4J61j34K04k01k35K20j18M1K81j81
5835F6m5J9J02q7k19K02o2J39j9j59n2N2o8J71J60n36M57Kj85Km2L00j40j2l3
5860A3jo1J27q7K05l5j51n2L34k47k18L3j42K59J07J93m63J67j72M3J08l6O0J42
5884A26j71Q1N9n5K15l73L79l30M9k74L28Oo2J86q2m8o4n6J17j9p6k70M79j49
5908dk7M0J07j95R5m8j20K8J22J20j29j44j6J17j21J45j59M00l22L31m27K45L3
5931G1k44J93j86P2OQ7j82J03n0K71p1J85j51n9R9o3j59K13Ml23MK16O8j60J86
5956A30j84k65J85r9J67k8K40p0j32J73k04K17p6j76n5j1K39p6J23j28j35J03
$$ plain form
5978 -62 46 18 120 -47 100 144 6 377 -16 265 4 -203 -184 -249 166 172 -17 -161 79 266 -64 -165
6000 -165 -188 -50 72 135 -31 -55 76 82 -20 -35 103 -129 -194 -116 -295 -34 -116 17 14 161 249 288 269 -144 -38
6025 -38 -117 101 28 -75 413 118 -249 198 -93 -172 206 97 108 -156 59 355 -185 3 -49 48 -24 89 111
6048 111 -312 -116 19 23 -51 -191 76 -72 147 102 -103 95 483 -19 47 -42 113 38 88 194 -125 105 47
6071 47 -7 211 150 -96 -107 -72 -165 -135 -275 146 314 65 -36 70 -226 -235 -116 121 -112 -24 -158 70 -255
6094 -255 -175 -135 -95 -47 -249 -69 -155 166 126 -10 210 62 211 335 -104 56 119 37 188 196 219 288 -51 140
6118 140 408 324 190 -5 -118 193 -22 -10 -113 76 -10 11 -95 311 159 248 -165 -293 -13 172 -70 -186
6140 -186 178 181 142 150 -167 -278 -59 28 -7 77 -107 213 -8 197 186 -106 -101 73 243 107 86 -187 -71 -61
$$ packed form
5978f2J08k8J02j67J47M4j38L71l93K81k61k07J9o5M15Oj89j44K40J87l30j01
6000a65k3J38J22O3j66k4J31Oj02j5J38k32o5P8j79K61q2J33lJ47Q8L9j9m13J06
6025c8p9K18p3j03M88k95l67M47k91p9L78j09J1k64K15K96n40J88n2R7p2J13K2
6048A11m23J96J35Mp4j40K67j48K19m5k05J98L88n02O6q9J55p5N0J06l19K30n8
6071D7n4K18o1k46j1L5r3L0j40M21J68k49j01J06k96rJ19K37k33Q8j34K28l25
6094b55Q0M0M0M8k02J80q6L21m0j36K20j48J49J24m39J60O3q2J51QK3O9l39J91
6118A40K68q4j34j95j13L11k15J2j03J89q6K1j06M06j52Q9m13j28K80J85k42j16
6140a86L64Ll9Ql17j11K19Q7l5Q4j84L20k21K05j1k92NJ74J70j36k1k73J16J0
$$ plain form
6164 -61 -124 42 -45 -46 -24 189 -21 -161 111 -129 44 -178 274 -53 27 23 -19 74 -20 -26 371 146 128 -51 -126
6189 -126 88 -47 86 -67 83 -71 -4 -118 6 169 155 331 218 265 -70 15 4 225 -38 107 -76 -214
6211 -214 -15 69 100 52 -277 141 -110 -236 -89 -166 107 -87 -170 222 -138 -98 -2 95 -131 -215 -96 -48 20 74
6235 74 109 103 -12 3 -101 34 121 -103 105 110 181 -274 62 77 -188 53 -31 134 187 -25 -57 73 -221 29
6259 29 -186 -128 46 -157 60 132 104 50 24 -133 -37 -124 -140 74 100 -17 -23 -161 -95 -173 -131 -129 248 5 -35 133
6285 133 67 -33 -41 -46 -89 -144 -66 -41 -99 -196 -35 35 90 -31 37 -74 -307 -65 172 93 -99 179 23 153 126
6310 126 94 197 63 26 -16 -40 86 126 80 -101 -98 -149 -180 20 76 -132 -271 -128 -174 -13 138 73 -40 24 17
6335 17 -38 -232 -129 -2 11 -4 153 47 172 -94 -373 83 178 9 168 -230 -69 -108 -57 -31 190 -86 -61
$$ packed form
6164f1o3J66q7jK2K13k10j40K72k40J73k22M52l27Q0mm2R3r4oL97k25j8j79p5
6189a26K14j35J33j53J50j54O7j14J24J63j4J76j13M7l35Q5j1K21k63J45j83j38
6211b14J99Q4L1m8l29M18k51j26J47p7K73j94q3L92l60M0R6R7k26q4J19M8O8N4
6235G4L5oj15J5j04J35Q7k24K08NP1m55L36J5k65K41q4J65N3k12l2J30k94K50
6259B9k15N8J74k03K17P2k8n4k6j57R6q7j6K14K6j17oj38O6p8M2KL77k43m0J68
6285A33o6j00qnm3n5P8K5n8r7J61P0N5j21O8j11k33K42K37p9j92K78j56J30k7
6310A26l2J03j34l7m2k4J26M0m6j81Ln1l1K00N6k08j39J43m6J61J51o5j13O4p
6335A7n5j94J03J27J3j5J57j06J25k66k79M56R5j69J59l98J61l9N1K6K21k76K5
$$ plain form
6358 -61 3 117 -45 65 -125 61 319 14 -219 -96 -173 -265 116 -140 -120 -9 41 -242 -168 -133 -62 99 -114
6381 -114 -165 12 -207 -172 -115 -109 -43 36 40 -15 -177 -155 -257 441 51 -124 105 -2 -145 89 56 -44 95 48
6405 48 -43 -186 -116 94 84 -92 2 28 -4 154 125 -105 28 287 168 90 39 137 248 71 -214 9 -101 63
6429 63 175 -111 170 -58 -37 -43 -190 11 -79 -24 -32 100 204 116 -135 236 17 -59 102 53 -71 49 119 31
6453 31 10 -46 40 63 28 12 -73 197 -86 -11 -29 -201 8 -68 -5 43 269 169 -168 26 -157 151 -354 -75
6477 -75 70 -210 -26 -155 -130 -60 -4 -14 36 -75 -155 -13 -2 -86 75 25 36 -131 -121 70 42 114 85 102 95 175
6503 175 -313 -12 91 33 -38 65 -28 -53 -81 42 23 225 175 -134 -67 168 -219 -69 -15 -106 51 26 -365 238
6527 238 -5 18 87 183 40 -59 99 42 -96 160 316 120 55 226 29 85 -45 -181 30 -156 145 22
$$ packed form
6358f1O4J14j62J10j90J86K58l05k33J23p7r2L81k56K0J11N0k83P4L5P1J61k13
6381a14n1J77k19L5N7OO6P9Mn5j62K2j02O98l90j75K29j07j43K34l3j00J39m7
6405D8r1j43P0K10j0j76R4K6l2J58k9k30J33K59j19p8n1R8J11j77k85K23j10J64
6429F3J12k86K81k28K1oj47K01r0N5qJ32J04q8k51L71k19p6J61m9j24J20P0q8
6453C1k1n6Q6K3l5j6q5K70k83P5j8j72K09p6O3M8K26j00l37J94j83L08n05K79
6477g5J45k80J84j29K5P0N6j0N0j11q0J42J1q4J61n0J1j67J0J91k8P2k9J7pQ0
6503A75m88L01J03n8p1J03r3k5k8J23j9K02n0l09O7K35l87J50N4r1J57k5l91O03
6527B38k43K3O9R6j43r9J58n7j38K56J56j96o5J71j97N6j30j36K11j86L01j23
$$ plain form
6549 22 -183 -91 135 -29 75 34 209 -180 -8 274 -223 -140 7 -109 -54 117 96 -137 -37 36 349 46
6571 46 260 -161 42 89 109 -141 -48 -27 22 -168 -19 55 -296 204 156 -116 -167 -127 -43 -91 245 -256 53 -142
6595 -142 33 -31 -8 -10 -83 -62 7 131 59 394 -8 157 -183 -134 249 23 7 -59 145 -17 206 -41 91 82
6619 82 -133 -44 -28 -13 20 243 -99 -311 -7 -47 -86 -33 -98 -101 37 302 182 -69 -87 -41 -203 17 53 -219 55
6644 55 -120 250 152 212 -165 144 123 61 118 180 -21 -5 -66 85 -129 -100 20 91 45 79 -114 -28 89 -115 86
6669 86 39 -58 238 -175 215 134 113 396 -112 -14 5 125 13 81 290 -139 4 30 -112 -18 124 -13 41 -105
6693 -105 70 -96 -248 191 -19 -7 269 298 190 158 -109 -103 -149 -68 -65 94 -297 -133 94 -79 -95 36 164
6716 164 -103 185 -334 -57 -22 155 12 -51 4 82 27 -249 56 -93 85 -67 -201 -3 -137 229 31 101
$$ packed form
6549B2k05R2K26j64J04m1J75l89J72K82m97Q3J47j16N5J71k1k33J00P3L13l03
6571D6K14m21K03M7K0k50R3K1M9j90J49P4l51N00m8k72n1M0Q4m8L36n01L09j95
6595a42J75o4K3kp3K1O9J24p2L35m02J65l40M9L83k26j6o6K04j62K23k47J32r
6619H2k15Q9J6J5L3K23l42k12L04m0l9N3o5lJ38K65j20k51j8M6j62K20L6k72K74
6644E5j75L70r8O0l77L09k1o2N7O2k01J6o1J51k14K9J20P1m6L4j93Q6J17k04K01
6669H6m7r7K96m13L90q1k1K83n08R8J9J20j12O8K09m29J43K6j42R4J42j37N4j46
6693a05J75j66j52M39k10J2K76K9j08l2k67Om6Q1LJ59l91J64K27j73j6J31J28
6716A64k67K88n19K77L5J77j43o3N5P8n5k76L05j49J78j52j34J98j34L66j98P0
$$ plain form
6738 101 -71 23 117 -61 -94 -160 -105 -89 44 103 -186 288 251 24 -71 -117 -60 116 66 -89 51 -100 70 113
6762 113 1 -160 26 -107 -249 56 -192 -44 22 108 -6 -62 -86 -83 -134 -48 -49 -39 48 -232 -106 -111 -136 118 -13
6787 -13 -258 -41 73 73 171 -271 -180 -46 158 11 98 88 -94 -41 187 122 189 34 321 -80 -88 130 39 277
6811 277 -170 213 -30 -48 -127 89 -100 0 -70 -10 29 -150 -113 -187 155 108 -157 35 132 22 -49 389 -252
6834 -252 42 68 148 176 -75 249 257 37 112 -26 -45 17 84 -83 161 -77 63 260 -134 100 -43 -94 195
6857 195 88 -96 260 -3 71 -135 19 125 5 0 -11 207 9 87 116 -46 -45 98 30 -27 33 23 -3 142
6881 142 -31 -14 -19 -8 -156 160 -282 -9 -161 -213 -108 -183 377 -66 -167 118 210 105 47 65 -7 -285 -22
6904 -22 -60 -88 165 68 187 95 62 -11 -111 161 -2 164 24 -156 -173 1 -61 -119 -121 12 0 143 -40 -217
$$ packed form
6738A01j72R4R4j78l3o6N5J6J33N9k89M74l7k27r5m6N7J76n0j55J40j51J70M3
6762A13j12j61J86j33j42L05k48J48O6Q6j14n6k4Ln1Q6jJ0Q7k80J26nk5K54j31
6787a3k45K17J14%R8m42R1J34K04j47Q7j0j82N3K28o5O7j55K87m01qK18r1K38
6811B77m47L83k43j8p9K16j89J00p0O0L9j79L7p4L42m7k65J92R7j10p1M38o41
6834b52K94K6Q0K8k51L24Qk20P5j38j9O2O7j67K44k38J40J97l94K34j43n1K89
6857A95j07j84L56k63P4k06J54J06j20nj1K18j98P8K9j62JJ43o8n7O0j0k6J45
6881A42j73J7nJ1j48L16m42K73j52n2J05p5N60m43j01K85R2j05n8J8p2k78K63
6904b2l8k8K53r7J19r2l3p3j00K72j63J66j40j80j7J74o2n8kJ33j2J43j83j77
$$ plain form
6928 -217 -208 -35 -286 52 -24 -173 -225 69 70 79 -163 -156 53 111 202 135 39 -12 87 199 60 -95 -28 50 4 143
6954 143 -23 -174 185 101 67 131 -12 -251 79 240 45 -24 112 53 -38 -133 130 86 12 142 48 70 9 70
6978 70 -85 124 236 -55 -147 -165 73 -201 66 78 -72 47 -27 232 -62 -292 260 88 0 14 39 58 297
7001 297 243 74 269 189 -145 233 -196 20 274 -230 11 149 46 288 169 -179 -132 141 -88 -193 -16
7022 -16 -214 -40 -186 -23 72 51 -26 216 -270 -234 28 171 31 -332 123 -134 265 -390 -89 22 100 270
7044 270 54 120 122 -76 21 -123 -110 -126 -71 -175 -109 -12 -25 -61 -172 236 -264 -152 35 -66 -205 -49 44 77
7068 77 83 -41 108 -53 2 -198 39 67 153 41 -116 -159 119 -107 113 -49 136 137 -11 -42 -174 282 -163
7091 -163 -112 -90 -77 11 109 26 -42 -149 179 -151 188 -48 30 128 -105 70 1 102 -204 67 -205 -142 -167 130
$$ packed form
6928b17RJ73k51L38p6j49n2K94JRk42PK09N8R1o7r6n1R9J12j39j55O7P8m6J39
6954A43j66j51L59q4l4O4j43k39L30J61j95o9J36n9r1r5K63m4p4J30r4K2o1O1
6978G0j55K09J12k91r2j8K38k74K67J2j50J19p4K59k94k30N52j72q8J4K5J9K39
7001B97n4j69J95q0l34L78m29K16K54n04K41J38j03K42j19l48M7K73k29j05J77
7022a6j98J74j46J63R5k1p7K42m86L6K62J43j40l63M55k57L99o55L01J11P8J70
7044B70k16O6Kj98R7j44J3j6N5j04O6R7j3l6j11M08n00J12J87j01j39J56R3L3
7068G7Oj24J49j61N5k00K37K8Q6j12j57m3K78k26K20j62J85Jj48l1j32M56m45
7091a63N1K2J3Q8R8q3o8j07L28l30L39k36P8R8k33J75o9J01l06K71k72O3k5K97
$$ plain form
7115 130 59 29 90 -113 -113 -190 -1 -19 -5 35 73 96 -85 48 -67 -162 -92 -132 152 -135 184 -31 -48 -109 59
7140 59 23 166 122 -435 4 -30 131 -162 -25 24 180 68 -122 210 38 291 -23 69 -177 -210 98 163 36
7163 36 -20 -5 140 -18 74 -13 -139 -56 -77 145 -50 48 39 -8 186 -36 -148 -371 276 25 -104 139 -141 -15
7187 -15 231 78 99 144 -241 120 -90 0 135 -75 30 6 -30 -131 270 -86 90 5 50 -151 -21 -24 -119 68
7211 68 52 23 -24 136 160 -151 60 164 356 -238 42 -36 -97 -91 -131 126 89 -2 191 103 137 -55 106 202 -5
7236 -5 2 314 -178 225 47 83 105 -169 30 108 121 -119 -32 -29 29 -83 -44 -45 -125 23 -61 16 -52 -254 -55 -146 136
7263 136 -118 73 -83 -20 235 -87 65 278 75 20 148 -159 157 -265 -55 139 65 98 -422 115 102 -65
7285 -65 -33 130 -50 136 0 10 75 -81 73 57 -38 170 125 -37 -49 78 -167 146 152 -45 142 4 37 41
$$ packed form
7115A30p1l0O1k03%p7J89j8J4M0L8K3j81J33j15r5P0m0K84k87L19k15j7o1J68
7140E9l6J43m4n57M39l4J61k93J37M9J56j12j90L32j72K53l14R2k46l3L08O5j27
7163C6n6J5J45j58R2q7j26Q3k1K22j95R8rm7J94k22j12k23O47k51j29K43k80J26
7187a5K46j53K1M5l85L61k10R0J35k10J05k4l6j01M01l56J76q5M5k01J30lr5J87
7211F8j6k9m7J60K4l11K11J04J92n94K80p8o1Om0K57l7r1J93q8L4j92J61R6k07
7236ePL12m92M03j78L6K2k74J99P8J3k40Q7LN8j12L9jq0J48q4P7o8k02J99r1K82
7263A36k54J91j56O3K55l22J52K13k03n5J28l07L16m22K10J94p4L3n20N37j3j67
7285f5L2J63j80J86j36J0O5j56J54j6r5K08m5j62j2J27k45L13Oj97J87j38L3M
$$ plain form
7309 41 142 -54 203 151 -44 3 6 -64 68 -72 -131 119 -35 -155 90 83 79 133 185 98 -81 104 -148 104 -85
7334 -85 -3 135 -24 93 104 -27 158 -182 0 -98 -29 -236 231 128 -66 200 -316 -11 -133 153 -137 -275
7356 -275 -180 113 118 8 -42 156 47 -371 6 -18 -141 -139 -127 -55 -31 -72 153 -118 -84 13 222 91 31 325 146
7381 146 -68 56 200 299 16 22 289 59 -55 -97 98 -177 -239 2 -66 269 24 208 81 -13 -102 147 195
7404 195 -124 92 190 -116 -189 -73 -99 151 -42 288 -189 229 119 -158 -85 -40 -24 195 -217 88 290 96
7426 96 235 -180 361 92 7 -180 79 -3 -187 -151 -173 -65 -112 80 145 -128 -61 199 -149 -123 -119 140 22 98
7450 98 278 -6 23 150 -55 121 -23 34 184 100 3 -50 -99 40 140 -86 -120 93 -87 -50 156 271 49
7473 49 -230 -212 58 294 72 -5 -25 -121 120 147 139 39 -174 23 191 -53 86 68 -13 -328 -165 168 -155
$$ packed form
7309D1J01j96K57n2j95M7Lp0J32j40n9K50j54j20K45pmN4N2q7j79J85k52K52j89
7334h5Q2J38j59J17J1j31J85l40J82r8O9k07M67j03j94K66n16L05j22K86k90j38
7356b75R5K93Nj10n0J98j09m18L77k4j23KJ2P2K4m1K25k71L4R7K09j31o0K94j79
7381A46k14J24J44R9k83OK67k30j14m2J95k75o2K41o8L35k45J84j27r4q9K49M8
7404A95l19K16R8l06p3J16k6K50j93L30m77M18j10k77P3M5J6K19m12L05K02j94
7426I6J39m15N41k69q5j87K59q2j84L6k2J08m7J92O5k73O7K60l48K6MK59j18P6
7450I8J80k84K9J27k05J76j44N7J50q4r7n3m9J39J00k26l4K13j80L7K06J15k22
7473D9k79J8K70K36k22p7k0r6K41K7qj00k13J97J68k44J39j8q1l15J63L33l23
$$ plain form
7496 -155 74 91 154 108 36 44 -60 -129 -118 -140 -2 154 227 -45 -12 97 -14 -83 -150 114 162 122 33 -163 -69 -149
7522 -149 96 -63 177 65 269 82 56 140 164 180 208 133 53 108 -42 -84 -16 14 132 70 -203 -90 237 66
7546 66 274 46 85 38 84 -157 -102 -218 0 41 -6 -192 -154 114 51 93 -108 -24 -261 -148 97 -144 -71 -3
7570 -3 -48 -101 156 -9 170 -27 145 9 -34 107 -68 -30 -151 -101 279 78 -122 101 92 -61 222 -137 -50
7593 -50 37 -168 41 62 10 -93 -19 -106 22 199 200 -221 110 -3 -135 19 130 -132 267 199 12 125 1
7616 1 -286 172 -96 -299 32 -54 -150 305 140 -47 150 -62 37 -56 10 -21 -19 -154 -64 361 -73 -369 43 -29
7640 -29 -256 173 13 324 23 65 87 -16 134 -236 70 50 104 93 -25 128 36 -170 3 91 52 -244 -29
7663 -29 -129 -157 26 53 -236 -84 -133 -68 -104 38 -61 -101 136 119 -63 59 215 0 -75 -19 131 2 -132 -41
$$ packed form
7496a55K29J7O3m6p2Qj04o9J1k2J38J56P3k72L3J09j11o9o7K64M8m0q9j96R4q0
7522a49K45j59K40j12K04j87k6Q4K4J6K8p5q0N5j50m2O8L0J18o2k73J13L27j71
7546F6K08k28L9m7M6k41N5j16K18M1m7j86L8K68o3M2k01Q4k37J13K45k41P3O8
7570cm5n3K57j65J79j97J72j36m3J41j75L8j21N0L80k01k00K23rj53K83l59Q7
7593e0Q7k05K09K1n2j03P4q7J28J77Jm21L31j13j32J54J11k62L99o8j87J13j24
7616Ak87M58k68k03L31q6r6M55j65j87J97k12R9r3O6l1Kj35R0M25m34k96M12p2
7640b9k27M29j60L11l01M2K2j03J50l70L06k0N4j1j18J53r2k06J73Q8l9k96K15
7663b9j00k8J83K7k89J52m9O5l6J42r9m0K37j7j82J22J56k15p5N6J50j29j34R1
$$ plain form
7687 -41 -145 -74 -269 97 -243 41 119 197 -29 -80 205 -270 -63 227 -106 9 16 -122 278 -197 -18 -82 -143
7710 -143 -73 45 -16 -52 165 81 11 -90 139 144 7 138 235 5 -65 15 -38 35 168 277 -111 -161 -43 33 -135
7735 -135 -163 81 4 -104 151 -26 -237 27 -149 -261 42 -65 -5 9 -5 -182 -157 -186 -67 -83 -172 -87 214
7758 214 -36 -82 156 -207 17 -1 -305 -156 45 205 271 141 -213 -127 -57 -111 -24 -334 8 40 456 -216 -268
7781 -268 117 77 35 227 -114 -93 244 277 1 -72 10 -172 51 275 -116 42 -79 -124 166 -24 -258 108
7803 108 169 -40 -8 14 36 -147 -39 -121 33 87 -66 103 -24 -108 -160 -203 137 -131 -18 -190 -97 -262 186
7826 186 -2 118 126 -194 57 137 -109 2 -53 -4 226 5 86 -59 -33 -20 112 11 6 76 8 -206 -383 -96
7850 -96 95 -144 -5 133 153 161 -303 -40 45 -228 43 139 -98 -108 41 -34 -137 -184 -53 -288 131 -22 118
$$ packed form
7687d1j04P1j95L66l40K84P8P8k26n1K85m75K07K90l33J15Pj38M00m75J79o4o1
7710a43P0J18o1l6K17q4p0j01K29Nj37J31R7k30p0Q0n3P3J33J09l88n0J18P6j68
7735a35k8K44p7j08K55j77k11K64j76j12L03j07O0J4j4j77K5k9J19j6q9Q5L01
7758B14k50m6K38l63K24j8l04J49K01J60O6j30l54Q6P0n4Q7l10L42L2M16o72n2
7781b68L85m0m2J92l41K1L37L3k76p3Q2j82K23K24l91J58j21m5K90j90k34L66
7803A08O1k09L2K2K2j83J08q2J54N4j53J69j27q4n2m3L40k68J13j72R3j65M48
7826A86j88J20Ql20K51Q0k46J11n5M9K30k21Q1j45K6J3J32j01nP0o8k14j77K87
7850i6J91k39J39J38K0Qm64K63Q5k73K71R6k37j0J49p5j03m7J31k35M19j53J40
$$ plain form
7873 118 -42 15 172 272 -56 80 80 152 19 -74 -153 10 -41 -187 -83 -92 -99 -67 -59 34 204 -93 134 19 -3
7898 -3 -28 47 163 191 -102 65 211 -160 -109 33 190 48 30 76 -29 275 18 -18 19 5 -157 -113 -237 -39
7922 -39 138 -160 -86 -19 7 -205 41 -54 132 -2 6 -37 218 -178 168 27 182 -182 151 -35 -29 -151 -198 -21
7946 -21 -236 167 -283 39 102 -225 16 -261 -81 -152 -67 8 49 90 -166 -26 -78 61 124 147 93 -53 11 -139
7970 -139 -134 96 188 -148 -15 -36 83 179 -143 126 12 -63 -193 -159 -183 44 -28 189 -125 93 10 102 28 314
7994 314 -86 -187 5 54 166 100 1 249 345 32 159 65 -101 46 154 -371 -100 -110 -213 -4 -17 129
8016 129 150 -30 146 22 -1 -75 -223 -38 -92 -110 -66 -76 -14 49 -193 -86 -127 51 182 41 -3 77 -112 -6
8040 -6 -240 118 153 -77 74 98 194 202 85 -19 194 -161 -139 51 -82 185 85 21 -9 -214 83 -125 189
$$ packed form
7873A18j60N7J57J00l28J36%P2j33r3p9J63n1j46J04rpL2QR3J70k97K27j15k2
7898ck5P5J16K8k93J67J46l71N1J42J57j42j8M6j05L04k57l6L7j4j62M4j24J98
7922c9J77k98P4O7K6k12K46r5J86j34Qm3K55l96L46j41J55l64L33j86Oj22m7J77
7946b1k15M03m50L22O3l27K41k77J80p1Q5P5M1M1k56J40n2J39O3K3n4j46O4j50
7970a39NK30R2l36J33k1J19R6l22K69j14p5j30L4k4K27p2K17l14K18q3R2p4K86
7994C14m00j01J92M9J12o6r9K48R6l13J27r4j66J47J08n25K71j0j03K09j3J46
8016A29K1j80J76j24k3p4j48J85n4j8M4j0O2O3k42J07m1J78J31j41m4Q0j89J06
8040fk34L58L5k30J51K4R6Qj17j04K13l55K2J90j33K67j00o4l0k05K97k08L14
$$ plain form
8063 189 -32 119 -40 -22 93 11 -57 -173 95 -164 -166 2 -107 63 2 -150 41 -146 -11 -241 5 -132
8085 -132 -23 232 117 -53 -5 -53 57 82 -78 -197 -23 -94 -238 -202 -77 91 122 -167 90 43 157 55
8107 55 -38 36 -102 67 280 -33 -45 71 -19 32 30 112 166 36 203 -280 8 -11 114 341 -52 228 11 58
8131 58 22 94 118 -246 19 119 -135 -2 124 -25 -2 153 99 -77 -12 150 -23 -267 10 121 -47 117
8153 117 336 -191 -55 -92 24 -53 -127 98 -156 361 -106 -116 11 -128 -48 178 68 -36 -16 -101 56 -42 13
8176 13 141 96 68 5 1 -61 184 74 -284 -219 7 72 186 174 -54
$$ packed form
8063A89k21J51j59J8J15q2o8j16K68k59kJ68j09J70o1j52J91j87J35k30K46j37
8085a32J09K55j15j70M8m8J10K5j60j19J74p1j44L6J25J68L1k89K57m7J14j02
8107E5r3P4j38J69K13l13j2J16r0N1kQ2N4j30J67m83K88j9J25K27l93K80k17M7
8131E8l6P2K4l64K65J00k54J33J26j49K3J55n4j76O5J62j73k44K77J11j68J64
8153A17K19n27J36l7J16p7p4K25k54N17m67j0J27j39Q0K26j10j04K0q5J57r8N5
8176A3J28m5k8o3mo2K45j10l58O5K26O5J14j2k28
8191e4
$$ Imaginary data points
##PAGE= N=2
##DATA TABLE= (X++(I..I)), XYDATA
$$ plain form
0 0 0 0 0 0 0 0 0 0 0 0 0 -8 8 -8 16 -16 24 -24 32 -33 40 -48 56 -69 80 -93 111 -127 144 -167 189 -216 245
33 245 -277 312 -350 392 -440 490 -549 608 -676 750 -828 917 -1010 1114 -1229 1354 -1491
50 -1491 1643 -1809 1999 -2203 2436 -2702 3003 -3354 3761 -4247 4837 -5567 6504 -7746 9485
65 9485 -12096 16431 -24940 47917 -244076 -703925 -285839 -124585 -3053 392448 514283
76 514283 218636 152526 -57803 -568307 -563069 -39131 135253 208218 479496 372938 -65565
87 -65565 -194022 -300497 -530484 -282950 253672 366954 332132 380443 78441 -347123 -343918
98 -343918 -259080 -277812 41866 448612 391424 188466 82437 -222182 -481550 -312472 -87886
109 -87886 16438 303162 500299 241628 -59723 -156814 -325905 -401761 -115932 171413
$$ packed form
0@%%%%%%%%%%%qJ6j6K4l2M0m8N6o5P3q8J04j25J49j73K04k38K71l11L56m05M61
33B45n22N89o62P42q32R30j039J157j284J426j578J745j927K124k343K583k845
50a491L134l452L808m202M639n138N705o357P115q008R084j0404J2071j4250J7231
65I485k1581K8527m1371P2857k91993m59849M18086J61254J21532L95501J21835
76E14283k95647o6110k10329n10504N238N23938J74384P2965K71278j06558m38503
87f5565j28457j06475k29987K47534N36622J13282l4822M8311l02002m25564L205
98c43918Q4838j8732L19678M06746n7188k02958j06029l04619k59368J69078K24586
109h7886J04324K86724J97137k58671l01351r7091j69091p5856K85829K87345
$$ plain form
119 171413 255232 350888 302330 -45302 -284159 -271270 -299900 -236943 120345 384937 326462
130 326462 200921 31025 -244798 -340374 -207542 -116974 23075 322861 415421 170494
140 170494 -59855 -192427 -327207 -289426 -66119 88640 206208 355165 273721 -48342
150 -48342 -250883 -276164 -254788 -91105 163489 256139 233072 215520 46855 -241147 -342998
161 -342998 -238614 -86574 120972 290305 248279 115651 28383 -135653 -321950 -278935
171 -278935 -51433 147075 271787 277947 121321 -50487 -146257 -245152 -274347 -99788 142671
182 142671 259414 249121 140269 -44682 -191523 -237099 -206313 -78673 125371 260384
192 260384 248348 135639 -30050 -191363 -258273 -200041 -52452 119971 227757 221255 125611
$$ packed form
119A71413Q3819R5656m8558l47632k38857J2889k8630O2957L57288K64592n8475
130C26462j25541j69896k75823r5576J32832R0568J40049K99786R2560k44927
140A70494k30349j32572j34780L7781K23307J54759J17568J48957q1444l22063
150d8342k02541k5281K1376J63683K54594R2650k3067j7552j68665k88002j01851
161c42998J04384J52040K07546J69333m2026j32628q7268j64036j86297M3015
171b78935K27502J98508J24712O160j56626j71808r5770r8895k9195J74559K42459
182A42671J16743j0293j08852j84951j46841m5576L0786J27640K04044J35013
192B60384j2036j12709j65689j61313o6910N8232J47589J72423J07786o502r5644
$$ plain form
203 125611 -27256 -185561 -251703 -188707 -44924 127529 244634 222884 104791 -30257
213 -30257 -169676 -248578 -179123 -30931 99401 212094 239938 104773 -74366 -173842 -217869
224 -217869 -177058 -17890 124573 180521 217298 158313 -58318 -222754 -206110 -134161 -34407
235 -34407 121804 198714 161554 117727 -2 -211864 -267899 -116500 11268 93637 202765
246 202765 198283 66928 -27939 -125147 -247781 -185454 32161 137760 157994 191061 95179
257 95179 -92189 -154206 -156711 -179192 -51068 166100 208545 141908 95188 -45297 -202967
268 -202967 -170080 -81066 -53902 80473 243801 181436 25526 -46809 -150400 -225965 -104964
279 -104964 35176 67086 159020 225798 63841 -113498 -128405 -154983 -160302 13162 158482
$$ packed form
203A25611j52867j58305o6142O2996J43783J72453J17105k1750j18093j35048
213c0257j39419p8902O9455J48192J30332J12693K7844j35165j79139r9476m4027
224b17869M0811J59168J42463N5948L6777n8985k16631j64436J6644P1949R9754
235c4407J56211P6910l7160m3827j17729k11862n6035J51399J27768Q2369J09128
246B02765m482j31355r4867r7208j22634O2327K17615J05599K0234L3067r5882
257I5179j87368o2017k505k2481J28124K17168M2445o6637m6720j40485j57670
268b02967L2887Q9014K7164J34375J63328o2365j55910p2335j03591p5565J21001
279a04964J40140L1910R1934O6778j61957j77339j4907k6578n319J73464J45320
$$ plain form
290 158482 139911 140442 110891 -84335 -202910 -129549 -94605 -57963 129478 226386 113928
301 113928 32820 -22738 -170986 -198574 -53274 13876 53958 196495 198167 4995 -91862
312 -91862 -107788 -181847 -130123 58054 115446 104704 165345 93632 -112270 -165523 -115863 -116270
324 -116270 -8352 171255 159126 67325 70654 -16339 -187846 -175334 -56719 -5231 101352
335 101352 209490 108723 -28510 -27904 -89228 -199372 -109495 58468 103295 143975 163103
346 163103 12088 -120372 -92052 -104748 -139323 4844 157674 134708 97643 64273 -86579
357 -86579 -178988 -98434 -47643 -26696 109295 188520 90714 10312 -32806 -149014 -174334 -35522
369 -35522 49583 65972 141112 140079 -582 -84302 -99253 -145987 -98691 63026 125879 98707
$$ packed form
290A58482j8571N31k9551j95226j18575P3361L4944L6642J87441R6908j12458
301A13928q1108n5558j48248k7588J45300O7150M0082J42537J672j93172r6857
312i1862j5926p4059N1724J88177N7392j0742O0641p1713k05902n3253M9660m07
324a16270J07918J79607j2129r1801L329q6993j71507J2512J18615N1488J06583
335A01352J08138j00767j37233O06o1324j10144Q9877J67963M4827M0680J9128
346A63103j51015j32460K8320j2696l4575J44167J52830k2966l7065l3370j50852
357h6579r2409Q0554N0791K0947J35991P9225r7806q0402m3118j16208k5320J38812
369c5522Q5105J6389P5140j033j40661q3720j4951m6734M7296J61717O2853k7172
$$ plain form
381 98707 109326 51316 -97516 -143048 -93678 -70679 4912 132062 141559 68805 30668 -53263
393 -53263 -163139 -130531 -18537 26635 76987 145664 104853 -254 -60635 -120935 -149834
404 -149834 -47453 74932 91780 92866 104422 26404 -84033 -120885 -117695 -71997 50570
415 50570 135129 103973 57616 25140 -57439 -128291 -110301 -51589 24250 118801 142893 62757
427 62757 -18900 -62023 -103512 -109437 -48833 29251 95187 135166 93334 -17389 -94536 -102564
439 -102564 -83480 -41954 27764 92221 119543 90699 1849 -94324 -123766 -84406 -23679 35204
451 35204 86438 109611 80464 1540 -82047 -117792 -92540 -27210 46743 95787 101411 68818
463 68818 150 -79138 -114221 -85599 -29047 37432 99947 111298 57154 -13217 -72831 -109537
$$ packed form
381I8707J0619n8010j48832m5532M9370K2999P5591J27150R497p2754l8137q3931
393e3263j09876L2608J11994M5172N0352O8677m0811j05107o0381o0300k8899
404a49834J02381J22385J6848J086J1556p8018j10437l6852L190M5698J22567
415E0570Q4559l1156m6357l2476q2579p0852J7990N8712P5839R4551K4092q0136
427F2757q1657m3123m1489n925O0604P8084O5936L9979m1832j10723p7147q028
439a02564J9084M1526O9718O4457K7322k8844q8850r6173k9442L9360O0727N8883
451C5204N1234K3173k9147p8924q3587l5745K5252O5330P3953M9044N624l2593
463F8818o8668p9288l5083K8622N6552O6479O2515J1351n4144p0371n9614l6706
$$ plain form
475 -109537 -86586 -15831 43130 82310 107076 71592 -17682 -81407 -99145 -87815 -25270 60396
487 60396 91589 79171 61366 3290 -82863 -109840 -75245 -26027 49374 112325 87014 24921
499 24921 -2537 -47466 -110053 -93248 -14103 47274 96790 110356 33534 -46493 -52348 -66840
511 -66840 -96061 -35531 64455 93331 87252 58935 -33306 -96324 -64817 -45891 -47324 33506
523 33506 113891 85910 35557 -3527 -85813 -116161 -39258 9084 15607 78956 110057 31327
535 31327 -30697 -49915 -99803 -88877 18750 65832 48880 78960 67549 -35200 -82586 -64527
547 -64527 -73795 -29595 79905 94672 41456 40795 4924 -91594 -94559 -29686 -14783 26528 105591
560 105591 81295 4664 -9783 -48615 -113718 -62775 31937 39977 54148 94184 37846 -49245
$$ packed form
475a09537K2951P0755N8961L9180K4766l5484q9274o3725j7738J1330O2545Q5666
487F0396L1193j2418j7805n8076q6153k6977L4595M9218P5401O2951k5311o2093
499B4921k7458m4929o2587J6805P9145O1377M9516J3566p6822q0027n855j4492
511f6840k9221O0530R9986K8876o079k8317r2241o3018L1507J8926j433Q0830
523C3506Q0385k7981n0353l9084q2286l0348P6903M8342O523O3349L1101p8730
535C1327o2024j9218m9888J0926J07627M7082j6952L0080j1411j02749m7386J8059
547f4527r268M4200J09500J4767n3216o61l5871r6518k965O4873J4903M1311P9063
560A05591k4296p6631j4447l8832o5103N0943R4712Q040J4171M0036n6338q7091
$$ plain form
572 -49245 -56156 -66795 -81471 3097 85458 58594 40911 53962 -14137 -89408 -69006 -43353
584 -43353 -25877 59491 108720 45187 535 -969 -58711 -96941 -38460 10273 28586 84747
596 84747 91197 -401 -50315 -38296 -63638 -66350 8745 55311 54841 75750 46046 -55626 -87286
609 -87286 -41807 -32779 -16632 54503 78542 44588 31128 -10770 -90539 -83561 -9668 10954
621 10954 24107 76265 68854 4104 -23280 -48971 -89371 -48127 36278 49993 45107 65670
633 65670 25388 -48095 -56241 -47622 -54777 -1017 71486 64751 35336 27300 -25301 -80575 -56149
646 -56149 -18292 -6454 42790 84930 46186 -2320 -19144 -57460 -77005 -24281 24894 34303
658 34303 58496 62700 5123 -40374 -45746 -60226 -47963 20746 63386 51802 40565 16011
$$ packed form
572d9245o911j0639j4676Q4568Q2361k6864j7683J3051o8099p5271K0402K5653
584d3353J7476Q5368M9229o3533m4652j504n7742l8230N8481M8733J8313N6161
596H4747O450r1598m9914J2019k5342k712P5095M6566m70K0909k9704j01672l1660
609h7286M5479R028J6147P1135K4039l3954j3460m1898p9769O978P3893K0622
621A0954J3153N2158p411o4750k7384k5691m0400M1244Q4405J3715m886K0563
633F5670m0282p3483q146Q619p155N3760P2503o735k9415q036n2601n5274K4426
646e6149L7857J1838M9244M2140l8744m8506j6824l8316j9545N2724M9175R409
658C4303K4193M204n7577m5497n372j4480J2263O8709M2640j1584j1237k4554
$$ plain form
670 16011 -37393 -59468 -44709 -34184 -1076 59881 73863 32650 -768 -27388 -56760 -52908
682 -52908 -21024 4775 39833 72665 51234 -6201 -40719 -51649 -49649 -21643 16740 39733
694 39733 53920 50483 8853 -41959 -60699 -47749 -18663 19027 45505 49258 37837 10383
706 10383 -30812 -60116 -54504 -19577 23766 49804 48794 30940 4944 -28420 -52653 -51157 -24632
719 -24632 18796 53685 53845 26811 -706 -27828 -51865 -48339 -17412 16166 44821 57669 32817
732 32817 -8053 -32111 -46017 -49036 -18161 25397 42567 44772 37048 70 -40694 -47718 -38709
745 -38709 -22420 20676 54464 43742 21029 4785 -30953 -56479 -37791 -10032 11404 46698
757 46698 59258 20335 -14222 -24582 -44493 -47170 -7800 23187 32686 50715 40235 -15542
$$ packed form
670A6011n3404k2075J4759J0525L3108O0957J3982m1213l3418k6620k9372L852
682e2908L1884K5799L5058L2832k1431n7435l4518j0930K000K8006L8383K2993
694C9733J4187l437m1630n0812j8740J2950K9086L7690K6478L753j1421k7454
706A0383m1195k9304N612L4927M3343K6038j010j7854k5996l3364k4233J496K6525
719b4632M3428L4889J60k7034k7517k7122k4037L526L0927L3578K8655J2848k4852
732C2817m0870k4058j3906l019L0875M3558J7170K205p724l6978m0764p024R009
745c8709J6289M3096L3788j0722k2713j6244l5738k5526J8688K7759K1436L5294
757D6698J2560l8923l4557j0360j9911k677L9370L0987R499J8029j0480n5777
$$ plain form
769 -15542 -46417 -35421 -32374 -18830 25088 43777 33731 32846 7694 -49035 -58487 -20149 -3656
782 -3656 10600 45461 45012 13665 1967 -22098 -62759 -44058 11813 25113 27228 46956 26022
795 26022 -18617 -26120 -32868 -50413 -13686 42739 40625 24883 28835 -3797 -46430 -35404 -20372
808 -20372 -22812 17457 60407 35882 4180 994 -28933 -55310 -22886 6035 6957 36830 56919
821 56919 12039 -24162 -20266 -36572 -44202 3267 34412 24893 34708 32467 -19236 -44123 -23670
834 -23670 -25786 -20105 31162 51317 22286 12281 703 -41101 -45227 -10113 -4181 5467 48525
847 48525 47814 -239 -16593 -20955 -44113 -28760 13690 18235 20620 45957 25309 -28606 -36492
860 -36492 -24837 -28980 -2614 36457 28621 16916 26794 -2415 -48519 -38780 -10761 -3475 22140
$$ packed form
769a5542l0875J0996L047J3544M3918J8689j0046q85k5152n6729r452L8338J6493
782c656J4256L4861m49l1347j1698k4065m0661J8701N5871J3300K115J9728k0934
795B6022m4639p503o748j7545L6727N6425k114j5742L952l2632m2633J1026J5032
808b0372k440M0269M2950k4525l1702l186k9927k6377L2424K8921R22K9873K0089
821E6919m4880l6201L896j6306p630M7469L1145r519R815k241n1703k4887K0453
834b3670k116N681N1267K0155k9031j0005j1578m1804m126L5114N932R648M3058
847D8525p11m8053j6354m362k3158J5353M2450M545K385K5337k0648n3915p886
860c6492J1655m143K6366L9071p836j1705R878k9209m6104R739K8019P286K5615
$$ plain form
873 22140 45672 21430 -1111 2214 -23136 -51492 -23669 13977 20202 32370 36980 1429 -22066
886 -22066 -15609 -28693 -36969 2751 36315 29131 24074 15812 -20246 -36197 -19696 -16947 -10925
899 -10925 26729 43881 19978 4558 -7030 -34341 -36831 -8415 5349 13469 36429 32648 -806
912 -806 -16732 -21381 -34250 -22565 12067 24997 24187 28060 10110 -22476 -28969 -21661 -19724 -205
926 -205 29658 32702 18788 7439 -14650 -34728 -26132 -7217 1515 17331 34706 25777 1661
939 1661 -15787 -29822 -30713 -8636 12370 17541 23442 26147 7800 -18513 -30771 -28587 -12398
952 -12398 12954 25842 21443 15914 7865 -12077 -30088 -29747 -12816 10623 27938 27234 13464
965 13464 -200 -12242 -23656 -26723 -14689 8183 27289 29962 15207 -2836 -16675 -23769 -20990
$$ packed form
873B2140K3532k4242k2541L325k5350k8356K7823L7646O225J2168M610l5551k3495
886b2066O457j3084q276L9720L3564p184n057q262l6058j5951J6501K749O022
899a0925L7654J7152k3903j5420j1588k7311k490K8416J3764Q120K2960l781l3454
912h06j5926m649j2869J1685L4632J2930q10L873j7950l2586o493P308J937J9519
926b05K9863L044j3914j1349k2089k0078Q596J8915Q732J5816J7375q929k4116
939A661j7448j4035q91K2077K1006N171N901K705j8347k6313j2258K184J6189
952a2398K5352J2888m399n529q049j9942j8011L41J6931K3439J7315p04j3770
965A3464j3664j2042j1414l067J2034K2872J9106K673j4755j8043j3839p094K779
$$ plain form
978 -20990 -11204 4288 22944 31812 18641 -3807 -18597 -25108 -22211 -6621 9116 18441 25927
991 25927 21891 -1359 -21442 -23799 -20288 -10277 11199 24249 20848 15437 4158 -19213 -28828
1004 -28828 -17017 -6516 5050 25396 28498 9374 -3432 -12412 -26620 -22461 -833 8610 15016
1017 15016 28691 19789 -8963 -19738 -18841 -21982 -7593 16492 18608 15692 20214 2399 -26333
1030 -26333 -25351 -11529 -7024 9492 27171 16877 5356 6203 -12386 -33523 -19207 2823 8548
1043 8548 20664 27104 5263 -10044 -6538 -19251 -28821 -2597 20024 17381 19035 15666 -10185
1056 -10185 -21410 -10479 -14744 -15660 13619 29823 15649 7965 417 -22850 -25622 -4699 -1707
1069 -1707 530 24357 27487 2635 -7257 -10383 -25889 -18779 7748 11633 9677 23346 15985 -12843
$$ packed form
978b0990R786J5492J8656Q868j3171k2448j4790o511K897J5590J5737R325P486
991B5927m036k3250k0083k357L511J0011K1476J3050l401n411j1279k3371r615
1004b8828J1811J0501J1566K0346L102j9124j2806q980j4208M159K1628R443O406
1017A5016J3675q902k8752j0775Q97l141J4389K4085K116k916M522j7815k8732
1030b6333R82J3822M505J6516J7679j0294j1521Q47j8589k1137J4316K2030N725
1043H548J2116O440k1841j5307L506j2713r570K6224K2621k643J654l369k5851
1056a0185j1225J0931m265r16K9279J6204j4174p684p548k3267k772K0923K992
1069a707K237K3827L130k4852r892l126j5506P110K6527L885j956J3669p361k8828
$$ plain form
1083 -12843 -18430 -13100 -19452 -5387 22017 19996 8196 12381 -89 -24431 -19847 -5470 -6509
1096 -6509 6801 28471 18017 -974 -1106 -12197 -28091 -11898 8308 6189 13868 25962 7125
1109 7125 -15034 -12405 -15191 -20052 2983 20373 10560 10865 15910 -5886 -24169 -15053 -9321 -5923
1123 -5923 16968 25317 6843 1021 2642 -16565 -24981 -7007 2950 6802 22287 19844 -4126
1136 -4126 -9928 -5961 -18495 -17593 5742 14190 13275 19353 7988 -16768 -17249 -7145 -11247 -4307
1150 -4307 16401 18249 9870 7893 -5602 -23915 -15862 -761 -422 7215 21106 14302 -220 -4633
1164 -4633 -14684 -22433 -7212 9511 9734 12455 16180 3314 -11592 -12672 -13990 -12596 3979 17477
1178 17477 13662 9753 5970 -8606 -18552 -12435 -5867 463 13576 19002 9765 684 -6103 -16144
$$ packed form
1083a2843n587N330o352J4065K7404k021j1800M185j2470k4342M584J4377j039
1096f509J3310K1670j0454j8991j32j1091j5894J6193K0206k119P679J2094j8837
1109G125k2159K629k786m861K3035J7390r813L05N045k1796j8283R116N732L398
1123e923K2891Q349j8474n822J621j9207q416J7974R957L852J5485k443k3970
1136d126n802L967j2534R02K3335Q448r15O078j1365k4756m81J0104m102O940
1150d307K0708J848q379j977j3495j8313Q053J5101L39P637J3891o804j4522m413
1164d633j0051p749J5221J6723K23K721L725j2866j4906j080j318J394J6575J3498
1178A7477l815l909l783j4576r946O117O568O330J3113N426r237r081o787j0041
$$ plain form
1192 -16144 -16930 -4544 5667 9939 15348 12922 1040 -8697 -13524 -15565 -8475 6746 14418 13239
1206 13239 9099 1962 -8686 -14139 -12992 -7889 3398 15481 16369 7802 -1384 -8178 -12593 -12560 -6761
1221 -6761 2782 12960 17097 10262 -1859 -10971 -13184 -9801 -5024 2436 11316 15901 10719 -112
1235 -112 -10935 -15638 -10676 -1467 4743 9048 13898 11171 -228 -9986 -14318 -12859 -3103 8313
1249 8313 11453 9730 9170 1623 -10681 -14346 -10415 -4885 5779 15267 11947 4264 956 -7067 -15591
1264 -15591 -11115 -1097 4164 11153 15870 6167 -4673 -7073 -11192 -13858 -2132 9346 9407 10440
1278 10440 10483 -2291 -12353 -10070 -8782 -6418 7945 15668 7763 3793 2414 -9370 -15625 -6942
1292 -6942 -1417 2348 14394 15102 664 -4847 -3736 -12103 -12995 547 6772 7929 14499 8600 -8809
$$ packed form
1192a6144p86J2386J0211M272N409k426j1882r737m827k041P090J5221P672j179
1206A3239m140p137j0648n453J147N103J1287J2083Q88q567r186o794m415L3N799
1221f761R543J0178M137o835j2121r112k213L383M777P460Q880M585n182j0831
1235a12j0823m703M962R209O210M305M850k727j1399r758m332J459R756J1416
1249H313L140j723n60p547j2304l665L931N530J0664R488l320p683l308q023q524
1264a5591M476J0018N261O989M717r703j0840k400m119k666J1726J1478O1J033
1278A0440M3j2774j0062K283J288K364J4363P723p905l970j379j1784o255Q683
1292f942N525L765J2046P08j4438n511J111q367q92J3542O225J157O570n899j7409
$$ plain form
1307 -8809 -10869 -5367 -9118 -5619 8874 11646 7717 8983 -341 -16535 -12260 -1036 -2414 1912
1321 1912 13877 10832 1943 657 -7919 -18033 -7111 6415 4005 6040 13729 4824 -6548 -5931
1335 -5931 -9788 -13559 1048 13395 7291 5333 8506 -3110 -13303 -7188 -5384 -5614 8544 16211
1349 16211 4978 368 1293 -9775 -14873 -2890 1983 1567 11783 13766 -919 -6018 -3847 -11174
1363 -11174 -11015 4670 9129 4757 9546 7098 -8010 -10250 -4839 -8271 -3394 11965 12156 2676
1377 2676 3275 -370 -12205 -10258 -1747 -2047 3904 15595 9543 -3590 -3863 -5269 -11741 -5484 4309
1392 4309 3895 7509 13311 2892 -10272 -7906 -5147 -7074 1131 9400 6444 6384 7163 -4948 -14513
1407 -14513 -7416 -850 -338 6451 11144 4242 853 46 -9858 -13449 -2258 5368 5032 8476 7975
$$ packed form
1307h809k060N502l751L499J4493K772l929J266r324j6194M275J1224j378M326
1321A912J1965l045q889j286q576j0114J0922J3526k410K035P689q905j1372O17
1335e931l857l771J4607J2347o104j958L173j1616j0193O115J804k30J4158P667
1349A6211j1233m610R25j1068n098J1983M873m16J0216J983j4685n099K171p327
1363a1174J59J5685M459m372M789k448j5108k240N411l432M877J5359J91r480
1377B676N99l645j1835J947Q511l00N951J1691o052j3133k73j406o472O257R793
1392D309m14L614N802j0419j3164K366K759j927Q205Q269k956o0P79j2111r565
1407a4513P097O566N12O789M693o902l389q07r904l591J1191P626l36L444n01
$$ plain form
1422 7975 -886 -4970 -4788 -9829 -7856 4333 10039 6398 5893 2453 -6623 -8457 -5226 -4877 -521
1437 -521 9154 10338 3832 645 -3842 -10031 -8360 -1166 1652 5238 10203 6551 -1281 -4564 -6777
1452 -6777 -9104 -3736 4315 6973 7101 6186 500 -5964 -7317 -6570 -4586 2151 8786 8451 4176 -247
1468 -247 -5560 -7845 -5792 -2804 932 6674 9600 5752 -804 -6128 -8092 -5669 -1624 2177 5925
1483 5925 7937 6124 339 -6028 -9384 -6142 -512 3198 5369 6646 5228 419 -4655 -8583 -8120
1498 -8120 -1314 5269 6584 5670 4068 -75 -5286 -6956 -6362 -3524 4643 9140 5970 2376 214
1513 214 -4694 -7422 -4911 -2043 1408 7955 9418 2066 -2924 -3942 -7300 -6491 292 3485 4655
1528 4655 7906 5477 -3211 -6664 -5074 -5860 -2554 5449 6725 4207 4631 623 -7887 -7712 -2736 -2057
$$ packed form
1422G975q861m084J82n041J973J2189N706l641n05l440r076j834L231L49M356
1437e21R675J184o506l187m487o189J671P194K818L586M965l652p832l283k213
1452f777k327N368Q051K658J28r15n686o464j353P47J984O737O635l35m275m423
1468b47n313k285K053K988L736N742K926l848o556n324j964K423M045L801L748
1483E925K012j813n785o367l356L242N630L710K171J277j418m809n074l928M63
1498h120O806O583J315r14j602m143n211j670N94K838Q167M497l170l594k162
1513B14m908k728K511K868L451O547J463p352m990j018l358Q09O783L193J170
1528D655L251k429q688l453J590p86L306Q003J276k518M24m008q510J75M976O79
$$ plain form
1544 -2057 2249 9551 6500 36 -459 -3225 -8880 -5261 1438 2085 4904 9355 3262 -4964 -4292 -4463
1560 -4463 -6742 -900 6023 4290 4531 6095 -1961 -9139 -4928 -1746 -2377 3671 8244 3215 1860
1575 1860 2156 -5585 -10275 -2769 2423 1871 6224 7339 -28 -2944 -1638 -7004 -7919 2087 6554
1590 6554 3925 5185 3973 -4338 -5635 -2308 -5277 -3663 6740 8589 2471 1853 -269 -7871 -6369
1605 -6369 79 -1330 674 8796 6720 -1870 -1943 -2962 -8194 -3710 3681 2390 2827 8182 2856 -6138
1621 -6138 -4304 -3119 -5808 581 7450 4110 1934 4271 -1852 -8308 -3909 -920 -2405 3824 8800
1636 8800 3003 -1040 100 -5120 -8223 -1297 2539 946 5465 7559 -382 -4464 -2888 -5101 -4993
1651 -4993 2770 5270 2182 4389 4430 -3886 -7017 -3452 -2786 -547 6018 5782 750 1233 145 -6402
$$ packed form
1544b057M306P302l051o464m95k766n655L619O699O47K819M451o093q226O72j71
1560d463k279N842O923j733K41J564q056p178M211L182o31O048M573n029j355
1575A860K96p741m690P506N192n52M353J115p367k916J306n366r15J0006M467
1590F554k629J260j212q311j297L327k969J614J0403J849o118o18k122p602J502
1605f369O448j409K004Q122k076q590p3j019n232M484P391j291M37N355n326q994
1621f138J834J185k689O389O869l340k176K337o123o456M399K989j485O229M976
1636H800n797m043J140n220l103O926L836j593M519K094p941m082J576k213J08
1651d993P763K500l088K207M1q316l131L565O66K239O565k36n032M83j088o547
$$ plain form
1667 -6402 -6597 -858 1109 3262 6846 3809 -2080 -1972 -2266 -6177 -4086 2603 4530 4396 4921 99
1683 99 -5350 -3972 -2280 -3843 -93 5602 4906 2782 1133 -3292 -6338 -3312 -402 -92 2952 6324
1699 6324 3525 -350 -2444 -5142 -5297 -1203 2618 2699 4295 4197 79 -3449 -4168 -4088 -2298 2056 4631
1716 4631 3707 2898 760 -3363 -5014 -3331 -1310 1132 4360 4746 2736 31 -2785 -4920 -3738 -618
1732 -618 2029 3457 4291 2986 337 -3009 -4926 -4209 -803 2355 3977 3610 2045 -45 -2310 -4426
1748 -4426 -4473 -1098 2723 4354 4027 2021 -944 -2666 -3232 -3563 -2083 2479 5136 4140 1883 -854
1764 -854 -3802 -3381 -1953 -1661 555 4686 4975 1359 -950 -2802 -4660 -2710 512 1193 2394 5163
1780 5163 2837 -1891 -3072 -3542 -3598 -109 3482 2449 2301 3515 -165 -4584 -3646 -2144 -1488 2309
$$ packed form
1667f402j95N739J967K153L584l037n889J08k94l911K091O689J927j34N25m822
1683I9n449J378J692j563L750N695o96k124j649m425l046L026K910L10L044L372
1699F324k799l875k094k698j55M094L821Q1J596r8m118l528p19Q0J790M354K575
1716D631r24q09k138m123j651J683K021K442L228L86k010k705k816k135J182L120
1732f18K647J428Q34j305k649l346j917P17L406L158J622l67j565k090k265k116
1748d426m7L375L821J631l27k006k965j722n66l31J480M562K657r96k257k737
1764h54k948M21J428K92K216M131K89l616k309j852j858J950L222O81J201K769
1780E163k326m728j181m70n6L489L591j033j48J214l680m419R38J502O56L797
$$ plain form
1796 2309 5055 2234 620 993 -2947 -5311 -1874 469 512 3542 5432 642 -2022 -1330 -3741 -4191
1812 -4191 891 3028 1624 3221 3387 -2038 -4221 -2015 -2840 -1574 3736 4213 916 1596 1386 -4047
1828 -4047 -4845 -991 -247 960 5250 3510 -1197 -497 -237 -4724 -3701 1634 2206 2441 4626 1210
1844 1210 -3665 -1883 -1136 -4132 -1593 4090 3332 1768 2542 -1225 -5339 -2054 225 -1850 934 5253
1860 5253 2684 -109 378 -3018 -5595 -416 2490 -24 2273 4761 481 -2667 -1335 -3381 -3745
1875 -3745 1922 3867 1187 2115 2906 -1946 -4058 -1709 -1997 -1284 3840 4642 337 365 517 -3894 -4009
1892 -4009 117 213 419 4380 3754 -1153 -1407 -1357 -4149 -2443 2641 2286 1225 3319 1443 -2924 -2702
1909 -2702 -1555 -2703 -76 4218 2712 607 1402 -397 -4251 -2613 -325 -539 1916 4698 1205
$$ packed form
1796B309K746k821j614L73l940k364L437K343M3L030J890m790k664O92k411m50
1812d191N082K137j404J597J66n425k183K206q25J266N310M77l297O80k10n433
1828d047p98L854P44J207M290j740m707P00K60m487J023N335N72K35K185l416
1844A210m875J782P47k996K539N683p58j564P74l767m114L285K279k075K784M319
1860E253k569k793M87l396k577N179K906k514K297K488m280l148J332k046l64
1875c745N667J945k680R28P91m852k112K349k88P13N124Q02m305K8J52m411j15
1892d009M126R6K06L961o26m907k54N0k792J706N084l55j061K094j876m367K22
1909b702J147j148K627M294j506k105P95j799l854J638K288k14K455K782l493
$$ plain form
1924 1205 -1380 -509 -1577 -3878 -1724 1284 1247 2985 3706 -613 -3164 -1531 -1729 -2143 743 2894
1940 2894 1862 2347 1633 -2383 -3984 -1525 -203 -143 2223 2891 1373 609 -717 -3506 -3223 -257 1379
1957 1379 1575 2671 2090 -386 -1568 -2134 -3164 -1618 1758 2779 1906 1595 347 -1675 -2087 -2065 -1463
1974 -1463 788 2855 2730 1298 21 -1415 -2563 -2289 -498 845 2017 2712 1499 -208 -1773 -2571
1990 -2571 -2292 -704 1412 2247 2266 1201 44 -1661 -2458 -2333 -852 1393 2399 2602 1106 -624 -1630
2007 -1630 -1779 -2230 -975 1070 2360 2407 1459 -396 -2197 -1971 -1074 -947 677 2274 2140 1081 -227
$$ packed form
1924A205k585Q71j068k301K154L008l7J738P21m319k551J633j98m14K886K151
1940B894j032M85p14m016j601K459J322O0K366O68j518p64j326k789K83K966J636
1957A379J96J096n81k476j182n66j030J546L376J021q73l11j248k022m12K2O02
1974a463K251K067j25j432j277j436j148K74J791J343J172O95j213j707j565p98
1990b571K79J588K116Q35J9j065j157j705p97J25J481K245J006K03j496j730j006
2007a630j49m51J255K045J290M7r48j855j801K26Q97J27J624J597j34j059j308
$$ [...]
8191h6
##END NTUPLES=NMR FID
##END=
