##TITLE=1H_PR_197_S
 CDCl3
 8 sc, 
 15.11.2021
##JCAMPDX= 6.0         $$ Bruker NMR JCAMP-DX V2.0
##DATA TYPE= NMR FID
##DATA CLASS= NTUPLES
##ORIGIN= UXNMR, Bruker Analytische Messtechnik GmbH
##OWNER= root
$$ XWIN-NMR		Version 3.5
$$ Mon Nov 15 12:30:34 2021 Russian Standard Time (UT+4h)  she@DPX200
##.OBSERVE FREQUENCY= 200.131346
##.OBSERVE NUCLEUS= ^1H
##.DELAY= (6, 6)
##.ACQUISITION MODE= SIMULTANEOUS
##.ACQUISITION SCHEME= undefined
##.AVERAGES= 8
##.DIGITISER RES= 18
##SPECTROMETER/DATA SYSTEM= spect
##.PULSE SEQUENCE= zg30
##.SOLVENT NAME= CDCl3
##.SHIFT REFERENCE= (INTERNAL, CDCl3, 0, 15.7039)
##AUDIT TRAIL= $$ (NUMBER, WHEN, WHO, WHERE, WHAT)
$$ ##TITLE= Audit trail, XWIN-NMR		Version 3.5
$$ ##JCAMPDX= 5.01
$$ ##ORIGIN= Bruker BioSpin GmbH
$$ ##OWNER= she
$$ F:/spectra/data/she/nmr/H-F/1/audita.txt
$$ ##AUDIT TRAIL=  $$ (NUMBER, WHEN, WHO, WHERE, WHAT)
(   1,<2021-11-15 12:28:54.43 +0400>,<she>,<DPX200>,
      <created by zg, POWCHK disabled, PULCHK disabled
       configuration hash MD5:
       00 E9 B6 7A A2 85 ED C7 34 08 36 98 17 FE 4E 26
       data hash MD5: 16K
       8B 7E 82 81 B5 79 08 F0 70 67 0A CE BA 92 8E 90>)
$$ ##END=
$$ 
$$ hash MD5
$$ 8E A7 9E 54 F2 B5 4B 9A 7F 75 35 4C 34 22 FD FF
##$RELAX= 
##$RELAX= 
##$RELAX= 
##$RELAX= 
##$RELAX= 
##$RELAX= 
$$ Bruker specific parameters
$$ --------------------------
##$DU= <F:/spectra>
##$EXPNO= 1
##$NAME= <H-F>
##$PROCNO= 1
##$TYPE= <nmr>
##$USER= <she>
##$AMP= (0..31)
100 100 100 100 100 100 100 100 100 100 100 100 100 100 100 100 100 100 
100 100 100 100 100 100 100 100 100 100 100 100 100 100 
##$AQSEQ= 0
##$AQ_mod= 1
##$AUNM= <au_zg>
##$AUTOPOS= <>
##$BF1= 200.13
##$BF2= 200.13
##$BF3= 200.13
##$BF4= 200.13
##$BF5= 200.13
##$BF6= 200.13
##$BF7= 200.13
##$BF8= 200.13
##$BYTORDA= 1
##$CFDGTYP= 0
##$CFRGTYP= 5
##$CHEMSTR= <none>
##$CNST= (0..31)
1 1 145 1 1 1 1 1 1 1 1 1 1 1 1 1 1 1 1 1 1 1 1 1 1 1 1 1 1 1 1 1 
##$CPDPRG= <>
##$CPDPRG1= <>
##$CPDPRG2= <>
##$CPDPRG3= <>
##$CPDPRG4= <mlev>
##$CPDPRG5= <mlev>
##$CPDPRG6= <mlev>
##$CPDPRG7= <mlev>
##$CPDPRG8= <mlev>
##$CPDPRGB= <>
##$CPDPRGT= <>
##$D= (0..31)
0 1.2 0 0 0 0 0 0 0 0.06 0 0.03 0 0 0 0 0.0002 0 0 0 0 0 0 0 0 0 0 0 0 
0 0 0 
##$DATE= 1636964933
##$DBL= (0..7)
120 120 120 120 120 120 120 120 
##$DBP= (0..7)
150 150 150 150 150 150 150 150 
##$DBP07= 0
##$DBPNAM0= <>
##$DBPNAM1= <>
##$DBPNAM2= <>
##$DBPNAM3= <>
##$DBPNAM4= <>
##$DBPNAM5= <>
##$DBPNAM6= <>
##$DBPNAM7= <>
##$DBPOAL= (0..7)
0.5 0.5 0.5 0.5 0.5 0.5 0.5 0.5 
##$DBPOFFS= (0..7)
0 0 0 0 0 0 0 0 
##$DE= 6
##$DECBNUC= <off>
##$DECIM= 32
##$DECNUC= <off>
##$DECSTAT= 4
##$DIGMOD= 1
##$DIGTYP= 9
##$DL= (0..7)
0 120 120 120 120 120 120 120 
##$DP= (0..7)
150 150 150 150 150 150 150 150 
##$DP07= 0
##$DPNAME0= <>
##$DPNAME1= <>
##$DPNAME2= <>
##$DPNAME3= <>
##$DPNAME4= <>
##$DPNAME5= <>
##$DPNAME6= <>
##$DPNAME7= <>
##$DPOAL= (0..7)
0.5 0.5 0.5 0.5 0.5 0.5 0.5 0.5 
##$DPOFFS= (0..7)
0 0 0 0 0 0 0 0 
##$DQDMODE= 0
##$DR= 18
##$DS= 0
##$DSLIST= <SSSSSSSSSSSSSSS>
$$ [...]
##$SUBNAM2= <"">
##$SUBNAM3= <"">
##$SUBNAM4= <"">
##$SUBNAM5= <"">
##$SUBNAM6= <"">
##$SUBNAM7= <"">
##$SUBNAM8= <"">
##$SUBNAM9= <"">
##$SW= 18.0517287032376
##$SWIBOX= (0..15)
0 0 2 0 0 0 0 0 0 0 0 0 0 0 0 0 
##$SW_h= 3612.71676300578
##$TD= 16384
##$TD0= 1
##$TE= 0
##$TE2= 300
##$TE3= 300
##$TEG= 300
##$TL= (0..7)
0 120 120 120 120 120 120 120 
##$TP= (0..7)
150 150 150 150 150 150 150 150 
##$TP07= 0
##$TPNAME0= <>
##$TPNAME1= <>
##$TPNAME2= <>
##$TPNAME3= <>
##$TPNAME4= <>
##$TPNAME5= <>
##$TPNAME6= <>
##$TPNAME7= <>
##$TPOAL= (0..7)
0.5 0.5 0.5 0.5 0.5 0.5 0.5 0.5 
##$TPOFFS= (0..7)
0 0 0 0 0 0 0 0 
##$TUNHIN= 0
##$TUNHOUT= 0
##$TUNXOUT= 0
##$USERA1= <user>
##$USERA2= <user>
##$USERA3= <user>
##$USERA4= <user>
##$USERA5= <user>
##$V9= 5
##$VALIST= <valist>
##$VCLIST= <CCCCCCCCCCCCCCC>
##$VD= 0
##$VDLIST= <DDDDDDDDDDDDDDD>
##$VPLIST= <PPPPPPPPPPPPPPP>
##$VTLIST= <TTTTTTTTTTTTTTT>
##$WBST= 1024
##$WBSW= 4
##$XGAIN= (0..3)
0 0 0 0 
##$XL= 0
##$YL= 0
##$YMAX_a= 139514
##$YMIN_a= -224971
##$ZGOPTNS= <>
##$ZL1= 120
##$ZL2= 120
##$ZL3= 120
##$ZL4= 120
##$ABSF1= 10
##$ABSF2= 0
##$ABSG= 5
##$ABSL= 3
##$ALPHA= 0
##$AQORDER= 0
##$ASSFAC= 0
##$ASSFACI= 0
##$ASSFACX= 0
##$ASSWID= 0
##$AUNMP= <proc_1d>
##$AZFE= 0.1
##$AZFW= 0.1
##$BCFW= 1
##$BC_mod= 2
##$BYTORDP= 1
##$COROFFS= 0
##$CY= 11.3945322036743
##$DATMOD= 1
##$DC= 2
##$DFILT= <>
##$DTYPP= 0
##$F1P= 2.36226072786647
##$F2P= -0.459571619588291
##$FCOR= 0.5
##$FTSIZE= 0
##$FT_mod= 4
##$GAMMA= 1
##$GB= 0.15
##$INTBC= 1
##$INTSCL= 1
##$ISEN= 128
##$LB= 0.24
##$LEV0= 0
##$LPBIN= 0
##$MAXI= 10000
##$MC2= 0
##$MEAN= 0
##$ME_mod= 0
##$MI= 1.114404
##$NCOEF= 0
##$NC_proc= 0
##$NLEV= 6
##$NOISF1= 3.799351
##$NOISF2= 2.8
##$NSP= 1
##$NTH_PI= 0
##$NZP= 0
##$OFFSET= 15.70392
##$PC= 1
##$PHC0= -15512.25
##$PHC1= 12.60081
##$PH_mod= 1
##$PKNL= yes
##$PPARMOD= 0
##$PSCAL= 0
##$PSIGN= 0
##$REVERSE= no
##$SF= 200.130013532006
##$SI= 16384
##$SIGF1= 3
##$SIGF2= 2
##$SINO= 400
##$SIOLD= 16384
##$SREGLST= <1H.CDCl3>
##$SSB= 0
##$STSI= 0
##$STSR= 0
##$SW_p= 3612.71676300578
##$SYMM= 0
##$S_DEV= 0
##$TDeff= 0
##$TDoff= 0
##$TI= <>
##$TILT= no
##$TM1= 0
##$TM2= 0
##$TOPLEV= 0
##$USERP1= <user>
##$USERP2= <user>
##$USERP3= <user>
##$USERP4= <user>
##$USERP5= <user>
##$WDW= 1
##$XDIM= 8192
##$YMAX_p= 0
##$YMIN_p= 0
$$ End of Bruker specific parameters
$$ ---------------------------------
##NTUPLES= NMR FID
##VAR_NAME=  TIME,          FID/REAL,        FID/IMAG
##SYMBOL=    X,             R,               I
##VAR_TYPE=  INDEPENDENT,   DEPENDENT,       DEPENDENT
##VAR_FORM=  AFFN,          ASDF,            ASDF
##VAR_DIM=   8192,          8192,            8192
##UNITS=     SECONDS,       ARBITRARY UNITS, ARBITRARY UNITS
##FACTOR=    0.0002768,     1,               1
##FIRST=     0,             0,               0
##LAST=      2.2672688,     0,               0
##MIN=       0,             -224971,         0
##MAX=       2.2672688,     139514,          0
$$ Real data points
##PAGE= N=1
##DATA TABLE= (X++(R..R)), XYDATA
$$ [...]
$$ plain form
1836 -250 399 -334 -710 508 68 -710 458 -5 -867 272 294 -614 317 562 -443 -215 383 -342 1
1855 1 782 -92 10 726 60 -197 616 226 -563 645 82 -526 335 -50 -773 325 265 -855 -127 79
1875 79 -554 -75 253 -379 -334 242 -217 -120 530 -409 -292 556 161 -33 542 251 -321 437 313 -384 556
1896 556 38 -604 410 267 -558 -176 218 -877 -251 481 -297 -599 427 -106 -769 519 121 -654 328
1915 328 615 -323 148 368 -219 -26 493 -124 -144 341 187 -254 302 36 -170 135 -47 8 -80 42 108
1936 108 -441 -5 -77 -219 -267 -49 197 -151 51 358 -235 -308 632 196 -279 278 349 -433 133 639 -335
1957 -335 -132 546 -230 -323 526 -18 -576 150 409 -598 91 510 -574 -286 446 -479 -748 622 111
1976 111 -738 221 434 -685 8 1005 -104 -379 715 209 -605 612 602 -570 158 576 -495 -368
$$ packed form
1836b50O49p33l76J218m40p78J168m63q62J139K2r08R31K45j005K28N98p25L43
1855AP81q74J02P16o66k57Q13l90p89J208n63o08Q61l85p23J098o0j120P28K06
1875G9o33M79L28o32M5N76m59R7O50r39J17Q48l95j94N75k91n72P58j24o97R40
1896E56n18o42J014j43q25L82L94j095O26P32p78l02J026n33o63J288l98p75R82
1915C28K87r38M71K20n87J93N19o17k0M85j54m41N56k66k06L05j82N5q8J22O6
1936A08n49M36p2j42m8K18K46l48K02L07n93p3R40m36m75N57P1p82N66N06r74
1957c35K03O78p76r3Q49n44n58P26K59j007O89M19j084K88P32r25k69J370n11
1976A11q49R59K13j119O93R97j109k75J094n06q14J217j0j172P28M18j071J27
$$ plain form
1994 -368 920 -62 -562 209 5 -846 209 582 -294 -534 499 -331 -583 598 319 -607 343 533 -593
2013 -593 -129 856 63 -371 676 311 -675 295 668 -308 -153 714 -384 -754 370 -72 -1011 310 771
2032 771 -933 -386 706 -535 -618 774 -21 -904 305 521 -890 61 1060 -375 -383 932 -54 -921
2050 -921 1027 666 -739 280 894 -935 -482 1095 -318 -753 607 -103 -1238 458 652 -965 -139
2067 -139 866 -752 -684 766 365 -681 642 427 -663 264 620 -74 -400 478 4 -931 168 329
2085 329 -479 -27 630 -393 -750 446 363 -500 441 581 -954 -367 718 -446 -596 1040 81 -1017
2103 -1017 761 452 -715 578 1221 -729 -409 822 -224 -740 1477 191 -1013 603 622 -909
2119 -909 -119 1034 -694 -329 410 -585 -904 758 193 -475 300 206 -358 -162 704 -93 -405 476 109
$$ packed form
1994c68J288r82n00P71k04q51J055L73q76k40J033q30k52J181k79r26R50J90j126
2013e93M64R85p93m34J047l65r86R70L73r76J55Q67j098l70J124m42r39J321M61
2032G71j704N47J092j241q3J392p95q83J209K16j411R51R99j435qJ315r86q67
2050i21J948l61j405J019O14j829M53J577j413m35J360p10j135J696J94j617Q26
2067a39J005j618O8J450m01j046J323k15j090R27L56o94l26Q78m74r35J099J61
2085C29q08M52O57j023l57J196q3q63R41J40j535N87J085j164j50J636r59j098
2103a017J778l09j167J293O43j950L20J231j046n16K217j286j204J616J9j531
2119i09P90J153j728L65P39r95l19J662n65o68P75r4n64J96Q66p97l12Q81l67
$$ plain form
2138 109 -722 -279 385 -151 -131 504 49 -449 300 539 -229 -114 806 -294 -463 240 63 -787 517 370
2158 370 -1217 -373 648 -820 -381 944 -404 -914 750 214 -852 834 638 -869 303 834 -547
2175 -547 53 1089 -210 -515 776 -30 -852 641 403 -537 88 438 -703 -522 367 -389 -464 277 13
2194 13 -76 21 -73 -153 138 -29 41 107 -138 431 195 -207 369 276 -400 64 403 -216 14 681 -430 -536
2216 -536 640 -162 -844 554 -48 -992 123 522 -790 235 800 -581 -375 985 -398 -518 522
2233 522 87 -552 356 320 -445 452 548 -293 -31 510 -648 -392 361 -344 -137 97 -85 -270 284 -31
2253 -31 -229 29 -43 -286 26 -243 -95 329 113 62 399 55 -280 377 195 -294 458 254 -473 129 270
2274 270 -527 140 526 -266 -329 439 -497 -650 396 20 -547 253 -338 -451 227 52 -660 -69 455 -545
$$ packed form
2138A09q31M43O64n36K0O35m55m98P49K39p68J15R20j100j69P03j77q50J304j47
2158C70j587Q44J021j468M39J325j348n10J664n36j066J686j96j507J172N31j381
2175e47O00J036j299l05J291q06q22J493k38r40O25L50j141J81Q89p56p5P41k64
2194A3q9R7r4q0K91j67P0O6k45N69k36m02N76r3o76M64L39o19K30O67j111j06
2216e36J176q02o82J398o02r44J115L99j312J025N65j381K06J360j383j20J040
2233E22m35o39R08l6p65Q97R6q41K62N41j158K56P53p05K07K34j82j85N54l15
2253c1j98K58p2k43L12k69J48M24k16n1L37l44l35O57j82m89P52k04p27O02J41
2274B70p97O67L86p92o3P68r36j53J046l76n67Q00n91j13O78j75p12N91N24j000
$$ plain form
2294 -545 187 648 -386 -11 452 -292 125 292 -304 -306 181 -220 -212 177 116 -168 102 292 -173 145 285
2315 285 -211 129 -27 -305 237 303 -310 -53 386 -220 -30 505 -25 -70 275 162 -98 162 425 -472 403
2336 403 -133 -484 157 137 -236 -156 162 -481 26 224 -350 -108 286 -292 -348 515 -55 -323 472 262 -396
2357 -396 617 -4 -190 334 139 -321 213 213 -32 16 307 -182 37 295 -408 -247 206 -10 -171 216 -146
2378 -146 -266 44 182 0 276 -63 -365 190 122 -444 302 386 -283 99 313 -9 14 229 -127 -52 503
2399 503 -42 -378 363 258 -404 186 -104 -316 251 166 -200 -87 17 -489 281 306 -172 -356 330 147 -138
2420 -138 207 19 -324 303 130 7 312 80 -69 65 390 -141 -19 -65 55 -220 191 -194 -61 -27 -66
2441 -66 4 -264 -271 57 50 -226 44 240 -224 -25 394 -211 -4 446 7 -116 419 46 -208 128 -128 -592
$$ packed form
2294e45P32M61j034L75M63p44M17J67n96kM87m01QL89o1k84K70J90m65L18J40
2315B85m96L40j56k78N42O6o13K57M39o06J90N35n30m5L45j13k60K60K63q97Q75
2336D03n36l51O41k0l73Q0L18o43N07J98n74K42L94n78n6Q63n70k68P95k10o58
2357c96J013o21j86N24j95m60N34%k45M8K91m89K19K58p03J61M53k16j61L87l62
2378a46j20L10J38j82K76l39l02N55o8n66P46Q4o69L82K14l22K3K15l56P5N55
2399E03n45l36P41j05o62N90k90k12N67q5l66J13J04n06P70K5m78j84O86j83k85
2420a38L45j88l43O27j73j23L05k32j49J34L25n31J22m6J20k75M11l85J33L4l9
2441f6P0k68pL28pk76K70J96m64J99M19o05K07M50m39j23N35l73k54L36k56m64
$$ plain form
2463 -592 24 187 -237 -6 147 -123 -395 466 134 -558 146 114 -346 -475 50 -257 -226 206 -60 -125 75
2484 75 258 -146 45 158 -69 -112 95 309 -66 187 143 -151 -167 53 -495 -285 329 134 -202 121 25 -645
2506 -645 -296 443 -214 -129 345 -38 -369 268 545 -442 183 300 -132 -177 477 -131 1 356 329 -559 17
2527 17 319 -417 -197 567 -477 -475 422 89 -486 160 404 -526 -228 205 -182 -242 496 -61 -433 290 184
2548 184 -389 35 609 -400 57 622 4 -303 119 107 -438 130 74 -121 -139 311 -218 -262 186 -34 -346
2569 -346 8 398 134 -195 356 -155 -374 356 197 -129 -28 304 -301 45 524 -114 -398 387 186 -623
2589 -623 106 354 -348 106 284 -317 -324 176 167 -366 419 120 -703 1 523 -265 -253 657 130 -603 415
2610 415 117 -491 237 320 -522 -48 650 -570 -399 805 144 -418 114 167 -327 42 278 -168 -203 -96
$$ packed form
2463e92O16J63m24K31J53k70k72Q61l32o92P04l2m60j29N25l07L1M32k66o5K00
2484G5J83m04J91J13k27m3K07K14l75K53m4k94j6K20n48K10O14j95l36L23r6o70
2506f45L49P39o57Q5M74l83l31O37K77r87O25J17m32m5O54o08J32L55k7q88N76
2527A7L02p36K20P64j044KQ97l33n75O46K44r30K98M33l87o0P38n57l72P23j06
2548A84n73M24N74j009M57N65o18l07M22j2n45N68n6j95j8M50n29m4M48k20l12
2569c46L54L90k64l29N51n11k19P30j59l26J01L32o05L46M79o38k84P85k01q09
2589f23P29K48p02M54J78o01pN00rn33P85k99q23P04N22p88J2R10n27p33J018
2610D15k98o08P28Q3q42M74O98j220J71J204o61n62N32N3m94L69K36m46l5J07
$$ plain form
2630 -96 -221 -318 23 261 -251 155 169 -140 -148 396 190 -227 273 65 -148 47 422 129 -286 221 -176 -685
2652 -685 85 115 -410 23 333 -538 -530 415 -54 -440 461 -103 -510 -195 135 -492 -20 730 -386 -176 603
2673 603 29 -348 208 215 -323 288 466 -321 -24 573 -175 -491 57 107 -335 78 108 -62 104 -128 28
2694 28 -110 -40 -99 -65 -18 274 -252 -143 57 -52 -131 197 80 -356 -69 386 160 -95 141 -13 -386 279
2716 279 278 -422 47 95 -485 -118 466 -46 -405 354 -72 -518 473 18 -414 75 241 -103 65 258 -72
2737 -72 -112 279 90 -37 0 85 -119 148 110 -418 137 179 -125 -48 14 47 -60 -427 -242 83 -160 39 128
2760 128 -202 -258 239 344 -120 258 224 -186 86 114 -253 -198 326 -241 -157 423 63 -336 286 -66 -63 41
2782 41 13 -275 -195 77 -638 -11 119 -82 14 396 -141 -274 354 166 -61 426 190 40 260 442 -116
$$ packed form
2630i6j25r7L41K38n12M06J4l09qN44k06m17N00k08k13J95L75k93m15N07l97n09
2652f85P70L0n25M33L10q71QR45m69l86R01n64m07L15L30o27M72P50j116K10P79
2673F03n74l77N56Pn38O11J78p87K97N97p48l16N48N0m42M13L0j70J66k32J56
2694B8j38P0n9L4M7K92n26J09K00j09p9L28j17m36K87M55k26k55K36j54l73O65
2716B79jp00M69M8n80L67N84n12l59P59m26m46R91m55m32M89J66l44J68J93l30
2737g2m0L91j89j27L7Q5k04K67l8n28N55M2l04P7O2L3j07l67J85L25k43J99Q9
2760A28l30n6M97J05m64L78l4m10K72K8l67N5N24n67Q4N80l60l99O22l52LJ04
2782D1k8k88Q0K72p15O27J30k01R6L82n37j33O28j88k27M87k36j50K20J82n58
$$ plain form
2803 -116 210 301 -326 -91 377 59 -43 107 -64 20 139 -174 -18 -31 -254 -45 71 -272 12 122 -23
2824 -23 -242 91 172 -86 -124 32 -239 49 290 -197 10 237 -204 87 150 -9 -224 190 -2 -91 257 -33
2846 -33 -284 312 58 -279 202 -26 -216 -57 38 36 39 96 -213 -113 303 29 20 119 -40 5 284 116 -287 162
2870 162 -8 -36 108 -42 -184 36 -16 -212 -132 24 -96 23 112 -283 84 117 -85 -106 276 -55 72 249
2892 249 34 -152 302 187 -55 99 39 -210 131 80 -191 35 70 -189 -89 -150 -91 -58 -60 -22 -127 -39 367
2915 367 72 129 -92 -76 -144 -99 288 313 -115 -21 79 -180 137 107 -33 117 264 -92 -301 -111 -50 152 -37
2938 -37 -103 -264 -47 54 -64 -390 85 115 -120 339 -399 -333 169 291 -135 -65 158 -166 220 208 -100 -283
2960 -283 249 -47 -5 53 112 -215 141 -242 -235 -23 -47 45 -71 138 -241 -135 161 -50 -94 8 314 85 -78
$$ packed form
2803a16L26R1o27K35M68l18j02J50j71Q4J19l13J56j3k23K09J16l43K84J10j45
2824b3k19L33Q1k58l8J56k71K88K41m87K07K27m41K91O3j59k15M14j92q9L48k90
2846c3k51N96k54l37M81k28j90J59R5kLN7l09J00M16k74rR9j59M5K79j68m03M49
2870A62j70k8J44j50j42K20n2j96Q0J56j20J19Q9l95L67L3k02k1L82l31J27J77
2892B49k15j86M54j15k42J54o0k49L41n1k71K26L5k59J00o1N9L3kL8j05Q8M06
2915C67k95N7k21J6o8M5L87K5m28R4J00k59L17l0j40J50J47l56k09J90O1K02j89
2938c7o6j61K17J01j18l26M75L0k35M59p38O6N02J22m26P0K23l24L86j2l08j83
2960b83N32k96M2N8N9l27L56l83PK12k4R2j16K09l79J06K96k11m4J02L06k29j63
$$ plain form
2983 -78 206 -166 -217 -105 -47 87 34 323 87 -35 151 12 34 -305 -34 -108 -65 135 -103 -61 18 -185 -161
3006 -161 25 -1 -22 174 63 -115 168 167 -56 -180 370 184 -318 103 273 -116 -8 281 157 -257 195
3027 195 -148 -406 109 38 -111 30 -163 -315 33 100 -111 29 45 214 -266 12 280 12 -24 288 100
3048 100 58 102 80 -35 -61 174 -174 -85 -58 318 -129 185 -1 -368 -188 228 -294 -169 -6 80 -215 100
3070 100 162 -170 -40 -1 -406 -32 378 -35 -217 308 113 9 -30 385 54 -14 229 -163 23 466 -143
3091 -143 -290 173 -51 -214 14 199 -236 -130 267 -185 -121 61 1 -67 75 281 125 105 174 -112 -188 148
3113 148 -169 -145 94 247 114 330 162 24 19 -17 221 -111 -109 -101 -95 93 -102 -246 -144 380 9 -84 47 -17
3137 -17 -154 -122 50 149 -86 134 -50 -59 186 267 243 87 200 -218 56 209 167 -62 32 99 -359 178 -67
$$ packed form
2983g8K84l72n1J12N8J34n3K89k36j22J86j39K2l39K71p4M3K00k38M2P9k03K4
3006a61J86k6k1J96j11j78K83jk23j24N50j86n02M21J70l89J08K89j24m14M52
3027A95l43k58N15p1j49J41j93j52L48O7k11J40J6J69m80K78K68k68l6L12j88
3048A00m2M4k2j15k6K35l48Q9K7L76m47L14j86l67J80M16n22J25J63Q6k95L15
3070A00O2l32J30L9m05L74M10m13j82N25j95j04l9M15l31o8K43l92J86M43o09
3091a43j47M63k24j63K28J85m35J06L97m52O4J82o0o8J42K06j56k0O9k86p6L36
3113A48l17K4K39J53j33K16j68j38nl6K38l32KQOJ88j95j44J02N24l71r3J31o4
3137a7j37L2J72R9k35K20j84rK45Q1k4j56J13m18K74J53m2k29R4O7m58N37k45
$$ plain form
3160 -67 -103 -185 45 -250 -159 150 -102 -75 227 157 9 -152 173 -252 -107 363 -8 -122 89 23 -304 -53
3182 -53 -29 102 -67 116 -130 -87 -28 52 -115 -91 -97 -118 28 80 -47 -26 24 174 -76 150 56 139 53 119 181 -77
3208 -77 59 -50 -158 -28 102 -149 80 231 -265 -249 86 -134 -196 256 43 -193 169 140 -169 90 256
3229 256 -201 17 198 -400 -102 241 127 50 45 -21 76 73 111 -292 152 35 -81 58 131 -120 -49 -3 -139 -278
3253 -278 -122 -133 53 81 -128 161 69 36 180 269 -90 51 151 139 -116 36 32 -105 7 157 -252 23 -228
3276 -228 -120 61 -119 -144 17 206 -70 69 -43 -281 -389 -29 -147 -54 -80 -108 -80 -10 74 -122 44 69 -74
3299 -74 40 98 78 29 162 -31 -90 -50 -180 -167 -62 -160 89 128 -176 -61 17 -101 128 12 -10 -82 -124 -194 -56
3324 -56 107 158 -213 179 -43 -145 -113 -5 53 48 82 -172 -138 112 -179 -259 -86 155 -105 220 306 -114 89
$$ packed form
3160f7l6q2K30k95R1L09k52K7L02p0j48j61L25m25J45M70l71j14K11o6l27K51
3182e3K4J31j69J83k46M3N9Q0j67K4ok1J46N2j27K1N0J50k50K26r4Q3q6O6O2k58
3208g7J36j09j08J30J30k51K29J51m96J6L35k20o2M52k13k36L62k9l09K59J66
3229B56m57K18J81n98K98L43j14p7no6R7lL8m03M44j17j16J39P3k51P1M6j36j39
3253b78J56j1J86K8k09K89r2l3J44Q9l59J41J00j2k55J52mj37J12J50m09K75k51
3276b28J08J81j80k5J61J89k76J39j12k38j08L60j18R3k6k8K8P0Q4j96J66K5j43
3299g4J14N8k0m9J33j93n9M0j30J3J05r8K49L9l04J15P8j18K29j16k2p2m2p0J38
3324e6J63N1l71L92k22j02L2J08N8nL4k54L4K50k91q0J73K41k60L25Q6m20K03
$$ plain form
3347 89 -8 87 -298 85 -45 -303 -208 -163 -278 343 12 -181 53 -128 -35 -73 -54 -18 231 72 -87 23 -208
3370 -208 -184 -28 56 -163 -251 24 -32 146 -108 -36 -231 119 -184 -224 138 -105 61 99 11 -201 43 483 -126
3393 -126 10 -266 -124 110 80 -366 73 147 -123 -78 185 -124 -162 -55 251 53 12 100 -214 102 202 -53
3415 -53 -76 -7 38 -6 -3 220 69 97 168 -57 -42 86 -115 478 91 1 118 189 -123 151 72 217 59 -124
3439 -124 51 -121 -127 -70 -263 133 82 -138 209 -133 275 296 -114 128 32 14 129 271 17 -236 196 -21
3461 -21 -56 231 172 -23 88 288 -242 96 180 -97 -181 -142 -206 109 44 9 108 172 -147 -2 -3 -15 -67 59 -222
3486 -222 -31 -48 -39 -33 -15 196 190 94 22 -19 -10 8 -173 -41 1 -129 -88 -104 -192 17 157 -150 69 55 13 -109 116
3513 116 191 -223 -6 26 -89 -112 77 -15 -146 44 209 -74 76 131 -139 -76 358 -8 -112 -12 -144 -56
$$ packed form
3347H9r7R5l85L83j30k58R5M5j15O21l31j93K34j81R3l8J9L6K49j59j59J10k31
3370b08K4J56Q4k19q8K75n6J78k54P2j95L50l03m0L62k43J66L8q8k12K44M40o09
3393a26J36k76J42K34l0m46M39P4k70M5K63l09l8J07L06j98m1Q8l14L16J00k55
3415e3k3O9M5m4LK23j51K8P1k25J5J28k01N93l87r0J17P1l12K74p9J45j58j83
3439a24J75j72oN7j93L96n1k20L47l42M08K1m10K42r6j8J15J42k54k53M32k17
3461b1l5K87n9j95J11K00n30L38Q4k77q4L9o4L15o5l5R9O4l19J45jj2n2J26k81
3486b22J91j7ROJ8K11or6p2m1RJ8j81J32M2j30M1j6q8K09J40l07K19j4m2j22K25
3513A16P5m14K17L2j15k3J89r2j31J90J65k83J50N5k70O3M34l66j04J00j32Q8
$$ plain form
3535 -56 193 -13 -1 -144 12 -356 -369 80 -131 34 131 -15 402 58 512 242 -36 73 20 71 -21 120
3557 120 -152 91 157 -97 -79 184 -157 146 -17 17 -182 -53 -109 -97 -138 243 -62 -241 363 -111 -118 -24 -46
3580 -46 19 -108 359 -1 156 -41 86 8 114 92 -228 -255 -195 -38 -93 -25 53 72 162 155 -45 185 50 -252
3604 -252 -216 224 -103 -82 67 104 194 -83 62 38 -84 120 5 118 3 279 -109 28 44 -99 -28 124
3626 124 -22 -107 343 44 50 141 -16 -34 -19 76 50 -2 -221 32 7 108 228 205 184 98 -195 40 176 52
3650 52 16 -249 177 -94 -121 180 -71 27 20 -204 -58 -178 -14 -12 -120 381 -77 -153 199 -64 -386 101 -53
3673 -53 -21 -50 41 -166 -172 12 19 43 -142 -227 -18 -144 -74 -68 29 46 -89 66 30 75 76 -32 -100 167 168 -100 39
3700 39 37 1 131 -77 51 204 -107 50 234 -108 -34 -59 -185 -57 29 73 74 51 10 -3 76 185 -175 -45 -257
$$ packed form
3535e6K49k06J2j43J56l68j3M49k11J65R7j46M17l44M54k70k78J09n3N1r2J41
3557A20k72K43O6k54J8K63l41L03j63L4j99J29n6J2m1L81l05j79O04m74pR4k2
3580d6O5j27M67l60J57j97J27p8J06k2l20k7O0J57n5O8P8J9R0pk00K30j35l02
3604b52L6M40l27K1J49L7R0k77J45k4j22K04j15J13j15K76l88J37J6j43P1J52
3626A24j46q5M50k99OR1j57j8J5R5k6n2k19K53k5J01J20k3k1q6k93K35J36j24
3650E2l6k65M26k71k7L01k51R8pk24J46j20J64Kj08N01m58p6L52k63l22M87j54
3673e3L2k9R1k07oJ84PK4j85q5K09j26P0OR7J7j35J55l6M5Jj08o8K67Jk68J39
3700C9kl6J30k08J28J53l11J57J84l42P4k5j26J28Q6M4Jk3m1j3P9J09l60J30k12
$$ plain form
3725 -257 34 -17 -23 -220 -54 -95 87 -35 7 -93 -86 0 -29 -68 -80 -184 105 -37 -63 58 104 -45 -179 75
3749 75 -274 -24 -243 147 -28 212 -60 -24 -43 54 -23 -22 58 50 6 105 11 -254 -65 76 -56 332 65 3 -186
3774 -186 -19 -110 -71 117 123 -144 -94 -76 -220 111 113 -150 -128 -132 -182 -123 87 41 -192 180 57 80 31 115 41 -128
3800 -128 -249 58 207 70 -30 114 17 183 -280 -31 -40 -61 118 -285 -255 -148 -111 -27 -127 -99 10 -175 -120
3823 -120 -48 307 -35 -110 219 -143 158 -27 29 -67 -80 -140 -62 292 -111 -95 80 187 -192 -43 -254 40 128
3846 128 -113 -325 -89 297 53 -253 100 279 -85 -46 51 2 18 124 -365 -212 93 92 -349 -85 -2 143
3868 143 123 -88 11 207 3 -96 45 21 -53 68 76 70 -111 92 -344 -129 32 -73 -199 53 -213 -7 -179
3891 -179 -213 243 -167 -108 56 90 -206 -64 175 -14 -153 208 -36 -310 -188 18 -60 -173 -394 43 69 175
$$ packed form
3725b57K91n1oj97J66m1J82j22M2j00PQ6k9l9j2j04K89j42k6J21M6j49j34K54
3749G5l49K50k19L90j75K40k72L6j9R7p7JQ0qm4R9r4k65J89J41j32L88k67o2j89
3774a86J67r1L9J88Ok67N0J8j44L31Kk63K2mn0N9K10m6k33L72j23K3m9Q4p4j69
3800a28j21L07J49j37j00J44r7J66m63K49rk1J79m03L0J07L7Q4j00K8J09j85N5
3823a20P2L55l42p5L29l62L01j85N6r6j3o0P8L54m03J6J75J07l79J49k11K94Q8
3846A28k41k12K36L86k44l06L53J79l64L9R7m9J6J06m89J53L05jm41K64Q3J45
3868A43k0k11R9J96k04r9J41k4p4J21Qoj81K03m36K15J61j05j26K52k66K06j72
3891a79l4M56m10N9J64L4k96J42K39j89j39L61k44k74J22K06p8j13k21M37K6J06
$$ plain form
3913 175 -9 -62 25 234 -200 -56 -186 -343 149 -99 -141 71 167 -122 152 -88 -92 -107 99 20 7 243 5
3936 5 51 -101 -51 -153 -34 27 -178 66 -30 -47 -26 -298 -36 34 62 115 108 -37 109 22 188 77 148 149 -227 87
3962 87 -8 -149 -78 232 -25 -179 -141 -152 52 360 -173 167 -77 -199 317 58 55 -109 59 -37 -45 70 5 132
3986 132 -208 -88 156 102 47 108 17 119 -163 119 -91 -179 110 -104 -164 109 -248 -120 -147 -28 -172 -57
4008 -57 -146 25 -240 -86 2 -45 -160 -277 -191 -335 -25 -69 -138 -91 291 44 234 137 94 -25 -59 196 -215 80
4032 80 170 -94 48 186 -235 -41 132 97 123 -1 -308 126 -60 10 -192 305 13 -9 59 -120 80 -208
4054 -208 -184 12 -107 13 2 -134 6 218 201 -114 -232 74 61 -5 -125 -24 -163 -57 289 -98 40 20
4076 20 37 -112 -31 -144 -138 -10 64 -19 84 -66 -96 112 67 -41 179 6 254 -78 176 -191 -47 -290 146
$$ packed form
3913A75j84n3Q7K09m34J44j30j57M92k48m2K12R6k89K74k40mj5K06p9j3K36k38
3936EM6j52N0j02J19O1k05K44r6j7K1k72K62P0K8N3pj45J46q7J66j11P1Jl76L14
3962H7r5j41P1L10k57j54L8j1K04L08n33L40k44j22N16k59lj64J68r6qJ15o5J27
3986A32l40J20K44n4n5O1r1J02k82K82k10q8K89k14o0K73l57J28k7J19j44J15
4008e7q9J71k65J54Q8m7j15j17Q6j44L10m4o9M7L82k47J90r7m3j19l4K55m11K95
4032H0R0k64J42J38m21J94J73l5K6j24l07M34j86P0k02M97k92k2O8j79K00k88
4054b08K4J96j19J20j1j36J40K12j7l15j18L06j3o6j20J01j39J06L46l87J38k0
4076B0J7j49Q1j13OJ28P4q3J03j50l0K08m5j08K20j73K48l32K54l67J44k43M36
$$ plain form
4099 146 -40 -258 40 -19 113 152 23 -148 -139 104 193 -50 -42 166 103 3 36 113 -154 -99 48 97 19 83 131
4124 131 134 -151 -141 260 284 -244 -190 119 -70 -207 110 -16 83 71 -56 -26 52 -82 -98 -30 166 48 -17 84
4148 84 57 -109 142 -180 92 -12 186 112 -80 410 96 45 20 164 32 -11 -206 -110 191 -191 -54 -105 112
4171 112 212 -82 10 136 317 150 95 -128 285 -1 89 -103 63 94 -20 216 197 73 43 57 -151 -82 -36
4194 -36 4 -140 0 -9 -218 -67 163 114 48 41 -19 -95 -143 -78 -64 172 237 -41 -45 230 232 -50 -35 64 -175 78 102
4221 102 -49 118 82 207 -250 18 49 134 -157 154 28 -141 -65 -87 311 87 -179 -235 -147 -63 34 10 53 -88
4245 -88 -41 -5 -58 260 -4 -79 -221 -84 155 -34 -165 -35 -12 -256 -73 285 -334 -189 -6 -19 261 -75
4267 -75 163 -71 -208 227 -5 53 -60 -57 8 75 87 121 25 6 59 47 25 -313 -75 -146 11 191 187 217 193 -55
$$ packed form
4099A46j86k18K98n9J32L9j29j71RK43Q9k43QK08o3j00L3P7k67N5J47M9p8O4M8
4124A31Lk85J0M01K4n28N4L09j89j37L17j26R9j2j27L0P8j34j6O8J96j18o5J01
4148H4k7j66K51l22K72j04J98p4j92M90l14n1k5J44j32m3j95R6L01l82J37n1K17
4171A12J00k94R2J26J81j67n5k23M13k86R0j92J66L1j14K36j9j24l0J4k08O9M6
4194c6M0j44J40rk09J51K30m9o6po0p6m8O5J4K36O5k78mK75Kk82J5R9k39K53K4
4221A02j51J67l6J25m57K68L1Q5k91L11j26j69P6k2L98k24k66n6Q8Q4R7k4M3j41
4245h8M7L6n3L18k64p5j42J37K39j89j31J30K3k44J83L58o19J45J83j3K80l36
4267g5K38k34j37M35k32N8j13LO5O7J2L4r6j9N3j2k2l38K38p1J57J80mL0k4k48
$$ plain form
4293 -55 -194 41 -69 -56 301 -8 -139 54 28 -127 -230 -107 -132 -56 -206 -203 136 -153 -6 -246 -258 80 118
4316 118 -31 66 -86 103 196 -145 -51 90 166 62 72 126 21 68 12 -41 -122 215 37 70 24 -126 24 -53
4340 -53 33 217 21 -242 -10 -100 -22 -24 203 -252 106 18 -121 -55 23 -39 -31 160 -343 -109 88 -94 -162 -129 176
4365 176 146 29 -160 146 -8 55 138 -35 38 21 92 99 54 198 -29 228 -120 -135 148 -20 76 39 213 -47
4389 -47 44 -27 63 16 -348 -275 -89 -39 24 -119 77 -66 -62 331 -53 128 -83 -120 -103 -238 218 133 -115 -31 186
4414 186 -67 -5 27 49 -84 -116 37 298 -225 147 -82 -183 -100 103 -140 85 -203 -124 -72 -282 -48 273
4436 273 -92 14 -178 -31 -36 -25 -131 -242 59 18 51 221 42 -5 -308 -163 312 194 -112 -31 -159 165
4458 165 81 -82 39 7 130 7 -7 -119 -160 1 202 171 -39 -131 -97 -120 12 1 -69 -222 76 -197 -9
$$ packed form
4293e5j39K35j10J3L57l09j31J93k6j55j03J23k5P6j50LL39k89J47k40j2L38L8
4316A18j49R7j52J89R3l41R4J41P6j04J0N4j05M7n6n3q1L37j78L3m6j50J50p7
4340e3Q6J84j96k63K32r0P8kK27m55L58q8j39O6P8o2QJ91n03K34J97j82o8L3L05
4365A76l0j17j89L06j54O3Q3j73P3j7P1Pm5J44k27K57l48j5K83j68R6l7J74k60
4389d7R1p1R0m7l64P3J86N0O3j43J96j43ML93l84J81k11l7J7j35M56q5k48Q4K17
4414A86k53O2L2K2j33l2J53K61n23L72k29j01Q3K03k43K25k88P9N2k10K34L21
4436B73l65J06j92J47nJ1j06j11L01m1L3J70j79m7l03J45M75j18l06Q1j28L24
4458A65q4j63J21l2J23j23j4j12m1J61K01l1k10r2L4k3J32j1p0j53K98k73J88
$$ plain form
4481 -9 93 28 -15 36 -85 93 -59 97 37 305 -78 -91 -61 -120 144 -147 -72 42 14 -121 -122 -110 -1 -203 -7
4506 -7 225 65 193 -12 -85 -60 -101 -135 14 -233 -98 133 -13 -238 -79 90 -18 -39 -15 222 145 -44 -231
4529 -231 114 81 61 -53 162 -36 -245 -114 -103 -112 48 -42 155 -116 14 31 78 190 -15 76 89 -112 -206 99
4553 99 132 -230 3 86 7 139 -10 56 114 -308 51 248 -55 -124 28 208 94 -168 -196 -101 42 -63 -150
4576 -150 101 81 -121 43 -100 -29 -73 -42 161 -75 -182 221 12 68 -171 -87 60 36 -91 -48 -138 -11 190
4599 190 21 -269 23 62 201 34 36 -338 -32 -21 75 388 -146 85 263 49 -67 218 188 -75 13 107 -234
4622 -234 216 156 12 65 218 127 124 -301 149 -234 168 -73 119 -32 -52 -213 -18 -110 -27 -10 -369 129 32
4645 32 22 77 179 -22 -148 178 182 -4 104 -110 18 -92 293 225 -67 -15 100 55 173 -146 -201 -127 -15
$$ packed form
4481iJ02o5m3N1j21J78j52J56o0K68l83j3L0n9K64k91P5J14k8j35jJ2J09k02J96
4506gK32j60J28k05p3K5m1l4J49k47J35K31j46k25J59J69j08k1K4K37p7j89j87
4529b31L45l3k0j14K15j98k09J31J1rJ60r0J97k71J30J7M7J12k05R1J3k01r4L05
4553I9L3l62K33Q3p9J32j49O6N8m22L59J97l03o9J52J80j14k62k8R5J43j05q7
4576a50K51k0k02J64j43P1m4L1K03k36j07M03k09N6k39Q4J47k4j27M3r0J27K01
4599A90j69k90K92L9J39j67Kl74L06J1R6L13n34K31J78k14j16K85l0k63Q8R4l41
4622b34M50o0j44N3J53r1lm25M50l83M02k41J92j51k0j61J95r2Q3J7l59M98r7
4645C2j0N5J02k01j26L26Mj86J08k14J28j10L85o8k92N2J15m5J18l19n5P4J12
$$ plain form
4668 -15 -97 -37 -167 166 130 -272 -17 289 69 -153 108 -47 20 196 -62 176 -114 -72 -5 -161 2 -45 -198
4691 -198 143 -43 -146 207 7 118 270 -80 162 238 316 293 -47 -99 -67 -43 -30 13 196 -148 234 30 50
4714 50 38 36 7 -65 33 137 135 -106 257 23 -36 -146 -52 29 88 82 413 175 62 -75 31 112 -200 -156 -202 77
4740 77 -96 -137 312 316 29 -217 -74 -90 -143 -94 93 -90 -150 -5 235 28 -73 34 -102 165 98 -75 52
4763 52 -43 61 -60 -14 209 -171 23 -114 52 68 -172 248 127 33 -2 -48 -119 -13 -28 -57 -23 138 -199 -93
4787 -93 -14 218 200 52 -158 -76 -87 -204 -208 -6 157 -38 -133 -19 91 174 28 -55 -99 -55 97 276 -129 121
4811 121 -74 -12 6 83 233 -127 100 45 0 -105 53 136 169 -13 -188 -237 -289 24 -122 138 -44 -7 145
4834 145 -295 -14 31 -132 -30 72 -175 -104 -52 -59 92 40 16 216 239 32 -42 210 194 -32 108 -24 202
$$ packed form
4668a5q2O0j30L33l6m02K55L06k20k22K61j55O7J76k58K38k90M2O7j56J63m7j53
4691a98L41j86j03L53k00J11J52l50K42P6P8k3l40n2L2K4J3M3J83l44L82k04K0
4714E0j2kk9p2R8J04kk41L63k34n9j10R4Q1N9oL31k38j13j37J06Q1l12M4m6K79
4740G7j73m1M49Mk87k46J43j6n3M9J87j83o0J45K40k07j01J07j36K67o7j73J27
4763E2r5J04j21M6K23l80J94j37J66J6k40M20j21r4l5m6p1J06j5k9L4J61l37J06
4787i3P9K32j8j48k10Q2j1j17mK02J63j95r5J14J10Q3j46q3m4M4J52J79m05K50
4811A21j95O2J8P7J50l60K27n5m5j05J58Q3L3j82j75m9n2L13j46K60j82L7J52
4834A45m40K81M5j63J02J02k47P1N2pJ51n2k4K00K3k07p4K52j6k26J40j32K26
$$ plain form
4857 202 -3 -75 196 -224 23 -395 -100 104 130 -45 -34 63 238 -24 122 -78 41 128 -257 3 -137 -56
4879 -56 -106 40 -50 -38 -94 -101 142 122 106 18 -7 86 27 69 -171 -204 -140 -173 35 -53 3 -4 92 -68 -44 59 -117 70
4907 70 -183 -65 35 -99 -15 168 150 32 150 169 -3 119 -24 -16 -102 -25 -133 103 185 162 17 -141 122
4930 122 -58 -100 -21 199 10 64 -104 17 -83 -28 128 -22 98 18 26 49 52 52 217 -59 -85 -169 -111 -11 -137
4955 -137 48 -19 39 -55 -101 112 -22 21 -26 228 -132 113 254 -195 205 -111 83 -182 -129 -118 -78 241 248 80
4979 80 -76 -67 183 -68 -104 -24 163 -66 -101 44 -206 -257 -335 -101 -162 -118 -111 -14 13 -107 65 -26 -89 255 -260
5004 -260 -68 220 27 -68 5 -153 -105 -58 -48 44 102 -76 -111 44 -109 86 78 -194 102 120 11 -100 -33 189
5028 189 91 203 -97 -27 -148 106 169 228 50 79 -159 41 -165 -97 -150 -227 26 -36 -44 91 -126 -278 57 -196
$$ packed form
4857B02k05p2K71m20K47m18K95K04K6j75J1R7J75k62J46k00J19Q7l85K60j40Q1
4879e6n0J46r0J2n6pK43k0j6q8k5R3n9M2k40l3O4l3K08q8N6pR6j60K4J03j76J87
4907G0k53J18J00j34Q4J83j8j18J18J9j72J22j43Qq6P7j08K36Q2k3j45j58K63
4930A22j80m2P9K20j89N4j68J21j00N5J56j50J20q0QK3L%J65k76k6q4N8J00j26
4955a37J85o7N8r4m6K13j34M3m7K54l60K45J41m49M00l16J94k65N3J1M0L19Pj68
4979H0j56RK50k51l6Q0J87k29l5J45k50n1p8K34o1M4PR7K7j20J72r1o3L44n15
5004b60J92K88j93r5P3j58M8M7J0R2N8j78l5J55j53J95qk72K96J8j09j11O7K22
5028A89r8J12l00P0j21K54O3N9j78K9k38K00k06O8n3p7K53o2qJ35k17j52L35k53
$$ plain form
5052 -196 61 -217 97 165 145 -138 135 -24 -51 -151 -67 21 -2 -137 30 -89 67 -69 22 -260 147 70 89
5075 89 51 53 121 -46 56 -189 15 69 195 -110 136 -72 -350 -193 92 -15 130 16 233 -33 166 6
5097 6 71 167 145 -70 -94 -249 -72 -95 58 -20 169 18 -180 196 45 80 -48 -74 94 -116 -71 -217 -104 18
5121 18 7 79 168 31 -96 -218 156 106 -91 -185 -103 174 -120 -170 3 -40 47 -223 -22 78 -124 -107 216 48
5145 48 -96 141 115 -137 252 -67 -64 202 140 143 135 154 -249 -26 212 83 -217 -201 61 -174 115 171 149 24
5169 24 -206 202 8 16 -117 -83 -95 80 -72 -110 -93 -37 177 -89 92 65 -23 -3 65 -72 -30 -103 14 -54 -16
5194 -16 100 2 -94 -312 36 23 -165 196 -28 -165 166 -112 -160 -75 237 245 172 -191 253 -174 -98 6 -125
5217 -125 -59 -79 -11 108 156 51 -34 -201 4 -155 -105 2 119 -26 -38 82 334 -25 -4 -104 38 -295 -156
$$ packed form
5052a96K57k78L14O8k0k83K73j59k7j00Q4Q8k3j35J67j19J56j36R1k82M07p7J9
5075H9l8KO8j67J02k45K04N4J26l05K46k08k78J57K85j07J45j14K17k66J99j60
5097FO5R6k2k15k4j55J77k3J53p8J89j51j98L76j51L5j28k6J68k10M5j46J13J22
5121A8j1P2Q9j37j27j22L74n0j97r4Q2K77k94n0J73m3Q7k70K01J00k02J7L23j68
5145D8j44K37k6k52L89l19LK66o2LqJ9m03K23K38j29l00J6K62k35K89N6k2j25
5169B4k30M08j94Qj33L4j2J75j52l8J7N6K14k66J81k7q8K0O8j37M2p3J17o8L8
5194a6J16r8r6k18L48j3j88L61k24j37L31k78m8Q5L12Qp3l63M44m27P6J04j31
5217a25O6k0O8J19M8j05q5j67K05j59N0J07J17j45j2J20K52l59K1j00J42l33J39
$$ plain form
5240 -156 1 258 -263 -76 -327 152 82 -158 273 -37 -178 -215 170 128 351 214 -265 230 67 -24 136
5261 136 -235 -68 221 182 -156 -24 93 3 -16 -4 -103 -171 -78 105 185 -49 -142 -207 10 2 131 -20 70 -354
5285 -354 -3 -50 -100 97 -32 -15 -90 -106 53 111 -71 143 -89 67 9 -29 -259 -11 -154 -3 7 -174 -108
5308 -108 -57 -42 146 199 -134 59 -125 -12 -52 -36 2 64 -106 180 -80 -35 -37 -93 -24 205 117 85 138 -23 -50
5333 -50 -155 -26 -398 152 127 -178 151 -251 -105 -163 -17 68 -19 -77 -284 -46 -155 -13 -26 255 207 -154 212
5356 212 -49 272 -162 -19 -149 2 -81 160 -36 71 29 83 82 -73 117 -72 -13 -180 111 184 -150 -111 -49
5379 -49 86 22 -92 -131 -45 161 -4 74 -254 67 -23 -15 63 153 -65 99 -18 175 154 -100 149 -84 117 -38
5403 -38 44 -146 -142 -192 203 161 -5 -183 27 -21 -202 135 -24 55 135 -225 -65 81 -40 -260 -11 71 93 260
$$ packed form
5240a56J57K57n21J87k51M79p0k40M31l10j41l7L85m2K23j37m79M95j63r1J60
5261A36l71J67K89l9l38J32J17r0j9J2r9o8R3J83Q0k34r3o5K17qJ29j51R0m24
5285c54L51m7n0J97j29J7p5j6J59N8j82K14k32J56n8l8k30K48j43J51J0j81O6
5308a08N1J5J88N3l33J93j84J13m0J6L8O2j70K86k60M5kn6O9K29q8l2N3j61k7
5333e0j05J29l72N50k5l05L29m02J46n8J46Q5q7n8k07K38j09J42j3K81m8l61L66
5356B12k61L21m34J43j30J51q3K41j96J07m2N4jj55J90j89N9j67K91P3l34L9O2
5379d9J35o4j14l9Q6K06j65P8l28L21r0QP8R0k18J64j17J93k1k54K49k33K01j55
5403c8Q2j90Mn0L95m2j66j78K10m8j81L37j59P9Q0l60J60J46j21k20K49Q2K2J67
$$ plain form
5427 260 -69 56 -6 78 -58 -21 -85 -99 66 -242 -61 -173 156 155 -76 -48 -97 -27 -255 41 316 -18 -304
5450 -304 -101 6 -108 -73 -30 -39 -219 84 -131 161 8 -42 -197 -55 -14 -5 -118 15 8 84 -69 -77 -39 -90 -42
5475 -42 34 67 136 -125 -56 10 9 166 -274 -245 139 -264 -206 -88 -162 -45 3 -134 -214 -88 16 -152 -48 103
5499 103 -41 -51 134 37 -34 -43 35 149 198 -112 125 132 -32 -88 -79 -66 -34 235 -120 -47 -153 -103 58 100 159 -139
5525 -139 -7 93 33 -28 59 47 -76 -6 20 97 24 -92 -9 140 171 203 -109 -82 -61 -5 -156 -100 -159 -197 -94 15
5551 15 -14 253 -191 -134 162 -200 41 -203 -18 126 81 -121 51 -199 3 70 -35 168 85 42 27 -61 53
5574 53 -125 6 100 -81 101 85 -111 86 -1 -163 151 228 99 -221 -296 86 211 -127 77 97 -44 93
5596 93 -145 190 -115 -32 126 -66 194 99 -72 134 28 37 266 -120 -281 184 112 -113 117 -42 9 -209
$$ packed form
5427B60l29J25o2Q4j36L7o4j4J65l08J81j12L29jk31K8m9P0k28K96K75l34k86
5450c04K03J07j14L5M3rj80L03k15K92j53n0j55J42M1Rj13J33pP6j53qL8n1M8
5475d2P6L3O9k61O9O6jJ57m40K9L84m03N8J18p4J17M8j37q0J26J04j68J04J51
5499A03j44j0J85r7p1rP8J14M9l10K37Pj64n6RJ3L2K69l55P3j06N0J61M2N9k98
5525a39J32J00o0o1Q7j2j23P0K6P7p3j16Q3J49L1L2l12K7K1N6j51N6n9l8J03J09
5551A5k9K67m44N7K96l62K41k44J85J44m5k02J72k50K02O7j05K03q3m3j5q8J14
5574E3j78J31R4j81J82j6j96J97q7j62L14P7j29l20p5L82J25l38K04K0j41J37
5596I3k38L35l05Q3J58j92K60r5j71K06j06RK29l86j61M65p2k25K30j59N1k18
$$ plain form
5618 -209 36 -69 140 94 73 175 -32 -78 -34 40 -11 40 -248 3 94 -35 54 28 24 46 -126 73 48 116 -95
5643 -95 14 73 -44 -51 39 104 -130 -7 162 127 -283 -218 249 -29 178 44 -6 160 84 -22 -134 27 157
5666 157 -8 170 57 -137 60 -215 141 87 31 111 -104 -8 -13 66 -47 88 -29 268 -31 -23 -59 41 -117
5689 -117 -41 -91 -177 -127 -154 59 -225 -11 -11 189 -143 -129 -52 201 131 39 203 11 -85 -90 -28 -85 36 120 -167 -109
5715 -109 -164 15 -242 -362 128 -41 141 48 -43 19 -135 -164 -115 5 -78 -172 101 -62 -82 -79 19 -52 -17 139 78
5740 78 133 22 -328 -5 -96 -158 177 82 108 -16 -137 89 109 43 -225 -13 -130 -28 -116 4 66 -144 155
5763 155 -125 -105 35 54 -70 258 -13 49 12 -4 -6 6 42 60 194 -95 -232 -181 80 16 40 -197 -153 -49 106
5788 106 20 163 -172 -51 -195 2 114 -290 0 16 -48 70 -13 27 173 -225 3 58 43 209 -47 -35 -346
$$ packed form
5618b09K45j05K09m6k1J02k07m6M4P4n1N1k88K51R1j29Q9k6mK2j72J99k5O8k11
5643i5J09N9j17pR0O5k34J23J69l5m10O5M67k78K07j34n0J66p6j06j12J61J30
5666A57j65J78j13j94J97k75L56n4n6Q0k15R6nP9j13J35j17K97k99Ql6J00j58
5689a17P6n0q6N0k7K13k84K14%K00l32J4P7K53p0r2J64j92r6nO2n7J21Q4k87N8
5715a09n5J79k57j20M90j69J82r3r1O2j54k9M9J20q3r4K73j63k0LR8p1L5J56o1
5740G8N5j11l50L23r1o2L35r5K6j24j21K26K0o6k68K12j17J02q8J20O2k10K99
5763A55k80K0J40J9j24L28k71O2l7j6kJ2L6J8J34k89j37N1K61o4K4k37M4J04J55
5788A06q6J43l35J21j44J97J12m04K90J6o4J18q3M0J46l98K28N5j5J66k56J2l11
$$ plain form
5811 -346 -71 154 -279 80 -196 -60 10 95 -59 86 -95 26 3 25 90 89 2 -58 17 -205 126 -176 95
5834 95 -8 32 17 209 -60 92 241 -130 100 -79 -15 -56 -98 63 60 160 194 181 26 53 63 236 111 -116
5858 -116 -150 -6 51 202 -182 -22 196 -163 -138 185 -250 371 106 -329 99 -28 30 273 -72 66 38 57
5880 57 227 95 27 -85 98 272 101 10 17 -37 -47 -286 166 -211 -88 119 98 -75 -23 107 -219 -8 77
5903 77 152 -22 -234 273 -80 -142 17 -184 -151 12 -108 152 -85 -164 -133 58 -136 112 146 101 274 -170 -48
5926 -48 -123 -265 -385 34 -47 89 104 -183 41 191 -42 -143 344 -89 -117 -64 133 103 88 -142 -40 61 52
5949 52 101 57 -76 -98 -154 -38 73 -103 -52 -27 273 123 -13 -162 30 0 57 -78 -40 -161 -79 -13 152 51
5973 51 90 -162 -117 -224 -52 2 -139 -235 211 68 52 -124 40 -6 10 140 86 -170 -100 207 237 121 229 69
$$ packed form
5811c46K75K25m33L59k76J36P0Q5j54J45j81J21k3K2O5jq7o0P5k22L31l02K71
5834I5j03M0j5J92k69J52J49l71K30j79O4m1m2J61lJ00L4j3j55K7J0J73j25k27
5858a16l4J44N7J51l84J60K18l59K5L23m35O21k65m35M28j27N8K43l45J38k8J9
5880E7J70j32o8j12J83J74j71r1Pn4j0k39M52l77J23K07k1j73N2J30l26K11Q5
5903G7P5j74k12N07l53o2J59k01L3J63j20K60k37p9L1J91j94K48L4m5J73m44J22
5926d8p5j42j20M19q1J36J5k87K24J50k33j01M87m33k8N3J97l0j5k30J02J01r
5949E2M9m4j33k2n6J16J11j76N1K5L00j50j36j49J92l0N7j35L8j21Q2O6J65j01
5973E1L9k52M5j07J72N4j41r6M46j43j6j76J64m6J6J30n4k56P0L07L0j16J08j60
$$ plain form
5997 69 27 107 29 103 -198 260 -235 -108 20 139 166 -6 88 138 -80 -108 37 170 -95 40 -142 9 145
6020 145 7 -78 -133 35 61 -85 122 129 361 -4 57 54 -36 -85 -54 -178 -8 -88 -140 85 -26 168 -26 75
6044 75 225 -40 38 164 -64 -62 55 303 -75 55 14 -73 178 -18 -134 59 -304 -14 94 -226 7 189
6066 189 -278 20 36 74 165 32 -76 38 69 206 -86 -98 -122 -105 67 136 201 -27 67 180 -37 3 -59 -78
6090 -78 -154 -25 87 38 -213 -92 -1 299 -72 -72 -164 232 177 -204 -208 -114 159 -43 -120 -83 -87 -185 -226 -189 -154 101
6116 101 9 174 -33 39 63 48 94 -113 -243 119 23 62 -236 288 -146 -248 10 31 35 69 -26 181 -175 75
6140 75 92 128 0 -8 -219 -122 104 -245 78 -178 -115 1 -131 -234 86 55 52 -68 240 118 32 -166 -119 266
6164 266 -99 -257 58 81 -97 115 -126 -11 -157 219 137 72 130 76 115 -142 -14 34 -61 14 -26 34 -52 -82
$$ packed form
5997F9m2Q0p8P4l01M58m95J27J28J19K7j72R4N0k18k8J45J33k65J35j82J51J36
6020A45j38q5n5J68K6j46K07PK32l65O1lr0m9L1j24J70q0n2K25j11J94j94J01
6044G5J50k65P8J26k28KJ17K48l78J30m1q7K51j96j16J93l63K90J08l20K33J82
6066A89m67K98J6L8R1j33j08J14L1J37k92j2k4J7J72O9O5k28R4J13k17M0o2j9
6090g8p6J29J12m9k51J21R1L00l71%r2L96n5l81mR4K73k02p7L7mr8m1L7L5K55
6116A01r2J65k07P2K4j5M6k07j30L62r6L9k98N24m34j02K58K1ML4r5K07l56K50
6140G5J7L6j28qk11R7K26l49L23k56O3J16j32j03L20l1lj20L08j22q6j98M7L85
6164B66l65j58L15K3j78K12k41J15j46L76q2o5N8n4L9k57J28M8r5P5m0O0q6l0
$$ plain form
6188 -82 27 284 -174 -37 -192 89 -6 327 19 -34 229 156 29 5 165 -31 -51 80 -86 -27 232 19
6210 19 -68 4 277 21 42 71 -50 -46 175 36 -93 39 26 -89 -105 -100 -127 217 -64 -87 -105 -14 -16 3 66 117 149
6237 149 -191 186 13 -88 -27 -89 168 163 26 171 -110 -320 -25 -37 56 254 -108 110 83 23 -78 80 -87
6260 -87 214 15 -42 27 -191 -12 135 69 -164 -302 14 259 -135 82 -74 -68 145 -19 -45 62 88 201 -78
6283 -78 108 151 466 15 114 129 165 -129 257 -285 33 46 -55 64 18 -48 -84 -66 24 88 -76 119 7 42
6307 42 25 -105 4 -216 0 -195 -149 -37 148 152 -194 35 -84 -71 -7 106 89 -198 -58 -22 49 -260 -84
6330 -84 158 -186 197 -257 -59 51 90 -22 67 67 112 197 -100 213 42 39 123 -308 -122 -209 81 42 -167 -205
6354 -205 -86 102 4 189 22 150 186 84 -79 188 128 102 194 150 -7 48 154 -217 60 -3 -37 -134 -173 66
$$ packed form
6188h2J09K57m58J37j55K81r5L33l08n3K63p3j27k4J60j96k0J31j66N9K59k13
6210A9q7P2K73k56K1K9j21MK21j39j29J32j3j15j6Nk7L44k81k3j8R1kJ9O3N1L2
6237A49l40L77j73j01O1o2K57nj37J45k81k10K95j2R3J98l62K18k7o0j01J58j67
6260h7L01j99n7O9k18J79J47o6k33j38L16K45l94K17j56OK13j64k6J07K6J13k79
6283g8J86M3L15m51R9J5L6k94L86n42L18J3j01J19m6o6l6J8R0O4j64J95j12L5
6307D2j7j30J09k20K16j95M6J12J85Ml46K29j19J3O4J13j7k87J40L6P1l09J76
6330h4K42l44L83m54J98J10L9j12Q9%M5Q5k97L13j71lQ4m31J86q7K90l9k09l8
6354b05J19J88r8J85j67J28L6j02j63K67o0k6R2m4j57N5J06l71K77o3l4r7l9K39
$$ plain form
6378 66 -3 -100 125 -63 -22 177 -138 4 -88 -277 79 24 -75 6 59 -298 85 198 144 -114 -4 -88 -322 -124
6402 -124 114 -77 -123 -17 5 66 -150 -280 137 18 -44 -131 148 95 -166 136 59 68 -128 45 120 204 -36 -255
6426 -255 49 -129 68 -27 141 -273 -62 319 -279 -2 143 175 315 -135 -54 11 115 -71 9 152 -154 -1
6448 -1 234 -98 14 36 -50 113 177 -73 -117 108 -71 -44 -90 158 389 -163 184 26 -25 240 -57 95 -35
6471 -35 -206 -101 21 105 115 -326 -7 -290 97 -186 154 140 97 -36 -85 -71 139 23 -235 -96 201 -44
6493 -44 114 78 96 116 108 -170 -14 -35 105 38 49 62 -78 7 124 -135 -262 65 63 59 44 219 -90 37 367
6518 367 -167 -3 38 -12 -63 -149 -115 26 197 6 10 -103 -87 -327 52 -104 -229 -29 88 14 93 105 -186 -37
6542 -37 -5 -109 244 13 76 -38 130 278 153 68 4 -4 187 -28 313 80 -317 303 -27 -158 114 -84
$$ packed form
6378F6o9r7K25j88M1J99l15J42r2j89L56n5r9Q1N3l57L83J13n4k58J10q4k34J98
6402a24K38j91m6J06K2O1k16j30M17j19o2q7K79n3k61L02p7Rj96J73P5Q4k40k19
6426b55L04j78J97r5J68m14K11L81n98K77J45L2J40m50Q1O5J04j86Q0J43l06J53
6448aK35l32J12K2q6J63O4k50m4K25j79K7m6K48K31n52L47j58n1K65k97J52j30
6471c5j71J05J22Q4J0m41L19k83L87k83L40j4m3j33m9J4K10j16k58J39K97k45
6493d4J58l6J8K0qk78J56k1J40o7J1J3j40Q5J17k59j27L27kmj5J75l09J27L30
6518C67n34J64M1n0n1q6L4J41J71j91Mj13J6k40L79j56j25K00J17p4P9J2k91J49
6542c7L2j04L53k31O3j14J68J48j25q5o4qJ91k15L41k33l97O20l30j31K72j98
$$ plain form
6564 -84 94 -86 -177 4 -31 -162 -155 57 75 -237 18 -133 122 -11 -67 111 -221 17 -66 -26 -70 165 27
6587 27 320 95 7 22 -119 166 57 7 73 12 130 -121 -4 -106 99 6 -61 -76 106 -133 -157 3 13 -10
6611 -10 -70 60 152 -106 -97 220 172 287 -174 -13 28 7 105 -141 204 138 11 -87 -80 -28 -67 -5 61 -186 73 0
6637 0 37 -172 -57 128 -67 -67 -78 -106 43 -62 -159 48 -152 -196 28 -133 -23 134 94 -243 64 194 -69
6660 -69 102 71 98 -183 -104 60 103 80 67 198 -207 -75 27 -63 239 87 16 123 -70 163 46 -24 30 185
6684 185 -139 159 8 205 -78 12 85 30 118 -13 -20 -42 40 -126 25 34 -124 88 93 -98 -55 89 -96 190
6708 190 107 -91 -94 -273 32 52 111 74 66 -193 -381 213 -143 267 24 51 -104 -42 143 -27 -20 190 152 -163
6732 -163 -69 -86 91 -88 181 9 -130 -100 250 -231 -51 -53 194 122 -139 -23 -190 -37 -117 2 68 -26 -172
$$ packed form
6564h4J78j80r1J81l5j31PK12J8l12K55j51K55j33n6J78l32K38q3M0m4K35j38
6587B7K93k25q8J5j41K85j09n0O6o1J18k51J17j02K05r3o7j5J82k39k4J60J0k3
6611a0o0J30R2k58RL17m8J15m61J61M1k1R8k46L45o6j27r8PN2l9O2O6k47K59p3
6637@L7k09J15J85j95%j1k8J49j05r7K07k00m4K24j61J10J57m0l37L07J30k63
6660f9J71l1K7k81P9J64M3k3j3J31m05J32J02r0L02j52p1J07j93K33j17p0N4J55
6684A85l24K98j51J97k83R0P3n5Q8j31pk2Q2j66J51Rj58K12Nj91M3J44j85K86
6708A90q3j98lj79L05K0N9l7qk59j88N94l56M10k43K7j55O2J85j70PK10l8l15
6732a63R4j7J77j79K69j72j39L0L50m81J80kK47p2k61J16j67J53q0J19O6r4j46
$$ plain form
6755 -172 192 -80 94 57 97 -198 -15 -15 13 -172 -106 -152 72 69 -58 229 51 102 -58 21 161 146 -128 174
6779 174 207 -120 -99 114 -1 419 126 26 -261 -53 -24 38 -261 -36 120 -68 72 10 111 -92 -43 -34 -37
6802 -37 -49 107 -143 16 -14 -66 149 -239 -69 179 101 -240 -124 88 99 -189 -27 176 -184 120 -119 23
6824 23 45 -295 -81 -86 144 -2 -44 -75 -108 -42 219 101 122 -73 254 80 -13 352 84 -36 -135 125 -28 101
6848 101 78 -99 -63 107 20 -258 -105 221 12 -1 85 -56 3 24 -134 6 -119 -224 -190 17 47 47 -149 123
6872 123 -102 -86 153 -1 158 -39 157 109 103 -164 -148 -178 -157 -184 10 123 97 -160 13 -24 -1 164 -2 51
6896 51 74 -242 66 80 228 -160 -118 -42 128 175 265 105 8 97 -115 204 39 32 -130 -253 122 27 -9 -160
6920 -160 58 -43 74 -89 174 -211 -236 -32 -118 18 -24 -127 45 23 17 119 -67 -90 -107 -30 -285 2 78
$$ packed form
6755a72L64k72J74l7M0k95J83%K8j85O6m6K24lj27K87j78N1j60P9J40j5k74L02
6779A74L3l27K1K13j15M20k93j00k87K08K9O2k99K25J56j88J40o2J01k03M9Rl
6802c7j2J56k50J59l0n2K15l88J70K48p8l41J16K12J1k88J62K03l60L04k39J42
6824B3K2l40K14nK30j46m2l1l3O6K61j18K1j95L27j74r3L65k68j20r9K60j53J29
6848A01k3j77L6J70q7k78J53L26k09j3Q6j41N9K1j58J40j25j05L4K07L0%j96K72
6872A23k25J6K39j54J59j97J96m8ok67J6l0K1k7J94J13k6k57J73l7K3J65j66N3
6896E1K3l16L08J4J48l88M2P6J70M7R0j60r7Q9k12L19j65pj62j23L75r5l6j51
6920a60K18j01J17j63K63l85k5K04q6J36m2j03J72k2oJ02j86k3j7P7k55K87P6
$$ plain form
6943 78 141 109 67 -123 5 -22 -125 -25 106 -133 -141 83 104 -113 24 169 65 138 -36 172 129 -89 -199
6966 -199 -65 -45 -36 -7 -106 -195 187 -112 -2 -207 77 -123 24 0 -118 92 -175 46 93 -39 46 331 115
6989 115 -192 123 -70 132 -84 -170 -95 -55 -188 35 -15 105 -44 9 33 23 10 25 90 -9 -80 -98 17 44 265
7014 265 -17 17 18 114 34 -148 -80 42 210 -68 -96 1 -331 -106 200 28 -15 135 76 108 25 91 -121 235
7038 235 -169 -75 3 -233 82 94 -87 -115 -99 55 14 -2 -23 -135 -98 80 -35 -81 -1 -8 171 -37 -30 86 -90
7063 -90 -56 93 -46 187 -246 -33 190 206 37 152 -140 48 -120 -66 -29 -6 -11 -16 61 127 -73 93 -219 15
7087 15 254 90 -96 48 -258 -8 66 7 -189 -49 22 -145 201 157 -36 172 24 -68 -158 52 -48 -255
7109 -255 74 81 44 90 -135 74 66 -31 -99 -41 -321 -129 -102 -217 -203 -99 -93 41 146 34 63 7 -35 -110 188 -7
$$ packed form
6943G8O3l2m2j90J28k7j03J00J31k39qK24K1k17J37J45j04P3j74K08m3k18j10
6966a99J34K0RK9r9q9L82k99J10k05K84k00J47k4j18K10k67K21M7j32Q5K85k16
6989A15l07L15j93K02k16q6P5M0j33K23n0J20j49N3K4j0j3J5O5r9p1j8J15K7K21
7014B65k82L4JR6q0j82O8J22J68k78k8R7l32K25L06j72m3J50n9L2q3O6k12L56
7038B35m04R4P8k36L15J2j81k8J6J54m1j6k1j12L7J78j15m6Q0pJ79k08PJ16j76
7063i0L4J49j39K33m33K13K23J6j69J15k92J88j68N4L7K3nnP7O6k00J66l12K34
7087A5K39j64j86J44l06K50P4n9j96J40P1j67L46m4j93K08j48r2r0K10j00k07
7109b55L29Pl7M6k25K09qr7o8N8k80J92K7j15J4J04OJ34J05j12K9n6m2p5K98j95
$$ plain form
7135 -7 133 -39 -69 -52 3 -6 -208 -110 -11 -84 38 -123 -228 52 4 -22 -18 -158 2 -153 -157 39 60 79 -123 -33
7161 -33 40 46 -33 32 -34 168 28 76 157 233 182 95 30 45 -104 202 -52 -5 183 -9 37 45 -15 30 356 -228 -128
7188 -128 6 46 119 -153 -25 29 1 -59 53 11 -12 23 -79 -99 187 -27 -61 73 65 175 -70 273 -53 83
7212 83 229 -501 30 35 89 100 48 5 224 -75 -66 22 238 -10 190 -215 148 -98 -105 85 0 -150 43 24 -100
7237 -100 -253 132 -58 -94 -3 49 175 81 31 -86 -32 35 9 -125 -168 84 -6 -84 84 -69 76 -81 230 -28
7261 -28 -2 50 39 160 67 -117 108 242 -198 92 -146 166 3 -86 -133 -39 -202 83 -27 -16 258 49 -25
7284 -25 -135 93 30 174 -63 262 254 166 -117 -22 -14 -238 -2 136 169 0 -65 108 143 -28 228 12 -181 -55
7308 -55 -84 30 -18 -118 -35 -143 -79 -96 241 -28 -75 -30 -79 -42 51 108 -106 -88 -16 -22 13 58 -148 -28 28 -149
$$ packed form
7135gJ40j72l0J7N5rk02R8R9p3J22j61j05K80m8k6Mj40J60j55mJ96K1J9k02R0
7161c3P3Op9O5o6K02j40M8Q1P6n1q7o5J5j49L06k54M7J88j92M6Qo0M5L26n84J00
7188a28J34M0P3k72J28N4k8o0J12m2k3L5j02k0K86k14l4J34qJ10k45L43l26J36
7212H3J46p30N31NN4J1n2m3K19k99RQ8K16k48K00m05L63k46pJ90q5j50J93j9j24
7237a00j53L85j90l6R1N2J26r4n0j17N4O7k6j34m3K52r0p8J68j53J45j57L11k58
7261b8K6N2j1J21r3j84K25J34m40K90k38L12j63q9m7R4j63K85j10J1K74k09p4
7284b5j10K28o3J44k37L25qq8k83R5Qk24K36J38L3j69o5J73L5j71K56k16j93J26
7308e5k9J14m8j00Q3j08O4j7L37k69m7M5m9L7R3N7k14J8P2oL5M5k06J20N6j77
$$ plain form
7334 -149 56 63 274 -54 66 56 -166 -47 31 61 139 -48 109 4 221 -127 -211 83 138 -32 198 -30 22
7357 22 -214 -71 17 34 46 120 -102 98 -78 62 125 -38 -5 4 337 -61 55 -90 -18 -23 55 -85 51 30 -33
7382 -33 89 -158 -4 -114 97 29 344 235 -365 -113 -223 -49 60 -167 -106 67 -84 132 -220 9 -28
7403 -28 -3 40 -191 -132 89 57 -354 179 138 110 -257 -93 -80 240 -14 11 18 -101 -152 -172 19 98 83 -70 200
7428 200 168 -192 63 -35 14 -82 -339 20 110 -94 -184 -212 189 176 198 222 -82 -165 39 223 20 99 -36 48
7452 48 40 -120 170 -18 -117 63 60 -82 154 -127 162 154 214 -22 181 -43 -72 25 -19 -88 -207 70 118 144 -192
7477 -192 -85 -9 120 88 28 -4 69 38 3 -145 -14 126 91 140 -54 106 31 -114 152 -163 -53 302 -108
7500 -108 -24 -118 45 -50 78 165 -221 81 89 279 -82 26 -55 5 -15 68 -223 -224 51 81 91 114 8 189 -243
$$ packed form
7334a49K05PK11l28J20j0k22J19P8L0P8j87J57j05K17l48q4K94N5j70K30k28N2
7357B2k36J43Q8J7J2P4k22K00j76J40O3j63L3RL33l98J16j45P2nP8j40J36k1o3
7382c3J22k47J54j10K11o8L15j09o00K52j10J74J09k27O1J73j51K16l52K29l7
7403b8K5M3k31N9K21l2m11N33m1k8l67J64J3L20k54K5Pj19n1k0J91P9j5j53K70
7428B00l2l60K55r8M9r6k57L59R0k04r0k8M01j3K2K4l04q3K04J84k03P9j35Q4
7452D8qj60K90j88r9J80lj42K36k81K89qO0k36K03k24k9R7m4o9j19K77M8K6l36
7477a92J07P6J29l2o0l2P3l1l5j48J31J40l5M9j94J60p5j45K66l15J10L55m10
7500a08Q4r4J63r5J28Q7l86L02QJ90l61J08q1O0k0Q3k91jK75L0J0K3j06J81m32
$$ plain form
7525 -243 -140 102 75 -89 -111 211 300 44 100 -163 152 38 -28 53 -170 -15 -144 -43 -77 -88 -86 17 -178
7548 -178 -184 -47 245 -75 31 37 -64 -252 75 -263 -69 65 131 -49 -81 -32 -58 -39 -61 -206 166 -274 -242 -23
7572 -23 27 131 87 64 -170 -50 411 32 103 -53 -13 -51 -140 276 -21 -156 25 39 86 47 71 -97 -109 128
7596 128 29 260 -45 -66 12 177 -101 -113 -167 225 44 112 -33 -353 -45 -322 -26 -24 47 65 -147 -58 35 113
7620 113 -281 -130 143 231 -13 -49 -50 43 -65 190 214 35 62 89 48 -62 13 -13 35 144 110 30 25 -27 95 95
7646 95 102 62 -84 127 -289 -74 -371 151 51 -150 -30 -26 21 -4 108 -365 117 74 7 -160 44 95 188 -11
7670 -11 -84 158 -46 19 -94 -9 186 8 -22 10 159 -21 213 54 -38 50 123 6 8 50 188 75 143 -78
7694 -78 -128 -119 305 90 -30 -208 46 -144 -239 87 58 97 -371 -72 8 117 -10 30 122 40 135 -24 -230 -63
$$ packed form
7525b43J03K42k7j64k2L22Q9k56N6k63L15j14o6Q1k23J55j29J01l4j1KJ03j95
7548a78oJ37K92l20J06Oj01j88L27l38J94J34O6j80l2M9k6J9k2j45L72m40L2K19
7572b3N0J04m4k3k34J20M61l79P1j56M0l8q9M16k97j35J81J4M7l9K4j68j2K37
7596A28r9K31l05k1P8J65k78j2n4L92j81O8j45l20L08k77K96KP1J8k12Q9R3P8
7620A13l94J51K73Q8k44l6jR3j08K55K4j79K7K7m1j10P5k6M8J09l4q0nn2J22%
7646I5Pm0j46K11m16K15k97N22j00k01J20MM7k5J12m73M82m3o7j67K04N1R3j99
7670a1p3K42k04O5j13Q5J95j78l0L2J49j80K34j59r2Q8P3j17KM2J38j13O8k21
7694g8n0RM24k15j20j78K54j90r5L26k9L9m68K99Q0J09j27M0R2q2R5j59k06J67
$$ plain form
7718 -63 -33 240 85 -60 -97 -64 143 -82 -145 6 -177 191 112 188 -269 -182 -113 124 133 73 -54 104 207 51
7742 51 30 307 129 -126 70 209 145 29 89 139 -114 249 -180 -42 -148 -61 57 72 12 -98 24 -278 -128
7765 -128 159 198 -20 15 37 172 88 287 -179 -123 209 -129 -68 -39 -42 10 -105 -187 -116 215 -82 -3 10 38 131
7790 131 -15 35 -59 49 49 -101 -67 -154 -91 12 174 121 -54 100 -245 90 -120 15 151 -109 -180 -75 200
7813 200 178 -106 17 8 130 33 -149 -35 -190 305 175 114 -162 21 -88 33 -58 -94 109 102 -43 248 -88
7836 -88 -19 25 29 46 -244 -105 40 51 141 -220 -155 47 156 -227 -30 -168 52 -69 -117 108 -101 -91 -69 -154
7860 -154 14 199 -205 11 -375 -9 -67 69 282 -68 41 -83 -9 202 -55 37 -21 113 36 183 -106 -78
7882 -78 76 -265 2 -20 -101 48 130 -167 54 25 14 86 -201 -37 76 -221 1 156 -71 -21 86 178 135
$$ packed form
7718f3L0K73j55j45l7L3K07k25o3J51j83L68p9P6m57Q7O9K37Ro0j27J58J03j56
7742E1k1K77j78k55J96J39o4j16O0N0k53L63m29J38j06Q7J18J5o0j10J22l02J50
7765a28K87L9k18L5K2J35q4J99m66N6L32l38O1K9lN2j15q2P1L31k97P9J3K8R3
7790A31j46N0r4J08%j50L4q7O3J03J62n3j75J54l45L35k10J35J36k60p1J05K75
7813B00k2k84J23rJ22r7j82J14j55M95j30o1k76J83j09J21r1l6K03pj45K91l36
7836h8O9M4MJ7k90J39J45J1R0l61O5K02J09l83J97j38K20j21m8K25k09J0K2q5
7860a54J68J85m04K16l86L66n8J36K13l50J09j24P4K11k57R2n8J34p7J47k89K8
7882g8J54l41K67k2q1J49Q2k97K21k9j1P2k87J64J13k97K22J55k27N0J07R2m3
$$ plain form
7905 135 60 -82 -45 24 8 22 95 -74 -288 225 -221 25 -22 16 21 139 42 -165 -129 44 -131 -127 -66 -93 -110 186
7931 186 -104 32 -97 -87 8 17 63 -289 -103 -111 -212 -336 -70 6 312 144 174 -45 -34 1 59 -183 -30 227
7955 227 123 72 77 -1 -29 258 -145 -75 171 -41 94 129 -95 -184 -71 -34 237 -88 193 86 143 12 -79 -141
7979 -141 173 -200 -185 143 -73 4 -278 252 105 -106 -126 122 -93 156 1 181 94 138 144 105 7 219 -128
8002 -128 -119 53 -49 -68 307 62 -208 -49 12 19 -292 -144 166 56 -148 -89 86 7 27 -236 -20 54 4 -84
8026 -84 207 -19 255 45 45 -34 94 -62 74 86 1 50 188 -35 65 69 180 167 78 -95 33 185 -181 -205
8050 -205 -178 51 -178 31 -182 134 247 152 42 -9 49 30 -384 -231 45 51 -93 -85 -37 -122 191 227 -167 -199
8074 -199 -66 112 218 131 110 -221 -220 135 141 155 121 -109 94 -109 117 151 -2 22 118 -101 54 47 123 -27 23
$$ packed form
7905A35p5j42L7O9j6J4P3j69k14N13m46K46m7L8NJ18r7k07L6J73j75MO1k7j7K96
7931A86k90J36j29J0R5RM6l52J86qj01j24K66P6L06j68L0k19J1L5N8k42J53K57
7955B27j04n1Np8k8K87m03P0K46k12J35L5k24q9J13L7K71l25K81j07N7j31r1o2
7979a41L14l73J5L28k16P7k82N30j47k11k0K48k15K49j55J80q7M4Ol9r8K12l47
8002a28RJ72j02j9L75k45k70J59O1Pl11J48L10j10k04N9J75p9K0k63K16P4n0q8
8026h4K91k26K74k10%p9J28j56J36J2q5M9J38k23J00MJ11j3q9j73J28J52l66k4
8050b05K7K29k29K09k13L16J13r5j10n1N8j9m14J53K76Oj44QM8q5L13L6l94l2
8074a99J33J78J06q7k1l31JL55OJ4l4k30K03k03K26L4j53K4R6k19J55pP6j50N0
$$ plain form
8099 23 -7 -137 -133 59 28 27 -179 -206 -36 -17 -13 -129 23 36 -113 -1 70 71 -221 116 107 -95 -9 -64 9 43 -53
8126 -53 6 -144 107 -4 220 -386 -136 70 -32 -16 -108 -19 11 220 145 -4 149 90 37 81 99 -81 -30 -30 -51
8151 -51 114 110 32 92 -40 48 -15 -55 -412 147 80 20 -235 -130 10 -137 -233 -143 -97 -284 -160 21 120 -7 -2
8176 -2 6 143 142 -163 -51 223 -54 -90 -99 -25 26 -53 -3 -110 -8
$$ packed form
8099B3l0j30MJ92l1jk06k7J70J9Mj16J52J3j49J12P1Jk92L37rk02Q6n5P3L4r6
8126e3N9j50K51j11K24o06K50K06j02J6r2Q9L0K09p5j49J53n9n3M4J8j80N1%k1
8151e1J65mp8O0j32Q8o3m0l57N59o7o0k55J05J40j47r6R0M6j87J24J81R9j27N
8176bQJ37jl05J12K74k77l6rP4N1p9N0j07J02
8191h
$$ Imaginary data points
##PAGE= N=2
##DATA TABLE= (X++(I..I)), XYDATA
$$ plain form
0 0 0 0 0 0 0 0 0 0 0 0 0 0 0 0 7 -8 8 -8 8 -9 16 -16 19 -24 24 -32 35 -40 48 -56 63 -71 80 -90 101 -114
36 -114 128 -141 158 -176 194 -216 240 -265 292 -323 356 -391 431 -475 523 -577 636 -704 778
55 778 -864 964 -1077 1211 -1373 1570 -1820 2138 -2571 3183 -4119 5706 -8868 17460 -85698
70 -85698 -224971 75976 5763 -150749 103258 139514 -122924 -26059 97655 -45269 3297
81 3297 131507 -7997 -64618 7248 -58549 -47225 79055 27482 -31502 23362 -36091 -92696
93 -92696 22543 64018 4405 24457 26107 -42289 -45749 913 33909 27029 -19688 -15629 3392
106 3392 -57869 -21104 108397 43087 -49428 49964 11454 -127571 9570 105231 -54068
117 -54068 -23856 87759 -69932 -96228 89514 25649 -61332 73360 20872 -115340 14985
$$ packed form
0@%%%%%%%%%%%%%%Pj5J6j6J6j7K5l2L5m3M8n6O7p5Q8j04J19j34J51j70J91k15
36a14K42k69K99l34L70m10M56n05N57o15O79p47Q22r06R98j100J213j340J482
55G78j642J828k041K288k584K943l390L958m709N754p302R825j4574K6328j03158
70h5698j39273L00947p0213j56512K54007L6256k62438R6865J23714j42924M8566
81C297J28210j39504n6621P1866o5797J1324J26280n1573n8984N4864n9453n6605
93i2696J15239M1475n9613K0052J650o8396l460M6662L2996o880m6717M059J9021
106C392o1261L6765J29501o5310r2515R9392l8510j39025J37141R5661j59299
117e4068L0212J11615j57691k6296J85742o3865q6981J34692n2488j36212J30325
$$ plain form
128 14985 60802 -54278 36786 84124 -80904 -51165 58749 -45435 -32143 104689 6005
139 6005 -75980 40910 15691 -66448 41367 67219 -45422 -22543 21897 -38656 -20692 45157
151 45157 20061 -5861 -1196 -17411 -13915 -832 3533 27801 11875 -32220 -6125 7060 -28217
164 -28217 13236 44417 -22892 -21302 22605 -28830 -19903 56546 6449 -29053 36417 -8059
176 -8059 -58510 36744 35427 -46744 23164 41783 -65365 -14348 63638 -28721 -25432 62159
188 62159 -18153 -62467 37807 13959 -45709 31484 30724 -48732 -2980 27256 -29820 2045
200 2045 38815 -16603 -13651 22389 -14668 -11313 30875 1372 -14067 14998 -6353 -19271 14724
213 14724 7119 -8209 10332 -3110 -16332 6559 -1891 -8876 16633 -1583 -21058 12454 2619
$$ packed form
128A4985M5817j15080R1064M7338j65028K9739J09914j04184J3292J36832r8684
139F005q1985J16890k5219q2139J07815K5852j12641K2879M4440o0553J7964O5849
151D5157k5096k5922M665j6215L496J3083M365K4268j5926m4095K6095J3185l5277
164b8217M1453L1181o7309J590M3907n1435Q927P6449n0097l5502O5470m4476
176h059n0451R5254j317q2171O9908J8619j07148N1017P7986r2359L289Q7591
188F2159q0312m4314J00274k3848n9668P7193p60p9456M5752L0236n7076L1865
200B045L6770n5418K952L6040l7057L355M2188k9503j5439K9065k1351j2918L3995
213A4724p605j5328J8541j3442j3222K2891q450o985K5509j8216j9475L3512r835
$$ plain form
226 2619 -23921 18008 19127 -27218 4282 23073 -26622 -4016 35398 -14281 -15389 30165 -8586
239 -8586 -25162 27296 5516 -26238 19260 9821 -30601 9518 18113 -25017 3241 21667 -22905
252 -22905 -7974 22830 -14318 -11790 23322 -6406 -17259 17301 269 -16266 14480 6141
264 6141 -14887 9054 6942 -13025 7034 8918 -11692 5181 8957 -13120 2594 11130 -12199
277 -12199 -910 13058 -11884 -6053 14302 -8380 -9443 13929 -4363 -12974 11914 153 -13560
290 -13560 10499 4318 -13589 7647 8052 -13056 4863 11406 -11579 1458 13448 -9127 -2873
303 -2873 14127 -6327 -7149 12601 -2862 -9890 9824 -289 -11035 6688 1872 -11148 4380
316 4380 3835 -10395 2542 5551 -9364 900 7629 -7588 -828 9387 -4922 -2632 9738
$$ packed form
226B619k6540M1929J119m6345L1500J8791m9695K2606L9414m9679j108M5554l8751
239h586j6576N2458k1780l1754M5498r439m0422M0119Q595m3130K8258J8426m4572
252b2905J4931L0804l7148K528L5112k9728j0853L4560j7032j6535L0746q339
264F141k1028K3941k112j9967K0059J884k0610J6873L776k2077J5714Q536k3329
277a2199J1289J3968k4942N831K0355k2682j063K3372j8292q611K4888j1761j3713
290a3560K4059o181j7907K1236M05k1108J7919O543k2985J3037J1990k2575O254
303b873J7000k0454q22J9750j5463p028J9714j0113j0746J7723m816j3020J5528
316D380n45j4230J2937L009j4915J0264O729j5217O760J0215j4309K290J2370
$$ plain form
329 9738 -2138 -4230 8930 191 -5566 6940 1924 -6549 4823 2354 -6922 2569 2910 -7056
343 -7056 583 2982 -6805 -812 4035 -5791 -1779 5339 -4275 -3041 6013 -1816 -3934 6556 797
358 797 -4181 5347 2415 -4953 3851 4158 -4250 1517 4625 -4369 -1443 4746 -2850 -2733 3824 -1835
374 -1835 -4849 1758 370 -4464 929 2266 -3913 -1743 2325 -1091 -1814 3311 1676 -2743 441
389 441 2845 -998 -26 4998 1160 -2891 1664 2135 -2883 687 4597 -2002 -3601 2060 -1417 -4853
405 -4853 2914 3299 -4791 -1782 1663 -4805 -2580 5396 1164 -3992 1753 607 -5526 1119 6941
420 6941 -437 -1976 4571 -1413 -6341 5177 6887 -3476 996 5610 -7107 -6312 8634 1558
434 1558 -6554 6586 2123 -14213 -527 9464 -6953 -1956 11437 -7560 -13016 8808 2411
$$ packed form
329I738j1876k092J3160q739n757J2506n016q473J1372k469r276R491L41r966
343g056P639K399r787N993M847r826M012P118r614J234R054p829k118J0490n759
358G97m978R528k932p368Q804L07q408N767L108q994K926O189p596J17O557n659
374a835l014O607j388m834N393J337o179K170M068l416p23N125j635m419L184
389D41K404l843R72N024l838m051M555M71n018L570L910o599j599N661l477l436
405d853P767L85q090L009L445o468K225P976m232n156N745j146o133O645N822
420F941p378j539O547n984m928J1518J710j0363M472M614j2717P95J4946p076
434A558q112J3140m463j6336J3686R991j6417M997J3393j8997n456K1824o397
$$ plain form
447 2411 -9269 10651 8376 -14794 -1725 10154 -7796 -71 17612 -2508 -11640 7397 397
460 397 -9883 10309 11005 -10013 -3565 5109 -9227 -4341 12631 2805 -8171 429 -1201 -10037
474 -10037 58 11046 1641 -5488 1612 -1877 -9750 2850 13811 -39 -4541 6279 -4732
487 -4732 -12810 10058 13240 -7468 2276 8689 -17207 -9178 18319 357 -8876 15218 -2170
500 -2170 -25318 6391 14030 -12863 5814 18166 -19506 -15126 17084 -2559 -8979 22654 4767
513 4767 -24252 3107 9158 -13742 7821 21834 -10388 -12291 8148 -5881 -8507 17518 9437
526 9437 -12065 -2127 697 -11528 215 14995 3148 -7242 -1553 -3274 -10163 1658 14935
539 14935 3030 -7938 1552 -2639 -14201 5701 19079 -4515 -5541 10099 -10656 -16176 18680
$$ packed form
447B411j1680J9920k275k3170J3069J1879j7950P725J7683k0120r132J9037p000
460C97j0280K0192O96k1018O448Q674j4336M886J6972r826j0976Q600j630q836
474a0037J0095J0988r405p129P100l489p873J2600J0961j3850m502J0820j1011
487d732q078K2868L182k0708R744O413k5896Q029K7497j7962r233K4094j7388
500b170k3148L1709P639k6893J8677J2352l7672M380L2210j9643o420L1633j7887
513D767k9019K7359O051k2900K1563J4013l2222j903K0439j4029k626K6025q081
526I437k1502R938K824j2225J1743J4780j1847j0390N689j721o889J1821J3277
539A4935j1905j0968R490m191j1562J9902J3378k3594j026J5640k0755n520L4856
$$ plain form
552 18680 12655 -12845 8303 8374 -25227 -4013 23360 -5952 -5476 20040 -10606 -25589 14048
565 14048 8532 -14800 14079 12330 -26141 -6845 15505 -10571 -1285 24161 -5958 -19743 9315
578 9315 1779 -12292 15332 15620 -13607 -5067 6650 -8330 -2674 16364 5367 -9109 -2250
591 -2250 -969 -7860 -81 11200 4079 -8138 -4183 -120 -8756 -1600 14997 2071 -10602 3675
605 3675 -573 -14230 7809 17229 -8097 -2679 11334 -12681 -10613 20453 4034 -11676 13088
618 13088 1408 -23407 6062 16051 -13005 2039 16496 -18051 -14224 17073 -2353 -11262 17051
631 17051 2648 -21457 3615 9816 -11409 4533 15932 -9095 -8591 8177 -2484 -4644 11737
644 11737 5125 -7364 -1007 395 -3798 1961 6344 1658 -3224 -3637 -1426 -1670 -1336 5332 3805
$$ packed form
552A8680o025k5500K1148P1l3601K1214K7373k9312M76K5516l0646j4983L9637
565A4048n516k3332K8879j749l8471J9296K2350k6076R286K5446l0119j3785K9058
578I315p536j4071K7624K88k9227Q540J1717j4980N656J9038j0997j4476O859
591b250J281o891P779J1281p121j2217L955M063q636P156J6597j2926j2673J4277
605C675m248j3657K2039R420k5326N418J4013k4015K068L1066j6419j5710K4764
618A3088j1680k4815K9469R989k9056J5044J4457l4547L827L1297j9426q909K8313
631A7051j4403k4105K5072O201k1225J5942J1399k5027N04J6768j0661k160J6381
644A1737o612j2489O357J402m193N759M383m686m882m13K211k44L34O668j527
$$ plain form
659 3805 -7042 -2640 2761 -6434 -620 11503 -2257 -7700 7139 -1563 -10764 10325 9123 -10637
673 -10637 2837 8761 -12901 -2578 16066 -4564 -7046 12722 -3450 -14561 9971 5932 -11274
686 -11274 5825 7614 -13939 -2366 10016 -6625 -2731 10664 -4655 -8606 6675 250 -5638
699 -5638 6667 3663 -6579 999 2598 -3606 1944 4675 -1235 -310 372 -1855 663 1574 256
714 256 1884 -658 -3587 1466 457 -3785 3065 2474 -6417 50 4039 -5679 -739 7284 -4025
729 -4025 -4496 6521 -2070 -5878 7582 2424 -6766 4662 4210 -7571 2391 7269 -5568 -624
743 -624 6510 -4749 -3748 7041 -2098 -4690 5338 -527 -6256 2820 1534 -5790 1976 2472 -4993
758 -4993 183 2842 -3078 187 3169 -1898 -701 2960 -1405 -80 3404 -731 -481 3029 -1330
$$ packed form
659C805j0847M402N401r195N814J2123j3760n443J4839q702r201K1089j202j9760
673a0637J3474N924k1662J0323J8644k0630k482J9768j6172j1111K4532m039j7206
686a1274J7099J789k1553J1573J2382j6641L894J3395j5319l951J5281o425n888
699e638J2305l004j0242P578J599o204N550K731n910R25O82k227K518R11j318
714B56J628k542k929N053j009m242O850n91q891O467L989r718M940Q023j1309
729d025m71J1017q591l808J3460n158r190J1428m52j1781R962M878j2837M944
743f24P134j1259J001J0789r139k592J0028n865n729R076j286p324P766M96p465
758d993N176K659n920L265K982n067J197L661m365J325L484m135K50L510m359
$$ plain form
773 -1330 -1049 3265 -966 -2041 2757 -948 -3367 2177 -205 -3939 1881 731 -4068 788 1956
788 1956 -3777 244 3139 -2792 -561 3545 -1829 -1380 4273 -827 -1936 3675 262 -2636 3064
803 3064 1019 -3056 1580 1547 -3055 488 1543 -2839 -104 1887 -2592 -1073 2161 -2213 -1359 1997
819 1997 -1370 -1681 2137 -517 -1527 2070 412 -1589 1716 1118 -1786 1634 1478 -1684 1038 1545
835 1545 -1618 217 1442 -1400 -335 1460 -1311 -1127 1337 -1090 -1373 1020 -835 -1595 1265 -279
851 -279 -1643 1038 411 -1600 991 1231 -1219 618 1401 -1004 284 1918 -480 -299 1647 -203
867 -203 -1029 1148 76 -1044 429 624 -1549 -145 632 -1244 -512 367 -571 -837 75 -59 -760 -9
885 -9 651 -225 -613 518 563 -222 642 1181 -389 137 1252 125 -464 1110 874 -1303 468 696 -880
$$ packed form
773a330K81M314m231j075M798l705k419N544k382l734N820j150m799M856J168
788A956n733M021K895n931K231M106n374M49N653n100j109N611l413k898N700
803C064k045m075M636l3m602L543J055m382K735J991m479J519L234m374Q54L356
819A997l367l11L818k654j010L597j658k001L305n98k904L420j56l162K722N07
835A545l163J835J225k842J065J795k771J84K464k427k83K393j855p60K860j544
851b79j364K681o27k011K591K40k450J837P83k405J288J634k398J81J946j850
867b03q26K177j072j120J473J95k173J404P77j876P32Q79r38k66R12j34p01P51
885iO60q76l88J131M5p85Q64N39j570N26J115j127n89J574k36k177J771K28j576
$$ plain form
904 -880 -533 1455 -814 -1560 395 -151 -1721 436 942 -1437 -886 1054 -938 -1019 1806 1117 -1401
921 -1401 598 1423 -1501 -206 3020 140 -1201 1930 273 -2809 1064 2865 -2133 -433 2219
936 2219 -2839 -3073 2946 135 -3357 2324 1052 -4738 203 3034 -2764 -475 4157 -1912 -3659
951 -3659 3240 799 -2643 3379 2540 -3980 -117 3487 -2198 -613 4771 -497 -3459 1435 533 -2906
967 -2906 1295 2702 -1877 -2160 804 -1258 -2365 1758 2271 -2283 -1228 1661 -1946 -2350 3862 2190
983 2190 -3390 1116 2267 -4364 -414 6229 -997 -3109 4365 -860 -5810 3983 4559 -4870 1056
998 1056 4441 -6442 -3191 7017 -1469 -4144 5978 -623 -8231 3012 3770 -5435 2156 5892
1012 5892 -5537 -3779 5405 -977 -3010 6135 1416 -5641 1128 2674 -3134 1071 5250 -1582 -3475
$$ packed form
904h80L47J988k269p46J955n46j570K157N06k379N51J940j992q1K825o89k518
921a401J999Q25k924J295L226k880j341L131j657l082L873J801m998J700K652
936B219n058k34O019k811l492N681j272n790M941K831n798K289M632o069j747
951c659O899k441l442O022q39o520L863L604n685J585N384n268k962M894r02l439
967b906M201J407m579k83K964k062j107M123N13m554J055K889l607m04O212j672
983B190n580M506J151o631L950O643p226k112P474n225m950R793N76r429N926
998A056L385j0883L251J0208q486k675J0122o601p608J1243P58r205P591L736
1012E892j1429J758R184o382k033R145m719p057O769J546n808M205M179o832j893
$$ plain form
1027 -3475 1351 -186 -2697 2208 3449 -2394 -2874 1207 -1314 -2982 3035 3474 -3685 -1970 2917
1042 2917 -2998 -2636 6642 1801 -5070 2636 2386 -6592 1648 8170 -3885 -2687 6457 -3938 -6593
1057 -6593 7716 2526 -6588 3893 3469 -9380 -443 7531 -4382 -2276 7202 -3709 -7740 5517
1071 5517 1866 -5522 4554 3791 -7168 -866 4674 -2495 -454 6130 -631 -4665 1571 1188 -2454
1086 -2454 2052 3849 -1955 -2975 773 -11 -1888 1700 3185 -2309 -3293 1782 -668 -3506 3662
1101 3662 3690 -5083 -1391 4006 -4269 -2076 7876 -222 -6132 4776 1104 -7378 4498 6595 -6017
1116 -6017 -51 6168 -5896 -3475 8361 -967 -5326 5690 136 -8118 3100 4810 -5469 849
1130 849 5145 -5512 -2981 5127 -1039 -3054 4689 184 -5001 1145 2368 -2122 1331 3305 -1372
$$ packed form
1027c475M826j537k511M905J241n843m80M081k521j668O017M39p159J715M887
1042B917n915L62R278m841o871P706k50q978Q240O522j2055J198R144j0395k655
1057f593J4309n190r114J0481m24j2849Q937P974j1913K106R478j0911m031J3257
1071E517l651p388J0076p63j0959O302N540p169K041O584o761m034O236l83l642
1086b454M506J797n804j020L748p84j877L588J485n494r84N075k450k838P168
1101C662K8q773L692N397q275K193R952q098n910J0908l672q482J1876K097j2612
1116f017N966O219j2064K421J1836r328m359J1016n554q254J1218J710j0279O318
1130H49M296j0657K531Q108o166k015P743m505n185O146J223m490L453J974m677
$$ plain form
1145 -1372 -1897 1030 684 -317 1001 1711 -308 -2467 409 1644 -1766 54 3091 -2284 -3446 2472
1161 2472 -74 -3612 3734 2119 -5506 438 3335 -4761 -359 6378 -2797 -3456 5360 -988 -4526
1176 -4526 5498 2660 -5339 2518 3245 -5748 693 5667 -3507 -1993 4617 -2782 -4388 3935 394
1191 394 -3673 2600 1156 -4160 511 2439 -1842 169 2186 -1568 -796 1033 -85 299 1287 -155
1207 -155 249 -30 -986 1085 908 -746 1079 859 -2214 342 1887 -1940 -218 2919 -2214 -2168 2909
1224 2909 -1336 -2830 3188 380 -3985 1948 1778 -3787 1526 3467 -3259 -580 3697 -2178 -1515
1239 -1515 4165 -534 -2433 3106 184 -3034 2202 1490 -2935 1100 1600 -2721 -179 1783 -1891
1254 -1891 -341 1554 -1573 -839 1448 -904 -820 1529 -573 -1014 1312 -437 -818 1817 105 -1026
$$ packed form
1145a372n25K927l46j001J318P10k019k159K876J235l410J820L037n375j162N918
1161B472k546l538P346j615p625N944K897q096M402O737r175o59Q816o348l538
1176d526J0024k838p999P857P27q993O441M974r174J514O610p399j606Q323l541
1191C94m067O273j444n316M671J928m281K011K017l754P72J829j118L84R88j442
1207a55M04k79r56K071j77j654J825k20l073K556J545l827J722L137n133M6N077
1224B909m245j494O018k808m365N933j70n565N313J941o726K679M277n875O63
1239a515N680m699j899N539k922l218N236p12m425M035N00m321K542J962l674
1254a891J550J895l127P34K287k352Q4K349k102m41K326j749l81K635j712j131
$$ plain form
1270 -1026 1469 -87 -1183 1588 609 -1576 1399 883 -2320 890 1389 -2241 443 1755 -1989 -688
1286 -688 2033 -1435 -1231 1999 -816 -2129 2002 -143 -1993 1806 837 -1751 1292 1392 -1836 713
1302 713 1825 -1330 11 2007 -1294 -263 1639 -1047 -718 1356 -942 -1265 1331 -227 -1371 848
1318 848 -153 -1648 819 345 -1732 604 792 -1354 658 1154 -1275 262 1530 -976 -77 1691
1334 1691 -578 -311 1581 -334 -873 1345 -348 -1358 934 152 -1499 728 306 -1603 395 728
1350 728 -1380 -99 975 -1049 24 1328 -959 -455 1284 -504 -721 1316 -201 -562 1088 502
1366 502 -824 974 615 -795 615 685 -913 -82 656 -653 -399 471 -565 -506 333 -626 -307 417
1384 417 -314 -397 433 -235 -260 672 117 -66 717 -38 -398 1262 160 -512 964 320 -832 208 480
$$ packed form
1270a026K495j556j096K771r79k185K975n16l203L210M99l630K684J312l744J301
1286f88K721l468K04L230k815j313M131k145j850L799r69k588L043J00l228K549
1302G13J112l155J341J996l301J031J902k686L29K074k298l23K596j558j144K219
1318H48j001j495K467m74k077K336J88k146K012M96k429J537J268k506Q99J768
1334A691k269K67J892j915n39K218j693j010K292p82j651K227m22j909J998L33
1350G28k108J281J074k024J073J304k287N04J739j788k17K037j517l61J650n86
1366E02j326J798l59j410J410P0j598Q31P38j309K54Q70j036N9Q39r59L19P24
1384D17p31q3Q30o68k5R32n55j83P83p55l60J660j102o72J476o44j152J040K72
$$ plain form
1403 480 -1019 17 835 -765 -496 585 -579 -881 1075 62 -1345 488 98 -1265 335 904
1419 904 -1020 -186 1138 -649 -602 1085 302 -967 784 666 -962 295 1035 -195 -89 766 -227
1436 -227 -826 488 723 -681 -288 739 -808 -704 784 29 -1141 616 640 -1410 -133 1095 -329
1453 -329 -496 1438 68 -1144 574 1049 -869 682 1367 -643 -523 1453 116 -1116 1051 315
1469 315 -1399 68 1066 -1221 -370 1578 -551 -1459 612 215 -1495 741 1256 -1375 -612 1631 -855
1486 -855 -943 1904 860 -1679 995 1255 -2034 -43 2238 -1052 -1007 2122 -500 -2318 1496 890 -2039
1503 -2039 484 1388 -2295 -917 2005 -891 -1272 1592 -7 -2135 758 1519 -1179 32 1847 -1102
1519 -1102 -1401 1500 579 -1016 1498 1260 -1543 -540 1179 -553 -980 1813 341 -1929 23 1198
$$ packed form
1403D80j499J036Q18j600K69J081j164l02J956j013j407J833l90j363J600N69
1419I04j924Q34J324j787M7J687p83j269J751j18j628J257P40j230J06Q55r93
1436b27n99J314K35j404L93J027j547J04J488p55j170J757K4k050J277J228j424
1453c29j67J934j370j212J718M75j918J551O85k010J20J976j337j232K167p36
1469C15j714J467R98k287Q51J948k129r08K071l97j710K236N15k631P63K243k486
1486h55q8K847j044k539K674K60l289J991K281l290M5L129k622j818L814o06k929
1503b039K523R04l683J378K922k896l81K864j599k128K893P61k698J211J815k949
1519a102k99K901r21j595K514k38k803J003J719j732m27K793j472k270J952J175
$$ plain form
1535 1198 -1466 -499 2071 -893 -2288 1537 291 -2008 1635 2227 -2092 -473 2289 -1495 -1223 3147
1551 3147 400 -2456 1859 922 -3025 1341 2925 -2070 -752 2509 -1646 -2147 2621 237 -2564
1566 -2564 1643 1003 -3105 222 2051 -1787 -859 2147 -749 -2115 1298 1013 -1184 868 1303 -1320
1582 -1320 -571 1546 354 -554 1389 833 -1446 -708 1354 -414 -646 1901 10 -2326 361 1306
1598 1306 -1590 61 2294 -1579 -2309 2007 -152 -2273 2187 1493 -2837 190 2621 -2378 -401
1613 -401 3643 -983 -1891 2567 -303 -2847 2239 2112 -2584 394 1961 -2650 -1069 2799 -634 -1680
1629 -1680 1825 -74 -2377 868 1201 -1310 53 1201 -1095 -765 1313 430 -821 683 557 -972
1645 -972 -509 1356 696 -567 719 701 -1159 -324 1353 -348 -935 1587 87 -2285 838 1137 -1942
$$ packed form
1535A198k664R67K570k964j395L825j246k299L643N92m319J619K762l784K72M370
1551C147k747k856M315r37l947M366J584m995J318L261m155n01M768k384k801
1566b564M207o40m108L327J829l838R28L006k896j366L413k85k197K052M35k623
1582a320P49K117j192r08J943n56k279P38K062j768k32K547j891k336K687R45
1598A306k896J651K233l873p30M316k159k121M460o94m330L027K431m999J977
1613d01M044m626r08M458k870k544N086j27m696K978J567m611J581L868l433j046
1629a680L505j899k303L245L33k511J363J148k296L30K078q83j251J504j26j529
1645i72M63J865o60j263J286j8j860Q35J677j701n87K522j500k372L123K99l079
$$ plain form
1662 -1942 234 2057 -2290 -1348 2178 -856 -1511 2631 354 -2590 1015 1373 -2244 656 2617 -1609
1678 -1609 -689 2012 -981 -1165 2175 250 -1500 1041 433 -1965 278 1199 -1309 -114 1018 -1048
1694 -1048 -836 688 125 -772 341 61 -857 -407 98 459 75 103 398 -26 -497 816 809 -538 358
1713 358 997 -786 -610 1745 -404 -867 1229 92 -1665 1251 444 -1861 429 946 -1799 -200
1729 -200 1413 -1336 -491 1814 -795 -1488 1599 -206 -1377 1295 893 -1351 787 1019 -1098 -148
1745 -148 1420 -511 -510 1005 -521 -867 642 -267 -550 637 -222 -674 210 -251 -506 384 -112 -510 416
1764 416 24 -507 708 152 -240 655 361 -604 657 871 -509 237 891 -990 -233 1168 -519 -563
1782 -563 1159 -752 -965 870 -384 -1083 704 314 -1103 612 372 -1134 203 870 -716 151 1162
$$ packed form
1662a942K176J823m347R42L526l034o55M142k277k944L605L58l617K900J961m226
1678a609R20K701k993j84L340j925j750K541o08k398K243R21k508J195J132k066
1694a048K12J524n63q97J113k80r18M50N05L61l84K8K95m24m71J313pj347Q96
1713C58O39j783J76K355k149m63K096j137j757K916q07k305K290N17k745J599
1729b00J613k749Q45K305k609o93L087j805j171K672m02k244K138K32k117R50
1745a48J568j931JJ515j526l46J509r09k83J187q59m52Q84m61k55Q90m96l98R26
1764D16l92n31J215n56l92Q95k94r65J261K14j380P46O54j881P57J401j687m4
1782e63J722j911k13J835j254o99J787l90j417J715k40j506J337O67j586Q67J011
$$ plain form
1799 1162 -608 45 1036 -84 -175 997 -329 -541 791 -61 -528 726 -60 -749 467 391 -522 -104
1817 -104 126 -828 -227 544 -884 -147 401 -574 -332 596 -279 -281 596 -408 -44 719 76 -363 467 236
1837 236 -320 446 313 -696 380 407 -553 -6 515 -798 -253 743 -638 -591 530 -670 -615 484 -440
1856 -440 -363 536 216 -441 461 555 -711 471 556 -315 107 479 -247 34 544 -502 5 568 -236 -110
1876 -110 315 -274 -138 232 -158 -290 498 -198 -536 -79 77 -464 156 -52 -645 348 385 -252 196 682
1896 682 -265 340 565 -231 11 723 -146 -406 427 -232 -640 413 209 -769 133 144 -701 -186 426 -621
1916 -621 -175 495 -341 -297 273 78 -345 513 121 62 184 303 -304 -122 482 105 -5 232 68 -318 2
1937 2 48 29 -223 89 35 -395 -288 196 -124 -533 242 -222 -356 350 217 -501 -26 827 -446 -410 687
$$ packed form
1799A162j770O53R91j120r1J172j326k12J332q52m67J254p86o89J216p6r13M18
1817a04K30r54O01P71j428P37N48r75K42R28q75kQ77j004L64P63o43m39Q30k31
1837B36n56P66j33j009J076K7r60N47N21j313N45R96j381M7J121j200N5J099r24
1856d40P7Q99l20o57R02R4j266J182Q5q71M22L72p26K81N10j046N07N63q04J26
1876a10M25n89J36L70l90j32P88o96l38M57J56n41O20k08n93R93L7o37M48M86
1896F82r47O05K25p96K42P12q69k60Q33o59m08J053k04r78R02J1q45N15O12j047
1916f21M46O70q36M4N70j95m23Q58l92n9J22J19o07J82O04l77j10K37j64l86L20
1937BM6j9k52L12n4m30J07M84l20m09P75m64j34P06j33p18M75Q53j273L6J097
$$ plain form
1958 687 -131 -349 668 225 -716 210 788 -467 -184 842 -342 -428 728 -93 -749 280 461 -712
1976 -712 -160 469 -423 -366 697 -73 -875 313 336 -479 226 814 -437 -235 603 23 -203 858 484
1995 484 -637 511 699 -812 -29 629 -394 -502 587 -163 -1114 347 358 -657 176 595 -441 -505
2013 -505 748 107 -627 493 470 -453 22 858 -212 -408 982 74 -774 614 667 -582 -95 900 -590
2032 -590 -598 681 78 -762 679 285 -1355 168 866 -797 -248 1177 -216 -753 853 270 -1003 555
2050 555 743 -991 131 962 -605 -414 1403 142 -845 845 530 -855 283 993 -789 -337 592
2067 592 -427 -745 626 -14 -1019 125 518 -728 -424 878 139 -474 334 138 -815 221 720 -191
2085 -191 -238 741 81 -506 425 690 -691 -132 785 -698 -562 697 -197 -839 533 314 -1305 102
$$ packed form
1958F87q18k18J017m43r41R26N78j255K83J026j184q6J156q21o56J029J81j173
1976g12N52O29q92N7J063p70q02J188K3q15P05N88j251K02Q38n80k26J061l74
1995D84j121J148J88j511P83O58j023j08J089p50r51J461J1j015Q33M19j036o4
2013e05J253o41p34J120k3r23M75Q36j070j96J390r08q48J388N3j249M87R95j490
2032e90qJ279o03q40J441l94j640J523O98j663N49J425j393n37J606n83j273J558
2050E55J88j734J122Q31j567J91J817j261r87J690l15j385J138P10j782M52R29
2067E92j019l18J371o40j005J144L93j246L04J302p39o13Q08j96r53J036M99r11
2085a91m7R79o60n87R31K65j381N59R17j483J36J259q94o42J372k19j619J407
$$ plain form
2103 102 698 -838 42 1258 -863 -807 1328 49 -762 1220 666 -1021 317 830 -763 -109 988
2120 988 -191 -653 670 -161 -692 705 617 -765 142 316 -598 -121 665 68 -427 204 98 -481 -181
2139 -181 762 24 -207 369 2 -517 426 673 -49 -220 642 50 -885 737 544 -767 436 522 -831
2158 -831 -550 776 -489 -748 771 -12 -1106 337 422 -930 193 1008 -841 -266 830 -369 -163
2175 -163 1241 -6 -900 597 379 -811 662 762 -426 162 582 -221 -275 601 147 -429 169 -175
2193 -175 -319 95 200 -29 -330 -284 111 -132 -189 63 263 -121 -2 295 -315 -38 485 -226 -140 711 1
2214 1 -491 682 218 -547 442 222 -706 141 356 -582 -274 683 -669 -724 755 -15 -509 560 262 -717
2234 -717 43 410 -529 76 665 -589 32 570 -139 -169 359 -116 -128 550 13 -189 129 -3 -255 115
$$ packed form
2103A02N96j536Q80J216k121N6K135j279q11J982n54j687J338N13j593O54J097
2120I88j179m62J323q31n31J397q8j382R07J74r14M77P86n97m95O31j06n79L00
2139a81R43p38k31N76l67n19R43K47p22j71Q62n92r35J622j93j311J203Q6j353
2158h31K81J326j265k59J519p83j094J443Q5j352J123Q15j849N75J096j199K06
2175a63J404j247q94J497k18j190J473J00j188N88M20q03n4Q76m54n76N98l44
2193a75j44M14J05k29l01M6L95k43n7K52K00l84J19K97o10K77N23p11Q6Q51p10
2214Am92J173m64p65R89k20r28Q47K15r38L08R57j352n5J479p70m94J069k98r79
2234g17P60L67r39O05N89j254O21N38p09l0N28m75j2O78n37k02L18j32k52L70
$$ plain form
2254 115 -158 -502 -61 128 -394 87 -107 -228 233 -182 -271 459 431 -455 202 301 -431 95 525 -294 -12
2275 -12 553 -344 -145 528 -88 -378 569 64 -341 565 272 -755 -70 458 -719 68 628 -265 -123 420
2295 420 -445 -279 432 -192 -218 502 166 -274 461 101 -316 -116 466 55 132 453 -329 323 393 -265 25
2316 25 173 -266 -112 248 -239 -158 258 -228 -257 354 86 -472 294 90 -121 202 315 -642 113 466 -289
2337 -289 282 236 -341 200 368 -87 -163 315 -295 -137 217 -34 -412 64 25 -89 146 162 -211 116 157 -151
2359 -151 326 300 -405 43 87 -139 86 236 -38 -70 454 66 -175 238 25 103 224 92 -338 32 186
2380 186 -349 -132 17 -264 -62 229 -187 -218 56 -407 -364 347 0 -31 344 101 -171 496 142 -377 183
2401 183 58 -450 250 -198 -99 261 344 -139 -88 140 -206 -154 189 -74 -402 117 -327 -259 165 -79 -344 -36
$$ packed form
2254A15k73l44M41J89n22M81j94j21M61m15q9P30k8q86O57R9p32N26M30q19K82
2275a2N65q97J99O73o16k90R47n05m05R06k93j027O85N28j177P87N60q93J42N43
2295D20q65J66P11o24k6P20l36m40P35l60m17K00N82m11P7L21p82O52P0o58K90
2316B5J48m39J54L60m87Q1M16m86k9O11k68n58P66k04k11L23J13r57P55L53p55
2337b89N71m6n77N41J68m55p6M78o10J58L54k51l78M76l9j14K35J6l73L27M1l08
2359a51M77k6p05M48M4k26K25J50k74l2N24l88k41M13k13P8J21j32m30L70J54
2380A86n35K17J49k81K02K91m16l1K74m63M3P11l47l1L75k43k72O67l54n19N60
2401A83j25n08P00m48R9L60Q3m83N1K28l46N2L43k63l28N19m44O8M24k44k65L08
$$ plain form
2423 -36 91 88 108 265 -146 -145 305 -27 257 -9 118 108 -153 -152 -9 -23 -65 11 -24 -352 -92 -79 -183 -266 78
2448 78 -104 -174 480 15 -158 422 -42 -382 400 224 -355 201 354 -304 -71 592 -219 -501 497 -88 -417
2469 -417 -135 308 -220 -171 302 -280 -142 335 -96 -279 320 170 -264 71 147 -316 -60 236 -41 -153 196
2490 196 358 -45 245 313 -226 33 174 -15 -249 240 197 -364 75 38 104 -332 196 -84 -524 69 -155
2511 -155 -279 290 221 -551 -111 511 -407 -140 393 -24 -364 654 367 -251 -50 316 -453 -86 566 -72
2531 -72 -552 349 765 -436 45 357 -444 -231 449 -28 -234 233 30 -386 108 128 -279 -60 713 -383
2551 -383 -493 461 -97 -459 362 483 -348 -14 513 -132 -227 475 201 -388 354 162 -507 -154 236 -342
2571 -342 -311 130 8 -473 723 250 -487 110 281 -260 -341 536 293 -293 387 146 -510 204 759 -129
$$ packed form
2423c6J27lK0J57m11JM50l32K84k66J27j0k61JJ43j4m2P6l5l28K60J3j04q3L44
2448G8j82p0O54m65j73N80m64l40P82j76n79N56J53o58K33O63q11k82R98n85l29
2469d17K82M43n28M9M73n82J38M77m31j83N99j50m34L35P6m63K56K96k77j12L49
2490A96J62m03K90O8n39K59J41j89k34M89m3n61M39l7O6m36N28k80m40N93k24
2511a55j24N69o9p72M40O22r18K67N33m17l40J018k87o18K01L66p69L67O52o38
2531g2m80R01M16j201M81L12q01K13O80m77k06M67k03m16M94K0m07K19P73j096
2551c83j10R54n58l62Q21J21q31L34N27o45r5P02k74n89P42j92o69L53L90n78
2571c42L1M41j22m81J196m73p37N97J71n41q1Q77k43n86O80k41o56P14N55q88
$$ plain form
2591 -129 -215 418 -306 -399 504 286 -408 560 162 -663 -425 319 -323 -289 470 -119 -526 365 505 -355 129
2612 129 551 -433 -334 632 -188 -277 534 71 -530 116 363 -264 -294 713 -224 -433 147 150 -248 -36 273
2633 273 -223 -31 19 -232 -326 79 -113 -227 213 -47 -253 96 398 -55 -236 271 114 -399 118 443 -229
2654 -229 -173 526 -204 -559 511 -167 -427 351 329 -244 -136 204 -375 -170 296 -173 -349 239 -60 -361
2674 -361 -94 339 -513 79 274 -158 -129 565 219 -344 315 -40 -87 207 328 -128 -61 118 -50 -178 -39
2695 -39 -145 -372 -312 -25 -94 -110 -9 190 -345 -249 211 -148 -196 1 67 -291 430 176 -180 389 399 -50 -241
2718 -241 372 -194 -194 438 -115 -367 143 176 -366 299 196 -442 -137 386 -174 -146 194 -59 -261 309 -108
2739 -108 -177 142 250 88 38 285 183 -10 -20 -84 26 212 148 199 8 62 -141 -98 -130 -13 -41 -171 309
$$ packed form
2591a29q6O33p24r3R03k18o94R68l98q25K38P44o42L4P59n89m07Q91J40q60M84
2612A29M22r84R9R66q20q9Q11m63o01O46K47o27l0J007r37k09N80Ll98K12L09
2633B73m96J92N0k51r4M05j92j14M40k60k06L49L02m53j81N07j57n13N17L25o72
2654b29N6O99p30l55J070o78k60P78k2n73J08L40n79K05M66m69j76N88k99l01
2674c61K67M33q52N92J95m32K9O94l46n63O59l55m7K94J21m56O7J79j68j28J39
2695c9j06k27O0K87o9j6J01J99n35R6M60l59m8J97O6l58P21k54l56N69J0m49j91
2718b41O13n66%O32n53k52N10L3n42O65j03o38L05N23n60K8L40k53k02N70m17
2739a08o9L19J08j62n0K47j02j93j0o4J10J86o4N1j91N4k03M3l2J17k8j30M80
$$ plain form
2762 309 -62 -156 -29 261 -195 213 392 -31 -34 35 19 -285 420 199 -269 347 171 -117 -237 303 -437 -68
2784 -68 375 -258 -77 149 -34 -289 -104 -402 -89 194 -81 -163 152 -154 -253 57 218 -97 97 7 -125
2805 -125 -23 361 58 16 288 -88 226 377 -75 36 -3 -198 -1 35 -190 -252 117 10 -233 -30 -20 -76
2827 -76 121 150 -208 -18 394 -142 -75 12 156 -140 180 152 -227 178 -146 -197 299 -96 -76 49 -43 -101 -98 310
2851 310 -291 -204 197 -143 19 112 -223 -265 225 -208 -309 200 -139 -342 39 -156 -186 168 -149 -173 257 -141
2873 -141 -125 57 65 -68 144 -113 -413 22 181 82 -43 346 -160 -136 157 156 24 36 175 -62 -2 174 54
2896 54 -84 117 -231 125 175 -262 -4 331 -66 -123 43 -237 -94 327 -358 -193 -23 -153 12 -25 -119 -76
2918 -76 5 133 -24 -137 204 46 126 -93 -137 169 4 -70 -153 451 -81 209 224 5 -120 379 -218 -83
$$ packed form
2762C09l71r4J27K90m56M08J79m23lO9j6l04P05k21m68O16j76k88j20N40p40L69
2784f8M43o33J81K26j83k55J85k98L13K83k75q2L15l06r9L10J61l15J94r0j32
2805a25J02L84l03m2K72l76L14J51m52J11l9j95J97L6k25o2L69j07k43K03J0n6
2827g6J97K9l58J90M12n36O7Q7J44k96L20k8l79M05l24n1M96l95K0J25r2n8LM08
2851C10o01Q7M01l40J62R3l35m2M90m33j01N09l39k03L81j95l0L54l17k4M30l98
2873a41J6J82Qj33K12k57l00M35J59r9j25L89n06K4K93jj32J2J39k37O0J76j20
2896E4j38K01l48L56N0m37K58L35l97n7J66k80J43M21o85J65J70j30J65l7r4M3
2918g6Q1J28j57j13L41j58Q0k19m4L06j65p4q3O04n32K90J5k19j25M99n97J35
$$ plain form
2940 -83 269 -15 -105 28 57 -134 255 321 -273 -299 148 -360 67 48 -192 -283 198 -311 -118 27 5 -24 164
2963 164 266 -68 190 446 -61 330 274 -45 -180 44 24 -181 200 112 -143 8 371 -90 -269 241 36
2984 36 31 -54 -18 -155 -58 -207 -123 -269 211 -55 3 -114 -201 261 -53 209 -115 -93 226 219 -49 257 351 -170
3008 -170 -56 380 -277 -90 183 -253 -174 98 -39 -271 54 120 -191 -88 216 -1 -125 110 72 -279 69
3029 69 164 -61 30 154 -54 -251 86 -62 -395 -218 106 -100 -24 210 18 -220 -136 -183 -429 95 -19 -203
3051 -203 -337 39 -193 -205 299 -51 -185 81 230 -46 -125 173 -163 -298 114 175 -110 22 215 -363 -83
3072 -83 270 -190 -368 451 18 -346 313 46 -96 70 106 -181 218 111 58 -79 197 271 43 180 444
3093 444 -213 -66 264 131 74 -38 43 -223 67 63 -247 -119 -34 -254 -447 0 -175 -273 399 171 -308 -279
$$ packed form
2940h3L52k84r0J33K9j91L89O6n94k6M47n08M27j9k40r1M81n09J93J45k2k9J88
2963A64J02l34K58K56n07L91n6l19j35K24k0k05L81q8k55J51L63m61j79N10k05
2984C6nq5L6j37R7j49Q4j46M80k66N8j17q7M62l14K62l24K2L19pk68L06R4n21
3008a70J14M36o57J87K73m36P9K72j37k32L25O6l11J03L04k17j24K35l8l51L48
3029F9R5k25R1J24k08j97L37j48l33J77L24k06P6K34j92k38Q4m7k46N24j14j84
3051b03j34L76k32j2N04l50j34K66J49k76p9K98l36j35M12O1k85J32J93n78K80
3072h3L53m60j78Q19m33l64O59k67j42J66L6k87L99j07n3j37K76P4k28J37K64
3093D44o57J47L30j33n7j12Q1k66K90ml10J28Q5k20j93M47j75r8O72k28m79K9
$$ plain form
3115 -279 -105 -48 -84 475 -58 6 274 -32 -443 66 9 -9 -46 110 -245 13 85 101 -231 103 43 -472 150
3138 150 128 -121 -288 296 194 -129 93 204 3 -42 202 149 -163 260 142 -91 258 217 -369 117 155 81
3160 81 -46 215 -168 -213 16 -74 -132 100 131 -333 177 49 30 -80 119 -201 -189 118 -273 -34 220 284 1
3183 1 141 22 57 -119 262 -29 -35 -64 175 -2 -141 -20 80 -51 29 95 -353 52 142 242 -91 85 -97
3206 -97 -349 -35 131 14 47 86 -193 13 333 410 -331 -3 -123 -35 -2 150 -105 -7 175 -175 -251 -19 -309
3229 -309 -216 65 -102 -121 -157 193 -118 -119 -23 69 -49 131 -93 -138 47 97 -48 87 -103 90 -3 103 259
3252 259 -107 29 -28 93 -349 -301 156 -2 253 166 54 -334 -155 155 -232 -277 138 79 -20 10 44 6 355
3275 355 -94 -195 62 101 121 -74 -26 -196 37 80 89 13 17 -240 133 98 -24 -27 -80 -116 -74 93 90 105 -56 11
$$ packed form
3115b79J74N7l6N59n33O4K68l06m11N09n7j8l7J56l55K58P2J6l32L34o0n15O22
3138A50k2k49j67N84j02l23K22J11k01m5K44n3l12M23j18k33L49m1n86M86L8p4
3160H1j27K61l83m5K29r0n8K32L1m64N10j28j9j10J99l20J2L07l91K39K54O4k83
3183AJ40j19L5j76L81k91ok9K39j77j39J21J00j31Q0O6m48M05R0J00l33J76j82
3206i7k52L14J66j17L3L9k79K06L20P7p41L28j20Q8L3J52k55R8J82l50p6K32k90
3229c09R3K81j67j9l6L50l11jR6R2j18J80k24m5J85N0j45J35j90J93r3J06J56
3252B59l66J36n7J21m42M8M57j58K55q7j12l88J79L10l87m5M15n9r9L0L4l8L49
3275C55m49j01K57L9K0j95M8j70K33M3Rp6Mk57L73l5j22ln3l6M2J67lJ5j61O7
$$ plain form
3301 11 -263 40 42 172 5 37 -166 -99 67 -48 324 -152 109 15 107 -196 -131 97 -197 -17 -14 -222 41
3324 41 74 34 4 60 17 -39 85 94 -192 101 -143 -401 -16 106 92 6 59 -102 -8 235 -72 -79 160 101 -210
3349 -210 152 -39 -21 -109 154 -67 100 40 -4 -71 -207 -320 136 74 -132 -129 121 -121 -287 94 -88 107 -82
3372 -82 79 -139 -184 22 35 489 -199 -114 68 72 6 -45 -88 -63 -42 -49 -71 69 61 116 50 61 -4 -54 -180 70 241
3399 241 126 230 173 142 -199 -63 -142 -9 -29 4 60 -39 -116 64 90 -61 -57 -38 110 53 106 36 -88 243 -113
3424 -113 -138 73 27 232 88 -48 217 -168 46 59 -161 -142 203 98 10 -87 89 -215 -45 197 -261 -3
3446 -3 189 -73 18 12 -14 75 -158 32 -67 100 3 -189 -63 127 -152 -93 -25 119 280 172 61 -380 112 -143
3470 -143 -115 222 -37 -120 147 37 -112 4 -17 -87 93 -48 179 -75 -114 -18 68 -125 -50 -85 -243 42 53
$$ packed form
3301A1k74L03KJ30j67L2k03O7J66j15L72m76K61r4R2l03O5K28k94J80Lk08K63
3324D1L3m0l0N6m3n6J24Rk86K93k44k58L85J22j4q6N3j61R4K43l07pK39n9l11
3349b10L62j91J8q8K63k21J67o0m4o7j36j13M56o2k06LK50k42j66L81j82J95j89
3372h2J61k18m5K06J3M54o88Q5J82Mo6n1m3K5K1pk2J40qN5o6J1o5n0j26K50J71
3399B41j15J04n7l1l41J36p9J33k0L3N6r9p7J80K6j51MJ9J48n7N3p0j24L31l56
3424a13k5K11m6K05j44j36K65l85K14J3k20J9L45j05q8r7J76l04J70K42m58K58
3446cJ92k62R1ok6Q9k33J90r9J67r7j92J26J90k79N9O8J44J61j08j11m41M92k55
3470a43K8L37k59q3K67j10j49J16k1p0J80j41K27k54l9R6Q6j93P5l5j58K85J1
$$ plain form
3493 53 -12 41 170 196 -5 -107 -125 -19 -154 53 -246 -133 -190 63 9 -205 9 61 70 70 54 -225 151 222 -6
3518 -6 -77 163 132 15 193 42 97 211 -112 -34 20 8 -214 8 270 29 155 150 97 -4 23 3 -135 -31
3542 -31 180 -153 -164 -331 175 -71 50 -136 -109 223 33 -127 -35 48 31 20 113 19 -162 400 37 65 -219
3565 -219 72 -188 -139 232 -74 -17 138 66 -262 90 52 -150 -173 60 -318 -89 -162 -119 59 303 247 -133 2
3588 2 92 -285 130 168 195 73 182 52 -78 -41 -66 93 39 223 27 -106 47 -63 -333 -151 -112 2 29
3611 29 -53 -118 -292 -55 -26 -142 44 -26 119 46 108 -1 -17 197 44 -177 96 110 -88 -59 187 -25 90
3634 90 322 -52 -170 293 -92 -221 18 131 -210 -447 9 -117 162 67 -123 126 -20 487 124 154 -2
3655 -2 78 -100 232 56 -34 26 -90 -82 -210 103 -45 48 79 112 236 96 -226 -107 109 -165 -294 -88 128
$$ packed form
3493E3o5N3J29K6k01j02j8J06j35K07k99J13n7K53n4k14K14N2R%j6k79L76P1k28
3518fp1K40l1j17J78j51N5J14l23P8N4j2k22K22K62k41J26nn3j01K7k0j38J04
3542c1K11l33j1j67N06k46J21j86K7L32j90j60R2Q3j7j1R3r4j81N62l63K8k84
3565b19K91k60M9L71l06N7J55p2l28L52l8k02k3K33l78K29p3M3J78K44n6l80J35
3588BR0l77M15L8K7j22J09j30j30L7k5J59n4J84j96j33J53j10k70J82L9J14K7
3611B9q2o5j74K37K9j16J86p0J45p3O2j09j6K14j53k21K73J4j98K9K46k12J15
3634I0K32l74j18M63l85j29K39J13l41k37M56j26K79r5j90K49j46N07l63L0j56
3655bQ0j78L32j76r0O0j16Qj28L13j48R3L1L3J24j40l22J19K16k74j29K06K16
$$ plain form
3678 128 219 -25 110 316 -54 -52 112 133 -135 166 7 146 -104 200 125 9 -83 -104 181 48 -196 149
3700 149 -34 -71 -66 -4 94 48 -176 74 -51 -206 -21 70 -103 241 -66 -157 23 73 -13 -24 -114 -159 122 -47
3724 -47 89 -19 87 -101 14 -108 220 -86 -10 -50 204 -38 -4 -40 -38 -24 -85 199 -94 152 121 -182 -153 23
3748 23 133 124 175 21 -112 136 129 -100 187 -126 55 162 195 -74 -117 63 -36 -11 -179 148 -364 114 33 -361
3772 -361 209 61 -96 166 -75 91 -200 125 126 -2 426 -18 33 313 150 -39 44 10 -101 -245 122 -217
3794 -217 57 -88 -191 237 120 -120 -150 -191 -142 -41 167 133 89 -21 121 211 210 311 -265 83 113 -217 46
3817 46 179 -25 -70 -18 93 -268 128 -147 -78 -57 72 -304 -44 -51 150 56 135 -93 -120 -45 -27 132 -114 50
3841 50 -169 -21 -23 9 129 119 -133 171 21 -10 38 2 88 73 -102 46 -22 141 169 -61 129 -120 -8 -160
$$ packed form
3678A28R1k44J35K06l70KJ64K1k68L01j59J39k50L04p5j16r2k1K85j33k44L45
3700A49j83l7NO2R8m6k24K50j25j55J85R1j73L44l07r1J80N0q6j1r0m5K81j69
3724d7J36j08J06j88J15j22L28l06P6m0K54k42L4l6KJ4o1K84k93K46l1l03K9J76
3748B3J10rN1j54j33K48pk29K87l13J81J07L3k69m3J80r9K5j68L27n12M78q1l94
3772c61N70j48j57K62k41J66k91L25Jj28M28m44N1K80j63j89Q3l4j11j44L67l39
3794b17K74j45j03M28j17k40l0m1M9J01K08l4m4j10J42R0jJ01n76L48L0l30K63
3817D6J33k04m5N2J11l61L96k75O9K1J29l76K60pK01r4P9k28k7P5J8J59k46J64
3841E0k19J48kL2J20j0k52L04j50l1M8l6Q6j5j75J48o8J63K8k30J90k49J12j52
$$ plain form
3865 -160 -94 -287 153 78 -72 144 55 -12 -18 317 58 -150 -48 -3 -35 -54 77 -164 378 -47 106 -146 -96
3888 -96 32 -15 142 24 10 -8 -305 64 27 -98 54 -13 -11 103 175 142 -14 -1 348 192 -46 34 -185 -12
3912 -12 -152 -202 44 -131 -30 -128 -108 -39 -66 15 -230 21 -285 147 198 35 -125 19 234 117 -104 -95 -161 42
3936 42 80 -75 148 176 73 328 -132 74 -22 -136 -9 -91 -162 -69 -188 -196 246 -229 145 -157 -63 -73 45 -111
3960 -111 -15 33 135 83 55 31 -51 75 -135 -52 74 30 94 -4 62 -72 -193 -72 -89 -173 -9 172 250 18 -22
3985 -22 29 -153 -177 90 -10 67 -249 -83 290 -166 -163 -153 45 121 99 -217 16 -117 -89 -87 -37 65 -20 141 105
4010 105 -169 64 101 86 354 402 -78 -47 28 -111 81 183 56 3 156 20 57 142 29 26 -170 45 215
4033 215 158 -81 174 -202 201 -121 57 111 -10 9 38 -116 109 -78 -107 8 -275 -5 195 -9 13 -7
$$ packed form
3865a60O6j93M40p5j50K16q9o7oL35k59k08J02M5l2j9J31k41N42m25J53k52N0
3888i6J28m7J57j18j4j8k97L69l7j25J52o7KJ14P2l3j56J3L49j56k38Q0k19J73
3912a2j40n0K46j75J01r8K0O9k7Q1k45K51l06M32N1j63j60J44K15j17k21Ro6K03
3936D2L8j55K23K8j03K55m60K06r6j14J27q2p1R3j19qM42m75L74l02R4j0J18j56
3960a11R6M8J02n2k8k4q2J26k10Q3J26m4O4r8O6j34j21J21j7q4J64J81P8k32m0
3985b2N1j82k4K67j00P7l16J66L73m56LJ0J98P6k2l16K33j33K8KN0J02q5J61l6
4010A05k74K33L7j5K68M8m80L1P5j39J92J02j27n3J53j36L7Q5j13lj96K15J70
4033B15n7k39K55l76M03l22J78N4j21J9K9j54K25j87k9J15k83K70K00k04K2k0
$$ plain form
4055 -7 -150 -130 -97 201 -191 50 80 -30 -155 244 33 103 59 -64 -67 34 63 -50 72 -160 -172 -84 203 -63
4079 -63 -278 149 -57 -1 42 31 -42 72 -175 -216 -104 -189 -20 -14 116 63 -113 -114 110 24 -169 -38 -13 -162 -13
4104 -13 -37 168 59 120 -137 -173 115 -106 -282 56 187 29 -30 -111 -154 -63 -37 79 61 41 117 64 68 144 -265
4129 -265 -14 -29 148 -43 247 -41 -279 -19 -229 -91 -70 94 214 125 -24 308 -11 115 -29 -66 98
4150 98 -83 116 -2 -53 -70 48 227 41 -180 147 -46 -243 120 -122 171 118 7 -210 -151 -127 -116 -38 -130
4173 -130 30 -91 -18 115 18 42 31 177 132 -151 164 19 123 189 139 73 82 126 -50 60 39 20 175 53
4197 53 -66 -227 -36 1 -102 5 -32 -4 -95 91 194 -180 -153 -29 78 274 -5 133 21 62 -109 111
4219 111 -25 -145 -95 -245 27 -101 63 283 264 -5 -148 -97 -102 378 -114 29 -79 264 87 -252 40 -68
$$ packed form
4055gj43K0L3K98l92K41L0j10j25L99k11P0m4j23lJ01K9j13J22k32j2Q8K87k66
4079f3k15M27k06N6M3j1p3J14k47m1J12q5J69OJ30n3j76jK24q6j93J31K5j49J49
4104a3k4K05j09O1k57l6K88k21j76L38J31j58n9q1m3R1K6J16j8k0P6n3MP6m09
4129b65K51j5J77j91K90k88k38K60k10J38K1J64J20q9j49L32l19J26j44l7J64
4150I8j81J99j18n1j7J18J79j86k21L27j93j97L63k42K93n3j11k17N9K4J1P8r2
4173a30J60j21P3J33r7K4j1J46m5k83L15j45J04O6n0o6RM4j76J10k1j9J55j22
4197E3j19j61J91L7j03J07l7K8r1J86J03l74K7J24J07J96k79J38j12M1j71K20
4219A11j36j20N0j50K72j28J64K20j9k69j43N1nM80m92J43j08L43j77l39K92j08
$$ plain form
4241 -68 -71 516 -15 44 -193 -215 -96 -138 104 -91 181 130 199 4 -94 150 -175 -4 158 -179 -102 139 -1
4264 -1 -295 146 -35 -224 -55 216 157 -14 92 -135 -67 -134 -219 -51 -124 -127 -16 -75 -54 203 22 94 12 -107
4288 -107 -179 70 -52 139 -55 -55 113 107 47 241 -58 14 60 -115 338 111 154 -199 115 -136 39 -67 -2
4311 -2 -179 6 -98 281 144 395 -23 -39 90 -198 143 157 122 20 159 -248 -25 -116 99 -122 -140 -109 -6
4334 -6 -148 -17 -185 -200 32 -91 -1 179 39 -205 -43 -81 -209 -66 80 -38 163 -62 167 -71 112 60
4356 60 37 -8 122 112 120 -110 29 -27 42 -105 -46 -77 33 -202 -6 33 213 -59 -3 66 -108 -35 -81 101 -76
4381 -76 -105 147 148 -155 -39 47 -34 31 -41 9 20 -106 72 94 10 213 219 -180 -20 -22 -28 -149 -53 342 46 199
4407 199 106 -80 26 -14 -55 -226 31 -34 103 -186 30 -125 215 163 -178 78 44 -356 80 -225 -125 -55
$$ packed form
4241f8lN87n31N9k37k2J19m2K42j95K72n1O9j95r8K44l25J71J62l37P7K41j40
4264ak94M41j81j89J69K71n9j71J06k27O8o7q5J68p3lJ11n9K1K57j81P2q2j19
4288a07p2K49j22J91j94%J68oo0J94k99P2M6j75M53k27M3l53L14k51J75j06O5
4311bj77J85j04L79j37K51m18j6J29k88L41J4l5j02J39m07K23r1K15k21j8L1J03
4334fj42J31j68j5K32j23R0J80j40k44J62l8j28J43J46j18K01k25K29k38J83n2
4356F0k3m5J30j0Qk30J39n6O9j47N9l1J10k35J96L9J80k72N6O9j74P3m6J82j77
4381g6k9K52Jl03J16Q6q1O5p2N0J1j26J78K2q4K03Ol99J60koj21R6L95k96J53
4407A99r3j86J06m0m1j71K57o5J37k89K16j55L40n2l41K56l4m00M36l05J00P0
$$ plain form
4429 -55 -244 -8 71 198 119 -67 312 -142 -66 135 -42 166 278 137 -311 -157 -155 62 97 115 49 -155 116
4452 116 77 49 -31 173 -224 -28 109 -137 107 -292 -140 -12 3 -338 168 46 -81 -353 -40 179 35
4473 35 -64 -103 -47 -190 220 24 46 166 -116 -129 -30 -86 -225 -59 88 -102 -88 -112 -106 -87 11 -142 220 -80 -53
4498 -53 1 138 142 4 -49 59 48 -127 -180 -7 -41 252 -45 99 -167 -170 -4 -119 221 -39 29 -138 86 -22
4522 -22 40 -182 -119 -117 164 152 -2 154 150 -135 70 -11 192 141 -240 117 3 -181 -71 54 213 -6 -69 129
4546 129 -56 39 -23 -106 -56 1 -99 -85 128 157 -30 -258 34 167 46 10 0 -83 94 -32 -193 269 3
4569 3 -10 -2 314 -9 140 -51 21 16 -76 73 -70 -85 -110 -250 16 257 46 22 -32 -73 62 -85 -62 -42 -60 39
4595 39 -163 -298 37 51 1 286 127 -27 248 -34 -146 -103 -55 -35 337 -215 41 -121 54 -50 -21 -193
$$ packed form
4429e5j89K36P9J27p9j86L79m54P6K01j77K08J12j41m48J54KK17L5J8o6k04K71
4452A16l9k8q0K04l97J96J37k46K44l99J52J28J5l41N06j22j27k72L13K19j44
4473C5r9l9N6j43M10j96K2J20k82j3R9n6j39J66J47j90J4k4OJ9R8j53L62l00K7
4498e3N4J37Mj38n3J08j1j75n3J73l4K93k97J44k66lJ66j15L40k60O8j67K24j08
4522b2O2k22O3KK81j2j54J56mk85K05q1K03n1l81L57j14j84J10J25J59k19o3J98
4546A29j85R5o2q3N0N7j00J4K13K9j87k28K92J33j21l6j0q3J77j26j61M62k66
4569Cj3QL16l23J49j91P2nr2J49j43j5k5j40K66K41k11k4n4m1J35j47K3K0j8R9
4595C9k02j35L35J4n0K85j59j54K75k82j12M3M8K0L72n52K56j62J75j04K9j72
$$ plain form
4617 -193 -43 -165 -61 -19 14 158 -173 142 44 60 -106 126 131 67 127 208 62 -339 -164 -155 119 49 -31 13 51
4642 51 6 -22 -281 -148 -23 140 73 -103 -19 -181 70 62 -245 -239 92 -64 -221 -64 127 -86 38 -136 129
4665 129 -74 15 -17 48 124 7 47 -39 -176 251 -79 5 -156 18 -53 -48 -90 153 90 -156 -16 21 150 -188
4689 -188 -5 -19 -1 180 237 -295 -124 105 -2 59 174 66 130 -66 -12 -64 -34 -39 234 -323 145 -38 -8 -13
4713 -13 -83 49 -54 177 123 -16 156 90 156 -73 45 60 176 48 -47 159 117 46 -92 115 119 76 0 -26 48
4738 48 -104 11 -48 -65 110 -284 94 1 149 -35 -12 -35 163 40 215 -49 -153 32 144 -23 -211 8
4760 8 293 -237 -103 -93 -66 -25 11 193 -138 47 66 -155 -98 -120 -92 259 1 -31 5 -54 284 159 -151 -226 -4
4785 -4 -71 14 101 -8 -17 -5 128 -48 -124 -9 142 79 -17 -15 8 96 98 0 -182 -20 200 -88 -93 -37 -37 -81 -1 234
$$ packed form
4617a93J50j22J04M2L3J44l31L15r8J6j66K32No4O0Q1j46m01J75RK74p0q0M4L8
4642E1m5k8k59J33J25J63o7j76Q4j62K51ql07OL31j56j57J57J91k13J24j74K65
4665A29k03Q9l2O5P6j17M0q6j37M27l30Q4j61J74p1Nm2K43o3k46J40L7J29l38
4689a88J83j4J8J81N7n32J71K29j07O1J15j08O4j96N4n2L0nK73n57M68j83L0n
4713a3p0J32j03K31n4j39J72o6O6k29J18J5J16j28r5K06m2p1j38K07Mm3p6k6P4
4738D8j52J15n9j7J75l94L78r3J48j84K3k3J98j23J75k64j04J85J12j67j88K19
4760HK85n30J34J0K7M1L6J82l31J85J9k21N7k2K8L51k58l2L6n9L38j25l10p5K22
4785do7Q5Q7j09rJ2J33j76p6J15J51o3r6KK3Q8Kr8j82J62K20k88nN6%m4Q0K35
$$ plain form
4813 234 -111 -36 112 117 -155 -262 107 79 -63 -45 307 -45 107 -94 -25 -116 128 68 138 126 25 -133 -75 -187
4837 -187 -303 35 189 144 261 54 -87 100 7 -53 -45 -54 33 216 40 16 47 13 91 215 -27 67 -35 59 -23
4862 -23 292 87 144 -187 25 -122 -164 -92 -105 126 -179 -24 -8 -319 -135 113 -11 106 -297 139 125 -163
4884 -163 27 -146 118 -169 47 55 -15 -364 85 -291 -62 200 -32 -86 -41 137 -164 119 -100 252 266 0
4906 0 44 -149 90 27 -65 -66 136 167 57 -129 32 110 -217 -125 -103 81 -172 92 -14 46 114 -57 -14 -84 135
4931 135 -66 -112 110 195 -111 -54 -67 21 123 -48 -38 -59 236 22 3 143 74 130 -89 148 -407 44 -72
4954 -72 98 -406 161 -135 140 120 -97 147 -314 112 134 61 55 7 -80 48 -114 101 150 68 -61 -218 87
4977 87 -197 -275 27 49 -17 4 70 43 -149 -60 -94 79 -77 4 -41 -174 214 19 -30 -29 -107 142 37 -72 -110
$$ packed form
4813B34l45P5J48Nk72j07L69k8j42J8L52l52J52k01O9r1K44o0P0j2j01j58N8j12
4837a87j16L38J54m5J17k07j41J87r3o0QrQ7J83j76k4L1l4P8J24k42R4j02R4q2
4862b3L15k05N7l31K12j47m2P2j3K31l05J55J6l11J84K48j24J17m03M36j4k88
4884a63J90j73K64k87K16Qp0l49M49l76K29K62k32n4M5J78l01K83k19L52J4k66
4906@M4j93K39o3r2jK02L1j10j86J61P8l27R2K2J84k53K64j06O0O8j71M3p0K19
4931A35k01m6K22Q5l06N7j3Q8J02j71J0k1K95k14j9J40o9N6k19K37n55M51j16
4954g2J70n04N67k96K75k0k17K44m61M26K2p3om8q7J28j62K15M9q2j29j57L05
4977H7k84p8L02K2o6K1O6k7j92Q9l4J73j56Q1m5j33L88j95m9Jp8K49j05j09l8
$$ plain form
5002 -110 -12 52 9 -8 -10 115 43 -4 22 167 -33 67 -147 82 66 -98 -59 152 130 142 -261 -71 41 46 -90
5027 -90 -286 -96 1 24 -107 -41 146 208 24 -113 206 31 248 308 204 -25 231 235 234 124 -41 -39 -11 -135
5051 -135 120 14 105 68 -16 -52 -153 -126 -44 3 -14 -48 -26 -132 79 128 9 -12 18 98 125 -58 -25 -152 -148 -2
5077 -2 112 -58 59 0 -122 115 -96 113 -179 -27 12 -139 242 194 -64 130 -73 -55 11 100 -105 -115 -189
5100 -189 126 16 -302 -153 -9 -85 89 2 13 128 81 15 105 159 -79 165 60 39 -214 81 156 141 -340
5123 -340 172 29 -17 98 4 -89 57 52 -33 -125 -239 12 -48 -20 96 -199 48 -87 -11 -142 -190 143 -145 -91
5147 -91 77 113 -125 57 -8 -79 -139 98 -158 75 146 57 -57 46 355 -78 -126 28 74 -40 26 -68 -378 -90
5171 -90 106 -311 -131 85 -171 -21 -90 -118 229 103 17 -21 174 48 112 51 252 -50 23 26 85 90 189 180 235 103
$$ packed form
5002a10R8O4m3j7kJ25p2m7K6J45k00J00k14K29j6j64L9K11k2J2m03J90J12Nj36
5027i0j96J90R7K3j31O6J87O2j84j37L19j75K17O0j04k29K56Mjj10j65KK8j24
5051a35K55j06R1l7q4l6j01K7Q2M7j7l4K2j06K11M9j19k1L0Q0K7j83L3j27MJ46
5077bJ14j70J17n9j22K37k11K09k92J52L9j51L81m8k58J94k03J8O6Q9k05j0p4
5100a89L15j10l18J49J44p6J74q7J1J15m7o6R0N4k38K44j05k1k53K95P5j5m81
5123c40N12j43m6J15r4r3J46nq5r2j14K51o0K8J16k95K47j35P6j31m8L33k88N4
5147i1J68L6k38J82o5p1o0K37k56K33P1q9j14J03L09m33m8J54M6j14O6r4l10K88
5171i0J96m17J80K16k56J50o9k8L47j26q6l8J95j26O4o1K01l02P3LN9NR9rN5j32
$$ plain form
5197 103 109 39 -39 -4 -1 -103 -134 168 79 -18 -146 101 15 48 59 37 -247 216 -65 257 -211 -143 -66 82 -136
5222 -136 -25 -65 -95 73 -88 -102 -47 41 -194 66 0 186 -292 121 -149 -77 -32 -35 8 -137 16 -166 186 36
5246 36 30 15 -126 -84 -2 -33 64 84 73 164 -3 122 -29 -111 -115 66 -86 36 -33 275 32 130 104 -156 182 120
5272 120 -183 -50 219 52 -88 -160 -227 187 -3 98 -111 209 -108 48 45 195 -126 -143 -92 31 33 -56 99
5295 99 -122 -49 -88 -4 -14 113 23 -175 -51 -75 -65 80 -29 71 -126 53 -169 -212 -22 -123 38 -66 -91
5318 -91 20 174 -21 67 -6 -18 282 -167 -282 -64 10 -148 181 -147 -177 -54 119 -190 -150 31 137 5
5340 5 -1 55 -85 19 -248 -94 -52 -28 -2 24 -111 83 -37 45 177 69 421 -26 112 -59 114 -6 15 12
5364 12 -38 76 -182 51 136 -45 -128 -18 80 202 258 100 -129 -18 73 157 46 -24 187 5 73 57 -204 -36
$$ packed form
5197A03Op0p8L5Lj02l1L02q9r7j28K47q6L3J1k2k84M63k81L22m68O8P7J48k18
5222a36J11m0l0J68j61j4N5Q8k35K60o6J86m78M13k70P2M5lM3j45J53j82L52j50
5246C6oj5j41M2Q2l1R7K0j1R1j67J25j51q2mJ81j52J22o9L08k43R8k6k60L38o2
5272A20l03J33K69j67j40p2o7M14j90J01k09L20l17J56lJ50l21j7N1J23Kq9J55
5295I9k21P3l9Q4j0J27r0j98J24k4J0J45j09J00j97J79k22m3J90j01J61j04k5
5318i1J11J54j95Q8p3j2L00m49j15K18P4j58L29l28l0J23J73l09M0J81J06j32
5340EoN6j40J04k67J54M2K4K6K6j35J94j20Q2J32j08L52m47J38j71J73j20K1l
5364A2n0J14k58K33Q5j81q3J10R8J22N6j58k29J11R1Q4j11p0K11j82O8j6k61J68
$$ plain form
5388 -36 236 -90 224 -127 -169 -353 46 73 -207 119 153 -211 52 -254 -52 -149 -8 247 -54 45 -63 -298
5410 -298 -127 119 -76 -304 137 50 -280 44 123 -191 86 60 -69 -55 -92 -49 -277 14 137 -36 13 131
5432 131 75 -176 -141 11 145 -138 -113 22 -153 75 49 33 -68 22 155 -72 105 -5 29 93 177 -127 -201
5455 -201 -93 -202 -25 244 -96 49 210 -21 115 185 25 149 -176 -10 -63 -40 -207 -61 -210 -72 -169
5476 -169 21 33 48 37 -110 192 373 17 -30 257 124 -67 -119 115 141 58 133 116 -32 -190 -106 -126 -93 -221
5500 -221 -133 59 140 213 -4 258 -295 -136 -197 77 72 -220 -36 -37 -105 121 -8 -72 119 182 -94 -50 -38 256
5524 256 204 -101 92 46 156 193 46 176 70 -106 -117 22 -134 -119 -2 280 54 184 59 116 163 -204
5546 -204 133 111 -94 -88 -373 107 -41 -110 -5 32 59 -39 -237 125 28 -381 8 -96 40 -204 80 -185 6
$$ packed form
5388c6K72l26L14l51m2j84L99K7k80L26L4l64K63l06K02r7J41K55l01R9j08k35
5410b98J71K46j95k28M41q7l30L24P9l14K77k6j29J4l7M3k28K91J23j73M9J18
5432A31n6k51L5J52J34k83K5J35j75K28k6j6j01R0J33k27J77j10L4O4Q4l04p4
5455b01J08j09J77K69l40J45J61k31J36P0j60J24l25J66n3K3j67J46j49J38r7
5476a69J90J2J5j1j47L02J81l56m7K87j33j91n2K34K6q3P5j7j48j58Q4k0L3j28
5500b21Q8J92Q1P3k17K62n53J59o1K74nk92J84jo8K26j29o4J91O3k76M4J2K94
5524B56n2l05J93m6J10L7j47J30j06j76j1J39j56J5J17K82k26J30j25N7M7l67
5546b04L37k2k05Ok85M80j48o9J05L7K7r8j98L62r7m09L89j04J36k44K84k65J91
$$ plain form
5569 6 110 -64 43 147 -44 185 -217 96 -98 40 168 -10 -51 26 -152 29 109 136 115 16 87 -364 -71
5592 -71 22 -15 -298 -80 -70 45 -114 -147 -175 -84 234 146 20 125 -150 -187 40 98 -90 -106 -94 -52 -125 3 -63
5617 -63 52 -45 -128 -133 67 52 -56 38 19 174 109 78 1 110 271 -59 104 -115 26 167 208 39 254 33
$$ packed form
5569FJ04j74J07J04j91K29m02L13j94J38J28j78m1P7j78J81Q0K7k1r9P1m51K93
5592g1R3l7k83K18J0J15j59l3k8R1L18q8j26J05k75l7K27N8j88j6J2M2p3J28o6
5617f3J15r7q3nK00j5j08R4j9J55o5l1p7J09J61l30J63k19J41J41M1j69K15k21
$$ [...]
8191a43
##END NTUPLES=NMR FID
##END=
