##TITLE=1H_PR_182_15
 D2O
 8 sc, 
 15.11.2021
##JCAMPDX= 6.0         $$ Bruker NMR JCAMP-DX V2.0
##DATA TYPE= NMR FID
##DATA CLASS= NTUPLES
##ORIGIN= UXNMR, Bruker Analytische Messtechnik GmbH
##OWNER= root
$$ XWIN-NMR		Version 3.5
$$ Mon Nov 15 12:46:29 2021 Russian Standard Time (UT+4h)  she@DPX200
##.OBSERVE FREQUENCY= 200.131346
##.OBSERVE NUCLEUS= ^1H
##.DELAY= (6, 6)
##.ACQUISITION MODE= SIMULTANEOUS
##.ACQUISITION SCHEME= undefined
##.AVERAGES= 8
##.DIGITISER RES= 18
##SPECTROMETER/DATA SYSTEM= spect
##.PULSE SEQUENCE= zg30
##.SOLVENT NAME= CDCl3
##.SHIFT REFERENCE= (INTERNAL, CDCl3, 0, 15.7039)
##AUDIT TRAIL= $$ (NUMBER, WHEN, WHO, WHERE, WHAT)
$$ ##TITLE= Audit trail, XWIN-NMR		Version 3.5
$$ ##JCAMPDX= 5.01
$$ ##ORIGIN= Bruker BioSpin GmbH
$$ ##OWNER= she
$$ F:/spectra/data/she/nmr/H-F/1/audita.txt
$$ ##AUDIT TRAIL=  $$ (NUMBER, WHEN, WHO, WHERE, WHAT)
(   1,<2021-11-15 12:45:01.37 +0400>,<she>,<DPX200>,
      <created by zg, POWCHK disabled, PULCHK disabled
       configuration hash MD5:
       00 E9 B6 7A A2 85 ED C7 34 08 36 98 17 FE 4E 26
       data hash MD5: 16K
       99 CE 78 2B 60 43 14 79 56 1F 9E 08 D1 CD 3C D6>)
$$ ##END=
$$ 
$$ hash MD5
$$ 72 D2 CD 43 89 C3 BF 31 15 55 6A BD C6 B8 7E BF
##$RELAX= 
##$RELAX= 
##$RELAX= 
##$RELAX= 
##$RELAX= 
##$RELAX= 
$$ Bruker specific parameters
$$ --------------------------
##$DU= <F:/spectra>
##$EXPNO= 1
##$NAME= <H-F>
##$PROCNO= 1
##$TYPE= <nmr>
##$USER= <she>
##$AMP= (0..31)
100 100 100 100 100 100 100 100 100 100 100 100 100 100 100 100 100 100 
100 100 100 100 100 100 100 100 100 100 100 100 100 100 
##$AQSEQ= 0
##$AQ_mod= 1
##$AUNM= <au_zg>
##$AUTOPOS= <>
##$BF1= 200.13
##$BF2= 200.13
##$BF3= 200.13
##$BF4= 200.13
##$BF5= 200.13
##$BF6= 200.13
##$BF7= 200.13
##$BF8= 200.13
##$BYTORDA= 1
##$CFDGTYP= 0
##$CFRGTYP= 5
##$CHEMSTR= <none>
##$CNST= (0..31)
1 1 145 1 1 1 1 1 1 1 1 1 1 1 1 1 1 1 1 1 1 1 1 1 1 1 1 1 1 1 1 1 
##$CPDPRG= <>
##$CPDPRG1= <>
##$CPDPRG2= <>
##$CPDPRG3= <>
##$CPDPRG4= <mlev>
##$CPDPRG5= <mlev>
##$CPDPRG6= <mlev>
##$CPDPRG7= <mlev>
##$CPDPRG8= <mlev>
##$CPDPRGB= <>
##$CPDPRGT= <>
##$D= (0..31)
0 1.2 0 0 0 0 0 0 0 0.06 0 0.03 0 0 0 0 0.0002 0 0 0 0 0 0 0 0 0 0 0 0 
0 0 0 
##$DATE= 1636965900
##$DBL= (0..7)
120 120 120 120 120 120 120 120 
##$DBP= (0..7)
150 150 150 150 150 150 150 150 
##$DBP07= 0
##$DBPNAM0= <>
##$DBPNAM1= <>
##$DBPNAM2= <>
##$DBPNAM3= <>
##$DBPNAM4= <>
##$DBPNAM5= <>
##$DBPNAM6= <>
##$DBPNAM7= <>
##$DBPOAL= (0..7)
0.5 0.5 0.5 0.5 0.5 0.5 0.5 0.5 
##$DBPOFFS= (0..7)
0 0 0 0 0 0 0 0 
##$DE= 6
##$DECBNUC= <off>
##$DECIM= 32
##$DECNUC= <off>
##$DECSTAT= 4
##$DIGMOD= 1
##$DIGTYP= 9
##$DL= (0..7)
0 120 120 120 120 120 120 120 
##$DP= (0..7)
150 150 150 150 150 150 150 150 
##$DP07= 0
##$DPNAME0= <>
##$DPNAME1= <>
##$DPNAME2= <>
##$DPNAME3= <>
##$DPNAME4= <>
##$DPNAME5= <>
##$DPNAME6= <>
##$DPNAME7= <>
##$DPOAL= (0..7)
0.5 0.5 0.5 0.5 0.5 0.5 0.5 0.5 
##$DPOFFS= (0..7)
0 0 0 0 0 0 0 0 
##$DQDMODE= 0
##$DR= 18
##$DS= 0
##$DSLIST= <SSSSSSSSSSSSSSS>
$$ [...]
##$SUBNAM2= <"">
##$SUBNAM3= <"">
##$SUBNAM4= <"">
##$SUBNAM5= <"">
##$SUBNAM6= <"">
##$SUBNAM7= <"">
##$SUBNAM8= <"">
##$SUBNAM9= <"">
##$SW= 18.0517287032376
##$SWIBOX= (0..15)
0 0 2 0 0 0 0 0 0 0 0 0 0 0 0 0 
##$SW_h= 3612.71676300578
##$TD= 16384
##$TD0= 1
##$TE= 0
##$TE2= 300
##$TE3= 300
##$TEG= 300
##$TL= (0..7)
0 120 120 120 120 120 120 120 
##$TP= (0..7)
150 150 150 150 150 150 150 150 
##$TP07= 0
##$TPNAME0= <>
##$TPNAME1= <>
##$TPNAME2= <>
##$TPNAME3= <>
##$TPNAME4= <>
##$TPNAME5= <>
##$TPNAME6= <>
##$TPNAME7= <>
##$TPOAL= (0..7)
0.5 0.5 0.5 0.5 0.5 0.5 0.5 0.5 
##$TPOFFS= (0..7)
0 0 0 0 0 0 0 0 
##$TUNHIN= 0
##$TUNHOUT= 0
##$TUNXOUT= 0
##$USERA1= <user>
##$USERA2= <user>
##$USERA3= <user>
##$USERA4= <user>
##$USERA5= <user>
##$V9= 5
##$VALIST= <valist>
##$VCLIST= <CCCCCCCCCCCCCCC>
##$VD= 0
##$VDLIST= <DDDDDDDDDDDDDDD>
##$VPLIST= <PPPPPPPPPPPPPPP>
##$VTLIST= <TTTTTTTTTTTTTTT>
##$WBST= 1024
##$WBSW= 4
##$XGAIN= (0..3)
0 0 0 0 
##$XL= 0
##$YL= 0
##$YMAX_a= 811114
##$YMIN_a= -822839
##$ZGOPTNS= <>
##$ZL1= 120
##$ZL2= 120
##$ZL3= 120
##$ZL4= 120
##$ABSF1= 10
##$ABSF2= 0
##$ABSG= 5
##$ABSL= 3
##$ALPHA= 0
##$AQORDER= 0
##$ASSFAC= 0
##$ASSFACI= 0
##$ASSFACX= 0
##$ASSWID= 0
##$AUNMP= <proc_1d>
##$AZFE= 0.1
##$AZFW= 0.1
##$BCFW= 1
##$BC_mod= 2
##$BYTORDP= 1
##$COROFFS= 0
##$CY= 11.3945322036743
##$DATMOD= 1
##$DC= 2
##$DFILT= <>
##$DTYPP= 0
##$F1P= 2.36226072786647
##$F2P= -0.459571619588291
##$FCOR= 0.5
##$FTSIZE= 0
##$FT_mod= 4
##$GAMMA= 1
##$GB= 0.15
##$INTBC= 1
##$INTSCL= 1
##$ISEN= 128
##$LB= 0.24
##$LEV0= 0
##$LPBIN= 0
##$MAXI= 10000
##$MC2= 0
##$MEAN= 0
##$ME_mod= 0
##$MI= 1.114404
##$NCOEF= 0
##$NC_proc= 0
##$NLEV= 6
##$NOISF1= 3.799351
##$NOISF2= 2.8
##$NSP= 1
##$NTH_PI= 0
##$NZP= 0
##$OFFSET= 15.70392
##$PC= 1
##$PHC0= -15515.83
##$PHC1= 11.00081
##$PH_mod= 1
##$PKNL= yes
##$PPARMOD= 0
##$PSCAL= 0
##$PSIGN= 0
##$REVERSE= no
##$SF= 200.130013532006
##$SI= 16384
##$SIGF1= 3
##$SIGF2= 2
##$SINO= 400
##$SIOLD= 16384
##$SREGLST= <1H.CDCl3>
##$SSB= 0
##$STSI= 0
##$STSR= 0
##$SW_p= 3612.71676300578
##$SYMM= 0
##$S_DEV= 0
##$TDeff= 0
##$TDoff= 0
##$TI= <>
##$TILT= no
##$TM1= 0
##$TM2= 0
##$TOPLEV= 0
##$USERP1= <user>
##$USERP2= <user>
##$USERP3= <user>
##$USERP4= <user>
##$USERP5= <user>
##$WDW= 1
##$XDIM= 8192
##$YMAX_p= 0
##$YMIN_p= 0
$$ End of Bruker specific parameters
$$ ---------------------------------
##NTUPLES= NMR FID
##VAR_NAME=  TIME,          FID/REAL,        FID/IMAG
##SYMBOL=    X,             R,               I
##VAR_TYPE=  INDEPENDENT,   DEPENDENT,       DEPENDENT
##VAR_FORM=  AFFN,          ASDF,            ASDF
##VAR_DIM=   8192,          8192,            8192
##UNITS=     SECONDS,       ARBITRARY UNITS, ARBITRARY UNITS
##FACTOR=    0.0002768,     1,               1
##FIRST=     0,             0,               0
##LAST=      2.2672688,     0,               0
##MIN=       0,             -822839,         0
##MAX=       2.2672688,     811114,          0
$$ Real data points
##PAGE= N=1
##DATA TABLE= (X++(R..R)), XYDATA
0 0 0 0 0 0 0 0 0 0 0 8 -8 8 -16 16 -24 24 -31 41 -42 58 -66 77 -95 108 -132 152 -174 204 -233 269 -309
31 -309 350 -401 450 -509 576 -643 722 -805 898 -1003 1112 -1236 1368 -1511 1672 -1843 2035
48 2035 -2242 2468 -2722 2996 -3305 3647 -4027 4461 -4951 5515 -6173 6945 -7877 9016
62 9016 -10454 12336 -14907 18669 -24701 36000 -64637 303953 401837 -260513 -634802 -822839
74 -822839 -557177 -77557 474279 756040 728332 336444 -195404 -650778 -772357 -561483
84 -561483 -80174 429895 748366 696132 340215 -173032 -602872 -758542 -545129 -93643
94 -93643 395776 700895 686512 340771 -151112 -564262 -717339 -544093 -109742 366643
104 366643 663314 655530 351472 -121386 -532341 -686888 -526453 -131452 328053 632968
114 632968 636029 348083 -90712 -489887 -662172 -520247 -140970 292555 592771 621062
124 621062 355267 -71165 -454316 -628593 -515960 -160178 267002 560799 596483 361620
134 361620 -43006 -425950 -603532 -502961 -175781 232958 533663 580956 360004 -20249
144 -20249 -390644 -581357 -497681 -184665 206274 500616 565045 364984 -3314 -362975
154 -362975 -553394 -490248 -198731 183875 475230 545240 366642 17983 -338039 -532290
164 -532290 -479629 -208114 157962 450496 530888 365153 34320 -310657 -511036 -473009
174 -473009 -215891 136860 424213 515393 366904 49436 -287051 -488813 -464871 -225915
184 -225915 116177 401242 499397 366812 65621 -264236 -469271 -456654 -233199 96109
194 96109 379258 484952 366297 78911 -243132 -450300 -448806 -239968 78750 358961
204 358961 471031 365073 92004 -222592 -432893 -440879 -245107 61279 338432 458422
214 458422 364582 102761 -203560 -414611 -434395 -251666 46482 319099 443790 364473
224 364473 115257 -186636 -398084 -425185 -257949 29141 302583 432042 361026 126176
234 126176 -167057 -383445 -418957 -259429 15330 282861 421328 361426 133074 -151695
244 -151695 -365566 -412356 -265934 4466 268257 406262 359975 144957 -138155 -352417
254 -352417 -402109 -269477 -11599 253334 396961 354872 153162 -119622 -338913 -398157
264 -398157 -270618 -22692 234325 386097 356751 159172 -106505 -321097 -390676 -277597
274 -277597 -33044 221979 371351 353057 170837 -94007 -310642 -380330 -278618 -48497
284 -48497 207507 364010 348130 176141 -75785 -296355 -376938 -279481 -57211 189052 351634
295 351634 350087 181914 -65447 -279416 -368412 -286021 -67525 178399 337874 344853 193477
306 193477 -52085 -269973 -358447 -285091 -82177 163247 330961 340698 196329 -35543 -255001
317 -255001 -355374 -286608 -88063 146593 317567 341454 202276 -27213 -239730 -344845
327 -344845 -291607 -98418 137670 305034 334461 211344 -13668 -231036 -336100 -288408
337 -288408 -110281 122317 298158 330684 212170 -71 -215475 -332047 -289616 -115106
347 -115106 108324 284213 329393 217991 6926 -202648 -320481 -292017 -124290 100124
357 100124 273414 321694 223799 19420 -194105 -313102 -288017 -133475 85653 265412
367 265412 318084 224143 30254 -179174 -307125 -288721 -137401 73936 252177 315123 229261
378 229261 37191 -168120 -295664 -289051 -145612 64985 242323 306978 232273 48670 -158580
389 -158580 -288818 -284972 -151931 52196 233336 303272 232551 57160 -145226 -281554 -284947
400 -284947 -156270 42167 220620 298480 236411 64050 -135050 -270797 -282997 -162879
410 -162879 33519 211339 290868 237408 73723 -125082 -263641 -279158 -167477 21820
420 21820 201808 286342 237689 80483 -113903 -255359 -277675 -170881 13682 191546 280549
431 280549 238761 86329 -104711 -246743 -274485 -174709 5794 182477 274010 238800 92821
442 92821 -95526 -239070 -271090 -177840 -2474 173239 268051 238732 98947 -86474 -230475
453 -230475 -267934 -181094 -10657 164410 262063 238466 105052 -76696 -222758 -264474 -183478
464 -183478 -18848 154229 256470 238425 110196 -67747 -213429 -261589 -187061 -26066
474 -26066 144960 248460 238455 116960 -59007 -205558 -256506 -190012 -35237 136740 243105
485 243105 236374 122164 -48663 -198160 -253966 -191089 -42115 125747 236897 236786 125801
496 125801 -40838 -187886 -249641 -194590 -48079 118291 228613 235461 132417 -33328 -181580
507 -181580 -243634 -195544 -56845 110428 223704 232120 135569 -23269 -173613 -241712 -195764
518 -195764 -61820 99454 217265 233092 138859 -17258 -163478 -236350 -199684 -67479 93084
529 93084 208544 230077 145080 -9931 -157910 -230320 -198834 -75553 85027 204599 226761
540 226761 146393 -377 -149489 -228225 -198513 -79338 74482 196721 227295 149494 4854
551 4854 -139414 -221680 -201923 -85324 68860 188358 222713 155323 13008 -134163 -215995
562 -215995 -199551 -92928 59347 183995 219801 155450 21676 -124824 -213259 -199818 -95345
573 -95345 50395 175137 219531 158406 25458 -115992 -205794 -201454 -100946 45771 167745
584 167745 213549 162547 33476 -110945 -200736 -198340 -106495 36630 163046 210709 161438
595 161438 40073 -101498 -196957 -198008 -107948 29175 153998 208844 164244 43708 -94199
606 -94199 -189121 -198111 -113042 24543 147927 202982 166446 51085 -88674 -184485 -194662
617 -194662 -117340 16089 142391 200203 165376 56329 -79453 -179728 -194813 -118640 9426
628 9426 133608 197316 167836 59777 -73261 -172161 -193339 -123508 4591 127929 191519
639 191519 168378 66489 -67091 -167334 -189972 -126037 -3478 121443 188541 167735 70740
650 70740 -58817 -161920 -188863 -127945 -9001 113553 184165 169144 74648 -52577 -155512
661 -155512 -186921 -131164 -14740 107714 179331 168903 79978 -46037 -150283 -183631 -132998
672 -132998 -20814 101116 175832 168346 83346 -39320 -144419 -182019 -134668 -25683 94706
683 94706 171281 168012 86779 -34024 -138457 -179035 -136496 -30808 88620 166793 167260 90392
695 90392 -28219 -133222 -176396 -137760 -35375 82834 162344 166740 93413 -22768 -127679
706 -127679 -173210 -139037 -40176 77150 158152 165280 96856 -16962 -122488 -170668 -139426
717 -139426 -44564 70974 153922 164714 99209 -11519 -116573 -167938 -141106 -48336 65196
728 65196 148304 163628 102658 -6661 -111337 -163911 -141782 -53603 59741 144361 161485
739 161485 104776 -155 -105821 -161924 -141740 -57369 52960 139998 161222 106592 4075
750 4075 -99260 -158158 -143542 -60745 48631 134251 159330 110504 9109 -95330 -153936
761 -153936 -142809 -65873 43040 130902 156721 111147 15062 -90009 -151982 -142335 -68142 36656
773 36656 126011 156517 112633 17919 -83527 -147849 -143569 -71022 33672 120387 153517 115552
785 115552 22550 -80367 -143497 -141938 -75173 28136 117766 150820 115139 27828 -74639
796 -74639 -141769 -141173 -76304 22246 112046 150288 116592 29747 -68768 -136856 -142338 -79873 19129
809 19129 106791 146307 119115 34865 -65426 -133041 -139850 -83853 13366 103832 144354 118520
821 118520 39558 -58931 -130673 -139566 -84133 7836 97874 142954 119930 41579 -53857 -125240
833 -125240 -139679 -87380 5045 93109 138793 121420 46452 -50207 -121962 -136696 -90380 -905
845 -905 89975 136820 120150 49907 -44298 -119017 -136714 -90704 -4940 83807 134674 121575
857 121575 51766 -40150 -113204 -135848 -93826 -8096 79828 130255 122002 56119 -36538 -110413
869 -110413 -132944 -95355 -13222 76403 128597 120785 58565 -30756 -107191 -132265 -95559 -15960
881 -15960 70893 125950 121817 60267 -27505 -102559 -130725 -97971 -19023 67262 122039 121253 63721
894 63721 -23954 -99446 -127990 -98732 -23412 63373 120045 120330 65834 -18978 -95570 -127270
906 -127270 -99541 -26519 58299 116666 120570 67967 -15407 -91096 -125027 -100989 -29628 54891
918 54891 113348 119794 70956 -11260 -87545 -122876 -101599 -33407 50749 110754 118973 72344
930 72344 -7662 -84387 -121466 -101813 -35895 46844 107546 118177 74216 -4066 -80268 -119125
942 -119125 -102982 -38578 43123 104758 117814 76309 -457 -76732 -117151 -103200 -41221 39156
954 39156 101390 116787 78117 3071 -73186 -115072 -103751 -44617 35404 98667 115824 79668
966 79668 6792 -69494 -112985 -103870 -46943 31415 95481 114948 80687 9658 -65251 -110903
978 -110903 -104573 -49271 27835 92077 113633 82736 12786 -62347 -107983 -104481 -52879 24150
990 24150 89247 112236 84043 16777 -58615 -106343 -103799 -54527 20085 85944 111796 84837
1002 84837 19424 -54351 -103765 -105017 -56239 17541 82297 110215 87113 22351 -51504 -100762
1014 -100762 -104213 -59578 13826 80157 108139 87333 26473 -47655 -99279 -103788 -60893 9167
1026 9167 76324 108007 88097 28036 -43600 -95979 -104341 -62923 6949 72669 105327 89760
1038 89760 31159 -41631 -93420 -102724 -65487 3818 70874 103776 89077 34348 -37499 -92314
1050 -92314 -102678 -65846 -153 66679 103002 90254 35585 -34156 -88478 -102661 -68002 -1601
1062 -1601 63629 100391 91227 38485 -32125 -86091 -100815 -70176 -5204 61717 98886 90168
1074 90168 41337 -27678 -84368 -100647 -70100 -8564 57396 97750 91272 42447 -24585 -80661
1086 -80661 -100255 -72343 -10376 54539 94476 92103 45880 -22061 -78436 -98449 -74017 -14534
1098 -14534 52213 93520 91028 48066 -17845 -76429 -98185 -74203 -17220 47814 91928 92300
1110 92300 48887 -15187 -72603 -97309 -76037 -18885 45575 88603 91754 51899 -12874 -70383
1122 -70383 -95272 -76781 -22626 42811 87559 91120 53290 -8939 -68089 -94821 -76873 -24469
1134 -24469 39307 85351 91526 54339 -6830 -64589 -93653 -78464 -26277 36745 82933 90782
1146 90782 56891 -4190 -62724 -91764 -78855 -29517 33923 81415 90366 57863 -814 -59887
1158 -59887 -90933 -79140 -31051 30928 78871 90181 59587 1405 -57054 -89104 -80021 -33177
1170 -33177 28422 76824 89697 61046 3965 -54742 -87725 -80330 -35724 25501 74662 89119
1182 89119 62213 6658 -51959 -86423 -80648 -37506 22451 72145 88227 63278 9405 -49036
1194 -49036 -84531 -80973 -39914 20011 70220 87745 64792 11702 -46345 -83338 -81155 -41372
1206 -41372 16986 67567 87060 65872 13954 -43925 -81134 -81361 -43387 14715 65713 85928
1218 85928 66629 16767 -41377 -79935 -81086 -44724 11750 63376 85420 67288 18420 -38519
1230 -38519 -78333 -81351 -46440 9427 60704 84125 68569 20512 -36359 -76092 -81266 -48474
1242 -48474 7098 58860 82697 68730 23027 -33826 -74723 -80539 -49440 3940 56249 82580
1254 82580 69482 24705 -30521 -72544 -81019 -50879 2069 53648 80715 70653 27211 -28733
1266 -28733 -70244 -80103 -52768 -652 51700 79251 70285 29659 -25529 -69090 -79327 -53429
1278 -53429 -3426 49009 78803 70967 30820 -22728 -66386 -79553 -54767 -4995 46174 76631
1290 76631 72242 32990 -20980 -64410 -78285 -56603 -8103 44721 75128 71598 35256 -17943
1302 -17943 -63162 -78053 -56909 -10408 41456 74420 71925 36069 -15513 -60218 -77812 -57986
1314 -57986 -11572 39390 71967 72501 38181 -14066 -58577 -76235 -59269 -14318 37471 70972
1326 70972 71611 39897 -10809 -57124 -75785 -59076 -15992 34709 70015 72462 40555 -8760
1338 -8760 -54197 -75222 -60728 -17770 32434 67462 72483 42969 -6773 -52341 -73675 -61653
1350 -61653 -20701 30467 66473 71479 44389 -3511 -50388 -73420 -61506 -22662 26993 64725
1362 64725 71878 45310 -1516 -47602 -72247 -63162 -23771 25207 62465 71602 47304 407
1374 407 -45993 -70487 -63124 -26387 23241 61551 70757 47953 2981 -44113 -70393 -63221 -27824
1387 -27824 20349 59962 71277 48978 4638 -41543 -68905 -64219 -29285 18673 57692 70631
1399 70631 50385 6555 -40061 -67558 -64170 -31240 16779 56585 69736 50931 8405 -37922
1411 -37922 -67094 -64533 -32179 14098 54590 69574 52022 10496 -35548 -65789 -64906 -34123
1423 -34123 12620 52945 69194 53201 12496 -33621 -63992 -64881 -35771 10129 51331 68158
1435 68158 53918 14775 -31383 -62831 -65148 -37057 7754 48928 67652 54962 16704 -29272
1447 -29272 -61499 -65361 -38449 5747 47209 67059 55603 18890 -26828 -60123 -65276 -40264
1459 -40264 3264 45099 66367 56521 20605 -24807 -58434 -65245 -41711 1365 43421 65230
1471 65230 56854 22430 -22817 -57058 -64890 -42458 -878 41365 64489 57278 23772 -20194
1483 -20194 -55357 -64931 -43822 -2502 39298 63460 58338 25564 -19013 -54045 -64420 -45048
1495 -45048 -4423 38079 62498 58260 27325 -16736 -53044 -63743 -45752 -6447 35974 61733
1507 61733 58435 28351 -14467 -50958 -64065 -46529 -7924 33816 60618 59200 30175 -12934
1519 -12934 -49291 -63145 -48082 -10345 32441 59068 58687 31651 -10555 -47851 -62505 -48348
1531 -48348 -12217 30101 58583 58943 32440 -8484 -45852 -62463 -49347 -13294 27989 56623
1543 56623 59842 34356 -6896 -43783 -61396 -50451 -15801 26274 55529 58885 36101 -4189
1555 -4189 -42693 -61004 -50322 -17591 23668 54631 59399 36314 -2283 -40487 -60236 -51574
1567 -51574 -18856 21877 52496 59162 37976 -1214 -39071 -58691 -52031 -20932 20397 51386
1579 51386 58487 39094 1402 -37678 -58451 -52007 -22020 17992 50420 58926 39637 2795
1591 2795 -35182 -57525 -52913 -23021 16589 48393 58201 41059 3989 -34116 -56160 -53065 -25043
1604 -25043 15310 47469 57628 41447 6244 -32561 -55990 -52569 -26023 12552 46208 58146
1616 58146 42241 7750 -30028 -54472 -53579 -27199 11142 44170 57263 43577 9108 -28858
1628 -28858 -53075 -53428 -29284 9239 43212 56322 43931 11569 -26825 -52421 -53316 -29837 7026
1641 7026 41243 56455 44652 12615 -24836 -51299 -53791 -30956 5879 39553 55391 45523
1653 45523 14335 -23472 -49844 -53278 -32531 3843 38183 54377 45956 16041 -21451 -48946
1665 -48946 -53529 -33322 1922 36541 54247 46430 17284 -19613 -47697 -53415 -34478 669
1677 669 35029 53345 46966 18593 -18113 -46187 -53142 -35443 -1142 33502 52533 47197 19819
1690 19819 -16101 -45069 -53115 -36178 -2778 32060 51587 47742 21547 -14424 -43619 -52513
1702 -52513 -37034 -4527 30349 50819 47810 22750 -12624 -42323 -52408 -37765 -5831 28714
1714 28714 49820 48165 24280 -10900 -40873 -51923 -38975 -7568 26909 48838 48309 25450
1726 25450 -9563 -39530 -51154 -39364 -9458 25195 48010 48162 26351 -7534 -38244 -51356
1738 -51356 -40303 -10972 23329 46819 48670 27598 -6146 -36450 -50290 -41097 -12235 22184
1750 22184 45754 48384 28961 -4209 -35511 -49914 -41247 -14032 20164 44917 48339 29503
1762 29503 -2350 -33983 -49596 -41925 -14986 18734 43578 48895 30790 -1509 -32531 -48594
1774 -48594 -42543 -16194 17538 42459 48043 31862 162 -31322 -47908 -42246 -17829 15337
1786 15337 41672 47912 32132 1928 -29372 -47540 -43022 -18256 14076 39963 48391 33293
1798 33293 2961 -28106 -46307 -43515 -20059 12895 39273 47252 34085 4905 -26915 -45780
1810 -45780 -43204 -21241 10650 38283 47434 34406 6025 -24966 -45138 -43660 -22088 9688
1822 9688 36610 47257 35762 7130 -23525 -43881 -44119 -23845 8222 35674 46113 36218 9016
1835 9016 -22514 -43660 -43763 -24466 6250 34506 46543 36595 10051 -20736 -42626 -44528 -25299
1848 -25299 5196 32812 45897 37191 10949 -19495 -41238 -44269 -26737 3763 32124 45025
1860 45025 37495 12854 -18450 -40588 -43844 -27106 2116 30640 44890 37906 13638 -16616
1872 -16616 -39496 -44191 -27952 962 29215 44213 38576 14824 -15462 -38479 -43832 -29040
1884 -29040 -108 28393 43512 38943 16338 -14018 -37865 -43770 -29590 -2067 26960 43149
1896 43149 39029 17169 -12702 -36690 -43794 -30305 -2937 25485 42347 39580 17826 -11636
1908 -11636 -35700 -43228 -31264 -4188 24420 41721 39376 19084 -9945 -34680 -43051 -31554
1920 -31554 -5516 23171 41216 40034 20162 -8634 -33498 -42925 -32077 -6589 21785 40183
1932 40183 40082 21463 -7263 -32265 -42520 -32682 -7680 20563 39571 39937 22242 -6212 -31745
1945 -31745 -42328 -33287 -8943 19398 38719 40317 22935 -4915 -30141 -41697 -33798 -10276
1957 -10276 17945 37776 40318 24039 -3666 -29378 -41382 -34054 -11453 16740 36966 40339
1969 40339 24271 -2357 -28042 -40748 -34719 -12432 15527 36146 39969 25482 -900 -26869
1981 -26869 -40180 -35058 -13447 14039 35407 40036 25722 318 -25594 -39745 -35211 -14434
1993 -14434 12640 33969 39912 27177 1440 -24216 -38947 -35863 -15801 11724 33176 39304
2005 39304 27802 2683 -23434 -38478 -35796 -16702 10206 32513 39265 27830 4050 -21864
2017 -21864 -37815 -36026 -17399 8857 31331 39282 28583 4695 -20890 -37017 -36119 -18566 7857
2030 7857 30220 38520 29468 6430 -20142 -36656 -35976 -19591 6514 29406 38429 29457 7241
2043 7241 -18361 -36284 -36485 -19625 5493 28103 38511 30281 8057 -17408 -34860 -36253 -20960
2056 -20960 4270 27532 37404 30555 9399 -16661 -34496 -36253 -21767 2964 26691 37796
2068 37796 30690 10002 -15017 -33628 -36383 -22187 1990 24986 37053 31528 10849 -14094
2080 -14094 -32346 -36334 -23256 1073 24191 36068 31694 12484 -13060 -32115 -36102 -23835
2092 -23835 -275 23371 36130 31779 12876 -11649 -31294 -36260 -24129 -1074 22091 35721
2104 35721 32352 13530 -10888 -30236 -35709 -25019 -2051 21561 34947 32213 14710 -9770
2116 -9770 -29781 -35659 -24966 -3462 20500 34668 32444 15243 -8317 -28808 -35701 -25627 -3817
2129 -3817 19055 33602 33009 16173 -7624 -27794 -35243 -26535 -5198 18520 33202 32788 17169
2142 17169 -6266 -27326 -34712 -26644 -6435 17554 32703 32938 18079 -5323 -26024 -34750 -27295
2155 -27295 -7148 16207 32198 33077 18571 -4486 -25089 -34263 -27800 -8111 15368 31403 33082
2168 33082 19027 -3319 -24366 -33996 -27970 -8956 14286 30811 32750 19678 -2515 -23250
2180 -23250 -33876 -28310 -9890 13338 30279 33092 20475 -1260 -22528 -33050 -28510 -10574
2192 -10574 12378 29475 32934 21228 -431 -21785 -32865 -28881 -11256 11480 28628 32718
2204 32718 21735 514 -20792 -32407 -29093 -12296 10288 28157 32679 22111 1417 -20166
2216 -20166 -32034 -29316 -12935 9165 27125 32670 22716 2421 -18976 -31571 -29656 -13620 8691
2229 8691 26515 31954 23142 3113 -18038 -31117 -29601 -14545 7210 25768 32126 23313 4253
2242 4253 -17279 -30802 -29780 -15058 6443 24958 32198 23967 4912 -15974 -29908 -29876 -15910
2255 -15910 5435 24171 31405 24746 5940 -15219 -29576 -29940 -16661 4689 23551 31599 24826
2268 24826 6550 -14328 -28988 -30112 -16739 3811 22731 31453 25285 7338 -13659 -28321
2280 -28321 -30147 -17741 3191 22270 30786 25279 8312 -12991 -28041 -29315 -18185 1812 21516
2293 21516 30668 25439 8994 -11752 -27469 -30136 -18808 1097 20272 30364 26233 9437 -11238
2306 -11238 -26264 -30177 -19313 733 20044 29682 26092 10385 -10405 -26201 -29649 -19712 -489
2319 -489 19444 29691 26476 10780 -9252 -25390 -29789 -20086 -1146 17795 29116 26894 11440
2332 11440 -8456 -24834 -29628 -20671 -1885 17683 28471 26528 12680 -7786 -24318 -29434 -20952
2345 -20952 -3016 16699 28453 26809 12986 -6824 -23553 -29491 -20992 -3826 15623 27670
2357 27670 27114 13734 -6044 -22491 -28921 -22139 -4424 14865 27120 26916 14494 -5071 -22443
2370 -22443 -28814 -22176 -5362 14010 27073 27251 14558 -4146 -21442 -28822 -22470 -5858 13312
2383 13312 26614 27218 15557 -3515 -20616 -28270 -23005 -6716 12380 25906 27195 15951 -2453
2396 -2453 -19996 -28332 -22808 -7732 11796 25388 27328 16370 -1681 -19262 -27784 -23441 -8263
2409 -8263 10759 24443 27416 17082 -854 -18382 -27404 -23608 -8749 10068 24156 27212 17377
2422 17377 -82 -17702 -27123 -23737 -9585 9127 23989 27151 17880 564 -17031 -26618 -23905
2435 -23905 -10093 8419 22853 26998 18388 1323 -16345 -26729 -24155 -10904 7469 22371
2447 22371 26709 18727 2281 -15536 -25870 -24508 -11589 6806 21460 26568 19240 2914 -14789
2460 -14789 -25602 -24454 -11895 6181 21233 26704 19663 3703 -14091 -25020 -24431 -12331 5299
2473 5299 20756 26404 19612 4046 -13354 -24814 -24729 -13132 4584 19734 26091 20170 4834
2486 4834 -12735 -24268 -24479 -13676 3622 19600 25968 20330 5698 -11885 -24082 -24726 -13992
2499 -13992 2966 18847 25786 20753 6030 -10933 -23255 -24776 -14835 2493 18188 25372 21072
2512 21072 7030 -10169 -22895 -24496 -15070 944 17672 24899 21166 7715 -9563 -22624 -24993
2525 -24993 -15352 823 16599 24872 21606 8040 -8654 -21786 -24851 -16102 221 16010 24614
2538 24614 21893 8891 -8108 -21592 -24453 -16618 -919 15339 24486 21914 9465 -7408 -20859
2551 -20859 -24643 -16677 -1309 14424 24056 22288 9679 -6789 -20570 -24643 -17582 -1834 14130
2564 14130 23645 22396 10429 -6085 -20356 -24200 -17422 -2911 13760 23420 22162 10874 -5496
2577 -5496 -19440 -24467 -17664 -3245 12501 23006 22624 11257 -4963 -18381 -23910 -18629 -3830
2590 -3830 12469 22668 22488 12094 -4055 -18380 -24085 -18419 -4620 11635 22615 22422 12281
2603 12281 -3332 -17737 -24036 -18700 -5120 10734 21975 22645 13084 -2892 -16909 -23560 -19358
2616 -19358 -5779 10229 21158 22445 13502 -2195 -16670 -23376 -19322 -6537 9632 21344 22848
2629 22848 13778 -1204 -15727 -23366 -19629 -7086 8731 20485 22765 14461 -501 -15246 -22743
2642 -22743 -19961 -7855 8302 19991 22414 14848 60 -14768 -22529 -20068 -7837 7281 19733
2655 19733 22595 14960 592 -13801 -22371 -20121 -8536 6692 19322 22761 15327 1129 -13616
2668 -13616 -21969 -20136 -8943 6264 18688 22556 15785 1795 -12732 -21691 -19958 -9345 5405
2681 5405 18102 21996 15921 2376 -12325 -21083 -20260 -10126 5023 17736 22231 16156 3010
2694 3010 -11700 -20891 -20513 -10670 4387 17184 21647 16583 3486 -10745 -20280 -20565 -10733 3532
2708 3532 16398 21795 16560 4130 -10531 -20059 -20528 -11308 2961 16075 21483 17108 4936 -9895
2722 -9895 -19831 -20575 -12076 2236 15311 21348 17275 5337 -9213 -19353 -20487 -12355 2067 14653
2736 14653 20999 17576 5733 -8697 -18992 -20356 -12537 1427 14400 21010 17342 6081 -7900
2749 -7900 -18628 -20345 -12637 610 13495 20624 17720 6672 -7369 -18099 -20444 -13267 165
2762 165 13510 20210 17988 7171 -6907 -17717 -19989 -13501 -423 12854 20057 17988 7826
2775 7826 -6126 -17138 -20152 -13530 -922 12036 19878 18444 8172 -5588 -16966 -20324 -14155
2788 -14155 -1533 11861 19459 17993 8440 -5231 -16380 -19875 -14066 -2111 11317 19283 18250
2801 18250 8784 -4639 -15739 -19977 -14629 -2384 10522 18890 18629 9228 -4078 -15371 -19743
2814 -19743 -14731 -3054 10096 18173 18440 9904 -3595 -15188 -19560 -14926 -3704 9557 18314
2827 18314 18501 9905 -2648 -14460 -19608 -15275 -3949 8849 17966 18681 10248 -2308 -13898 -19365
2841 -19365 -15679 -4440 8457 17119 18492 11064 -2057 -13633 -18799 -15538 -5356 7840 17228
2854 17228 18395 10955 -1027 -13063 -18768 -16013 -5373 7261 16651 18269 11651 -597 -12482
2867 -12482 -18570 -16108 -6300 6976 16375 18673 11941 -183 -12037 -18508 -16052 -6426 6013 16244
2881 16244 18282 12084 638 -11592 -18106 -16305 -6888 5726 15474 18540 12336 711 -11101
2894 -11101 -17775 -16480 -7482 5441 15086 18284 12964 1393 -10561 -17875 -16251 -7794 4699 14874
2908 14874 18071 13076 1696 -10099 -17457 -16721 -8083 4055 14397 18102 13425 2386 -9732
2921 -9732 -17306 -16728 -8460 3616 13942 17747 13577 3066 -9167 -16805 -16604 -8714 2858 13485
2935 13485 17933 13608 3538 -8578 -16282 -16646 -9404 2430 13028 17483 13919 3873 -8053
2948 -8053 -16460 -16734 -9816 1936 12436 17373 13903 4315 -7639 -15924 -16750 -9826 1665 12392
2962 12392 17367 14261 4777 -6953 -15466 -16670 -10174 1042 11806 17217 14293 4970 -6472 -15305
2976 -15305 -16775 -10837 352 11343 16901 14702 5561 -6298 -14746 -16877 -10881 139 10563
2989 10563 16598 14703 6077 -5436 -14435 -16862 -11285 -724 10542 16637 14635 6623 -5016 -14307
3003 -14307 -16625 -11288 -707 9724 16405 14974 6631 -4551 -13717 -16671 -11897 -1366 9564
3016 9564 15927 15226 7310 -4228 -13284 -16250 -11814 -2444 9153 15982 14930 7661 -3473 -13015
3030 -13015 -16557 -12059 -2242 8469 15421 15237 7833 -3117 -12611 -16283 -12587 -2706 8022 15005
3044 15005 15075 8515 -2613 -12364 -15860 -12416 -3277 7502 14838 15039 8469 -1735 -11658 -15927 -12701
3059 -12701 -3438 6899 14120 15241 8846 -1711 -11105 -15778 -13050 -4052 6694 14204 14927 9193
3073 9193 -1186 -11045 -15654 -12841 -4783 6088 13921 14905 9431 -524 -10531 -15569 -13245 -4714
3087 -4714 5710 13482 15227 9601 -347 -9951 -15266 -13078 -5110 5319 13076 14861 10129 401
3101 401 -9723 -14962 -13331 -5386 4908 12878 14822 10073 603 -9100 -14598 -13510 -5790 4209 12376
3116 12376 15050 10337 850 -8791 -14327 -13579 -6454 3941 12279 14799 10501 1556 -8282 -14339 -13172
3131 -13172 -6696 3466 11977 14731 10918 1910 -7853 -14121 -13605 -6797 3050 11596 14712 10847 2264
3146 2264 -7559 -13786 -13733 -7199 2943 11406 14343 11227 2734 -7267 -13534 -13504 -7437 2183 10807
3161 10807 14357 11116 3100 -6660 -13368 -13745 -7666 1801 10497 14320 11339 3378 -6059 -12824 -14004
3176 -14004 -8333 1590 10097 14129 11371 3712 -5888 -12679 -13666 -8272 640 9482 14035 11812 4003
3191 4003 -5690 -12584 -13728 -8386 878 9292 13673 11814 4301 -4865 -12325 -13471 -8549 131 9245
3206 9245 13657 11670 4514 -4675 -11880 -13344 -8862 -329 8736 13285 12015 5206 -4263 -11459 -13359
3221 -13359 -9280 -442 8566 13186 12058 5266 -3815 -11097 -13433 -9315 -1112 7677 13059 12107 5481
3236 5481 -3473 -10952 -13474 -9243 -1202 7381 12718 12138 5966 -3096 -10623 -13334 -9808 -1863 7124
3251 7124 12426 12220 6013 -2698 -10334 -13056 -9863 -2088 6806 12377 12253 6382 -2689 -10131 -13091
3266 -13091 -10035 -2477 6427 12286 12481 7017 -1708 -9673 -12759 -10087 -2788 6159 12062 12180 6908
3281 6908 -1633 -9399 -12869 -10396 -3089 5636 11652 12588 7084 -1117 -8774 -12682 -10465 -3197 5298
3296 5298 11242 12314 7551 -964 -8965 -12523 -10615 -3676 5017 11533 12018 7702 -481 -8406 -12470
3311 -12470 -10524 -3956 4516 10955 12324 7827 -295 -7906 -12439 -10878 -4210 4630 10736 12543 7825
3326 7825 -76 -8163 -12132 -10842 -4480 3952 10528 12077 8249 480 -7409 -12115 -10789 -4805 3280
3341 3280 10091 12251 8411 417 -7050 -11625 -11194 -4924 3486 9933 12388 8368 1376 -6992 -11707
3356 -11707 -10854 -5271 2797 9898 11945 8499 1662 -6456 -11553 -11303 -5545 2418 9408 11903 8786
3371 8786 1419 -6131 -11160 -11237 -5797 2177 9161 12026 8989 2182 -5789 -11105 -11048 -5952 1912 8788
3387 8788 11655 9184 2743 -5772 -10722 -11229 -6064 1471 8711 11621 9415 2563 -5411 -10722 -11401
3402 -11401 -6444 1433 8394 11833 9629 2699 -4981 -10794 -11194 -6742 1023 8272 11519 9335 3159
3417 3159 -4633 -10374 -11372 -6670 502 7974 11360 9800 3344 -4400 -9880 -11149 -7029 139 7839
3432 7839 11299 9891 3744 -3915 -9934 -11106 -7239 -50 7076 11137 9868 4001 -3725 -9688 -10923
3447 -10923 -7579 -332 6949 10885 9830 4467 -3437 -9630 -11258 -7543 -497 6584 10640 10084 4234
3462 4234 -3001 -9028 -11129 -7914 -901 6544 10775 10172 4681 -2858 -8702 -10824 -7764 -1223 6270
3477 6270 10449 9881 4916 -2608 -8691 -10944 -8076 -1624 5916 10216 10249 5112 -2074 -8666 -10900 -8277
3493 -8277 -1350 5465 10091 10167 5273 -2071 -8327 -10487 -8151 -1987 5175 10181 10191 5478 -1464 -8261
3509 -8261 -10797 -8364 -2256 4812 9803 10343 5841 -1208 -7682 -10703 -8342 -2483 4660 9735 10124
3524 10124 6057 -1006 -7552 -10457 -8756 -2850 4362 9357 10240 6006 -793 -7260 -10525 -8434 -3082
3539 -3082 4152 9442 10401 6461 -467 -6906 -10241 -8899 -3358 3836 9050 10226 6474 -63 -6699
3554 -6699 -10213 -8997 -3641 3507 8775 10229 6596 195 -6214 -9931 -8921 -3796 3073 8569 10038
3569 10038 7022 505 -6174 -9816 -9362 -3843 2925 8566 10062 7189 682 -5909 -9673 -8914 -4218
3584 -4218 2698 8106 9930 7205 1256 -5456 -9465 -9179 -4525 2275 7933 9881 7270 1244 -5203
3599 -5203 -9252 -9043 -4360 1872 7642 9776 7584 1635 -5025 -9297 -9142 -5036 1900 7446 9683
3614 9683 7378 1764 -4888 -9327 -9187 -5093 1364 7513 9815 7915 2030 -4511 -8977 -9158 -5252
3629 -5252 1148 7068 9629 7841 2428 -4073 -8847 -9366 -5487 956 6891 9587 7972 2548 -3889
3644 -3889 -8675 -9268 -5397 298 6593 9476 8039 2619 -3890 -8719 -9423 -6095 374 6456 9361
3659 9361 7998 3098 -3498 -8314 -9202 -6006 144 5907 9346 8088 3349 -3079 -8368 -9530 -6013
3674 -6013 -426 5848 9227 8268 3199 -2736 -7887 -9210 -6363 -186 5455 9142 8502 3624 -2456
3689 -2456 -7834 -9271 -6469 -652 5405 9065 8519 3831 -2418 -7501 -9217 -6430 -950 4976 8891
3704 8891 8672 4036 -2131 -7395 -9296 -6832 -1326 4916 8651 8385 4485 -1756 -6946 -8888 -6749
3719 -6749 -1526 4642 8362 8510 4650 -1456 -6893 -9239 -7067 -1666 4486 8425 8476 4829 -1055 -6763
3735 -6763 -8925 -7166 -2154 4154 8242 8319 4907 -1055 -6553 -9053 -7329 -2066 3961 7933 8895 5059
3751 5059 -1201 -6371 -8951 -7191 -2531 3558 8257 8560 5254 -496 -6044 -8777 -7386 -2566 3511
3766 3511 7897 8552 5484 -302 -5846 -8888 -7606 -2762 3100 7499 8402 5677 -205 -5914 -8753
3781 -8753 -7616 -2971 3133 7714 8721 5689 294 -5713 -8459 -7570 -3231 2942 7318 8732 5517
3796 5517 434 -5292 -8447 -7875 -3240 2428 6976 8743 6006 539 -5151 -8354 -7666 -3674 2133
3811 2133 7135 8615 6064 850 -4632 -8175 -7806 -3750 1847 6878 8328 6069 948 -4868 -7871
3826 -7871 -7905 -4141 1814 6663 8465 6213 1218 -4317 -7938 -7602 -4006 1470 6348 8637 6637 1777
3842 1777 -4153 -7894 -7688 -4162 1236 5971 8206 6786 1642 -3837 -7590 -8061 -4645 905 6052
3857 6052 8025 6575 2224 -3830 -7515 -7857 -4636 635 5713 7894 6960 2296 -3181 -7095 -7729 -4938
3873 -4938 562 5373 7945 6877 2341 -2980 -7137 -7628 -5066 97 5340 7640 6660 2582 -2974
3888 -2974 -7190 -7828 -4980 -97 4976 7878 6876 2745 -2723 -6701 -7878 -5223 -92 5010 7596
3903 7596 6910 2847 -2624 -6335 -7752 -5259 -569 4902 7559 6886 2861 -2101 -6505 -7716 -5469
3918 -5469 -760 4149 7254 7082 3548 -2063 -6211 -7779 -5465 -762 4340 7288 7067 3489 -1576
3933 -1576 -5841 -7812 -5582 -896 4158 7111 6852 3707 -1516 -5878 -7348 -5722 -1131 3970 7054
3948 7054 7252 3797 -1076 -5833 -7605 -5681 -1518 3509 6911 7026 3844 -1044 -5562 -7510 -5787
3963 -5787 -1775 3136 6838 7123 4284 -815 -5339 -7298 -6100 -1885 3146 6761 7050 4558 -675
3978 -675 -4859 -7429 -6251 -2234 2773 6344 6969 4630 -236 -5238 -7162 -6123 -2194 2856 6326
3993 6326 7047 4447 46 -4457 -7053 -6334 -2439 2156 6287 7091 4699 367 -4540 -6982 -6204 -2688
4009 -2688 2470 5895 7062 4898 520 -4359 -6914 -6402 -2657 1783 5836 7213 4748 489 -4239
4024 -4239 -6986 -6362 -3074 1756 5721 6990 5113 329 -3923 -6440 -6560 -3149 1780 5514 6809
4039 6809 5102 932 -3757 -6645 -6380 -3163 1141 5277 6865 5113 954 -3632 -6385 -6405 -3505 1093
4055 1093 5162 6876 5394 1361 -3375 -6675 -6424 -3399 943 5162 6787 5373 1842 -2752 -6220
4070 -6220 -6601 -3687 707 4908 6653 5410 1520 -2715 -5979 -6451 -3809 702 4763 6487 5446
4085 5446 1999 -2653 -6094 -6536 -4135 434 4676 6498 5472 2083 -2645 -5827 -6640 -3952 230
4100 230 4220 6458 5756 2354 -2145 -5608 -6438 -4525 345 4282 6275 5724 2409 -1996 -5359 -6094
4116 -6094 -4177 -212 4034 6141 5549 2207 -1677 -5525 -6500 -4420 -477 3712 6160 5783 2420 -1541
4132 -1541 -5111 -6079 -4475 -516 3337 6124 5604 2933 -1535 -5098 -6163 -4633 -661 3391 6251
4147 6251 5946 2681 -1262 -4905 -6248 -4449 -763 3180 5983 5762 3037 -936 -4868 -6085 -4709
4162 -4709 -1005 2890 5652 5547 3152 -924 -4645 -6239 -4825 -1401 2720 5623 5638 3338 -661 -4464
4178 -4464 -5987 -4937 -1507 2654 5489 5702 3534 -559 -4358 -5841 -5067 -1422 2469 5301 5612 3439
4194 3439 -549 -4109 -5870 -4780 -1676 2364 5000 5554 3564 -382 -4119 -6011 -4985 -1667 2077
4209 2077 5133 5865 3512 -250 -4061 -5604 -5207 -1857 1825 4936 5811 3735 -60 -3854 -5674 -5168
4225 -5168 -1970 1885 4752 5656 4082 -39 -3473 -5544 -4997 -2125 1599 4629 5800 3939 379
4240 379 -3253 -5502 -5164 -2296 1099 4512 5659 3925 720 -3104 -5221 -5168 -2441 987 4408 5329
4256 5329 3917 661 -2872 -5071 -5125 -2544 1321 4204 5336 4398 909 -2715 -4980 -5276 -2800 1166
4272 1166 4143 5432 4209 1096 -2393 -5210 -5392 -2878 839 3800 5262 4404 1014 -2326 -4761
4287 -4761 -4847 -3004 716 3645 5512 4244 1171 -2332 -4749 -5067 -3180 344 3647 5315 4824 1400
4303 1400 -2010 -4731 -5051 -3127 285 3410 5381 4340 1430 -1852 -4473 -4981 -3267 28 3073
4318 3073 4990 4435 2081 -1902 -4505 -5013 -3368 -35 3232 4844 4470 2081 -1657 -4317 -5127 -3524
4334 -3524 -49 3074 5117 4674 2125 -1703 -4293 -4988 -3457 -455 3022 4753 4551 2096 -1342 -4223
4350 -4223 -5175 -3579 -308 2962 4928 4664 2022 -1229 -3906 -5003 -3642 -723 2725 4809 4627 2293
4366 2293 -1062 -3935 -4824 -3756 -681 2584 4703 4438 2399 -902 -3979 -4636 -3690 -937 2424 4635
4382 4635 4642 3030 -863 -3441 -5077 -3632 -973 2018 4527 4683 2719 -712 -3533 -4851 -3776 -1177
4398 -1177 2149 4179 4359 2724 -501 -3509 -4834 -3990 -1113 2046 4327 4593 2976 -458 -3504 -4800
4414 -4800 -3963 -1233 2109 4248 4439 2752 -183 -3389 -4739 -3890 -1757 1754 4106 4544 3124 41
4430 41 -2954 -4576 -3947 -1998 1555 4112 4400 3145 25 -2737 -4551 -3968 -1742 1552 3997 4399
4446 4399 2823 181 -2907 -4440 -4095 -1762 1680 3808 4592 3039 434 -2805 -4310 -4260 -1756 1173
4462 1173 3854 4480 3371 503 -2441 -4389 -3969 -2015 1070 3724 4482 3297 520 -2596 -4302 -4081
4478 -4081 -1866 1077 3433 4585 3355 787 -2354 -4217 -4062 -1996 957 3495 4382 3230 756
4493 756 -2109 -4375 -4201 -2187 733 3335 4437 3331 693 -2076 -4156 -4088 -2447 561 3214 4258
4509 4258 3475 891 -1946 -3918 -4062 -2321 364 3026 4079 3435 1074 -1893 -3978 -3883 -2339 556
4525 556 3227 4309 3458 1094 -1853 -3908 -4065 -2419 60 2927 4000 3260 1201 -1397 -3790 -4067
4541 -4067 -2789 323 2850 3781 3537 1275 -1617 -3586 -4139 -2496 118 2966 3982 3705 1478 -1558
4557 -1558 -3472 -4268 -2452 71 2622 3946 3739 1591 -1061 -3535 -4126 -2738 -251 2521 3939 3858
4573 3858 1556 -999 -3562 -3888 -2827 -249 2255 3737 3935 1568 -1069 -3202 -3892 -2800 -521 2184
4589 2184 3801 3444 1495 -1097 -3322 -4120 -3020 -597 2227 3825 3727 1896 -683 -3344 -3835 -2935
4605 -2935 -544 1905 3823 3833 2078 -767 -2966 -4068 -3127 -765 2109 3964 3882 1858 -771 -2809
4621 -2809 -3892 -3068 -762 1907 3766 3708 1872 -617 -2964 -3997 -3057 -889 1861 3584 3607 2140
4637 2140 -446 -2931 -3978 -3120 -1031 1738 3486 3791 2031 -378 -2892 -3631 -3010 -1137 1424 3389
4653 3389 3778 2396 -128 -2706 -3844 -3190 -910 1512 3513 3534 2408 -4 -2451 -3785 -3116 -1470
4669 -1470 1439 3307 3902 2512 -110 -2638 -3772 -3314 -1171 1244 3413 3648 2484 25 -2362 -3800
4685 -3800 -3220 -1467 1548 3184 3627 2532 16 -2248 -3642 -3193 -1530 1331 3427 3645 2717 245
4701 245 -2280 -3654 -3204 -1672 944 3151 3663 2674 131 -2011 -3705 -3764 -1548 885 3332 3765 2676
4718 2676 552 -2131 -3444 -3552 -1792 998 2989 3686 2731 715 -1925 -3327 -3347 -1738 827 2812
4734 2812 3765 3060 594 -1685 -3514 -3215 -1855 817 2876 3709 2994 642 -1808 -3197 -3179 -1870 575
4751 575 2674 3525 3021 973 -1835 -3360 -3747 -1894 389 2701 3764 3041 779 -1681 -3220 -3196 -2134
4768 -2134 459 2789 3567 2648 953 -1650 -3254 -3406 -2212 38 2280 3516 2911 1212 -1311 -3257
4784 -3257 -3300 -2094 206 2393 3708 3069 1095 -1528 -3346 -3568 -2232 265 2500 3684 3171 1083
4800 1083 -1233 -3166 -3715 -2360 -141 2379 3500 3239 1454 -1180 -3014 -3442 -2334 153 2162 3525
4816 3525 3151 1350 -1121 -3149 -3718 -2492 -252 2118 3654 2947 1464 -982 -2938 -3791 -2399 -472
4832 -472 2118 3466 3461 1565 -1022 -2984 -3732 -2725 -581 1971 3513 3387 1747 -908 -2847 -3410 -2512
4849 -2512 -493 1943 3313 3379 1659 -920 -2711 -3633 -2609 -568 1927 3636 3574 1934 -882 -2936
4865 -2936 -3738 -2646 -573 1657 3434 3452 1707 -482 -2961 -3749 -2610 -627 1785 3316 3455 1916
4881 1916 -378 -2558 -3575 -3013 -686 1693 3264 3153 1886 -367 -2563 -3468 -2924 -847 1516 3251
4897 3251 3550 1833 -367 -2490 -3205 -3081 -998 1669 3174 3637 2065 -339 -2406 -3312 -3017 -994
4913 -994 1220 3270 3314 1962 -127 -2444 -3447 -3477 -1244 1389 3058 3319 2031 75 -2355 -3158 -3098
4930 -3098 -1045 1114 2999 3196 2394 270 -2209 -3315 -3207 -1157 1138 2866 3306 2463 116 -2135
4946 -2135 -3261 -2909 -1208 1019 2872 3524 2330 189 -1908 -3375 -3160 -1336 1034 2957 3213 2419
4962 2419 618 -1920 -3240 -3404 -1397 779 2712 3425 2299 280 -2022 -3558 -2913 -1655 905 2877
4978 2877 3248 2475 464 -1829 -3434 -3349 -1739 670 2607 3180 2624 530 -1618 -3250 -3116 -1707 638
4995 638 2819 3568 2678 354 -1721 -3182 -3007 -1755 238 2563 3266 2687 681 -1608 -2857 -3364 -1638
5012 -1638 684 2447 3401 2708 582 -1594 -3052 -3354 -1917 536 2382 3427 2720 659 -1481 -3036
5028 -3036 -3008 -1997 282 2385 3396 2908 938 -1293 -3024 -3647 -1984 43 2164 3556 2781 928
5044 928 -1401 -2984 -3334 -1881 44 2180 3170 2918 1177 -1318 -2873 -3337 -2089 -39 2303 3114
5060 3114 2866 1034 -1011 -2769 -2955 -2094 -49 2010 3144 3170 1278 -884 -3001 -3191 -2195 -96 1862
5077 1862 3411 2949 1306 -957 -2929 -3251 -2416 -115 1723 3216 3171 1344 -838 -2585 -3373 -2539 -454
5094 -454 1699 3245 2990 1527 -682 -2734 -3179 -2591 -490 1829 3273 2931 1547 -631 -2599 -3237
5110 -3237 -2725 -635 1807 3227 3086 1730 -387 -2114 -3361 -2809 -715 1406 2975 3083 1711 -364
5126 -364 -2450 -3524 -2588 -767 1453 2898 3164 2044 -374 -2437 -3199 -2738 -1062 1334 3010 3228
5142 3228 1849 -428 -2455 -3337 -2584 -916 1484 3040 3282 2142 -228 -2099 -3354 -2573 -896 1336
5158 1336 3033 3237 2052 -142 -2052 -3414 -2731 -1043 1416 3095 3077 2111 146 -2103 -3462 -2770
5174 -2770 -1128 998 2776 3245 2047 330 -2364 -3161 -2761 -1217 1045 2793 3252 2265 213 -2222
5190 -2222 -2950 -2897 -1029 1182 2658 3387 2229 309 -2014 -3165 -2867 -1306 896 2600 3218 2326 442
5207 442 -1851 -3095 -2967 -1167 559 2464 3406 2480 269 -1869 -3049 -3009 -1522 828 2601 3135 2619
5224 2619 265 -1784 -2956 -3277 -1728 701 2588 3372 2720 668 -1425 -2865 -2995 -1569 546 2362
5240 2362 3415 2424 784 -1624 -3071 -3108 -1834 451 2420 3160 2600 755 -1540 -2783 -3139 -1896
5256 -1896 234 2388 3231 2746 892 -1546 -2823 -3163 -1885 406 2274 3274 2598 1045 -1435 -2961
5272 -2961 -3048 -1639 147 2069 3460 2597 1159 -1036 -2980 -3326 -2110 203 2279 3070 2581 949
5288 949 -1519 -2819 -3121 -1914 176 2082 3157 2905 1195 -1141 -2878 -3148 -2019 -190 2125 3022
5304 3022 3068 1254 -823 -2823 -3268 -1974 -56 2033 3170 2722 1109 -891 -2759 -3053 -2263 -255
5320 -255 1726 2912 2859 1281 -899 -2606 -3010 -2215 -468 1813 3238 2949 1312 -812 -2403 -3261 -1821
5337 -1821 -447 1958 2720 2964 1525 -562 -2516 -3284 -2270 -446 1518 2842 2919 1462 -638 -2443
5353 -2443 -3181 -2380 -462 1428 3096 2881 1567 -540 -2338 -3165 -2607 -738 1259 2801 2889 1675 -301
5370 -301 -2464 -3245 -2582 -720 1467 2829 3032 1904 -438 -2294 -3265 -2502 -784 1371 2982 2775 1907
5387 1907 -445 -2201 -2995 -2401 -996 926 2950 2821 1876 -47 -2182 -2954 -2630 -1128 1013 2675
5403 2675 2999 1960 218 -2201 -2902 -2483 -1204 1085 2678 2983 1855 110 -1980 -3176 -2682 -1068
5419 -1068 1085 2548 2793 1886 -135 -1805 -2795 -2431 -1218 855 2517 3106 2266 198 -2013 -2805 -2787
5436 -2787 -1188 705 2325 2752 2217 253 -2091 -2935 -2767 -1428 678 2549 2868 2129 352 -1544
5452 -1544 -3107 -2702 -1364 405 2396 2827 2105 550 -1424 -2730 -2736 -1369 578 2208 3046 2421 567
5469 567 -1697 -2782 -2818 -1458 411 2110 2950 2359 793 -1301 -2565 -2802 -1428 387 2273 3042 2182
5486 2182 645 -1674 -2723 -2810 -1778 470 2046 3101 2389 589 -1218 -2680 -3030 -1864 341 2188
5502 2188 3039 2270 642 -1322 -2587 -2577 -1818 256 1988 2984 2185 815 -1009 -2711 -2972 -1970 140
5519 140 2038 2600 2708 1068 -1333 -2454 -2874 -1859 -110 1775 2813 2526 996 -915 -2366 -2854
5535 -2854 -1876 -187 1746 2961 2680 991 -927 -2638 -2861 -1983 -215 1675 2615 2668 972 -766 -2354
5552 -2354 -2855 -2041 -326 1517 2842 2528 1152 -843 -2306 -3263 -2258 -306 1844 2661 2735 1421 -666
5569 -666 -2109 -3205 -2119 -411 1453 2745 2622 1311 -967 -2097 -2604 -2232 -455 1543 2587 2721
5585 2721 1505 -474 -2065 -2703 -2247 -455 1444 2457 2543 1422 -660 -2073 -3155 -2170 -679 1201
5601 1201 2715 2458 1699 -562 -2116 -3068 -2385 -640 1113 2869 2633 1536 -356 -2247 -2779 -2360 -878
5618 -878 1221 2557 2714 1613 -335 -1984 -2712 -2472 -749 1151 2523 2716 1666 -168 -1834 -2581
5634 -2581 -2578 -982 1132 2664 2724 1704 -194 -1780 -2940 -2649 -775 1068 2221 2549 1569 152 -1784
5651 -1784 -2692 -2324 -1018 1048 2186 2756 1921 152 -1826 -2723 -2407 -946 925 2466 2719 1994 261
5668 261 -1692 -2627 -2395 -898 674 2285 2692 1817 195 -1684 -2807 -2617 -1371 793 2320 2822 1958
5685 1958 285 -1639 -2832 -2694 -1256 564 2098 2770 2216 289 -1575 -2966 -2644 -1218 635 2237
5701 2237 2738 2415 466 -1316 -2419 -2488 -1408 505 1900 2817 1843 370 -1380 -2493 -2601 -1408 463
5718 463 1989 2698 2023 678 -1234 -2434 -2622 -1261 381 2002 2711 2213 616 -1052 -2541 -2696 -1431
5735 -1431 61 1881 2615 2602 563 -842 -2386 -2609 -1454 220 1993 2852 2222 919 -1036 -2416
5751 -2416 -2602 -1801 105 1672 2551 2592 993 -1055 -2443 -2541 -1629 -223 1805 2687 2356 706 -681
5768 -681 -2459 -2676 -1750 -138 1941 2662 2287 851 -735 -2047 -2551 -1667 -152 1562 2695 2348 823
5785 823 -832 -2228 -2700 -1867 -122 1923 2908 2480 1393 -537 -2376 -2607 -1981 -229 1562 2404 2346
5802 2346 1344 -957 -2133 -2663 -1791 -466 1275 2503 2441 1320 -332 -2141 -2600 -2358 -429 1358
5818 1358 2423 2514 1339 -431 -2090 -2627 -2087 -568 1156 2611 2761 1491 -376 -1982 -2727 -1850 -494
5835 -494 1166 2481 2364 1481 -64 -1869 -2950 -2017 -787 940 2097 2494 1710 -273 -1731 -2644 -2054
5852 -2054 -757 628 2065 2541 1684 -111 -1711 -2391 -2228 -559 1020 2232 2413 1913 -14 -1817
5868 -1817 -2602 -1953 -717 1107 2213 2589 1744 57 -1694 -2588 -2527 -1007 1167 2215 2423 1693 15
5885 15 -1746 -2516 -1954 -1084 609 2503 2525 1749 462 -1318 -2359 -2431 -1036 719 2162 2572 1676 -38
5903 -38 -1772 -2697 -2185 -1106 488 1922 2482 1697 215 -1346 -2424 -2361 -957 662 1915 2278 1821
5920 1821 520 -1188 -2372 -2528 -1251 457 2183 2658 1880 595 -1110 -2309 -2495 -1282 426 1692
5936 1692 2409 1950 352 -991 -2213 -2305 -1357 644 1831 2297 1953 554 -1005 -2335 -2774 -1392 584
5953 584 1728 2486 2058 555 -949 -2103 -2443 -1382 144 1691 2394 1967 702 -899 -2367 -2560 -1582
5970 -1582 18 1740 2414 2082 704 -1080 -2067 -2358 -1728 223 1871 2484 2099 762 -909 -2150 -2468
5987 -2468 -1713 37 1538 2488 2066 1135 -959 -2245 -2221 -1646 -227 1411 2437 2240 922 -960 -2010
6004 -2010 -2462 -1661 5 1499 2371 2167 966 -621 -1710 -2586 -1766 -284 1470 2355 2106 1106 -509
6021 -509 -1942 -2659 -1655 -422 1317 2392 2448 803 -793 -1846 -2419 -1818 -534 1244 2125 2339 1294
6038 1294 -530 -2057 -2317 -1708 -510 1229 2323 2383 1023 -241 -1642 -2434 -1826 -545 992 2251
6054 2251 2238 1165 -300 -1849 -2418 -1722 -717 1194 1919 2350 1415 -287 -1661 -2454 -1930 -665 1009
6071 1009 2025 2332 1320 -295 -1946 -2258 -2135 -758 989 2294 2492 1434 16 -1625 -2226 -2074
6087 -2074 -757 827 2094 2575 1558 -258 -1559 -2362 -1877 -978 802 2142 2530 1353 -100 -1471
6103 -1471 -2310 -2212 -1046 987 2268 2363 1733 109 -1478 -2183 -1954 -922 590 1841 2241 1719 -64
6120 -64 -1487 -2358 -2156 -784 621 1849 2283 1698 221 -1250 -2301 -2140 -931 600 1609 2196 1797
6137 1797 397 -1104 -2481 -2219 -1115 364 1961 2224 1416 415 -1339 -2324 -2368 -1209 398 1679
6153 1679 2457 1904 403 -1046 -1981 -2191 -1160 161 1703 2184 1886 571 -932 -2002 -2050 -1268 188
6170 188 1948 2228 1659 647 -1151 -2171 -2299 -1283 -106 1415 2240 1843 412 -761 -1757 -2486 -1210
6187 -1210 288 1524 2140 1901 701 -816 -1904 -2212 -1279 64 1598 2528 1903 867 -969 -1797 -2304
6204 -2304 -1549 -65 1599 2233 1964 832 -682 -1762 -2418 -1454 143 1388 2219 2325 1036 -542 -1914
6221 -1914 -2177 -1613 -87 1435 2069 2125 991 -452 -1855 -2416 -1666 -52 1172 1872 2177 1121 -607
6238 -607 -1804 -2233 -1715 -272 1035 1938 2261 903 -595 -1796 -2357 -2116 -388 1273 2150 2136 1198 -366
6256 -366 -1825 -2339 -1851 -333 846 2323 1964 1196 -81 -1547 -2218 -1698 -512 921 2063 2176 1315
6273 1315 -183 -1596 -2367 -2101 -705 721 1934 2080 1401 26 -1522 -2283 -1944 -651 875 2080
6289 2080 2305 1353 65 -1428 -2280 -1906 -756 982 2155 2176 1256 143 -1233 -2277 -1922 -854 901
6306 901 1917 2372 1284 69 -1196 -2170 -2138 -709 545 1645 2164 1472 125 -1223 -1845 -1731 -780
6323 -780 547 1859 2189 1250 212 -1420 -2286 -2111 -1277 621 1580 2040 1501 611 -928 -1980 -2108 -903
6341 -903 210 1589 2075 1577 319 -1197 -1803 -1980 -824 370 1841 2078 1633 448 -1131 -2058 -2169
6358 -2169 -1208 247 1697 2106 1440 668 -847 -1850 -2024 -1313 456 1364 2148 1526 562 -921 -2066
6375 -2066 -1981 -1379 275 1661 2302 1671 501 -683 -1962 -2053 -1138 194 1341 2212 1719 653 -560
6392 -560 -1837 -2061 -1357 -171 1278 2096 1826 664 -696 -1849 -2031 -1470 161 1269 2178 1840 940
6409 940 -635 -1798 -2066 -1685 -276 1266 2250 1831 954 -407 -1751 -1886 -1622 -422 1322 1795 2017
6426 2017 935 -532 -1570 -1935 -1550 -107 842 2099 1872 841 -645 -1580 -2190 -1564 -186 984 2062
6443 2062 1973 883 -478 -1405 -2133 -1381 -356 874 1887 1753 1120 -280 -1335 -2272 -1687 -648 871
6460 871 2013 2218 968 126 -1457 -1971 -1733 -486 933 1917 2077 1049 -237 -1247 -1971 -1841 -601
6477 -601 663 1724 1957 1231 -167 -1339 -1824 -1644 -884 746 1734 1977 1151 -3 -1134 -1976 -1752 -606
6495 -606 612 1659 2088 1105 -124 -1052 -2141 -1741 -823 543 1617 1955 1496 431 -1235 -2028 -1894
6512 -1894 -993 371 1783 2273 1719 407 -1139 -1831 -1544 -1288 454 1367 2166 1493 505 -953 -1754 -1879
6530 -1879 -1073 687 1637 1999 1466 363 -881 -1938 -1871 -1151 333 1559 2056 1551 342 -743 -1806
6547 -1806 -1662 -1134 201 1303 2135 1417 371 -888 -1644 -1746 -1133 171 1298 1700 1722 548 -856
6564 -856 -1630 -2104 -1088 140 1403 1843 1618 505 -929 -1713 -1966 -1351 -70 1317 2007 1601 595
6581 595 -885 -1419 -1865 -1333 -84 1254 1798 1525 524 -564 -1436 -1709 -1243 18 1506 1824 1685 836
6599 836 -554 -1392 -1579 -1503 -365 1075 1710 1645 696 -400 -1651 -1749 -1409 -76 1263 1611 1545 859 -80
6618 -80 -1456 -1953 -1550 -282 800 1521 1831 1100 -231 -1314 -1909 -1565 -234 663 1848 1837 1054 -226
6636 -226 -1148 -1688 -1343 -322 599 1965 2035 953 -415 -1110 -1794 -1344 -404 802 1834 1714 887 -131
6654 -131 -1295 -1837 -1399 -479 767 1548 1724 1072 -273 -1409 -1745 -1867 -843 694 1649 1643 860 -133 -1124
6673 -1124 -1667 -1560 -641 652 1604 1932 1201 133 -1148 -1661 -1458 -781 475 1405 1914 1243 284 -861
6691 -861 -2003 -1580 -852 368 1434 1858 1492 168 -863 -1796 -1708 -1075 384 1443 1669 1311 165 -1032
6709 -1032 -1742 -1700 -937 159 1144 1927 1579 507 -732 -1768 -1532 -964 373 1512 2076 1371 455 -784
6727 -784 -1859 -1699 -1045 319 1310 1770 1462 270 -715 -1743 -1738 -1082 268 1332 1962 1448 507 -787
6745 -787 -1645 -1688 -978 322 1210 1775 1655 546 -807 -1364 -1699 -1184 233 1147 1762 1932 598 -628
6763 -628 -1808 -1702 -1351 -26 1108 1492 1381 486 -518 -1505 -1892 -1210 -243 976 1708 1831 878 -559
6781 -559 -1417 -1742 -1425 -345 1196 1661 2011 886 -536 -1385 -1813 -1404 -292 910 1886 1787 875 -239
6799 -239 -1509 -1726 -1145 -324 1063 1582 1845 899 -264 -1266 -1632 -1155 -301 638 1732 1993 897 -351
6817 -351 -1330 -1749 -1449 -441 765 1565 1746 1055 74 -1445 -1784 -1555 -459 894 1664 1730 1112 6
6835 6 -1247 -1739 -1352 -409 865 1791 1881 1107 -245 -1178 -1842 -1294 -554 894 1470 1853 1288 28 -1140
6854 -1140 -1775 -1491 -516 365 1503 1996 1341 146 -914 -1804 -1595 -611 424 1524 1839 1385 92 -1171
6872 -1171 -1725 -1381 -929 445 1494 1717 1217 104 -991 -1599 -1853 -695 462 1422 1638 1448 458 -1044
6890 -1044 -1580 -1700 -691 396 1431 1662 1501 157 -784 -1805 -1668 -898 501 1502 1745 1139 424
6907 424 -770 -1682 -1899 -902 80 1272 1677 1424 513 -854 -1653 -1788 -936 215 1235 1714 1654 484
6925 484 -767 -1643 -1725 -1248 150 1203 1648 1431 554 -722 -1706 -1831 -978 114 1371 1812 1647 589
6943 589 -534 -1639 -1827 -1033 -60 1013 1710 1569 579 -483 -1160 -1760 -1141 50 1174 1656 1596 714
6961 714 -509 -1403 -1701 -1308 -291 1024 1842 1653 813 -134 -1343 -2009 -1323 -129 810 1745 1772 759
6979 759 -205 -1456 -1756 -1366 -244 960 1580 1782 1050 -319 -1405 -1926 -1586 -510 1052 1642 1719 944
6997 944 -70 -1211 -1820 -1262 -149 942 1964 1622 919 -104 -1187 -1647 -1459 -596 696 1763 1519
7014 1519 891 -163 -1279 -1739 -1382 -559 758 1585 1712 1225 -3 -1017 -1622 -1289 -312 535 1491 1649
7032 1649 1174 -113 -944 -1735 -1627 -623 748 1771 1761 870 -91 -1027 -1713 -1434 -797 692 1169 2036
7050 2036 970 214 -795 -1511 -1545 -752 504 1596 1811 1102 9 -901 -1593 -1508 -469 489 1278 1575
7068 1575 1104 119 -1048 -1818 -1468 -662 328 1402 1777 1377 42 -1151 -1549 -1619 -824 474 1168 1730
7086 1730 1167 197 -780 -1579 -1398 -913 298 1282 1602 1729 150 -919 -1539 -1442 -1011 228 1523 1769
7104 1769 983 528 -657 -1512 -1679 -513 221 1260 1772 1263 689 -592 -1692 -1845 -1040 160 1051 1501
7122 1501 1348 632 -937 -1609 -1586 -991 201 1155 1754 1157 809 -893 -1659 -1550 -936 213 1040 1703 1306
7141 1306 728 -581 -1564 -1531 -1293 -156 1107 1811 1374 644 -595 -1420 -1379 -866 -195 1182 1804 1259 861
7160 861 -751 -1447 -1550 -1257 -259 1053 1370 1577 566 -513 -1109 -1675 -1387 -406 907 1661 1611 840 -381
7179 -381 -1410 -1729 -1186 -137 928 1634 1570 1087 -190 -1103 -1993 -1329 -164 828 1736 1610 946 -366
7197 -366 -1192 -1804 -1391 -282 791 1697 1574 985 -288 -1287 -1705 -1252 -365 937 1762 1625 922 22 -1306
7216 -1306 -1747 -1404 -380 862 1423 1717 1078 -21 -1162 -1646 -1432 -524 887 1701 1421 1012 -23 -1278
7234 -1278 -1685 -1229 -407 578 1526 1687 1023 -19 -757 -1687 -1413 -747 552 1511 1677 1140 79 -971
7252 -971 -1644 -1571 -562 610 1421 1532 1385 77 -1241 -1690 -1364 -788 376 1242 1813 1273 21 -805
7270 -805 -1579 -1319 -796 129 1385 1468 1325 53 -786 -1583 -1407 -820 260 1280 1849 1066 325 -699 -1443
7289 -1443 -1717 -863 516 1401 1535 986 198 -576 -1385 -1547 -752 119 1282 1630 1497 354 -662 -1662
7307 -1662 -1616 -997 90 1534 1583 1515 435 -694 -1661 -1470 -1070 -24 1214 1878 1566 148 -748 -1758
7325 -1758 -1698 -1111 -236 1182 1597 1591 562 -969 -1524 -1635 -1153 198 1323 1709 1312 415 -630 -1494 -1795
7344 -1795 -1268 -101 974 1682 1349 533 -443 -1358 -1685 -1041 -190 949 1573 1484 645 -563 -1459 -1526 -1201
7363 -1201 -437 935 1376 1244 705 -369 -1447 -1596 -1022 -306 762 1428 1474 784 -340 -1318 -1454 -1107
7381 -1107 -129 1109 1647 1343 640 -48 -1171 -1577 -856 -490 674 1484 1649 738 -203 -1076 -1795 -1301 -168
7400 -168 953 1471 1479 834 -110 -1229 -1604 -1165 -396 790 1632 1723 823 -76 -979 -1553 -1542 -358 841 1627
7420 1627 1624 937 -119 -1132 -1863 -1225 -372 693 1357 1447 1109 65 -1036 -1674 -1664 -257 674 1203 1559
7439 1559 1036 198 -1168 -1551 -1393 -627 410 1332 1428 1150 9 -894 -1463 -1400 -543 435 1361 1511 1035
7458 1035 95 -863 -1459 -1454 -341 592 1198 1437 898 280 -1058 -1622 -1479 -733 349 1154 1417 1132 260
7477 260 -925 -1675 -1603 -589 396 1241 1355 1217 402 -817 -1412 -1411 -930 112 1321 1785 1083 353 -585
7496 -585 -1555 -1438 -716 119 1230 1673 1053 390 -590 -1300 -1499 -807 289 917 1372 1198 313 -576 -1639
7515 -1639 -1518 -1001 -108 885 1448 1257 496 -592 -1539 -1714 -936 224 687 1746 1332 588 -679 -1231
7533 -1231 -1350 -1016 21 946 1398 1218 461 -655 -1567 -1421 -1014 -64 1060 1711 1260 567 -313 -991 -1385
7552 -1385 -1080 -117 905 1336 1141 637 -462 -1340 -1513 -1045 -29 722 1295 1278 632 -671 -1186 -1574 -959
7571 -959 -95 634 1578 1390 595 -283 -1078 -1517 -719 -301 698 1290 1420 650 -241 -1163 -1513 -1111 -269 727
7591 727 1439 1364 829 -58 -1002 -1250 -965 -320 436 1220 1613 668 -76 -1018 -1454 -1165 -296 511 1489 1423 775
7612 775 -244 -1162 -1370 -1102 -469 726 1251 1278 888 178 -1091 -1277 -1273 -526 403 1302 1328 1057 56 -1126
7632 -1126 -1196 -1142 -455 384 1350 1411 1069 -102 -780 -1156 -1203 -484 625 1159 1425 784 3 -816 -1338 -1026
7652 -1026 -664 215 1166 1465 1136 -151 -690 -1409 -1221 -537 261 1432 1056 1021 57 -927 -1176 -1302 -1031
7671 -1031 398 1028 1353 743 150 -414 -1242 -1211 -896 301 902 1501 918 195 -774 -1290 -1428 -890 98
7690 98 774 1456 891 215 -332 -1380 -1233 -730 181 943 1325 1351 517 -585 -1358 -1305 -513 31 1031 1555
7710 1555 1194 410 -509 -1331 -1288 -975 54 935 1493 1105 510 -351 -1122 -1470 -985 -149 846 1457 1219 418
7730 418 -451 -1157 -1159 -1149 -153 884 1314 1090 715 -58 -1353 -1277 -744 79 557 1162 1080 455 -341 -1007 -993
7751 -993 -756 -158 711 1118 1165 737 -241 -789 -1262 -1028 -97 543 1214 1133 464 -11 -1097 -1368 -889 -316
7771 -316 542 1248 1185 786 -228 -1180 -1351 -1015 -289 909 1124 1240 721 -106 -863 -1045 -852 -382 812
7790 812 1361 1341 679 -197 -900 -1062 -978 -358 419 1408 899 999 -88 -867 -1188 -1077 -348 589 1307 832
7810 832 698 -61 -1016 -1188 -1177 -304 307 1090 1122 732 -63 -939 -1301 -1113 -388 541 858 1268 761 -231 -343
7831 -343 -1145 -993 -352 447 987 1225 674 159 -665 -1046 -914 -285 460 1064 1222 1038 -22 -701 -1222 -1131
7851 -1131 -457 368 793 1078 786 143 -626 -1281 -998 -600 200 776 1105 842 163 -717 -1122 -1314 -705 170
7871 170 953 1004 909 249 -562 -1345 -984 -581 270 807 1250 944 54 -575 -1177 -1103 -620 101 722 1193 849
7892 849 244 -410 -851 -1223 -516 -78 571 1330 774 229 -480 -786 -944 -616 121 882 991 940 313 -244
7912 -244 -912 -1160 -600 65 561 1163 1309 409 -328 -830 -924 -690 -193 685 878 706 613 -198 -779 -1036 -564
7933 -564 -36 565 1070 1003 312 -202 -878 -1223 -965 -22 611 1023 821 575 -9 -481 -1359 -581 -203 537
7953 537 729 896 574 -473 -632 -1066 -706 -323 558 981 1110 502 124 -610 -874 -755 -278 574 687 904
7973 904 704 -161 -869 -996 -737 -427 301 879 916 470 -224 -744 -1153 -598 -77 417 993 802 629 110
7993 110 -495 -1166 -1156 -419 212 783 1013 869 297 -689 -650 -694 -557 419 620 798 668 44 -516 -925 -842
8014 -842 -354 157 756 1162 964 129 -466 -1117 -719 -384 14 501 961 755 155 -508 -997 -1103 -582 102
8034 102 869 856 598 257 -569 -642 -956 -334 327 770 1062 721 254 -454 -640 -735 -96 287 670 837 552
8055 552 234 -419 -818 -911 -431 -153 806 973 569 316 -235 -938 -844 -560 -61 437 962 980 286 -281 -841
8076 -841 -945 -583 40 595 897 718 -33 -501 -855 -696 -677 -82 771 1010 904 233 -297 -881 -1001 -577
8096 -577 237 325 718 563 282 -249 -747 -991 -588 -145 340 600 784 386 -349 -759 -1061 -445 -298 535
8116 535 1006 772 642 -76 -591 -787 -780 99 447 741 707 418 -422 -524 -863 -994 -128 228 775 909 454
8137 454 -165 -475 -791 -696 -151 310 823 772 364 24 -487 -813 -658 -341 288 858 490 394 -7 -444 -899
8158 -899 -675 -129 242 573 644 546 176 -407 -722 -696 -241 314 840 797 775 26 -351 -888 -621 -601 257 142
8180 142 899 698 -68 -758 -909 -635 -486 94 589 844 813
8191H13
$$ Imaginary data points
##PAGE= N=2
##DATA TABLE= (X++(I..I)), XYDATA
0 0 0 0 0 0 0 0 0 0 1 0 0 -8 8 -8 10 -10 17 -17 25 -32 33 -43 50 -58 69 -77 94 -106 122 -142 159 -185 208
33 208 -235 268 -297 335 -377 418 -469 520 -576 643 -707 786 -866 952 -1054 1157 -1279 1407
51 1407 -1551 1712 -1887 2089 -2315 2570 -2868 3215 -3627 4127 -4741 5527 -6569 8017 -10189
66 -10189 13788 -20888 40393 -217275 -776804 -761302 -468444 78806 566313 811114 646522
77 646522 208613 -332829 -713779 -772338 -450775 61569 542064 770493 648421 209823
87 209823 -311021 -680481 -736468 -459221 41779 512680 737144 623005 229300 -277913
97 -277913 -648875 -709927 -446195 13350 471841 708263 607747 230795 -241255 -605579
107 -605579 -688716 -445494 -805 431770 667832 597674 244058 -217507 -566625 -656597
117 -656597 -447533 -26764 402442 635182 576548 257954 -183028 -537272 -633599 -439342
127 -439342 -50210 363963 609346 565004 261616 -153808 -498808 -614552 -440221 -64283
137 -64283 332560 575249 554846 273858 -131657 -467968 -587748 -439184 -85788 306338
147 306338 548847 538008 282196 -104225 -441664 -568921 -432533 -101355 275842 524996
157 524996 527571 285788 -82837 -411006 -549615 -431247 -113583 251027 497532 515409
167 515409 292914 -64043 -386327 -528128 -427353 -128951 228296 475490 501248 297159
177 297159 -43136 -362119 -510792 -422337 -140652 203822 452859 490648 301080 -25054
187 -25054 -337521 -492514 -418873 -152091 182591 430814 478974 305248 -8306 -315870
197 -315870 -475553 -414548 -162448 162789 410967 468191 307830 6616 -295176 -458971
207 -458971 -410452 -172057 145003 391607 456567 311050 22024 -276283 -443356 -405262
217 -405262 -181562 125962 374499 446251 311969 36480 -255949 -429763 -401846 -188420
227 -188420 108418 354443 437259 315561 47590 -238139 -412752 -398165 -197538 94831
237 94831 338446 424707 317392 61658 -223199 -400013 -391280 -204340 77223 324184 417126
248 417126 315522 72616 -203743 -387779 -388747 -208138 63456 305268 408118 319644 81267
259 81267 -189577 -370891 -384176 -217986 51521 292197 395211 319628 95400 -175563
269 -175563 -360899 -376287 -222467 34084 278007 389470 317499 103600 -157006 -348145
279 -348145 -375618 -225590 23878 259831 379493 321912 111798 -145273 -331961 -369234
289 -369234 -235269 11574 248710 366990 319933 125681 -130877 -323520 -361917 -237390
299 -237390 -4994 234003 362231 317938 131311 -113153 -309377 -360884 -241146 -13505
309 -13505 216315 350222 321943 139917 -103196 -294374 -352872 -249183 -25578 206979
319 206979 339074 317866 151477 -88840 -286235 -346484 -249153 -40025 191653 333843
329 333843 316442 155141 -73488 -272024 -344403 -252958 -46544 176698 321077 318392 163732
340 163732 -65073 -258657 -335166 -258852 -58440 167980 311211 312557 172552 -50981 -250482
351 -250482 -329130 -256992 -69766 152826 305097 311043 174476 -38617 -236136 -325800 -260247
362 -260247 -75196 140370 292045 311100 182139 -30798 -224661 -315911 -263077 -86170
372 -86170 131091 283386 304961 188249 -17692 -215932 -310472 -261333 -94474 116857 275525
383 275525 303345 190436 -7475 -202018 -304803 -263635 -99967 106560 263849 300796
393 300796 196410 694 -192129 -295507 -264261 -109481 96876 255180 294934 200125
403 200125 12472 -182084 -289750 -262489 -116030 84087 246408 292621 202492 20753
413 20753 -170124 -282659 -263096 -121389 74558 235461 288042 206382 28861 -160379 -274467
424 -274467 -262431 -128339 65282 227320 282960 208769 37612 -150872 -268104 -260484 -132899
435 -132899 55392 218070 278914 209937 44611 -141082 -260816 -259604 -137602 47202 209538
446 209538 274017 211668 51586 -131604 -253626 -257773 -141945 37972 200420 269322 213342
457 213342 58330 -122307 -246216 -255941 -147031 30027 191348 264129 215022 66180 -113485
468 -113485 -238618 -253391 -151674 20163 182941 259397 215373 73070 -102780 -231680
478 -231680 -252150 -154784 11484 172746 254399 217449 78561 -94073 -222667 -249552 -160180
489 -160180 4595 164996 247936 217878 86631 -85751 -216342 -245497 -163355 -5495 156866
500 156866 244095 216956 91903 -75106 -209492 -244716 -165021 -11832 146236 238405 219294
511 219294 96313 -68231 -200034 -241409 -170231 -18246 139551 231209 218229 104043 -60296
522 -60296 -194502 -236895 -171667 -27792 131175 227951 216566 107167 -50016 -186912 -236162
533 -236162 -172930 -32631 120989 221276 218384 111579 -44526 -177831 -231078 -177743 -39274
544 -39274 115496 213905 215987 118964 -35836 -172892 -226388 -178129 -48446 106080 210617
555 210617 214425 121125 -26024 -163584 -225337 -179408 -51969 96380 202550 215831 125593
566 125593 -21125 -155101 -219268 -183326 -58930 91070 195945 211570 131478 -12614 -150450
577 -150450 -214700 -181360 -66478 81590 192286 210325 132086 -4308 -140656 -212709 -182806
588 -182806 -68979 73514 183690 210389 136530 -411 -133289 -205889 -184772 -75538 68605
599 68605 177820 205433 140119 8078 -128261 -202183 -182316 -81038 59303 173282 203757
610 203757 140302 14431 -119225 -198444 -184149 -83763 52288 164749 202218 144348 19008
621 19008 -112407 -191546 -184372 -89973 46657 159152 197428 146450 26667 -106594 -187901
632 -187901 -182186 -93746 38258 153883 195874 147097 31824 -97713 -183633 -182756 -96470 32319
644 32319 145892 192983 150226 36732 -91734 -177026 -181730 -101747 26126 140129 188923
655 188923 151546 43624 -85218 -173230 -180170 -104822 18495 133999 186529 151923 47965
666 47965 -77404 -167817 -179823 -107791 13200 127294 182742 153533 52708 -71841 -162365
677 -162365 -177953 -111124 7312 121477 179263 154140 57579 -65715 -157452 -176186 -113280
688 -113280 1390 115934 175795 154487 61825 -59261 -152433 -174591 -116386 -3842 109954
699 109954 172415 154733 65616 -53252 -147347 -173169 -117981 -9228 103934 168885 155110
710 155110 69184 -47863 -142159 -171196 -120336 -13593 98300 164530 154876 73546 -42312
721 -42312 -137302 -168444 -122557 -19169 93007 161127 154157 76997 -35625 -132810 -167203 -123537
733 -123537 -23900 86167 157272 154967 79853 -30619 -126376 -164703 -126152 -28305 80891
744 80891 152329 154068 84358 -25425 -122156 -161390 -127121 -34190 75672 149429 152523 86649
756 86649 -18629 -117233 -160441 -127597 -37641 68960 144925 153838 89450 -14891 -110802 -157149
768 -157149 -130474 -41328 65157 140122 151492 93181 -9971 -107578 -153758 -129701 -46587
779 -46587 59558 137857 150029 94197 -4222 -102028 -152428 -129963 -48616 53798 132757 150594
791 150594 96308 -1301 -96380 -148368 -132103 -52583 50581 127994 147442 99965 3858 -93312
803 -93312 -145208 -130758 -57167 44203 125305 146042 100017 9157 -86840 -143566 -131361 -59233
815 -59233 38419 119785 146064 102537 11962 -81961 -138704 -132652 -63186 35494 115277 142599
827 142599 105239 17386 -78419 -135866 -130707 -66980 29182 112602 141530 104961 22026 -72314
839 -72314 -133871 -131584 -68137 24387 106151 140363 107456 24424 -67793 -128910 -131703 -72004
851 -72004 21189 102757 136626 109084 29383 -63968 -126451 -129604 -74765 15276 99168 135623
863 135623 108455 33086 -57954 -123565 -130092 -75822 11761 93785 133712 110501 35401 -54356
875 -54356 -118950 -129293 -79070 8498 90351 130245 110976 39748 -50992 -116245 -127333 -80701
887 -80701 3417 86863 129041 110398 42406 -45543 -112861 -127479 -81881 429 81685 126455
899 126455 111880 44930 -41887 -109142 -125972 -84487 -3280 78545 123411 112085 48515 -37926
911 -37926 -105882 -124571 -85937 -7722 74354 121881 111960 50848 -33172 -102307 -123747 -87450
923 -87450 -10881 70305 118786 112331 53603 -29727 -98738 -122265 -89266 -14306 66586 116095
935 116095 112161 55986 -25840 -95452 -120899 -89995 -18004 62370 113749 112098 58552 -22003
947 -22003 -92279 -119223 -91294 -21186 58760 111336 111578 60641 -18238 -88763 -118013 -92127
959 -92127 -23990 54689 108704 111786 62697 -14641 -84883 -116349 -93333 -27058 51611 105696
971 105696 111478 65249 -11419 -82361 -114326 -94402 -30424 47558 103336 110703 66975 -7158
983 -7158 -78897 -112939 -94882 -33321 43321 100500 110875 68737 -4178 -74366 -111335 -96203
995 -96203 -35851 40365 97114 109848 71820 -740 -72019 -108709 -96291 -39330 36672 95339
1007 95339 108634 72704 3643 -68103 -107844 -96506 -41133 32114 91705 108940 74295 6149
1019 6149 -64072 -105380 -97864 -43975 29606 88398 107271 76768 9376 -61871 -102933 -97435
1031 -97435 -47299 25938 86679 106326 77227 12918 -57865 -102175 -97455 -48171 22428 83159
1043 83159 106200 78507 14948 -54071 -99025 -98863 -51081 20077 79988 104050 80274 18079
1055 18079 -52319 -96806 -97323 -53612 15735 78420 102816 80072 21280 -48018 -95839 -97626
1067 -97626 -54235 12697 74391 102525 81706 22614 -44992 -92495 -98187 -56826 10751 71690
1079 71690 100030 82780 26450 -42941 -90583 -96184 -58961 6659 69878 99196 82663 29122
1091 29122 -38205 -88716 -97041 -60142 3436 65662 98383 84296 30980 -35333 -85221 -96947
1103 -96947 -62605 1169 62928 95571 84813 34308 -32975 -83522 -95109 -64149 -2505 60792
1115 60792 95105 84564 36254 -28833 -81740 -95623 -64499 -4968 56733 93354 85776 37817
1127 37817 -26566 -78256 -94678 -66930 -7272 54818 90901 85663 40952 -23713 -76468 -93273
1139 -93273 -67490 -10767 51791 90054 85550 42490 -20396 -74312 -93398 -68547 -12713 48514
1151 48514 87844 86358 44216 -17856 -71283 -92182 -70029 -15280 46071 86118 86101 46459 -15303
1164 -15303 -69198 -91000 -70767 -18128 43306 84632 85853 47856 -11986 -67003 -90361 -71636
1176 -71636 -20125 40466 82700 86196 49876 -9687 -64157 -89007 -72758 -22516 37948 80725
1188 80725 85844 51408 -6927 -61840 -88123 -73319 -24862 35243 78775 85600 53059 -4164
1200 -4164 -59369 -86784 -74299 -26989 32464 76900 85369 54586 -1411 -56801 -85677 -74638
1212 -74638 -29166 29428 74780 85104 55825 1151 -53954 -84373 -75251 -30985 27227 72338
1224 72338 84492 57405 3090 -52088 -82632 -75503 -33287 24586 70696 84000 58370 6214
1236 6214 -49452 -81858 -75617 -34689 21568 68502 83727 59453 7918 -46338 -80082 -76399
1248 -76399 -36735 19670 66041 82894 60959 10361 -44672 -78291 -76353 -39119 16816 64748
1260 64748 81675 61450 13382 -41928 -77510 -76021 -40193 13858 62128 81712 62565 14952
1272 14952 -38665 -75383 -77019 -42224 11817 59524 80068 64137 17222 -37019 -73290 -76187
1284 -76187 -44440 8930 58023 79083 63817 19987 -33857 -72451 -76393 -44921 6034 55044
1296 55044 79211 64948 21107 -31294 -69734 -76963 -47156 4590 52800 76966 66079 23924
1308 23924 -29879 -68208 -75469 -48546 1866 51574 76424 65518 26121 -26675 -67144 -75365
1320 -75365 -49086 -577 48370 75483 66766 26864 -24400 -64239 -75445 -50777 -2147 46520
1332 46520 73387 67452 29467 -22728 -63210 -74166 -51943 -4987 44630 72950 66914 31162
1344 31162 -19380 -61534 -74440 -52314 -7326 41311 71796 67938 32346 -17013 -58459 -74062
1356 -74062 -54433 -9044 39382 69393 68325 35106 -15046 -57530 -72670 -55265 -12137 37815
1368 37815 68898 67870 36249 -12022 -55401 -72832 -55804 -13596 34726 67452 68490 37533
1380 37533 -10356 -53088 -71733 -57275 -15307 33118 65342 68197 39450 -8385 -51755 -70900
1392 -70900 -57369 -17541 30516 64784 68298 40351 -5959 -50064 -70434 -58042 -18692 28532
1404 28532 63024 68521 41616 -4321 -47628 -69343 -59055 -20643 26919 61544 68434 43197
1416 43197 -2086 -46165 -68566 -59414 -22961 24467 60278 67792 44459 140 -43776 -67780
1428 -67780 -60080 -24526 22316 58569 67877 45548 2305 -41771 -66689 -60622 -26212 19788
1440 19788 56656 67478 46716 4578 -39844 -65563 -61112 -28356 17637 55182 67336 48185
1452 48185 6510 -37692 -64535 -61568 -29840 15929 53582 66794 49351 8836 -35718 -63586
1464 -63586 -61823 -31734 13197 51973 66377 50130 10724 -33235 -62322 -62084 -32768 11113
1476 11113 49794 65880 51657 12454 -31612 -60834 -62304 -34909 8994 48408 65127 51890
1488 51890 14796 -29670 -60138 -61911 -35618 6842 46505 64802 52308 16001 -27650 -58331
1500 -58331 -62660 -37020 5424 44806 63593 53537 17532 -26199 -57114 -62059 -38327 3108
1512 3108 43602 63173 53522 20006 -23575 -55983 -61874 -39299 816 41553 62741 54118 20775
1525 20775 -21350 -54229 -62194 -40438 -244 39215 61290 55070 22810 -20045 -53033 -61340
1537 -61340 -42206 -2917 38312 60539 55009 24816 -17292 -51878 -61174 -42525 -4912 35517
1549 35517 59823 55685 25550 -15447 -49628 -61498 -44006 -6037 33676 58043 56532 27894
1561 27894 -13772 -48226 -60208 -45155 -8408 32260 57174 55779 29338 -11161 -46976 -60064
1573 -60064 -45526 -10308 29522 56722 56668 29864 -9456 -44764 -60086 -46698 -11504 28287
1585 28287 54817 56468 31933 -8188 -43713 -58482 -46975 -13715 26759 53902 55730 32572
1597 32572 -5310 -42046 -58725 -47121 -14775 24343 52990 56617 33141 -4492 -40196 -57764
1609 -57764 -48281 -15934 23209 51512 56238 35034 -2649 -39172 -56688 -48674 -18046 21244
1621 21244 50467 56100 35727 -426 -37309 -56385 -48870 -19373 19140 49028 56220 36960
1633 36960 917 -34942 -55208 -49867 -20699 17543 47376 55611 38386 2620 -33859 -54349
1645 -54349 -49738 -22333 15352 46488 55204 38665 4837 -32259 -53862 -50243 -23608 13818
1657 13818 44936 55278 39717 6091 -30241 -52756 -50668 -24994 12150 43169 54481 40764
1669 40764 7701 -28510 -51503 -50732 -26498 10059 42224 54127 41192 9357 -26842 -50633
1681 -50633 -50878 -27394 8636 40479 53814 41954 10819 -25062 -49398 -50777 -28740 6904
1693 6904 38899 53248 42393 12432 -23633 -48561 -51139 -29784 5269 37721 52724 43298
1705 43298 13702 -21632 -47243 -50782 -31086 3582 36129 51720 43619 15304 -20231 -46432
1717 -46432 -50902 -32051 1764 34647 51681 44298 16684 -18188 -45002 -51043 -33060 20
1729 20 32683 50489 44872 18019 -16867 -43637 -50588 -34247 -1759 31435 49577 45035 19616
1742 19616 -14994 -42689 -50266 -34757 -3133 29735 49130 45292 20563 -13287 -41069 -50461
1754 -50461 -35689 -4413 28384 48043 45880 22199 -12091 -39933 -49684 -36638 -6465 27094
1766 27094 47173 45727 23550 -9872 -38837 -49458 -36826 -7924 25077 46641 45973 24042
1778 24042 -8292 -37154 -49099 -37849 -8757 23799 45223 46539 25652 -7546 -36096 -48036
1790 -48036 -38599 -10286 22619 44541 46163 26619 -5000 -35149 -48301 -38395 -11648 20361
1802 20361 43900 46148 27204 -3717 -33171 -47689 -39351 -12830 19149 42191 46551 28671
1814 28671 -2733 -32412 -46479 -40053 -14648 17715 41830 45423 29109 -652 -30847 -46511
1826 -46511 -40206 -15762 15844 40501 46299 29761 361 -29099 -45785 -41058 -16523 14523
1838 14523 38894 46088 31301 1781 -28416 -44882 -40903 -18017 13601 38669 45335 31849
1850 31849 3689 -27187 -44582 -41017 -19038 11695 37667 45585 32382 4443 -25246 -43641
1862 -43641 -41734 -19820 10486 35973 44866 33285 5704 -24550 -42675 -41799 -21308 9184 35448
1875 35448 44706 33608 7486 -22995 -42317 -41822 -22300 7364 33979 44722 34175 8142
1887 8142 -21483 -41201 -42135 -23114 6429 32819 43987 35177 9495 -20509 -40374 -42195 -24434
1900 -24434 4914 31961 43878 35218 10813 -18880 -39841 -42038 -24821 3528 30404 43307
1912 43307 35890 12113 -17519 -38854 -42274 -25966 2520 29443 42690 36791 13214 -16281
1924 -16281 -37860 -41699 -26745 1133 28126 42293 36690 14247 -14724 -37149 -41810 -27485
1936 -27485 -259 26882 41777 37022 15352 -13511 -35978 -41949 -28259 -1401 25893 40888
1948 40888 37556 16127 -12403 -35034 -41662 -28469 -2643 24679 40462 37481 17281 -11016
1960 -11016 -34153 -41340 -29519 -4158 23575 39812 37764 18102 -9594 -33011 -41004 -30222
1972 -30222 -5248 22163 39341 38053 18984 -8155 -31782 -41059 -30763 -6130 20942 38315
1984 38315 38106 20045 -7365 -30689 -40342 -31250 -7804 19783 37572 38015 21138 -5508 -30006
1997 -30006 -40009 -31692 -8954 18279 37087 38416 21616 -4211 -28620 -39973 -32172 -9695
2009 -9695 17038 35677 38194 22699 -3312 -27643 -38986 -32801 -10991 15829 35160 37999 23552
2022 23552 -2047 -26700 -38855 -32850 -12281 14304 34551 38239 24078 -796 -25062 -38287
2034 -38287 -33374 -12490 13295 33238 38371 24832 51 -24300 -37616 -33873 -13824 12343
2046 12343 32519 37618 25702 1555 -23668 -37449 -33539 -14897 11133 31762 37676 25596
2058 25596 2547 -21855 -36942 -34332 -15506 9745 30375 37721 27239 3561 -21154 -35941
2070 -35941 -34330 -16983 8995 29940 37014 27140 5149 -20283 -35491 -33930 -17342 7362 29256
2083 29256 37131 27749 5806 -18744 -34661 -34814 -17860 6555 28034 36450 28501 6547 -18161
2096 -18161 -33927 -34475 -19170 5526 27590 36311 28629 8066 -16689 -33510 -34555 -19547 4237
2109 4237 26514 36469 29017 8432 -15392 -32641 -34737 -20114 3309 25154 35690 29886 9465
2122 9465 -14959 -31947 -34358 -21186 2253 24778 35125 29486 10394 -13622 -31522 -34339 -21472
2135 -21472 1202 23491 34894 29977 11162 -12344 -30473 -34361 -22402 300 22566 34161
2147 34161 30560 12174 -11325 -29674 -34388 -23223 -968 21640 33911 30678 13107 -10376
2159 -10376 -29151 -34227 -23376 -2092 20773 33324 30708 13909 -9443 -28328 -34029 -23867
2171 -23867 -2632 19682 32652 30765 14683 -8312 -27577 -33712 -24404 -3937 18652 32562
2183 32562 31141 15465 -7367 -26916 -33528 -24901 -4654 17822 32161 31298 16264 -6495 -25986
2196 -25986 -33296 -25429 -5509 16820 31245 31511 16734 -5501 -25040 -33299 -26032 -6549 15766
2209 15766 30757 31518 17585 -4449 -24430 -33086 -26114 -7202 14926 30310 31321 18096 -3648
2222 -3648 -23862 -32797 -26430 -8146 14036 29508 31358 18787 -2753 -22676 -32330 -26732 -8908
2235 -8908 13136 28990 31354 19256 -1702 -21784 -31799 -27362 -9767 12044 28127 31424 19917
2248 19917 -779 -21147 -31496 -27295 -10826 10933 27902 31408 20470 207 -20090 -31378
2260 -31378 -27905 -11294 10344 26987 31259 20992 865 -19396 -30323 -27800 -12099 9252
2272 9252 26446 30992 21503 1892 -18631 -30497 -27853 -12886 8142 25916 30921 21708 2658
2285 2658 -17305 -29957 -28296 -13315 7750 24814 30944 22519 3341 -16828 -28970 -28285 -14357
2298 -14357 6781 24313 30310 22827 4553 -16155 -29246 -28360 -14402 5842 23855 30519 22989
2311 22989 4992 -15070 -28398 -28691 -14972 5102 22815 30223 23592 5683 -14717 -27690 -28394
2324 -28394 -16017 4349 22165 29444 23683 6942 -13768 -27550 -28496 -16602 3384 21346 29961
2337 29961 23826 7339 -12727 -26832 -28877 -16817 2410 20198 29471 24539 8027 -11757 -26192
2350 -26192 -28399 -17511 1508 20145 28877 24663 9265 -10982 -25886 -28902 -18095 635 19356
2363 19356 29061 24690 9664 -9849 -25137 -28716 -18576 -46 18160 28280 25297 10267 -9560
2376 -9560 -24447 -28461 -19132 -911 17961 28023 25112 11231 -8497 -23994 -27985 -19389 -1685
2389 -1685 16897 27709 25374 11694 -7701 -23450 -28343 -19713 -2318 16104 27044 25743 12403
2402 12403 -7056 -22448 -28228 -20469 -3400 15460 26556 25817 12777 -5915 -21953 -27916 -20565
2415 -20565 -3945 14441 26343 26128 13287 -5170 -21309 -27728 -21101 -4566 13797 26031 25902
2428 25902 13899 -4332 -20469 -27312 -21276 -5423 12910 25192 25869 14603 -3519 -20193 -27203
2441 -27203 -21502 -6232 12018 24783 26080 15480 -2858 -19196 -26697 -22228 -6851 11203 24537
2454 24537 26114 15750 -1926 -18874 -26456 -21948 -7454 10586 23872 25968 16012 -1333 -18212
2467 -18212 -26010 -22681 -8244 10120 23439 25699 16469 -534 -17323 -26045 -22702 -8633 8659
2480 8659 22974 25935 16933 146 -16562 -25775 -22992 -9321 8233 21920 25983 17322 865
2493 865 -15976 -25143 -23065 -10105 7734 21749 25645 18038 1711 -15468 -24947 -23245 -10684
2506 -10684 6717 21027 25445 18204 2504 -14404 -24740 -23533 -11113 6173 20310 25459 18608
2519 18608 2913 -13668 -23993 -23456 -12006 5432 19761 25343 19025 4034 -13083 -23978 -23538
2532 -23538 -12231 4624 19509 25148 19082 4403 -12188 -23551 -23678 -12770 3747 18427 25224
2545 25224 19742 4912 -11698 -22715 -23894 -13813 3128 17953 24424 19993 5879 -11252 -22763
2558 -22763 -23706 -13876 2275 17543 24533 19887 6319 -10353 -22092 -23866 -14025 2028 16659
2571 16659 24360 20298 6892 -9560 -21615 -23310 -14961 1285 16574 23733 20453 7925 -9055
2584 -9055 -21202 -23568 -15004 230 15683 23989 20708 7975 -8000 -20760 -23864 -15488 -121
2597 -121 14994 23347 21263 8770 -7400 -20013 -23615 -16035 -940 14635 23062 21152 9222
2610 9222 -6746 -19579 -23330 -16331 -1582 13740 22949 21316 9690 -6020 -19141 -23359 -16280
2623 -16280 -2047 13200 22454 21417 10419 -5202 -18473 -23080 -17098 -3157 12469 22200 21432
2636 21432 10808 -4727 -18222 -23075 -17101 -3642 11603 21727 21645 11337 -4037 -17722 -22864
2649 -22864 -17795 -4060 11256 21380 21600 11849 -3409 -17074 -22785 -17967 -4765 10731 21141
2662 21141 21414 12112 -2907 -16991 -22757 -17935 -5236 9990 20724 21627 12350 -2085 -15859
2675 -15859 -22298 -18164 -5793 9571 20093 21636 13190 -1784 -15232 -21929 -18595 -6648 8605
2688 8605 19734 21607 13489 -1091 -14648 -21902 -18737 -6728 8050 19436 21513 13888 -408
2701 -408 -14355 -21601 -18345 -7538 7414 18748 21199 14022 62 -13511 -21466 -19138 -7693
2714 -7693 6938 18313 21311 14188 760 -13077 -20995 -19189 -8245 6198 17755 21177 14595
2727 14595 1593 -12419 -20588 -18946 -8711 5646 17492 21162 14799 1959 -11866 -20338 -19075
2740 -19075 -9284 5176 16727 20953 15489 2258 -11456 -19789 -19248 -9821 4531 16423 20764
2753 20764 15512 3314 -10640 -19807 -18986 -10143 4019 16005 20512 15660 3370 -10419 -19343
2766 -19343 -19434 -10246 3576 15181 20485 15916 3891 -9643 -18831 -19440 -11087 3037 15057 20230
2780 20230 16091 4599 -9067 -18710 -19484 -11185 2033 14566 20185 16362 4817 -8465 -18344
2793 -18344 -19370 -11487 1672 13917 20131 16710 5382 -8200 -17657 -19545 -12188 1198 13505
2806 13505 19509 16644 5923 -7452 -17456 -19094 -12358 312 12865 19542 16512 6302 -6638
2819 -6638 -17224 -19348 -12329 105 12303 19037 17182 6896 -6426 -16586 -19296 -12937 -512
2832 -512 12138 19126 17088 7409 -5629 -16572 -19146 -13323 -1270 11412 18795 17159 7912 -4971
2846 -4971 -15969 -19238 -13392 -1587 10889 18489 17754 8311 -4843 -15344 -18777 -13844 -1908 10476
2860 10476 18049 17460 8569 -4135 -15384 -18671 -13868 -2889 9706 17972 17417 9145 -3600 -14697
2874 -14697 -18886 -14232 -3137 9379 17350 17533 9786 -3170 -13731 -18511 -14445 -3749 8950
2887 8950 17075 17467 9865 -2382 -13561 -18726 -14505 -4265 8264 16853 17488 9981 -1893 -13171
2901 -13171 -18390 -15104 -4460 7664 16103 17670 10584 -1589 -12708 -17945 -15062 -4976 7325
2914 7325 16087 17591 10907 -1185 -11999 -17907 -15215 -5446 6616 15888 17711 11239 -354 -11750
2928 -11750 -17586 -15401 -5941 6166 15307 17387 11366 208 -11311 -17392 -15473 -6343 5772 15166
2942 15166 17586 11869 496 -10614 -17366 -15691 -6679 5297 14528 17429 12321 990 -10200
2955 -10200 -16955 -15632 -7224 4722 14404 17162 12413 1678 -9706 -16969 -15698 -7581 4106 13714
2969 13714 17414 12552 1874 -9098 -16468 -16074 -7833 3801 13446 16902 12755 2631 -9152 -16114
2983 -16114 -15796 -8329 2817 13081 16920 12999 3191 -8356 -15945 -16208 -8608 2587 12442 16650
2997 16650 13330 3632 -7902 -15323 -16060 -9040 2247 12206 17012 13271 3800 -7485 -15144 -15907
3011 -15907 -9218 1561 11834 16585 13782 4468 -6914 -14868 -16297 -9561 1182 11075 16386 13594
3025 13594 4590 -6345 -14526 -15897 -10010 944 11002 15946 13906 5222 -5927 -14203 -15645 -10227
3039 -10227 42 10305 15755 14095 5473 -5280 -13803 -15832 -10186 -245 9866 15699 14336 6100
3053 6100 -5112 -13518 -15971 -10875 -386 9682 15444 13921 6486 -4557 -13272 -15555 -10948 -1254
3067 -1254 9351 15224 14299 6613 -3935 -12785 -15595 -10929 -1660 8406 14931 14610 7113 -3451
3081 -3451 -12362 -15568 -11831 -2326 8384 14707 14261 7755 -2931 -11662 -15427 -11799 -2631 7888
3095 7888 14378 14348 7773 -2517 -11528 -15181 -11796 -2641 7246 14034 14550 8000 -2182 -11188 -15102
3110 -15102 -12352 -3006 6730 14126 14485 8459 -1664 -10789 -15049 -12084 -4004 6271 13490 14277 8322
3125 8322 -1030 -10536 -15151 -12330 -3901 5918 13323 14426 8799 -1143 -10009 -14613 -12251 -4272 5658
3140 5658 12937 14261 9191 -430 -9769 -14402 -12480 -4819 5056 12565 14245 9265 22 -9278 -14371
3155 -14371 -12631 -4941 4706 12289 14123 9448 242 -8731 -13918 -12636 -5462 4149 11829 14344 9953
3170 9953 895 -8438 -13662 -12788 -5868 3776 11836 14105 9809 1273 -8031 -13551 -12751 -6001 3276
3185 3276 11270 13819 10066 1585 -7710 -13189 -12887 -6512 3001 11198 13943 10355 2071 -7519 -13257
3200 -13257 -12592 -6510 2733 10627 13615 10366 2249 -6839 -12934 -12720 -6866 2179 10232 13676 10564
3215 10564 2533 -6271 -12660 -12977 -7266 1799 10110 13616 10558 3206 -6215 -12514 -12813 -7616 1611
3230 1611 9729 13550 11076 3120 -5809 -12311 -12927 -7854 917 9675 13384 11125 3772 -5319 -12019
3245 -12019 -12926 -7938 780 9330 13423 10953 3817 -5021 -11636 -13075 -8085 265 8789 12867 11286
3260 11286 4515 -4397 -11122 -12705 -8571 -66 8310 13005 11497 4359 -4114 -11257 -12596 -8397 -247
3275 -247 8159 12759 11490 4707 -3883 -10826 -12780 -8921 -507 7894 12329 11448 5282 -3252 -10919
3290 -10919 -12775 -8936 -1069 7434 12215 11513 5438 -3278 -10161 -12937 -9142 -1553 7040 12058 11580
3305 11580 5750 -3097 -10046 -12587 -9331 -1865 6757 11792 11882 5829 -2705 -9630 -12466 -9484 -2153
3320 -2153 6411 11744 11800 6337 -2396 -9597 -12719 -9435 -2280 5966 11632 11913 6376 -1713 -9267 -12205
3336 -12205 -9794 -2592 5866 11545 11737 6516 -1392 -9126 -12171 -9928 -3101 5075 11326 11751 6674
3351 6674 -941 -8632 -12214 -10064 -3375 4814 10854 11873 7309 -799 -8312 -11820 -10074 -3468 4774
3366 4774 10662 11565 7641 -528 -8173 -11798 -10328 -3854 4273 10485 11789 7621 -297 -7682 -11793
3381 -11793 -10039 -4378 3958 10192 11892 7830 314 -7497 -11716 -10169 -4641 3677 9826 11711 7570
3396 7570 445 -6870 -11675 -10264 -4782 3384 10053 11726 8271 908 -6929 -11336 -10527 -4902 3222
3411 3222 9556 11513 8198 1037 -6301 -11148 -10699 -5229 2741 9214 11611 8656 1471 -6303 -10843
3426 -10843 -10526 -5242 2265 8960 11578 8712 1867 -5946 -10808 -10567 -5366 1942 8598 11035 8732
3441 8732 2192 -5688 -10476 -10839 -5740 1941 8583 11121 8852 2294 -5352 -10262 -10915 -5803 1443
3456 1443 8266 11337 8890 2547 -4830 -10215 -10646 -6409 1069 8081 11028 9208 2779 -4625 -10122
3471 -10122 -10841 -6104 737 7594 10771 9225 3275 -4568 -9506 -10635 -6632 388 7541 11081 9447
3486 9447 3510 -3941 -9747 -10386 -6641 207 7250 10903 9244 3792 -3769 -9494 -10624 -6764 -115
3501 -115 6869 10488 9382 3825 -3336 -9116 -10768 -7005 -274 6467 10493 9311 4106 -3169 -9039
3516 -9039 -10496 -7194 -801 6365 10263 9256 4487 -2976 -8698 -10450 -7549 -719 6148 10419 9449
3531 9449 4513 -2390 -8333 -10532 -7662 -1148 5711 9885 9496 4879 -2014 -8099 -10293 -7691 -1891
3546 -1891 5350 9809 9486 5175 -1845 -8072 -10407 -7891 -1711 5003 9585 9769 4969 -1718 -7742
3561 -7742 -10081 -8006 -2213 4827 9584 9805 5492 -1252 -7575 -10314 -8098 -2674 4562 9552 9711
3576 9711 5706 -935 -7204 -10247 -8115 -2439 4256 8948 9915 5959 -825 -6967 -9959 -8470 -2661
3591 -2661 3870 8940 9726 6015 -411 -6780 -9875 -8101 -2972 3688 8897 9596 6132 -539 -6674
3606 -6674 -9745 -8567 -3138 3390 8462 9962 6291 94 -6278 -9675 -8513 -3428 3472 8327 9661
3621 9661 6400 451 -6105 -9222 -8517 -3774 2947 7909 9586 6438 653 -5412 -9394 -8559 -3853
3636 -3853 2592 7905 9683 6937 704 -5590 -9218 -8745 -4080 2290 7766 9563 6916 1162 -5132
3651 -5132 -9225 -8577 -4629 1902 7784 9479 7154 1438 -5068 -9029 -8953 -4683 1857 7254 9517 7315
3667 7315 1698 -4988 -9020 -8782 -5135 1766 6919 9588 7498 2080 -4460 -8658 -8816 -4902 1342
3682 1342 7088 9370 7368 1973 -4336 -8601 -9167 -5468 910 6636 9149 7403 2354 -3840 -8267
3697 -8267 -8937 -5304 942 6445 9381 7466 2360 -3578 -8459 -9154 -5885 537 6419 9044 7902
3712 7902 2830 -3640 -8345 -9080 -5697 373 6147 8855 7896 3157 -3075 -7803 -9019 -5945 58
3727 58 5611 9010 7947 3198 -2817 -7672 -9029 -6231 -655 5374 8540 7995 3535 -2512 -7543 -8995
3743 -8995 -6209 -504 5225 8906 8154 3781 -2187 -7307 -8975 -6342 -801 4893 8606 7961 3840
3758 3840 -2037 -6976 -8851 -6516 -898 4831 8439 8154 3909 -1668 -6806 -8876 -6688 -1330 4669
3773 4669 8555 8257 4369 -1522 -6997 -8759 -6717 -1588 4412 8115 8456 4177 -1440 -6386 -8766
3788 -8766 -6646 -1634 4135 8013 8208 4600 -1135 -6107 -8369 -6842 -2105 3852 8179 8240 4645 -706
3804 -706 -6109 -8529 -6936 -1891 3666 7771 8138 4938 -546 -5853 -8321 -7248 -2213 3417 7666
3819 7666 8358 4972 -471 -5981 -8386 -6882 -2482 2950 7602 8190 5296 -348 -5261 -8173 -7319 -2597
3835 -2597 2740 7176 8306 5594 160 -5358 -8189 -7188 -2798 2840 7288 8077 5506 377 -5061
3850 -5061 -7780 -7424 -3640 2604 7011 8281 5498 418 -4664 -7878 -7443 -3209 2233 6590 8270
3865 8270 5671 371 -4806 -7596 -7345 -3502 2003 6544 8043 5696 1000 -4445 -7623 -7521 -3888
3880 -3888 1672 6507 8037 6177 1278 -4308 -7561 -7360 -3805 1569 5989 7974 5964 1271 -3733
3895 -3733 -7208 -7493 -4233 1446 6017 7708 6362 1649 -3871 -7106 -7374 -4144 1010 5771 7681
3910 7681 6235 1891 -3254 -7348 -7596 -4114 738 5532 7708 6664 1960 -3189 -6746 -7423 -4519
3925 -4519 877 5457 7774 6394 2253 -2853 -6650 -7530 -4812 551 5286 7631 6356 2391 -2870
3940 -2870 -6867 -7251 -4827 32 5004 7457 6445 2619 -2731 -6570 -7295 -5029 -295 4694 7375
3955 7375 6841 2583 -2383 -6295 -7305 -5252 -373 4577 7121 6601 3142 -2085 -6400 -7447 -5230
3970 -5230 -537 4541 7226 6599 3371 -1958 -5973 -7430 -5201 -583 3832 6941 6723 3265 -1841
3985 -1841 -5619 -7043 -5491 -1188 3884 6918 6717 3574 -1422 -5811 -7199 -5501 -1129 3881 6749
4000 6749 6632 3607 -976 -5363 -7200 -5419 -1391 3474 6652 6868 4047 -862 -5333 -7044 -5949
4015 -5949 -1749 3249 6454 7093 3946 -781 -5231 -6834 -5769 -1851 2909 6435 6853 3999 -742
4030 -742 -5058 -6885 -5824 -1902 3003 6147 6766 4124 -430 -4727 -6879 -6219 -2540 2638 5960 6813
4046 6813 4467 -318 -4532 -6555 -5868 -2196 2543 6081 6633 4600 256 -4069 -6604 -5816 -2158 2166
4062 2166 5869 6716 4610 44 -4189 -6525 -6144 -2659 1941 5608 6597 4423 414 -3933 -6378 -6108
4078 -6108 -2906 1603 5529 6609 4479 427 -3659 -6350 -6241 -2874 1358 5535 6579 4680 744
4093 744 -3486 -6629 -6054 -3288 1392 4968 6539 5115 1068 -3167 -6227 -6042 -3163 953 5201 6427
4109 6427 5142 1188 -2998 -5769 -6246 -3270 988 4667 6025 5119 1353 -3153 -5950 -6121 -3709 732
4125 732 4480 6291 5361 1688 -2839 -5807 -6026 -3619 641 4445 6338 5095 1611 -2472 -5492 -6207
4141 -6207 -3711 235 4333 6283 5248 2002 -2435 -5640 -5959 -3776 216 4115 6180 5204 1815
4156 1815 -2447 -5178 -5797 -3995 69 3998 5911 5324 2069 -1987 -5118 -6155 -4027 -83 3814
4171 3814 5883 5591 2252 -2290 -5033 -6025 -4294 -449 3682 5788 5439 2393 -1469 -4891 -5820 -4217
4187 -4217 -440 3545 5748 5222 2675 -1442 -4647 -5577 -4401 -573 3129 5791 5179 2692 -1340 -4698
4203 -4698 -5685 -4323 -766 3045 5723 5429 2835 -1266 -4492 -5699 -4372 -1113 2903 5284 5345 3132
4219 3132 -1030 -4338 -5801 -4480 -1044 2754 5476 5458 2902 -917 -4332 -5857 -4446 -1387 2547
4234 2547 5295 5430 3205 -577 -4035 -5693 -4487 -1318 2502 5232 5469 3134 -560 -4006 -5496
4249 -5496 -4693 -1738 2056 5181 5355 3165 -291 -3719 -5499 -4641 -1998 1899 4758 5344 3322 -137
4265 -137 -3606 -5513 -4679 -1853 2178 4792 5417 3792 192 -3443 -5193 -4704 -2094 1657 4464 5445
4281 5445 3658 310 -3367 -5206 -4959 -1914 1542 4472 5120 3694 353 -2939 -5022 -4932 -2069 1200
4297 1200 4446 5282 3965 419 -3247 -5005 -4801 -2261 1539 4190 5277 3942 763 -3113 -5081
4312 -5081 -4956 -2375 1053 4140 5054 3739 876 -2729 -4899 -4918 -2494 886 4034 5334 3932 874
4328 874 -2425 -4646 -4750 -2567 921 3673 5099 4013 1069 -2563 -4869 -4904 -2745 791 3501 4968
4344 4968 4015 1129 -2142 -4559 -4880 -2687 431 3320 4830 4057 1579 -2181 -4370 -4951 -2647 482
4360 482 3366 4919 4108 1364 -2123 -4425 -4842 -2985 171 3427 4852 4361 1350 -1865 -4184 -4704
4376 -4704 -2969 160 3471 4839 4427 1635 -1791 -4369 -4726 -3239 -162 2817 4850 4452 1851 -1611
4392 -1611 -4069 -4784 -3400 47 2898 4692 4465 2047 -1357 -4122 -4616 -3558 -157 2672 4654 4348
4408 4348 2050 -1214 -3847 -4714 -3275 -461 2761 4469 4348 2193 -1181 -3800 -4610 -3362 -659 2524
4424 2524 4529 4448 2247 -779 -3718 -4375 -3564 -793 2401 4456 4140 2335 -1050 -3673 -4703 -3598
4440 -3598 -921 2330 4267 4392 2327 -714 -3314 -4621 -3682 -905 2183 4235 4743 2601 -548 -3162
4456 -3162 -4462 -3585 -1116 2250 4095 4499 2556 -425 -3041 -4501 -3631 -1251 1968 4002 4240 2583
4472 2583 -512 -3098 -4566 -3763 -1401 1602 3843 4345 2762 -207 -2863 -4596 -3819 -1686 1360 4009
4488 4009 4239 3049 5 -2823 -4407 -4012 -1371 1473 3713 4394 2662 59 -2754 -4185 -3837 -1613
4504 -1613 1333 4251 4114 3077 414 -2534 -4037 -3902 -1534 1154 3521 4163 2994 327 -2680 -4458
4520 -4458 -3696 -1701 1268 3465 4081 3286 166 -2442 -3982 -3892 -1765 1308 3270 4518 3061 710
4536 710 -2181 -4145 -3804 -1730 878 3413 4154 3077 586 -2150 -3810 -3743 -1981 873 3452 4365
4552 4365 3357 658 -2134 -3973 -3953 -2070 713 3185 3928 2937 611 -2089 -3663 -4025 -2094 526
4568 526 3149 4155 3213 875 -1810 -3903 -3925 -2031 573 3079 4246 3489 898 -1784 -3723 -4045
4584 -4045 -2460 414 3037 4121 3171 1272 -1391 -3596 -3810 -2115 296 2540 3906 3409 1195 -1606
4600 -1606 -3343 -3445 -2438 374 2482 3720 3451 1322 -1414 -3397 -3842 -2538 64 2400 4037 3467
4616 3467 1248 -1193 -3488 -4013 -2439 5 2509 4043 3527 1294 -1264 -3298 -3975 -2630 -197 2120
4632 2120 3739 3500 1417 -1086 -3170 -4103 -2682 -197 2110 3649 3473 1531 -1035 -3351 -3825 -2818
4648 -2818 -319 2470 3732 3770 1699 -761 -3102 -3921 -2877 -609 2029 3672 3669 1849 -910 -3042
4664 -3042 -4083 -3030 -455 2179 3825 3651 1948 -749 -2859 -3973 -2738 -357 2022 3515 3754
4679 3754 1896 -516 -2827 -3949 -2761 -842 1838 3860 3810 1994 -520 -2898 -3643 -3139 -851 1435
4695 1435 3609 3712 1969 -158 -2712 -3648 -2778 -1090 1654 3359 3815 2212 -325 -2684 -3681 -3064
4711 -3064 -832 1596 3315 3584 2324 -303 -2808 -3672 -3144 -1227 1490 3539 3818 2405 -88 -2749
4727 -2749 -3591 -3231 -1182 1482 3304 3485 2173 -103 -2491 -3716 -3061 -1195 1296 2970 3702 2599
4743 2599 108 -2333 -3739 -3148 -1298 1284 3062 3689 2382 41 -2353 -3613 -3425 -1378 880 3224
4759 3224 3543 2281 339 -2035 -3906 -3402 -1342 1098 3008 3895 2740 320 -1888 -3662 -3165 -1544
4775 -1544 910 3181 3582 2550 543 -2085 -3557 -3275 -1715 829 2917 3872 2733 348 -1758 -3362
4791 -3362 -3333 -1564 943 2852 3665 2965 468 -1836 -3191 -3352 -1601 593 2811 3668 2686 830 -1732
4808 -1732 -3233 -3277 -1915 742 2849 3768 2924 855 -1487 -3419 -3591 -1842 563 2847 3587 2926 913
4825 913 -1564 -3301 -3557 -1828 477 2421 3362 3292 1043 -1269 -3101 -3430 -2005 337 2465 3727
4841 3727 2749 956 -1454 -3289 -3504 -2185 -68 2325 3489 3063 1140 -1374 -3167 -3814 -2443 235
4857 235 2097 3612 2882 1173 -1453 -2973 -3410 -2370 40 2447 3623 3177 1302 -1173 -3054 -3547
4873 -3547 -2477 -11 2125 3456 2981 1214 -1213 -2993 -3637 -2520 -34 2189 3513 3049 1463 -773
4889 -773 -3030 -3678 -2421 -152 2169 3354 3092 1461 -813 -2850 -3521 -2367 -204 2400 3300 3175
4905 3175 1741 -824 -2908 -3579 -2423 -425 2022 3589 3285 1591 -642 -2689 -3634 -2381 -509 1903
4921 1903 3589 3249 1570 -617 -2867 -3863 -2765 -506 1865 3328 3384 1912 -672 -2727 -3797 -2842
4937 -2842 -870 1487 3199 3296 1855 -597 -2344 -3254 -2684 -638 1832 3117 3410 1802 -428 -2383
4953 -2383 -3314 -2837 -929 1511 3319 3682 1835 -280 -2473 -3210 -2865 -925 1307 3217 3455 1970
4969 1970 -496 -2436 -3546 -2958 -1092 1308 2979 3262 1958 -127 -2275 -3300 -2861 -937 1322 3120
4985 3120 3384 2028 -117 -2240 -3297 -3053 -863 1103 3169 3531 2158 42 -2178 -3176 -3218 -1251
5001 -1251 1321 2786 3500 2477 28 -2194 -3055 -3044 -1531 1220 2944 3223 2225 224 -1904 -3209
5017 -3209 -2986 -1565 884 2650 3253 2436 337 -2069 -3523 -3213 -1498 742 2707 3336 2412 608
5033 608 -2062 -3131 -3237 -1564 637 2659 3152 2221 418 -1775 -3281 -3183 -1446 893 2411 3455
5049 3455 2581 551 -1655 -3179 -3033 -1804 485 2617 3297 2563 424 -1643 -3262 -3380 -1770 467
5065 467 2704 3230 2720 709 -1467 -2919 -3069 -1918 395 2495 3290 2738 624 -1519 -3217 -3393 -1998
5082 -1998 285 2265 3241 2834 860 -1218 -3017 -3306 -1831 347 2108 3421 2786 859 -1156 -2906
5098 -2906 -3145 -2008 16 2328 3327 2768 1103 -1195 -2906 -3080 -1837 316 2140 3354 3013 1167
5114 1167 -1181 -2739 -3279 -2228 -125 2142 3064 2890 1155 -1374 -2866 -3393 -2347 -55 2165 3175
5130 3175 2975 1195 -865 -2895 -3139 -1846 -177 1754 3319 2920 1237 -943 -2879 -3287 -2420 -146
5146 -146 2023 3201 2846 1286 -559 -2709 -3491 -2163 -377 2031 3441 3066 1465 -661 -2600 -3413
5162 -3413 -2329 -472 1789 3023 3304 1628 -637 -2361 -3492 -2475 -647 1778 3110 3114 1725 -395
5178 -395 -2484 -3305 -2421 -934 1874 2978 2930 1773 -560 -2367 -3194 -2518 -615 1695 3051 3288 1873
5195 1873 -503 -2245 -3295 -2857 -723 1298 2937 3225 1864 -307 -2400 -3100 -2678 -1004 1467 3048
5211 3048 2968 1997 -383 -2529 -3464 -2647 -863 945 2952 3165 2159 -52 -2325 -3008 -2895 -964 1481
5228 1481 2655 3103 1939 39 -2037 -3368 -3035 -1191 1053 2806 3301 2059 156 -2135 -3368 -2894
5244 -2894 -1231 1027 2727 2990 2217 146 -2158 -3402 -2867 -1349 932 2683 3069 2217 323 -1967
5260 -1967 -3140 -3103 -1295 856 2750 3067 2289 211 -1790 -3317 -2828 -1211 662 2658 3465 2113
5276 2113 512 -2046 -2966 -2863 -1661 489 2322 3367 2322 562 -1571 -2776 -2806 -1474 602 2448
5292 2448 3086 2486 703 -1579 -3029 -3024 -1450 733 2608 3091 2564 829 -1717 -2976 -3064 -1631 421
5309 421 2094 3204 2508 654 -1351 -2815 -3066 -1669 156 2330 3066 2540 827 -1288 -2831 -3011
5325 -3011 -1813 205 2283 3040 2371 967 -1243 -2907 -3154 -1933 -144 2207 3190 2612 906 -1035
5341 -1035 -2903 -3075 -1903 271 2159 3110 2737 1055 -1019 -2966 -3363 -1679 117 2150 3032 2905
5357 2905 1137 -1014 -2614 -2898 -1971 -63 2115 2898 2738 1032 -949 -2496 -3181 -1770 -332 1783
5373 1783 3088 2512 1271 -1135 -2632 -3181 -2190 -12 1685 2853 2448 1275 -781 -2342 -2927 -2442
5389 -2442 -365 1722 3084 2886 1273 -599 -2576 -3149 -2035 -357 1590 2931 2841 1279 -532 -2552
5405 -2552 -2953 -2453 -155 1780 2512 2851 1443 -209 -2415 -3163 -2341 -684 1485 2738 3119 1517 -452
5422 -452 -2325 -3007 -2194 -638 1457 2816 2982 1537 -347 -2163 -2681 -2497 -861 948 2784 2698 1482
5439 1482 -299 -2288 -3010 -2412 -866 1163 2724 3211 1712 -177 -1966 -3008 -2592 -1058 1254 2710
5455 2710 2725 1778 -168 -2292 -2912 -2433 -1114 1006 2585 2880 1954 -129 -2029 -2996 -2512 -965 779
5472 779 2593 2802 1956 -111 -1732 -2586 -2599 -1277 898 2472 2799 1977 152 -1925 -2926 -2813 -1205
5489 -1205 753 2422 3091 2274 139 -1591 -2720 -2757 -1259 558 2394 3212 2249 423 -1717 -2767
5505 -2767 -2836 -1424 593 2207 2973 2248 247 -1608 -2864 -2633 -1178 636 2262 2940 2181 520 -1487
5522 -1487 -2625 -2559 -1441 501 2194 2893 2393 316 -1504 -2668 -2637 -1457 397 2211 2735 2344 442
5539 442 -1363 -2774 -2756 -1754 363 2098 3013 2338 687 -1564 -2698 -2695 -1593 253 2338 3050 2375
5556 2375 683 -1434 -2545 -2707 -1766 436 2136 2935 2265 737 -1247 -2602 -2951 -1562 216 1847
5572 1847 2893 2381 791 -1212 -2716 -2709 -1688 244 1746 2755 2471 1002 -939 -2375 -3106 -1772
5588 -1772 239 2105 2698 2671 1052 -967 -2595 -2914 -1963 -70 1750 2817 2472 989 -918 -2395
5604 -2395 -2703 -2077 -156 1745 3035 2755 1176 -782 -2379 -2831 -2058 -336 1752 2798 2605 1343
5620 1343 -702 -2172 -2699 -2222 -338 1440 2599 2430 1386 -564 -2359 -2753 -1998 -474 1433 2504
5636 2504 2586 1368 -576 -2016 -2790 -2098 -513 1346 2864 2837 1533 -569 -2330 -2801 -2489 -667 1364
5653 1364 2564 2817 1474 -550 -2201 -2942 -2061 -652 1369 2748 2602 1280 -462 -2273 -2565 -2184
5669 -2184 -860 1209 2284 2855 1566 -375 -2210 -2853 -2117 -751 1229 2567 2913 1651 -289 -2046
5685 -2046 -2770 -2330 -994 1117 2444 2658 1703 2 -1795 -3063 -2048 -771 1045 2328 2643 1550
5701 1550 -252 -1679 -2772 -2043 -722 889 2297 2572 1703 19 -1894 -2372 -2326 -1002 871 2463
5717 2463 2776 2039 -11 -1566 -2276 -2469 -1074 648 2425 2703 1838 105 -1661 -2546 -2569 -1249 826
5734 826 2242 2672 2097 73 -1407 -2628 -2488 -1258 461 2181 2781 1777 353 -1430 -2348 -2438 -1335
5751 -1335 638 2196 2916 2111 285 -1341 -2341 -2455 -1536 419 1982 2864 2205 479 -1464 -2794
5767 -2794 -2584 -1506 455 2091 2478 2263 712 -1295 -2336 -2599 -1520 255 2118 2665 2276 646
5783 646 -1177 -2276 -2631 -1637 330 1853 2585 2102 739 -1486 -2307 -2508 -1284 333 1835 2921 2203
5800 2203 703 -1211 -2296 -2678 -1914 349 1733 2701 1960 725 -980 -2265 -2711 -1651 69 1623
5816 1623 2363 2270 936 -987 -2369 -2561 -1750 -163 1658 2423 2288 940 -686 -2276 -2479 -1871 -27
5833 -27 1539 2599 2201 864 -759 -2107 -2582 -1753 -174 1628 2540 2225 972 -603 -1920 -2469 -1889
5850 -1889 -374 1701 2762 2466 896 -473 -2099 -2670 -1813 -210 1652 2480 2270 1323 -369 -1813
5866 -1813 -2762 -1760 -416 1478 2398 2461 1150 -316 -2096 -2415 -1726 -527 1220 2527 2416 1430 -208
5883 -208 -1778 -2639 -1789 -589 1151 2599 2498 1202 -257 -1875 -2623 -2085 -626 939 2390 2796 1407
5900 1407 -332 -1753 -2399 -1884 -893 882 2385 2334 1663 -159 -1787 -2504 -2180 -968 1152 2333 2705
5917 2705 1470 92 -1401 -2459 -2222 -794 867 2323 2422 1597 116 -1611 -2638 -2318 -789 957
5933 957 2349 2741 1546 170 -1434 -2470 -2045 -943 729 2204 2430 1900 388 -1533 -2584 -2126
5949 -2126 -1089 749 2144 2393 1860 190 -1401 -2379 -2156 -821 602 2126 2519 1865 385 -1225
5965 -1225 -2516 -2259 -1155 496 1944 2192 1619 432 -1318 -2383 -2243 -1235 407 1919 2690 2018
5981 2018 246 -1297 -2389 -2291 -1112 377 1913 2621 1944 352 -1117 -2222 -2307 -1245 620 2018
5997 2018 2412 1993 582 -1191 -2421 -2503 -1343 94 1803 2213 2063 573 -1092 -2244 -2563 -1462 350
6014 350 1774 2660 2162 651 -837 -2086 -2464 -1354 117 1680 2361 2112 534 -1014 -2564 -2337 -1472
6031 -1472 -49 1515 2288 2035 690 -977 -2212 -2390 -1535 84 1444 2566 2147 787 -952 -2155
6047 -2155 -2400 -1430 31 1619 2563 2052 818 -686 -1814 -2353 -1718 -180 1317 2324 2097 1103 -691
6064 -691 -2257 -2460 -1627 -101 1589 2294 2159 1261 -702 -1894 -2396 -1849 -242 1198 2085 2144 1083 -549
6082 -549 -1703 -2457 -1718 -258 1248 2243 2258 1120 -337 -2131 -2372 -1828 -510 1170 2107 2228 1404 -613
6100 -613 -1925 -2217 -1743 -441 1133 2349 2243 1270 -332 -1424 -2524 -2035 -348 962 2146 2298 1173
$$ [...]
8191e90
##END NTUPLES=NMR FID
##END=
