##TITLE=1H_PR95S
 D2O, 32 sc, 
 2.4.2019
##JCAMPDX= 6.0         $$ Bruker NMR JCAMP-DX V2.0
##DATA TYPE= NMR FID
##DATA CLASS= NTUPLES
##ORIGIN= UXNMR, Bruker Analytische Messtechnik GmbH
##OWNER= root
$$ XWIN-NMR		Version 3.5
$$ Tue Apr  2 16:06:51 2019 Russian Standard Time (UT+4h)  she@DPX200
##.OBSERVE FREQUENCY= 200.1316
##.OBSERVE NUCLEUS= ^1H
##.DELAY= (6, 6)
##.ACQUISITION MODE= SIMULTANEOUS
##.ACQUISITION SCHEME= undefined
##.AVERAGES= 32
##.DIGITISER RES= 18
##SPECTROMETER/DATA SYSTEM= spect
##.PULSE SEQUENCE= zg30
##.SOLVENT NAME= DMSO
##.SHIFT REFERENCE= (INTERNAL, DMSO, 0, 15.7039)
##AUDIT TRAIL= $$ (NUMBER, WHEN, WHO, WHERE, WHAT)
$$ ##TITLE= Audit trail, XWIN-NMR		Version 3.5
$$ ##JCAMPDX= 5.01
$$ ##ORIGIN= Bruker BioSpin GmbH
$$ ##OWNER= she
$$ F:/spectra/data/she/nmr/H-F/1/audita.txt
$$ ##AUDIT TRAIL=  $$ (NUMBER, WHEN, WHO, WHERE, WHAT)
(   1,<2019-04-02 16:05:46.93 +0400>,<she>,<DPX200>,
      <continue with go, POWCHK disabled, PULCHK disabled
       configuration hash MD5:
       00 E9 B6 7A A2 85 ED C7 34 08 36 98 17 FE 4E 26
       data hash MD5: 16K
       56 2C 18 7B A5 47 2C F7 05 B8 53 07 95 92 86 5B>)
$$ ##END=
$$ 
$$ hash MD5
$$ 84 CC 4A 7A B1 33 47 07 8C 89 86 A1 50 B7 3B 5C
##$RELAX= 
##$RELAX= 
##$RELAX= 
##$RELAX= 
##$RELAX= 
##$RELAX= 
$$ Bruker specific parameters
$$ --------------------------
##$DU= <F:/spectra>
##$EXPNO= 1
##$NAME= <H-F>
##$PROCNO= 1
##$TYPE= <nmr>
##$USER= <she>
##$AMP= (0..31)
100 100 100 100 100 100 100 100 100 100 100 100 100 100 100 100 100 100 
100 100 100 100 100 100 100 100 100 100 100 100 100 100 
##$AQSEQ= 0
##$AQ_mod= 1
##$AUNM= <au_zg>
##$AUTOPOS= <>
##$BF1= 200.13
##$BF2= 200.13
##$BF3= 200.13
##$BF4= 200.13
##$BF5= 200.13
##$BF6= 200.13
##$BF7= 200.13
##$BF8= 200.13
##$BYTORDA= 1
##$CFDGTYP= 0
##$CFRGTYP= 5
##$CHEMSTR= <none>
##$CNST= (0..31)
1 1 145 1 1 1 1 1 1 1 1 1 1 1 1 1 1 1 1 1 1 1 1 1 1 1 1 1 1 1 1 1 
##$CPDPRG= <>
##$CPDPRG1= <>
##$CPDPRG2= <>
##$CPDPRG3= <>
##$CPDPRG4= <mlev>
##$CPDPRG5= <mlev>
##$CPDPRG6= <mlev>
##$CPDPRG7= <mlev>
##$CPDPRG8= <mlev>
##$CPDPRGB= <>
##$CPDPRGT= <>
##$D= (0..31)
0 1.2 0 0 0 0 0 0 0 0 0 0.03 0 0 0 0 0 0 0 0 0 0 0 0 0 0 0 0 0 0 0 0 
##$DATE= 1554206630
##$DBL= (0..7)
120 120 120 120 120 120 120 120 
##$DBP= (0..7)
150 150 150 150 150 150 150 150 
##$DBP07= 0
##$DBPNAM0= <>
##$DBPNAM1= <>
##$DBPNAM2= <>
##$DBPNAM3= <>
##$DBPNAM4= <>
##$DBPNAM5= <>
##$DBPNAM6= <>
##$DBPNAM7= <>
##$DBPOAL= (0..7)
0.5 0.5 0.5 0.5 0.5 0.5 0.5 0.5 
##$DBPOFFS= (0..7)
0 0 0 0 0 0 0 0 
##$DE= 6
##$DECBNUC= <off>
##$DECIM= 24
##$DECNUC= <off>
##$DECSTAT= 4
##$DIGMOD= 1
##$DIGTYP= 9
##$DL= (0..7)
0 120 120 120 120 120 120 120 
##$DP= (0..7)
150 150 150 150 150 150 150 150 
##$DP07= 0
##$DPNAME0= <>
##$DPNAME1= <>
##$DPNAME2= <>
##$DPNAME3= <>
##$DPNAME4= <>
##$DPNAME5= <>
##$DPNAME6= <>
##$DPNAME7= <>
##$DPOAL= (0..7)
0.5 0.5 0.5 0.5 0.5 0.5 0.5 0.5 
##$DPOFFS= (0..7)
0 0 0 0 0 0 0 0 
##$DQDMODE= 0
##$DR= 18
##$DS= 0
##$DSLIST= <SSSSSSSSSSSSSSS>
##$DSPFIRM= 0
$$ [...]
##$SUBNAM2= <"">
##$SUBNAM3= <"">
##$SUBNAM4= <"">
##$SUBNAM5= <"">
##$SUBNAM6= <"">
##$SUBNAM7= <"">
##$SUBNAM8= <"">
##$SUBNAM9= <"">
##$SW= 24.9336934301222
##$SWIBOX= (0..15)
0 0 2 0 0 0 0 0 0 0 0 0 0 0 0 0 
##$SW_h= 4990.01996007984
##$TD= 16384
##$TD0= 1
##$TE= 0
##$TE2= 300
##$TE3= 300
##$TEG= 300
##$TL= (0..7)
0 120 120 120 120 120 120 120 
##$TP= (0..7)
150 150 150 150 150 150 150 150 
##$TP07= 0
##$TPNAME0= <>
##$TPNAME1= <>
##$TPNAME2= <>
##$TPNAME3= <>
##$TPNAME4= <>
##$TPNAME5= <>
##$TPNAME6= <>
##$TPNAME7= <>
##$TPOAL= (0..7)
0.5 0.5 0.5 0.5 0.5 0.5 0.5 0.5 
##$TPOFFS= (0..7)
0 0 0 0 0 0 0 0 
##$TUNHIN= 0
##$TUNHOUT= 0
##$TUNXOUT= 0
##$USERA1= <user>
##$USERA2= <user>
##$USERA3= <user>
##$USERA4= <user>
##$USERA5= <user>
##$V9= 5
##$VALIST= <valist>
##$VCLIST= <CCCCCCCCCCCCCCC>
##$VD= 0
##$VDLIST= <DDDDDDDDDDDDDDD>
##$VPLIST= <PPPPPPPPPPPPPPP>
##$VTLIST= <TTTTTTTTTTTTTTT>
##$WBST= 1024
##$WBSW= 4
##$XGAIN= (0..3)
0 0 0 0 
##$XL= 0
##$YL= 0
##$YMAX_a= 569135
##$YMIN_a= -686266
##$ZGOPTNS= <>
##$ZL1= 120
##$ZL2= 120
##$ZL3= 120
##$ZL4= 120
##$ABSF1= 10
##$ABSF2= 0
##$ABSG= 5
##$ABSL= 3
##$ALPHA= 0
##$AQORDER= 0
##$ASSFAC= 0
##$ASSFACI= 0
##$ASSFACX= 0
##$ASSWID= 0
##$AUNMP= <proc_1d>
##$AZFE= 0.1
##$AZFW= 0.1
##$BCFW= 1
##$BC_mod= 2
##$BYTORDP= 1
##$COROFFS= 0
##$CY= 11.3945322036743
##$DATMOD= 1
##$DC= 2
##$DFILT= <>
##$DTYPP= 0
##$F1P= 18.9103706918063
##$F2P= -1.10871071338519
##$FCOR= 0.5
##$FTSIZE= 0
##$FT_mod= 4
##$GAMMA= 1
##$GB= 0.15
##$INTBC= 1
##$INTSCL= 1
##$ISEN= 128
##$LB= 0.24
##$LEV0= 0
##$LPBIN= 0
##$MAXI= 10000
##$MC2= 0
##$MEAN= 0
##$ME_mod= 0
##$MI= 1.114404
##$NCOEF= 0
##$NC_proc= 0
##$NLEV= 6
##$NOISF1= 3.799351
##$NOISF2= 2.8
##$NSP= 1
##$NTH_PI= 0
##$NZP= 0
##$OFFSET= 15.70392
##$PC= 1
##$PHC0= -9223.604
##$PHC1= 26.80025
##$PH_mod= 1
##$PKNL= yes
##$PPARMOD= 0
##$PSCAL= 0
##$PSIGN= 0
##$REVERSE= no
##$SF= 200.130013532006
##$SI= 16384
##$SIGF1= 3
##$SIGF2= 2
##$SINO= 400
##$SIOLD= 16384
##$SREGLST= <1H.CDCl3>
##$SSB= 0
##$STSI= 0
##$STSR= 0
##$SW_p= 3612.71676300578
##$SYMM= 0
##$S_DEV= 0
##$TDeff= 0
##$TDoff= 0
##$TI= <>
##$TILT= no
##$TM1= 0
##$TM2= 0
##$TOPLEV= 0
##$USERP1= <user>
##$USERP2= <user>
##$USERP3= <user>
##$USERP4= <user>
##$USERP5= <user>
##$WDW= 1
##$XDIM= 8192
##$YMAX_p= 0
##$YMIN_p= 0
$$ End of Bruker specific parameters
$$ ---------------------------------
##NTUPLES= NMR FID
##VAR_NAME=  TIME,          FID/REAL,        FID/IMAG
##SYMBOL=    X,             R,               I
##VAR_TYPE=  INDEPENDENT,   DEPENDENT,       DEPENDENT
##VAR_FORM=  AFFN,          ASDF,            ASDF
##VAR_DIM=   8192,          8192,            8192
##UNITS=     SECONDS,       ARBITRARY UNITS, ARBITRARY UNITS
##FACTOR=    0.0002004,     1,               1
##FIRST=     0,             0,               0
##LAST=      1.6414764,     0,               0
##MIN=       0,             -686266,         0
##MAX=       1.6414764,     569135,          0
$$ Real data points
##PAGE= N=1
##DATA TABLE= (X++(R..R)), XYDATA
0@%%%%%%%k9O1o4O4o4R6j28J28j60J93k25K88l49M11m76N43o28P22q29R55j082
$$ 0 0 0 0 0 0 0 0 -29 32 -32 32 -32 64 -64 64 -96 97 -128 160 -189 222 -254 289 -339 383 -446 509 -573
28e73J218j379J562j757J965k197K460k744L055l402L777m188M641n136N683o292
$$ -573 645 -734 828 -929 1036 -1161 1299 -1445 1610 -1792 1985 -2203 2438 -2698 2985 -3307
44c307O972p727Q575r542J0643j1911J3405j5180J7325j9996K3421k8009L4512
$$ -3307 3665 -4062 4513 -5029 5614 -6297 7108 -8072 9253 -10743 12678 -15331 19181
57A9181m4505O2063j02028L67173j1037o33354j07787L9161K99352L83856K90137
$$ 19181 -25324 36739 -65289 301884 290847 -342507 -450294 -411133 -111781 272075 562212
68E62212j84085m06574l73935j44608J23998M65910M11214O829l21957k96523
$$ 562212 378127 -28447 -402382 -546990 -422992 42918 454132 460961 139004 -157519
78a57519k36614r2814K41013M95228K70471j28132l26561l20556k05817J05394
$$ -157519 -394133 -486947 -245934 249294 519765 391633 65072 -255484 -461301 -355907
88c55907L76417L23588O4978j17603k79636l69813j36946K88596M10192J84643
$$ -355907 20510 344098 409076 291473 11837 -357976 -494922 -206326 203866 388509
98C88509k9056j64027l10411k78435K8081K96907L03547J69899m3282l10092l73317
$$ 388509 359453 195426 -114985 -393420 -365339 -68432 235115 405014 361732 51640 -321677
109c21677j01617J83804K41449K19649J55884j08398l83402l03931K0283K31953
$$ -321677 -423294 -239490 1959 221608 377492 269094 -114308 -418239 -397956 -166003
119a66003K80729K36403K2372k58891l16258j42198M1799K12890L46243K12327
$$ -166003 114726 351129 373501 114610 -201648 -343846 -302047 -89157 257086 469413
129D69413j58631l59026k37814m9973R5668K70502L10318O2395k38273l13966
$$ 469413 310782 -48244 -286058 -336031 -240363 30139 340457 402852 164579 -149387
139a49387k12843j8385K42413L63084J71463j16436k36153k41740j78943N9915
$$ -149387 -362230 -380615 -138202 224882 396345 279909 43756 -197984 -376927 -317012
149c17012L39215L24478M0330j94551k68347k40597o0576K11906L17012J80473
$$ -317012 22203 346681 387011 192460 -75887 -316484 -377060 -165154 151858 332331
159C32331k0059j95811l11880k14690R9763L16266K51253P2899q3197k40425k87233
$$ 332331 312272 116461 -195419 -410109 -310346 5920 257173 330072 246875 6450 -280783
170b80783q9239J89481K87511K01977K8629j88203l10226j86292O4224K07797
$$ -280783 -370022 -180541 106970 308947 337576 149373 -160853 -347145 -282921 -75124
180g5124K25686J66024k7724k65539k90084p6068J41312K30790K21188Q5727j44216
$$ -75124 150562 316586 288862 23323 -266761 -342829 -201517 29273 250461 336188 191972
191A91972k72125j89161j2352J50384K58750K07015l2784k42462k37953j05963
$$ 191972 -80153 -269314 -281666 -131282 127468 334483 301699 59237 -178716 -284679
201b84679L9285J88010K56611J21398j18705k43558k02820o8600J22068K58534
$$ -284679 -245394 -57384 199227 320625 201920 -41638 -244458 -313058 -190990 67544
211F7544K04334K991j59569k12888j75961j6518K00886K70775J23218p6511j93804
$$ 67544 271878 274869 115300 -97588 -273549 -290067 -89181 181594 304812 228301 34497
222C4497k16524j18636Q7233K36743K08431N4746j09493k29122k12847k3817J81200
$$ 34497 -182027 -300663 -213430 23313 231744 286490 176997 -52125 -264972 -288789 -107589
233a07589K32125J39350n706j59362k43908j49287O2941K11106K07467R5024p9756
$$ -107589 124536 263886 258180 98818 -145090 -294377 -231436 -20330 187137 282161 202405
244B02405k25193k12587m8616J26515K07224J81169M2111j55049k43136j45972
$$ 202405 -22788 -235375 -283991 -157476 49748 230917 273028 117979 -125157 -271129
254b71129L4228J68683K10317J33665m7270k02216k07571q1055Q0439J99868K02008
$$ -271129 -236901 -68218 142099 275764 228494 26278 -181293 -262348 -181909 17959 219967
265B19967N7149j33627k14889j56995k1427J30880K17361J55113k3523j74521
$$ 219967 277116 143489 -71400 -228395 -249822 -118942 98419 253532 230009 55488
275E5488k00427j12643M6142J86649K04877P8547q7955j86781j78255o0382J12808
$$ 55488 -144939 -257582 -211440 -24791 180086 258633 170678 -16103 -194358 -254740 -141932
286a41932K13286J60285P029j36072j96606j42055J1926J64371K00048J04572
$$ -141932 71354 231639 238668 102596 -94010 -236065 -224139 -59768 140280 244852
296B44852m8785j72128j94636q3133Q6496J90768J66875M6202j02240j95544j60823
$$ 244852 196067 23939 -170697 -253830 -167334 23434 190309 236511 134271 -61273 -222096
307b22096j2650J38232J90976J28930j3682j53081j94658j00864N2572J68312
$$ -222096 -234746 -96514 94462 223392 209710 56629 -138029 -238893 -186321 -18009
317a8009J77852P9721p7134j83375j65107l9039J05575J81823J48346J4923j30747
$$ -18009 159843 239564 162430 -20945 -186052 -225091 -119516 62307 210653 225576 94829
328I4829j86170j21692J7576J44531J80029J00427n0579j64495j69694p0148P2278
$$ 94829 -91341 -213033 -195457 -50926 129103 229530 178951 14456 -155238 -225386 -153108
339a53108J69818J58343M0896j01856j75378j38077j5062J21975J78126J17723
$$ -153108 16710 175053 215949 114093 -61285 -199362 -214424 -92449 85677 203400
349B03400j7326j37706j69885r5084M3383J55509J65479O8497p0112j62105j49665
$$ 203400 186074 48368 -121517 -216601 -173218 -17709 147770 216267 146155 -15950 -165615
360a65615m2277R5209J69637J33562J4843j14937j70652j15903J4742J34405J65025
$$ -165615 -207892 -112683 56954 190516 205359 90422 -80230 -196133 -181391 -46986 118039
371A18039R0782m1523j47610j59959o7590O6488J57794J45025M0674r1882j64410
$$ 118039 208821 167298 19688 -140271 -207861 -141373 16421 161446 202120 110238 -54172
382e4172j30297j2666J12186J63531J10926j4042j30479j61916q6649M1860J44095
$$ -54172 -184469 -197135 -84949 78582 189508 175466 44987 -116929 -203578 -161718 -17623
393a7623J52677O3781o6608j52271j39083l6052Q9535J57608J26345J0013j10268
$$ -17623 135054 198835 132227 -20044 -159127 -195179 -105644 51964 178309 188322 78054
404G8054j57262j02882J5930J25830J54249Q2160m2663j38318j45027n9740O4799
$$ 78054 -79208 -182090 -166160 -40330 113919 196079 153416 15098 -129929 -189669 -124870
415a24870J48065J32926L1503q7110j51299j17636j0794J06019J51119R7752j6931
$$ -124870 23195 156121 187624 100514 -50785 -168421 -179215 -73196 77923 175675 158744
426A58744j21032j46944p9021M0712J33809J37781N4685o1563j39332j29003l2341
$$ 158744 37712 -109232 -188253 -147541 -13732 124049 178734 117171 -22161 -151164 -183505
437a83505Q6332J45035J11748R711r9579j44444r5196J8946J15522J39918P7791
$$ -183505 -97173 47862 159610 169321 69742 -74702 -169898 -150952 -35430 104488 182279
448A82279l8032j28624j35130n1383O1197J31780J22185L4314q2093j42883j08445
$$ 182279 144247 15623 -119507 -170890 -109693 22087 144272 178586 96493 -46390 -154835
459a54835p738R4887J38314R3596j5921j15921j34989p0325L4274J20129J32411
$$ -154835 -162573 -67686 70628 164224 148303 32382 -102607 -172932 -138658 -18529 113882
470A13882N3608o1036j30706j14334k9697P5486J36901J07096M436r2114j29652
$$ 113882 167490 106454 -24252 -138586 -168283 -92797 44104 151200 155636 63522 -66130
481f6130q9380J1012J11152J35252O6235m0222j13159j20943n4676N4680J28756
$$ -66130 -155510 -144498 -33346 101906 168141 127919 14760 -106183 -160859 -106179 22577
492B2577J11391K5160p2382j26516j03968q382R3259J26520P9045j0565r7667
$$ 22577 133968 159128 86746 -39770 -143738 -152120 -58861 67659 146704 136139 38472
503C8472j30574p1372L8610J15932J13319M6767m7770j20133j12740k4939P1954
$$ 38472 -92102 -163474 -124864 -8932 104387 151154 103384 -16749 -129489 -154428 -82474
514h2474J18961R6823J6289q7200j30735p8128J8794R4343J15337P3550k8252
$$ -82474 36487 133310 149599 62399 -68336 -146464 -127670 -33327 82010 155560 127308
525A27308j14938j17379m2813M8972J11725J11042L0577p6932j20673q7291j0488
$$ 127308 12370 -105009 -147822 -98850 12875 123917 154494 77562 -43111 -130402 -140890
536a40890P4480J24777Q9316j7839j04762j12143n8580K6886J06188J18489M3507
$$ -140890 -66410 58367 147683 129844 25082 -87061 -145641 -118755 -12567 105922 149429
547A49429n5678j07870j00171l3497O8414J28584Q7597n364p9374j06731q2041
$$ 149429 93751 -14119 -114290 -147787 -79373 49211 136808 131444 52070 -54661 -136702
558a36702N500J01258J18540N2159l4486r8051j10373m4991N8423J11243Q6851
$$ -136702 -131202 -29944 88596 140755 106269 8218 -102155 -147146 -88723 22520 109371
569A09371K2433n4055j13807r7479K5R1016J04926O2152q091q5479j13098n5591
$$ 109371 131804 77749 -36058 -133537 -133512 -42496 62430 124582 116491 31012 -82086 -137677
581a37677L6920R3031R7121M9171m4906j14229r2004q564N9809R2711Q6362J7535
$$ -137677 -100757 -7726 89395 138566 93660 -20569 -112573 -121137 -61328 31383 117745 135280
593A35280q0457j14670o3296J4986P7697J03522O0151l4646r8770q7635l8110
$$ 135280 54823 -59847 -123143 -108157 -30460 73062 133213 98567 -203 -87838 -125948
604a25948K9174R7904J05975K3309p3355r8322o7467j1932O3400J10057P3132
$$ -125948 -96774 1130 107105 130414 57059 -41263 -108730 -120662 -57262 52795 125927
615A25927j4662p9352r4978o4106K2250J04334R9925K3857m4020q1454r1104l9790
$$ 125927 111265 31913 -63065 -127171 -104921 -587 99338 123195 79175 -2279 -93383 -133173
627a33173N9724J13311P4205n50o4587j00096p3796J5269Q7061R0051M9021j2973
$$ -133173 -73449 39862 114067 113517 48930 -51166 -124962 -109693 -22632 67419 116440 103467
639A03467q6484j11487l9164N9467R5307P1455K3630m7266j03594q2125J990O9318
$$ 103467 16983 -94504 -133668 -74201 21106 92561 116191 68925 -34669 -116794 -114804 -45486
651d5486R2390O9761o008r0008j00537l3457L3113P0376Q8024N0376m1940j06788
$$ -45486 46904 116665 110657 20649 -79888 -113345 -80232 -9856 78168 128544 86604 -20184
663b0184p9466q752N1282Q8362P7089Q1p4757q5750n3401L66O9144J06771N2124
$$ -20184 -99650 -108402 -57120 31242 108331 108412 33655 -52095 -105496 -105130 -35986 70785 122909
676A22909m4296q5089o7320l1968K7986Q9239Q7793J4015n6798q1841p1251j2698
$$ 122909 78613 -6476 -73796 -105764 -77778 11461 99254 113269 56471 -25370 -96621 -109319
688a09319P1340R5499M4914j8958n5085q1340o4982K0555R4728Q3325K0826l4519
$$ -109319 -37979 57520 102434 83476 28391 -52949 -117931 -97376 -2648 80677 101503 66984
700F6984p5568q0692k1335N7428Q2958N9638J4806n1277j00468o6016K5336P4559
$$ 66984 -8584 -89276 -110611 -53183 29775 89413 104219 52942 -47526 -113542 -88206 -13647
712a3647O9432M0886p605p5822r2119l1802M2589P6055P4694K8436n2116r3923
$$ -13647 55785 96671 89066 13244 -78875 -110677 -68088 7967 82661 111097 58981 -34942
724c4942n6759M279M6283P6407P1217j265q3807q7974l2135K2629O4309Q0614
$$ -34942 -91701 -87422 -41139 35268 106485 105220 21413 -66561 -98696 -76067 -11758 68856
736F8856L6801m2064p9680o4155k4668L6217R2437P4500n968o5832o7811m6087
$$ 68856 105657 63593 -16087 -80242 -104910 -68693 23744 98244 92276 26444 -41367 -87454
748h7454m845O2696R2883M4215k9940o9311p1753l7579L5146Q4743O5016N918
$$ -87454 -92299 -29603 63280 107495 77555 8244 -63509 -101088 -65942 18801 83817 89735
760H9735l7153o7911p2850j4099O6675Q6056L9865j2468n2466p6380m8719K4213
$$ 89735 52582 -15329 -88179 -102278 -35603 50453 90318 77850 25384 -50996 -99715 -75502
772g5502P2285O5680L1203k3070p9225p8673r872N4033O5246N0499J5829m5974
$$ -75502 -3217 62463 93666 70596 -8629 -87302 -97174 -43141 22105 72604 88433 42459
784D2459q7296n3701J7176O1157O9594M4969j7201p3766o8852j8294K6547O0750
$$ 42459 -44837 -98538 -81362 -20205 49389 94358 77157 3391 -65461 -83755 -57208 3542
796C542P2814K7380n1724q1946m9209Q4M2017P0798N6115q721o4239o8703l7035
$$ 3542 76356 103736 52012 -29934 -79143 -79059 -37042 33756 89871 81150 16911 -51792 -88827
809h8827J1936O5997P8365K4574m0722o2857n2708k3751L3295P8525O1211k470
$$ -88827 -76891 -10894 67471 92045 51323 -11534 -64242 -87993 -54698 23827 85038 82568
821H2568n1889o4889m8995K527O0668P1462L1485j7794n4144o8958l6423L4076
$$ 82568 30679 -34210 -83205 -80678 -20010 51452 82937 65143 10999 -57959 -94382 -60306
833f0306P4624N5425J0257l2092o3867n9839o493N2742O6185M2060j432n2905
$$ -60306 14318 69743 80000 47908 -15959 -75798 -82291 -29549 36636 78696 77264 24359
845B4359p4637l5998K4091N7983N5362L0016k0168o8029o5189j1631M0563O1079
$$ 24359 -50278 -86276 -62185 -4202 51160 81176 61008 -7021 -72210 -83841 -43278 17801
857A7801N3147R886m6466o9955m1598P234M6599O5749M2861j6826o5710o0166
$$ 17801 70948 80834 34368 -35587 -77185 -69951 -23352 42397 85258 68432 2722 -57444
869e7444k0613K2930N7296O2080J9508m0366o4882m8715p235M1743O9252M5934
$$ -57444 -78057 -55127 2169 64249 83757 43391 -21491 -70206 -77441 -35698 33554 79488
881G9488j0199n1759n7667l6635J0674N9129O6432K1105k9030n7945n4082j9334
$$ 79488 69289 17530 -40137 -76772 -66098 -6969 59463 80568 51538 -6407 -60489 -79823
893g9823L5376O6072M7722J801l9632o1655m6848N958N4869O0497K9287j4197
$$ -79823 -44447 21625 69347 71148 31516 -30139 -76987 -71029 -16160 44337 73624 59427
905E9427n0755o0126k7307K7238N9947N1815J3846l1293o2290m9191j272M2607
$$ 59427 8672 -51454 -78761 -51523 8424 60239 74085 42792 -19498 -68689 -69961 -27354
917b7354N6553L9451j311m7756o2851l1107J8244N0993N3465K5221k2967n7358
$$ -27354 29199 68650 67339 19583 -43268 -74375 -56131 -5138 48327 73548 50581 -6777
929f777n1432j2103L0551N5830M8146O156m2135n7942l7145M490M2231N7396L4508
$$ -6777 -58209 -70312 -39761 16069 64215 70371 28236 -29706 -66851 -62361 -20130 37266 71774
942G1774j5337n0616n3274k2491J9966N3855N1948J4324l2061n3711m4147p461
$$ 71774 56437 5821 -47453 -69944 -49978 3877 55825 70149 38088 -15623 -59770 -67231
954f7231L6863N8280L9261n278m3225n4437l3100J2164N0199N2864K2721k1479
$$ -67231 -30368 27912 67173 61895 18670 -35767 -68867 -56703 -6504 46360 69081 47602
966D7602n0727n0831j6464L1361N5299M3628M709l5391n5165l9706M292M3427
$$ 47602 -3125 -53956 -70420 -39059 16240 59868 64577 29186 -25979 -65685 -61393 -17966
978a7966N4312L1016j2131m7791n2882k2330K2197N0514M7538J4407k8353n4516
$$ -17966 36346 67362 55231 7440 -45442 -67772 -45575 4939 52477 66884 38531 -15985
990a5985m3121l742L6495N1746L6709l408m2477n2280k8976J3023M5200N0551
$$ -15985 -59106 -62848 -26353 25393 62102 58694 16217 -36063 -65039 -52016 -6816 43735
1002D3735K1727k1364m9800m5034j2956K8821N0154M0923M885l5026n1878l3929
$$ 43735 65462 44098 -5702 -50736 -63692 -34871 15283 56206 61091 26065 -25813 -59742
1014e9742L258L9879N0926K8388j2793m4083m6883k1222J9232M7451M4572J3108
$$ -59742 -56484 -16605 34321 62709 49916 5833 -41050 -62272 -43040 4411 48983 62091
1026F2091k6555m9963l9510m807L3677M9670L3712l872l8866m8624k7597J1197
$$ 62091 35536 -14427 -53937 -58744 -25067 24603 58315 54443 15577 -33047 -60644 -49447
1038d9447M3728M5590K0342j9341m5393m3100j3038K7113M6853L8523N207l1685
$$ -49447 -5719 39871 60213 40872 -4521 -47621 -60659 -33546 13307 51830 57037 25352
1050B5352m8348l3136L357L7620M7002K7275j1143m1989m5308k0598J9519M3813
$$ 25352 -22996 -56132 -52775 -15155 31847 59122 47979 5990 -39318 -59916 -40397 3416
1062C416M2803J2184k5808m6830l7193m380L1013M7544L2832k885l7315m6422
$$ 3416 46219 58403 32595 -14235 -51428 -55808 -24795 22749 55581 52696 15381 -31041
1074c1041k5865J1211M0466M3890J9280j8376m3915m0416j2685K4595M5399L7373
$$ -31041 -56906 -45695 -5229 38661 57941 39565 -4350 -44766 -57451 -32856 12543 49916
1086D9916L493l0614m4985l1093K788L5605M5768K4796j1296l8428m2397j9101
$$ 49916 53409 22795 -22190 -53283 -50495 -14890 30878 55674 44378 5950 -36447 -55548
1098e5548J7409M3158L9526J0131k3815m2764l7368l815L0167M3908K9607k794
$$ -55548 -38139 5019 44545 54676 30861 -11903 -49271 -53086 -22919 20989 50596 47802
1110D7802l3491m3604k4920J0890L7984M0664J9468j6480m1418l9013j0533K4195
$$ 47802 14311 -29293 -54213 -43323 -5339 35325 54793 38313 -3105 -42118 -52651 -28456
1122b8456M0619L4003N109k8591m4153k9411L430L2918M1488K5120r931l8707
$$ -28456 12163 46166 51275 22684 -21469 -50880 -47450 -14532 26956 52076 42145 3438
1134C438l9442j5733J5701L8681L8634J2572k4137m1344l2217n057K7064M2253
$$ 3438 -36004 -51737 -36036 2645 41279 53851 29714 -11630 -43847 -48904 -21840 20413
1146B0413K9534m264l3063l9774k2801P107L6555M1186J5656j7042l6571l5495
$$ 20413 49947 45683 12620 -27154 -49955 -42848 -6293 34893 50549 33507 -3064 -38559
1158c8559j1995K1870M0843L2508L485k6405m0367k9504L010L3339L9184J9771
$$ -38559 -50554 -28684 12159 44667 48152 21747 -18620 -48124 -45114 -11775 27409 47180
1170D7180q165l2470m0190j7740J7342L8270L2819J0655j8857l9268l2794k936
$$ 47180 39015 6545 -33645 -51385 -34043 4227 37046 47701 28844 -10424 -43218 -46154
1182d6154K7165L7576K6683N4l1041m1499k1152J1712L1645L5227J8739j4544
$$ -46154 -18989 18587 45270 45324 14283 -27216 -48368 -36656 -5011 30216 48955 34411
1194C4411l8582l4684p876J9884L5863L2289O120k8845l7852k4010K636K6061
$$ 34411 -4171 -38855 -46731 -26847 9016 41305 47425 18580 -19272 -43282 -40646 -14585
1206a4585L8748K4605j0386l4942l3837j4936J2614L4866L5330Q701k1582l4545
$$ -14585 24163 48768 38382 3440 -30397 -45333 -32719 2147 37477 46178 24596 -9949
1218i949k9070p461K5162M0470K5291o078k6828l3467k3005O324L4534L6141J2675
$$ -9949 -39019 -46480 -21318 19152 44443 38365 11537 -21930 -44935 -38611 -4077 32064 44739
1231D4739j4443l1224l4144j1833K3160L6706K4863K825j9146l7463k8718M382
$$ 44739 30296 -928 -35072 -46905 -23745 12961 37824 40649 21503 -15960 -44678 -40296
1243d0296L0655L3147J7960n586l0281l6902j3624J6463L1524K9349J1573j7167
$$ -40296 -9641 23506 41466 35880 5599 -31303 -44927 -28464 3060 32409 43982 26815
1255B6815l8873k8136J566K2423L0646K5585R09k9545l6619j7093R532K7785L3303
$$ 26815 -12058 -40194 -38628 -16205 14441 40026 40935 11390 -25229 -42322 -32790 -5005 28298
1268B8298J7704j6917l4616k7176o535J3707L3566L1139L110k7999l2537j8876
$$ 28298 46002 29085 -5531 -32707 -39242 -25535 8031 39170 42280 14281 -18256 -37132
1280c7132o76K4653L6564J8926j1199k8116k9217j6958J2082L5609L0739L872
$$ -37132 -37808 -13155 23409 42335 31136 3020 -26197 -43155 -31073 4536 35275 39147
1292C9147j8725k7962k6584p742K3637L7589K0180m964k3541l1344k2060R791
$$ 39147 20422 -7540 -34124 -41866 -18229 19360 39540 34576 11035 -20309 -42369 -32578
1304c2578L1649K7706J1351r094k9107l4477p999K2828L1235K1655M195j9250
$$ -32578 -929 26777 38128 29034 -73 -34550 -42549 -19721 11514 33169 37364 18114
1316A8114l4281k3656M922K6184K7797J9269m370l1892l2018q167J4367K4937
$$ 18114 -16167 -39823 -34901 -8717 19080 38349 33979 2087 -29931 -38098 -23731 1206
1328A206K7027J2972j7537l5566k3269R74J7397L0420K4813k918k8640k7794j4440
$$ 1206 28233 41205 23668 -11898 -35167 -34193 -16796 13624 38437 35519 6879 -20915 -35355
1341c5355M201K4753L3998J3953j7100l0118k2313q251J2760L2475K6827l67k1923
$$ -35355 -31154 -6401 27597 41550 24450 -5668 -27981 -36232 -23472 9003 35830 35463 13540
1354A3540k6632k1971l2K5868L3221J2838j0699k2055k6769j6282J1254L3710
$$ 13540 -13092 -35063 -35095 -9227 23994 36832 26133 4078 -22691 -38973 -27719 5991
1366E991K5392L339j4773k7553k6160k753K4090K8409J6465r4k0722l2183j9100
$$ 5991 31383 34722 19949 -7604 -33764 -36517 -12427 15982 32447 32353 11631 -20552 -39652
1379c9652J2036K7163K3841J0741p523k8867k9149m023J7315K5957K2468M941
$$ -39652 -27616 -453 23388 34129 26606 -2261 -31410 -35433 -18118 7839 30307 35248
1391C5248k0814l2583j6003N839J9661K5650J9899o074k9763k8153o792J1656
$$ 35248 14434 -18149 -34152 -28313 -8652 16998 36897 30823 1060 -27093 -33885 -22229
1403b2229K4355K6604P713j8898k7821j8415l327J5815L0799K1225o405k4601
$$ -22229 2126 28730 36443 17545 -10276 -28691 -32018 -16203 14596 35821 29416 4815
1415D815k3579j3560M022K4334K9524R215j3937k4114k3038q485J5149L1139J8823
$$ 4815 -18764 -32324 -28302 -3968 25556 34771 20834 -3280 -26318 -34803 -19654 11485 30308
1428C0308j110j6600k4116k1018M98K5453K7649J1403p325k0883k6594j2885J4102
$$ 30308 29198 12598 -11518 -32536 -32038 -6585 21064 32467 25142 4259 -22335 -35220 -21118
1441b1118K6657J9959O270j1120k8568k4546J400K0643K4053J5147Q16k0534k9267
$$ -21118 5539 25498 31768 20648 -7920 -32466 -31066 -10423 13630 28777 29593 9059 -20208
1454b0208j4053J0020K1307K4055J1602r895k8376k2576j770J2915K3496K2253
$$ -20208 -34261 -24241 -2934 21121 32723 22828 -5548 -28124 -29894 -16979 6517 28770
1466B8770M435k1013k7963j4037L384J8071K6401J5360q426k5214k0832r846R178
$$ 28770 33205 12192 -15771 -29808 -26424 -8353 18048 33408 24982 -232 -21064 -30910 -21732
1479b1732K5195K4768L591j7301k3171j7217l624J6116K8717J6494o315j9705
$$ -21732 3463 28231 31822 14521 -8650 -25867 -29491 -13375 15342 31836 25521 5816
1491E816k2819j4002N396K4835K4217O172j0943k1270k2553o683J5718K6248J6888
$$ 5816 -17003 -31005 -25609 -774 23443 29615 18672 -2598 -25151 -31834 -16116 10132 27020
1504B7020n00j4856k4120j8074M170K1068K2939J1254m928k1317k5032q083J2744
$$ 27020 26520 11664 -12456 -30530 -26360 -5292 17647 28901 23973 2656 -22376 -30459 -17715
1517a7715K1806J8482P128j2741k5160j9961J306J6682K2146J5715p42k0628k4676
$$ -17715 4091 22573 29701 16960 -8200 -28161 -26855 -10173 11973 27688 26946 6318 -18358
1530a8358j0342O804J8966K2677J0643j0701k4448j8794l565J1315K2667J9790
$$ -18358 -28700 -21896 -2930 19747 30390 19689 -4759 -23553 -27118 -15803 6864 26654
1542B6654J466j8588k2151j4309J094J8448K4240J3508q540k0893j9846r696R163
$$ 26654 28120 9532 -12619 -26928 -25834 -7386 16854 30362 21822 929 -18917 -28613 -19450
1555a9450K3266K0269L663j3952k1141j7684k354J7667K3001J4052m114j6287
$$ -19450 3816 24085 27748 13796 -7345 -25029 -27383 -9716 13285 27337 23223 6936
1567F936k2526j3314N995K2766K0102O843q257k1017k0948m798J4325K2477J5659
$$ 6936 -15590 -28904 -22909 -143 19959 26802 18545 -2472 -23420 -28218 -13893 8584 24243
1580B4243Q22j4727k3176j4300L621J8864K0204J1188o293j9414k0335p866J0236
$$ 24243 25065 10338 -12838 -27138 -23517 -4653 15551 26739 20446 1032 -19303 -27169 -16933
1593a6933K0745J7762N332j3055k1997j6165N10J4383K1319J3644k007j8778k0268
$$ -16933 3812 21574 26906 13851 -8146 -24311 -23801 -9418 11901 25545 23538 4760 -15508
1606a5508r475N101J8617K0352P826r950k0427j7417m564J1236K1653J5955P17
$$ -15508 -24983 -19882 -1265 19087 26913 16963 -3464 -20881 -25445 -14209 7444 23399 24116
1619B4116j5309k0570j2348J915J6964K0611J0716o914j7746j9213p694Q471K1028
$$ 24116 8807 -11763 -24111 -22196 -5232 15379 26095 19181 1435 -17778 -25472 -17001 4027
1632D027J7018L676j1453k0166j6517l79J4911K0543J1949j972j6493j9680j0118
$$ 4027 21045 24721 13268 -6898 -23415 -23794 -8883 11660 23609 21637 5144 -14536 -24654
1645b4654N744J8865J7547P461r060j9070j7607l882J2256J9639J4982O87j4119
$$ -24654 -18910 -45 17502 24963 15903 -3167 -20774 -24656 -12400 7239 22221 22908 8789
1658H789k0100j2242L077J6346J7999J0143o099j8079j7559o561R181J8344J6664
$$ 8789 -11311 -23553 -20476 -4130 13869 24012 17913 -166 -17725 -24286 -15105 3239 19903
1671A9903L750j1172j9324j4843n33J4402J9417J1902l548j5168j9686q385N283
$$ 19903 23653 12481 -6843 -21686 -22219 -7817 11600 23502 19954 4786 -14900 -23285 -18002
1684a8002J7393J7340O978r279j8849j5150l305J1134J9071J3837J010j4229j7992
$$ -18002 -609 16731 23709 14430 -4419 -19569 -22874 -11740 7331 21168 22178 7949 -10043
1697a0043j1690K172J5579J8783Q013n893j5912j7764n512P589J8595J4598L204
$$ -10043 -21733 -19561 -3982 14801 22814 16921 1009 -16755 -22267 -14678 3917 18515 21719
1710B1719j0143j8738j3760l80J3982J7473J1089k435j4796j7883q412O031J5627
$$ 21719 11576 -7162 -20922 -21302 -7320 10153 21242 18807 4011 -13872 -22284 -16253 -626
1723f26J6597O214q404j7272j5105k807J0485J7287J3414M93j3506j6649j1186
$$ -626 15971 22185 13781 -3491 -18596 -21403 -10918 6369 19783 20276 6770 -9879 -21065
1736b1065K859J4085J7019Q953n313j6349j5497n504P511J6835J4706K946j0924
$$ -21065 -18206 -4121 12898 21851 16538 189 -15308 -20812 -13301 3534 18240 21186 10262
1749A0262j6812j2791n73J2413J6809J1171l585j3567j6251q100N261J5509J5644
$$ 10262 -6550 -19341 -19914 -7501 9308 20479 16894 3327 -12924 -21024 -15763 -254 15390
1762A5390N297p926j5263j4240l642J0820J6167J2442L6j2699j5654j1012K404
$$ 15390 20687 12761 -2502 -16742 -20384 -9564 6603 19045 19081 6382 -9272 -20284 -17880
1775a7880J3716J6496P524m640j4823j5607n777Q748J4855J3810L287r567j6331
$$ -17880 -4164 12332 19856 15216 393 -15214 -20991 -12243 2612 16422 19709 10142 -6189
1788f189j2321P50J2208J5129J0153k209j3716j6138o933N232J3270J5108N710
$$ -6189 -18510 -17760 -5552 9577 19730 17521 3805 -12333 -19266 -14034 -764 14344 20054
1801B0054p691j6307j2081k333R062J5259J1472K97j1715j4806r616K414J2102
$$ 20054 12363 -3944 -16025 -18358 -9296 5963 17435 17732 6017 -8789 -18405 -15991 -3889
1814c889J5567P711n576j4318j3216n528O452J5526J3969J373r708j4673j0251
$$ -3889 11678 19389 13813 -505 -13721 -19249 -12797 2729 16698 18071 8363 -6310 -16561
1827a6561j142J1577J6326R061l058j2423j4450p511M813J4418J2696M838p270
$$ -16561 -17703 -6126 10200 19261 16203 3780 -10670 -18181 -13368 1050 13746 18584 11314
1840A1314j3753j3269k874J0238J4449R934j79r855j5831q420L438J1927J4043
$$ 11314 -2439 -15708 -18582 -8344 6105 16039 15860 6005 -9826 -18246 -14808 -2881 11162
1853A1162O823m002j4051j4032m036P866J3450J1836K569q939j4515j0867J201
$$ 11162 17985 13983 -68 -14100 -18136 -10270 3180 15016 17585 8646 -5869 -16736 -15535
1866a5535R863J4198R174k339j2844j2780o190L812J2045J4240M985q450j3393
$$ -15535 -5672 8526 17700 15361 2517 -10263 -16453 -12641 -596 13644 18629 10179 -3214
1879c214j0840k244Q270J3795J0723j100j1160j2833p992J007J1735J4693N957
$$ -3214 -14054 -16298 -8028 5767 16490 15390 4230 -8603 -16595 -15588 -3853 10840 16797
1892A6797n525j1948j1014n916O880J4042J1768M52p302j2878j0843K2J0674J3928
$$ 16797 11272 -676 -11690 -17606 -10726 3316 15084 15536 8234 -4644 -15487 -15465 -4791 9137
1906I137O812k456j0039j3143p089M910J2646J0854M234n374j3378j1474j067
$$ 9137 15949 13493 3454 -9689 -16778 -11868 778 11632 15866 10492 -2886 -14360 -15427
1919a5427Q761J2008R187Q99r518j4503p505K957J1555J0248P205l615j3017j2420
$$ -15427 -6666 5342 14529 15428 5910 -8593 -16098 -13141 -1586 8662 15867 12252 -765 -13185
1933a3185k238O343J0555J1954K598r065j3274p034N27P425J2385Q942l293j1276
$$ -13185 -15423 -9080 1475 13429 16027 6962 -6312 -13346 -12819 -5394 6991 15933 12640 1364
1947A364j0511n190L518J0832J2418K625o768j1145r904k453P097J3723Q585j552
$$ 1364 -9147 -14337 -10819 13 12431 15056 8288 -2857 -12761 -15214 -8117 5606 14191 12639
1961A2639q141j1420p806J529J1518J1694M556m218r948j1388m049O168J2774
$$ 12639 4498 -6922 -14728 -13199 -1681 10013 14569 10351 403 -10985 -15034 -8866 3908
1974C908Q021J308o355j0947j0789Q35J0520J0863O410j456r773j2212m552M252
$$ 3908 11929 13237 6882 -4065 -14854 -14019 -3499 7364 13774 12318 2545 -9667 -14219 -9967
1988i967J0764R530M199n356j2321r908M61O613J0118Q868Q02r677j2227n338
$$ -9967 797 10327 14526 9170 -3151 -13059 -12598 -5985 4133 13001 13803 4126 -8101 -13439
2002a3439K555Q462J0753O316m461j1274r562k408N036R641J1125P93q553r571
$$ -13439 -10884 -2422 8331 14647 10186 -1088 -10650 -13058 -8022 1619 12744 13537 4984 -4587
2016d587p010j41O889J1896O964l537r269q832n875L264J1422J0137J139n615
$$ -4587 -11597 -11738 -4849 7047 14011 10474 1205 -7627 -13502 -10238 1184 11321 12460 6845
2030F845q914q604l196P465J2228O785j252p387r928p551K616J0042R551L665
$$ 6845 -2069 -10673 -13869 -6404 5824 12609 11357 3970 -5958 -13509 -10893 -851 8700 12365
2044A2365k779r163j0827l290P103R620P091K000o049j1018p770J911P724R455
$$ 12365 9586 423 -10404 -13694 -6591 3029 10120 12120 6071 -4947 -12717 -10806 -3082 6373
2058F373N955j243r399j1014l387M324Q775Q558M139n301j1693p184n91N855R720
$$ 6373 12328 11085 1686 -9328 -12715 -8391 384 8942 13081 7780 -3913 -11097 -11688 -5833 3887
2073C887P829n2r119r432m338J226P739J0194M623m757q966q309k351M234R732
$$ 3887 11716 11664 2545 -6887 -11225 -9999 -2260 7934 12557 7800 -1166 -9475 -11826 -7592 2140
2088B140Q559O36o203r108o547q82Q552J0359M225k924p019q651m970L172R725
$$ 2140 10699 11335 5132 -3976 -10523 -11405 -2853 7506 11731 8807 1788 -6863 -11833 -8661 1064
2103A064Q819J383m505r132p367j629P202Q526N900M4p128r616n372K654Q524
$$ 1064 9883 11266 6761 -2371 -9738 -11367 -4165 4361 10261 10305 3177 -6439 -11811 -9157 -633
2118f33Q214L360l028q575q978k163N482Q705P205J447o302j0084n890J529O365
$$ -633 7581 10941 7913 -662 -9640 -11803 -6321 2384 9589 11036 4734 -5350 -11240 -9711 -3346
2133c346Q744O134k062q353r099l341L869P540Q520K580m541r566o811Q7M793
$$ -3346 5398 11532 9470 1117 -7982 -11323 -7454 86 8606 11186 6645 -2921 -9732 -9645 -4852
2148d852Q123O808r03p171p667m405J326P183Q452L585l693p470p704k096L822
$$ -4852 3271 10079 9176 2005 -5662 -10067 -8741 -1558 6894 10479 6786 -684 -8388 -10484 -6662
2163f662R697O254L12n707p830n806r7P671Q405L401j877o004q054m043L374P993
$$ -6662 3035 9289 9601 3894 -3936 -9742 -9839 -2168 6237 9638 7761 1757 -6297 -10340 -6966 1027
2179A027O638K457m428q056o555j042O458P708M947k87n753r027l947J650P023
$$ 1027 7665 10122 5694 -2362 -8917 -9959 -3501 4207 9154 8867 3114 -5913 -9860 -8210 -1187
2194a187P890L535k613q416o765j807L770P041O832J604o076q132n334R38O136
$$ -1187 6703 10238 7625 -791 -7556 -9363 -5593 1448 8280 9884 3808 -4324 -9658 -8720 -2584
2209b584P206M986j970p318o433l439K854O900P543K266m421p922n188j248M893
$$ -2584 4622 9608 7638 320 -6113 -9552 -6698 202 7745 10011 5590 -2332 -7520 -8768 -3875
2224c875P354N214J54n985p513m500J756O216Q316J766k936o830n650l122M213
$$ -3875 3479 8693 8847 2862 -4651 -9151 -7395 -1179 7137 8903 5967 -863 -6513 -9635 -5422
2239e422P622O170o4l807p643o109O06O384O804M163j414o741o923k776L257O497
$$ -5422 2200 8370 8306 4499 -3144 -9253 -8647 -2263 4541 8704 7290 549 -6374 -9150 -5893 604
2255F04O211J680l186p599n088p86M645O915M500O10o162p367l627J796O554N790
$$ 604 6815 8495 5309 -2290 -7378 -8164 -3519 3396 7896 8506 2344 -5023 -8650 -6854 -300 5490
2271E490L354k846o896n850j171L351O543O124J65m906o944l904l22M771O906
$$ 5490 8844 5998 -898 -6748 -7919 -4568 1975 8099 8264 3358 -3586 -7490 -7812 -3041 3865
2286C865M640j143o609n169m173K605O425O800N19l226o008n511j039M461O954
$$ 3865 8505 7362 753 -4416 -8589 -5984 441 7241 7760 4534 -1474 -6985 -8024 -3563 3391
2301C391M755m26n897n630m666K123N666N842K636k214n963n420k281L636O660
$$ 3391 8146 7720 1823 -3807 -8473 -6350 -684 5158 7794 5580 -383 -5803 -8084 -4448 2212
2316B212M655N54l885o775m273N41N258N862L876j895m663o582k654L103N106
$$ 2212 6867 7421 3536 -3239 -7512 -6971 -1713 4149 8025 6130 1467 -5115 -7769 -4666 440
2331D40O204J021l577o549m624O54K875O646L893r5n061o113k620R34M629O579
$$ 440 6644 7665 4088 -2461 -7085 -6431 -3556 3090 6983 6888 1827 -4286 -6906 -5972 -1343 5236
2347E236K221k222n455n502k219M214O613L790L35m137n546m137M30M621O115
$$ 5236 7457 5235 -220 -5722 -7941 -3727 2886 6676 7011 2874 -2672 -6809 -6379 -1758 4357
2362D357K571m31n482n753k744K623M802N755R50k667n375m946n40M288N519L755
$$ 4357 6928 6497 1015 -4738 -7482 -4859 -57 5698 6648 3981 -1394 -6340 -6880 -2592 2927 6682
2378F682k15m855n512k734M67N545N306K530k690n144m846j394K804N627M716
$$ 6682 6467 1612 -3900 -6634 -6167 -622 4684 7214 4524 -620 -5466 -6860 -4056 1571 6287
2393F287m6l392n522m306O77M682N371K526l95m832n049k709J905N057N622N79
$$ 6287 6241 2849 -2673 -6979 -6302 -1620 3751 6277 5882 1050 -3999 -6708 -4803 254 5876 6455
2409F455l123m971m001l95L585N224L024M81m575n085k690Q06M664M793K447k498
$$ 6455 3332 -1639 -5640 -6035 -2450 2774 5798 6279 1704 -3381 -6071 -5265 -601 4192 6639 4141
2425D141m723m646j219K851N072M301P47l493n152l547J26M142M977K962j365
$$ 4141 -582 -5228 -6447 -3596 1476 5777 6524 3031 -2121 -5668 -5542 -1400 3577 6539 5174
2440E174m108n002k603K209L988N533J053k299n324l782k58L080M535L473J98
$$ 5174 1066 -3936 -6539 -4330 -342 5191 6244 3945 -1379 -5161 -5419 -2339 2196 5669 5867
2455E867m588m625k353M69M429M594K569j628m879m883q46K538M711L412J037
$$ 5867 1279 -3346 -5699 -5230 -801 3793 6362 4734 -145 -5028 -5874 -3336 1375 4787 5824
2470E824l116m821l645j10M343M301L400q75m950m139k335J677M995M261J465
$$ 5824 2708 -2113 -5758 -5868 -1525 2776 6176 5301 351 -3788 -6123 -4446 549 4810 6275
2485F275l060m092m137K12K258M530L484j70m308l943k836J311L821M476J641
$$ 6275 3215 -877 -5014 -4802 -2544 1986 5470 5300 992 -2951 -5787 -4476 -655 3821 5462
2500E462j145m023m721q92J221N339L508P51l823l644l010L9K788M660K929q11
$$ 5462 4317 294 -4427 -5319 -4098 1241 4749 5500 1677 -1967 -4977 -4938 -2150 2510 5439 4628
2516D628l729m454k133J979M343L200J184j972m064l809l63L008M005L292L98
$$ 4628 899 -3555 -5688 -3709 634 3834 5018 3046 -1018 -4827 -5190 -2182 1823 5115 5513
2531E513m251m464k424J628L244M060K042j307m366m838M38K089L108M117K41
$$ 5513 1262 -3202 -5626 -3998 -754 3306 5348 4041 -325 -5163 -4725 -2636 472 4589 4830
2546D830k730m386k566K96K922M719J939p24m219k995k147J709L426L912J271
$$ 4830 2100 -2286 -4852 -4556 -1634 3085 5024 4300 81 -2914 -5061 -3352 74 3986 5257
2561E257k096m074l073j424L009M407K530L83l277l234l200M34L754L311J799
$$ 5257 3161 -913 -3986 -5410 -2401 2006 4536 4919 1642 -1592 -4792 -4358 -604 2707 4506
2576D506j126l518l091j875K345L790K971M07j570m189l205l71L864L808J692
$$ 4506 3380 -138 -3229 -5104 -2759 1031 4002 4409 2839 -1350 -4555 -4926 -1062 2746 4438
2591D438N3l635l793k014J862L199L434J235j722m094l268r5K200L707K669P2
$$ 4438 4491 856 -2937 -4951 -3089 110 3544 4779 3057 -1037 -4305 -4400 -2200 1507 4176 4248
2607D248k514m256j995Q35K942L465J476m06m062l203p07J800K316L870P77k215
$$ 4248 1734 -2522 -4517 -3682 -740 2725 4201 3795 -267 -3470 -4177 -2377 -61 3809 4586 2371
2623B371m340k135N8J966M371K310j209k670l056k205J315L082L764R60k035l409
$$ 2371 -1969 -4104 -4046 -2080 2291 4601 3392 722 -2334 -4539 -3224 -142 3622 4582 2547 -862
2639h62k555j043K077M475K231k80k794l022k646J096K669L209J444k87l157l927
$$ -862 -3417 -4460 -2383 2092 4323 4043 1249 -1773 -4419 -3323 -654 2555 3999 3712 555 -3372
2655c372j049J962L314K221N37q07l695l365j7L545K800K206m93l318k652j382
$$ -3372 -4421 -2459 855 3076 3613 2806 -889 -4254 -4271 -726 2074 4280 3787 469 -2183 -3565
2671c565P37K430K504K046j808l410k608j67J854K842K456M80k322l151k074K24
$$ -3565 -2828 -398 2106 4152 2344 -1066 -3674 -3841 -1987 855 3311 3791 1469 -1682 -3756 -3532
2687c532K252L568J618j127l226k059j932J255L710K761M17j755k741k714n78
$$ -3532 -1280 2288 3906 2779 -447 -2506 -4438 -3183 527 3288 3705 1950 -791 -3505 -4083
2702d083K748L289K073o54j949l635j828J414K865K785O17j423k617l095m78K258
$$ -4083 -1335 1954 4027 3373 1424 -2211 -4039 -2625 240 3025 3642 2219 -398 -3493 -3971 -1713
2718a713L243J664M27j925l309k267N10K396L214J372p8l489k842p28J301K158
$$ -1713 1530 3194 3621 1696 -1613 -3880 -3370 -974 2240 3612 3534 45 -2797 -3525 -2224 -66
2734f6K757P73j417l022k548Q3J572L462J745l34k332k830j804J652J971K903
$$ -66 2691 3464 2047 -975 -3523 -3440 -1868 1594 3339 3005 673 -2157 -3961 -2309 -338 2565
2750B565J386j742k682j384j495J454L070J604O07k579k274j886o48K934K995
$$ 2565 3951 2209 -473 -1857 -3352 -1898 1172 2776 3383 804 -1470 -3356 -4004 -1070 1925
2765A925J898j287k114k686j243Q72L090K138N48j110k394k713o2K097K712J698
$$ 1925 3823 2536 422 -2264 -3507 -2635 455 2593 3141 2031 -363 -3076 -3138 -1041 1671 3369
2781C369m80k153k316k200J235K331K457R47j072k196k601r58K424K147J588P88
$$ 3369 2889 736 -1580 -3780 -2545 -214 2243 3190 2118 -78 -2679 -3637 -1213 934 2522 3310
2797C310k193k336k020N83J892K753P70n6j966k876o80R70K346K049O69j945k175
$$ 3310 1117 -1219 -3239 -2656 -764 1989 2759 2703 737 -2139 -2819 -1849 497 2546 3215 1270 -905
2814i05k136J99J360K833K185l04l235k136p01K16K511K395J189j201k222j999
$$ -905 -3041 -2842 -1482 1351 3536 3232 -3 -2139 -2840 -2624 -113 2282 3471 2270 48 -1951
2830a951q66R42L046J315K39j191k752j769M8K150K348J308j116j369k191j692
$$ -1951 -2817 -1875 1171 2486 2725 1534 -1218 -2987 -2939 -789 1559 2867 1751 382 -1809 -3501
2846c501J657K507J831L04j085k218k288l11J941K097J889j062j217j810j777
$$ -3501 -1844 663 2494 2798 1713 -505 -2793 -3104 -1163 934 2823 1761 544 -1266 -3043
2861c043J115J564K214J187j220k080k417O2J163J522K064K93j275k272j394M92
$$ -3043 -1928 -364 1850 3037 1817 -263 -2680 -2618 -1455 67 2131 2424 1149 -1123 -2517 -2025
2877b025J613J811J233k87j520k845q48Q67J836K429J84o60k784j416k11J598
$$ -2025 -412 1399 2632 2345 825 -2020 -2868 -2001 -165 2264 2448 1788 -996 -2412 -2623 -1025
2893a025K587R00P2j754k433q61n9K464J669J548j471j651k000j132J813J622
$$ -1025 1562 2462 2534 780 -1653 -2514 -2573 -109 1560 3108 1637 -14 -2014 -3146 -1333 289
2909B89K668n59j167j744j910k60K305K266Q14q29j868k249k07N07K265J494R60
$$ 289 2957 2398 1231 -513 -2423 -2683 -378 1888 2702 1873 5 -2244 -2451 -1944 321 1815 2775
2926B775r14k452j549m60J759J840R29P19j799j705j922K81K441J806P22r50j869
$$ 2775 1861 -591 -2140 -2600 -841 999 1928 2647 848 -857 -2779 -2498 -57 1749 2471 1521 -348
2943c48j551p75J619J437K032k60j513j594r32K08J107K223M24k7k103j221j258
$$ -348 -1899 -2674 -1055 382 2414 2154 641 -953 -1885 -1677 -570 1653 2077 2050 -53 -1274 -2532
2960b532J008J988J352Q26j712j945q26n16J082K045R88Q87j807k332p50K28J198
$$ -2532 -1524 464 1816 2642 930 -1015 -1841 -2357 -1275 770 1758 2645 838 -1494 -2244 -2016 -818
2977h18K314O34l35k409j425l35N11K716J193q0j583j533j074q6K096J149J362
$$ -818 1496 2130 1795 -614 -2039 -2374 -1863 853 2046 1966 383 -1150 -2224 -2310 -214 935 2297
2994B297k16j567j767r53L70J032K084J029n76j743r33j118O37K185K104q63j342
$$ 2297 2081 514 -1253 -2206 -1836 -804 1280 2309 1733 -10 -943 -2061 -1424 761 2865 2002 660
3011F60k195r95P89J495J759O63q52j209j678m3oK077J682l94m16k229j344l9
$$ 660 -1535 -2530 -1741 -246 1513 2176 1324 115 -1563 -1606 -1612 465 2147 1753 1337 -892 -2236 -2275
3029b275J748J337J035l90j140j258p38q7J796J438O86r44j011j844k51Q14J971
$$ -2275 -527 810 1845 1455 315 -943 -1681 -1768 28 1466 2152 1208 197 -1647 -1898 -1084 887
3046H87Q68L63r03k310j199o4J893J574M47Jk060j242k24J431P45J640L02n93
$$ 887 1755 2118 1215 -1095 -2294 -2358 -465 1109 1556 1557 -503 -1745 -1969 -538 207 1847 2149 1556
3064A556k681j038n05J917J133J390P81j920j786r71Q27J664R23J084j676q19
$$ 1556 -1125 -2163 -2668 -751 382 1772 2553 633 -1153 -2124 -1297 367 1290 2374 698 -121
3080a21j285p75J284J407J675o36q92k071k91m36J687J359J439r53j600j222n09
$$ -121 -1406 -2181 -897 510 2185 1549 657 -1414 -1705 -2141 -454 905 2344 1391 -209 -1431 -1940
3097a940J005J625J113l40o10j177j409K64Q50J692J225r85j284j373q14J242
$$ -1940 -935 690 1803 1463 853 -324 -1733 -1469 -619 1073 2298 1313 29 -1344 -2158 -916
3113i16J222J151j04J27k184j266P09J066R40O96k73r14j130p46K37K011L92O62
$$ -916 306 1457 1353 1480 -704 -1970 -1261 -195 745 1441 1168 254 -876 -1622 -1385 626 1018 1680
3131A680K12j470j407j337J740R47P84N74j133l90k126N27O80J415O53J69j349
$$ 1680 1892 422 -985 -2322 -582 365 1149 1723 590 200 -1926 -1399 -719 696 1349 1518 169
3148A69j585k76M58J726P00J2k49q43j336r00Q58J704P12K67n49j473o35r7R17
$$ 169 -1416 -1692 -1234 492 1192 1204 955 112 -1224 -2124 -1266 438 1150 1417 868 -605 -1240 -1337 -420
3167d20J571J03j0j301m8j470O91Q48J456k10m02j014j262k91J148J223J647j053
$$ -420 1151 1254 1244 -57 -105 -1575 -884 -36 1420 1210 808 -206 -1468 -1759 -611 612 2259 1206
3185A206q50j954Q5O98J189N07N14p4j353j306m47R56J144Q44r5o55j119r53O2
$$ 1206 356 -1598 -1513 -815 374 881 1395 1321 -32 -1338 -1785 -829 315 1159 1064 409 -710 -1663 -1601
3204a601J212J414L89L43j592j354M05Q1N21J689j57j203o78j245O07P78J082
$$ -1601 -389 1025 1414 1757 165 -1189 -784 -703 -182 1507 1350 147 -531 -1776 -1169 -391 691
3221F91J075o63q03r45m71j3R62J319K39p19p94o18p92J009J057R34l35m63r68
$$ 691 1766 1103 300 -645 -1116 -1129 -167 1152 1391 672 -122 -740 -1532 -523 534 1468 1133 670 -298
3240b98j157J41J176P23J148J04k059p80l34K27J370L88J84l23r94q68K18P86
$$ -298 -1455 -1314 -138 585 1733 1837 -222 -1002 -1336 -1109 261 649 833 510 -484 -1352 -1134 -348
3258c48J515P4p3r21j201k03k2J202J344K66j059q88o85m26Q28J107Q86r4r99
$$ -348 1167 1241 1168 247 -954 -1157 -1179 23 1367 1633 574 -314 -999 -1425 -597 510 1396 1302 303
3277C03j044j13k82P16R01J337l18k029m98l50O59J060P64k09k91l35j589K73
$$ 303 -741 -854 -1136 -420 481 1818 1500 -529 -1027 -1377 -718 342 1106 897 606 271 -1318 -1045
3295a045O17J138Q78o82j144k43o70K82J423L46M52j161N7n83j113O12J801M26
$$ -1045 -428 710 1588 906 -238 -481 -1151 -869 554 900 1352 191 248 -335 -1448 -836 965 1391
3313A391m50l04j294o27M22N52J535J14m39r22q52q95J086Q25N23%J68j029r81
$$ 1391 941 637 -657 -1284 -862 -310 1225 1339 900 -22 -874 -1769 -683 142 665 665 833 -196 -1177
3332a177l03J114J017J17l58R0j189L94j285J471O41P72q84l89q48l36Q89J38
$$ -1177 -1480 -366 651 768 410 500 -689 -295 -1580 -109 532 1304 420 31 -817 -1153 -264 -126
3350a26J068L71j075m64r68K53p8J520Q57m39n30j026l77N55J193L81j44l5j591
$$ -126 942 1313 238 -226 -1194 -941 -1019 501 1358 919 389 -637 -1014 -459 734 1115 971 936 -655
3369f55J3n72N94J675n13M31p98q43l32o42J688Q99j0o95J57j572K67O10R79P63
$$ -655 -642 -1214 -620 1055 542 973 175 -668 -1000 -1642 46 945 935 240 397 -1175 -908 -298 681 1444
3389A444o55L6j611n47O04M73N09J137m89p50j229K11K67R31N10N94l89j721n53
$$ 1444 789 825 -786 -1333 -729 -256 253 1390 901 151 -1078 -867 -600 331 841 1435 1046 -675 -1228
3408a228J2J072Q12K1M9p69n43ll56Q37P90N7K26j332O7o48J20R63J023l92o71
$$ -1228 -1216 -144 668 689 738 -31 -574 -577 -933 -96 694 751 977 -355 -288 -936 -816 147 1170 778 107
3429A07q5j031n9N41R96R77q45k08r14o33J94J597N14n90j9l24q08m16N82L75
$$ 107 22 -1009 -1068 -527 469 1446 601 393 -521 -1154 -960 637 1151 561 542 218 -590 -1006 -424 -49
3449d9J555j097Q7p50r04P92J033M85l79j72p96l55p02P23L02Q61J039j005o46
$$ -49 1506 409 496 -254 -1158 -366 667 1152 773 601 -195 -550 -1252 -529 -227 634 1673 668 22
3468B2r70k0P67Q57n9Q1m50j429O06j26L19J240m18k91j35p38o59O25Q48K03Q44
$$ 22 -948 -968 -201 656 597 678 228 -1201 -595 -721 -402 838 420 129 -6 -744 -1403 -778 70 273 1117
3489A117j071r82j43M45P92L4L26K6M0j020q25J017M70Q31o28p44r8p01K51O31
$$ 1117 46 -936 -1079 -634 158 192 518 544 584 -436 -1261 -244 226 1057 429 -315 -413 -1114 -863 -232
3509b32N56N28k22q56J7j78l7k72J366L09j037o60M2k65Q40Q41J47m93j73k77
$$ -232 324 852 630 -226 -209 -387 -424 -696 670 979 -58 -718 -676 -941 -101 740 887 394 221 -56
3529e6n42q5P34N09J52K76r54o41p17J53J098J331o1m10j225j0J10L41R6Q95r53
$$ -56 -598 -683 51 560 712 988 34 -607 -1324 -1171 -73 1258 1197 787 -438 -448 -338 3 99 994 41
3550D1n4q97j61O14K96N96K58n60m84p6j27L53K25M70rJ13j299j53J17P24O67
$$ 41 -13 -910 -1071 -457 -161 435 693 133 -351 -427 -554 -201 24 494 485 598 -701 -854 -737 -13 654
3571F54k98Q29j561L07p89K65l2Q24O56j58j076j63o17J215N54J51M7r11N6o16
$$ 654 356 1185 -376 -69 -858 -593 -625 199 855 697 -379 -542 -1159 56 610 761 808 -103 -47 -663
3591f63p1N79M17J96Oo10Q3m25M21n20J340n59K64p47L2j63k33J343l92J71o68
$$ -663 -734 -155 262 458 464 -146 -63 -488 -67 -587 753 194 458 -289 -257 -420 -653 690 298 469 -199
3612a99j57l28k78O12P63P49o98l43q30j67O64J23J541p74j45l04p27q0j08J508
$$ -199 -356 -684 -962 -350 413 1162 464 121 -709 -876 -212 -89 1452 678 533 229 -498 -578 -686 822
3632H22k54M2n47k71m91L98L38K58K03k77m71L6l04PM82O60p98N75n33p80l27
$$ 822 568 610 63 -208 -699 -301 37 295 498 221 -250 -214 -518 -511 -29 631 -167 408 -125 -905 -1232
3653a232J673L38n25l43L08r16Q2P1Q86j35L73l51J60j304K48L54j18O30J91p29
$$ -1232 441 779 254 -89 219 -697 -615 -544 342 207 580 229 389 -915 -667 -313 -431 199 390 -339
3673c39O62o30K81j63K42R23q07P3q03L17j91N78L94l32m46j02o3J96M62K95p8
$$ -339 323 -307 -26 -189 53 976 169 242 -561 -244 -435 143 537 205 -241 -343 -406 -210 252 547 469
3694D69k58m29m9n49J018N8n0Q45q92j65k19k12l01R06p84J035r14j17L90K1J05
$$ 469 211 -218 -267 -816 202 260 210 1055 163 -2 -221 -433 -734 172 -612 423 -491 -608 -218 -197 -92
3715i2L91l03R54j643L12m96Q04l5M28m5O37j675K80j35O35J41l39R43j333J38
$$ -92 299 -4 950 -693 -381 -877 -73 -108 320 275 912 -763 -483 -618 17 158 -181 762 -571 -433
3735d33J89J69q2N64M34p65j96L76n65O25o2m4J65M0n78j21L55L74L87m29k06
$$ -433 -244 -75 -157 407 841 76 -120 256 -309 316 254 210 375 415 -163 -284 71 445 832 403 197
3756A97j51K4L77r08P41L00n17K7J07o57J87N36R2k60M57l30l40K5J44J54R6m2
$$ 197 46 70 447 -461 280 580 63 90 197 -460 -273 263 355 95 552 222 -118 -93 51 205 301 259
3778B59o92k93N33J07j1N02n07P74p10Rm07R5k96M28K24K87J98q62P6N00k4L84
$$ 259 -433 -726 -193 -86 -97 405 -102 672 -38 -29 -436 -341 -637 -209 15 302 500 -362 -286 214 190 574
3800E74j99M0p77p5j11J00J044m03P4j96o69Q51o52K63J81j29K93k88k90R8ML77
$$ 574 375 415 -362 -437 -548 -448 596 193 267 71 -598 253 -399 -136 45 -84 209 -79 -369 -271 -267 110
3822A10k51L34l62o46P90P11o27K23K03%j80j028P8J49M13l1P56p39K30k69k12
$$ 110 -141 193 -169 -815 -25 686 59 282 485 485 305 -723 -645 -496 -83 -114 642 -97 133 -136 -348
3843c48N45j66M77j8K08j069J07M72n00O15k29L10m26q39O39L11K00o04N07K61
$$ -348 197 31 508 490 698 -371 -264 208 -292 323 94 404 -22 -861 -222 89 289 -315 192 453
3863D53m36K7k02K6N19J89o48M55j551J074l85P66o6M08r67K76m26O56n55J91
$$ 453 17 44 -158 -132 387 576 -72 383 -1168 -94 -479 287 221 629 -338 -62 -488 168 -387 -196
3883a96N13PJ36m23n95J64P71l03K76K6j17m01J05m44N13n9O08J4n31j13l19k16
$$ -196 317 324 460 37 -558 -394 377 74 350 376 259 -142 -37 -481 32 -27 581 595 64 -49 -368 -584
3905e84N34L42J13q97N67o78K14M76K30J12q97L16p08N35l10P95j93M22k26n43
$$ -584 -50 292 405 -492 75 -603 -389 87 317 429 -468 -152 -860 -325 -635 160 -33 389 163 -380
3925c80K57K17l50J65L57O36o95K31n08k33m33K47M71l77J33J09r1o8J57M64P03
$$ -380 -123 94 -256 -91 266 902 207 438 -70 -303 -736 -489 -18 -395 -262 -153 -244 -312 -155 309 1012
3946A012o59k87l9p49j52J152J02r44K80J99M18q63mP78k75K34l3j18K74J40J63
$$ 1012 353 66 27 -722 -874 278 380 -564 -284 -85 333 -530 -534 244 -31 203 170 52 326 466 629
3967F29K3m04N9p48L56k85L93L35k68p5n39L59k40j62P54K49p9J53n34j63k36
$$ 629 652 248 307 -441 -85 -370 23 358 90 15 -524 -165 -405 -567 187 436 357 510 -24 -187 -423
3988d23N89o1m77k2j33O10J42j36k28K04N04l01j23q35J063q84P93j72m17L16
$$ -423 166 105 -372 -394 -527 83 225 89 -139 65 569 268 145 -690 373 -511 282 110 -307 9
4008Ik32M1k25L74M11L6k47J62m73p2N4M3N60R3n91M13l36k60L02j93RJ93M50
$$ 9 -223 -182 -407 -33 378 414 167 329 -144 -216 -162 -119 441 534 -57 356 20 -240 62 -131 -122 71 521
4031E21n83l4q8J1M87n8m60Q59q69R0p0RN26l8k19J03n25J72L58m46j03P71m21
$$ 521 -62 -96 -184 -173 314 256 -204 655 -214 -124 -194 -185 341 303 84 187 -338 -166 192 -254 -357 414 -7
4054gl19M53o39O61j02K30L26n36j93K38o73j1O40K84l52l18J36j70J127o27l85
$$ -7 -326 127 -512 149 47 277 603 67 -126 112 -561 -572 68 352 0 -318 -182 -352 775 148 -237
4075b37P45r21L44K7m8j36N01K94k74q30O52m84J41J37L33j20M92o80k12M05N2
$$ -237 508 -413 -69 -42 -90 -226 275 569 295 -535 117 -367 -226 -89 244 124 616 -64 -276 129 181
4096A81n5l09K07K04n52L1J77j80Q06p88L65j31j87Q28j389L69O22q8k01l39O01
$$ 181 126 -183 24 228 -324 -293 -116 -296 510 -278 87 -44 -231 597 -792 -423 199 111 -90 -429 172
4117A72n12J66N35M3l36Q9l66J90j31j22Q9J3N2R1m29PL39L28R7M92m61J03o57
$$ 172 -340 -174 361 404 68 157 -209 -19 -150 -272 -183 -170 -118 -27 -456 -449 -110 218 315 807 346 449 -208
4140b08P9J07m02O24j09qm06J25Q5r6L40k1R9m97l31P52L19j91k13M31j84N3p19
$$ -208 -129 -22 -424 200 91 83 -323 -198 -113 -209 131 110 209 -288 -619 133 452 261 48 479 295 348 -371
4163c71K40J88N79k97K54k87p72O0N95J06k96l51O26o24o82P88O69n04M17K24
$$ -371 -131 57 636 339 593 306 -466 -406 189 295 -1 -352 274 -350 -1032 -244 425 -79 338 562
4183E62m83m45L30J03k91M92o62O91m19K60l45J01L7j76P29R4r50ol04K91Q64
$$ 562 79 -366 -36 67 -224 268 -394 297 -122 138 -207 -106 -69 -245 484 578 -372 -378 -682 -391 473
4204D73q01K25L3j97K87m38M28J84K47j08p03l21J027N6o01L79k30k38j25P7J50
$$ 473 -328 -103 -70 -267 20 -418 10 194 441 333 -370 -691 336 392 -209 170 -60 -298 -423 -346 -196
4225a96L15j16K87k20J21J53l49k54N30J80k91J89j25p10p2R51L6n13J58J1l39
$$ -196 119 3 290 70 191 344 -5 -259 271 451 160 349 224 -486 -558 393 429 -84 74 85 -254
4246b54n38M36Q74j32m50m2l06O86m66j42M64J83o1l07K90n74N2O00J40K48n07
$$ -254 -792 -356 518 386 -64 -106 -412 274 -192 -334 130 313 252 -55 235 -339 -287 313 453 701 194
4267A94n55KJ51M01k95L97M36j208O03l97N36k69J55K4J27o54R8j32Q4J00j73
$$ 194 -361 -359 -208 193 -102 295 731 -477 126 -271 265 -4 151 175 302 -352 -254 -386 -302 -202 -375
4288c75P23m30k90l53L94j07Q65q7L75o49j23p46J048K09M7m43L57o9o35L33o
$$ -375 348 -82 -372 -725 -331 -438 427 340 715 66 -57 -803 245 454 501 58 415 346 -289 44 38
4309C8L22k37J40o6q82J36m72Q28J71M67j16m14K60p60M38O45n71m67J045p35
$$ 38 360 123 263 197 -685 -549 -1021 -193 -22 445 329 -85 175 -585 -147 498 -73 -540 505 -230
4329b30N21r66P52J06P6M54n28o44k1P5QO01K75n35m03p1K80L16N06m76J18q6
$$ -230 291 -675 77 183 259 713 185 -459 -480 -405 -397 204 479 -56 -459 -530 -250 66 572 96 214 128
4351A28J66k72j50M52n96P61k14o6Ll65n6K8L62m5r51L33J32k98Q53k25M53m80
$$ 128 294 22 -128 324 -272 489 275 209 212 -153 -209 -181 181 136 -815 -482 -350 -648 205 -20 433 -47
4373d7k61p1K48k58m36J148n9n41N80o60r3n22J860j025N64m07K09n69K94k46
$$ -47 -308 -379 -131 -389 -825 323 264 -277 303 -357 -450 -972 888 -137 427 20 229 -340 -46 -292
4393b92Q0M39p05M15j36n61J57Q81n75M72q2l87j92J62K86k25N19j4n71K41q29
$$ -292 -212 227 -478 -63 -199 -760 -603 278 -297 175 93 -294 -486 -324 -38 -263 256 242 -329 -88 -917
4414i17J236l73k7O12l21l21p44K66Q00rK21M85p56J06p76O28j66M60p24k8M23
$$ -917 319 -54 -81 531 210 -111 -855 -589 211 202 423 908 152 258 -518 110 -56 404 -320 -348 75
4435G5j18j247R81L15J1L3j26l80K8O27P5k23P58P0r32J41k85J52l18O94K46J19
$$ 75 -43 -1290 -309 6 17 50 -76 -456 -428 199 274 51 809 879 -53 88 -197 -45 -363 331 577 696
4457F96r75l76P95j87K80K66k80j67o45k52J014n63N76K31m92K5L03m63N90j01
$$ 696 -279 -655 140 -47 233 499 219 52 -593 -845 169 -394 182 413 -79 -54 249 -214 376 275
4477B75m09M26Q3n38k86L69M19k43N9K7j67l98j2M97O8K29k36M27q65K42p57O99
$$ 275 -134 292 375 -163 -449 -80 339 96 155 182 15 -383 -395 102 170 399 163 590 -275 -33 -790 -91
4499i1K83L08J56j13j65j419J038J02L19K19l67k88l10j05O10M15l59p2N2J89
$$ -91 192 500 656 543 378 -1041 -3 99 418 637 270 -18 -328 -433 177 592 233 161 213 402
4519D02n96m25Q37L53m92R39l58j411P78n25O29K07p01J84j31m79O26P1k42P25
$$ 402 -194 -619 218 571 79 1018 660 -751 27 -498 131 338 -363 -179 -310 -789 -163 -92 -334 391
4539C91J82p28k14o38O43O37o2m81N98o92k03q1K05J472n26k84p8l44J21j157
$$ 391 573 -155 -369 -1007 -364 273 211 -270 328 -364 -567 -648 -443 1029 503 219 141 -203 -82 -1239
4559a239Q15M51M20m14J50j28J14n62O22K58K59m45l04l9m89P77l32O85j85O5
$$ -1239 -424 27 447 33 183 55 169 -393 229 487 746 301 -3 -42 -531 246 -86 599 414 479
4579D79p7m15m96q7O87O36m33k27K33l89j45P1O69K71j12n99k80l43K8M25K42
$$ 479 402 -13 -509 -596 91 727 294 67 300 -89 -234 -163 506 777 665 66 -214 -557 -529 -104 138
4600A38K76q35Q11r49K72J161r17O72l51J58o34n35L09O75M2M62j67m48q53J87
$$ 138 414 -421 390 -559 -287 874 -43 629 278 436 -198 -733 -424 251 293 755 588 140 -713 -526
4620e26P61m51R69m82o98O76l34j51O34j78K61j82n18J47M2K60q8J96O48q11o71
$$ -526 235 -216 753 271 -427 249 -85 -236 398 220 481 299 -219 -72 -30 230 142 338 986 175 -496
4641d96K08j60O19N25m46J49l7o57J54l14N01p6P64O6q46q36N58Q9L43Q98j175
$$ -496 -288 -448 171 696 250 399 362 -295 -141 -455 46 -30 734 800 -46 -882 -324 -235 108 1006 -169
4662a69L27o4k35m76O72J80K35m87P69o12l00J10K04j76L30K33r61J21J28k55
$$ -169 158 94 -141 -617 55 235 470 -17 752 140 -160 -50 154 -22 308 541 -420 -299 -171 -426
4682d26N59L7M9k27n66k35K81J33J425p76m6M94j263M4N88K84J53k00k57m73o09
$$ -426 133 170 219 -8 -574 -809 -528 -395 1030 254 208 702 -561 -517 71 355 508 308 51 -422 -1031
4703a031Q83J25R8N81j02m04k04m68Q89m14M9P88k29n31r53M92Q35O6n96R66j467
$$ -1031 -148 -23 75 656 554 150 -54 -522 367 -47 2 790 561 30 -923 -431 404 470 -126 840 -627
4724f27J03N89n08P99m4k38K70p01K14l57M7O13L24N03r74K66o11L7R13l85m03
$$ -627 -524 65 -443 356 312 74 344 -357 -143 -500 -453 160 484 987 13 279 -332 -295 618 233 -170
4745a70L20l75P1m3k9K11O79L25o23q29n30O81K80J49k51p9L50l78JL20J04J29
$$ -170 150 -225 -154 -197 -226 -15 664 989 366 -463 -993 -312 -32 117 -134 -213 137 -241 -240 80 184 313
4767C13J98J74q89j83J96J90K61M01p2j88l45J56j143M63J033o13O37k43p05J91
$$ 313 511 685 -204 -387 -191 -1 260 661 589 401 56 212 -931 -468 565 -48 589 346 -359 -168
4787a68j56R13o5l25J18k09l27O58o19R78o86j98R5m02J37m27%P30O27n06k10
$$ -168 -324 589 524 199 317 108 -219 439 -180 798 112 -86 9 -393 -256 -683 -683 47 674 168 -42
4808d2J1j12n4L22Q71j93r04o07L02l71P90L64L04R5n53n17o86L69P46M68m64
$$ -42 -31 -143 -197 125 996 803 -101 -708 -406 -777 13 377 681 776 223 -294 -980 -611 135 603 139
4829A39l5k32q98l60Q76J112k50J47m33J7r1o08O59Q21j03p45k45j92Q3N11k36
$$ 139 104 -128 -1026 -1386 -510 602 352 499 66 83 -8 -616 43 864 761 16 -229 -421 -338 173 -63
4850f3Q53k68m34m45q1M04M07n42L72O20j055p21L05L48L90P7J90M91j623O92
$$ -63 790 522 88 -357 -438 -34 373 -169 203 823 -232 -953 -648 -300 90 167 357 848 -775 -83
4870h3K12j02K61L51l85l84J33m20j50K61J060r24k71J9M19n36L4J254q23J02
$$ -83 129 27 288 639 254 -130 3 -417 -567 -306 754 -170 -441 -422 -3 -539 -505 749 -74 28
4890B8k61L48J20r65O73K81N12p70P4l52m33Q24N6LK15m33Q9m17m88O02J088q63
$$ 28 -233 115 235 -730 -57 224 736 -34 40 -312 -745 79 135 138 353 -80 9 -408 -896 -294 794 -69
4912f9J14J13k47n91k92O99O23J16m49Lj20l9R6l14O93L69j114P97p85k10R24
$$ -69 45 158 -89 -680 -972 -273 350 466 17 20 -100 -139 -43 -357 336 705 -409 388 -397 -607 317
4933C17N5j19L64p34l49J49R7P44o46N83m28o2o40L01M02J56R1L55K65k75j346
$$ 317 372 253 617 -117 -466 -317 -220 524 -122 461 33 -29 -669 -368 34 190 281 636 901 626 -720
4954g20N70L33j75L47L7n95l48J31P96k29k53Q71r91l39n7L80j48Q54O47n62k47
$$ -720 -150 183 8 355 392 -203 -551 -420 376 147 -106 765 -226 -565 -622 -242 -390 464 1111 549 302
4975C02n8r0p23Q80J63L5m03m70n31R27p7O56j33N63q8j078k59k55M74K74O91
$$ 302 244 154 -569 311 474 509 106 -364 -895 32 -45 611 478 1041 953 -125 -384 -639 -165 109 800
4996H00j03j114l83O71k11P60O06r48N47o62m17L93m94O53O94q10J80k70p9l93
$$ 800 697 -417 -800 -129 -340 420 1026 78 625 -37 -454 -61 -555 98 792 -18 162 -108 -187 -580
5016e80J104J73l29q38J283j280M43K33j26O29J39p67q64M09R0j01R71k80o38
$$ -580 524 697 368 -470 813 -467 -24 209 83 712 851 84 -780 -371 -281 -382 589 309 -329
5035c29Q33r91M13j094J601n72O0J44l65j44M72j02PO86l1p00k87OP68l12K2J063
$$ -329 504 -487 -74 -1168 433 -139 -79 65 -300 -444 28 -74 -67 619 588 -112 -399 -393 375 63 85 1148
5057A148r63n72L15m8l25R20R1o25j36K40J3l36J73K64J72k30M6j29k09O61p53
$$ 1148 185 -387 -72 -120 -445 475 566 -59 -195 45 58 -278 -105 159 331 101 147 18 -191 470 -283
5078b83J321p24p5q10jj80Q69J10M9l32r5m63m50J286j22j00J94l92j02k84K55
$$ -283 1038 314 239 -571 -572 -752 117 227 276 -56 -151 -614 -1064 222 100 0 194 -198 -300 -584 -329
5099c29K30L91K47No67m01P5L29O6P60j82k49j83m02k75J34P10K24j0m87r06N17
$$ -329 -99 292 539 544 -123 -524 -449 -120 -54 706 524 275 92 -310 -585 -451 259 483 473 -14 -920 -403
5121d03j01O52k39J095o63r49k38M87j24L03L74k61m76L54j17m6j54N88M10K31
$$ -403 -504 148 -91 1004 341 -608 -846 -359 -483 -180 194 -67 -543 -189 -306 -352 -506 82 492 723
5141G23l57r29j21L00O24M15m60K92n33p91R02l31R52o90J95k02p54l4N33l49
$$ 723 366 -563 -684 -384 240 655 195 487 -46 -837 65 -266 686 -4 191 -11 -765 -799 -266 -615
5161f15Q78L08O2j90r85k13L36L0L33L66j19n57q8j18J139p33j31Q23n24j19n69
$$ -615 263 571 633 443 -542 -755 -419 -389 -56 310 191 -366 -454 -572 567 -166 -297 526 2 -117 -686
5182f86M52M63M11k26J01q5p35O65o22K18N18n99Q2j05j36l9O4M19J26K71j190
$$ -686 -234 229 640 414 515 430 -305 360 -262 -44 474 -125 -43 -148 -284 -323 -259 160 286 557 -633
5203f33j03N30N06J47J95j49l59k27l22J32J76N39l17l43L82p50K18k06J091l35
$$ -633 -736 -206 300 447 642 493 134 -93 -415 -283 -107 432 115 -228 154 -596 -378 -584 507 172
5223A72K54M06j271q0l84N08J091j62q1J45j207O25j68L32P13L9o81m98p49L35
$$ 172 426 832 -439 -519 -903 -395 696 534 453 598 -609 16 -152 180 893 932 251 -247 -996 -661
5243f61N8M24N56N88l26j384N76l4L16J57q1l45L25l97m16M57P32m86N4k96K66
$$ -661 -603 -179 377 965 639 -745 -169 -203 113 270 189 -156 169 -228 -644 -187 545 59 113 -183 83
5264H3n05k57K06P18n29P99l36j84l73p3M86J78K22Q3J54j055k11l43J358J13
$$ 83 -422 -679 -473 245 -284 515 179 -5 -378 -451 35 213 435 518 672 -383 -594 -937 421 534
5284E34p95N52o62n6J5K2J355n40n53K90q42JR73m06N75N0L33p02l83k32P98j78
$$ 534 -261 291 -371 -427 -412 -390 965 425 -128 162 -680 -679 294 -112 463 513 846 144 -239 -471 327 149
5306A49K64J28m64J28l18j7J5O39J4p6l27n78K10j60P75k79o3K80n59n7J76K2
$$ 149 413 541 77 205 -113 -130 -115 524 538 462 135 -443 -233 -393 382 103 40 320 -239 -296 -120 -98
5328i8O05J26j46j186M10L20j13j16N36J59l79j00n53L23L98O40m0l0j006K75
$$ -98 507 633 487 -699 -289 31 -82 -198 338 497 118 18 -535 -212 186 826 786 756 -250 25
5348B5l54J37O5K48M81m71j15J41r46N02M44K40l0l11nr18Q30Q6L77r2J64l43
$$ 25 -329 -192 -127 121 602 131 16 157 -789 -287 157 397 367 56 51 -867 -37 49 426 334 498 155
5370A55o50l08M04O47L77j64j76k12n07L23n7M96M42n61j75q5Q8R5M00J42mk61
$$ 155 -495 -803 -399 248 625 461 285 73 -434 -111 -168 328 770 209 34 -51 37 132 532 674 670 409
5392D09n29m72J9O12k07P41j60N9j000P9L69K01K0L8K12n19n95K59L06P91k75
$$ 409 -120 -592 -573 39 -168 573 413 472 -528 -449 -80 121 141 179 391 -128 -723 -464 -158 633 358
5413C58K91k01p98n12O59p4l1J022Lo97k29k66k93N13K02J81M49m79m38J1j53
$$ 358 649 448 -350 -862 -203 -277 -308 714 717 20 -209 -475 -768 -255 -53 128 577 98 -340 -329 -482
5434d82J083p51P16o66R8l68N8K25Q59k64o72k83m33P49K53N8l08R86j50j207
$$ -482 601 -150 566 -100 -2 -370 -312 -87 772 508 -164 -447 -880 -131 122 180 -128 858 708 -499
5454d99P2K42L79n5J15L98j49j168J010l28J16M89n83P2l04K68n72O08O0Q34p5
$$ -499 -427 -185 194 139 254 652 503 -665 345 17 133 622 39 111 -193 75 -497 111 171 1005 930
5475I30o69o75Q3n07M79Q81m56j0J53m27j77J70L85K69k08O9j25k48j10q5M24
$$ 930 261 -414 -331 -838 -359 522 66 56 209 -218 -395 -225 160 429 221 290 165 -83 -193 -278 146
5496A46K26Q62o47r84j72k35N54J27o8N84N1p96l13N88J59k45J84J42p98M78o35
$$ 146 372 1234 587 -397 -569 -804 -250 -123 -191 393 444 -352 -665 -77 82 -163 21 163 -635 -157 -792
5517g92J332J0L64k37q71o14P3M24L57L93k32K60q75m80L96M00M09O79q58J11
$$ -792 540 550 914 677 -194 -808 -735 -311 46 439 207 467 -408 -888 -492 -92 317 996 138 249
5537B49n37k46K24J54M97j39j88l19n32M55j31O74J26O9q8J52m87k74p1R35j98
$$ 249 -288 -534 -310 -156 341 202 14 -305 -837 -382 -513 161 287 356 268 420 -67 -341 -412 523 325
5558C25l24K15k54m74M19K57o4L2o3k5n82pQ63n47J53J050o30q80J106j453J231
$$ 325 1 216 -38 -512 -93 164 100 132 69 44 -538 -545 318 -229 -76 974 344 -536 570 -883 348
5579C48m01L80O66p95l55q00J023L81Q18m5k19j093n03L82N1N25M29m06N3q12
$$ 348 -53 327 993 198 -157 -957 66 447 1265 1220 1001 -92 -595 -213 -162 363 792 386 439 -373
5599c73j75l41M62M78R80l16o87j12m21J97q4J210m36r99J133m97l75N89k58Q91
$$ -373 -548 -889 -427 51 1031 715 28 -84 -505 -308 -392 818 382 -617 516 19 -356 233 -25 866
5619H66o71n4R7r58L32O54L32M4p72K20K15n14O15m49L07m2j45m02l47L68M56
$$ 866 195 141 238 -720 -388 266 598 642 -130 90 305 -209 406 -43 264 222 77 -325 -672 -304 152
5640A52J21M05j79r92k46j65M55M74K54J62Nn65l22O09J70k87K92l60k25k17O91
$$ 152 273 678 499 -493 -739 -904 -449 25 279 441 446 -119 -441 168 338 51 343 -17 -242 -459 232
5661B32k67j45O78k26l1N0o94j78M85N11K31k24m81k28j65L04J60L68J05m10K72
$$ 232 -35 -180 498 272 241 291 -403 -581 -96 415 646 422 -59 -287 -452 -148 12 380 485 75 347
5682C47j256N69j06P15o57O61n88K26j51N1p2N18O34m67j194o6P48m90O27M42
$$ 347 -909 -340 -446 269 -388 273 -315 -89 -240 -189 -261 257 891 424 -770 -836 -88 -578 49 491
5702D91J33Oq29J87j03K02K67Q5n2j90p77P8J41M59O20r47Q42q8j140J25N26j14
$$ 491 624 630 -199 -12 -115 87 354 439 387 197 -580 -502 -361 98 718 -229 613 525 -615 -490 36 -78
5724g8L46j55n46nM1j61r6M55R18n74k16k24L66j90N21J30M92j373K16o29N62
$$ -78 268 113 -433 -438 -397 -558 -654 -199 719 145 -71 -295 71 -119 402 532 1024 -349 -133 -762 -200
5745b00q1J54r5L34J39k92k15J64L86k0j10j65o42j1Q04j52J85O32j39j34j150
$$ -200 -281 -127 -222 112 251 -41 -256 -92 294 274 164 -1 -643 -654 150 -2 183 815 676 542 -608
5766f08L67l98O94K11L12l87k18M43r08J214k08J51n75R58j292J45o39K38J189
$$ -608 -241 -639 55 266 578 191 -27 416 -492 722 514 665 90 1048 -244 -99 -738 -500 689
5785F89k70l84k85J40p44R41q7M99Q16p51q04l9P4J78n0K52P8m27J99m86N66j54
$$ 689 419 35 -250 -110 -854 87 0 499 1315 564 -240 -279 -205 -27 -77 175 253 -174 25 -461 105 -49
5807d9O17m90o58O81M1j71k70L17M57j22o26o19p6M59R27R3j4m59j82o47m46J557
$$ -49 568 78 -580 101 142 -29 -299 18 475 353 -273 -892 -968 -509 418 511 497 38 -144 -791 -1237 320
5829C20n41P07m5j68p6l19o06L38O62q4L51r76J93n70K63N30M8M15n93%m81J98
$$ 320 -221 486 441 273 197 -122 -728 -390 272 188 539 -437 -244 -814 -551 -21 27 442 -151 -151 -632 -434
5851d34M18J45O3M53n5q44j06K30L77m22Q22j6n02o81M15M43n67J127O78j455
$$ -434 -16 129 192 645 590 -254 -360 -130 247 -175 647 631 129 -552 -137 306 -261 866 1544 89
5871H9n31J10q7M68J91q5L24r4n09n01N74q0K68K88j41j47m82k89L67K25J132
$$ 89 -442 -332 -419 49 240 155 479 385 -124 -625 -51 -131 137 425 284 137 -345 -634 -267 -42 1090
5892A090l73p33o16k99Q34J00O87n60N85r63n69K03J33O30M67p9j53l48l54J61
$$ 1090 717 -16 -632 -931 -97 3 690 130 715 -248 -817 -614 -481 149 616 537 384 36 -318 -157
5912a57L25J16L27jl99o53M20m80N51J77m3l23K51l21O1K41m51L10M85l13L6o41
$$ -157 168 284 611 610 211 -442 -22 -502 49 226 183 -140 111 -210 -149 92 -359 -49 436 123 159 -482
5934d82K96O4j06P70j40p36no37J106n58L89L37K88o59l31K80Q3K74l42K6J43
$$ -482 -186 -122 -228 542 402 -334 -339 -976 130 -428 -39 298 586 -73 -404 -124 -41 233 -109 -83 60
5955F0J12j352N42K66P08ql21k2l75k59P20J02N64Jr87l7Q4p27J253m63O84q24
$$ 60 172 -1180 -638 -372 336 328 7 -15 -390 -649 71 173 737 738 -249 -286 -202 -929 324 -139 545 -279
5977b79J46m34l36M53M24P55l32j74j256O79k08L23M88J62l8L9l05n64O79J63
$$ -279 -133 -567 -903 -450 -26 729 397 223 -1033 -354 -562 -239 249 411 373 412 107 -457 222 385
5997C85k16K62m75P08j167o6J56J52R61q80l16L74n99J09O06N51k65N28n07q7
$$ 385 169 431 -44 664 -503 -569 -413 -261 700 -180 -496 -122 -721 -612 -6 545 280 808 301 214
6017B14o85K58k46Q14Q6m98n26m09k71Q07R81J20l25r07O43n08K72p18J148J52
$$ 214 -471 -213 -459 355 441 -57 -583 -992 -1263 -456 525 645 320 -587 56 -452 -180 -898 250 402
6037D02N82p78j43l17O3L09K4j55Q4m1r00O39K12J55n9K57L9j240L98N0K34K32
$$ 402 984 206 63 -254 -191 118 142 -13 71 30 -870 -231 -19 136 77 334 373 -867 -469 -419 -185 47
6059D7Q2R4k67p75O19O72j32N17l79o64K23n34j8O80N1k34M89p58j42k57O58J50
$$ 47 129 223 -44 -819 -200 472 340 857 478 -186 37 -497 -515 165 216 -18 471 -287 -429 -686 -28 122
6081A22n41J240n91l75p08P77J3M0O36j70j90m91j40J86O4R12n37M6q49l98O62
$$ 122 -419 821 230 -145 -853 -76 -63 -23 613 443 253 -238 -378 -192 -128 784 247 293 -556 -954 -292
6102b92K41O95l10M09o16j48m50K23L93m06J041l04k00m37q8K19j14M24J95l43
$$ -292 -51 644 334 743 127 -21 -471 -248 145 -261 780 476 276 -161 -249 -30 -144 280 475 132
6122A32o98k31Q72J96J71j54J60j12j37p76K42L52L31M5r5l90P2J9m8N5Q85p59
$$ 132 -566 -797 75 271 442 288 448 336 199 -577 -335 17 348 393 298 -92 -20 -1 -49 6 891 132
6144A32o10M89k37Q4N68n0N50l84r41L38l06O52J0n1J04j86l23l77L45N48K60
$$ 132 -478 11 -226 -142 426 376 926 542 -399 -61 -367 285 295 244 348 162 -161 -538 -193 355 615
6165F15j65n53M34o05j43J10O92M11j50m18j88k24J00k61K97L09j62k04K95j065
$$ 615 450 -103 331 -274 -417 -307 385 796 646 228 40 -184 -84 -345 -48 261 99 -105 190 -875
6185h75N47P03m98P41l30l68n75K84q4M17L40j20j19J62o79J24N36O09j56J21
$$ -875 -328 375 -123 618 288 -80 -655 -371 -455 -38 302 182 63 225 -454 -330 206 815 659 780
6205G80n12r94N48K9M6K95k69M78o22J68J34o79R65k13M52m04o33k48N8J104N
$$ 780 268 -726 -178 -149 -103 192 -77 401 -221 -53 81 -598 367 154 606 202 -431 -679 -621 483 488
6226D88l27l27J85r85O33l66R67J2K17l34J96m84l80N77L38j63K07m19m92k84
$$ 488 161 -166 19 -966 -333 -699 268 280 497 163 359 -125 -505 72 410 247 454 35 -457 -741
6246g41O68L53k21l91M20n15q2Q64n52O06J22K21r34p70Q98QK75l4L69J20n65
$$ -741 -73 280 59 -332 88 -427 -509 355 -197 409 531 752 -182 -952 -54 -46 229 195 564 684 119
6267A19o4k10l7r3J602o90m34j67k39m95J294J24j50J57l5j082p5N41m5l29R80
$$ 119 55 -155 -192 -285 1317 627 193 26 -213 -708 586 710 560 717 682 -400 -475 66 21 -308 672
6288F72m06j73o57K85O05k21j66N13l79j23m92k29Q97K04P81r43N4l12l58J10
$$ 672 266 93 -564 -279 326 105 -61 452 73 -50 -542 -771 126 330 1111 168 222 -90 -448 -338
6308c38L48j33P03j83o43K23r0J72J98M95m16m06l14n46N45K68L56O38j235M12
$$ -338 10 -123 580 397 -246 -23 -113 59 257 752 336 -70 -384 -930 -385 -117 239 877 -358 54
6328E4J1n89K6J011j96K1r5r59L60J54N49Q9K12n19k80m45m83R80N55q38k86J184
$$ 54 65 -524 -498 513 317 338 243 -716 -356 -202 347 436 648 129 -151 -596 -1079 -99 456 -382 -668 516
6350E16j016J87R6K90J52m2L48n33q22K69R4N44j63N73J5q80K91K27p04J094M33
$$ 516 -500 -313 -217 73 225 183 531 -2 -824 -555 -461 83 -80 493 508 -372 -81 146 -558 536 969
6371I69j022L2M5k40m65P82l15L09N37q03j10L99n85j10P04K94L8j196J90l0K09
$$ 969 -53 -21 24 -216 -681 101 -214 95 632 -171 -281 118 -467 -577 127 421 459 -737 -547 -577 -368
6392c68N64P54l35j173L25J34l64O39n3j27L38j035q6M82L3J042k80j35o01N73
$$ -368 196 950 615 -558 -233 -99 -463 176 123 -4 334 -701 -787 -305 -272 770 490 355 -246 327
6412C27m31n35O45K52N44r63n3k17l56Q09M82Q7n73k10L51m43M8R6M38k33n94
$$ 327 -104 -639 6 258 802 -161 -214 -431 -787 22 504 591 18 -192 159 -284 -236 -140 298 65 -529
6433e29P80r58N12j9l76O09j88J81o7l71O3PQ31k71K40m24j84p19N03N79m43N77
$$ -529 251 -707 -195 -214 -590 19 -169 12 -55 -426 -363 -356 475 204 444 20 -164 -883 -380 199 -244 333
6455C33J62j048J33p12R39p5N44j51k61m42K22m94J072K04r8J81p85l66L2O30
$$ 333 495 -553 -420 -1132 -193 -268 276 125 -136 -578 -356 -850 222 426 328 509 -276 -642 -610 20
6475B0N31j12l36L97q3n86m36L87J96J89J13k46J11l53l43L75N90K70j50p67l08
$$ 20 551 439 103 500 417 -169 -605 -218 -22 167 280 34 145 -208 -551 -176 414 684 534 -233 -541
6496e41J81M67n77Q87j10k54k01k31L54k6M15j021J297n59k49L33r16P05O47j73
$$ -541 -360 107 -470 417 307 53 -148 -379 -25 -51 364 -657 640 81 -168 165 -751 -46 601 428
6516D28o08m19m72O30K7N54L69J1m65n53M73r2o79R53j85L32p20m09J39N59L28
$$ 428 -180 -599 -1071 -441 -414 140 509 520 55 -498 -25 -117 -796 157 -28 304 -416 -825 -686 -127 201
6537B01l83P68p55m76K68k90N88J22N69k43j42o10M16n7k36K61O13m13m44L27
$$ 201 -182 586 -169 -645 -377 -667 -79 43 612 369 227 -383 33 -24 -260 1 614 201 -243 84
6557H4p92R62l12L11P2q6k37j026J22J495l66J3j65P7k78L26m19N63j12J40l07
$$ 84 -708 254 -58 253 325 239 2 -1024 -902 593 227 240 75 152 -126 200 -219 344 232 372 65
6578F5j94J12k66R2M11j65N71j83j165K28P6M78K53M9o14O30k42j46l83R27l18
$$ 65 -129 -17 -283 -191 220 55 626 443 -722 -494 -418 60 313 362 -252 378 136 -10 -393 534 216
6599B16L4q8m64L88l29K8O66k16j99o06k0K44J00J127o27J03l42K82q97MJ013
$$ 216 250 162 -302 86 -243 -215 451 235 36 -570 -590 -346 -246 881 254 357 15 297 -600 -596 417
6620D17r3Q7m40L07n08K8m59K99O26J68j38m31k66M77q61J045m67M14m2k55K15
$$ 417 324 411 -29 278 -230 -202 -661 -362 264 432 294 -137 -403 74 -787 258 -209 205 163 -92 123
6641A23k93L09L68J1q78Q7K82q52M49O32O26m44j68p63K28M03m00N31J58l98l71
$$ 123 -170 139 507 518 -360 -273 9 -843 -394 238 864 420 252 -511 -283 120 -280 251 409 11 -360
6662c60L14k72J85j31J23K11J79o16K82o20m2L67J51Q35j071j42M03L48l68K37
$$ -360 -46 -318 -133 -264 -141 70 249 -367 -85 -705 -747 -380 -229 606 -465 -607 -204 144 -224 13
6682A3O53p59ql61J30M8L57J51n42P34o3j069R37k9l38RN81k21k53j14q8O92m17
$$ 13 666 -93 -101 -462 -332 -284 73 224 -318 416 353 -716 221 192 -146 -137 444 223 -30 -144 -232 460 43
6705D3k2O47q67Rp36O41K13N12j14n78n76R43J23o30K79l0J40lP1j09m88M72l9
$$ 43 21 668 -199 -190 -926 -285 -72 440 326 -252 -828 115 238 -392 -113 -143 -3 -6 65 -44 -532 -60 -99
6728i9L71j10J50p16J01O69n54L15o91L1J82K80l32O85k64J54j06k59p36M54K50
$$ -99 272 162 312 -404 -303 366 -188 127 -564 -533 -351 -71 -403 282 18 172 66 -193 -929 -475 -225
6749b25P15J8k07l58q92L00M07K98N7K12k83k09k75M04M18K38l62m7J75q14J23
$$ -225 490 508 301 -57 -949 -649 -242 56 113 325 42 -167 -442 -38 380 618 256 209 384 -430 -307
6770c07o3K49Q83L30j055n19m77L60O22NM63j51J09R2r88O85J95j24J91K4p02
$$ -307 -370 -121 762 1092 37 -482 -959 -599 23 28 491 340 449 541 -447 238 433 309 500 524 -178
6791a78Q7j70p2L92J1K64k39k58k84k01J23Q1N12M52o60L95n17L37l27P60J05
$$ -178 -91 -261 -333 59 70 334 95 -163 -447 -648 -525 -444 68 520 -140 255 -262 75 -252 508 613
6812F13j91l08k70m22L77J97j51J012j294l53N87j4RP13rN2K20q34r1m88P20J80
$$ 613 422 114 -156 -578 -201 -4 -155 857 -437 -790 -203 -217 -208 505 496 548 768 -66 -157 -645 75 255
6834B55l26Q70r65J03o35J088J31J8j2j99j61n91N4O20LM73o85K29J05r21l0L11
$$ 255 -71 799 -166 -63 -698 390 521 539 527 328 167 -424 -370 250 253 726 41 270 375 -546 -576 -265
6856b65N91p79Q37r47N0M83J006q08p24R87j14m0j037P65K63l37L51n50K79M8
$$ -265 326 -453 384 -563 -513 -30 976 168 -556 431 317 277 -760 5 268 -69 282 -268 11 59
6876E9j08J06K57J23j58k23k21K00j62M1O12m33m06M49n22K35k98L93O69n51K02
$$ 59 -49 57 314 437 279 56 -165 35 -127 -86 526 93 -313 136 -386 -151 -449 -56 613 62 264
6897B64p09l83O37k01J099j23m49K9K26p08OP14l67N43o40p3m33M11L80l63J45
$$ 264 -445 -828 -191 -392 707 584 135 164 390 -318 -312 402 35 578 -62 -135 -568 -157 223 -140 5
6918EP05r61K91l28m82P69j03P36n95k26r3K3N75M49J26q22p1r35O22P52m03Q9
$$ 5 710 -251 40 -288 -770 -1 -104 632 37 -189 -282 -259 316 765 891 69 -2 -937 -315 437 34 123
6940A23K26k90O52j162L55p1N01k3k7K17J5r89N9R88j89M5q8j188N95J94k20L16
$$ 123 349 59 711 -451 -96 -167 334 311 284 501 516 -473 -414 574 385 430 342 -846 -251 -57 -277 39
6962C9N8M21l83k82l44MQ05m93L9M37k96m20M79l36O91j45N96k29q92Q7k70N04
$$ 39 97 518 135 -147 -491 -487 318 -175 -136 301 5 -415 64 -272 419 274 870 641 -251 -164 -434 70
6984G0l69J13l8J75k85p2o1M42J65J80k03J7j47J62m27P37M21r68J03k36L92l41
$$ 70 -299 -186 -224 -49 -334 -406 -467 -25 140 320 117 134 -13 149 -278 459 880 -88 15 -221 171 -170
7006a70M34n30k9N02n43N95p36M52l28O60L90q01P7q1J78j64P08l04l30K56r24
$$ -170 264 -266 -295 207 -336 259 -477 -25 -353 307 697 -104 -27 -108 70 -94 614 310 -20 236 -688
7027f88Q07k91J0L13j76J94J57o02l28M31J91k47P30l43l27j78m71J107j21M4
$$ -688 119 -172 -162 151 -25 169 326 -276 -604 -173 18 -229 501 158 -169 -347 -818 289 168 212
7047B12P31m57m47k9K12j15K18l4m11M99m09p49L39O35N56j387O95j51k48j09
$$ 212 943 486 39 10 222 107 325 291 -120 379 -30 -779 -440 195 751 -636 59 -92 -340 -449
7067d49K57L06M54K02r55K65m99Q90p8n63K70m1l42j60M8M7M96M10m68L0j94J50
$$ -449 -192 114 568 770 -185 80 -419 471 393 -170 100 59 -283 -443 -395 -348 148 558 90 120 -74 76
7089G6j24O2J71n08L83K51l0p36K36M73J24q26N78o26J51L17J72M97n04K6O1j75
$$ 76 -48 14 185 -323 60 311 281 -455 -219 254 378 -448 130 -496 -345 -28 144 641 137 163 224 49
7111D9o79L90N13m4J21j77k16j45n39j27J124M82o60j83l71L7K47L00l42M69Q
$$ 49 -630 -240 273 229 350 173 -43 -188 -727 -854 270 752 92 -91 -462 -425 -178 122 -220 249 257
7132B57m67l41M47OJ03O76m10j016M94L39ok73L40L65J79r07J33j99o25J074N37
$$ 257 -210 -551 -104 -98 5 681 271 -745 -251 88 82 -191 149 514 693 -214 -81 -280 -905 169 706
7153G06m65k83J77m37k68N70O4M90l19k36j17n6l25N34p5L32m17j05O47p24K64
$$ 706 241 -42 135 -302 -570 0 64 554 235 -1 -118 -174 -499 35 -40 292 -125 -230 417 -307 -43
7174d3j76M37j9o8j89n04M33J2J80q06P86O6j38k16J32L46L50n55m37K41j153
$$ -43 -219 218 199 131 -58 -562 -129 -117 63 -743 43 109 -29 -245 -113 233 583 28 -409 -168 -1321
7195a321J308p0j66L64k51q5k68J65O74j15m3N89k69o61R8r98J423l58j99N8k70
$$ -1321 -13 -83 -249 115 -136 -221 -489 -324 350 235 192 781 512 -149 -51 -1049 374 16 -183 -125 -395
7216c95M57n33P0M41P37o07l22K67j53K13k45Q66p48j21L3O3p52k72J049j53N91
$$ -395 62 -471 -401 40 777 170 -152 115 -38 175 -70 796 48 -73 -40 23 -729 -1001 48 -105 486
7237D86j70l58M33m80k58J67M95k83J15j04k58n5K83k7P02j6r30K74R4j93L98
$$ 486 316 -42 391 -89 -347 -180 315 32 147 43 -215 -270 13 -14 688 672 -258 16 110 -83 315
7258C15J88Q7p46j36l09R5K22O01J53l64N31n97ln80L50J96J81L1k92j33J57K62
$$ 315 503 590 -156 -292 -601 -506 -284 317 470 106 637 40 37 -543 -193 3 184 215 -77 -210 -53 209
7280B09r50J176l25L60q47L20n23R07j10J6J62k01l68k76N46p06M80O3M16j2n60
$$ 209 -741 435 110 470 -377 -57 -580 327 217 233 395 194 -174 -450 96 -610 -130 -67 349 337 -223
7301b23J40J76k69K6N19Jk26m08k67K37O69Mn8k92n79J73L60N28j91l57k58j46
$$ -223 -83 93 -176 -150 369 370 144 -264 -531 -294 375 379 321 29 -550 -377 -17 511 320 -37 -295 -441
7323d41l4R5M15L52o63N25o44O58m22k6m8P06j65j61j97q9n4k33M38L67p31M21
$$ -441 -475 -380 35 387 -276 249 -395 263 -159 -185 -233 473 308 147 -50 -139 -193 -426 12 379 -352 69
7345F9Rn93O27j8J02N12Q3o45J41n10l90M57JL78n79J85M60n35n4R61l72l12k92
$$ 69 78 -515 112 94 196 708 791 146 287 -223 -613 -156 -155 223 -356 -171 289 -246 -300 661 289 -23 -315
7368c15L77l86J41L16r8M19j026O22omj45M36j67o70J216k48o73j96N91m3q11
$$ -315 62 -324 -183 133 35 454 -572 50 44 40 -105 331 164 -506 710 462 -211 -407 184 141 -670
7389f70P10j07k33L51n93O12k3J69n22Q4l87J23K70L38L31m71J92l42l79M62J3
$$ -670 40 -67 -300 51 -542 70 47 216 -306 -222 -609 -486 -216 122 453 -18 174 -168 -547 -85 -72
7410g2q9K46L26k32r85P38K11P7j21J46k67k17P41r07K52P41m45n27J78N10q79
$$ -72 -161 85 411 179 -806 -68 143 220 99 245 -22 -239 502 -405 -153 588 143 -384 -206 304 -575
7431e75L93L54j68P49n41J60l80l35o0J89N01o24L02l65J56K68K71k03K7k18j9
$$ -575 -182 172 4 753 212 372 -8 -343 -403 -214 287 -337 -35 -400 -244 24 295 92 119 -99 -118
7452a18K97l97O4L76L61m21l95k96L7K50J71J31L74m37l51N49q24L41Q2M43l06
$$ -118 179 -218 -154 222 583 162 -233 -529 -492 -242 -71 60 434 -3 -354 195 -629 -288 -206 237 -69
7473f9j68Lk23Q2J14J69O21Q1l89j128L33L52p2Q24l42R0q11P6N71J8l26J3O78
$$ -69 -237 -234 -457 -375 -261 -92 529 610 221 -907 -574 -222 -294 530 188 278 -533 -457 114 132 -194 -181 497
7496D97l91k14l10M87M9j74R12l35l47q05K78k61M66k87N79K52k6p17m09J295
$$ 497 106 -108 -418 69 118 -56 856 521 174 -631 -353 -614 -148 -435 144 396 370 -347 -756 539
7516E39j72l63N30l81j05j63m84L53M3L37r16J234j4j76j038N47J14K69J85l09
$$ 539 367 4 534 153 48 -115 -599 -246 -203 134 -782 452 438 262 -776 -229 -115 154 339 30
7536C0j94n36P31J38L93o76K36K78q72N30J57m00N40m96q7P6J32p5j84N7K23K97
$$ 30 -164 -700 31 169 562 -114 122 400 -472 58 215 -185 355 -141 -228 -152 -20 -95 -279 -222 1 298
7558B98r92N57K65Q4M86j74J18q00N85m93R1n1K90j01k08J63p4j42J80j67K84
$$ 298 -694 -137 128 212 698 524 642 -158 427 -66 25 -26 264 163 -45 118 44 -98 82 -85 199
7579A99j89M1j08n70Q79k26J56k02P10n54p46R80j35J66l6m92q1N98j009L32M04
$$ 199 10 51 -57 -627 252 26 182 -20 690 136 -610 370 235 401 365 -127 -208 390 -619 -287 117
7600A17M46J79p00L8M85p03J4l1m7M26J47k68j49m32Q96K80K08n44n01o46R46
$$ 117 563 742 42 80 565 -138 -124 -155 -202 224 371 103 -46 -478 418 698 906 362 -139 -785 161
7621A61Km1M53j218J066m11j77m20L13L61J07J49l26j02j1o38R06l9O60j026M05
$$ 161 163 122 575 -643 423 12 -165 -585 -272 89 196 345 19 -83 -94 -732 174 135 795 -231 174
7642A74Q3o15Q4N94k89M74l39n58l8N48K42j51q49J054l61o80M30o7M73k48O95
$$ 174 257 -358 -274 320 31 505 166 -392 -430 118 360 209 -640 414 53 -627 -197 -264 209 -39 656
7663F56p50r5N4j25K90m14O02l17R8M89m00l31J48J60L79m83k54J9K78l6n2O39
$$ 656 -94 -189 -135 -260 30 -384 218 -99 -1 488 88 -243 -95 65 444 -39 -293 -274 4 -32 -84 555
7685E55k35k75M8k31J52J54o30R51m93K56n03J4Q15p1o96K0M76j96n68N94OJ16
$$ 555 320 45 93 -138 14 168 -462 489 -4 252 -251 -237 578 507 -189 -169 307 111 -457 137 143 259
7707B59k16J16j07o77J65L82k68K37N79k08l06M07p50j27R57q00M03P3n17K75
$$ 259 43 159 52 -625 -460 -78 -346 -109 470 262 -44 363 -387 -514 443 -357 46 119 -398 -123
7727a23L25J64J69j52n30J91l70M61p33N52J66J9O04n76q41K99K17O21J05r04
$$ -123 202 366 535 383 -147 44 -326 135 -598 -46 120 139 743 167 -674 -375 -158 463 568 -336
7747c36O98l89j59n6j78Q87o73O90l8j031J414o11K45n52J43J31p46K04O43r93
$$ -336 362 -27 -186 -242 -420 467 -206 484 446 -585 829 218 463 -89 54 185 -561 -357 286 -707
7767g07O54j00O2K30n81P20l54K28o4l39j48L05k3J45n18L54Q10j201M12l82n68
$$ -707 -53 -153 -91 139 -442 278 -76 152 88 -251 -399 -94 -117 28 -490 -136 674 -527 -115 -497 -1065
7788a065O82K43J14O66p13M34m11m62P1N92J59l57K03j55K94k52m44J86J14k19
$$ -1065 -383 -140 -26 640 -73 361 -50 -512 -441 151 310 -47 156 1 295 43 -401 -215 -101 -320
7808c20J036j100J32O39n10Q11j75q07q8k91R33l18J71k92J12K73k73L89m05M24
$$ -320 716 -384 -252 387 -123 688 513 -294 -382 -673 260 -58 113 -179 -67 206 -67 322 -83 341
7828C41j77j00M46o13k18O8M63m10J03K08k43L92j87l94O13q6K67l09o94L89K07
$$ 341 164 64 510 -103 -321 -253 210 -200 -97 111 -132 260 73 -321 292 206 473 164 -530 -141 66
7849F6m67l03M46N42j9nk48Q3J85k29J36q1O0l54J10j48k95J077k81l64k87L13
$$ 66 -401 -704 -258 284 265 260 12 95 280 51 187 106 166 -188 -78 -226 -521 556 275 -89 -376 -63
7871f3p0n56P43J56j70n31K05K24m9J57l82J208o07j65J22m97K12M17n7r29J078
$$ -63 -133 -689 54 210 40 -491 -286 -62 -111 46 -336 872 265 100 222 -275 -63 354 297 -632 446
7892D46n00K36p31O06O6J48k94m26j55K42J07p5N81l31K36K6n91N03j55O9p5N79
$$ 446 -54 182 -549 57 123 271 -23 -449 -604 -362 -255 -330 251 -80 156 182 -409 94 -61 8 -67 512
7914E12r10P10L88m64k86Q8M66r00J00j87p4M90M20jm80M10m77L8N96n95L87j23
$$ 512 -398 312 700 236 -50 38 504 -396 -296 -483 -557 -67 353 352 -128 282 -195 -157 439 -156 231 108
7936A08k81M88k54j89M70k28k36n33R04J07k11j09K92l99O96m9j98j73l77L00
$$ 108 -173 315 61 -128 342 114 -122 -655 249 356 145 36 328 -71 625 576 378 205 -172 128
7956A28l21P31m01m50L2L82k71K02K77%N47l72n96m88R67o18K04M62k18j6n82
$$ 128 -193 538 137 -313 -281 101 -170 32 309 309 856 484 -112 -600 367 -251 -47 415 197 181 -401
7977d01O6QJ35J07J47j82J70k76K30R7L4k23O3M59l94k03N80m54L01K35o70j01
$$ -401 -335 -327 -192 -85 62 -120 50 -226 4 101 135 -88 -25 434 40 -163 417 -37 264 499 -171 -272
7999b72l11M72j17Q8M25m69N18j018N06l07K29J74L2J034q84j71J67n8k48P46
$$ -272 -583 -111 -228 -140 285 -184 334 -684 -178 -485 -256 -82 -50 984 100 -71 96 38 -210 536
8019E36q26j29Q28j197L40J80k31J76Q94o4m86o86L72P51n59L87N6m2m22o4j86
$$ 536 -290 -419 409 -788 -448 -268 -499 -323 571 507 21 -665 -293 458 -101 286 342 300 -122 -186 -372
8040c72L25R5j02J44J00k87n52P15R9n93O97p69K26j08L79o43J181L54j004l14
$$ -372 -47 48 -54 90 190 -97 -649 66 165 -428 269 -500 -274 -382 -3 -646 535 889 -115 -429
8060d29P28k3l66j02J48J06o5M10q52J78M36R2K86n38k6O76p43rL08L27o0m46
$$ -429 299 276 -90 -192 -44 62 -3 407 -445 -267 169 261 547 9 -17 659 -84 -93 215 542 482 36
8082C6J36k55L17J46r85P70q9Ml46j08O33r22M13Q92n23L23m88oo4M74j25m41
$$ 36 172 -83 234 380 -605 165 76 80 -266 -374 259 -663 -250 642 119 442 -46 -52 -116 358 233 -208
8104b08P79o68J15j49n32Q13l62k41P04r3J13n36P36j097M08m00J024n77L18j15
$$ -208 571 -97 18 -131 -663 150 -212 -453 251 158 271 -265 471 -626 -218 -618 406 -171 147 32
8124C2l6M90n0l81l91N0J8O77k34J04j71n31J17j58M39k35O11p07N00J71j72K63
$$ 32 -4 486 436 55 -336 -286 -268 409 175 279 108 -423 -306 -464 -25 -260 351 -356 144 315 143 406
8146D06L3p53L71O01o72l00k08L43P48k37J9l74q71P95o9m5N63M49j135N98j88
$$ 406 439 -314 57 658 -14 -314 -522 -179 569 332 351 -23 -894 -99 -168 -213 350 799 -336 262 74
8167G4k32P20k81J33M9l70l75L52o15N09J97k71k8N55K3k01o76J25L99J96k36
$$ 74 -158 562 281 414 463 93 -282 70 -545 -36 161 -110 -138 417 440 239 -437 -312 87 283 47
8188D7L17q50M23
$$ 47 364 -486 -63
8191f3
$$ Imaginary data points
##PAGE= N=2
##DATA TABLE= (X++(I..I)), XYDATA
0@%%%%%%%%%%%L2o4O4o4O4q2J14j28J53j85K00k32K79l14L57m14M71n35O02o80
$$ 0 0 0 0 0 0 0 0 0 0 0 0 32 -32 32 -32 32 -50 64 -64 89 -96 104 -128 151 -163 194 -220 251 -284 318 -362
31c62P62q49R59j072J189j325J473j632J805j998K219k457K718l015L341l712
$$ -362 400 -449 510 -562 627 -698 775 -857 948 -1050 1169 -1288 1430 -1585 1756 -1956
47a956M142m628N193n863O656p638Q878j0490J2704j5928K1093l0737N4789k21148
$$ -1956 2186 -2442 2751 -3112 3544 -4094 4784 -5706 6998 -8930 12163 -18574 36215 -184933
61a84933n01333J88260L65404L47586K17292j0563l94734m43702j46930J86612
$$ -184933 -686266 -498006 -132602 214984 432276 421713 26979 -416723 -563653 -377041
71c77041L52269M18554J75353k77149m72780k29765L1183J75278L42736L71265
$$ -377041 -24772 393782 569135 291986 -180794 -410559 -379376 -204098 138638 509903
81E09903O710l91321m05322j53869P9979K98576L84013J52554j93978l10199k58865
$$ 509903 516613 125292 -280030 -433899 -353920 -55344 328669 481223 287245 -22954 -281819
92b81819j53754J18035M22394L51059m0951k80884k65413k09137o0806K32453
$$ -281819 -435573 -317538 104856 455915 414964 134080 -131333 -340470 -401276 -168823
102a68823L74803J89496q2015k47413l27358k10957J31409L59989K53214N0566
$$ -168823 205980 395476 313461 66048 -261310 -472267 -340858 19131 272345 322911
112C22911p5551k42246l40427j11263K56256L57898J97881R384j86336l33237
$$ 322911 247360 5114 -335313 -446576 -190320 167578 365459 374843 188507 -144730
122a44730k25256O5404K43340K58003J94509k4475l31658l69809p4090J87941
$$ -144730 -369986 -304582 -61242 196761 391270 366795 35137 -334672 -408762 -220821
132b20821K44642K33616J28466j50447l56730k51376Q362K07260L14292K47530
$$ -220821 23821 257437 385903 235456 -121274 -372650 -364288 -157028 157264 404794
142D04794m3380l07364k85060j06075N1430K22504L35336J60934j88411l39273
$$ 404794 361414 54050 -231010 -337085 -285655 -63151 272185 433119 244708 -94565
152i4565k24999l9722J51529L07579K50368j2638k25512k65060j95162K941K74042
$$ -94565 -319564 -359286 -207757 99822 350190 337552 112040 -153020 -348182 -345241 -71199
163g1199L43991J12960j46782k37713k27919j29435J10876L11160K50704J7589
$$ -71199 272792 385752 238970 1257 -226662 -356097 -245221 65939 316643 334232
173C34232j78213k70424k25968J887K42907K71076J26362l1611j84665k83951
$$ 334232 156019 -114405 -340373 -338486 -95579 175497 301859 270248 85583 -198368
183a98368j64621J20292K83981K17908O2549j06117k50607k38808l6202J70868
$$ -198368 -362989 -242697 41284 259192 321741 215624 -34983 -273791 -309993 -139125
193a39125K34992J85375K6491j98613k94270j45162P8917J94210K11300J42314
$$ -139125 95867 281242 307733 109120 -185150 -330312 -251395 -57185 154115 296429
203B96429n2445k46574k42411o1853J19348K26614K21020N5645j67461k46043
$$ 296429 243984 -2590 -245001 -306854 -187506 39108 260128 315773 148312 -97731
213i7731j55950r985J43164K52995J84944m8213k28217k20822j01934N5306K08532
$$ -97731 -253681 -263666 -120502 132493 317437 269224 41007 -179815 -281749 -226443 -17911
224a7911K37551Q3028j19416k19530j96103o3125J38048K59489J75385k0142j63606
$$ -17911 219640 302668 183252 -36278 -232381 -295506 -157458 102031 277416 257274 93668
235I3668k11375j60575J1933K05311K38978J02167p6149j99345k15971q8323J18051
$$ 93668 -117707 -278282 -266349 -61038 177940 280107 203958 4613 -211358 -299681 -181630
246a81630K29786J78985L9846j17728k25607j86641L271J82801K17354J25125
$$ -181630 48156 227141 266987 149259 -76348 -262989 -259718 -76917 140437 265562
256B65562k7216j77439k26302j09454P7800J96113J92508P8931r8587k23368j85119
$$ 265562 238346 60907 -165395 -274849 -197049 -936 191572 270503 171916 -51452 -236571
267b36571k1528J32250K00161J61416J3440j60808k20495j22212M0596J70579
$$ -236571 -258099 -125849 74312 235728 249168 88360 -132135 -254347 -213751 -43172
277d3172K03648J07383p2638j96465j83595o3654Q9174J97397J81955L2996j37061
$$ -43172 160476 267859 195221 -1244 -184839 -248493 -159319 38078 220033 253029 115968
288A15968k02486j42096m226J43747K06495J26973l9825j67871j88953r9033O1183
$$ 115968 -86518 -228614 -232840 -89093 117402 244375 204550 36679 -152274 -251307 -190124
299a90124J89290J85827N6931r7395j83796j65363l7322J24201K01396J40484
$$ -190124 -834 184993 241924 144529 -39267 -204630 -241952 -117751 83645 224129
309B24129l873j41254j90943j20998L4645J67403J84014Q6340o0894j73510j77941
$$ 224129 220256 79002 -111941 -232939 -198294 -30891 153123 239463 178569 5059 -172882
320a72882o0260R6625J82847J51559K8526j15153j89029j37725M387J37997J80147
$$ -172882 -233142 -136517 46330 197889 226415 111262 -77767 -215492 -211105 -73108 107039
331A07039J11302l0757j58265j77795q3171O3724J64431J63668N9558q6284j75881
$$ 107039 218341 187584 29319 -148476 -231647 -167923 -3492 160176 219734 133450 -42431
342d2431j47250k5395J10857J76769J31298o87j31903j73768j04465K9460J46443
$$ -42431 -189681 -215076 -104219 72550 203848 203161 71258 -102510 -206975 -177515 -31072
353c1072J69205Q3111n7442j60001j57405n4626Q0949J66101J43565K5997j06260
$$ -31072 138133 221244 163802 3801 -153604 -208230 -127281 38820 182385 208382 102122
364A02122j69037j26628j560J25245J68537J02708k9405j41307j62032q0788N4855
$$ 102122 -66915 -193543 -195103 -69858 98679 201387 171982 30675 -131357 -212145 -157290
375a57290J53062J52776N3782p8871j61033j38603k6310J03241J64387J20523
$$ -157290 -4228 148548 202330 123459 -37574 -176177 -202487 -99246 65141 185664
385A85664j25j20125j63079r9331K9017J37877J57233P6218n2767j49129j46698
$$ 185664 185539 65414 -97665 -196996 -167979 -30102 127131 203349 150582 1453 -145245
396a45245m9752P8666J55861J32653K3070r9801j59904j14756L275J18002J55112
$$ -145245 -194997 -116331 39530 172183 195253 95452 -64452 -179208 -175933 -57931 97181
407I7181R3829l0099j33432j50858p0934N3442J42519J39600M6169p7751j49802
$$ 97181 191010 160911 27479 -123379 -194313 -140871 1648 141248 187417 109666 -40136
418d0136j24647k2046R6838J50947J10670m381j14814j48092q8386K8346J28663
$$ -40136 -164783 -186829 -89991 60956 171626 167245 52431 -95661 -184047 -155701 -27038
429b7038J44386O6978n1614j36356j31386m5124P3588J45608J21063J9124r2168
$$ -27038 117348 184326 132712 -3644 -135030 -180154 -106566 39042 160105 179229 87061
440H7061j44359j04646K374J10800J42364Q3989k7619j21147j39747o7324N1468
$$ 87061 -57298 -161944 -159570 -48770 93594 177583 149964 28817 -110930 -178254 -126786
451a26786J31817J24325M1112o8406j38146j19242j9354R0688J38716R9588r55
$$ -126786 5031 129356 170468 102062 -36084 -155326 -174680 -83992 54724 154312 153357
462A53357j04726j40717q1574L0303J16773J30822O7063m5598j28975j24450l6888
$$ 153357 48631 -92086 -173660 -143357 -26584 104238 171301 125703 -3272 -127722 -164610
473a64610O8899J29892J13786K1218q7872j36358r3789L841R6101J34222Q2701
$$ -164610 -95711 34181 147967 169185 81313 -55045 -148834 -144993 -48892 85330 168031
484A68031k9317j17684j24042n7438M0600J19660J22852L8392o9421j25505j03948
$$ 168031 138714 21030 -103012 -160450 -119850 -190 122662 161054 91633 -33872 -137820
495a37820k1970Q0696J33515R2457q691r4324j20420p9270J9039J12328J26636
$$ -137820 -159790 -79094 54421 146878 138187 43863 -76557 -155827 -136788 -24460 102176
506A02176N3129m4665j11565j13456m2136O4103J25036R9675J7284p1250j25124
$$ 102176 155305 110640 -925 -114381 -156517 -92414 32622 132297 149581 78331 -46793
517d6793r7699M964R9926J18570O6945j6858r9562j25746o0035M6236J13102J06007
$$ -46793 -144492 -139528 -39602 78968 145913 129055 29493 -96253 -156288 -110052 3050 109057
529A09057M0838n6987j24668j03091r973P5926J12142R1781P566r5754j28675
$$ 109057 149895 92908 -31760 -134851 -144824 -68898 43244 135025 142591 46837 -81838
540h1838o4702K9243R6536J13351O0428m2297j16311j03819l1999N2552J14741
$$ -81838 -146540 -117297 -20761 92590 153018 110721 -5590 -109409 -141408 -88856 25885
551B5885J07163J2717q7074j14896p2748n54P9130J21913P4056l0254j02509j04488
$$ 25885 133048 145765 58691 -56205 -128953 -129507 -50377 71536 145592 115338 12829 -91659
563i1659n0939L7321J13191J05143K3327o0190r9259r2651k5165P6230J23253
$$ -91659 -142598 -105277 7914 113057 136384 76194 -23065 -115716 -140881 -64651 58602
574E8602P4178j5924p9114j02083o9604K0205J01295J02170M2397l1936r7382
$$ 58602 132780 116856 37742 -64341 -133945 -113740 -12445 89725 132122 100186 2804
585B804j07622l1850O7974J02610P2777J6674n5107j11753q7113P804Q6063R8121
$$ 2804 -104818 -136668 -68694 33916 106693 123367 68260 -43493 -130606 -122802 -36739 61382
597F1382O0044j4336r2351j06469l8444M0141Q3557R4200M8652n1201j15837q2019
$$ 61382 121426 107090 14739 -91730 -130174 -90033 -6476 87724 136376 85175 -30662 -112681
609a12681j548O1299R3155Q0868N239q3380j03147n6796J1321Q0649J10049N1152
$$ -112681 -114229 -52930 40225 121093 126332 42952 -60195 -116991 -105670 -25021 85028 136180
621A36180m9816r7240p7153l3334L4235J01264R9446J1735p4812r5627o8541m439
$$ 136180 86364 -10876 -88029 -121363 -87128 14136 113582 125317 50505 -45122 -113663 -118102
633a18102P7975J07365N3785k4291p4272r3233o1714L3324J09820R1444J2519
$$ -118102 -40127 67238 121023 96732 22460 -70773 -132487 -99163 10657 102101 114620
644A14620m9256q3443q5054k1678P0202J02136O4902j519o8229j05382o2662L4105
$$ 114620 65364 -18079 -103133 -124811 -54609 47527 112429 110910 42681 -62701 -125363 -91258
656i1258Q8723P6105L8147j9291q9299j01711k5809O1356Q9615O8013J5253n9030
$$ -91258 -2535 73570 111717 92426 3127 -98584 -124393 -63037 26578 94591 109844 50814
668E0814j00307o1259J2429O2272Q6280O7894j4070r5614r1627k1081L5105O9468
$$ 50814 -49493 -110752 -98323 -36051 50229 118123 104053 8439 -83188 -104269 -69164 304
680C04Q2655L7257n1671r4167o9067j1742N0056R4180P1508j4664p5061p3363
$$ 304 82959 120216 68545 -25622 -94689 -106431 -56375 37805 109313 94649 19588 -53775
692e3775m5657L41P1623J02263M3414m5038q0846o7890l0279L9397R1137P0826
$$ -53775 -99432 -99091 -27468 74795 118209 73171 -7675 -75565 -105844 -66447 24690 95516
704I5516M469m8368p8255p4807p469P9210R3676L5458k0960n7773q0102n2554
$$ 95516 99985 51617 -26638 -101445 -108914 -29704 63972 99430 78470 20697 -59405 -111959
716a11959K9366Q8842P4582K4294l6200q4855p9927n947O2632P3486N2949J2161
$$ -111959 -82593 6249 80831 105125 68925 -15930 -95857 -101804 -39172 34314 87263 99424
728I9424n5989j01268n7674K9959P3830O9718L9556k1448q1017p7532j8588L9593
$$ 99424 43435 -57833 -115507 -85548 -11718 58000 97556 76108 -4909 -82441 -101029 -61436
740f1436P2724P6358K3969o2599r1974m6410R885M8673P5468O1898j3345p9915
$$ -61436 11288 87646 111615 49016 -42958 -89368 -79483 -30810 44658 106556 93211 13296
752A3296p8206l1470K3319P2902Q0312K0173n0024p0875n5667k1558M0563R1059
$$ 13296 -64910 -96380 -73061 -159 80153 100326 50302 -20573 -76240 -97798 -57235 33824
764C3824O5753j4677o4249o6552m4902N967O7876Q0344L0702k7538o4350p3463
$$ 33824 99577 84900 20651 -45901 -90803 -84836 -16960 63384 94086 66548 2198 -71265
776g1265l4122M4815Q6630N4960O39l7203o7610o6099k436O7332P7490L9173j2309
$$ -71265 -105387 -60572 26058 81018 81657 44454 -23156 -89255 -91691 -24359 53131 92304 79995
789G9995n9715p8725l4651L2949O5494N7697K8582k6595q1254p2447k513N3995
$$ 79995 20280 -58445 -93096 -60147 5347 63044 91626 65031 -16223 -88670 -91183 -37188
801c7188O4129M9155P563n4473p9757m0396J7128N6810P0764M2081k7111p6391
$$ -37188 26941 76096 83659 29186 -50571 -90967 -73839 -17029 53735 95816 68705 -7686
813g686o1506j2154K9790O1078O7128J7043n3072p5136m5103Q57M8628P3308M5680
$$ -7686 -69192 -81346 -51556 9522 76650 93693 40621 -34515 -79618 -78761 -30133 43175 88855
826H8855j9232n9284n9935l5018J5697O8346P3453J6105m1640o1911n2233j7038
$$ 88855 69623 10339 -49596 -84614 -68917 -571 72882 88987 47347 -14564 -66797 -83835
838h3835M0408P4136M9494m896m7607o6373m6841J0533O3626O4714K4078j8691
$$ -83835 -43427 30709 80203 75307 27700 -38673 -85514 -74981 -11355 53359 77437 58746
850E8746n3580o5866k9572L8489O9918N1589R248l6189o7033n4177K779N1618
$$ 58746 5166 -60700 -90272 -51783 18135 69724 78972 42783 -24250 -78427 -75648 -24030
862b4030O1196M0664m307n6897p1914k8913K7756N6976N5083K5762k7168o7715
$$ -24030 37166 77830 73523 16626 -55288 -84201 -56445 531 55614 81376 54208 -13507
874a3507n6804o829L9082O2516N1094K677n2858o5999l4245R580M8486O4298L6520
$$ -13507 -70311 -77140 -38058 24458 75552 78229 25371 -40628 -74873 -65293 -16807 47491 84011
887H4011k4236o3998n5635j7732K7942O1185N5393R784m2446n9993m4704k321
$$ 84011 59775 -4223 -59858 -77590 -49648 11537 66930 76714 34268 -25725 -70429 -72750
899g2750M5196O7934L7838j5729n1942n5165l1002J6791O0026N7863J6570l0658
$$ -72750 -27554 40380 78218 62489 10547 -44618 -75620 -58829 1197 59060 75630 44972
911D4972n6244n2357j1397M0465O1783M0416j694m0810n9359l9609J0288N3995
$$ 44972 -11272 -63629 -75026 -34561 27222 67638 65944 25134 -34225 -73834 -63546 -9551
923i551N6450K5054j7907n2338n6001j8832K9535N5871M6537J2246l4775o0212
$$ -9551 46899 71953 54046 1708 -54293 -73125 -43590 12281 58818 71064 36289 -23923
935b3923m3533K492M2063N5122L6014o680m9082n7342k5512J7581N1243N2907
$$ -23923 -67456 -64964 -22901 32221 68235 61555 12473 -44869 -70381 -52800 -1557 51350
947E1350K0229k6904n6273m6794q734L2530N4679M4902Q01m2873n5596l4166Q257
$$ 51350 71579 44675 -11598 -58392 -67126 -34596 20083 64985 65786 22913 -32683 -66849 -58592
960e8592M4495N6074K8401j8825n1151n0166j9107K3487N5039M8217R431l3741
$$ -58592 -14097 41977 70378 51553 402 -49764 -68871 -45384 9655 57872 67303 33562
972C3562n4007m1544j803M0426N6100L3839q884m4720n3174k8197J7488N0909
$$ 33562 -20445 -61989 -63792 -23366 32734 66573 57689 12969 -40205 -68402 -50914 -5
984eM9308J7463k4467n2246m6456r700L3279N3831L8632J713l9114n3416l3877
$$ -5 49303 66766 42299 -9947 -56403 -66103 -32824 21007 59639 61352 22238 -31178 -65055
997f5055R385M4711N0777K5325j6609m7579m8330j7446K5359N0148M2771R252
$$ -65055 -55670 -10959 39818 65143 48534 955 -47375 -64821 -39462 10686 53457 62709
1009F2709l2101n1786l7605K64L7987N0149L1924p313m3321m9421k3339J6008
$$ 62709 30608 -21178 -58783 -58519 -20532 29617 61541 54228 10907 -38514 -61853 -45845
1021d5845M5384M6503J6911k3523m8454m2737q414K9485M9948L7482j155l5765
$$ -45845 -461 46042 62953 39430 -9024 -51761 -60175 -30690 19258 56740 55585 19820
1033A9820m8874l1202P993M0990M7588K3914j5022m3825m5416j6804K3932M6407
$$ 19820 -29054 -60256 -52263 -11273 36315 60229 45207 1382 -44034 -60838 -36906 9501
1045I501M0687Q807k8881m7347l7113o29L4778M8480K8742p215l8625m6848k4623
$$ 9501 50188 58995 30114 -17233 -54346 -54975 -20197 28283 57025 49810 11185 -35663 -60286
1058f0286J5389M3895M3842J6582k2571m5414m0962p967K9757M5719L5356J006
$$ -60286 -44897 -1002 42840 59422 36851 -8563 -49525 -57492 -27735 17984 53340 54346
1070E4346l3741m7836k8667O521L8734M4509K3314j4324m3085m2696j4768K0990
$$ 54346 20605 -27231 -55898 -49377 -10643 33866 57180 42856 -229 -42925 -57693 -36703
1082c6703M4162L9971Q478k8508m5060l3873n85L3206M5569K9204p105l8202m3496
$$ -36703 7459 47430 55908 27400 -17660 -51533 -52118 -18912 26657 55861 48756 10554 -32942
1095c2942k3080J4118M0979M1911J4061k1428m1994l7665r059K6874M5288L3751
$$ -32942 -56022 -41904 -925 40986 55047 33619 -8375 -46040 -55099 -28225 17063 50814
1107E0814j032l1134m3672k6884N674L6935M3383J9925j3290l8917m0792j6068
$$ 50814 49782 18648 -25024 -51908 -46234 -9299 34084 54009 40719 1802 -38990 -55058
$$ [...]
8191c62
##END NTUPLES=NMR FID
##END=
