##TITLE=1H_PR90_RMSO
 DMSO-d6, 8 sc, 
 5.6.2019
##JCAMPDX= 6.0         $$ Bruker NMR JCAMP-DX V2.0
##DATA TYPE= NMR FID
##DATA CLASS= NTUPLES
##ORIGIN= UXNMR, Bruker Analytische Messtechnik GmbH
##OWNER= root
$$ XWIN-NMR		Version 3.5
$$ Wed Jun  5 15:49:26 2019 Russian Standard Time (UT+4h)  she@DPX200
##.OBSERVE FREQUENCY= 200.13155
##.OBSERVE NUCLEUS= ^1H
##.DELAY= (6, 6)
##.ACQUISITION MODE= SIMULTANEOUS
##.ACQUISITION SCHEME= undefined
##.AVERAGES= 8
##.DIGITISER RES= 18
##SPECTROMETER/DATA SYSTEM= spect
##.PULSE SEQUENCE= zg30
##.SOLVENT NAME= CDCl3
##.SHIFT REFERENCE= (INTERNAL, CDCl3, 0, 15.7039)
##AUDIT TRAIL= $$ (NUMBER, WHEN, WHO, WHERE, WHAT)
$$ ##TITLE= Audit trail, XWIN-NMR		Version 3.5
$$ ##JCAMPDX= 5.01
$$ ##ORIGIN= Bruker BioSpin GmbH
$$ ##OWNER= she
$$ F:/spectra/data/she/nmr/H-F/1/audita.txt
$$ ##AUDIT TRAIL=  $$ (NUMBER, WHEN, WHO, WHERE, WHAT)
(   1,<2019-06-05 15:48:17.34 +0400>,<she>,<DPX200>,
      <created by zg, POWCHK disabled, PULCHK disabled
       configuration hash MD5:
       00 E9 B6 7A A2 85 ED C7 34 08 36 98 17 FE 4E 26
       data hash MD5: 16K
       61 0F 60 FC 29 7F 67 3B 09 16 62 D1 20 51 D1 3F>)
$$ ##END=
$$ 
$$ hash MD5
$$ 8C A6 E9 EC 89 B7 16 B2 48 A6 47 35 2D 0F B4 77
##$RELAX= 
##$RELAX= 
##$RELAX= 
##$RELAX= 
##$RELAX= 
##$RELAX= 
$$ Bruker specific parameters
$$ --------------------------
##$DU= <F:/spectra>
##$EXPNO= 1
##$NAME= <H-F>
##$PROCNO= 1
##$TYPE= <nmr>
##$USER= <she>
##$AMP= (0..31)
100 100 100 100 100 100 100 100 100 100 100 100 100 100 100 100 100 100 
100 100 100 100 100 100 100 100 100 100 100 100 100 100 
##$AQSEQ= 0
##$AQ_mod= 1
##$AUNM= <au_zg>
##$AUTOPOS= <>
##$BF1= 200.13
##$BF2= 200.13
##$BF3= 200.13
##$BF4= 200.13
##$BF5= 200.13
##$BF6= 200.13
##$BF7= 200.13
##$BF8= 200.13
##$BYTORDA= 1
##$CFDGTYP= 0
##$CFRGTYP= 5
##$CHEMSTR= <none>
##$CNST= (0..31)
1 1 145 1 1 1 1 1 1 1 1 1 1 1 1 1 1 1 1 1 1 1 1 1 1 1 1 1 1 1 1 1 
##$CPDPRG= <>
##$CPDPRG1= <>
##$CPDPRG2= <>
##$CPDPRG3= <>
##$CPDPRG4= <mlev>
##$CPDPRG5= <mlev>
##$CPDPRG6= <mlev>
##$CPDPRG7= <mlev>
##$CPDPRG8= <mlev>
##$CPDPRGB= <>
##$CPDPRGT= <>
##$D= (0..31)
0 1.2 0 0 0 0 0 0 0 0 0 0.03 0 0 0 0 0 0 0 0 0 0 0 0 0 0 0 0 0 0 0 0 
##$DATE= 1559735296
##$DBL= (0..7)
120 120 120 120 120 120 120 120 
##$DBP= (0..7)
150 150 150 150 150 150 150 150 
##$DBP07= 0
##$DBPNAM0= <>
##$DBPNAM1= <>
##$DBPNAM2= <>
##$DBPNAM3= <>
##$DBPNAM4= <>
##$DBPNAM5= <>
##$DBPNAM6= <>
##$DBPNAM7= <>
##$DBPOAL= (0..7)
0.5 0.5 0.5 0.5 0.5 0.5 0.5 0.5 
##$DBPOFFS= (0..7)
0 0 0 0 0 0 0 0 
##$DE= 6
##$DECBNUC= <off>
##$DECIM= 24
##$DECNUC= <off>
##$DECSTAT= 4
##$DIGMOD= 1
##$DIGTYP= 9
##$DL= (0..7)
0 120 120 120 120 120 120 120 
##$DP= (0..7)
150 150 150 150 150 150 150 150 
##$DP07= 0
##$DPNAME0= <>
##$DPNAME1= <>
##$DPNAME2= <>
##$DPNAME3= <>
##$DPNAME4= <>
##$DPNAME5= <>
##$DPNAME6= <>
##$DPNAME7= <>
##$DPOAL= (0..7)
0.5 0.5 0.5 0.5 0.5 0.5 0.5 0.5 
##$DPOFFS= (0..7)
0 0 0 0 0 0 0 0 
##$DQDMODE= 0
##$DR= 18
##$DS= 0
##$DSLIST= <SSSSSSSSSSSSSSS>
##$DSPFIRM= 0
$$ [...]
##$SUBNAM2= <"">
##$SUBNAM3= <"">
##$SUBNAM4= <"">
##$SUBNAM5= <"">
##$SUBNAM6= <"">
##$SUBNAM7= <"">
##$SUBNAM8= <"">
##$SUBNAM9= <"">
##$SW= 24.9336996594482
##$SWIBOX= (0..15)
0 0 2 0 0 0 0 0 0 0 0 0 0 0 0 0 
##$SW_h= 4990.01996007984
##$TD= 16384
##$TD0= 1
##$TE= 0
##$TE2= 300
##$TE3= 300
##$TEG= 300
##$TL= (0..7)
0 120 120 120 120 120 120 120 
##$TP= (0..7)
150 150 150 150 150 150 150 150 
##$TP07= 0
##$TPNAME0= <>
##$TPNAME1= <>
##$TPNAME2= <>
##$TPNAME3= <>
##$TPNAME4= <>
##$TPNAME5= <>
##$TPNAME6= <>
##$TPNAME7= <>
##$TPOAL= (0..7)
0.5 0.5 0.5 0.5 0.5 0.5 0.5 0.5 
##$TPOFFS= (0..7)
0 0 0 0 0 0 0 0 
##$TUNHIN= 0
##$TUNHOUT= 0
##$TUNXOUT= 0
##$USERA1= <user>
##$USERA2= <user>
##$USERA3= <user>
##$USERA4= <user>
##$USERA5= <user>
##$V9= 5
##$VALIST= <valist>
##$VCLIST= <CCCCCCCCCCCCCCC>
##$VD= 0
##$VDLIST= <DDDDDDDDDDDDDDD>
##$VPLIST= <PPPPPPPPPPPPPPP>
##$VTLIST= <TTTTTTTTTTTTTTT>
##$WBST= 1024
##$WBSW= 4
##$XGAIN= (0..3)
0 0 0 0 
##$XL= 0
##$YL= 0
##$YMAX_a= 359310
##$YMIN_a= -757641
##$ZGOPTNS= <>
##$ZL1= 120
##$ZL2= 120
##$ZL3= 120
##$ZL4= 120
##$ABSF1= 10
##$ABSF2= 0
##$ABSG= 5
##$ABSL= 3
##$ALPHA= 0
##$AQORDER= 0
##$ASSFAC= 0
##$ASSFACI= 0
##$ASSFACX= 0
##$ASSWID= 0
##$AUNMP= <proc_1d>
##$AZFE= 0.1
##$AZFW= 0.1
##$BCFW= 1
##$BC_mod= 2
##$BYTORDP= 1
##$COROFFS= 0
##$CY= 11.3945322036743
##$DATMOD= 1
##$DC= 2
##$DFILT= <>
##$DTYPP= 0
##$F1P= 18.9103706918063
##$F2P= -1.10871071338519
##$FCOR= 0.5
##$FTSIZE= 0
##$FT_mod= 4
##$GAMMA= 1
##$GB= 0.15
##$INTBC= 1
##$INTSCL= 1
##$ISEN= 128
##$LB= 0.24
##$LEV0= 0
##$LPBIN= 0
##$MAXI= 10000
##$MC2= 0
##$MEAN= 0
##$ME_mod= 0
##$MI= 1.114404
##$NCOEF= 0
##$NC_proc= 0
##$NLEV= 6
##$NOISF1= 3.799351
##$NOISF2= 2.8
##$NSP= 1
##$NTH_PI= 0
##$NZP= 0
##$OFFSET= 15.70392
##$PC= 1
##$PHC0= -8506.218
##$PHC1= 19.8002
##$PH_mod= 1
##$PKNL= yes
##$PPARMOD= 0
##$PSCAL= 0
##$PSIGN= 0
##$REVERSE= no
##$SF= 200.130013532006
##$SI= 16384
##$SIGF1= 3
##$SIGF2= 2
##$SINO= 400
##$SIOLD= 16384
##$SREGLST= <1H.CDCl3>
##$SSB= 0
##$STSI= 0
##$STSR= 0
##$SW_p= 3612.71676300578
##$SYMM= 0
##$S_DEV= 0
##$TDeff= 0
##$TDoff= 0
##$TI= <>
##$TILT= no
##$TM1= 0
##$TM2= 0
##$TOPLEV= 0
##$USERP1= <user>
##$USERP2= <user>
##$USERP3= <user>
##$USERP4= <user>
##$USERP5= <user>
##$WDW= 1
##$XDIM= 8192
##$YMAX_p= 0
##$YMIN_p= 0
$$ End of Bruker specific parameters
$$ ---------------------------------
##NTUPLES= NMR FID
##VAR_NAME=  TIME,          FID/REAL,        FID/IMAG
##SYMBOL=    X,             R,               I
##VAR_TYPE=  INDEPENDENT,   DEPENDENT,       DEPENDENT
##VAR_FORM=  AFFN,          ASDF,            ASDF
##VAR_DIM=   8192,          8192,            8192
##UNITS=     SECONDS,       ARBITRARY UNITS, ARBITRARY UNITS
##FACTOR=    0.0002004,     1,               1
##FIRST=     0,             0,               0
##LAST=      1.6414764,     0,               0
##MIN=       0,             -757641,         0
##MAX=       1.6414764,     359310,          0
$$ Real data points
##PAGE= N=1
##DATA TABLE= (X++(R..R)), XYDATA
$$ [...]
2059F20j297K85J270j48r13n14P77L54l30m88M18M9J05j97n5L73l58j90k60O61
2079A62J98n40n25J009N15p23j034N85J586p49j553n1K040O27k061r65J183K141
2097A845j360j567K47J655L64j470p36R49J189o14j377L21J036K04j027p76J630
2114E13M13q73j304R87J587r61j367N32J568k53j785k37J457P05p35j567J411
2131I1J030m78j672j53K000N10j641j015J145J623j112j474j46K544J33k106j024
2148a745J928J397j126k129J055J917n53j786q9K014L55j793j080J748R48p94
2164B67j429L34K074l02j519p59J794J190j661j602J318J612o75k078N23J988
2180A075rj614j344K225J336j336j662Q27J882k69k009j2J525O86j334j345J063
$$ plain form
2059 620 -677 -392 878 730 -183 -697 80 434 104 -384 34 83 188 -9 -64 309 -49 -239 -499 162
2079 162 360 -180 -705 304 819 96 -938 -353 1233 484 -1069 -1120 920 1547 -514 -1479 -296 1845
2097 1845 485 -1082 -835 820 1184 -286 -1022 -73 1116 502 -875 -554 482 686 -341 -1117 513
2114 513 926 53 -1251 -264 1323 362 -1005 -473 1095 842 -943 -1180 277 982 247 -1320 91
2131 91 1121 643 -1029 -1182 818 1328 -313 -1328 -183 1440 328 -1146 -1292 1252 1385 -721 -1745
2148 -1745 183 1580 454 -1675 -620 1297 744 -1042 -1131 883 1238 -555 -1635 113 1061 267
2164 267 -1162 -828 1246 944 -575 -1334 460 1650 -11 -1613 -295 1317 642 -1436 -913 1075
2180 1075 1066 -548 -1892 333 1669 333 -1329 -502 1380 1111 -898 -910 615 1301 -33 -1378 -315
2197c15J593m59j917J59J704M45j464r20J258J506j454j488O14J892l29j813k01
2214a189K002N11j704p71J368J376q79j949N09J722k26j434j62J302N92j214r70
2231a116J296J020o54j185j1Q79Q25j308n23R93O76r67p20R46N36j05j044k76
2249g38J067J96n71p16Q22L67k87o26m6O13O23l94p28lQ36l49o21l5Q89L11p47
2270a37p88P79P94l99m98k81O68K05o25l7L83K19K9p09K58N51q2m22j83L71L93
2291D89o00n06L06Q31k70m55j87Q31l50l79k2P76l40l01j69L32M34k82m00J34
2311a28J38L4k50k96L17N04l00Ol56L16L95j27m67K17K41j48p7k32oM13J55n20
2333a71r0M89M3Op48K03M88K06n55p07O83R36m91r20J98J128k42j023q6J003L27
$$ plain form
2197 -315 1278 819 -1098 -939 765 1210 -254 -1174 84 1590 136 -1352 -738 1154 825 -988 -1189
2214 -1189 813 1324 -380 -1151 217 1593 714 -1235 -726 996 770 -664 -826 476 1068 -146 -1116
2231 -1116 180 1200 546 -639 -650 229 1054 -254 -777 216 892 -75 -795 151 687 582 -462 -738
2249 -738 329 525 -46 -762 60 427 140 -486 -532 81 704 310 -418 -421 415 66 -555 -590 299 610 -137
2270 -137 -925 -146 648 249 -249 -530 138 343 -282 -319 64 283 312 -397 -139 412 330 -92 -275 96 489
2291 489 -111 -617 -311 520 250 -205 -392 439 89 -290 -312 464 124 -177 -346 -14 420 138 -262 -128
2311 -128 10 44 -206 -502 -185 319 19 25 -331 -15 380 253 -214 3 244 96 19 -213 -219 194 349 -171
2333 -171 -261 228 271 277 -471 -268 220 426 -129 -836 -153 783 292 -628 -430 698 456 -567 -653 350 677
2354F77p03o09O19O43k58r08K50P22J02q34j90P50O64p62j069Q10P74p5j367L65
2374c99J086j81j093l96J023P48p15q20L58J146l27q63m9R33M93j246o09P51R54
2393G94p7j218q5J352j51j074k25O76O23l93j124N53R19k01p70k66P90N36n80
2412G9r34M24J244o43p49j46R44L59o34m34N77O82n30o69m34J195L92q82m22O59
2432G8P30o63p77K53Q77j33r06n1R78L52q21p53P74R41n31j065r8J519j2j170
2452d78l36J023M37j33j136J77J448l83j080k26R92N69j083p49R35Q85p20p91
2470f49n5J003L16p80n97P05N36l53n46M7R60l7q76l08Q29M53r01k25L08P89l97
2491B22p42K92J039l38o32m87M60O03j30p56L24M74k32k20q3L94K47o69k46M46
$$ plain form
2354 677 -26 -635 -16 627 369 -539 -289 433 535 -299 -489 261 925 163 -906 -96 678 603 -764 -399
2374 -399 687 506 -587 -983 40 788 73 -747 -389 757 430 -433 -482 451 944 -302 -911 -160 794
2393 794 717 -501 -586 766 615 -459 -684 -8 615 222 -902 -349 570 369 -401 -667 123 659 79
2412 79 -855 -431 813 170 -579 -725 219 578 -56 -490 87 769 239 -430 -864 331 723 -159 -581 78
2432 78 808 145 -632 -379 498 365 -541 -592 386 738 -83 -836 -62 879 348 -717 -815 704 692 -478
2452 -478 -814 209 646 513 -623 -446 1002 619 -461 -687 305 874 -209 -958 -23 862 142 -649
2470 -649 -704 299 615 -165 -762 -57 479 126 -420 -373 587 550 -326 -634 195 648 -253 -478 -170 619 222
2491 222 -520 -228 811 473 -159 -646 -186 417 287 -469 -145 329 97 -123 -206 188 435 -234 -480 -34
2511c4N48j22o48l03Q80M52j066k60L94O28l57p42J27P73K59p18l73K51Q99m46
2531A42n08n2P98Pm16n91N66K52L4n59J97R5L96j81n62K50L82M3o14L72L59J6
2553D26o40N6J74K63l36l25L73M85p19l00M29Q34n68o05NQ26k9j24n72K00Q51
2574G04k59r61j51J069j07o2q06L76P37l1o75m63Q70J86m51o48K43R80K5q76k65
2595e65R08J6j49q43M48O84k37p56L01N14l34j10j43N54j2n32j41M37K08j46k70
2616a68K45M07k44o65J60N38p2l49m05L44M73k06l46j40P73M55o16p78M56N06
2636C68k74m82m07J058O35q55o64L00N90K84j040J77L20N93o85m52P3P25J65r69
2656e40J88P06j36m55j45M20j5k1m67N22K88k33l26K90J70Lm24J4O26m2n19l65
$$ plain form
2511 -34 514 392 -256 -559 321 773 -293 -553 -159 469 112 -630 -503 270 529 -189 -562 -311 588 142
2531 142 -366 -418 380 387 -29 -620 -54 198 232 -327 -130 -35 361 180 -382 -132 250 293 -321 51 410 426
2553 426 -214 -158 16 279 -57 -382 -9 476 -243 -543 -114 720 152 -453 -448 378 349 225 -347 -147 704
2574 704 445 -516 -667 402 295 233 -573 -197 540 509 -166 -629 241 427 -24 -672 -429 551 576 -300 -565
2595 -565 343 359 210 -633 -185 499 262 -494 -193 321 -13 -123 -266 288 276 -256 -397 40 248 102 -168
2616 -168 77 484 240 -425 -265 273 201 -148 -553 -209 264 58 -288 -428 345 800 184 -594 -138 368
2636 368 94 -388 -795 263 898 43 -621 -321 269 553 -487 -310 10 603 -82 -534 -461 264 429 -540
2656 -540 -352 354 218 -237 -382 38 23 2 -465 57 345 112 -214 76 246 249 -175 -161 465 423 -96 -461
2678d61L81O91j41q09J00L25P47p45n84J65J023n14m97l61J145K71o85q54O99
2697a04Q12m59m90l78N94M76m54q08M15P88l15o68K28M12M92o22l18L63L50J41
2717D55q01P6L18J3m60K29L27L54r02K8O33%j69j81P1L5L66q01N5N06N51m91p88
2740e76L21O04J9p20j74Q22L75q38m03N65N79l80q56Q1P92N64o82n44O89J26p6
2761B88o92J07O03K13o8p80m1N40L10n25m26N37M46l89m70L67L33l32k18O0O03
2782D66o08j73l5M05M09n75j54M67P1k2n87P6P49l82l84k82J018k33j43o23L30
2803b10M51k9o33JO86K02o89m61M92N88P3j149L66P28R3m10o51N65P20m59o63
2824c89M9N37K84k53l98J55N93o83k80K03M79J22l53o13O15Q2m2j67j35L47n9
$$ plain form
2678 -461 -80 611 470 -339 -239 86 833 88 -496 -331 692 178 -319 -680 465 736 51 -803 -104
2697 -104 708 249 -241 -619 -25 451 -3 -811 -396 392 77 -591 -363 49 541 -81 -399 -36 314 455
2717 455 -346 -270 48 61 -399 -170 157 511 -391 -363 270 270 101 -80 -9 26 392 -409 -354 152 703 212 -576
2740 -576 -255 349 368 -352 -526 296 671 -167 -570 -5 574 194 -662 -581 211 775 93 -451 238 364 288
2761 288 -404 -297 306 519 451 -329 -370 170 480 -45 -471 66 512 123 -347 20 353 21 -197 -137 466
2782 466 -142 -315 -350 55 464 -111 -265 202 273 251 -336 -260 489 107 -277 -559 459 226 83 -540 -210
2803 -210 241 212 -421 -420 266 468 -221 -682 -190 398 471 -678 -312 416 509 99 -552 13 733 274 -389
2824 -389 -340 197 481 228 -170 -15 578 -105 -385 -182 297 419 66 -547 68 150 108 -59 -194 153 94
2845I4n40K46K41J42m53k83K47L93L18n83R1L87K25m79l71K75O29n11m07J84M48
2866B93k55l15j36N82o8j29l63J24N45O0o29l86J001O0n07l60L50O04m38m22K86
2887a03N03K43o71n60M11Q61m08p69L59L78r9l44KJ48K88j17o65L41M32j70k33
2908a73q4L56O3j87m66M84M56k94j79J77L1K44p62K7L58J77k75m83O06L99m04
2929G1o86K40P31r8m75m1J76N68m12l45k68J063J35q45m87O34N76k59r07L45Q23
2950E39l48k43k49O10K57m25l17J44J66N5l79J07J44M23l73l74K68N47l29p53
2970e30L45Q2L12k58o3J11K83j53m69L73L72j32m59k65N38K17l56j98L16N38k17
2991C87o29J13L73L87r28j29J71O90j25q80K59N80L9k61l82O99M7l93k38J21N60
$$ plain form
2845 94 -446 -200 41 183 -270 -553 -306 87 405 -178 -87 300 525 46 -325 -50 579 68 -339 -155 293
2866 293 38 -277 -413 169 101 -28 -391 -267 278 338 -291 -677 324 384 -123 -483 -133 471 33 -389 -103
2887 -103 400 643 -28 -588 -177 684 276 -493 -134 244 145 -199 -197 -49 239 122 -543 -202 230 60 -173
2908 -173 -257 99 162 -25 -491 -7 449 155 -24 153 184 428 -334 -307 51 228 -47 -530 76 475 71
2929 71 -615 -375 356 258 -217 -258 -82 486 74 -271 -539 524 659 -186 -673 -39 537 278 -629 -284 539
2950 539 191 -52 -301 309 566 141 -176 -32 134 189 -190 -83 61 484 111 -263 5 552 223 -530
2970 -530 -185 -103 209 -49 -112 -1 282 129 -340 33 405 273 -186 -451 87 304 -52 -250 66 604 387
2991 387 -242 -129 244 631 -297 -426 -255 435 310 -570 -311 269 308 47 -335 364 411 18 -220 -99 461
3012D61k39k70n9M68k24k03j54O4N69k38l04l21O12k13k00RN03O1l05m94LR05
3034D31Jr00M20K00K20o19j50L22L01n4m10J1M20L59o49r6L97P6j0l79k29O56
3056C18k6n47l2M85J5k22l78J77O59on68j91J64L69O8n63K13K81J66m44k95L48
3078iK56k77j69p9N01p1l01j80J64L90k96l36K92K56q7k32k67N41L00p34R7L77
3100A36j21O7k97O18L40q03k41K64Q6K84o51K41K74J30m37k53J13M06R2l70r4
3121b16N36P6r2o82M29J74K28m37o08N95K25n1m87J76J85mj5j45j69N18k64j75
3143b03j70L98L14n50J28N4J04j79LK17K73m51j62L25j22K50m8l88M37l6J3l90
3165a83L14L07l33l12k04N96J86m06o00M09P17k88o66R1P55Kl90n45O22R1k24
$$ plain form
3012 461 222 -48 -107 361 137 -66 -220 -156 413 175 -129 -450 162 -51 -251 -242 261 322 17 -477 -474 431
3034 431 432 -468 -48 152 372 -247 -397 -75 226 172 -238 -227 193 552 -97 -193 204 280 270 -109 -338 318
3056 318 292 -255 -287 198 213 -9 -387 -210 449 443 -125 -316 -152 217 285 -278 -65 216 382 -62 -357 -9
3078 -9 247 -30 -199 -278 223 152 -149 -329 -165 225 -71 -407 -115 141 54 -178 -445 96 396 -338 -241 136
3100 136 15 82 -215 403 743 -60 -301 -37 49 333 -318 -77 197 327 -110 -363 -250 156 248 -122 -216
3121 -216 320 396 304 -378 51 225 453 16 -592 3 228 177 -310 -134 51 47 32 -113 -282 236 -28 -203
3143 -203 -373 25 339 -211 -83 -29 75 -104 -101 116 389 -62 -224 101 -21 229 181 -207 230 194 207 -183
3165 -183 131 438 105 -207 -411 185 371 -35 -635 -226 491 203 -463 -372 383 385 -5 -550 72 163 -61
3186f1k99L9N84K35r23m2N00N34n91p3p0M14q9l34l3M94nj82m74O32q6l63K14
3209B1k54O42l80J22l85%M29m1l25K12J29j11l44j71M67M36n51l54L36N35m29
3230a6k07j28P14l0m11j45N27N8r9n99L4P45J24o67l57O61k66j82k23P7P92j22
3252B80l41l53N67M83q89n2J71K83j51k92J76N11l2p06K00o7O15l52l98M81L43
3273D77l79m36M59j90K6l4j93R9M51o1p66K49J74J37O0k06M50N6m9q89N49K04
3295A88qm33l39P65P2N7o23j51N77J90n67M3M03K04l39m27O39k17L0k09J97j62
3317a10K81j60m00L22M69n19k5J43L42l49k07L93o4j08J91m03Q3K26k21j07L5
3338a88N17m52Jk24K71L07m86J82K04j93J77o30K91J97N96n72m03K84M47p8n54
$$ plain form
3186 -61 -360 -321 263 498 -425 -467 33 567 -24 -97 -167 247 158 -176 -209 285 280 98 -376 256 170 -193 21
3209 21 -233 409 29 151 -234 -234 195 154 -171 41 170 59 -285 -456 11 447 -104 -458 -122 413 -16
3230 -16 -223 -351 363 333 -78 -223 304 362 263 -336 -302 443 567 -100 -457 204 -62 -244 -467 -390 402 280
3252 280 -61 -414 153 636 -253 -305 -134 149 -2 -294 -118 393 361 -345 -145 -212 403 51 -347 134 477
3273 477 98 -338 121 -69 -43 -77 -270 -171 280 219 -547 -298 -124 13 73 -133 317 373 324 -565 -16 188
3295 188 180 -253 -592 173 245 302 -321 -472 105 295 -272 -229 174 378 39 -388 251 34 64 -145 52 -110
3317 -110 171 11 -389 -67 402 -117 -142 1 343 -6 -213 180 116 8 199 -204 -121 105 -116 -223 -188
3338 -188 329 -123 -122 -346 -75 232 -254 -72 132 -61 116 -514 -223 -26 570 -2 -405 -121 326 248 -306
3359c06J48M0K03n40M71k80M00j2j65l0K22K45o02N0J31L27k64L3k17J26J75m30
3381b75J88J82L65p92J33K03K26l19k27J90m1K68k53J54l62N68Q4k25k48J65K12
3402A96l44j10J08M03j14l79L66J05j59o55M97N3J14R5k05j7k05L91j36q4O9K10
3424A99k32k03K31O09m27l19j07L75J07j51l03R9L56j78m64L18J01L8k51J24J53
3445G5P7j80k48k0M07l23L05k48K6M34m28J63L3L8k57j93P8O27M4n22K1L92k32
3468F9j05o8l3M62o4k54m83M79L06n9m64J03M09k04k93j28N07J4j16l58L42L68
3490D30l57k58O8K93J52m01l24O48k78P8j16n9K21r7m5k35K20K24o8o90L22N37
3512B65N4n34M2L95M1n79J2J52K25O8o49L27M17O2n93m6M13p8K61m98rK44J86
$$ plain form
3359 -306 -158 -118 85 -455 16 -264 136 124 -41 -71 151 396 -206 -156 -25 302 38 71 -146 -20 155 -275
3381 -275 -87 95 460 -332 -199 4 230 -89 -316 -126 -167 101 -152 2 -360 208 292 67 -181 -16 196
3402 196 -148 -258 -150 253 139 -240 126 231 72 -583 -86 -33 81 176 -29 -46 -251 140 4 -80 -11 199
3424 199 -33 -236 -5 604 177 -142 -249 126 233 82 -221 -122 234 56 -408 -90 11 49 -202 -78 75
3445 75 152 -28 -276 -296 111 -212 93 -155 -129 305 -123 40 73 111 -146 -339 -261 366 410 -112 -91 301 69
3468 69 -36 -104 -137 325 261 7 -476 3 309 250 -214 -111 298 94 -199 -327 180 194 78 -280 62 430
3490 430 73 -185 -117 176 328 -73 -397 251 -27 51 -65 -124 97 0 -45 -280 -60 164 96 -594 -272 265
3512 265 319 -215 -173 222 263 -316 -304 -152 73 141 -508 -181 236 298 -295 -341 72 -6 255 -243 -252 -8 178
3535A78k90j44J31J98J13r1k68N05l69l91M80Q9L4n10L89r8L36m40k80K68M86
3556C26j11l70Q9J59K22l59Mk9N16l25p4j33K37L4k92k34L10K05k20J11m84L03
3578a15L47P4n14R7J41o9l75Q0N19l38N1j99M86N8l73k01L86j25J60l58L96j23
3600Ej3q0k79N23k6k37k57M18m6O2k29j98K08R3J50n38K57L36l7j82k59k3M96
3623A44J80o34M67J3M8m30J64L9J78k65j45K32lJ08k00P2J26J34j29O7K12j96
3645A82J8m03m1M10j41j94L5K12J99l89J21J81j3j96k23r9P53j45J54p92M34Q7
3667A50l22N7rK06O7l0j66PL52j81l72L94l77M02k94J88L1K14j79j60j48l2L25
3690A23m00K99j38K20l40m7L46L19o24M9j9M06o7k07l28M35q4J12j41R1J45N5
$$ plain form
3535 178 -112 -256 -125 73 186 95 -173 332 -37 -428 52 141 175 -335 54 -44 292 -148 -428 -160 326
3556 326 215 -155 -66 93 315 -44 -40 -69 447 122 48 -85 152 186 -106 -340 -30 175 -45 66 -418 -115
3578 -115 232 306 -208 -111 30 -39 -414 -334 185 -153 -102 -301 185 243 -130 -331 55 -70 90 -268 128 5
3600 5 -8 -88 -367 156 130 -107 -364 54 8 70 -159 -357 -149 -56 94 -444 -187 149 112 -70 -329 -352 144
3623 144 324 -310 157 170 218 -212 -48 -9 169 -96 -241 -9 -12 96 -104 -32 94 228 99 166 378 182
3645 182 200 -203 -244 166 25 -169 -134 78 277 -112 9 190 177 -19 -242 -341 412 267 421 -371 63 150
3667 150 -172 -115 -124 82 149 119 -47 -40 312 131 -241 153 -224 178 -116 72 103 317 138 -22 -170 -202 123
3690 123 -277 22 -116 104 -236 -283 63 382 -242 -193 -212 194 127 -80 -408 27 -57 55 -86 5 150 205
3712B05n43Q0Q0Q7m4l6o9K75p3K36k3K0K76o31j94K03L13k22M4R5QM26m41l17
3736b45K75K43m9k92l04O84M7m71J7K02K45o42j01K05J86Q9j09j93M9M70m43l24
3758d61N69L47k86o85O08L50n09m64L38Q0K91k09j99L04j42J80j61K0J31o5l59
3779c22qK11M57k16m27K09K34L33o76O7N7J16R4m76K61L44k63m0k01J22M18l75
3801h1n0P1J03J39K0k49J01Jl00k73M63L91l14l9J37L7q7lj58J94J07l33k29M08
3825E6J07k30J95k05L59p6l92L0L22j64k36J5O81m03L55q52N53l69M30j37l82
3846c43M44j35K53l38j9L17K77q71L09K71J06k43K50l20P3L34o56M3L22Nj74j4
3868a09o1L42r5j88J15J02k62l43L05L24N3j60l03Q6M23k65J07l50R7M44o6n59
$$ plain form
3712 205 -338 -258 -178 -91 -135 -171 -240 35 -38 198 175 195 471 -160 -354 -151 162 -60 -16 79 87 513 72 -245
3736 -245 30 273 224 -68 -372 312 359 -112 -95 107 352 -290 -391 -186 0 89 -20 -213 -164 306 -137 -461
3758 -461 108 455 169 -516 92 442 -67 -531 -193 -113 178 -31 -230 74 -68 112 -49 -29 102 37 -322
3779 -322 -330 -119 338 122 -305 -96 138 471 -205 -138 -81 35 129 -347 -86 258 -5 -45 -246 -124 294 -81
3801 -81 -131 -60 43 182 202 -47 54 55 -245 -518 -55 336 22 -17 120 157 70 67 -91 103 210 -123 -352 56
3825 56 163 -67 128 -77 282 206 -186 -156 166 2 -234 -219 462 59 414 -438 115 -254 176 39 -343
3846 -343 101 -34 219 -119 -138 179 456 -415 -106 165 271 28 278 -42 31 365 -291 -248 74 79 -95 -109
3868 -109 -170 172 77 -111 4 106 -156 -499 -194 130 183 23 -280 -194 229 -36 71 -279 -182 262 196 -363
3890c63K94J14l7J68l82J72L05k93M2r5L59j53j02j82K19L44j17l04j63J85n5
3911d4O7m08N83m2r4N8j21L34j79j62K87j73l5J0j47l65K68M61p6j59N1RJ62m25
3935a40k46M84j23J53O3q2K29o66J64Q0J29K03k55r8K36j72N6l61M14R3L1l61
3957a69R8R6j17J63l62K60Nj66K12k96N05K42n13J79o1m6L3j16j99K37r4K13m83
3980c79M20n2k54J69n5K42l7j57J52J95k45l9l96M36Q9j28J82j34J81m02K63j1
4002D0R0K69k93l38N35j98O2j59J27J57l75k27n0P64m06j41m3J84J37j24k95K17
4024f7J86m8l69J53K7J53L7l37L58k26K00j87Q9j40L49k17p5J76j4J45l36l9M14
4047B32l65M0l7J03K44k47k09K41L53l71k22L92m5J41n61J03L78J2k53k59M99
$$ plain form
3890 -363 -69 45 8 176 -206 -34 271 -22 20 -75 284 131 29 -153 66 410 293 -11 -174 11 -44
3911 -44 23 -385 198 156 62 120 -1 333 154 -8 279 106 71 81 -66 -431 -163 298 222 63 114 123 285 -140
3935 -140 -386 98 -25 128 191 109 338 -328 -164 -84 45 248 -7 -105 131 -41 15 -346 68 161 192 -169
3957 -169 -71 25 -92 71 -291 -31 -26 -192 20 -276 229 471 -42 137 76 30 63 -53 -252 -15 -109 104 -379
3980 -379 41 -11 -265 -96 -151 91 54 -103 49 244 -1 -40 -436 0 89 -39 143 9 190 -212 51 40
4002 40 130 399 106 -232 303 105 167 8 135 292 -83 -310 -360 404 -2 -143 -186 -2 135 11 -284 -67
4024 -67 119 71 -298 -145 -118 35 72 -265 93 -133 67 -120 -31 -171 178 -39 -114 62 48 193 -143 -182 232
4047 232 -133 -93 -130 -27 217 -30 -239 2 355 -16 -238 154 109 250 -311 -208 170 182 -71 -330 169
4068A69K30m56J35m23O03N3m98o7P83m64J66j38k29K81R1k87q7K34M3M5l99K25
4090A0j48M67m33J1K20K35o70L66j92M71m71k12J26K32J03O5m37N79k06N2l9R0
4112B19j7j99P6m22M48j29q6o7J73J80J58l96J66N0ol15J0K59j11M4J82m54L67
4135A30o6Ml84K57K20R5m27J41M19l41P0Q7j70k49M01l24K32M7J04j00q1M4k6
4158H3j55r4j72L08L6K85r8j16l2K68n22O4J38M2jM3l30K82r0O83r79K96J15k97
4182b43Q5K60R7o06K69R8O2q8J53j42n0J26P8k75L33k09Kj5j18m7K09J37n14K23
4206a75L53j11m6k19J82L85m37k42K24O28n97jJ85k88K36q7J81m59K36l6J49M0
4228A01o9m1k53j8M86j1j73K26l04M02k76j10Q4k68K51j07m8J41k2mJ48j70K63
$$ plain form
4068 169 399 -57 78 -345 258 311 -187 -254 529 65 231 93 -136 145 236 -51 -138 96 139 184 -215 10
4090 10 -138 329 -104 -93 127 362 -308 58 -134 337 -134 -346 -220 12 115 180 -257 322 116 168 129 219
4112 219 202 3 79 -343 105 -24 -110 -177 -4 176 334 -62 104 154 148 -167 -157 102 -9 35 217 -237 130
4135 130 64 68 -316 -59 161 256 -171 -30 389 48 118 205 35 -214 187 -137 95 142 246 146 65 109 83
4158 83 -72 -166 -338 -30 6 291 193 77 45 313 -209 -145 -7 35 34 77 -253 29 -61 622 -357 -61 54 -243
4182 -243 -158 102 199 -407 -138 -40 22 -66 87 -55 -105 21 99 -176 157 -52 -50 -65 -183 -230 -21 116 -398 -175
4206 -175 178 67 21 -198 -16 369 -68 -310 -86 542 -55 -56 129 -159 77 -10 171 -288 -52 -88 61 101
4228 101 32 -9 -262 -280 206 195 22 248 -56 346 70 -40 44 -224 27 -80 -128 13 -9 -13 135 -35 228
4251B28K71o61N3K74j68j92K48l01N67k99q8M3Q2l0L3l3o8N65j25o33k5L41k68
4274a86M8M4K28Mk61l15M15J15J77m24L8J92O4J57n55M34l3Q6l52J64K78k45j85
4297a12p6j6N13l69j21o7K17J70l60K43J75j42Q8l70K37q0O6L5k16J95r7J89n34
4320d32K62K60k75J50J61K05l63j80K03M8K37n04M33o6J56l79jN2M9K93k11j65
4342f7L8K33j12j19O5k20M72l54L9K01K1l02j47K10K38j51r9rj4L02k33L04k78
4365A8j20m0j64K26J24r8j3q3L44Q8k73K52l60L13j74k19j58N11r2n0o1q5J19
4388EJ9RL3l9p7m41L92K39k64M48o09L20k85J22Q9Ln0J12o0M0j1M21k40k96L21
4413B01k54K27J44n24L91M4l15J21j49L81k52n5J03n93M42J90rj07J4Oj54j58
$$ plain form
4251 228 499 -162 -109 165 -3 -195 53 -248 319 20 -68 -25 57 27 60 27 -41 524 399 -234 -259 82 -186
4274 -186 -138 -94 134 138 -123 -438 -23 92 269 -155 -117 75 139 296 -259 175 142 228 -124 40 318 73 -112
4297 -112 -188 -204 309 -60 -181 -248 -31 139 -221 22 197 55 143 -227 10 -70 -4 31 -185 10 -87 102 -432
4320 -432 -170 90 -185 -35 126 331 -32 -212 -9 39 276 -228 205 139 295 -84 -85 -33 16 309 98 -67
4342 -67 -29 204 92 -27 38 -182 290 -64 -25 176 197 -105 -252 -42 196 45 -54 -63 -77 225 -8 296 18
4365 18 -102 -142 -306 -80 44 -54 -67 -150 194 282 9 261 -99 214 40 -179 -337 174 82 32 -29 -114 5
4388 5 24 33 66 27 -50 -491 -99 140 -124 324 -285 35 -250 -128 -39 -36 -86 26 -34 6 -5 416 176 -120 201
4413 201 -53 174 318 -206 185 229 -86 35 -114 267 15 -40 63 -530 -88 102 93 -14 0 6 -148 -306
4435c06j0M46K7o5j17k77L76k32O5R8m0K09k66l8J63n8R0p3q1K01j72L09p2m0
4459A37p4j95Q3NL28k46p3j0K55j49j24m6J0K4J7J77O3j14j89J16J38o8J16m50
4483b69M06l1j9k49J77J6J53qj03L6k00j06K83j89J55o5Q5r9K37l2j84J10pk04
4507a07J40R4l57J07M06%m38J98L4Kj50j21L29r0l9j43J50R6l12R9j97K29J58
4530H8j95r2L47j5m6r6k7R2j5k21j44K41K19j95O8j67K80K3j73R8m6j26J07m43
4554d38M81J6R3n26M17K4j58j27L3j6N50k65Q4m8L2j52K91m95J82J53j22j97J88
4577@j98J84q3P0K4O7l23L10k69K81O7j13K11j11Q2k06j0k0m7L18k89l4P6P6j35
4602g2j08J40n5P5j71J23K02M24o19r8J97J38n5j26k1K36l60J51j0J35l9k10j52
$$ plain form
4435 -306 -316 130 157 92 -25 -302 74 -158 -93 5 -35 174 -92 -130 33 -25 65 -8 -89 112 -60 249 177 137
4459 137 63 -132 -49 -44 284 38 -35 -45 210 61 -63 -109 -99 -75 -58 119 182 68 -121 -5 133 65 181 -269
4483 -269 137 106 87 -162 15 31 184 176 73 109 -91 -197 86 -103 52 -13 72 -27 210 178 -6 104 97 -107
4507 -107 33 127 -230 -123 283 283 -155 43 77 79 -71 -192 137 47 8 -135 15 111 -201 -102 -299 -70 88
4530 88 -107 -199 148 133 87 -9 -36 56 41 -180 -324 -83 136 -59 9 -158 122 145 -28 70 24 -102 5 -438
4554 -438 43 59 152 -374 43 67 -91 -218 -185 -201 349 84 168 120 152 0 291 -204 -22 131 9 -188 0
4577 0 -198 -14 -97 -27 -3 64 -259 51 -218 63 130 17 228 117 199 -7 -17 -37 -84 234 -55 -89 -13 63 -72
4602 -72 -180 -40 -95 -20 -191 -68 134 558 -61 -159 38 176 121 -5 -26 210 -150 1 -9 126 87 -123 -275
4625b75L49J28m8k36J09K07k18j5q3J61k02P8K30l53K09K87o92J23L08j62N0j54
4647a99M44l14L9k5k4K09j71p3k26N67k48J2K53m75M33k68N5lL9J41k49q3k5K17
4671B6k17J32l7K85l8j93J19K02k38j8j20J39L9J00k4k89j0K45r8M0l84L00L37
4694B98m94o6K24K2k73K27j82J00L40q1k01K26m30M86k47Q3M00m40J90l94j0M53
4716B31j91oKJ33k27p5J07Q0R8j64q9L29P4k80K6N1j48K70l19K93l44J21j89M
4740b13L55k74J12l87L41K95j70j91J17K44j93k21R6J86l27N69l17L0J88m11R1
4761h0J62K2Rj48J57M0N6k80OM01m41K08L4j35p2K10J00p6m08J23J71k33K44r2
4785b2J78j17o4j78M63j55j05j46N6M09l12P5j06Oj29k8K1M27k14Q4k46L05k04
$$ plain form
4625 -275 74 202 154 -82 27 234 16 1 -82 79 -123 -45 185 -168 41 328 -364 -241 67 -95 -45 -199
4647 -199 245 -69 -30 -55 -79 130 -41 -114 -340 227 -21 -9 244 -231 202 -66 -11 -14 25 166 -83 -166 -191 26
4671 26 -191 -59 -96 189 151 -42 77 279 41 23 -97 42 81 181 157 -132 -142 103 5 45 -339 -39 298
4694 298 -196 -262 -38 -16 -289 -62 -244 -144 196 115 -86 140 -290 196 -51 32 432 -8 182 -212 -222 231
4716 231 40 34 36 169 -58 -133 -26 54 152 -12 -101 228 302 22 48 99 -49 221 -98 195 -149 -28 -217 -213
4740 -213 142 -132 -20 -407 -66 229 59 -132 -15 229 36 -185 -89 97 -230 339 22 52 240 -171 -80
4761 -80 82 104 113 -35 122 162 218 -62 -56 345 -96 112 146 11 -61 149 249 173 -235 -112 59 -174 70 -22
4785 -22 156 39 -25 -203 260 105 0 -146 -90 319 7 82 -24 -18 -147 -175 -154 273 59 143 -103 202 -2
4808bK51j74K4q2K12p3N8Q4r3k75j0j07M41k09j67J42l06N03l31p3J1M59k06J68
4832B45j15Ml9J86l91N4j2J26p7J87k6M1j59l0jJ53k00k39K28rj57O9J45m8kJ5
4858e2j67J31K62M9l03J86q5R0k45k5L57m41M95r6l52K91m6J63j83k38N10p7j51
4881G3J13rk74K71Nj26K52m19J02L13j88l0k24L3K38P3l35J68k54K97j32j9m3
4904a15M5K21p7j53k16M36j29q8m9k53M95j1j59J00K3j30k64L48J2J36k43O8O7
4927F4j78N61m73J37n39P51p83N91r7k62R5J93J4n7K4JK14j67K62n14J0JM26l28
4951e4j33J62K75m37J17K21j67m6j6J22k4l87N70l38J6K53M0l74J12J80j54j93
4973b55K52L93k97j43J77k11Q5J76J58j27m37L46m5l51M83rM1o7k40P8J62k11
$$ plain form
4808 -2 249 75 99 17 229 156 214 298 205 -70 -80 -187 254 45 -122 20 -286 217 -114 -187 -176 283 77 245
4832 245 130 134 95 281 -110 -56 -68 58 -19 168 142 183 24 -6 -7 146 -54 -293 -65 -74 -231 -162 -17 -65 -67 -52
4858 -52 -219 -88 174 223 -80 106 21 111 -134 -159 198 -243 252 156 -196 95 49 212 29 -209 301 224 73
4881 73 186 177 -97 174 179 53 305 -114 -12 301 113 83 -141 -108 130 203 -132 36 -218 79 -53 -72 -115
4904 -115 -70 151 74 -79 -295 141 12 -76 -125 -378 117 106 -53 47 70 -60 -324 24 36 172 -71 -3 64
4927 64 -114 447 -26 111 -428 323 -460 131 34 -228 -133 60 74 17 41 42 256 89 351 -163 -153 -152 274 -54
4951 -54 -187 -25 250 -187 -70 151 -16 -62 -78 44 20 -367 203 -135 -119 134 174 -200 -88 92 -62 -255
4973 -255 -3 390 93 -50 127 -84 1 177 335 208 -229 117 72 -279 204 195 236 169 -71 7 169 -42
4995d2N8k0q7J48l09J5M23k82M4n6P3l1K11l8K8j36K7m7k13L62l14J22J42L06
5019C84l19K6Q3k45J47J00l98N29j75l06K76l37K05k6J81L37m49Q2m16O36l42
5040b7l28M51J4j08j24J78oJ06J12k93m6J45J12l79k9K70O5k98J72L73P6n80J71
5063B7l7J26o8r7J89Q8j72l16M52j87j94P8J15M4K7n5j76N8K01m6k05P5l3Q6K35
5088B15l47J93N3j08k66M8k7J20J56l2N1K07k57n4OM5p9R8l8l65Q73l57r6p3o9
5113a03K21k80j43M66j00l06K3K55Q6r1k53K18L21l11k10K90l1K07k15j41J61
5134F4M0l6k6j36K10Op1N8j5O3j08R3m23K88q9P9k40j6L66k81n6R7L03k70k35
5159c35K65j98M95k15r8K18J95l4k19j00J89L3q13O86l7k96K05J94j93J60J1k96
$$ plain form
4995 -42 16 -4 -91 57 -252 -237 186 -96 -52 -108 -35 -66 145 107 135 -1 26 -21 -234 128 -186 -64 78 384
5019 384 65 91 174 -71 76 176 -222 307 132 -174 102 -235 -30 -56 125 462 13 95 -321 315 -27
5040 -27 -355 96 110 2 -122 56 50 156 268 -25 -71 74 186 -193 -222 48 113 -185 -13 360 436 -144 27
5063 27 -10 116 48 -49 140 228 56 -260 192 5 -189 -111 4 48 75 20 -156 -98 103 57 -148 -73 -106 -20 215
5088 215 -132 61 114 6 -260 -212 -239 -119 37 5 56 263 6 -48 -42 3 -76 22 -16 -381 492 135 39 -34 -103
5113 -103 118 -162 -305 161 61 -245 -222 33 119 28 -225 -7 314 3 -207 83 52 259 44 -97 64
5134 64 104 68 42 -94 116 122 51 109 94 157 49 142 -281 7 -82 -3 -243 -259 107 -174 -230 -133 170 -100 -335
5159 -335 -70 -268 227 12 -86 132 327 293 74 -26 163 196 -617 69 32 -264 -59 135 -58 102 113 -183
5181a83N8L8j88%J78j9K20j38R4K12j06j90j16K22J55m28J70m2J98J2l61P0R2
5204e2J75l42M53k50j75L73l02n0K01J29p5M4j81J82j40J80j36L29m11J02q9k2
5226e7J02K19l20K48j90j14K83j48j70K66j24M1m46M02j13j2K52oJ21ll09k34
5248c12L83J95l37k9j25M27j19n2J96j80J39l80K56m1L8K15l45J75r4J28J35j60
5270A13l01N4O8K18J44k65p7j47J26J01J9j83M34j91l09K49j15k09K60J89K32
5291D10l66k69K96j91J19R2r5k1j57R3L9J13p3J87j37Q6n09K77J44k94N50l10
5313a6J2J66q1j37J80k63J12J52j6j97K35k15k18K01P8j24K48k94J02m5J16J55
5335A51o3j51L99j23o8l65J72J31Q0j1k31K39l70L31j52J75O1j98nK25j53K9o3
$$ plain form
5181 -183 -125 -87 -275 -275 -97 -116 104 -34 60 272 166 -24 -140 82 237 -191 -21 -63 135 147 -214 -144 -52
5204 -52 123 -219 234 -16 -191 182 -120 -170 31 160 85 129 -52 130 -10 170 34 363 -48 54 -35 -57
5226 -57 45 264 -56 192 2 -112 171 23 -147 119 -5 36 -410 -8 -121 -133 119 113 234 231 -78 -312
5248 -312 71 266 -71 -100 -225 202 83 31 227 47 186 -194 62 21 59 274 -71 104 10 138 273 113
5270 113 -188 -134 -66 152 296 31 -46 -193 -67 34 53 -130 304 113 -196 53 -62 -271 -11 178 410
5291 410 44 -225 71 -120 -1 91 -4 -25 -182 -89 -50 63 -10 177 40 126 -383 -106 38 -256 294 -16
5313 -16 -4 162 81 -56 124 -139 -27 125 109 -88 147 -68 -286 -85 -7 -131 117 -177 -75 -120 -4 151
5335 151 88 -63 336 213 145 -220 -48 83 163 152 -79 160 -210 121 -31 144 205 7 2 227 74 103 40
5358D0Q7j29L26l38o5L13m2l0k49R5q8J69k06O1J31L8m5k89O50r9k31l59K14r8
5382a44J75j20J3K9K17n7j23L9j08M01m21j25K08m7p9j05p4M82k3k83L8K15l1
5405G7N6l17j34L21L00l52l10N00n2O6K8q0k40P0j02J72j28j78L54j59K79n4j17
5428@N3No5L28m49J13l3K75l14k79K23K01K07o03J67k4K28M46n27K09r3l3J5j77
5452a27J21r1J26k12O8K17k73J51j42K42K13n35j8N55l03j18J1K61K4m36L41j01
5474b6%j33K59k59R7o3K39o2K68m26M45m93K5j26K66J06j63M0J31p9k97L79k54
5497a26N13o68N00m4j44j43J75LP2k71N4J61k37J5l8j85K96L2p0K74l29L64J18
5520C22k70j80K29k77J38K32k74J38j34j75K0L37J13j42P6j82n8J07J14N4p4k89
$$ plain form
5358 40 127 -2 324 -14 -79 234 192 162 -87 8 -80 89 -117 -56 75 113 68 -221 429 330 99 -260 -46 -144
5382 -144 31 -89 -76 -47 170 113 -10 29 -79 322 -99 -224 -16 -63 -142 -247 -321 161 138 -145 -107 108 77
5405 77 133 -184 -318 3 303 -49 -359 141 89 155 183 103 -137 -67 -169 3 -125 -303 51 -108 171 117 0
5428 0 53 58 -7 321 -128 -15 -48 227 -87 -366 -143 58 265 -338 -171 -195 33 479 -48 161 68 35 50 -127
5452 -127 -6 -97 29 -183 -115 102 -171 -20 -162 80 293 -242 -260 295 -8 -126 -115 146 170 -266 75 -26
5474 -26 -26 -159 100 -159 -62 -125 114 52 320 -106 339 -154 -129 -255 11 117 -46 -6 125 46 -251 128 -126
5497 -126 387 -281 219 175 31 -112 63 66 138 -133 -79 82 -155 -140 -178 -363 -67 -35 -105 169 -160 204 322
5520 322 52 -128 101 -176 -38 194 -80 58 -76 -251 -231 106 219 77 153 -29 -87 20 134 188 114 -175
5542a75qJ57L03k09Q7j53k44L56j3m2q5M1k3q2L33l43J65n1j68Q5q7J92j75Q9
5566e0p0kK48J15m08Q4P8K77m95K13j86K54q1q4K01M02m45q5K47l6j97j79R4k0
5590a25J03K11r0l51K20Q5j56K25j76J54m6m2L27l65L2K33l50J84j83N3k07K81
5612A7r1K20k69J19J01K03n20J34j1o8m0J87O4J77k06J76j83Q7L2l18M49o3j4
5635A83k68k98M99j28L19k10k06L85k06j25l24K75K40J20l16j57R8J58P6L5q9
5656F1j45L40k95r2J35M06l24k48J54K17j76l02J53J20J39j90r2R3Q4q5K9k48
5678b66J95k38K96q9O0L4N4k45J76n9lo5L21j78m3N7L0K1J56rk00qJ21j07J6l1
5704dQ1q0l1NL52k50j76j48J02K90k73J00J55j98L76o2l73N5M02ok92l14L05N47
$$ plain form
5542 -175 -183 -26 277 68 155 2 -242 114 101 59 -26 15 -8 -90 243 -100 65 14 -154 -69 -156 36 -139 -50
5566 -50 -120 -122 126 241 -167 -83 -5 272 -223 -10 -196 58 -23 -107 94 496 51 -34 213 177 -20 -199 -105 -125
5590 -125 -22 189 99 -252 -32 53 -103 122 -54 100 54 12 339 -26 6 239 -111 73 -110 -57 -264 17
5612 17 -74 146 -123 -4 97 300 -220 -86 -97 -165 -205 -18 46 223 17 193 10 97 129 -189 260 197 183
5635 183 -85 -383 116 -12 307 97 -109 276 70 -55 -379 -104 136 256 -60 -217 -119 39 115 150 61
5656 61 -84 256 -39 -131 4 410 86 -162 -8 209 33 -269 -116 4 143 -47 -139 -46 38 -47 -18 -266
5678 -266 -71 -309 -13 -102 -42 -8 46 -199 -23 -82 -85 -150 171 -7 -50 7 37 58 214 205 5 -3 118 11 27 -4
5704 -4 77 -3 -34 -29 323 73 -103 -251 -149 141 -132 -32 123 -75 301 239 -134 -79 323 317 25 -289 16 563
5728E63o86Q1M9J89l34J03J2J77M6m57m6K15J41J67m07K50r5j19Q3j37N08j54
5750A49j52j15j0J17J02J69k70j3j7O4K36l16J99r6q8J86l34K13J52j81n1j57
5772b13q6L21O7j83K52J5l6k3J2j07j36J74k03R0R5p6j72N86l34r0L45k77o9K39
5796A91k02o2K10k90J02j06K69m59L46o3P3Q3o1l82L01j3N5k68N9K64K04l50o9
5819a68L83k69J83j64k04O33k56j31j8j43M61j97k0m1M22l86l60J36L20m0k24
5840h3P7j47L94j76l58J77J87j00L3j56K04Q6m4J00Pj38l5Q1r1J06Q0k21m3o4
5864a24m3L51l76J86J75r9l63j10M94j55J6k10L12l71K10PN8J59k1l8l61J63L84
5887B44p9k97j51M82j91l3L0n4J42j24j17N5R9n2K08k63M34r3n83N25P7l38K72
$$ plain form
5728 563 -123 -42 7 196 -138 -35 -23 154 200 -257 -303 -88 53 220 -187 63 -32 -151 -68 -205 303 149
5750 149 -3 -118 -128 -11 91 260 -10 -23 -40 24 260 -56 143 47 -41 145 -189 24 176 -5 -56 -213
5772 -213 -299 22 89 -94 158 173 137 114 126 19 -117 57 -146 -56 39 -37 -209 377 43 -47 298 21 -48 191
5796 191 -11 -73 137 -153 -51 -157 112 -347 -1 -64 9 92 31 -351 -50 -63 -8 -276 -217 47 251 -99 -168
5819 -168 215 -54 129 -35 -239 394 138 7 -11 -154 307 110 90 49 471 85 -275 -139 181 141 -83
5840 -83 -6 -153 241 65 -293 -116 71 -29 4 -152 52 138 94 194 201 63 28 109 18 124 204 -17 -60 -124
5864 -124 -167 184 -192 -6 169 70 -293 -403 91 -64 -48 -258 54 -317 -107 -100 -42 117 96 58 -303 -140 244
5887 244 165 -132 -283 199 8 -25 5 -49 93 -31 -148 -93 6 -46 162 -101 333 240 -343 182 259 -79 193
5910A93k01o5Q5O3k93j61L05J18k0l67L10P3L03m64k33M02J27j40j31K50j72M
5932a4k4k51N38j89j54oQ3o6J18r2R9j13l4J94l16K32k69M28k67O2N6j47Q6J06
5956F0k2K38j65j61J67j49j06L41J92n56K43j41R7lJ02k17k94M08j07k05J2L17
5978E1lK61m86k34J73O3P5L6mJ38k56J31J09K05k49j09r9J24k08K48K5J14J64
6001B69k56j45L03k50L45j4m57M9K23p8j14L66j07n3L7j50j08K10K20j34k06m2
6023i2m3R2J14j76J30m14N70j33k94K89k22K83m7j98K70r4K46l11OJ84k47Q5j25
6046a27M0J59J27J4j49L42n48n4K26K04j30j31j03K48q1O4j19KJ31k41K47j1j92
6069h2J14k03m8L30J4j62l1P0J73j31J50j97K40K5l13j0J67lj26lo1M26p1n2l73
$$ plain form
5910 193 -8 -73 12 75 -218 -379 -74 44 24 -343 -33 40 343 -121 -354 48 175 35 -96 154 -18 -14
5932 -14 -38 -289 249 60 -94 -100 -17 -83 35 -57 42 -71 -105 89 -227 5 -264 164 -103 -41 15 -132 -46 60
5956 60 38 276 111 -50 117 -32 -138 203 395 -161 82 -59 38 35 137 -80 -374 34 -73 -278 -266 51
5978 51 48 309 -177 -411 -238 -175 -100 -64 -68 70 -186 -55 54 259 10 -99 -198 -74 -282 -34 -9 105 269
6001 269 13 -132 171 -79 266 252 -205 -156 67 -11 -125 241 134 81 118 -32 -140 70 290 156 -50 -92
6023 -92 -135 -43 71 -105 25 -389 181 48 -246 43 -179 104 57 -141 129 35 281 -30 -24 160 -87 -2 -127
6046 -127 -87 72 199 213 64 406 -142 -196 30 234 104 -27 -130 118 37 101 -18 -16 115 -126 121 110 -82
6069 -82 32 -171 -219 111 125 -37 -68 2 175 44 194 -3 237 262 -51 -61 106 103 -23 -26 -87 339 268 216 -157
6094a57M76j52l95L23j44K24l11jL95k57K98k66k96N3K96j76J07q9J61M3j39k73
6116b80N22J26n03j65P1M79k17J61l50K40L30m66R6R0p1k96j10J46J67K07m80
6137c03L14K1j35R3J3L37m53K35m23K18K94L4n47j93L64M41m17l73K16J51P7j85
6159b21L2K99k05k6N5o9J00k2K6l68N24k0n3l08J47JL5j5R0j7j02J7k0J76K57
6184C13k72j38J68M1j9l23K46j40pJ17K4K19j73J04o1m4K6L5j6l06Q3P6j59K42
6208C6J79o2l92L39l4K04J8k31j92M5J34l03K89j22J26k07J54j08J76k2k48p3
6230b94J67J9J75k16k7J08N3K11m67M34k00m3K18j29M68l77P7j88o0L70k41O2
6252A20k49K73k17N7j93M19m5k88R8j90N24k30j3l5J6p4J65J44n14K3J95k49K80
$$ plain form
6094 -157 319 167 -228 95 -49 175 -136 -137 258 1 299 33 -263 -210 86 -90 17 -72 89 132 -7 -280
6116 -280 242 368 -135 -300 -229 250 33 194 -156 84 414 -52 44 134 63 -233 -343 -197 -30 177 -303
6137 -303 11 32 -103 -10 3 340 -113 122 -301 -83 211 245 -302 -495 -131 310 -107 -480 -264 -113 -36 -221
6159 -221 -189 110 -95 -121 -66 -135 -35 -57 -31 -399 125 105 52 -256 -109 -108 -73 -88 2 -15 -117 -100 -120 56 313
6184 313 41 -97 71 112 93 -230 16 -124 -131 -14 10 229 56 160 99 55 81 116 100 -206 -123 -47 -206 36
6208 36 215 153 -239 100 66 270 288 57 -135 -90 44 -259 30 -92 34 -173 -19 -127 49 27 -221 -294
6230 -294 -127 -108 67 -149 -176 -68 -15 196 -271 163 -37 -80 138 9 477 100 177 -11 -71 299 58 120
6252 120 -129 144 -73 -16 -209 210 165 -123 -25 -215 309 79 66 31 47 -27 138 282 -232 -209 -14 -263 17
6275A7Q9n8r9rR8Nm9J82l51K06K08l50j06L96k54J66r2L7K28j59J58l21K81l65
6299a42j61K52k2K50j77n34M35J89k0oj79J5K30J36l14k16L2M59l31J83j80J33
6321C2K19k28j9K32m59K01M4K50j96k49o1L19J60m3j78n5n2l6L07k35p2L1j60
6344b48K32q0K34p6o8M5j67M94n49K55klJ67j13o4K18j18P6q0k12N6O0k17r7N21
6369B64j36j50k08K5N20m98L42n24L38L41k49j80L2K35J33n27L10J65K9m39j3
6390a90J32L40k68j67J46k08J58K9j04L54P2k31l49L70K16l46k56L45J08j93J07
6411F5m34N63M6l35p3j69L94j00R2k26J78M76l86m2L8pK8o5n6J7J19o9k20L71
6435B05r0j05J53Oj36O85q13j09M02q7j49r1J66J43l59P5O0o7l9K9J41k22N43
$$ plain form
6275 17 106 48 -51 -60 38 43 -6 176 -175 31 239 -111 -217 179 -75 91 -1 36 264 105 263 -58 223 -142
6299 -142 -303 -51 -73 177 0 -534 -99 90 70 64 -115 -100 130 266 -48 -264 -232 227 -104 79 -101 32
6321 32 251 23 4 236 -223 -22 22 272 76 -173 -234 85 245 202 24 -31 -83 -119 188 -47 -119 -88 -248
6344 -248 -16 -96 138 62 -6 39 -128 366 -183 72 70 67 234 121 57 275 157 233 153 -59 -3 57 -160 -257 264
6369 264 128 -22 -230 -205 315 -183 159 -365 -27 314 65 -115 -83 152 285 -242 68 233 262 -177 -190
6390 -190 -58 282 14 -153 -7 -215 -57 -28 -132 222 294 63 -286 84 300 -46 -302 43 151 -42 65
6411 65 -369 194 240 -95 -168 -337 57 -43 49 -177 1 477 91 49 87 80 108 43 -13 4 123 54 -166 205
6435 205 115 10 163 169 33 718 -95 -204 198 111 -38 -129 37 180 -179 -104 -44 -111 -150 -121 20 -202 341
6458C41m28j1J68j93L99l89M1j33L13l35K90k55M88l15P5j40K59qm72N61j94R6
6480A58k00%k7Jj17M26o29M82J9p7k2j55J70l31N85l02J99j12r0j70K01j69N9
6503a01L5m2J80R5l94r0N6M67n0k85K90k83J73k7j65qM55k58k70J33J93r5l2J99
6527A76l95N5Kj6J61J8L3jj13J12K59j80k76N2K59k25j36J11O3J05j13r4P9j5
6551g9j07lk03P5N15J9m5o2n0J11q2k21l4M30j57j27Q3J77j61j64o0L13M8k72
6575e6n3Q3rp9J8k77L71k16K86J08k24J46k67p0M40j8m95J30Q0nJ61j50r8Q8J07
6600AJ38l35K93l89L10k3k99J93K36J22k84l33M25J76n29L99k66K23J7l40N26
6621B61k05j03K3K07rj15k20K26l35N1J03n3M37j6j96o4m7K24k2m59L29r3k13
$$ plain form
6458 341 -87 -98 70 -123 276 -113 -72 -205 108 -227 63 -192 296 -19 56 -84 175 167 -305 256 62 158
6480 158 -42 -42 -69 -68 -185 241 -388 94 113 36 14 -141 29 -302 283 -19 180 68 -22 -192 9 -160 -101
6503 -101 -66 -108 72 167 -227 -317 -261 206 156 -129 161 -122 51 24 -141 -149 306 48 -222 -89 104 9 -23 176
6527 176 -219 -164 -162 -178 -17 1 34 33 -80 32 291 111 -165 -113 146 -79 -215 -104 -41 64 -49 -143 -64 -79
6551 -79 -186 -189 -392 -317 198 217 172 110 60 171 89 -132 -166 264 107 -20 63 240 79 -85 -145 168 216 -56
6575 -56 -109 -26 -35 -114 -96 -373 -2 -218 68 176 -48 98 -169 -239 201 183 -312 -182 -102 -107 54 -96 -194 -106 1
6600 1 139 -196 97 -292 18 -5 -304 -111 125 247 -37 -370 55 231 -298 101 -165 58 75 -265 261
6621 261 56 -47 -24 183 174 59 -161 65 -270 -219 -116 -169 268 252 56 -8 -55 169 147 -312 17 -76 -289
6644b89L01k75L28K50l17p8J38NK2P2l51K15p3K39m40Q3L78k56k27Q1m8M19k85
6667a08J98l64J95L43m65L17m55L47j44j0L7L81m34j52N65p8Ol74M05k68K14r4
6689F2K0m58L68j89K12l97K57J71O7O1o02P74k12j45o1K01k9j05J22j18l9J34
6711I4l7j47j06K00n31P23k87J19Q1l01L20J25m25j37N52k33K42p1o68L66L99
6732B78j07m35J06k43N15j95j10K74n0L10m66j4L64l62k8K1K07m9K81l58j81J51
6754i1N54m47r7K65q7J51j25j98K90Q7m17J32k9L8o9LK46k38m4o1k7l4J31K75
6778B08n94N83J05m66jN0K14q9J60m38L2M44Pj64j58J92j05m5r2J57j24R6j34
6801a62M5m1L73m94M5L00J4m21K02J8J91m5l57K10L77l04j48K31q6O5J09j04Q4
$$ plain form
6644 -289 12 -263 65 315 -2 -80 58 63 85 157 -194 21 -52 187 -253 -170 208 -48 -275 -194 -242 177 -108
6667 -108 90 -274 -79 264 -201 116 -339 8 -136 -146 -109 272 -162 -314 251 173 179 -195 210 -58 156 62
6689 62 82 -376 -8 -197 15 -382 -125 46 113 174 -428 346 134 -11 -72 129 100 -5 117 -1 -40 94
6711 94 57 -90 -196 4 -527 196 -91 28 109 -192 128 253 -172 -309 243 10 252 181 -487 -121 278
6732 278 171 -264 -158 -401 114 -81 -191 83 33 343 -123 -137 227 -135 -163 -142 65 16 297 -61 -242 -91
6754 -91 463 16 -81 184 97 248 123 -75 215 302 -115 17 -12 26 -43 -40 206 -32 -76 -137 -164 -198 -67 208
6778 208 -386 197 302 -164 -165 -115 99 10 170 -268 -236 208 215 51 -107 85 -20 -65 -157 0 -124 -28 -162
6801 -162 -117 -158 215 -279 -234 66 80 -341 -139 -121 70 25 -332 -122 255 -49 -197 34 -52 13 122 18 102
6824A02l41M58r0K8j82j79M86o25K08M64k23k84K87j24L28j40k10Qj0M00m59K1
6846g7N20m03j15mK60P2j43k00j62N04j83r5P0j20J27j23j96O0L68j67J8j95L85
6869B01n6j21j02K56o4kk94L65k54K73l06L5j04P5J7l0J00l11M35K9o8j30P8Q5
6893A07m06L70J25k88K29p6o8L7j39K5k16M91l71J09J24N4l71M70l91K49K38l32
6915c0k81M92l99L00l8k9j92N08k71pJ0J75K8k38Q6O7j98O9n7l92M28j64L04k89
6939a18L24K0n27p3K54Q2K56j05j82nN9k29O1q6K06j66L9J98Q0J74m39L26l5J69
6963B83m20K9K22k14K9J6k19K79J78l52Q5K05K2M8j68j7L60j20k24j67J99R6j31
6986A9K2K0J62j60p7LK81j74k87LM50k19k93J81K96O9p4k72j46L5L87l58p0L40
$$ plain form
6824 102 -239 219 129 157 -25 -204 282 -343 -135 329 106 -178 109 -15 313 173 -37 -29 -39 361 -98 -77
6846 -77 443 40 -75 -79 181 253 110 -90 -252 252 69 -26 44 -76 51 -72 -268 -208 160 -7 11 -184 201
6869 201 145 24 -78 178 114 112 -182 183 -71 202 -104 -69 -173 -98 -81 -111 -11 -322 113 142 74 -56 22 107
6893 107 -299 71 196 -92 137 61 -7 30 -109 -84 -300 191 -180 -71 53 107 -264 206 -185 64 302 -30
6915 -30 -311 181 -218 82 44 15 -177 331 60 53 63 238 266 28 114 181 -17 52 -5 -397 31 -133 171 -118
6939 -118 206 226 -301 -374 -120 -38 218 113 -69 -74 -15 -244 -183 -269 -63 -229 -190 8 88 262 -177 149 114 283
6963 283 -137 -108 114 -100 -71 -55 -274 5 183 -169 -84 121 143 191 23 6 366 246 22 -145 54 150 19
6986 19 41 61 223 63 -14 -11 270 96 -191 -188 262 43 -250 -69 227 296 222 -50 -196 -161 226 -132 -202 138
7010A38k48k13K92J9j12J71N9r4N2J97l9l98K86j8j76j59M68k85%J2N6l6J57j02
7034B7l04J13K56r0J95k36J51K80l50k89J37L14q5o4l78K65K01m0p0k32L9n6J42
7057g4J80n3L81l15l00J66M8L5k3k22m6L92l41j44M35j4J8n86M60M9K3J29n6j42
7081@Q5Kk41J81J60k16Q4o8K09j14l9jJ44j86J10j66l5J07K30j25k25J75L06l96
7105a9j7j07K07O10m65k14l8J25l4m9J03J27J22j29l92J97K80k34m43R7M67k18
7127b4P3n3J37J55k93J63k91L26k58j09L77p6L1j62J11k4J57k62r9N0m7K93j2
7150A63j12r3j17L53l39j30K07L16k24R6K55n68LK0k8K61k17N4m8L25k79P0J55
7173A23j80M01l25N7k06J47J94k37kK33j22j08J68k82K63p0k03R2L4J00O2l68
$$ plain form
7010 138 -110 -323 -31 -12 -124 47 106 12 64 261 222 -176 110 92 -84 -243 225 -60 -60 -48 8 -28 129 27
7034 27 -277 -164 92 2 197 -39 112 392 42 -247 -110 204 119 55 -323 -58 143 103 33 -199 -160 -216 -74
7057 -74 106 53 434 119 -181 -15 33 68 45 -177 -223 169 -172 -316 119 105 123 -463 -3 46 69 198 142 0
7081 0 85 87 -154 27 187 -29 55 -13 196 82 43 42 186 0 110 -56 -91 16 246 121 -104 71 377 -19
7105 -19 -36 -143 64 674 209 -5 -43 82 48 -1 102 229 351 222 -170 27 307 73 -370 -273 194 -24
7127 -24 49 -4 133 288 -5 158 -133 193 -65 -174 203 127 158 -4 107 83 240 -22 -121 -71 -118 175 163
7150 163 51 -42 -159 194 -145 -275 -68 248 24 120 375 -193 -190 -170 -198 63 -154 -100 -148 177 -102 -32 123
7173 123 -57 344 19 76 -130 17 211 -26 -28 205 83 -25 143 -139 124 54 -149 -57 -23 77 139 -229
7195b29m2K43l62K31J82J89j1l7k12k0L73m64j14M35j23o4m5r6L5K51l9j59o8
7218a46L2q7k1K64k59L58l66j21M13n4J05m08Q1L96j96J04r8r8L48k66N3l31M09
7241A12j69k64K55N2j44M39k53j80J33j06M2p5M10k50K41j58J25n13J96M63n61
7262b05N12j56l16N5q7J88L1n2k23L39K0o02L86K61j06j05JJ54p3lNr1J18j29
7286g8M7l04M45J73q2k77m0K26j29l31Q4K79K65j38n8j1K85k93k02L01l76L23
7308A09o2k01J24n6J06j42K51k31K84l82M28k80L65k6l81Rjm8J01P1k40L03j92
7331i1K64k70L10j24j43m9O0J39p1J71k89J0J61K2j47j90K58J20j0k37L12l4j65
7354Gq9j8M6J07j44J44o8m98M60M4Q9m9q7PO6J15l7j96O8J11M3j86J39m32N46
$$ plain form
7195 -229 -271 -28 -390 -159 23 212 201 164 -48 -68 305 -159 -273 162 39 -25 -70 -166 -131 120 81 -78 -146
7218 -146 -114 -201 -222 42 -217 141 -225 -346 67 13 118 -290 -209 187 -9 95 -3 -101 247 -19 34 -297 112
7241 112 -57 -321 -66 -14 -158 281 28 -152 -19 -125 -83 -158 252 2 243 85 210 -303 -107 356 -205
7262 -205 307 151 -165 -110 -197 -9 22 -30 -253 86 106 -496 -110 151 45 -60 -59 95 22 19 24 -67 51 -78
7286 -78 -31 -335 110 283 201 -76 -116 110 -19 -350 -266 13 278 140 82 71 356 63 -139 162 -214 109
7308 109 47 -154 -30 -86 20 -122 129 -102 182 -200 228 -52 313 287 -94 -85 -86 -134 -33 38 -202 101 -91
7331 -91 173 -97 213 89 -54 -103 -43 96 25 196 -93 -83 78 100 -47 -237 21 141 131 -106 206 172 7
7354 7 -82 -100 -54 53 -91 53 -15 -513 -53 -9 80 31 -56 -49 17 132 95 -101 -33 78 121 -65 74 -358 188
7379A88j16o4k12M29K92o34M31j26l22k4M4J48j90k1N0k4J86Nj23j10J55R0j55
7402a03j28K5L51l41J80j12k20M29J38k33L2J39j97k23K7K99j08j1k01L04P3r5
7424B5J62l02J3J92K27n03R7M4K31j10j73J28K46k6n26L16K31j05k51K55k36K21
7446A56j88K2K39m9k1n4j73J79k85J09J37L4l85K56P6j33M90n73J34l9J84O7k92
7469a09L01N6l37L5P2L23p6k39j89M10k01J4k51j43J47K39k4J76l47J43j0K68
7491B58k61j06J58l25l4L20N5J24l88K27n0K4o9j99M46k7l91M1M4M14k82j7OK43
7515B11k92J49l31J14L13l48Q9O0M28j86l97K3M9K42j3l34L20m5lLj43J68r2J17
7539A02k57K1m6J13J69j93K21R0k00j31J80O3J6j24o5p9K61l76J97Q0o3j89j16
$$ plain form
7379 188 72 8 -204 225 517 -117 314 188 -134 -158 -114 34 -156 -177 -127 -151 35 40 -83 -193 -38 52 -103
7402 -103 -231 -206 145 -196 -16 -128 -348 81 219 -14 18 157 -40 -263 -236 63 -45 -56 -257 47 120 25
7424 25 187 -115 -102 90 317 -186 -89 -45 186 76 -97 31 277 251 -275 41 272 167 -84 171 -65 156
7446 156 -32 -10 229 180 159 105 -68 111 -174 -65 72 106 -279 -23 53 -80 410 -163 -29 -68 116 183 -109
7469 -109 192 248 -89 -54 18 341 265 26 -163 247 46 60 -191 -334 -187 52 28 204 -143 0 -10 258
7491 258 -3 -109 49 -276 -310 10 65 189 -199 28 -22 2 -67 -266 180 153 -238 -197 -153 261 -21 -38 -32 211
7515 211 -81 68 -263 -149 164 -184 -95 -35 393 207 -190 -167 -118 124 111 -223 97 52 49 52 -91 77 -15 102
7539 102 -155 -134 -180 -67 102 -91 130 220 20 -111 69 132 148 24 -41 -120 141 -235 -38 42 -21 -210 -326
7562c26L57m82K93J27O0k51J20K48r3R1J1l22J63o7K30k75J70k75O8L61j35j76
7584a03M17m96K41K43o04N07m2k09j22R0L71k91N8k79J0J57Km9K70j91O3%l10
7607b67K52J20j16J79j40l4L98n70L01j28L8J00l13K00rN0M4m5p1J37k62K77r3
7630D8r2M09l99LM2K25q0k19J35r9K5R7k56K8L25k49j6J88P2k50J10K13qK40k32
7655B60j71P8J7j14o4j63M62l15k16O00j63k98L4K85k39M0j31QJ07K50j65k04
7677a02J29Q3n4n0j01j01J09J6O3R2J24QJ2l24K43j6M5R7n00N20m48p3J35j5L35
7702B27k35K05m89M36J49m21p0K27R6k71K62j75k06L56n0j92J03nR0k55K93O3
7724A38J6l08m6M92K2l97J74J91j70j87r2K2M77m09k28K09K55j80l9J13k40L73
$$ plain form
7562 -326 31 -451 -158 -31 29 -222 -102 146 53 144 155 -167 -4 -71 159 -116 54 -221 -153 208 73 -103
7584 -103 314 -182 59 302 -302 205 163 -46 -168 -78 293 2 60 -219 -209 -52 -50 -99 171 -20 43 43 -267
7607 -267 -15 105 -11 168 28 -6 392 -178 123 -5 33 133 -180 20 11 61 105 60 -11 126 -136 141 48
7630 48 -44 365 -34 -31 11 236 156 -63 72 -27 -2 95 -161 -133 192 -57 -73 115 187 -63 47 260 252 492 260
7655 260 89 167 184 70 6 -157 305 -10 -226 374 211 -87 -53 232 -7 33 -98 -90 17 267 102 -102
7677 -102 27 110 56 6 -95 -196 -87 -71 -8 84 208 216 228 -96 147 131 176 273 -227 293 -155 -228 -93 -108 227
7702 227 -8 197 -292 144 293 -128 -198 29 125 -146 116 -59 -265 91 41 -151 -48 -53 37 -218 75 138
7724 138 154 -154 -200 292 314 -83 91 282 112 -75 -167 -145 332 -77 -305 -96 159 -21 -60 53 -187 186
7746A86j89O5m9K46P2k73K4k76L27M7l19N52n6m67j7J82j62R5l2j58K66Q3p6l14
7770b43M39j11k7k3o0l2M25k00n53oJ01N34K6l76Q4L25k41j53L8n0J99r4k17J32
7794h3K03k98K12Kq7J86j57l07K54o4J72m8j03L02m16oL88J51k77j35L3Q3R5j97
7818i7M4J74J73m36J86J77k54J55j38J06k22J11R0O2j10J99l28L86k83O0J00k31
7840g6J88k05K61Rl10J34j0J34K25o29K36Mj9j36K06J99O5j32j37j68K83q6j83
7863a47J66O9P7j97m8K01k94J09K76l21m3M14k94P8k69K73K5j15j84q5L63p6r9
7886a21J10j19N3K18k33J6M76n09J91k16J00j44L28l73N40m96J6J50j10J28Q8
7907I3k4k66K06P5p3p9L97q0m63J90k0M1J25m10M48j78K33m25K47M1k10J9J0K22
$$ plain form
7746 186 -3 62 13 259 331 58 82 -194 133 180 -139 413 357 -110 -127 55 -107 -12 -44 -202 64 147 71 -243
7770 -243 196 85 58 35 -25 -57 368 168 -385 -391 -290 244 270 -106 -22 303 62 -91 -53 -103 96 2 -215 -83
7794 -83 120 -178 34 36 -51 135 -22 -329 -75 -139 33 -15 -118 184 -232 -238 150 301 24 -111 -78 5 100 -97
7818 -97 -53 121 294 -142 44 221 -33 122 -16 90 -132 -21 69 131 21 220 -108 278 -5 55 155 -76
7840 -76 112 -93 168 177 -133 1 -9 125 350 -279 -43 -39 -58 -194 12 211 276 144 7 -161 122 36 -147
7863 -147 19 88 165 -32 -80 121 -173 -64 212 -109 -152 262 -32 46 -223 50 75 -40 -224 -309 54 -22 -121
7886 -121 -11 -130 -77 141 -92 -76 400 -109 82 -134 -34 -178 150 -223 317 -179 -163 -13 -123 5 93
7907 93 69 -197 9 84 11 -68 329 249 -214 -24 -44 -3 122 -288 160 -18 215 -210 37 78 -132 -113 -103 119
7931A19N0k21PJ80O7l17o0K21J15j73q4N4L09k46l9L91k43q1K56k56j07R3K53
7954B88J5l93P0n4L3j84o7N03q9l44J87r2K15j08j28J43j08O9j97J02K84j38K0
7977B7K52l16J75j14q8j2J31k52L48m6n02L54K05k10j83N09k05j97l66N06M36
7998D52m56j7o1K97k0q5k19J84K8r0j20R6P1J35K14n25L19j67l9m06K21O5K78
8021A55l31J57QK95l69k20P5K68L16l86L40m08K98k23o6Q3J42K9l94J55M0J44
8043A08j88J61K60l96J23k24M03r1j63j31N8J27j21nJ84pK00j05j70J06l0J57
8065B56m14M2L39k57K9k70M18N8K35o30L98m1l30o8J14m9L51j81l69J32M40k72
8087f9K4L8N6K12j36k6l62K74j38j7jL62K36j10n34L81N6k34j59q4N99r0l16q9
$$ plain form
7931 119 169 -52 -45 135 202 -115 -175 46 161 -12 -96 -42 267 21 -18 373 130 49 305 49 -58 35 288
7954 288 303 -90 -20 -74 -41 -225 -292 211 122 -222 -35 -127 88 -20 -148 -5 -113 -44 -241 -139 145 7 27
7977 27 279 -37 138 24 -64 -76 55 -197 151 105 -397 -43 162 -48 -231 278 73 -124 -490 16 452
7998 452 -4 -21 -82 215 195 110 -109 75 103 13 -107 -11 60 195 409 -116 203 36 -3 -409 -188 -123 155
8021 155 -176 -19 -11 284 -85 -305 -230 38 354 -32 308 -100 198 -25 -91 -8 134 163 -231 -76 -36 108
8043 108 -80 81 341 -55 68 -156 247 156 -7 -138 -80 47 -74 -79 105 98 298 193 23 129 99 256
8065 256 -158 -116 223 -34 -5 -275 143 201 436 -194 204 163 -167 -235 -121 -170 181 0 -369 -237 203 -69
8087 -69 -45 -7 49 261 125 99 -263 11 -127 -144 -145 217 453 343 -191 190 246 12 -147 -231 368 278 -38 -127
8111a27q0K1L47l07L64j32J61n0k39K54l19J59j31L5K30p3K0o6o7J63m10K10q
8134d5K3KQ9J11k36J37J00m33M53k48j08J06P6j69J30j59L9K10Q7o7l90qN43m38
8158a95L03p1n2L29l11K72l86m6M01j22m11R5J38L63j31l06J64q9K31k12K34r5
8180A03k9l69J38J08J26o6k01O7L49j01j29
$$ plain form
8111 -127 -207 -186 161 -146 218 86 247 197 -42 212 -107 52 -79 -44 186 113 133 67 0 163 -247 -37 -45
8134 -45 -22 -20 69 180 -56 81 181 -252 201 -47 -155 -49 27 -142 -12 -171 -132 78 165 98 -292 -300 243 -195
8158 -195 108 37 -15 314 3 275 -111 -157 244 122 -289 -194 -56 307 176 -130 34 -55 176 -36 198 103
8180 103 74 -295 -157 -49 77 11 -190 -123 226 125 -4
8191d
$$ Imaginary data points
##PAGE= N=2
##DATA TABLE= (X++(I..I)), XYDATA
0@%%%Qj6QqJ6k4L2l8M6n6P0q6J04j21J45j74K04k37K76l22L71m26M86n54O33p17
29c80Q08r12J025j146J282j433J596j774J973k192K427k687K979l299L650m043
45b126M487m985N552o205O960p849Q920j0233J1884j4038J6982k1265K8101m0762
59b4577P1974k86220n18818M53460M10835r6535k75094J79546K84747j25574m09367
70c35623o8693K86053K09061o1968o0871K9341j4865r3359K130P4982J912m1027
82g2927R5899J30221q8334k44800k5829K39165J15593j93336j43538J79642K06274
93A98030j35757k69216K8424K64931P4653j90137j08078J28371J11414q2874j11310
104i1549L5555R2370J6346k8316j3682k9412l2147L9617P2608k6264j00666L191
$$ plain form
0 0 0 0 0 8 -8 0 -8 8 -16 16 -22 24 -32 38 -48 56 -65 80 -94 110 -127 149 -173 198 -228 258 -296 337 -380
29 -380 428 -484 541 -605 677 -756 840 -934 1039 -1153 1274 -1413 1566 -1733 1917 -2126
45 -2126 2361 -2624 2928 -3277 3683 -4166 4754 -5479 6405 -7633 9349 -11916 16185 -24577
59 -24577 47397 -238823 -757641 -304181 106654 10119 -264975 -85429 199318 73744 -335623
70 -335623 -404316 -118263 90798 28830 -32041 -2700 -17565 -110924 -108794 -33812 -31900 -72927
82 -72927 22972 153193 64859 -179941 -205770 33395 148988 -44348 -187886 -8244 198030
93 198030 62273 -206943 -178519 86412 161065 -29072 -137150 -8779 102635 19761 -91549
104 -91549 -55994 36376 52722 24406 10724 -18688 -50835 -11218 61390 35126 -65540 -62349
116f2349J28388M1565j31068r3631J03071J31715n6725j45265P379J36671L5114
127I4865j12353o5994P8154Q0240l8858p0266J3523M9575r073l3657J2128K2644
139B0928k0591j5161L9989K5992n2778m7081N3206P1598m0847r3897J2806R8619
151E2783J2234r5687l9411Q0227N9544n5902p0896K4747O4112j999n0908j3582
163c4738L3511K0887j0669r503L742J565K153R772K057j7348j3116J6517K4381
176B9211q445l2545o083L2542J9708k7440l1994J1599L2625j547l0824j0015K4097
189H89J9322j1234j7423K232J5280O710m519q422o837L169J2862L155j5749j1040
203a1605J4123J7740q581k3709l832J8937R671j6554j7980N740J9055O393j3310
$$ plain form
116 -62349 66039 107604 -23464 -117095 -14024 117691 60966 -84299 -76920 59751 94865
127 94865 -17488 -83482 -5328 74912 36054 -34212 -20689 28886 19813 -13844 -1716 20928
139 20928 337 -14824 25165 51157 -1621 -48702 4504 76102 35255 -58642 -45836 52783
151 52783 65017 -30670 -70081 10146 69690 13788 -57108 -32361 31751 29752 -21156 -34738
163 -34738 -1227 19660 8991 -512 3230 4795 6948 16720 18777 1429 -11687 4830 29211
176 29211 20766 -11779 -17862 14680 34388 6948 -25046 -13447 19178 17631 -13193 -23208 889
189 889 20211 8977 -8446 -6214 9066 15776 11257 2835 -4002 -833 12029 15184 -565 -11605
203 -11605 2518 20258 11677 -12032 -15864 3073 12744 -3810 -21790 -16050 3005 9398 -3912
216c912j1742P329J7035R11j8859r790J5441J6452p834j8688J192J8644P636j2490
230A325j1243O466J1518l089j2403k053J0242N871o777o773N064J0083k183r855
244c807N57Q486j901j2244r50J2128L580j2321m510J1734Q298j0126j1506P929
258d653J1800o033j4602J802J5210L442j0768m901R172P200o811r674K932R412
272C528l555j1755l3J2330L022j0643m065J1543O566j0615j0424R503J3630o064
286B968j5974L578J9153M929j5797o869J3402J2830r810j7421K084J6616L822
299A3511j7524j0442J3295J5441p045j7568N33J6603M226j6505j0790J2600J4036
312A0371o786j3857L270J5358K575j2087n403Q673O681p603q836L999R256k122
$$ plain form
216 -3912 -15654 -8325 8710 9621 -9238 -19028 -3587 12865 5031 -13657 -12465 6179 13815 1325
230 1325 -9918 -3452 8066 4977 -7426 -9479 763 6634 -143 -6916 -1852 8231 6048 -3807
244 -3807 -3250 5236 3335 -8909 -9859 2269 5849 -6472 -10982 752 9050 -1076 -12582 -4653
258 -4653 7147 1114 -13488 -11686 3524 6966 -3802 -8703 469 7669 858 -8816 -5884 3528
272 3528 -27 -11782 -11815 515 3537 -7106 -11171 372 6938 -3677 -14101 -4598 9032 2968
286 2968 -13006 -9428 9725 14654 -1143 -8012 5390 18220 8410 -9011 -6927 9689 13511
299 13511 -4013 -14455 -1160 14281 7236 -10332 -9799 6804 11030 -5475 -16265 -3665 10371
312 10371 3585 -10272 -7002 8356 10931 -1156 -6559 2114 8795 1192 -7644 -3645 5611 3489
326C489q527J255Q686O61p488k266O598K980p923n306P723P932n316q365M562
341a305J1762n05j1287m303J0479O821r468j1753O006J4700j38j5354m558J4321
355E418R795j1313j4675N353J6553r49j7979m631J6873J0873j2701j3796P489
368c690J4976l092j6153l438J3425O546j1389q440Q709J0479m639r803K368Q860
382D719o94p921r24P770J901p389j799Q090L984p709m938O717N627o085r166L126
398d691R724k20j0271k941J0420O732p311r389L939J0188j75j0298l756Q462P854
413H267n018r191K395R042J850q752n263M245O412k161p452r54O023L580l963
428i40m862J811M952R91m940k851K634M497r68l875L97L613J785j564k639M02
$$ plain form
326 3489 -5038 -3783 4903 5564 -1924 -4190 2408 5388 -2535 -7841 -118 7814 2498 -5867 -1305
341 -1305 10457 9952 -1335 -5638 4841 11662 2194 -9559 -3553 11147 11009 -4345 -8903 5418
355 5418 15213 3900 -10775 -5422 11131 10182 -7797 -12428 4445 15318 2617 -11179 -3690
368 -3690 11286 8194 -7959 -11397 2028 8574 -2815 -11255 -2546 7933 3294 -6509 -4141 4719
382 4719 4025 -3896 -4820 2950 4851 -2538 -4337 3753 7737 28 -4910 1807 7434 1349 -7817 -4691
398 -4691 5033 4813 -5458 -8399 2021 8753 1442 -7947 -4008 6180 6005 -4293 -8049 413 8267
413 8267 3249 -5942 -3547 5495 7345 -1407 -6670 -2425 3987 1826 -5626 -6580 -557 3023 -940
428 -940 -5802 -3991 961 1952 -2988 -5839 -3205 1292 324 -3551 -3154 459 2244 680 -1959 -1557
444a557K602q95k513q13K121J933j183o76J100J095k70j413k14J156m08j621N03
461a053K504J38k305m31K847J191l397k891K626L790k042o193K59P947K149p890
477b751m155P653P810o698j0634K787J2619L91j3717m575J3136R286r942j1982
491a0772N969J3774k243j3555l318J1245O579p928p938M947R109l26o726j889
505c072M549K641k053k477j96P92P52K051J136l313k984L567N300l753q139K53
521d946Q284L205q064n725N284Q036j166p655k338M539N488j222o253m028M583
536a978Q004J08j0155n013J0116J0668o168j5485n17J5850P165j4551j3351R927
550e380J7823j693j8472m298J5852J0441j1210j4664M104J4548K058j1543m769
$$ plain form
444 -1557 1045 150 -2363 -3176 -1055 878 -305 -981 119 1214 944 -469 -683 473 65 -1556 -1053
461 -1053 1451 1589 -716 -1147 1700 2891 -506 -3397 -771 3019 977 -5216 -4957 2990 5139 -2751
477 -2751 -6906 747 8557 1859 -8775 -5988 6631 7022 -6695 -11270 1866 11152 1210 -10772
491 -10772 -4803 8971 6728 -6827 -10145 1100 7679 -249 -8187 -3240 5869 5543 -1183 -3072
505 -3072 1477 4118 2065 -412 -608 184 936 2987 4123 810 -2174 1393 6693 2940 -5199 -4946
521 -4946 3338 6543 -1521 -7246 -1962 6074 4908 -2747 -5085 -546 4942 3720 -2533 -6561 -1978
536 -1978 6026 6134 -4021 -9034 1082 11750 5582 -9903 -10420 5430 12595 -1956 -15307 -5380
550 -5380 12443 10750 -7722 -12020 3832 14273 3063 -11601 -7497 7051 9109 -2434 -7203
563g203P593N901l094l678k71K93M0L397P72n783n016N806J0575k612j4478k138
579i896J4762Q581j2075j4334N558J6131J868j5913r169J1143J6174l399j7864
592h433n799J5220J2678r240j7512P07J8087P948j3975j2919P628J6804j09j5618
606d533q307J0799J2693l365j3633l750J1011Q226n536r500K52P777L846m232
620A748n596j460M603N736L19p572o525O280J2599j206j5154m799J3309J0677
634A2959j0425j4996M261J6457L227j3860j0192Q451J3444p71j2620q058P761
647d362J2816r84j3429o351J2299J2378o810j6039j87J5548P473j1383j3514N152
661g393J5309K733j2987p813Q726J0521l554j1400j517R077N266n514n085J120
$$ plain form
563 -7203 390 6291 3197 -481 -752 -459 -419 2978 3750 -2033 -7049 -1243 9332 6720 -7758 -9896
579 -9896 4866 13447 1372 -12962 -7404 8727 10595 -5318 -14487 -3344 12830 9431 -8433
592 -8433 -14232 988 13666 4426 -13086 -12379 5708 13656 -319 -13238 -5610 11194 11085 -4533
606 -4533 -12840 -2041 10652 7287 -6346 -10096 915 9141 3605 -5895 -5643 2134 5980 1748
620 1748 -3848 -5308 -705 5031 5350 -2222 -8747 -2467 10132 8926 -6228 -11027 2282 12959
634 12959 2534 -12462 -8201 8256 11483 -2377 -12569 -4118 9326 8555 -4065 -12123 -4362
647 -4362 8454 7470 -5959 -12310 -11 12367 5557 -10482 -10669 4879 12352 969 -12545 -7393
661 -7393 7916 10649 -2338 -10151 -1425 9096 5542 -5858 -7375 1702 6968 1454 -3631 -2511
675b511K426J748K604j146p076k358R434O617r457j1784P220J6306k300j9371
689i648l762J9257J0692j5503j5547Q153J6575j105j5885m365J2975Q850p658
702C029j1400K431J1050K340q506o109L835O572K01m303k114J738L598L79k507
717B34l690J054N663J820o522m943N842P640l416p840J437P326k56o504j202N976
733B619J847n655k407M207K632l162j660K886J176l296k523L263K960j986m111
748c210J310M401n9m972k7N216J779o484m190O133N647m665p317L776R066k454
764C950j0505R89J1846K030j2259n973J0861Q231p922r567N249J1304k605j1114
778e485o91J0689L384q214o412M907O649j635o079l72N307K193l912l620K482
$$ plain form
675 -2511 -85 1663 4267 3121 -3955 -6313 3121 9738 281 -11503 -4283 12023 9723 -9648
689 -9648 -13410 5847 16539 1036 -14511 -6358 10217 9112 -6773 -11138 1837 10687 3029
702 3029 -8371 -5940 5110 7450 -1056 -7165 -3330 3242 3443 -860 -2974 -1236 2362 2741 234
717 234 -3456 -2402 3261 5081 -1441 -6384 -542 7098 3682 -4158 -2721 4605 4349 -2155 -3357 2619
733 2619 4466 -1189 -3596 611 3243 81 -1579 1307 2483 -813 -3336 -73 2887 901 -3210
748 -3210 -1900 2501 2442 -2530 -2557 2659 4438 -2046 -6236 -103 5544 879 -6438 -2662 6404 3950
764 3950 -6555 -5566 6280 8310 -3949 -9922 939 9170 1248 -8319 -3070 8234 5629 -5485
778 -5485 -6176 4513 7897 -317 -6729 -1822 4827 3192 -2887 -3259 2048 4241 329 -3291 -809
793h09K986r21k517q7Q81P7O61R66k40k248l61K322L40k754m04L183O74l258j386
812b895K727K482j918j530J228M3k039P42L095q10l635j25N025P51n263j284N428
829B022K912n255m898L940N397j560n816k75N687K125m595m202M221N368k842
844B229o734O55O659J125o249j906O402K411n651m130N227M979m208n734K382
859b543N407p48m817r7M341J317l659k452K180L706p86l763j576L449L230k209
875I80l838J209M625l16m745j263M298K273l572k326J958L158r96l148O60K637
891A594P73k970j570J831K265m63k767j55L032O17l465q06L280K200l307l746
907c657K353M152j391l843J45L870M99l361j507K774K161k268j942L88K439L27
$$ plain form
793 -809 2177 1256 -1261 -1348 -467 -390 271 1237 997 -1251 -1612 710 1050 -1704 -2108 1075 1749 -1509 -2895
812 -2895 -168 2314 396 -1134 94 137 -1902 -1160 1935 1125 -2510 -2635 2390 3141 -2122 -3406 2022
829 2022 4934 -321 -5219 -1279 4118 2558 -3258 -3533 2154 4279 -316 -4518 -297 5071 2229
844 2229 -4505 -3850 2809 3934 -2315 -4221 2181 4592 -1059 -5189 38 5017 809 -4925 -2543
859 -2543 2864 2116 -2701 -2798 1543 2860 -799 -3251 -1071 2635 1849 -1914 -3490 -41 3189 980
875 980 -2858 -1649 2976 2660 -2085 -3348 950 3223 -349 -2675 -717 2441 1445 -1703 -1043 1594
891 1594 2367 -603 -2173 -342 1923 1460 -1307 -1462 1570 2187 -1278 -2084 1196 3396 89 -3657
907 -3657 -1304 2848 1457 -2386 -2241 1629 2128 -1233 -2740 34 2195 -73 -2015 -1627 812 1139
923A139j607r04J768J229j864j635J472K319q96k467k10K945O47k581j594L051
939H12K715k410m379J653M464M28m791j893L898L459k150m949O68N230J231m764
955g78m005M035N091j807n488o86N431J959l948m049L304M083j522l947m34L398
971F37J636k104j817J120J779p14j084J76N93j97r06K73J394m20j355K65J820
988A096M74k171j601K483K560k164l531R11M313R24m133k516L814L174j924m352
1004b643l4M615J638m173k765K200L763k76m272o98L488K472l025k881Q14L252
1020A475J25k896j066K556J349j284j339Q38J333j159p58O20Q69p06r06O01J471
1037A123j15j678l57K268J024k656j794J706K827n85l236p89L351K177k902l220
$$ plain form
923 1139 -468 -1372 396 1625 -239 -1874 -402 1917 1021 -1446 -1656 1289 1936 -645 -2239 812
939 812 3527 1117 -3262 -1609 2855 3283 -1508 -3401 497 3956 1806 -3143 -2475 2755 3986 -778
955 -778 -4783 -748 4343 2536 -2952 -3638 1793 3752 -196 -4245 -941 3142 1620 -2327 -2761 637
971 637 2273 169 -1648 -528 1251 537 -547 -371 222 25 -881 -608 786 366 -989 -724 1096
988 1096 1570 -601 -2202 281 2841 677 -2854 -1943 2370 3294 -839 -3355 459 3633 1709 -2643
1004 -2643 -2677 1938 3576 -597 -3362 -1162 2601 2325 -1947 -2645 843 3315 290 -2591 -1777 1475
1020 1475 1600 -1296 -2362 194 1543 259 -1080 -242 1091 -68 -826 -206 663 -43 -949 -348 1123
1037 1123 1008 -670 -1027 1241 2265 -391 -2185 -479 2348 1763 -1473 -2262 1089 3266 364 -2856
1053b856J407L984j47l758j603L352K864k077l961P38M679M10m385j772L456K812
1069C143k320m017J347M033J74l880j052L332K300l404k570K398K836j652k662
1084a994M12L082M24l203q00K893J537k638k213K032K515q23l085L25L322N37
1100B323l143j514K544K372j957k954J233L207Q8l937q04L476K169l057l053K237
1116g70L696j328m134J18M110J425l925k368K749L668j921m018L08M300N48l540
1132a082j793K874K570j753k554J99K895M09k189j062J519J199o67j470N92Q08
1148D95M29j023l02M33N93n26q46P40O46j88j403N22J599k21j562l72J497J560
1166B071j996k580J399L113M32m197j182L814K470k868l938J528M955J39n398
$$ plain form
1053 -2856 -1449 2535 2388 -1370 -2973 379 3243 1166 -2795 -2057 2622 3032 -1353 -3125 331 3143
1069 3143 823 -3194 -1847 2186 2360 -1520 -2572 760 3060 -344 -2914 -516 2320 668 -1994
1084 -1994 -1582 1500 1924 -1279 -2079 814 2351 -287 -2500 -468 2047 1224 -1861 -1536 1786 2323
1100 2323 -820 -2334 210 2582 625 -2329 -1096 2111 2199 -1738 -2542 934 3103 46 -3007 -770
1116 -770 2926 1598 -2536 -2418 1692 3117 -808 -3176 -427 3241 1320 -2698 -2390 1910 2458 -1082
1132 -1082 -2875 -1 2569 816 -1738 -1539 1356 1765 -424 -1486 33 1232 565 -905 -313 495
1148 495 924 -99 -401 32 625 99 -747 -7 639 451 -952 -430 1169 948 -614 -986 511 2071
1166 2071 75 -2505 -1106 2007 2439 -1758 -2940 874 3344 476 -3462 -1934 3021 3160 -2238
1181b238j650M623L543m155m057K034N028k60n191j195M628K253l557k929K549
1196e74K958j935k424Q39K666n41k233K30K340j03k464J30K248M59k615j081K607
1213E07K167k348k652J420L376m86l473o44K736J738j882k657P05K963Q5j908
1229c53j608R21K630j34j916j422J612K211m27l077j107L360J858k373k852J503
1245a174L703n50l907j22L162R85k833j564K231K234j938k255J330K378r66k270
1261a556K53K910J07k587j275K666K027k657k701K351L282j655l722N47L957R16
1277B863m277j451L734J707k774k522K148K941j280k953K91K808O81k493j272
1292a849J581J637p12j932R8K260L77j955q30J116J690p07j819j17K094O01j972
$$ plain form
1181 -2238 -3888 735 4278 123 -3934 -1900 3128 2868 -2323 -3518 1110 3363 -194 -3123 -574
1196 -574 2384 449 -1975 -1136 1530 989 -1244 -1014 1326 1223 -1241 -1111 1137 1596 -1019 -2100 507
1213 507 2674 326 -2326 -906 2470 1984 -1489 -2133 603 2341 459 -2198 -1493 1470 1555 -353
1229 -353 -1961 -1040 1590 1456 -460 -1882 -270 1941 1514 -1563 -2670 690 2548 175 -2677 -1174
1245 -1174 2529 1979 -1928 -2050 1112 2097 -736 -2300 -69 2165 227 -2028 -698 1680 714 -1556
1261 -1556 -1303 1607 1714 -873 -2148 518 2545 -112 -2813 -462 2820 1165 -2557 -2010 1947 2863
1277 2863 -1414 -2865 869 2576 -198 -2720 -572 2369 1089 -1864 -1573 1235 1916 -577 -1849
1292 -1849 -268 1369 657 -1275 -1177 1083 1460 -495 -1325 -209 1481 774 -1045 -1162 932 1533 -439
1309d39j015J137J762p66j629l04J614J348j752j549Q69K066m2k477l88K484J533
1326B452k829j993J996K798j611l054R39K801q7l114M63K418M23k079j332J987
1342A78J563j418k171J451K377p56k488p62K827J363k042k874J779L016o04l020
1358a581m28L397J147l188j985K353K533j192k870M57K446O3j545j154J544J327
1374A324q28j555J55J034J305j687p95J140R12q28j853J145K241r60k373K35K418
1391A030M07k253j054K200J754k216k056J350K858p32k535p24K658J330j453k206
1407a642N49K351L07k411j506K487K482j639l211Q75K955j9k734n81K494P74j826
1424b95j363J304J814r88j365J3J262M66j064q62J365R10p72j745J83K421N56
$$ plain form
1309 -439 -1454 -317 1445 679 -950 -1254 360 1708 -44 -1593 -724 1342 1300 -1177 -1565 919 2452
1326 2452 -377 -2370 -374 2424 813 -2241 -1302 1499 1412 -1702 -1239 1179 1602 -477 -1809 178
1342 178 1741 323 -1848 -397 1980 1224 -1264 -2026 801 2164 122 -2752 -973 2043 1439 -1581
1358 -1581 -2009 1388 2535 -653 -2638 -285 2248 1056 -1814 -1357 1089 1152 -393 -1547 -3 1324
1374 1324 496 -1059 -904 130 1435 -252 -1047 93 1005 177 -1676 -531 1710 750 -1623 -1388 1030
1391 1030 1437 -816 -1870 330 2084 -132 -2188 -838 2020 1288 -1247 -1971 687 2017 564 -1642
1407 -1642 -1093 1258 1565 -846 -2352 135 2617 978 -2233 -1358 1597 1578 -1156 -1737 757 1531 -295
1424 -295 -1658 -354 1460 472 -893 -880 382 848 -216 -1078 287 1197 425 -1320 -1137 1284 1840
1441A840k727p67K153J174j766k097J741K306r71k850K08K836R53k341j313J385
1457b36J287o58j237l15J839N51j367j344P77K003p05j544L27J722j90j945q81
1474a916K789J084k451j354J810J800j248j793N63K150r7k074q10J754J682j125
1490G64k334M18J915J364k664k200K274K682j554k771N43L466K50l124j057K375
1506C47J479j839j406J223J316m30j186m54J150O10n60q22M82P46o12p78P48J089
1524A103n36j962K49K024O26j884j430K324J477j797k035Q77K477p2k351r83J978
1541H5J563r75j839k95J775J357j609j960R89K486N26k933j261K268J812j542
1557D47k167Q64K047p8k131p4J573O74j199j011R35O91m67m59L53Q89m76j267
$$ plain form
1441 1840 -887 -1654 499 1673 -93 -2190 -449 1857 886 -1964 -1756 1080 2033 -308 -1621 -236
1457 -236 1051 393 -844 -1159 680 1231 -136 -1480 -703 1300 595 -949 -622 1100 910 -1035 -1916
1474 -1916 873 1957 -494 -1848 -38 1762 514 -1279 -716 1434 1337 -737 -1547 207 1889 764
1490 764 -1570 -1152 763 2127 -537 -2737 -463 2219 665 -2106 -1563 1903 2153 -971 -2028 347
1506 347 1826 -13 -1419 -196 1120 690 -496 -950 200 810 250 -572 -90 656 44 -734 14 1103
1524 1103 567 -1395 -1146 878 1504 -380 -1810 514 1991 194 -1841 -964 1513 1441 -910 -1893 85
1541 85 1648 673 -1166 -1461 314 1671 62 -1898 -909 1577 2103 -830 -2091 177 1989 447
1557 447 -1720 -856 1191 1113 -1018 -1092 481 1155 -44 -1055 -120 571 104 -355 -2 887 411 -856
1575h56K72J590J07k103m85K112J051j728k124J377L147q73l508j4L391R80l066
1592g30j920K274K689j065l153N6K978J010k258j833J641J854m14j944n26J856
1608E15R52j169j486P16J322m7j522k09J404K57n80r29O51N60m88l48K44N94k10
1627B27o81q7O80P56r85j072R09J647p20k032k13K652M37j966j751J942K460j408
1645G95k985Q62L060J18l328n33K512J952k082k150P49K691k92k518n99K571J038
1662A861k066j579J420K178j068k440M78K716m0k482l39J638J509k231j491J885
1678e1J704j010k216Q22J935J21k142o66J745J153j137j975Q02J994k4j801n06
1695a252J714R66j527j540J107K158o20k387J19J802P57j871r51J330J694q12
$$ plain form
1575 -856 -584 1006 1113 -990 -1475 637 1688 -40 -2164 -787 2360 1487 -2021 -2035 1356 2336 -730
1592 -730 -2650 -376 2313 1248 -1905 -1849 1129 2139 -119 -1952 -311 1543 1129 -815 -1341 515
1608 515 1467 298 -1188 -472 850 803 -719 -928 476 733 153 -776 -125 435 -53 -401 -157 437 227
1627 227 -454 -541 139 895 -90 -1162 -253 1394 674 -1358 -1571 1081 1518 -448 -2199 -257 2203 795
1645 795 -2190 -1328 1732 1850 -1478 -2011 501 2453 371 -1779 -1030 1661 1369 -1149 -1748 823 1861
1662 1861 -205 -1784 -364 1814 746 -1694 -1216 1500 1460 -1022 -1361 277 1786 -445 -1936 -51
1678 -51 1653 643 -1573 -751 1184 1305 -837 -1503 242 1395 258 -1717 -915 1079 1055 -746 -1252
1695 -1252 462 1428 -99 -1639 -532 1626 1006 -1381 -1262 540 1297 -574 -1525 -195 1499 687
1711F87j655J19J396M35j126r13P89J189l60j529K54J408L83j751k95J023J098
1728A152j276q91O20J906n87j933L52J360L00r79q08O33J081p62j119L81J543
1745I73q7j354m61J330O79r78j001M24J360l55j395J03J211N82r74j167Q48J061
1763G99m31j412L67R77M38o77o61M11O52jj111M46K96L71o84o75Q93N60j78q25
1783d45L6K79O42n17m22L47L48l9n78j50M84N35m28k69k00J043l26q06j99J107
1803D42L28p60p21Q38M26J8j110r6R42L84p85o28J087M42n48j189O31Q63k5p33
1823a94p72J124Q68r22j085P18J371p48j253j60J566N11j524r20J206J602j026
1840C62j528M58J690J42j463j044J505J242j224j393M56J896O6k027p39J711J139
$$ plain form
1711 687 -968 -849 547 982 -144 -1057 -268 921 561 -968 -714 694 1077 -674 -969 54 1152
1728 1152 -124 -1015 -395 1511 924 -1009 -657 703 1003 24 -784 -151 930 168 -951 -570 973
1745 973 886 -468 -929 401 1080 102 -899 -475 885 530 -865 -762 449 1031 57 -1110 -262 799
1763 799 368 -1044 -677 300 738 61 -600 -189 463 462 -649 -203 93 464 -220 -895 -2 558 380 -445
1783 -445 -409 -130 512 -5 -427 -80 268 229 -349 -499 -15 520 92 -177 -377 666 340 -466 -665 442
1803 442 770 10 -711 127 553 571 -539 -635 307 691 -94 -722 365 807 259 -930 -299 564 539 -194
1823 -194 -966 158 1026 104 -981 -263 1108 360 -893 -1053 513 1024 -500 -1420 -214 1388 362
1840 362 -1166 -708 982 1124 -339 -1383 122 1364 140 -1253 -797 1099 1165 -862 -1601 110 1249
1857A249j154j516R44J766l84k148N0J946N21j595j009J297J339n89k168P72J726
1874A047J12k145m13K072J136k216j207J717J674j109k462Q40K357N9k641r11
1890b090K439J894j667k846J234K858l38k828l50K429Q47j881j818J800J730o90
1906G23j968K34K153N5j689p70J595P70r57j702J196J245k69j844L62J774K31
1923A139j684q24J686J191j128j920P33K161J16k472m45J741J866j833k104J150
1939f27K539n18k641p85K920J153j991k022R66L149o99k860l0K347Q98k274r80
1956a455J684J266j213j592N95K149n88j911K77J914m2j966l39J370J420j383
1972A86k003J470J709m79k190K88J910N91k056j073J481J562o16k129L5J995P59
$$ plain form
1857 1249 95 -1421 -477 1289 905 -1243 -1193 753 1274 -321 -1330 -33 1306 717 -1451 -679 1047
1874 1047 1159 -986 -1399 673 1809 -407 -1614 103 1777 668 -1794 -954 1403 1462 -1179 -2090
1890 -2090 349 2243 576 -2270 -1036 1822 1484 -1344 -1694 735 1582 -299 -2117 -317 1413 723
1906 723 -1245 -1011 1142 1197 -492 -1262 333 1103 146 -1556 -360 885 616 -1228 -866 908 1139
1923 1139 -545 -1369 317 1508 380 -1540 -807 1354 1470 -1002 -1447 294 2160 327 -1777 -627
1939 -627 1912 1394 -1247 -2032 888 2041 50 -1972 -1006 2143 1444 -1416 -1446 901 1799 -475 -1455
1956 -1455 229 1495 282 -1310 -715 1434 846 -1065 -788 1126 1084 -882 -1221 149 1569 186
1972 186 -1817 -347 1362 883 -1307 -1019 891 1482 -574 -1647 -166 1396 780 -1349 -1314 681 1440
1989A440k010q79J554J213r43r01K50R47lp91l98L60P42m49o06J51N57J00q42
2008e08K92L51J21l08j99M74L22o79l46O51P24p14p87qJ312Q3j202J33L73P59
2028H44o49o35P6Q48L66j116k86L33O74O2p02l76L08R23l24q16P4P18j25p7l51
2049b31M2Q8N49k05m41k88M44O65o77o01N66N19N4q47j77O64j8J91o42M93J51
2070B99k13n78M50M48l82j31j63K67L06l83l63N98N98q79p70M93J390l93j894
2089a300L65J829K81j390r37J333J024r63j426O01J592n34j332k7J126P96j003
2106C5q42L95J225k05j009m84R40R38p00j070Q99O31n76q22O7J511j09j823J28
2125h71J346M49j061q72J057J302r42j287n8J628L47j488j176J571J587j002k133
$$ plain form
1989 1440 -570 -1449 105 1318 375 -526 -276 671 668 -123 -521 -161 581 132 -474 -323 234 334 -508
2008 -508 -216 135 256 -52 -251 223 545 -134 -480 171 895 181 -606 -614 698 781 -421 -288 85 844
2028 844 195 -440 -364 484 850 -266 -552 -219 455 517 -185 -561 -253 670 346 -470 -396 322 197 120 -231
2049 -231 -189 -101 448 243 -198 -486 -42 623 -54 -655 -89 430 484 -363 -540 124 106 297 -345 148 299
2070 299 86 -492 -42 406 24 -107 -270 -3 303 -80 -443 155 753 -126 -896 -403 987 594 -1300
2089 -1300 -935 894 1175 -215 -1152 181 1205 242 -1184 -583 1009 475 -857 -884 242 1038 35
2106 35 -807 -412 813 608 -401 -885 55 993 293 -777 122 753 177 -645 -578 933 824 -999 -871
2125 -871 475 924 -137 -1009 48 1350 408 -879 -937 691 1038 -450 -1626 -55 1532 530 -1603
2142a603O98K352k02k330r92K441J525j905j635J219J741l76k143P4J916J45j503
2159e78q83J754J146j530r84M63J653l02j622k36J521J077j842j164J223J568
2175A264p39k104Q80J805J93k274o65J868J720j715j876J152J883m16j949j79
2191a152J852P18j722j226J209J525o50j716K42J944L5j613q61J550J389j641
2207a17j170Q04J826m32k230N08J543K09j570q04J755J208j547j367Q51J437j07
2224G97j399k99J469O14j323p91M94J456m10j648J76J416N33j178o83J089L50
2241F63q94n58Q36Q97o87q88k1J135j58n45k49N23M99k23q40M79J79L95n84n47
2261e88L77M45K80j086r4J021L52o46j056R01Q79p35j080N19O90R1k88k56M98
$$ plain form
2142 -1603 -905 1447 1245 -1085 -2077 364 1889 -16 -1651 -432 1309 933 -1210 -1136 780 925 -578
2159 -578 -1461 293 1439 -91 -1075 -612 1041 739 -883 -1119 402 1479 -363 -1527 -304 1264
2175 1264 525 -1579 -699 1106 1299 -975 -1640 228 1948 233 -1643 -491 1392 976 -973 -1152
2191 -1152 700 1418 -304 -1530 -321 1204 554 -1162 -920 1024 1059 -554 -1415 135 1524 -117
2207 -117 -1287 -483 1343 911 -1319 -811 732 941 -629 -1433 322 1530 -17 -1384 -533 904 797
2224 797 -602 -901 568 1182 -141 -932 -438 1018 608 -1040 -864 552 1085 -93 -776 313 663
2241 663 -231 -789 47 944 257 -631 -652 483 325 -220 -469 54 553 330 -510 -31 148 543 -41 -588
2261 -588 -211 234 514 -572 -666 355 707 61 -995 -94 785 50 -1030 -511 179 270 -18 -274 224
2280B24j7Oo21k0P87K6o40j63P46K04k88q42M28O84o43l50K01O00O9r32K13P49
2302D21qo12m99R43J00m68N8j26L67p8j27l33L30P7K80n29q2L14Q8J87q61J70
2324c88N57q3n6m29N84nJ62k44l85N5O49J83q28j68Q31r5o17k42N08M11k3q49
2346d72n2J138l53q56j00J085K55r57m09P70O40l99r00K23Q24J04r80L8M97M59
2366E55o39r25R65R92p33p88J51O74M27j114j21P24Q17r68r98O45R82j40r73l0
2386d97N80O52j018q58J129J323r46j094L23J202J78j451m32Q54O93p93o42N09
2404b88J310o38q75pR43N2l99r29M52J165m04p65k26R19J57m94o61O26Q01l22
2424D17r84J47J119l31j004J75Q67o8n50m35L80R43n96p92K16Q14M40j103k20
$$ plain form
2280 224 207 213 -408 -428 359 385 -255 -418 328 532 244 -598 -170 514 -129 -479 -278 322 391 -541 -328 421
2302 421 413 -199 -698 245 345 -123 -65 -191 176 98 -29 -362 -32 45 325 -204 -286 28 116 303 -558 -388
2324 -388 169 86 30 -399 185 180 342 98 -287 -232 417 600 -228 -396 435 340 -277 -519 -11 400 377 -472
2346 -472 -524 614 261 -595 -695 390 645 -312 -721 49 689 290 -610 -387 437 541 -439 -401 96 555
2366 555 -84 -1009 -44 948 215 -573 -422 252 679 -435 -556 168 985 17 -981 -336 646 506 -467 -497
2386 -497 83 735 -283 -1141 -12 1311 365 -729 -406 796 974 -477 -909 -55 638 -155 -797 -288
2404 -288 1022 384 -491 -498 445 497 98 -831 -379 786 382 -383 -609 310 467 -27 -688 -62 739 417
2424 417 -567 -420 699 368 -636 -461 406 338 -212 -647 -267 676 80 -712 -496 318 758 -345 -565
2443e65N46Q31p74p68J41J141q1q01m80J025L85m24r79N64J373n38j302K00Q29
2462C23O49j064p93O87Q09m10r57JJ557k60q91k89J012L50p51p56N28Q16J44j222
2482e17K8J043j87k35p85P75K05j51r77M59R24l52n61j21Q61J27n34p35Q47R5
2502B09Qp10n7R38J8n99l43N27J30J80q43J87P64j10o05k68O36O28o39p04L78
2523b75J062k66n66o00Q13N47n41j055K76J026Q8m13m60N43L60n34j85ML09J51
2543B84k45j02L44o1o3o16L78M69j2m02k18Q60n96k0r0L82No00o4K52O16l73n52
2566d24J95M15L21p00n38J045L24l22q11J38Q92K6o31o63O95R88m46p65j59O50
2586B30N43n90o53N05L86P4q06k14N59K89m66l38O47J37l22k31p0M50J61m61N7
$$ plain form
2443 -565 -19 812 38 -730 -589 552 471 -330 -810 215 600 176 -803 -239 1134 596 -706 -506 323
2462 323 972 -92 -885 -198 611 201 -756 -755 802 542 -349 -638 374 724 -27 -783 -255 561 705 -517
2482 -517 -489 554 367 132 -653 122 327 176 -801 -342 582 230 -331 -452 409 536 2 -733 114 209
2502 209 217 -493 -550 388 406 -193 -536 -9 121 301 -542 -355 409 299 -306 -574 62 690 51 -653 -275
2523 -275 787 521 -45 -645 168 715 174 -881 -605 421 509 96 -364 179 539 5 -180 -176 133 284
2543 284 39 -63 281 220 157 -459 -81 388 376 -26 -244 616 20 0 -90 292 297 -303 -367 -115 501 128 -424
2566 -424 -229 186 507 -193 -731 314 638 316 -495 -357 535 561 -70 -733 -38 950 504 -261 -420 230
2586 230 773 183 -470 35 421 495 -311 -525 34 323 -143 -481 166 303 -19 -250 -320 130 291 -170 -113
2607a13K29Q0k54Qj85P26n72M2o4N79k82o73N6P45k64n8n64L86P35n81j16l06
2629d46P59L46j006m03O66Q12l38r69J80P71P55j106r21O37R41l93n53l02N39
2648c1O60o40r23M54J185k98n18l60O73k3k40n16N07N69l56k86l2N25n6m76L1
2669a51K74J70n67J02K64K09p1n95L22N47k64m18j16O70O8n08m37J84P81k8j122
2690f86L37Q56K84q13m47N55O42m13p58m0P26L26l43j050O39M55J73p58o5M01
2710B1M28n29l17K15N05J06p81M81J71j67j82k55M67M7l36k37N23L89n89k03J15
2731a28M67m37j35LM38N39r37l88M72M75N8p32j22O87R4p39k41M97M62pm92k19
2753c85P10K26o25k59M03M11Q8j042K68K43M74o26m22M78L67J50j049K22L00K67
$$ plain form
2607 -113 116 196 -58 -50 -235 491 -81 -39 -103 476 194 -479 -423 322 58 0 -564 -178 557 -24 -140 -446
2629 -446 313 659 -347 -750 -84 728 390 -579 -399 372 1127 21 -900 -263 678 285 -268 -570 -31
2648 -31 629 -11 -934 -480 705 407 -111 -471 202 179 -61 -577 -70 499 143 -143 -175 350 294 -182 -151
2669 -151 123 293 -274 -172 92 301 230 -365 -43 504 240 -178 -294 376 444 -64 -501 -317 464 436 -686
2690 -686 -349 507 791 -22 -469 86 728 315 -443 -483 243 569 226 -824 -185 270 443 -315 -380 21
2710 21 449 -80 -397 -182 323 429 -352 129 300 133 -49 -304 163 210 -126 -363 160 549 -40 -243 -128
2731 -128 339 -98 -233 -230 208 747 -190 -578 -106 369 427 -305 -427 260 354 -385 -626 -129 333 326 -166 -385
2753 -385 325 551 -74 -333 70 481 569 -473 -205 38 512 -114 -536 -58 309 459 -590 -368 -68 199
2773A99l44k69M05K51j0m91P3M50J84r32K76J89K75k17k11N60J01n49J60j81M18
2794C37M2m31j61L44K14k37o82M33Q58o20o87Q8R55K00r14j75M80M70p28m74J53
2815e35P37L09o77l89J96Q79k29o56J23N04M9l77l70J59R58n97k48k5M67K61j082
2836e43M00k46P12l34K6k7K35P4n79O1L73P5k26k63RN60k63n25K52J20M28m00
2858h1k48L79M94m57m97L53L60k56n07n9O99J08k41k04R7M65l56k22j77N16L45
2879E11o77m05M55N76k06q01L37P62J77j056l53Q62M31m07o42Q1O35j35m35n6
2899c46N54J47m16k95K38M75qo66J05L72N0k30j80p0M75k25n24N23K59q9j65j38
2921a54L73O3m21k56N94M9O4m93K0M53r8l95l94P09L36k76n80M1J090k82o02n33
$$ plain form
2773 199 -145 -414 -9 242 232 -259 -186 264 448 -484 -208 -19 256 39 -172 388 489 -60 100 -81 337
2794 337 379 -52 -213 131 345 108 -574 -141 717 97 -590 -502 453 653 -261 -436 44 514 -214 -688 -535
2815 -535 202 511 -166 -555 -359 520 291 -365 -242 262 311 -66 -436 -277 681 84 -164 -189 278 539 -543
2836 -543 -143 -389 323 -11 15 -12 223 297 -282 -221 152 227 1 -262 -253 307 44 -481 -229 -109 319 -81
2858 -81 -329 50 544 87 -410 -57 303 47 -460 -519 180 288 47 -157 -60 405 49 -173 -350 166 511
2879 511 -166 -571 -116 460 254 -547 -210 552 729 -327 -680 182 613 206 -436 -355 280 145 -290 -346
2899 -346 208 355 -61 -356 -118 357 349 -317 -212 160 210 -20 -200 -270 205 -20 -544 -21 238 149 -16 -154
2921 -154 219 282 -139 -395 199 248 312 -181 -161 292 194 -201 -595 114 450 174 -406 -365 725 443 -159 -692
2943f92P50L16j61n74N56R8n0l70r0L85J47j11p13O06J04K11p97J34L50L59n45
2964h7P4mJ01l12M1l31N95K13o08j97M93L91m03k67j41P54J41r47L61N92P1l19
2986B11l85K50L35k36m95J20L37J55n40j24M78L31Mp77L78M62n18l75J12K28N26
3007D77n08j95N4O54m7j053L95M44L21n87l43L01N35l90m33K53J86K85m49m01
3027e01O96J25m06m04L31N81m53l91O7O09j6j93l82M01J75r9n02M88K67l70l78
3048c55J71K49L52k19l33j40P51k33k71p7Q2M88n90l26N86L12l08n56K30j3N0
3069a50j79M2j9Q82k02q64j26N22M91k83m20L89K68k94l0l38M89p7n49L06OK41
3091A05L0n24L01M77n69J8k38O61k65L3l17L24L14l39l41K64Q7L65m51j78M93
$$ plain form
2943 -692 58 374 213 -361 195 293 243 -127 -217 168 315 204 -509 97 201 412 -385 -251 99 458 -87
2964 -87 -13 -17 84 -228 -187 -518 77 290 -318 -515 -22 369 -34 -301 -442 312 453 -494 -133 459 530 211
2986 211 -174 76 411 175 -320 -200 137 292 -248 -372 106 437 441 -336 42 504 -14 -389 -277 -49 477
3007 477 -31 -226 -172 482 435 -618 -223 221 542 -45 -388 -87 448 58 -375 -122 64 349 -100 -501
3027 -501 195 320 -86 -490 -159 422 -31 -422 -355 254 238 45 -337 64 239 140 -362 126 393 23 -355
3048 -355 -184 65 417 198 -135 -275 476 243 -28 -105 -23 465 -125 -451 135 447 139 -417 -187 -200 -150
3069 -150 -329 -287 -306 576 374 -490 -616 -94 397 114 -306 83 351 57 27 -311 178 101 -448 -142 -136 105
3091 105 135 -389 -88 389 -180 -162 -400 261 -4 29 -288 36 350 11 -330 -66 21 386 -65 -243 250
3112B50L02l96p31L17L92R4m23n9J88K42j11m23L34L27j89m10P6K09M63o31L8
3133a41J89MK43o49J55R9J37k62j19K90L94j45n45L2P65l87q0J23j20L4Q2l38
3155b39L47j27J68Ln94O04J1m09J59j52N41k3p35J52O40J79p53k76N80N33n12
3176I7m18M44M81m30k90k97O02M9j84j91K55K71J3o48J17MN59m55k48K45J07K92
3198C75o32j08Q20j89n11j59N97M6j65m31Q2P15r9k76j85K37j30j0k00J20L62
3219B59n5l89K49Q6J44j60n38J78J71K17n75J04K03J81k86P8J87N40n55m14J48
3240b27P31m65q0l38O72l05j99j20K30O04o45k03j52M66J99n02n0N78O3k9l65
3261a37k74O60j00l06N8K36M4l7j23l78O46Kl87O0L0j1J13n3m1N92m36j62o5M95
$$ plain form
3112 250 552 156 -575 -258 134 228 -195 -254 -66 176 65 -358 -24 303 114 -296 -220 -11 452 -179 -141
3133 -141 48 52 295 -354 -199 -100 37 -225 -344 -54 340 195 -350 -318 447 60 -20 103 -17 17 99 -239
3155 -239 108 -19 149 152 -442 162 173 -236 -77 -229 312 289 -446 -294 346 525 -228 -504 76 609 97
3176 97 -321 123 604 174 -116 -413 189 238 54 -137 118 389 402 -246 -129 -125 434 -21 -269 -24 83 375
3198 375 -257 -365 455 266 -245 -404 193 239 74 -357 -275 440 341 65 -120 117 -13 -23 -223 -103 259
3219 259 204 -185 64 150 294 134 -404 -226 -55 162 -413 -309 -106 75 -211 -133 54 594 39 -375 -227
3240 -227 504 39 -41 -379 293 -12 -211 -331 -101 503 -142 -345 -497 -31 168 -334 -384 194 257 228 -137
3261 -137 -411 249 149 -157 -99 137 181 144 21 -357 289 291 -96 -36 -6 -17 96 43 2 594 158 -4 -69 426
3285D26k2n31j98O57l6k35n02J94N28J0n00k1J44K37M6n08L0P97k39n46j53N18
3307I6K93n54l04N57L09n40K29n01O17J89o02j82L59q8J93m78M25Q3J27m73J38
3328a07K65K7k27j34K22L01r6m44j38M93L38n53k07J56N23k44k90J32J25R8m62
3349b22Q2P6J37J3l40k2M18J18n76JM99J11j6r09M88K85j38j48l9L27J92j68o12
3372d43K58M27k78k82K56P3O9M8k41K03J66k22m10J61N76k25l87R9J95l7K65m32
3394a61Q0O58m68k45J89J44L4n17r8M10N43o85o8k83P32N6m46J17L52n9l37l68
3416d20M71L39Q9o14k42O07J77o02k65J88K81R9m83J49J81L10o07K59K97J4j79
3437D9m60pN98K06m78j05N49Q7l53o95O12J93k5k87l55Q76l51j70L8J17L72m93
$$ plain form
3285 426 404 -127 -325 332 296 61 -441 -247 281 291 -209 -230 -86 151 197 -311 -281 516 277 -269 -422 96
3307 96 389 -165 -469 88 397 -143 86 -415 202 391 -211 -393 -34 -122 71 -407 18 101 228 -245 -107
3328 -107 158 185 -42 -176 46 347 251 -193 -331 162 500 -53 -260 -104 419 175 -115 17 142 240 -222
3349 -222 -140 -64 73 86 -254 -276 142 260 -316 -315 184 295 279 -630 -142 143 5 -143 -182 145 337 169 -443
3372 -443 -185 242 -36 -318 -62 11 80 128 -113 90 256 34 -376 -215 361 136 -251 -152 43 6 271 -161
3394 -161 -81 577 109 -136 53 197 231 -286 -384 26 569 -116 -184 -467 265 321 -125 -8 344 285 -52 -420
3416 -420 51 390 479 -135 -377 230 407 -195 -460 -272 9 108 -375 -226 -45 265 -342 -83 214 228 49
3437 49 -411 -418 180 386 -92 -197 352 439 86 -609 3 196 171 -116 -471 405 54 -116 -78 39 411 -82
3459h2j33J71K82j97l41J02O6L39k28k85L9L53M5j53k37J24M10l22m74M11J87
3480G7J02l56l0N58K81q53J24J56J23k61k29O7K73J59l20J49n1J21j05l39J72
3501a82K83J38l63l12J087o03l67K24L05j30M6l34O6K60j21j05J3N4L36m32o9
3522b06K7K5M48l36r8J80K33k98q1k93P50k74r5m74P35j16m3m41J62N05l56K7
3544a9k66N32j91p4k44M67R0l26k23K81L71j54o67K66L95j08k3l77K56l9N63p68
3566b58K43J71o9j9j34J82L28k24m50L17K50k01m61K03k1M02j84j83k0J95L32
3587C99l50q0O0O9l33J57MK45j79j91k10N68J61l90%K42M9J97n64j7J73J92k32
3610c0k27P91l31P9n68m0N14j70K1k57K34K52j29n28K43L09M8n53J18K86J37k95
$$ plain form
3459 -82 -215 -44 238 41 -300 -198 -132 207 -21 -306 -267 86 131 -22 -259 -135 275 -47 -521 -110 77
3480 77 179 -177 -207 351 632 -221 -97 59 182 -79 -308 -241 32 191 -129 20 -31 90 -15 -354 -182
3501 -182 101 239 -124 -436 651 48 -319 -95 210 80 126 -208 -142 118 -3 -108 -95 -41 295 -137 -206
3522 -206 -179 -154 294 -42 -140 40 273 -25 -106 -399 351 77 -18 -492 243 127 84 -357 -195 310 -46 -19
3544 -19 -285 247 56 -18 -262 205 295 -31 -254 27 398 244 -423 -157 238 130 107 -270 -14 -53 510 -258
3566 -258 -15 156 87 68 -66 116 444 220 -230 87 337 136 -325 -122 -143 259 75 -108 -128 67 399
3587 399 49 -31 29 98 -235 -78 -74 171 -8 -199 -409 159 320 -70 -70 172 221 418 -146 -163 10 202 -30
3610 -30 -257 534 203 282 -286 -326 188 18 39 -218 16 268 139 -389 -146 163 211 -342 -224 62 199 -96
3632i6k82O24j35lj63J74P6n6J46l50J34j29mJ48j78Q9M32n61k00M86J10l43l54
3655d35M49N3k30K13j81K31l09P7k9n6N97P2n18KK78L3n0k72J29L7j21N3k44N09
3679B88q6l39r9K80r7K72l69kK42nq8k72O61k75p7l32K72l5K67k32j39L17l9k80
3703a67N5J82J37k86k36M65P8m7m60j78N24K37n68KP2N8R9j14j31L29M1m6j49
3726a03L57o6o2l64j53N62J26m21k28N60k41J49l50R8L86k04l04K35o4J93j02
3747Dk85K42J23L6l49J5o0K77k0k31K76J92O6n03K63J55R2o50M84P4j10j97k89
3770c95M49L15k55k80q5L18L43n97j82L08J98k49l16K74K24K24n17j54O91l17
3790cj07l49K90M74k49k9k00K58K01k94j86J21M35o1m76l56O31m2l49q6Q12j44
$$ plain form
3632 -96 -378 246 111 108 -55 119 195 139 285 -65 69 -60 -64 84 -94 -5 427 -134 -334 152 262 -81 -435
3655 -435 14 67 -163 50 -131 100 -209 -132 -161 -217 380 452 -66 -64 214 247 197 -75 54 91 -30 23 -221 288
3679 288 202 -137 -236 44 -53 219 -150 -152 90 85 -3 -275 386 111 34 -298 -26 -61 206 -26 -165 152 113 -167
3703 -167 -112 70 207 -79 -315 150 228 181 -279 -457 67 304 -264 -262 -190 -132 -33 -147 -278 51 92 46 -103
3726 -103 254 188 126 -238 -391 171 297 -124 -352 208 -33 116 -234 -136 250 46 -258 -23 -87 106 4
3747 4 -281 -39 84 120 -229 -214 -274 3 -17 -248 28 220 286 -217 46 201 293 -357 127 201 91 -106 -395
3770 -395 54 369 114 -166 -251 67 410 -187 -369 -61 137 -112 -428 -154 70 294 -223 -377 314 -3
3790 -3 -110 -459 -169 305 56 27 -173 85 286 -8 -194 -73 362 301 -175 -531 100 58 -291 -377 435 291
3812B91n51k0J99M40q5m84Q3K9K46k20J02k02L56k80l36N44M6j19q3j52K66J81
3834B51j60k49k85Q04l5o51PP09k27l23l01O44lk47J04m26K60K00n9k05P6M59
3856C43k07L1K3k1K51k27m08N7L08%j12j67L49l41J47K59n9j78q1npL84p40K39
3880a62K37ok06k85N54l9K69k08k66J43J50k22K41k16k5N2J55m97M16L5j17m4
3902d1K10J75j83l14K61m63L47K14k17o5K61m6r6O6q3j67J11Jj18J47Q6K02m51
3925a63n5m0K22K04k34l0J84J83q5l52J08L50n38N44l08L20n2n57K03K95j33k3
3947D3p7jL0J5j84Q0J51J40j71l57M92k07NQK43N3k09j59q4J65K0pk30J10J47
3972A6L09q0k78K32k8k39N1K0K91m73j8Q6M03n01m46P09M12m28n6k70L91L44o52
$$ plain form
3812 291 -260 -280 -81 359 274 -210 -127 -98 148 -72 30 -172 184 -96 -432 112 158 39 -44 -196 70 251
3834 251 91 -158 -443 361 326 -325 -318 391 164 -159 -460 184 181 -66 38 -388 -128 72 13 -192 -116 343
3856 343 136 167 190 169 420 193 -215 -158 150 150 38 -129 220 -121 26 285 226 48 -33 -38 -45 339 -401 -162
3880 -162 75 69 -137 -422 132 93 362 154 -112 31 181 -41 200 -16 -41 11 166 -331 85 120 3 -41
3902 -41 169 344 161 -153 108 -355 -8 206 -11 -76 185 139 43 109 26 -141 -30 -29 -147 0 86 288 -163
3925 -163 -218 -258 -36 168 -66 -96 88 271 186 -166 -58 292 -246 298 -10 310 258 -299 -96 199 66 43
3947 43 -34 -35 -5 10 -174 -94 57 197 26 -331 161 -46 -41 -33 210 263 54 -105 -189 -24 -4 -11 -241 -131 16
3972 16 325 245 -33 199 171 -68 -17 3 294 -179 -197 -111 292 -209 -655 54 466 38 -18 -288 103 447 -205
3995b05k11M25J2j15k89L54J99m6m2k29J7K14k48LJ98n7K05j56k29K50L40m46
4017e6j25K43R5j07k58Q7L26J82n60j47J47J30N5l31J07N86k24n02K3M45m7q1
4039a2l98K73M74k28M0k57J07K85o93O2L04L52l79m9L24J82m40j4l29O17j98l5
4061a2m71M72lj9k18J27L31K17k24l85J86P0K26m40qK77J78k71K41j10j91P6j89
4084a40L83Q4j01m43J66N66m23j24l36M14n7J63k53K11K3j59k07K07k9M75l07
4105A13l52M16L8k35P6j94K65q0nj05M94m49J08l28M36q5k31q9J09K89j80K14
4127B25k16J97o6J08m13J48N3lq7j62L37m02L11J69j77j39J16k2K83m26K29j55
4149i2J71n5J40P2l49K59k94L58j36l06M78l49n6M16N3m95J91j9R0J7k17K37k34
$$ plain form
3995 -205 -416 9 21 -94 -383 -29 170 124 82 -147 -130 84 -164 -161 37 -20 185 29 -200 50 390 -56
4017 -56 -181 62 157 50 -208 -121 205 387 -173 -320 -173 -43 12 -319 -212 374 150 -352 -329 116 69 -12
4039 -12 -410 -137 337 109 149 -108 -1 284 -409 -347 -43 309 -70 -119 205 387 -53 -67 -396 221 23 -12
4061 -12 -483 -11 -14 -33 -251 -124 207 424 200 -185 1 71 297 -143 -151 126 304 33 274 164 -27 49 -140
4084 -140 243 327 226 -217 -51 515 92 -32 -368 46 -11 152 -101 110 133 -26 -233 -26 -55 420 113
4105 113 -239 177 215 -20 56 -138 127 47 42 -63 431 -18 90 -238 198 113 -118 -207 -98 191 11 225
4127 225 9 206 140 248 -165 -17 36 33 -54 -216 121 -281 30 199 22 -117 -1 -23 260 -166 63 -92
4149 -92 79 24 164 236 -113 146 -148 210 74 -232 246 -103 -159 257 310 -185 6 -13 77 94 -123 114 -120
4172a20K88l30K98L8k22J54n6l65N32j68j2J25j88J46k07J57k37J23J98m45K98
4193GL2l31Q5L48m48L40K1k14J76P4Oj30K6J16k08o2J18K81j73J97j04j50J25
4216A32l96J73M05q4j49k55J45J70j36L0m33K63K40r5k30M26jl05n1kL31m68L38
4239D8l10R3K32m4o0o2M28k65l14L78p2j2j65l0Q5K33q1l92L15J02m3m64L74Q8
4263F2J28k20j6J29j9J63n29L18L2J86O7m59L00M1k89o3J18K98m5l35J38O6k67
4286a96r3j71J77L20Jj50R2JN6k39N1M08J24n54L84j86R3j4k22j98K85J65k90
4309a56J2N23k46k02o2k22L22j59K90l82J03M14l43K86j90Nj96J68m5J57k6l5
4331A6l75K25J18j16M3K01m3J0j30L3o6K60j31k80L6L11j23j6j42L69Q6o24j20
$$ plain form
4172 -120 168 -162 136 174 -48 106 50 -315 217 49 37 162 -26 120 -87 70 -167 -44 154 -291 7
4193 7 39 -292 -207 141 -307 33 54 -160 16 90 96 -34 -8 108 -100 -162 -44 237 64 261 157 7 132
4216 132 -264 -91 314 230 81 -174 -29 141 5 35 -398 -135 105 10 -220 206 205 -100 -151 -153 178 -290 48
4239 48 -262 -169 63 19 -41 -103 325 60 -254 124 52 40 -125 -155 -70 163 82 -310 5 107 64 -400 -26 62
4263 62 190 -30 -46 83 64 227 -302 16 48 234 301 -158 142 183 -106 -169 -51 247 202 -133 5 71 -196
4286 -196 -289 -460 -283 37 38 -112 -20 -19 37 -202 -151 257 381 -173 211 25 118 104 -118 -316 -31 134 -156
4309 -156 -144 379 133 -69 -131 -353 -31 -190 100 -282 -179 235 -108 178 -12 -7 -203 -35 -80 77 51 16
4331 16 -359 -134 -16 -132 -89 112 69 79 -51 -18 -84 176 45 -235 -199 112 -11 -27 -169 200 286 -338 -458
4354d58O00j48Pp3J67k21p3k11O51j82ML3j97q5K28Q2k1j37K61K04n24J39K24
4377B70k58K5k62R6J79k80K52q7K67j37l09K79P4j8K4k15k18N94o4n55J16K84
4399E7R7k1j38N2R3J72o20K58J10l5P1m07L23n0M8J35l49J06J33q3O8j70J77k81
4423b54J61K7J09K1k95J77k49J42K11K0%l16J27K35r0k11K60M1M5j40m8K99k6
4446B46l90r3N30k80k1J06r1J42k87K86N6k59k33M51Nj8j15k12K57k39K28l3j74
4469a38j9J77J3j01J85m28K73K4l62N73K1rl33k18K56J89J76l95L70l50M1K9J3
4492a3N40l03l26j80O43n22JJ90l26M60l5l80J49o6K29k47K39j76L68o5M2r3P4
4515B03k95J39m42J59K57j73K02J52l98J88j85J59O8k8l3k28N06j14K05k68lk38
$$ plain form
4354 -458 142 -6 1 -72 95 -126 -199 -410 241 59 63 96 -101 -186 42 124 103 -34 227 431 -93 46 270
4377 270 12 37 -225 -129 50 -230 22 -65 202 65 -244 35 109 91 115 -100 -318 276 212 -343 -227 57
4399 57 154 133 -5 47 140 312 -308 -50 60 25 96 -311 12 -38 10 145 -204 -98 35 -48 20 -150 27 -254
4423 -254 -93 -66 43 64 -231 -54 -303 -161 50 70 70 -246 -119 116 26 -185 75 116 161 21 -27 272 246
4446 246 -144 -237 293 13 -8 98 7 149 -138 148 204 -55 -288 163 168 150 35 -177 80 -159 69 36 -138
4469 -138 -157 20 33 -68 117 -311 -38 -14 -376 197 218 209 -124 -342 -86 103 279 -116 254 -96 -55 -26 -13
4492 -13 527 224 -102 -282 361 -161 -160 30 -296 164 129 -251 -102 -168 61 -186 53 -123 245 180 222 129 203
4515 203 -92 47 -395 -236 21 -152 50 202 -196 -8 -193 -34 34 6 -27 -255 251 137 342 74 71 -167
4537a67L45l45J68j84mJ40L28m34M67k28N1k60J04L42j44l05r3M02l52J49j6k08
4559b44L57j85J1m7r1m7L18J03n3j98K47M6j67r6k56J66J00k05M80k74l0k5N1
4582c9K22k58K92k43L08Q5o09M84k94q0L27%j96j79QL52j62J3J14j83N6O1j26
4605d7P2o1N9P8k65K60k10K90l56r5N18l68L50j39km5j81%O4J86l6r6q1O4m1N4
4631b8j66j33L9L44R8j71K92o15J31O7J3P7J62j15q6K16k35J32po5M3M71o36O6
4655a06O3N8j0k68M90k17L7k8j45J16J81o9O2j50N3k8K5j55K62n7q0q9J60o1j07
4680f3R7L4q9J63q2K5K53n5j55k34J25k8J95j59j15J41J89k97P8l3m8J06k48J75
4704b5m0J93k34o1K51R2j22l32K51K13l16J67J30k56oJ41k73P3j47L09k5J91m9
$$ plain form
4537 -167 178 -167 1 -183 -187 -47 281 -153 314 86 137 -123 -19 323 179 -126 -219 183 -169 -20 -36 -244
4559 -244 113 -72 -61 -108 -199 -246 72 175 122 -76 171 217 50 -46 -302 -136 -36 -241 239 -35 -65 -90 -39
4582 -39 183 -75 217 -26 282 367 -242 242 -52 -132 195 195 -1 -180 -172 180 18 31 145 -38 18 79 -47
4605 -47 25 -36 23 101 -164 96 -114 176 -180 -275 243 -125 225 86 84 39 -142 -142 -78 108 72 -24 -105 -41 -82 -28
4631 -28 -194 -327 -288 56 154 -17 275 -340 -209 -142 -129 -52 110 -5 -91 125 -110 22 15 -50 -7 464 -172 -106
4655 -106 -43 15 5 -263 227 10 47 19 -126 -10 171 102 164 14 67 39 64 -91 171 114 34 -55 105 44 -63
4680 -63 34 68 -21 142 60 85 338 283 128 -106 19 -9 186 27 -88 53 242 -55 23 -10 -58 48 -200 -25
4704 -25 -65 128 -106 -167 84 176 54 -278 -27 186 -130 37 167 -89 -95 46 -227 -154 -301 8 -17 174 125
4727A25O0P3m44M66k37K51k11q2j99rL21K2O0k69l1J52q2m9M43j99l32O22m40
4750A1M5j49j14J97j66L77k09j71Q3Q4P6k17M48k17k8P1j12j58K74k79J97J58
4772B01k08l2M3P0k11K04n7J59Q3j30m42M10j31l3p4K7o4J97l19M11jk02J88N2
4796A41j57k38J17J19n9k34N21k14n8J13J08l10R2l1j3M28m82J3j78J56J10j26
4818a82J1L67M0P2l83J82on8l16J80J71p3j40L19p3r7j7j02K07o5M2j35K96n73
4842c33M24m7J81n45L22l1kk5L25k99j17O6k60L15J02l13L22j03J90j83l3l7J03
4865B2j58l93N37K27J9l41M5l25M76j6J23j96K1l4R6K1j03l9L06n0l06P9k70O78
4889D19o15K29k44K35k09J17O6No8L92l4j41m04K73j13j23J57k05L47l21L99k84
$$ plain form
4727 125 185 258 -186 280 43 294 83 1 -198 -207 114 136 196 -73 -104 48 -34 -83 360 161 -171 451 11
4750 11 56 -93 -207 -10 -176 201 -8 -179 -96 -12 64 -153 295 78 50 121 9 -149 125 -154 43 201
4772 201 -7 -39 4 74 -137 67 10 169 252 122 -320 90 -41 -74 -148 -121 -185 12 -307 104 103 -99 89 141
4796 141 -16 -254 -137 -18 -77 -311 210 -4 -62 51 159 -151 -59 -90 -103 325 -157 -144 -322 -166 -56 -182
4818 -182 -171 196 236 308 -75 107 101 43 -273 -93 78 5 -135 184 111 14 -3 -105 102 37 79 -56 240 -333
4842 -333 91 44 225 -320 2 -29 -31 -56 269 -30 -147 -81 -341 -26 76 -237 85 -18 172 -11 -44 -81 22
4865 22 -136 -529 8 235 254 -87 -42 -367 109 93 216 20 41 7 103 124 21 -18 288 238 -68 11 -259 419
4889 419 -196 33 -211 24 -185 -68 -2 3 -65 327 293 152 -252 21 -92 -215 -58 -263 84 -237 162 -122
4911a22J45j5k50K36Pk27K65o7J48l6K1j74K08l19K79j46n9Qk4M02j30l88l2J34
4935a36J23j40L46k19J37Kk07J30j0J92l03J11K1K10k36r0k79N27k29Q9ll20M03
4958A19j13J15j87P8Q1r1njk41L60r9J63p5l43J53L8K95n06K50n7M3k03K64k52
4982b14K20j64J28P8j25Jj40L40j76L5l07J02MN81k07j09n0k48k3L91j93J13j33
5005i6R4L64l42j76K37r9q9j16L32k12J54K5Q2j66j55L16k24R2l9j24L07j41J01
5028A25l01K02kk10K1N2J41q6Q1j71K24k44K13j60L86m64M46O4j93j93J38j29
5050f0j19K33k24M30k41k90L39K0M4n05L16r1L14o4M4m87M55Pj67L6j76M83k33
5073F4l55K62Jl7N0qNJ2K08l35N11m69P7j37K33J49l85j4K44j86J6K8j47M72l67
$$ plain form
4911 -122 23 8 -242 -6 1 -226 39 -28 120 84 105 -69 139 -180 99 -47 -106 -98 -122 280 150 -238 -270 -136
4935 -136 -13 -153 193 -26 111 113 -94 36 26 218 -85 26 47 257 21 -69 -348 179 -50 39 36 -284 119
4958 119 6 121 -66 12 93 2 -3 -4 -245 115 16 179 104 -239 -86 -48 247 -259 -9 -66 -23 -226 38 -214
4982 -214 6 -158 -30 48 -77 -76 -216 124 -52 -17 -324 -222 -218 363 156 47 -3 -251 -274 117 -76 37 -96
5005 -96 -2 362 20 -156 81 -18 -107 -223 109 -103 51 76 158 -8 -163 153 -71 21 -18 -142 165 24 125
5028 125 -176 26 24 -186 -165 -113 28 -58 23 -148 76 -168 45 -115 271 -193 253 317 124 -69 69 -60
5050 -60 -179 54 -170 260 19 -271 68 88 132 -373 -57 -148 166 102 146 -341 114 121 -46 -10 -186 297 64
5073 64 -291 -29 -28 -65 -15 -23 -18 -6 202 -133 378 -91 -14 -151 82 231 -154 -168 76 -110 -94 -66 -213 259 -108
5098a08M2K42j18p6r4L83m06j62M34j66k31J37J17n5j23K71j43M5Q6l74J90K10
5120A01J4l71R1J08K98l26K33k21J48m11m4K57M9J3j01j7N20j79j01p6l1JO3j09
5144i1pL18k68J11k86K76j39o1K5Q4L19j19k98L18n1k39J38P5j21p7J09j23q0
5167a87J46J89j62M0j55O9J1L11m24J08R6r0J52J36j72O9J1l4k67R6J9k10J54
5190i4R3r1K66k68J41K30n37R7K64k45K98k71J43pO4K39l40J75j20k21J40J82
5212A38l39J08p7R2J38J47k56q8j01K96L4k39k57M03q4o5L1P5J65k25j32J32j1
5235a15L0K53k27o5K39Mj65rR6j21M2j81L87j57j64K57P9k23Lj83P4q4N73l62
5259a9J11l38K35K45j12j3r2K7K4j02j15r2J87K22m32K60L23l74j29K69j12j25
$$ plain form
5098 -108 -66 176 58 -18 -112 271 -135 -297 137 -29 -260 -123 -6 -61 -184 87 -56 -11 75 -299 -109 101
5120 101 115 -256 -165 -57 241 -85 148 -73 75 -336 -380 -123 -74 -61 -162 -179 341 162 61 -15 -46 -45 18 -91
5144 -91 -98 220 -48 63 -223 53 -86 -147 -122 -38 281 162 -136 182 131 -108 30 105 -16 -93 16 -107 -187
5167 -187 -41 148 -14 26 -129 -60 -49 262 -162 -54 42 -48 104 240 68 137 148 114 -153 -57 -38 -248 -94
5190 -94 -1 -92 174 -94 47 277 -260 -163 101 -144 154 -117 26 19 83 322 -18 157 37 -184 -44 138
5212 138 -201 -93 -170 -78 60 207 -49 -137 -238 58 92 -147 -404 -1 -85 -150 -119 -44 121 -104 -236 -104 -115
5235 -115 -85 168 -59 -124 115 119 -46 -55 41 -80 -38 -219 168 11 -153 104 183 -40 -37 -220 -146 -230 343 -19
5259 -19 92 -246 -11 234 122 109 17 44 68 -34 -149 -241 -54 168 -264 -4 319 -55 -184 85 -27 -152
5281a52j19L82J51k68l11K5K33J79km18M98j02k06J04k14K56J5N1j83J91o9P6
5303A17O5P8k46J18nj43L32l12J92l41P8q1K15kj60J66k7m0J50Rk7j43p2k3L31
5328B29j86k28k03M19k1k67r7K48M21J6l23R5j55K12l3j95K24K24k64p9k81k21
5350d65N20Pk4r0K41j99p8M6J32r5m73L32J37r7J04R5L16m99K81j23j10n9L38
5373B37l09r3R7K40l65J24j49J42P9N4J29m7l16J37J43n58K39K18k6k21J87K23
5395A65j30J75j31n7l9Q3k09j33K91qj96r5M98k99J46p4n0N6L6k98J52J36K27
5418B46j50R8l8k43K20j27L3j07J13j45rK70j02l00J12M7k28L49J42r4J42j42
5440H7Nk63M52j18k8j37m53M02K55k44L6J14M4j54K9k15K64NoJ50j49M5j48l4
$$ plain form
5281 -152 -271 111 262 -6 -317 -292 -59 120 118 -300 198 96 -110 -6 -220 36 51 102 -81 110 41 117
5303 117 182 260 14 132 127 -16 316 4 196 -145 -67 -148 67 65 -95 71 44 4 154 163 136 -7 -79 -102 229
5328 229 43 -185 -388 31 10 -257 -354 -106 315 331 8 103 -52 160 127 -68 156 380 116 37 -244 -465
5350 -465 55 62 38 -52 189 -10 -88 -42 90 -5 -478 -146 -9 -106 -2 93 409 -90 191 68 -42 -101 237
5373 237 -72 -165 -68 172 -193 -69 -218 -76 3 57 186 139 -177 -40 103 -455 -216 2 -24 -245 -58 165
5395 165 35 210 79 22 -17 66 -143 -276 15 7 -189 -284 214 -85 61 -13 -63 -7 29 -269 -117 19 246
5418 246 96 194 156 -87 133 6 39 -68 45 -100 -109 161 59 -241 -129 -82 -310 39 181 87 229 87
5440 87 92 -171 281 163 135 -2 -455 -53 202 -42 -6 108 152 -2 27 -188 76 81 75 225 76 121 -27 -61
5464f1K33K49n48J42n1L2J81j77l03K28n8J84j44O9O6m7n9N9j60J58Q3K22m97
5487a99K13j80PJ63j37M25n76J67J61L36o30J18K14k01J14M0j05J22J15k84n1
$$ plain form
5464 -61 172 421 -127 15 -36 -4 177 0 -303 -75 -133 51 -93 -24 42 -5 -64 -5 -165 -7 76 298 -199
5487 -199 14 -166 -159 4 -133 292 -284 -117 44 380 -250 -132 82 -119 -5 35 -70 52 167 -117 -168
$$ [...]
8191a07
##END NTUPLES=NMR FID
##END=
