##TITLE=1H_PR90_RM
 D2O, 8 sc, 
 4.6.2019
##JCAMPDX= 6.0         $$ Bruker NMR JCAMP-DX V2.0
##DATA TYPE= NMR FID
##DATA CLASS= NTUPLES
##ORIGIN= UXNMR, Bruker Analytische Messtechnik GmbH
##OWNER= root
$$ XWIN-NMR		Version 3.5
$$ Tue Jun  4 14:01:38 2019 Russian Standard Time (UT+4h)  she@DPX200
##.OBSERVE FREQUENCY= 200.13155
##.OBSERVE NUCLEUS= ^1H
##.DELAY= (6, 6)
##.ACQUISITION MODE= SIMULTANEOUS
##.ACQUISITION SCHEME= undefined
##.AVERAGES= 8
##.DIGITISER RES= 18
##SPECTROMETER/DATA SYSTEM= spect
##.PULSE SEQUENCE= zg30
##.SOLVENT NAME= CDCl3
##.SHIFT REFERENCE= (INTERNAL, CDCl3, 0, 15.7039)
##AUDIT TRAIL= $$ (NUMBER, WHEN, WHO, WHERE, WHAT)
$$ ##TITLE= Audit trail, XWIN-NMR		Version 3.5
$$ ##JCAMPDX= 5.01
$$ ##ORIGIN= Bruker BioSpin GmbH
$$ ##OWNER= she
$$ F:/spectra/data/she/nmr/H-F/1/audita.txt
$$ ##AUDIT TRAIL=  $$ (NUMBER, WHEN, WHO, WHERE, WHAT)
(   1,<2019-06-04 13:59:26.56 +0400>,<she>,<DPX200>,
      <created by zg, POWCHK disabled, PULCHK disabled
       configuration hash MD5:
       00 E9 B6 7A A2 85 ED C7 34 08 36 98 17 FE 4E 26
       data hash MD5: 16K
       02 B4 14 1D 9E 28 01 78 48 B4 A5 E5 63 3B EF 8E>)
$$ ##END=
$$ 
$$ hash MD5
$$ 45 9B 3E F0 39 FE 7E 40 EF 92 F9 1B 77 CC 0B 41
##$RELAX= 
##$RELAX= 
##$RELAX= 
##$RELAX= 
##$RELAX= 
##$RELAX= 
$$ Bruker specific parameters
$$ --------------------------
##$DU= <F:/spectra>
##$EXPNO= 1
##$NAME= <H-F>
##$PROCNO= 1
##$TYPE= <nmr>
##$USER= <she>
##$AMP= (0..31)
100 100 100 100 100 100 100 100 100 100 100 100 100 100 100 100 100 100 
100 100 100 100 100 100 100 100 100 100 100 100 100 100 
##$AQSEQ= 0
##$AQ_mod= 1
##$AUNM= <au_zg>
##$AUTOPOS= <>
##$BF1= 200.13
##$BF2= 200.13
##$BF3= 200.13
##$BF4= 200.13
##$BF5= 200.13
##$BF6= 200.13
##$BF7= 200.13
##$BF8= 200.13
##$BYTORDA= 1
##$CFDGTYP= 0
##$CFRGTYP= 5
##$CHEMSTR= <none>
##$CNST= (0..31)
1 1 145 1 1 1 1 1 1 1 1 1 1 1 1 1 1 1 1 1 1 1 1 1 1 1 1 1 1 1 1 1 
##$CPDPRG= <>
##$CPDPRG1= <>
##$CPDPRG2= <>
##$CPDPRG3= <>
##$CPDPRG4= <mlev>
##$CPDPRG5= <mlev>
##$CPDPRG6= <mlev>
##$CPDPRG7= <mlev>
##$CPDPRG8= <mlev>
##$CPDPRGB= <>
##$CPDPRGT= <>
##$D= (0..31)
0 1.2 0 0 0 0 0 0 0 0 0 0.03 0 0 0 0 0 0 0 0 0 0 0 0 0 0 0 0 0 0 0 0 
##$DATE= 1559642365
##$DBL= (0..7)
120 120 120 120 120 120 120 120 
##$DBP= (0..7)
150 150 150 150 150 150 150 150 
##$DBP07= 0
##$DBPNAM0= <>
##$DBPNAM1= <>
##$DBPNAM2= <>
##$DBPNAM3= <>
##$DBPNAM4= <>
##$DBPNAM5= <>
##$DBPNAM6= <>
##$DBPNAM7= <>
##$DBPOAL= (0..7)
0.5 0.5 0.5 0.5 0.5 0.5 0.5 0.5 
##$DBPOFFS= (0..7)
0 0 0 0 0 0 0 0 
##$DE= 6
##$DECBNUC= <off>
##$DECIM= 24
##$DECNUC= <off>
##$DECSTAT= 4
##$DIGMOD= 1
##$DIGTYP= 9
##$DL= (0..7)
0 120 120 120 120 120 120 120 
##$DP= (0..7)
150 150 150 150 150 150 150 150 
##$DP07= 0
##$DPNAME0= <>
##$DPNAME1= <>
##$DPNAME2= <>
##$DPNAME3= <>
##$DPNAME4= <>
##$DPNAME5= <>
##$DPNAME6= <>
##$DPNAME7= <>
##$DPOAL= (0..7)
0.5 0.5 0.5 0.5 0.5 0.5 0.5 0.5 
##$DPOFFS= (0..7)
0 0 0 0 0 0 0 0 
##$DQDMODE= 0
##$DR= 18
##$DS= 0
##$DSLIST= <SSSSSSSSSSSSSSS>
##$DSPFIRM= 0
$$ [...]
##$SUBNAM2= <"">
##$SUBNAM3= <"">
##$SUBNAM4= <"">
##$SUBNAM5= <"">
##$SUBNAM6= <"">
##$SUBNAM7= <"">
##$SUBNAM8= <"">
##$SUBNAM9= <"">
##$SW= 24.9336996594482
##$SWIBOX= (0..15)
0 0 2 0 0 0 0 0 0 0 0 0 0 0 0 0 
##$SW_h= 4990.01996007984
##$TD= 16384
##$TD0= 1
##$TE= 0
##$TE2= 300
##$TE3= 300
##$TEG= 300
##$TL= (0..7)
0 120 120 120 120 120 120 120 
##$TP= (0..7)
150 150 150 150 150 150 150 150 
##$TP07= 0
##$TPNAME0= <>
##$TPNAME1= <>
##$TPNAME2= <>
##$TPNAME3= <>
##$TPNAME4= <>
##$TPNAME5= <>
##$TPNAME6= <>
##$TPNAME7= <>
##$TPOAL= (0..7)
0.5 0.5 0.5 0.5 0.5 0.5 0.5 0.5 
##$TPOFFS= (0..7)
0 0 0 0 0 0 0 0 
##$TUNHIN= 0
##$TUNHOUT= 0
##$TUNXOUT= 0
##$USERA1= <user>
##$USERA2= <user>
##$USERA3= <user>
##$USERA4= <user>
##$USERA5= <user>
##$V9= 5
##$VALIST= <valist>
##$VCLIST= <CCCCCCCCCCCCCCC>
##$VD= 0
##$VDLIST= <DDDDDDDDDDDDDDD>
##$VPLIST= <PPPPPPPPPPPPPPP>
##$VTLIST= <TTTTTTTTTTTTTTT>
##$WBST= 1024
##$WBSW= 4
##$XGAIN= (0..3)
0 0 0 0 
##$XL= 0
##$YL= 0
##$YMAX_a= 436828
##$YMIN_a= -354251
##$ZGOPTNS= <>
##$ZL1= 120
##$ZL2= 120
##$ZL3= 120
##$ZL4= 120
##$ABSF1= 10
##$ABSF2= 0
##$ABSG= 5
##$ABSL= 3
##$ALPHA= 0
##$AQORDER= 0
##$ASSFAC= 0
##$ASSFACI= 0
##$ASSFACX= 0
##$ASSWID= 0
##$AUNMP= <proc_1d>
##$AZFE= 0.1
##$AZFW= 0.1
##$BCFW= 1
##$BC_mod= 2
##$BYTORDP= 1
##$COROFFS= 0
##$CY= 11.3945322036743
##$DATMOD= 1
##$DC= 2
##$DFILT= <>
##$DTYPP= 0
##$F1P= 18.9103706918063
##$F2P= -1.10871071338519
##$FCOR= 0.5
##$FTSIZE= 0
##$FT_mod= 4
##$GAMMA= 1
##$GB= 0.15
##$INTBC= 1
##$INTSCL= 1
##$ISEN= 128
##$LB= 0.24
##$LEV0= 0
##$LPBIN= 0
##$MAXI= 10000
##$MC2= 0
##$MEAN= 0
##$ME_mod= 0
##$MI= 1.114404
##$NCOEF= 0
##$NC_proc= 0
##$NLEV= 6
##$NOISF1= 3.799351
##$NOISF2= 2.8
##$NSP= 1
##$NTH_PI= 0
##$NZP= 0
##$OFFSET= 15.70392
##$PC= 1
##$PHC0= -8643.36
##$PHC1= -11.39982
##$PH_mod= 1
##$PKNL= yes
##$PPARMOD= 0
##$PSCAL= 0
##$PSIGN= 0
##$REVERSE= no
##$SF= 200.130013532006
##$SI= 16384
##$SIGF1= 3
##$SIGF2= 2
##$SINO= 400
##$SIOLD= 16384
##$SREGLST= <1H.CDCl3>
##$SSB= 0
##$STSI= 0
##$STSR= 0
##$SW_p= 3612.71676300578
##$SYMM= 0
##$S_DEV= 0
##$TDeff= 0
##$TDoff= 0
##$TI= <>
##$TILT= no
##$TM1= 0
##$TM2= 0
##$TOPLEV= 0
##$USERP1= <user>
##$USERP2= <user>
##$USERP3= <user>
##$USERP4= <user>
##$USERP5= <user>
##$WDW= 1
##$XDIM= 8192
##$YMAX_p= 0
##$YMIN_p= 0
$$ End of Bruker specific parameters
$$ ---------------------------------
##NTUPLES= NMR FID
##VAR_NAME=  TIME,          FID/REAL,        FID/IMAG
##SYMBOL=    X,             R,               I
##VAR_TYPE=  INDEPENDENT,   DEPENDENT,       DEPENDENT
##VAR_FORM=  AFFN,          ASDF,            ASDF
##VAR_DIM=   8192,          8192,            8192
##UNITS=     SECONDS,       ARBITRARY UNITS, ARBITRARY UNITS
##FACTOR=    0.0002004,     1,               1
##FIRST=     0,             0,               0
##LAST=      1.6414764,     0,               0
##MIN=       0,             -354251,         0
##MAX=       1.6414764,     436828,          0
$$ Real data points
##PAGE= N=1
##DATA TABLE= (X++(R..R)), XYDATA
$$ plain form
0 0 0 0 0 0 -8 8 -8 8 -16 16 -24 32 -40 41 -56 65 -78 94 -110 130 -153 175 -205 236 -273 313 -354 405
28 405 -458 516 -582 655 -735 822 -915 1021 -1135 1260 -1401 1552 -1718 1904 -2106 2334
44 2334 -2584 2867 -3188 3548 -3965 4451 -5018 5705 -6544 7603 -8985 10873 -13630 18038
58 18038 -26251 46821 -205436 -241417 256635 255216 94597 39478 133726 -30727 -311689
69 -311689 -354251 -25758 260466 280887 133496 30372 -82609 -208031 -238412 -81449 110536
80 110536 211024 214625 156232 -27761 -263563 -320351 -94087 160656 201900 120001 120480 106146
92 106146 -104863 -353186 -282920 73762 305656 213486 44886 12236 -17619 -182588 -290627
103 -290627 -119663 187703 306378 174139 -6619 -107655 -169691 -200168 -118513 69508
$$ packed form
0@%%%%qJ6j6J6k4L2m0N6p2Q1r7J21j43J72k04K40k83L28l80M41n09N86o67P59
28D05q63R74j098J237j390J557j737J936k156K395k661K953l270L622m010M440
44B334m918N451o055O736p513Q416r469J0723j2249J4147j6588J9858k4503L1668
58A8038m4289P3072k52257l5981M98052j419j60619n5119R4248j64453k80962
69c11689m2562L28493K86224K0421j47391j03124j12981j25422l0381J56963J91985
80A10536J00488L601n8393j83993k35802n6788K26264K54743M1244q1899M79j4334
92A06146k11009k48323P0266L56682K31894r2170j68600l2650k9855j64969j08039
103b90627J70964L07366J18675j32239j80758j01036o2036l0477Q1655J88021
$$ plain form
113 69508 217125 215644 100869 -48808 -191003 -254353 -152326 68011 219078 194923 86191
124 86191 -1073 -95952 -217806 -233523 -39407 211464 268867 119474 -37385 -103232 -148944
135 -148944 -186980 -107023 101682 257856 212131 32211 -117856 -177439 -170329 -92850 57727
146 57727 198069 216894 104930 -48142 -160716 -198458 -136878 20279 182729 223344 118182
157 118182 -28431 -125119 -169476 -161967 -57630 123051 237833 173916 -3510 -139586 -173083
168 -173083 -143776 -69532 61617 191163 204509 73836 -97103 -190532 -175451 -81636 49834
179 49834 163365 191399 107584 -37384 -155125 -186778 -124287 5731 141943 200211 134496
190 134496 -10030 -134154 -173788 -131059 -31777 94467 188544 174136 41662 -114355 -184353
$$ packed form
113F9508J47617j481j14775j49677j42195o3350J02027K20337J51067k4155j08732
124H6191q7264r4879j21854j5717J94116K50871N7403j49393j56859o5847m5712
135a48944l8036P9957K08705J56174m5725j79920j50067n9583P110P7479J50577
146E7727J40342J8825j11964j53072j12574l7742O1580J57157J62450M0615j05162
157A18182j46613r6688m4357P509J04337J80681J14782o3917j77426j36076l3497
168a73083K9307P4244J31149J29546J3346j30673j70939r3429J5081R3815J31470
179D9834J13531K8034q3815j44968j17741l1653O2491J30018J36212N8268o5715
190A34496j44526j24124l9634M2729R9282J26244R4077j4408j32474j56017o9998
$$ plain form
201 -184353 -145077 -44149 70864 161227 176666 87485 -62072 -173010 -175901 -80329 50327
212 50327 149963 172150 103771 -22904 -138050 -175984 -115564 9167 127933 175615 126538
223 126538 7178 -116012 -172159 -131050 -21098 97083 164282 145417 43353 -88582 -171455
234 -171455 -154969 -53268 70937 151843 152352 71032 -53613 -152603 -166976 -88065 37029
245 37029 138368 161608 95800 -21036 -125334 -161542 -109263 5343 118292 164611 119327
256 119327 10795 -100410 -155922 -126592 -25432 93109 160591 137383 39873 -75877 -149020
267 -149020 -142214 -57490 60125 145729 150983 71401 -47600 -137051 -148746 -80658 29157 123821
279 123821 152306 96085 -15725 -118672 -153022 -101763 3336 104849 149057 111279 10888
$$ packed form
201a84353L9276J00928J15013R0363J5439q9181j49557j10938k891R5572J30656
212E0327R9636K2187o8379j26675j15146l7934O0420J24731J18766M7682m9077
223A26538j19360j23190n6147M1109J09952J18181O7199j8865j02064j31935q2873
234a71455J6486J01701J24205Q0906N09q1320j24645r8990j4373P8911J25094
245C7029J01339K3240o5808j16836j04298l6208N2279J14606J12949M6319m5284
256A19327j08532j11205n5512K9330J01160J18541O7482k3208r7510j15750p3143
267a49020O806Q4724J17615Q5604N254p9582j19001q9451j1695O8088J09815R4664
279A23821K8485n6221j11810j02947l4350N1259J05099J01513M4208l7778j00391
$$ plain form
290 10888 -95863 -149863 -123110 -29755 81066 146899 128878 38165 -71999 -140383 -133099 -56382
302 -56382 50290 131896 141433 70012 -41950 -128132 -139994 -74798 27906 113732 140175 91622
314 91622 -9940 -109055 -145003 -96518 4517 99947 140683 107194 16388 -84321 -139087
325 -139087 -115725 -26932 76825 137526 123490 42922 -60121 -128640 -125579 -54178 46382
336 46382 121719 130123 65998 -35404 -117396 -133936 -76376 21506 104991 130377 84385 -9331
348 -9331 -100372 -136968 -97030 -3998 89253 131657 102376 17973 -76822 -130499 -111769 -30464
360 -30464 66833 126022 116582 43966 -51996 -118893 -119766 -54076 41751 114247 123665 64791 -28977
373 -28977 -106590 -124524 -73972 17330 99164 127507 85625 -3714 -90598 -126348 -92177 -8058
$$ packed form
290A0888j06751n4000K6753R3355J10821O5833j8021r0713j10164o8384P284P6717
302e6382J06672Q1606R537p1421j11962q6182j1862O5196J02704Q5826K6443m8553
314I1622j01562r9115l5948M8485J01035R5430M0736l3489r0806j00709n4766
325a39087K3362Q8793J03757O0701j4036q0568j03043o8519L061P1401J00560
336D6382P5337Q404o4125j01402q1992j6540N7560R7882Q3485K5386m5992r3716
348i331r1041l6596L9938R3032R3251M2404k9281q4403r4795n3677J8730Q1305
360c0464R7297N9189r440p2616r5962o6897q73O5690R5827P2496R418n8874r3768
373b8977p7613j7934N0552R1302Q1834K8343m1882q9339q6884l5750L4171Q4119
$$ plain form
385 -8058 80028 124216 101245 22923 -68508 -121990 -107089 -33113 57607 115523 109909 44010
397 44010 -46167 -111627 -115457 -55312 35239 105165 116489 63522 -24352 -99167 -119482 -74055
409 -74055 11406 90295 119699 83038 874 -81753 -119473 -91119 -12793 71218 115408 96773
421 96773 25727 -60112 -113134 -103161 -35379 51203 108550 105736 46520 -37169 -101578 -110751 -56981
434 -56981 29595 98820 112378 65079 -15629 -86856 -112358 -76722 3335 83158 115136 81547
446 81547 4495 -72276 -109508 -88623 -19793 61475 109624 95209 26467 -55626 -105302 -97440
458 -97440 -37060 43464 100331 101510 46195 -33721 -95426 -105398 -57308 23677 92116 107303
470 107303 61784 -14958 -80595 -104223 -74465 -2871 74528 110745 81236 5117 -69584 -101719
$$ packed form
385h058Q8086M4188k2971p8322r1431n3482J4901P3976R0720N7916n614o5899
397D4010r0177o5460l830O0145R0551O9926J1324n2967q7874p4815k0315M5427
409g4055Q5461P8889K9404l6661q2164q2627l7720K8354P8326Q4011M4190j8635
421I6773p1046q5839n3022R973O7782Q6582N7347k814n9216q3689o4409r173N3770
434e6981Q6576O9225J3558m7299q0708p1227k5502L5636Q0057P9823L1978l3589
446H1547p7052p6771l7232K0885O8830Q1268M8149j4415o8742q2093m9676P862
458i7440O0380Q0524N6867J179n5315p9916o1705r972M8090Q0985O8439J5187
470A07303m5519p6742o5637k3628K9758P1594P7399L6217k9509p6119p4701l2135
$$ plain form
482 -101719 -80794 -20614 51874 101216 95435 32011 -50994 -101540 -92235 -34631 37640 90345
494 90345 97497 51975 -25300 -89145 -101725 -57134 17804 82666 102395 65425 -7356 -74050
506 -74050 -98719 -71011 -6680 63024 101697 83387 14298 -63239 -100169 -79137 -19440 45573
518 45573 88493 88445 38467 -40026 -98024 -95343 -36717 35518 82506 87806 50439 -16785 -80484
531 -80484 -100056 -60031 13751 75930 94899 63960 -869 -66357 -95095 -69957 -6774 58278
543 58278 92636 78577 20830 -51959 -95494 -81246 -20060 47294 85033 80010 37213 -28610
555 -28610 -85333 -94291 -43523 32755 83956 85028 45121 -13746 -68822 -91963 -62550 6854
567 6854 71534 91858 61211 247 -60109 -89385 -69796 -10953 53453 86766 72529 19908
$$ packed form
482a01719K0925O0180P2488M9342n781o3424q3005n0546R305N7604P2271N2705
494I0345P152m5522p7275o3845j2580M4591P4938O4862J9729l6970p2781o6694
506g4050k4669K7708O4331O9704L8673j8310o9089p7537l6930K1032N9697O5013
518D5573M2920m8m9978p8493n7998K681N8626P2235M6988N300l7367o7224o3699
531h0484j9572M0025P3782O2179J8969l0939o4829o5488k8738K5138O3183O5052
543E8278L4358j4059n7747p2789m3535J4248O1186O7354L7739n023m2797o5823
555b8610n6723q958N0768P6278N1201J072l9907n8867n5076k3141K9413O9404
567F854O4680K0324l0647o0964o0356k9276J9589N8843O4406L3313j4237n2621
$$ plain form
579 19908 -44932 -87732 -81866 -27463 42117 84141 77785 31843 -27869 -74834 -85617 -48097
591 -48097 21339 79404 87900 46036 -15828 -65114 -82137 -57147 980 62108 88181 63394
603 63394 4095 -55600 -84533 -66856 -11677 49731 82399 70424 22341 -38141 -80223 -78330
615 -78330 -30858 34936 80044 79065 34789 -25870 -70949 -78812 -46216 12408 67441 85328 52143
628 52143 -11428 -65508 -80475 -53353 -856 52153 79244 63531 10560 -50199 -83227 -67711
640 -67711 -13457 45141 75812 66657 25271 -30992 -74764 -77446 -33134 30455 73770 74608 37303
653 37303 -18792 -66160 -77509 -44444 12832 61357 77005 52218 -2949 -58833 -80190 -53923
665 -53923 885 51307 73345 59250 14078 -42316 -78435 -67849 -15918 42474 72253 63032
$$ packed form
579A9908o4840m2800N866N4403O9580M2024o356m5942n9712m6965j0783L7520
591d8097O9436N8065Q496m1864o1864m9286j7023K4990N8127O1128K6073k4787
603F3394n9299n9695k8933J7677N5179O1408L2668j1975m8083o0482m2082J893
615g8330M7472O5794M5108r79m4276o0659m5079p863L2596N8624N5033J7887l3185
628E2143o3571n4080j4967K7122N2497N3009K7091j5713n2971o0759l3028J5516
640f7711N4254N8598L0671r155m1386n6263m3772k682M4312O3589M3315Q38l7305
653C7303n6095m7368j1349L3065N7276M8525J5648k4787n5167n5884k1357K6267
665e3923N4808N0422K2038j4095m5172n6394l6119J0586N1931N8392K9779r221
$$ plain form
677 63032 25155 -25533 -68368 -76130 -35603 28181 69738 68110 34812 -12030 -57652 -77528
689 -77528 -50160 11386 62602 72173 44546 -711 -46927 -73803 -59897 -6947 50246 74187
701 74187 55717 11107 -37177 -68365 -64835 -23167 33897 70293 64651 24959 -24066 -61405
713 -61405 -69271 -37705 19947 65281 68269 34252 -10715 -48985 -68988 -53022 1594 59894
725 59894 76318 43865 -4849 -41966 -61450 -56530 -17488 40849 76708 61292 9464 -40151
737 -40151 -62285 -55180 -23749 22875 63006 67799 29702 -25383 -61922 -62843 -33023 13715 55868
750 55868 67652 38688 -11352 -50838 -63251 -46860 -4049 48284 74078 50489 -3064 -46182
762 -46182 -59364 -47964 -17091 28999 67730 65581 17583 -39564 -65233 -51938 -17938 20222
$$ packed form
677F3032l7877n0688m2835p762M0527O3784M1557j628l3298m6842m5622j9876
689g7528K7368O1546N1216R571k7627m5257m6216k6876J3906N2950N7193K3941
701G4187j8470m4610m8284l1188L530M1668N7064L6396n642l9692m9025l7339
713f1405p866L1566N7652M5334K988l4017m4967l8270k0003J5966N4616N8300
725E9894J6424l2453m8714l7117j9484M920L9042N8337L5859j5416n1828m9615
737d0151k2134P105L1431M6624M0131M793l8097n5085l6539r21K9820M6738M2153
750E5868J1784k8964n0040l9486j2413J6391M2811N2333K5794k3589n3553m3118
762d6182j3182J1400L0873M6090L8731k149m7998n7147k5669J3295L4000L8160
$$ plain form
774 20222 52695 63085 36224 -17989 -61804 -63964 -29403 15475 49398 60766 41274 -3835
786 -3835 -48481 -63893 -42926 -1389 41166 64867 52519 6604 -43159 -63042 -46696 -11028
798 -11028 27328 56304 59304 24908 -29650 -65456 -57765 -18083 23951 49731 53918 33125 -10316
811 -10316 -54151 -65871 -34984 14326 49503 55967 37159 -62 -41380 -62536 -45781 -2323
823 -2323 39510 58489 48464 12251 -33797 -61506 -51514 -11752 29809 52893 51229 25006 -18776
836 -18776 -56674 -60161 -24820 23230 52390 51521 28155 -7825 -43799 -60163 -40062 7551 48989
849 48989 57916 35267 -1424 -36700 -55972 -45630 -6973 36510 56899 45314 11328 -28678
861 -28678 -55560 -51951 -16533 27924 52826 48070 21030 -16540 -49060 -56989 -29764 17343 52154
$$ packed form
774B0222L2473J0390k6861n4213m3815k160L4561M4878L3923J1368j9492m5109
786c835m4646j5412K0967M1537M2555K3701j2348m5915m9763j9883J6346L5668
798a1028L8356K8976L000l4396n4558l5806P691L9682M2034K5780M187k0793m3441
811a0316m3835j1720L0887M9310L5177O464j8808l7221m1318k1156J6755M3458
823b323M1833J8979j0025l6213m6048k7709R992L9762M1561K3084j664k6223m3782
836a8776l7898l487L5341M8050K9160q69k3366l5980l5974j6364K0101M7613M1438
849D8989Q927k2649l6691l5276j9272J0342L8657M3483K0389j1585l3986m0006
861b8678k6882L609L5418M4457K4902m756k7040l7570l2520p929K7225M7107L4811
$$ plain form
874 52154 53593 26542 -10129 -40760 -53252 -38519 1280 43320 58626 37940 -1725 -36385
886 -36385 -51382 -41723 -9330 31390 54975 46038 11321 -27253 -50858 -48098 -18344 23194 51151
899 51151 48969 20470 -16690 -45307 -51535 -29278 11861 46896 53416 29207 -8873 -40161 -50594
912 -50594 -35418 -336 36999 54446 39518 1744 -35047 -50542 -39752 -9182 27248 50519
924 50519 45283 13448 -25500 -49051 -45658 -18113 19388 46879 48355 22542 -15144 -44110 -49395
937 -49395 -27753 9587 41990 50701 31100 -4993 -37992 -50216 -35000 -474 34293 50195
949 50195 38173 5081 -30714 -49344 -40190 -9459 26152 47566 43204 14752 -22209 -46665
961 -46665 -44651 -18201 17523 43940 46378 23486 -12673 -41866 -47769 -27114 8491 39078 47702
$$ packed form
874E2154J439k7051l6671l0631j2492J4733L9799M2040J5306k0686l9665l4660
886c6385j4997R659L2393M0720K3585q937l4717l8574k3605K760K9754M1538K7957
899E1151k182k8499l7160k8617o228K2257M1139L5035O520k4209l8080l1288j0433
912e0594J5176L5082L7335J7447j4928l7774l6791j5495J0790L0570L6430K3271
924E0519n236l1835l8948k3551L393K7545L7501K7491J476k5813l7686k8966n285
937d9395K1642L7340L2403Q711j9601l6093l2999j2224J5216L4526L4767J5902
949E0195j2022l3092l5795j8630R154L0731L5611K1414m362k8452l6961k4456
961d6665K014K6450L5724K6417K438k2892l6159k9193n903K0655L5605L0587Q624
$$ plain form
974 47702 30366 -3158 -34942 -48082 -34718 -1510 32324 47693 36437 6121 -27616 -46464
986 -46464 -40089 -11194 23791 45354 41865 15515 -19500 -43844 -43825 -19859 14934 40971 44892
999 44892 24236 -9775 -38944 -46285 -27707 5895 35709 45918 31052 -688 -31907 -45738
1011 -45738 -34553 -3686 29355 45887 36515 7426 -25099 -43665 -38676 -12688 21143 43389
1023 43389 41366 16196 -17318 -40893 -42103 -20249 12466 38418 43534 24411 -8189 -36399
1035 -36399 -44132 -27671 3803 32790 43727 30706 873 -29627 -43994 -34147 -5225 26378
1047 26378 43084 35896 9057 -22350 -41538 -38272 -13976 18395 40912 40301 17069 -14740 -38040
1060 -38040 -40642 -21323 9787 36124 42575 25045 -6287 -33537 -42015 -27525 1765 30181
$$ packed form
974D7702j7336l3524l1784j3140J3364L3208L3834J5369j1256l0316l3737j8848
986d6464O375K8895L4985K1563l489k6350l5015k4344J9K3966L4793K6037L921
999D4892k0656l4011k9169p341J8578L3602K9814J0209j4866l1740l1219j3831
1011d5738J1185L0867L3041J6532r372k9089l2525j8566M989K5988L3831K2246
1023D3389k023k5170l3514k3575j210K1854L2715K5952N116j9123l2600k8210
1035c6399p733J6461L1474K8987J0937j3021k9833l0500j4367R847K8922L1603
1047B6378J6706p188k6839l1407j9188L266K4296L2371K2517o11k3232l1809k3300
1060c8040k602J9319L1110K6337O451j7530l1332k7250q478J4490K9290K8416
$$ plain form
1072 30181 42430 30952 2595 -27230 -41818 -33272 -6593 23875 40872 35328 10512 -19917
1084 -19917 -39357 -37486 -14986 16073 38174 38777 17893 -12369 -35645 -39437 -22004 7408 33419
1097 33419 40756 24853 -4674 -30938 -40098 -27508 3 27535 40262 30700 3716 -25242
1109 -25242 -39778 -32016 -7226 21315 38515 34818 11865 -17796 -37713 -36417 -14661 14571
1121 14571 35358 36937 18715 -9839 -33431 -38480 -22149 6641 31359 38467 24596 -2458
1133 -2458 -28388 -38831 -27558 -1257 25200 38039 30199 5651 -22737 -38327 -32066 -8064
1145 -8064 19434 35522 32942 13291 -14317 -35545 -36606 -15783 13665 33544 34528 18035 -7313
1158 -7313 -29920 -37282 -23132 5072 30090 37078 23565 -1520 -25585 -36399 -27502 -2621 23690
$$ packed form
1072C0181J2249j1478k8357k9825j4588Q546K6679L0468J6997n544k4816l0429
1084a9917j9440J871K2500L1059K2101O03k0884l0262k3276l792J7433K9412K6011
1097C3419P337j5903k9527k6264r160J2590K7511K7532J2727r562k6984k8958
1109b5242j4536P762K4790K8541J7200l697k2953k9661j9917J296K1756K9232
1121A4571K0787J579j8222k8554k3592n049J6331K8790K4718P108j3871k7054
1133b458k5930j0443J1273K6301K6457J2839p840k4548k8388j5590O261K4002
1145h064K7498J6088k580j9651k7608k1228j061K0823K9448J9879R84j6493k5348
1158g313k2607p362J4150K8204K5018O988j3513k5085k4065j0814Q897K4881K6311
$$ plain form
1171 23690 36104 29016 6507 -19805 -36114 -32290 -9279 18698 34379 30729 12263 -11920
1183 -11920 -31539 -35645 -18275 11754 34208 34351 15654 -7711 -26341 -33745 -24228 1560 28610
1196 28610 37693 23616 -2320 -24316 -33321 -26070 -4814 20816 35361 29247 6689 -18229 -33483
1209 -33483 -30992 -10951 16222 33621 30710 11390 -11645 -28175 -32468 -19646 7447 32398
1221 32398 35876 16425 -9181 -25499 -29344 -22041 -1992 23567 37689 26161 -2012 -25319
1233 -25319 -31613 -23033 -4991 16937 32746 30005 8149 -18126 -32602 -28596 -10506 13716 31297
1246 31297 31247 12536 -12191 -28222 -29233 -17009 5045 27837 35680 19735 -8618 -28136 -28937
1259 -28937 -17642 -696 19155 33532 27914 1853 -25351 -33587 -21752 -2230 16012 28470
$$ packed form
1171B3690J2414p088k2509k6312j6309L824K3011K7977J5681l650j8466k4183
1183a1920j9619m106J7370L0029K2454J43j8697k3365j8630p404R517K5788K7050
1196B8610R083j4077k5936k1996r005P251K1256K5630J4545o114k2558k4918j5254
1209c3483K491K0041K7173J7399k911j9320k3035j6530m293J2822K7093K4951
1221C2398L478j9451k5606j6318l845P303K0049K5559J4122j1528k8173k3307
1233b5319o294Q580J8042K1928J5809k741k1856k6275j4476M006J8090K4222J7581
1246C1297n0j8711k4727j6031j011J2224K2054K2792P843j5945k8353j9518q01
1259b8937J1295J6946J9851J4377n618k6061k7204q236J1835J9522J8242J2458
$$ plain form
1271 28470 28198 10174 -16179 -32537 -28411 -9155 13117 28609 29288 13603 -10836 -28511 -29109
1284 -29109 -14496 6083 24259 31800 20951 -5064 -28039 -31061 -16253 3084 18646 28068
1296 28068 25198 5142 -22109 -34442 -23411 -270 18130 26370 24206 9764 -13049 -30379
1308 -30379 -28912 -9486 13971 27912 27001 12648 -8821 -26585 -29377 -14933 7131 24078 28884
1321 28884 18722 -2663 -24552 -31593 -18706 3719 20853 26597 21118 4706 -17694 -31746
1333 -31746 -25171 -2423 19112 27207 22067 7522 -11724 -27055 -27895 -10736 12897 27701 26234
1346 26234 11303 -8607 -24274 -27810 -15481 6144 24257 28171 16618 -3287 -21563 -28868
1358 -28868 -19795 1341 21119 27743 19528 2416 -16418 -28010 -24243 -5078 17336 27778 22476
$$ packed form
1271B8470k72j8024k6353j6358M126J9256K2272J5492O79j5685k4439j7675n98
1284b9109J4613K0579J8176P541j0849k6015k2975l022J4808J9337J5562R422
1296B8068k870k0056k7251j2333J1031K3141J8400Q240k164j4442k2813j7330
1308c0379J467J9426K3457J3941r11j4353k1469j7764k792J4444K2064J6947M806
1321B8884j0162k1385k1889p041J2887K2425J7134N744n479j6412k2400j4052
1333c1746O575K2748K1535Q095n140j4545j9246j5331q40J7159K3633J4804j467
1346B6234j4931j9910j5667l536J2329K1625J8113L914j1553j9905j8276p305
1358b8868R073K1136J9778O624q215j7112j8834j1592L767J9165K2414J0442n302
$$ plain form
1371 22476 6411 -12015 -24973 -25687 -11186 10671 26128 26036 11569 -8139 -23125 -26054 -15291
1384 -15291 4491 22514 27870 16920 -3351 -20636 -26463 -18585 -448 18591 27514 20426 2129
1397 2129 -16855 -26344 -21773 -4929 14765 26151 22561 7006 -11794 -24702 -24223 -9994 10215
1410 10215 24361 24552 11437 -7515 -22427 -25148 -14199 4688 21128 26087 16352 -2700 -20315
1423 -20315 -25905 -16833 536 17050 25349 20242 3231 -16423 -26563 -20889 -3868 14645 24193
1436 24193 21207 7376 -10633 -23725 -24118 -9979 10355 23872 23196 10478 -6414 -20236 -24224
1449 -24224 -14855 3942 20627 25042 15468 -1971 -18346 -25052 -17467 -183 16545 24128 18719
1462 18719 3790 -14056 -24946 -21503 -4959 13832 23701 20177 6719 -9555 -21727 -22898 -10985
$$ packed form
1371B2476j6065j8426j2958p14J4501K1857J5457r2j4467j9708j4986k929J0763
1384a5291J9782J8023N356j0950k0271j7285n827P878J8137J9039Q923p088j8297
1397B129j8984r489M571J6844J9694J1386l590j5555j8800j2908M79J4229K0209
1410A0215J4146J91j3115j8952j4912k721J0949J8887J6440M959r735j9052j7615
1423b0315n590R072J7369J6514Q299n107j7011j9654j0140N674J7021J8513R548
1436B4193k986j3831j8009j3092l93J4139K0334J3517o76j2718j6892j3822l988
1449b4224R369J8797J6685M415r574j7439j6375o706P585J7284J6728P583n409
1462A8719j4929j7846j0890L443J6544J8791R869l524j3458j6274j2172j171J1913
$$ plain form
1475 -10985 8510 23259 23457 10128 -6936 -19049 -22102 -14348 2329 19171 24759 15366 -1947
1488 -1947 -17126 -23101 -17059 -1354 15649 23613 18179 3388 -12755 -22749 -20612 -6365 12165
1501 12165 23279 20455 6599 -9478 -20353 -21319 -10891 6341 21122 23500 11469 -6431 -19294
1514 -19294 -21233 -13071 1622 16745 23470 16175 -965 -16565 -22227 -16264 -1908 13804 22554
1527 22554 18298 3901 -12048 -21152 -19397 -7103 10369 21979 20509 7343 -8864 -19519 -20193
1540 -20193 -10357 5457 19005 22202 12411 -4820 -18590 -21005 -12443 1694 15180 21456 16046
1553 16046 530 -15444 -21892 -15881 -1994 12686 20913 17902 4459 -11239 -20409 -18601 -6895
1566 -6895 8871 20298 19937 8180 -8024 -18979 -19487 -10006 4884 17706 20983 12225 -3531
$$ packed form
1475a0985J9495J4749J98j3329j7064j2113l053P754J6677J6842N588r393j7313
1488a947j5179n975O042J5705J7003P964n434j4791j6143r994K137J4247J8530
1501A2165J1114k824j3856j6077j0875r66J0428J7232J4781K378j2031j7900j2863
1514a9294j939Q162J4693J5123O725p295j7140j5600n662N963J4356J5712Q750
1527B2554m256j4397j5949r104J755J2294J7472J1610j470j3166j6207j0655o74
1540b0193R836J5814J3548L197r791j7231j3770k415Q562J4137J3486O276n410
1553A6046j5516j5974o448O011J3887J4680Q227l011j3443j5698r170J808J1706
1566f895J5766J1427l61j1757j6204j0955n08R481J4890J2822L277q758j5756
$$ plain form
1579 -3531 -17211 -20639 -12716 1852 14761 20337 15075 1105 -14061 -21007 -15735 -2150 12221
1592 12221 19750 17067 4738 -10438 -19685 -17848 -6316 8333 18793 18845 8088 -7183 -18271
1605 -18271 -18904 -9680 4669 16759 19825 11603 -3156 -15986 -19687 -12523 1322 14245 19592
1618 19592 14157 1006 -13099 -19705 -15231 -2383 11347 18842 16201 4781 -9513 -18773 -17263
1631 -17263 -6146 8078 17594 17731 8206 -6169 -17017 -18480 -9482 4282 15638 18809 11343
1644 11343 -2616 -14971 -18715 -12313 640 13102 18713 14046 1343 -12107 -18859 -14756 -2706
1657 -2706 10464 17855 15514 4980 -8653 -17660 -16729 -6216 7574 16846 16759 7856 -5238 -15925
1671 -15925 -17740 -9454 4064 15173 17793 10759 -2100 -13861 -17875 -11773 644 12514 17754
$$ packed form
1579c531j3680l428P923J4568J2909N576n262j3970j5166o946N272J3585J4371
1592A2221P529k683j2329j5176r247J837J1532J4649J0460N2j0757j5271j1088
1605a8271o33R224J4349J2090L066q222j4759j2830l701P164J3845J2923N347
1618A9592n435j3151j4105o606M474J2848J3730P495k641j1420j4294r260J510
1631a7263J1117J4224R516J37r525j4375j0848j463Q998J3764J1356L171p466
1644A1343j3959j2355l744O402J2953J2462N611m667j2703j3450o752M103J2050
1657b706J3170P391k341j0534j3633r007R31J0513J3790R272q7q903j3094j0687
1671a5925j815Q286J3518J1109K620p034j2859j1761m014O102J2417J1870N240
$$ plain form
1684 17754 13347 1325 -11366 -17722 -14126 -2702 9925 17029 14865 4507 -8202 -16685 -15847
1697 -15847 -6153 6870 16098 16163 7490 -5147 -14938 -16808 -9306 3647 14298 17069 10422 -1964
1711 -1964 -12963 -16823 -11579 99 11759 17132 12605 1371 -10590 -16611 -13357 -3107 9049
1724 9049 16270 14382 4470 -7749 -15602 -14946 -6132 6094 15037 15516 7416 -4822 -14289 -15837 -8697
1739 -8697 3075 13179 16127 9985 -1740 -12209 -16117 -11124 2 11148 16186 12211 1541
1752 1541 -9842 -15749 -12937 -2847 8461 15493 13836 4489 -7251 -15033 -14396 -5808 5836 14318
1766 14318 14742 7240 -4276 -13393 -15240 -8611 2737 12679 15316 9616 -1142 -11582 -15266 -10838
1780 -10838 -28 10434 15067 11552 1690 -9168 -15075 -12692 -3160 8040 14596 12993 4323 -6383
$$ packed form
1684A7754m407j2022j2691o356L596J1424J2627P104k164j0358j2709q483Q38
1697a5847R694J3023R228O5q673j2637r791j870P502J2953J0651K771o647j2386
1711a964j0999l860N244J1678J1660N373m527j1234j1961o021L254J0250J2156
1724I049P221j888r912j2219p853O56Q814J2226Q943M79q100j2238r467j548P140
1739h697J1772J0104K948o142j1725j0469l908M993J1126J1146N038l975j0670
1752A541j1383n907K812J0090J1308P032j657r347j1740p782O37Q588J1644Q482
1766A4318M24p502j1516r117j847O629J1348R942K637n700j0758j0440l684M428
1780a0838J0810J0462M633l515r862j0858n907K383R532J1200O556j603q670j0706
$$ plain form
1794 -6383 -13896 -13882 -5967 5268 13504 14007 6826 -3819 -12379 -14211 -8474 2376 11887 14649 9161
1809 9161 -1038 -10650 -14511 -10513 -637 9946 14574 11033 1712 -8332 -13879 -12123 -3399 7513
1823 7513 14098 12553 4108 -6163 -12818 -12937 -6041 4440 13128 13793 6770 -3829 -11867 -13204 -7832
1838 -7832 1788 10965 14065 8969 -914 -10214 -13752 -9946 -631 9160 13838 10616 1540 -8144 -13198
1853 -13198 -11357 -3335 6632 13415 12356 3921 -6065 -12291 -11977 -5475 3998 11678 13249 6881 -3482
1868 -3482 -11621 -12825 -7226 1813 10012 13109 8942 -275 -9581 -13376 -9322 -633 8427 12856 10396
1883 10396 1995 -7487 -12798 -10784 -3085 6256 12198 11692 4524 -5428 -12113 -11844 -5061 3949 10906
1898 10906 12131 6864 -2640 -10870 -12757 -7376 1788 9622 12099 8388 -43 -8612 -12718 -9448 -702
$$ packed form
1794f383p513J4P915J1235Q236N03p181j0645q560j832N737J0850R511K762n488
1809I161j0199r612l861L998R876J0583M628l541r321j0044n547J756Q724J0912
1823G513O585j545q445j0271o655j19O896J0481Q688O65p023j0599q038j337N372
1838g832R620R177L100n096r883r300l538L806R315R791M678l222r076r684n054
1853a3198J841Q022R967O783j059q435r986o226L14O502R473P680J571o368j0363
1868c482q139j204N599R039Q199L097m167r217r306l795M054Q689R060M429k460
1883A0396q401r482n311K014P699R341N942n06p168r952o685K69O783R010O957
1898A0906J225n267r504q230j887N381R164P834K477l711q431q569m106L270Q746
$$ plain form
1913 -702 7938 12217 9666 2332 -6758 -12176 -10752 -3019 6039 11317 10695 4420 -4319 -11245 -11926 -5376
1929 -5376 4240 10713 11219 5993 -1945 -9291 -12116 -7735 1303 9741 12104 7640 -420 -7815 -11383
1944 -11383 -9164 -1513 7357 11996 9561 1807 -6327 -11137 -9900 -3367 5565 11223 10088 3911 -4001
1959 -4001 -9982 -11270 -5643 3482 10583 10965 5274 -2354 -8370 -10673 -7788 302 8907 12139 7552
1974 7552 -1024 -7884 -10144 -7997 -1827 6054 11393 9762 1952 -6575 -10704 -9060 -3096 4627 10321
1989 10321 10167 4078 -4051 -9649 -10069 -5488 2611 9864 11195 5525 -2610 -8399 -9612 -6674 -155
2004 -155 7538 11554 8053 -630 -8046 -10105 -7008 -1216 5290 10076 9511 2608 -6097 -10821 -8804
2019 -8804 -2564 4403 9205 9487 4293 -3700 -9362 -9682 -4876 2378 8716 10411 5740 -2291 -8414
$$ packed form
1913g02Q640M279k551p334r090n418J424P733R058N278o22o275q739o926o81O550
1929e376R616O473N06n226p938p346k825M381R038Q438K363m464q060p395l568
1944a1383K219P651Q870M639k435p754q134m810J237O533Q932N658j135o177p912
1959d001n981j288N627R125P101L82n691p628o016k303K885Q090Q605L232m587
1974G552q576o860k260K147O170P881N339j631p810q527m129J644N964P723N694
1989A0321j54o089q129n598m20M581Q099P253J331n670q135n789j213K938O519
2004a55P693M016l501q683p416k059L097N792O506M786n65o903q705m724K017
2019h804O240O967M802K82n194p993n662l20M806P254O338J695m671q031o123
$$ plain form
2034 -8414 -9459 -5672 190 6661 10167 7980 432 -7381 -10279 -6934 -556 5405 9019 8217 2985
2049 2985 -4851 -10271 -8988 -2502 4741 8870 8583 4173 -2715 -8694 -9580 -4852 2374 7999 9434
2064 9434 5652 -1534 -7795 -9528 -5816 565 6325 9150 7192 824 -6273 -9898 -7355 -817 5642
2079 5642 8621 7323 2561 -3954 -8914 -8885 -3382 4251 8784 8090 3504 -2434 -7583 -8917 -5102 2106
2095 2106 7796 8918 5289 -1119 -6812 -8995 -5927 498 6419 8690 6434 757 -5560 -8946 -7321
2110 -7321 -1287 5199 8566 7278 2150 -3845 -7822 -7905 -3469 3198 8407 8259 3429 -2772 -7079 -7898
2126 -7898 -4912 1386 7137 8578 5089 -1030 -6470 -8336 -5828 -75 5756 8307 6250 809 -5125
2141 -5125 -8213 -6810 -1563 4542 8012 7008 2196 -3916 -7600 -7155 -3138 2559 7506 7967 3748
$$ packed form
2034h414j045L787N862O471L506k187p548p813k898L345O378N961L614q02n232
2049B985p836n420J283O486P243M129k87m410o888n979q86M728P226N625J435
2064I434l782p186o261j733L712O381N760K825j958o368p097l625K543O538O459
2079E642K979j298m762o515m960K9N503P633M533o94m586n938n149j334L815P208
2095B106N690J122l629o408n693k183L068O425N921K271k256n677o317l386J625
2110g321O034O486L367j288n128n995l977q3M436O667N209j48m830o201m307q19
2126g898K986O298N751J441l489o119n440j866K508N753N831K551k057n441n934
2141e125l088J403N247O105L470j004m812o112l684M45M017N697M947M61m219
$$ plain form
2156 3748 -2497 -7018 -7330 -4276 1063 6339 8084 5226 -876 -6225 -7803 -5269 -86 5298 7892
2171 7892 6139 826 -4877 -7695 -6405 -1609 4147 7542 6610 2367 -3414 -7329 -6898 -2763 2679
2186 2679 6676 7189 3819 -2205 -6674 -7260 -3979 1204 5948 7400 4837 -677 -5803 -7474 -5167
2201 -5167 -73 4875 7543 5766 854 -4463 -7361 -6012 -1463 3865 6982 6324 2108 -3283 -6664
2216 -6664 -6712 -2591 2681 6429 6665 3238 -1768 -5954 -6931 -3866 1264 5624 6869 4525 -467 -5208
2232 -5208 -6973 -4857 -174 4573 6911 5554 938 -4177 -6933 -5553 -1392 3522 6532 5927 1910
2247 1910 -3020 -6397 -6200 -2686 2507 6039 6269 2843 -1795 -5627 -6615 -3685 1286 5386 6405 3966
2263 3966 -597 -4879 -6621 -4592 -102 4372 6463 4916 779 -3917 -6468 -5225 -1175 3558 6222
$$ packed form
2156C748o245m521l12L054N339N276J745k858o102n349j578K534N183N384K594
2171G892j753n313n703k818J290M796N756L395r32m243n781l915M31M135N442
2186B679L997N13l370o024m469n86L281N183M744J452k563n514n126j671K307
2201e167N094M948K668j777m912n317k898J349M549N328L117o58m216n391l381
2216f664m8M121N272L748K36l427n006m186r77L065N130M360J245k344m992m741
2232e208j765K116M683M747K338j357m616n115k756J380M161M914L010o05m017
2247A910m930l377J97L514N193L532K30l426m638l832r88K930M971M100J019k439
2263C966m563m282j742K029M490M474K091j547m137m696k551J243M050M733K664
$$ plain form
2278 6222 5582 1887 -2780 -5996 -5872 -2367 2454 5748 6018 2855 -1750 -5191 -5956 -3651 1099 5173
2294 5173 6179 3700 -517 -4409 -6028 -4434 -174 4234 6049 4459 693 -3675 -5992 -4877 -1402
2309 -1402 3147 5896 5127 1661 -2715 -5672 -5408 -2410 2224 5202 5745 2675 -1576 -4947 -5763 -3281
2325 -3281 942 4808 5788 3580 -610 -4234 -5653 -4043 -151 3902 5840 4383 457 -3435 -5345
2340 -5345 -4573 -1236 3039 5571 5064 1752 -2555 -5218 -5219 -2128 1988 4937 5348 2746 -1523 -4773
2356 -4773 -5341 -3124 863 4304 5472 3339 -515 -4148 -5365 -3740 -122 3526 5334 4226 469
2371 469 -3387 -5218 -4365 -1246 2691 5087 4678 1730 -2482 -5093 -4766 -1936 1904 4724 4955 2788
2387 2788 -1202 -4339 -5049 -2836 956 4144 5014 3359 -301 -3678 -5047 -3655 -223 3497 4990
$$ packed form
2278F222o40l695m667l216J24L505M821L294K70l163m605l441p65K305M750M074
2294E173J006k479m217l892j619J594M260M408J815j590l766m368k317J115L475
2309a402M549K749p69l466m376k957K64K998M634K978N43l070m251l371q16K482
2325c281M223L866R80k208m190l624j419J610L892M053J938j457l926l892j910
2340e345P72L337M275K532n07l312m307k663jL091M116K949M11k602m269l250
2356d773n68K217L987L441J168k133l854l633j217J625L618L648J808j108l757
2371D69l856j831Q53L119L937K396m09k948m212k611L27K830L840K820K31k167
2387B788l990l137p10K213L792L188Q70j655l660l377j369J392L432L720J493
$$ plain form
2402 4990 3942 873 -2917 -4994 -4225 -1206 2455 4788 4362 1720 -2125 -4563 -4729 -1960 1706 4254
2418 4254 4720 2365 -1118 -4089 -4840 -2928 793 3904 4766 3146 -307 -3421 -4795 -3461 -150 3161
2434 3161 4834 3671 625 -2667 -4475 -3955 -1234 2387 4610 4123 1746 -1829 -4323 -4285 -1903 1433
2450 1433 4106 4410 2298 -971 -3842 -4414 -2748 617 3674 4586 2931 -277 -3166 -4433 -3386 -393
2466 -393 2937 4572 3619 490 -2637 -4262 -3499 -1128 1993 4278 4066 1457 -1930 -4216 -3853 -1672
2482 -1672 1304 3678 4088 2255 -962 -3603 -4276 -2538 447 3374 4282 2847 -214 -3010 -4048 -3004
2498 -3004 -365 2441 4321 3571 625 -2620 -3970 -3269 -921 1719 3584 3879 1701 -1619 -3926 -3816
2514 -3816 -1580 1250 3458 3783 2268 -638 -3259 -3988 -2448 437 2926 4012 2768 -129 -2880
$$ packed form
2402D990j048l069l790k077P69L019L661K333m26k642l845k438j66K769L666K548
2418D254M66k355l483k971p51J912L721L111Q62j620l453l114j374J334L311L311
2434C161J673j163l046l292j808N20K721L621K223m87k377l575k494L8K382L336
2450A433K673L04k112l269k871n72J666L365L057R12j655l208k889j267J047K993
2466c93L330J635r53l129l127j625P63K371L121K285k12k609l387k286L63K181
2482a672K976K374M10j833l217k641o73J738K985K927R08j435l061k796j038J044
2498c004K639K806J880p50k946l245j350P01K348K640J865K95k178l320k307J10
2514c816K236K830K208L25j515k906k621p29J540K885K489J086j244k897k751
$$ plain form
2529 -2880 -3850 -2875 -511 2279 3702 3333 918 -2291 -3883 -3296 -863 1735 3308 3394 1526 -1210
2545 -1210 -3672 -3716 -1666 1321 3278 3543 1922 -581 -2971 -3707 -2480 429 2843 3767 2660 56
2561 56 -2448 -3542 -2722 -467 2084 3440 3119 906 -1911 -3623 -3220 -733 1734 3231 3099 1391
2577 1391 -1109 -3103 -3451 -1713 1193 3168 3351 1774 -622 -2694 -3363 -2254 176 2533 3456 2581
2593 2581 -3 -2464 -3370 -2554 -382 1967 3074 2733 979 -1645 -3221 -3002 -845 1619 3022 3015 1246
2610 1246 -1084 -2875 -3128 -1467 819 2771 3301 1881 -633 -2482 -3052 -2113 119 2200 3176 2546
2626 2546 189 -2097 -3155 -2246 -276 1834 2973 2568 724 -1554 -3148 -2760 -930 1418 2845 2672
2642 2672 1200 -939 -2708 -2957 -1570 783 2509 2923 1679 -452 -2352 -3098 -1894 284 2053 2856
$$ packed form
2529b880r70R75K364K790J423l69k415l209j592N87K433K598J573Q6j868k736
2545a210k462m4K050K987J957K65j621k503k390p36J227K909K414R24j107k604
2561E6k504j094Q20K255K551J356l21k213k817j712M03K487K467J497j32j708
2577A391k500j994l48J738K906J975J83j577k396k072o69J109K430K357R23q75
2593B581k584k461r06Q16K172K349J107l41j754k624j576K19K157K464J403pj769
2610A246k330j791k53J661K286J952N30j420k514j849n70R39K232K081R76o30
2626B546k357k286j058R09J970K110J139m05j844k278j594L88J830K348J427j73
2642B672j472k139j769k49J387K353J726M14j244k131j900p46J204K178J769Q03
$$ plain form
2658 2856 2067 143 -1910 -3015 -2258 -199 1800 2732 2384 656 -1355 -2915 -2732 -837 1316 2616
2674 2616 2482 1178 -826 -2522 -2850 -1609 837 2515 2577 1445 -317 -2159 -2782 -1786 188 2166
2690 2166 2776 1826 -9 -1856 -2675 -2247 -294 1743 2825 2271 582 -1272 -2563 -2399 -852 1160
2706 1160 2670 2454 973 -949 -2309 -2504 -1440 548 2396 2515 1373 -382 -2015 -2560 -1820 80
2722 80 2036 2671 1723 -73 -1749 -2451 -2047 -307 1541 2640 2198 534 -1297 -2329 -2158 -704 1079
2739 1079 2451 2321 947 -809 -2081 -2269 -1120 652 2178 2417 1345 -466 -1880 -2252 -1476 99
2755 99 1763 2519 1773 -95 -1619 -2280 -1814 -374 1355 2386 1918 489 -1304 -2309 -2004 -639 971
2772 971 2160 2086 919 -929 -2116 -2196 -1168 664 1933 2227 1296 -393 -1907 -2251 -1406 28 1529
$$ packed form
2658B856p89j924k053j105P57K059J999R32l48j728k011j560J83J895K153J300
2674B616j34j304k004j696l28J241K446J678O2j132j762j842o23R96J974J978
2690B166O10r50j835j847q19M28J953K037J082n54j689j854j291J64J547K012
2706A160J510k16j481j922j360j95J064J988J848J19j142j755j633n45P40J900
2722H0J956O35r48j796j676p02M04J740J848J099m42j664j831j032J71J454J783
2739A079J372j30j374j756j272j88J149J772J526K39j072j811j414l72P76J575
2755I9J664P56p46j868j524o61M66J440J729J031m68j429j793j005L05J365J610
2772I71J189p4j167j848j187q0J028J832J269K94r31j689j514l44Q45J434J501
$$ plain form
2789 1529 2306 1668 110 -1616 -2265 -1631 -129 1265 2253 1922 427 -1188 -2142 -1838 -474 1024 1968
2806 1968 2064 844 -706 -1932 -1943 -1014 607 1899 2088 1199 -371 -1788 -2111 -1398 218 1533 2085
2823 2085 1588 120 -1551 -2128 -1548 -224 1102 2056 1764 440 -1212 -2017 -1800 -619 783 1881 2011
2840 2011 825 -619 -1798 -1844 -866 636 1616 1902 1133 -413 -1566 -1928 -1267 103 1456 1984 1332
2857 1332 -32 -1324 -1957 -1532 -253 1199 1762 1661 391 -1000 -1939 -1724 -416 981 1740 1722 705
2874 705 -856 -1924 -1857 -744 632 1669 1685 989 -426 -1603 -1790 -1030 183 1480 1848 1178 -20
2891 -20 -1312 -1715 -1182 -149 1190 1817 1458 444 -958 -1815 -1476 -398 994 1624 1441 561 -593 -1595
2909 -1595 -1658 -688 735 1638 1621 805 -534 -1445 -1508 -863 308 1296 1719 1096 -145 -1304 -1693 -1134 64
$$ packed form
2789A529P77o38j558j726o49O34J502J394R88l31j495j615r54L04J364J498R44
2806A968R6j220j550j226j1R29J621J292J89q89j570j417l23P13J616J315N52
2823B085m97j468j671n77N80J324J326R54k92j324j652q05K17J181J402J098J30
2840B011j186j444j179m6R78J502R80K86p69j546j153l62O61J370J353N28o52
2857A332j364j292o33M25J279J452N63j01j270j391r39K15J308J397P59j8j017
2874G05j561j068O7J113J376J037J6o96j415j177j87P60J213J297L68o70j198
2891b0j292m03N33J033J339O27l59j014j402q57L39J078J392O30j83q80j154j002
2909a595o3R70J423R03j7q16j339r11o3O45J171R88M23o23j241j159l89N59J198
$$ plain form
2928 64 1251 1550 1272 283 -1025 -1701 -1481 -356 958 1592 1371 395 -798 -1524 -1468 -612 547 1520 1473
2947 1473 694 -430 -1551 -1476 -851 291 1301 1544 883 -206 -1251 -1642 -949 161 1140 1426 1063 142
2965 142 -976 -1546 -1174 -203 940 1561 1315 273 -808 -1450 -1404 -565 694 1356 1399 580 -558 -1425 -1373
2984 -1373 -627 532 1141 1408 804 -235 -1198 -1414 -1061 186 1085 1516 913 -9 -860 -1447 -1132 -132
3002 -132 928 1318 1152 269 -780 -1395 -1153 -332 682 1422 1296 382 -586 -1335 -1175 -476 537 1246 1373
3021 1373 684 -329 -1159 -1379 -749 238 1143 1311 807 -88 -886 -1263 -989 -32 1154 1299 994 139 -857
3040 -857 -1352 -1100 -316 632 1353 1077 346 -713 -1185 -1137 -400 464 1257 1185 513 -474 -1162 -1220 -641 147 1180
3061 1180 1256 654 -265 -971 -1252 -796 83 962 1267 794 30 -840 -1222 -952 -182 766 1176 997 141 -764
$$ packed form
2928F4J187K99k78r89j308o76K20J125J314O34k21r76j193p26N6Q56J159R73m7
2947A473p79j124j121P5O25J142J010K43o61j089j045l91O93J110R79K86l63r21
2965A42j118n70L72R71J143O21k46j042j081o42M6Q39J259O62M3q19j138q67N2
2984a373P46J159O09K67o04j039r63k16L53J247Q99M31o03r22q51n87L15J000
3002a32J060L90j66q83j049o15K42Q21J014P40j26r14r68p49J60O99J013P09J27
3021A373o89j013q30k20O30R87R05J68n04q95p98l77K74R57J186J45l05q55r96
3040h57m95K52P84R48P21k76p31j059m72M8P37Q64P93p2o72r87o88n8N79P88J033
3061A180P6o02r19p06k81M56Q79Q79L05m73p64q70l82K70P70R48M10j79q56r05
$$ plain form
3081 -764 -1268 -1060 -257 645 1210 1049 297 -510 -1117 -1145 -573 340 980 1190 671 -354 -1073 -1171 -614 204
3101 204 1000 1147 756 -246 -897 -1299 -904 57 733 1118 828 18 -730 -1168 -968 -250 637 1162 983 360
3121 360 -736 -1221 -1027 -301 492 1229 967 442 -492 -1052 -1188 -544 405 1067 1062 784 -236 -1042 -1226 -733
3141 -733 204 895 1148 810 -60 -876 -1276 -780 -107 813 1269 994 188 -767 -1200 -996 -239 639 1252 982
3161 982 303 -593 -1022 -1192 -534 500 1172 1092 598 -438 -1081 -1124 -778 296 1000 1230 654 -247 -989 -1185
3181 -1185 -886 15 964 1210 942 41 -899 -1166 -933 -99 647 1191 994 263 -736 -1197 -1046 -461 657
3200 657 1315 1152 372 -525 -1163 -1079 -437 341 1083 1301 665 -267 -1164 -1191 -516 196 890 1314 982 -88
3220 -88 -955 -1254 -964 -20 740 1323 983 149 -781 -1295 -999 -233 741 1197 1033 457 -645 -1199 -1108 -455
$$ packed form
3081g64n04K08Q03R02N65j61p52q07o07k8N72R13O40K10n19j025p19r8N57Q18
3101B04P96J47l91j002o51m02L95R61O76L85k90q10p48m38K00P18Q87N25j79o23
3121C60j096m85J94P26P93P37k62n25r34n60j36O44R49O62nk78j020q06j84M93
3141g33R37O91K53l38q70q16m00M96O73R20M56k75q06r55m33K04P57Q78O13k70
3161I82o79q96m29j70O58J034O72q0m94j036o43m3L46J074P04K30n76r01p42j96
3181a185K99R01R49K46k68r01r40k67K33Q34P46N44j97p31r99m61J51N85J118
3200F57O58j63p80q97o38Q4O42P78P42K18o36r32q97k7O75P12O94M24l32j070
3220h8q67k99K90R44P60N83l40q34r30n14K96P66R74M56j64n76j102n54R1O53
$$ plain form
3240 -455 352 1211 1234 661 -299 -1231 -1426 -722 466 1037 1247 733 -168 -1068 -1293 -870 117 927 1260 1023
3260 1023 127 -736 -1289 -1123 -339 811 1194 1179 344 -667 -1295 -1189 -426 518 1255 1255 652 -423 -1244 -1242
3280 -1242 -533 197 1232 1350 818 -223 -1161 -1330 -953 147 1022 1440 891 -17 -1078 -1394 -1008 -250
3298 -250 819 1398 1248 173 -685 -1389 -1280 -520 731 1378 1231 637 -648 -1313 -1312 -654 332 1328 1333 564
3318 564 -404 -1168 -1520 -838 206 1103 1488 899 -80 -1090 -1555 -1025 -132 937 1554 1202 202 -806
3336 -806 -1392 -1312 -204 768 1312 1355 499 -657 -1418 -1363 -631 439 1284 1422 728 -427 -1192 -1442 -822 249
3356 249 1134 1577 969 -21 -1108 -1489 -1058 64 1046 1540 1224 217 -886 -1590 -1216 -284 772 1498
3374 1498 1411 469 -746 -1243 -1509 -649 585 1364 1530 677 -467 -1302 -1602 -850 285 1258 1707 1052 -136
$$ packed form
3240d55Q07Q59K3n73r60r32j95P04J188N71K10n14r01r00k25M23R87Q10L33k37
3260A023q96q63n53J66P84J150L83j5q35j011o28J06P63R44P37%o03j075q21K
3280a242P09P30J035J18n32j041r38j69L77J100Q75M18n49r08j061l16L86P58
3298b50J069N79j50j075q58p04J09P60J251O47j47n94j285o65JO58R86R96Np69
3318E64r68p64l52O82J044Q97L85n89r79j010m65N30Q93J069O17l52j000j008
3336h06n86Q0J108R72N44M3q56j156p61N5P32J070Q45J38o94j155p65k50O20J071
3356B49Q85M43o08r90j087l81M31J122R82M94l16j007j103p04L74R32J056P26
3374A498q7r42j215m97k66Q60J234P79J66q53j144q35l00P52J135R73M49o55j188
$$ plain form
3393 -136 -1190 -1563 -1114 61 1113 1479 1099 156 -1071 -1703 -1276 -342 765 1540 1353 383 -687 -1485
3411 -1485 -1456 -667 719 1557 1509 749 -481 -1426 -1597 -813 252 1340 1571 947 -98 -1315 -1707 -1150
3429 -1150 54 1117 1724 1277 47 -1154 -1588 -1358 -256 990 1530 1439 488 -753 -1629 -1466 -603 673
3447 673 1596 1659 787 -574 -1412 -1581 -741 358 1441 1820 967 -190 -1305 -1677 -1133 115 1217 1793
3465 1793 1265 116 -1167 -1792 -1381 -256 884 1650 1552 338 -855 -1708 -1603 -505 685 1653 1634 730
3483 730 -694 -1692 -1703 -832 504 1493 1754 1041 -255 -1398 -1755 -1053 50 1374 1821 1339 71 -1311
3501 -1311 -1777 -1340 -289 1170 1811 1465 359 -947 -1785 -1594 -491 874 1787 1717 573 -754 -1634
3518 -1634 -1673 -923 449 1671 1790 1056 -342 -1542 -1900 -1326 272 1360 2050 1455 -64 -1370 -1835
$$ packed form
3393a36j054l73M49J175J052L66l80r43j227o32M27R34J107P75j87r70j070p98
3411a485K9P89J386Q38m8p60j230r45j71P84J065J088K31o24j045j217l92N57
3429a150J204J063O07m47j230j201m34K30J102J246N40r1r51j241q76J63Q63J276
3447F73R23O3q72j361q38j69Q40J099J083L79q53j157j115l72N44J248J102N76
3465A793n28j149j283o25M11J125J140P66r8j214j193q53J05J098J190R68j9r04
3483G30j424r98j1Q71J336R89K61p13j296j143l57P02J103J324M47m82j268j382
3501a311m66M37J051J459O41l46j106j306q38J91J103J365R13p0j144j327q80
3518a634l9P50J372J222J19p34j398j200l58N74J598J088O90n95j519j306m65
$$ plain form
3535 -1835 -1461 -203 1152 1919 1530 375 -955 -1790 -1721 -657 872 1780 1874 722 -762 -1631 -1827 -798
3553 -798 517 1607 1777 1127 -235 -1610 -1880 -1321 259 1542 1954 1404 -15 -1397 -2024 -1570 -157
3570 -157 1231 2022 1612 372 -1197 -1964 -1599 -453 959 1880 1840 710 -801 -1905 -1960 -840 745
3587 745 1847 1901 997 -355 -1500 -2043 -1248 297 1420 2061 1322 -57 -1509 -1940 -1535 -51 1223
3604 1223 2025 1684 321 -1199 -2014 -1767 -518 1080 1944 1873 813 -677 -1966 -2048 -930 705 1878
3621 1878 2073 999 -466 -1661 -2014 -1428 86 1633 2154 1373 -64 -1579 -2084 -1577 -287 1236 2135
3638 2135 1754 401 -1122 -2285 -1814 -555 1012 2072 1818 971 -818 -1907 -2116 -876 598 1933
3654 1933 2069 1084 -425 -1721 -2159 -1450 231 1625 2212 1555 -91 -1516 -2277 -1567 -206 1247 2160
$$ packed form
3535a835L74J258J355P67l89j155j330q35O9J064J529R08R4j152j484q69j96J029
3553g98J315J090J70o50j362j375k70N59J580J283M12n50j419j382o27M54J413
3570a57J388P91m10j240j569p67L65J146J412R21m0j130j511j104n5J120J585
3587G45J102N4r04j352j145n43P95J545J123O41p39j379j452m31M05J484J274
3604A223Q02l41j363j520q15K47J249J598Q64p1j060j490j289q2J118J635J173
3621A878J95j074j465j195l53N86J514J547N21p81j437j515n05N07J290J523Q99
3638B135l81j353j523j163M71J259J567J060k54q47j789j089k09J240J474J335
3654A933J36r85j509j296m38P09J681J394N87o57j646j425p61P10J361J453R13
$$ plain form
3671 2160 1758 480 -1119 -2133 -1945 -654 1071 2156 2101 805 -721 -1989 -1982 -1083 634 1892 2156
3688 2156 1233 -498 -1901 -2065 -1351 165 1670 2279 1533 24 -1604 -2188 -1653 -84 1437 2141 1812
3705 1812 545 -1193 -2348 -2033 -683 1004 2158 2083 898 -870 -2082 -2193 -1083 571 1885 2167
3721 2167 1273 -487 -1859 -2212 -1550 186 1683 2331 1750 135 -1554 -2278 -1791 -321 1340 2185 1901
3738 1901 615 -1081 -2204 -2109 -677 985 2260 2193 1109 -788 -1892 -2125 -1249 461 1978 2423 1399
3755 1399 -232 -1820 -2336 -1601 4 1684 2331 1826 162 -1424 -2310 -1902 -458 1359 2192 1885 548
3772 548 -1063 -2324 -2041 -883 836 2213 2270 1123 -649 -2001 -2182 -1250 436 1825 2522 1442 -218
3789 -218 -1866 -2302 -1545 -100 1542 2441 1825 270 -1536 -2348 -1888 -468 1157 2193 2080 722 -1070
$$ packed form
3671B160m02j278j599j014J88J291J725J085n5j296j526j268PQ99J717J258K64
3688B156r23j731j403j64P14J516J505O09p46j509j628n84N35J569J521P04l29
3705A812j267j738j155L15J350J687J154p5j185j768j212j11J110J654J314K82
3721B167q94j760j372l53O62J736J497O48n81j615j689p24M87J470J661Q45k84
3738A901j286j696j123R5J432J662J275o7j084j897j104k33Q76J710J517M45j024
3755A399j631j588n16P35J605J680O47n05j664j586q86M08J444J817Q33l07j337
3772E48j611j261K83J158J719J377N7j147j772j352j81R32J686J389O97j080j660
3789b18j648m36P57J445J642Q99o16j555j806q12M60J420J625J036j13j358j792
$$ plain form
3806 -1070 -2233 -2153 -949 827 1992 2287 1179 -683 -2049 -2390 -1302 420 1926 2431 1594 -78
3822 -78 -1862 -2435 -1662 -171 1598 2275 1786 332 -1392 -2499 -2039 -627 1226 2359 2116 811 -1112
3839 -1112 -2267 -2245 -1011 690 2228 2329 1191 -496 -2087 -2454 -1343 428 1919 2351 1649 -171
3855 -171 -1755 -2520 -1818 -141 1611 2411 1978 414 -1351 -2443 -2133 -574 1137 2383 2152 825 -1047
3872 -1047 -2151 -2361 -1116 796 2162 2302 1223 -476 -2090 -2533 -1482 445 1983 2282 1460 51
3888 51 -1720 -2467 -1734 -223 1627 2371 1842 460 -1389 -2431 -2030 -694 1223 2250 2284 757 -1014
3905 -1014 -2170 -2402 -1153 780 2190 2336 1267 -439 -1875 -2466 -1610 328 1902 2580 1623 -135
3921 -135 -1691 -2398 -1870 -195 1481 2472 1898 459 -1421 -2363 -2060 -655 1087 2340 2268 860 -970
$$ packed form
3806a070j163Q0J204J776J165K95j108j862j366l41J088J722J506N05q37j672
3822g8j784n73P73J491J769O77m89j454j724j107M60J412J853J133k43j305j923
3839a112j155K2J234J701J538J01j138j687j591l67J111J771J491M32p02j820
3855a71j584p65P02J677J752Q00m33j564j765j092L10J559J711J246k31j327j872
3872a047j104k10J245J912J366J40j079j699j614m43J051J927J538K99q22j409
3888E1j771p47P33J511J850P44n29j382j849j042M01J336J917J027L4j527j771
3905a014j156k32J249J933J410J46j069j706j436n91Q56J938J574O78r57j758
3921a35j556p07N28J675J676R91n74j439j880r42L03J405J742J253p2j408j830
$$ plain form
3938 -970 -2203 -2374 -1074 670 2144 2293 1163 -621 -1982 -2353 -1623 204 1868 2578 1528 -123
3954 -123 -1787 -2309 -1836 -267 1462 2516 2211 315 -1429 -2408 -2229 -745 964 2357 2312 1049 -873
3971 -873 -2142 -2280 -1211 667 2143 2392 1501 -496 -1982 -2375 -1497 60 1787 2462 1877 66 -1747
3988 -1747 -2425 -1860 -179 1410 2315 2147 542 -1375 -2437 -2235 -796 996 2221 2195 999 -896 -2243
4005 -2243 -2456 -1336 553 2138 2559 1530 -453 -1928 -2460 -1542 111 1657 2367 1924 186 -1694
4021 -1694 -2501 -1968 -322 1393 2305 2202 637 -1317 -2439 -2288 -822 956 2289 2442 1189 -803
4037 -803 -2134 -2410 -1197 564 2027 2468 1522 -245 -1922 -2545 -1731 -66 1727 2410 1907 289 -1576
4054 -1576 -2486 -2055 -388 1320 2429 2182 721 -1240 -2418 -2310 -888 1076 2270 2431 1000 -767
$$ packed form
3938i70j233j71J300J744J474J49j130j784j361l71P30J827J664P10j050j651
3954a23j664n22M73J569J729J054l05j896j744r79J79J484J709J393m5j263j922
3971h73j269j38J069J878J476K49q91j997j486l93Q78J557J727O75n85j811j813
3988a747o78N65J681J589R05j68j605j917j062K02J439J792J225k6j196j895j347
4005b243k13J120J889J585M21j029j983j475n32R18J653J546P10m43j738j880
4021a694q07N33J646J715R12j03j565j954j122J51J466J778J333J53j253j992
4037h03j331k76J213J761J463M41r46j767j677o23Q14J665J793O83n03j618j865
4054a576r10M31J667J708J109k47j461j961j178J08J422J964J194J61j431j767
$$ plain form
4070 -767 -2248 -2417 -1227 388 1896 2463 1523 -299 -1803 -2519 -1746 148 1947 2475 1898 295 -1465
4087 -1465 -2475 -2132 -433 1332 2381 2088 692 -1123 -2220 -2263 -971 869 2231 2440 1095 -704
4103 -704 -2127 -2492 -1249 476 2005 2384 1550 -236 -1858 -2534 -1823 -69 1873 2493 1886 343 -1554
4120 -1554 -2342 -2135 -582 1289 2408 2302 843 -1179 -2336 -2337 -991 885 2249 2379 1132 -656 -2138
4137 -2138 -2589 -1395 518 2064 2430 1552 -61 -1864 -2582 -1811 -46 1759 2638 2030 299 -1482 -2348
4154 -2348 -2123 -476 1203 2313 2379 898 -1102 -2335 -2306 -973 764 2142 2344 1269 -515 -1993
4170 -1993 -2388 -1617 285 2011 2707 1588 -216 -1778 -2432 -1823 -22 1529 2656 2023 422 -1461
4186 -1461 -2358 -2096 -693 1059 2458 2237 983 -1041 -2302 -2300 -1036 803 2194 2359 1362 -401 -1991
$$ packed form
4070g67j481j69J190J615J508N67r40j822j504p16P73J894J799N28n77j603j760
4087a465j010L43J699J765J049k93j396j815j097m3J292J840J362K09j345j799
4103g04j423l65J243J725J529L79q34j786j622o76P11J754J942O20o07j543j897
4120a554p88K07J553J871J119j06j459k022j157jJ346J876J364J30j247j788j482
4137b138m51J194J913J546L66q78j613j803p18P71J765J805Q79o08j731j781q66
4154b348K25J647J679J110O6j481k000j233K9J333J737J378K02j075j784j478
4170a993l95P71J902J726O96j119j804j562o54O09J801J551J127o33j601j883
4186a461q97K62J403J752J399k21j254k024j261KJ264J839J391J65r97j763j590
$$ plain form
4203 -1991 -2601 -1672 219 1793 2422 1676 -36 -1677 -2362 -1935 -280 1470 2635 2050 573 -1306 -2340
4220 -2340 -2143 -762 1151 2213 2298 1093 -827 -2250 -2387 -1216 614 2079 2389 1445 -305 -1885
4236 -1885 -2550 -1616 15 1736 2506 1847 126 -1553 -2522 -2106 -381 1503 2531 2181 614 -1236 -2533
4253 -2533 -2218 -728 1105 2375 2383 1135 -796 -2171 -2405 -1391 571 2059 2452 1460 -320 -1844 -2348
4270 -2348 -1666 -21 1844 2464 1858 241 -1529 -2496 -2087 -387 1363 2487 2268 677 -1195 -2381
4286 -2381 -2378 -918 918 2287 2320 1156 -737 -2071 -2323 -1348 490 1962 2508 1590 -132 -1763 -2468
4303 -2468 -1598 -65 1666 2583 1985 273 -1539 -2417 -1983 -620 1237 2375 2194 825 -1044 -2294
4319 -2294 -2289 -913 888 2240 2455 1125 -619 -2208 -2474 -1404 362 1883 2409 1736 -74 -1861 -2393
$$ packed form
4203a991o10R29J891J574O29p46j712j641o85M27J655J750J165n85j477j879j034
4220b340J97J381J913J062Q5j205j920j423j37J171J830J465L10r44j750j580
4236a885o65R34J631J721P70o59j721j679r69M16J725J884J028l50j567j850j297
4253b533L15J490J833J270Qj248j931j375k34J014J962J488L93r92j780j524n04
4270b348O82J645J865O20o06j617j770r67M09J700J750J124k19j591j872j186
4286b381LJ460J836J369L3j164j893j334k52R75J838J472N46r18j722j631p05
4303b468Q70J533J731R17n98j712j812q78M34J363J857J138j81j369j869j250
4319b294NJ376J801J352K15j330j744j589k66J070J766J521N26o73j810j787n32
$$ plain form
4336 -2393 -1765 -74 1594 2370 2017 502 -1379 -2419 -2024 -701 1154 2392 2238 826 -942 -2197
4352 -2197 -2279 -1077 627 2148 2485 1353 -392 -2042 -2653 -1489 265 1851 2414 1756 145 -1737
4368 -1737 -2575 -1823 -294 1586 2325 2015 495 -1337 -2329 -2208 -738 1107 2411 2204 831 -823 -2208
4385 -2208 -2362 -1098 640 2024 2327 1418 -329 -2097 -2610 -1575 165 1797 2398 1779 124 -1650
4401 -1650 -2461 -2018 -371 1457 2475 2122 532 -1257 -2424 -2191 -931 987 2302 2188 995 -766
4417 -766 -2205 -2354 -1171 526 1951 2395 1462 -406 -1881 -2451 -1752 22 1735 2500 1691 238 -1498
4434 -1498 -2380 -1923 -515 1430 2445 2073 616 -1098 -2213 -2061 -846 928 2192 2235 1076 -788
4450 -788 -2178 -2249 -1233 409 1886 2513 1444 -125 -1898 -2364 -1644 35 1704 2477 1811 179 -1531
$$ packed form
4336b393O28J691J668P76l53j515j881j040L95J323J855J238j54j412j768j255
4352b197q2J202J704J521L37j132j745j650o11J164J754J586N63o58j611j882
4368a737q38P52J529J880P39l10j520j832r92J21J470J845J304k07j373j654j385
4385b208j54J264J738J384L03r09j747j768n13J035J740J632O01o19j655j774
4401a650q11M43J647J828J018l53j590j789j167K33J260J918J315j14j193j761
4417g66j439j49J183J697J425M44r33j868j475n70O99J774J713P65q09j453j736
4434a498q82M57J408J945J015l72j457j714j115J52J215J774J264M3j159j864
4450g88j390p1J016J642J477O27j069j569j773m66P20J679J669P73o66j632j710
$$ plain form
4467 -1531 -2388 -1981 -551 1194 2390 2212 631 -1191 -2314 -2220 -903 889 2174 2358 1166 -658
4483 -658 -2128 -2281 -1227 428 2037 2353 1654 -153 -1745 -2496 -1864 -191 1657 2400 1871 172 -1477
4500 -1477 -2264 -2021 -450 1303 2224 2177 844 -1113 -2381 -2258 -884 899 2049 2273 1270 -668 -2022
4517 -2022 -2560 -1442 400 1928 2391 1482 -191 -1695 -2458 -1754 -173 1483 2474 1914 264 -1409 -2374
4534 -2374 -2019 -520 1194 2293 2142 915 -876 -2320 -2234 -1117 777 1994 2308 1275 -419 -1963
4550 -1963 -2428 -1552 353 1975 2408 1615 -70 -1589 -2289 -1958 -253 1529 2307 1983 448 -1331 -2302
4567 -2302 -2019 -617 1058 2204 2242 1146 -813 -2261 -2257 -1134 630 2059 2376 1397 -378 -2008 -2439
4584 -2439 -1657 57 1935 2616 1705 92 -1724 -2478 -1614 -385 1395 2474 2172 511 -1339 -2377
$$ packed form
4467a531q57M07J430J745J196j78j581j822j123R4J317J792J285J84j192j824
4483f58j470j53J054J655J609L16o99j807j592p51O32J673J848P43n29j699j649
4500a477p87K43J571J753R21m7j333j957j268J23J374J783J150K24j003j938j354
4517b022n38J118J842J528M63r09j673j504p63P04J581J656R91n60j650j673r65
4534b374L55J499J714J099j51j227j791j444Q6J117J894J217L14j033j694j544
4550a963m65Q76J905J622M33p93j685j519p00L31J705J782P78l24j535j779r71
4567b302K83J402J675J146L8j096j959j448MJ123J764J429L17r79j775j630m31
4584b439P82J714J878O81r11j613j816p54Q64J229J780J079l02j661j850j038
$$ plain form
4600 -2377 -2147 -723 1107 2220 2212 954 -757 -2092 -2331 -1185 551 2065 2328 1315 -292 -1811
4616 -1811 -2351 -1551 135 1709 2490 1734 147 -1670 -2369 -1893 -259 1237 2403 1949 556 -1204 -2318
4633 -2318 -2193 -824 956 2216 2225 1003 -809 -2137 -2272 -1347 531 2074 2365 1404 -278 -1969 -2465
4650 -2465 -1656 54 1720 2332 1842 216 -1576 -2387 -1987 -342 1359 2218 2090 620 -1200 -2267 -2243
4667 -2243 -950 944 2205 2323 1079 -746 -1996 -2330 -1277 519 2067 2264 1523 -296 -1770 -2306
4683 -2306 -1617 -2 1586 2353 2008 209 -1317 -2297 -1910 -414 1253 2297 2026 669 -1016 -2173
4699 -2173 -2293 -989 918 2186 2222 1389 -555 -1959 -2461 -1255 365 1896 2433 1604 -215 -1721 -2331
4716 -2331 -1789 -226 1630 2429 1857 278 -1390 -2351 -2022 -665 1132 2380 2237 797 -992 -2200
$$ packed form
4600b377K30J424J830J113qj258j711j335k39J146J736J514K63j013j607j519
4616a811n40Q00J686J574P81p56j587j817o99M76J634J496J166m54j393j760j114
4633b318J25J369J780J260Rj222j812j328j35R25J878J543K91r61j682j691m96
4650b465Q09J710J666O12m90j626j792q11M00J645J701Q59j28j470j820j067K4
4667b243J293J894J261J18j244j825j250l34J053J796J548J97p41j819j474n36
4683b306O89J615J588P67l45j799j526r80L87J496J667J044k71j357j685j157
4699b173j20J304J907J268L6q33j944j404n02J206J620J531N37q29j819j506o10
4716b331N42J563J856P99n72j579j668r61L29J357J797J248j43j440j789j208
$$ plain form
4732 -2200 -2154 -1004 687 2077 2341 1227 -478 -1980 -2338 -1318 151 1919 2357 1596 -52 -1793
4748 -1793 -2370 -1694 -195 1378 2358 1902 300 -1456 -2372 -1868 -730 1137 2265 2159 826 -869 -2143
4765 -2143 -2123 -993 668 2077 2219 1252 -425 -1872 -2301 -1433 172 1704 2398 1651 -71 -1709 -2341
4782 -2341 -1795 -281 1359 2340 1930 408 -1349 -2320 -1986 -585 1106 2191 2236 917 -985 -2238 -2212
4799 -2212 -1120 611 1991 2250 1364 -353 -1874 -2305 -1445 140 1690 2438 1683 0 -1590 -2280 -1975
4816 -1975 -255 1315 2228 1991 544 -1233 -2274 -1938 -633 977 2130 2040 858 -683 -2104 -2450
4832 -2450 -1097 638 2041 2234 1298 -367 -1989 -2437 -1478 160 1707 2301 1758 114 -1652 -2269 -1763
4849 -1763 -302 1383 2224 1988 606 -1105 -2317 -2192 -652 924 2260 1981 887 -656 -2007 -2350
$$ packed form
4732b200M6J150J691J390K64j114j705j502l58J020J469J768M38p61j648j741
4748a793n77O76J499J573R80m56j602j756r16N04J138J867J128j06j333j695j274
4765b143K0J130J661J409J42r67j677j447m29Q68J605J532O94p47j722j638o32
4782b341N46J514J640R81m10j522j757r71L34J401J691J085M5j319j902j253K6
4799b212J092J731J380K59q86j717j521m31Q60J585J550P48p55j683j590o90L05
4816a975J720J570R13k37j447j777j041L36J305J610J153r0j182j541j421l46
4832b450J353J735J403J93r36j665j622m48R59J638J547N94n43j644j766o17N06
4849a763J461J685Q41k36j382j711j212J25J540J576J336k79j094j543j351l43
$$ plain form
4865 -2350 -1192 530 2019 2293 1326 -281 -1725 -2189 -1534 69 1573 2227 1940 143 -1540 -2391 -1866
4882 -1866 -362 1313 2212 1959 633 -1104 -2277 -2138 -795 787 2210 2125 1036 -639 -1896 -2289
4898 -2289 -1311 313 1771 2410 1565 -267 -1686 -2213 -1623 13 1535 2224 1819 350 -1462 -2357 -1797
4915 -1797 -475 1317 2096 1895 867 -934 -2059 -2117 -858 898 2116 2142 1059 -665 -1976 -2184 -1374
4932 -1374 305 1899 2348 1483 -291 -1650 -2242 -1589 -178 1503 2274 1877 288 -1340 -2251 -1791 -426
4949 -426 1116 2129 2030 686 -1014 -2131 -2141 -837 853 2079 2129 1141 -556 -1843 -2222 -1273 332
4966 332 1786 2305 1312 -181 -1640 -2220 -1595 -165 1367 2225 1708 264 -1211 -2338 -2008 -556 1189
4983 1189 2234 2048 741 -981 -2115 -2139 -951 774 1993 2126 1205 -502 -1792 -2290 -1358 351 1734
$$ packed form
4865b350J158J722J489K74r67j607j444m64O55J603J504O54k87j797j683q51N25
4882a866J504J675Q99k53j326j737j173J39J343J582J423q5j089j675j257l93
4898b289R78J624J458O39q45j832j419n27N90J636J522O89m05j469j812q95N60
4915a797J322J792P79k01j028j801j125n8J259J756J218K6j083j724j311k08Q10
4932a374J679J594M49q65j774j359n92O53J411J681P71l97j589j628r11M60J365
4949d26J542J013r9j344j700j117j0J304J690J226N0r88j697j287l79R49J605
4966C32J454N19r93j493j459n80O25J430J532Q58n17j444j475j127L30J452J745
4983A189J045j86j307j722j134k4J188J725J219J33r21j707j290m98R32J709J383
$$ plain form
5000 1734 2308 1388 -40 -1614 -2243 -1658 -132 1522 2250 1657 274 -1155 -2238 -2017 -618 1167 2264
5017 2264 2038 735 -915 -1992 -2040 -1074 632 1991 2117 1116 -500 -1913 -2205 -1348 288 1761 2315
5034 2315 1480 -103 -1401 -2250 -1660 -222 1433 2205 1685 395 -1308 -2167 -1933 -690 1066 2095 2070
5051 2070 736 -1018 -1983 -2203 -1006 588 1909 2197 1164 -490 -1651 -2160 -1284 161 1612 2170
5067 2170 1592 -30 -1526 -2166 -1568 -204 1266 2263 1840 445 -1169 -2099 -1928 -610 879 2034 2066
5084 2066 791 -831 -2077 -2091 -1017 569 1769 2155 1318 -405 -1787 -2148 -1438 255 1553 2105 1478
5101 1478 138 -1520 -2273 -1660 -315 1235 2119 1821 522 -1116 -2210 -1955 -668 848 1903 1975 971
5118 971 -733 -1940 -2080 -1116 543 1805 2111 1361 -295 -1796 -2229 -1452 125 1511 2203 1695 275
$$ packed form
5000A734N74r20j428j574o29N85J526J654P28n93j383j429j083K21J399J785J097
5017B264k26j303j650j077m8R66J706J359J26j001j616j413k92Q57J636J473N54
5034B315q35j583j298q49N90J438J655P72n20j290j703q59K34J243J756J029k5
5051B070j334j754r65k20J197J594J321K88j033j654j161n09Q76J445J451N58
5067B170n78j622j496o40N98J364J470R97m23j395j614r30J71J318J489J155L2
5084B066j275j622j246j4J074J586J200L86q37j723j382l61P10J693J298N52o27
5101A478j340j658p53O13J345J550Q84k98j299j638j094K55J287J516J055P2j004
5118I71j704j207j40R64J659J262L06p50j656j501m33P77J577J386O92n08j420
$$ plain form
5135 275 -1257 -2260 -1730 -348 1305 2013 1901 592 -1054 -1995 -1882 -715 869 1986 1874 996 -662
5152 -662 -1861 -2067 -1139 520 1808 2160 1100 -244 -1646 -2177 -1476 31 1546 2149 1451 199 -1234
5169 -1234 -2054 -1738 -435 1128 1960 1819 738 -855 -2070 -1962 -819 778 1839 1963 1042 -599 -1773
5186 -1773 -1941 -1186 337 1743 2072 1348 -55 -1657 -2094 -1521 22 1410 2091 1521 252 -1291 -2009
5203 -2009 -1718 -528 1165 1948 1893 667 -857 -2013 -1867 -852 658 1851 1991 994 -490 -1702 -1925
5220 -1925 -1089 206 1584 2039 1321 -69 -1481 -2085 -1553 -68 1227 2063 1502 431 -1211 -1995 -1645
5237 -1645 -417 1014 2078 1813 777 -761 -1832 -1940 -878 609 1801 1965 1066 -479 -1783 -1928
5253 -1928 -1220 221 1554 2011 1346 49 -1301 -1980 -1482 -170 1149 1892 1626 404 -1127 -1896 -1715
$$ packed form
5135B75j532j003N30J382J653P08j12j309j646r41J13J167J584J117j12q78j658
5152f62j199k06R28J659J288L52j060j344j402n31P01J507J515O03o98j252j433
5169a234q20L16J303J563Q32j41j081j593j215J08J143J597J061J24r21j641j174
5186a773j68P55J523J406L29p24j403j602m37N73J543J388O81n70j269j543p18
5203b009K91J190J693P83n5j226j524j156J46J015J510J193J40r97j484j212k23
5220a925Q36J295J378M55p18j390j412o04N32J485J295Q36n61j071j642p84L50
5237a645J228J431J064k65j036j538j071j08J062J487J192J64q99j545j304j45
5253a928P08J441J333M57o65j297j350o79M98J312J319P43k66j222j531p69J81
$$ plain form
5270 -1715 -494 849 2002 1848 661 -673 -1758 -1959 -920 547 1721 1921 1070 -371 -1486 -2035
5286 -2035 -1381 149 1454 2005 1474 168 -1277 -2029 -1543 -153 1156 2001 1701 557 -895 -1871 -1764
5303 -1764 -594 858 1931 1888 789 -684 -1758 -1862 -1054 411 1654 1822 1035 -175 -1574 -1913 -1305
5320 -1305 83 1521 2035 1423 133 -1190 -1950 -1541 -312 1172 1889 1600 543 -955 -1763 -1845 -696
5337 -696 846 1899 1863 808 -687 -1784 -1900 -934 481 1611 1990 1151 -129 -1448 -1887 -1340 137
5354 137 1421 1911 1404 50 -1240 -1969 -1405 -247 1176 1883 1655 417 -938 -1796 -1623 -763 635
5371 635 1730 1909 881 -546 -1724 -2010 -941 397 1610 1881 1261 -189 -1437 -1822 -1275 -60 1281
5388 1281 1875 1344 206 -1042 -2024 -1526 -375 1054 1728 1724 501 -967 -1812 -1674 -865 524 1650 1664
$$ packed form
5270a715J221J343J153j54j187j334j085k01J039J467J174K00q51j441j115n49
5286b035O54J530J305N51n31j306j445p52M86J390J309Q45l00j144j452r76J07
5303a764J170J452J073m3j099j473j074j04Q08J465J243J68p87j210j399l39O08
5320a305J388J438N14o12j290j323p60M09J229J484P17k89j057j498q08q2J149
5337f96J542J053l6j055j495j097j16R66J415J130L79q39j280j319m39N47J477
5354A37J284M90n07j354j290p29N64J158J423P07k28j238j355q58J73Q60J398
5371F35J095J79j028j427j178k86J069J338J213K71o20j450j248l85N47J215J341
5388A281N94n31j138j248r82M98J151J429O74mj223j468q45J38Q09J389J126J4
$$ plain form
5406 1664 952 -387 -1551 -1826 -935 360 1419 1810 1228 -25 -1243 -1905 -1434 -72 1207 1869 1630
5423 1630 235 -1070 -1830 -1541 -416 913 1807 1689 673 -733 -1685 -1719 -835 585 1520 1726 940 -399
5441 -399 -1398 -1900 -1126 288 1503 1797 1214 -18 -1287 -1920 -1373 -144 1178 1871 1505 348 -865
5458 -865 -1745 -1571 -623 765 1707 1625 771 -690 -1636 -1753 -858 526 1503 1746 991 -378 -1466 -1803 -1083
5477 -1083 139 1445 1720 1328 -57 -1222 -1751 -1325 -196 1239 1835 1489 389 -1005 -1813 -1600 -567
5494 -567 748 1694 1603 664 -657 -1616 -1797 -978 411 1561 1705 960 -327 -1476 -1841 -1039 308 1400
5512 1400 1744 1349 -37 -1230 -1757 -1358 -179 1032 1794 1367 297 -875 -1630 -1468 -581 797 1685
5529 1685 1706 655 -650 -1575 -1688 -839 421 1685 1689 1080 -357 -1331 -1852 -1095 132 1296 1810 1351
$$ packed form
5406A664p12j339j164k75Q91J295J059L91n82j253j218o62M71J362J279O62k39
5423A630j395j305p60K89J125J329Q94j18j016j406r52l4Q84J420R35K06p86j339
5441c99r99n02P74J414J215K94n83j232j269o33N47J229J322O93l66j157j213
5458h65q80J74R48J388R42q2q54j461r46j17Q95J384R77K43p55j369j088l37P20
5477a083J222J306K75l92j385j165n29M26J129J435N96l46j100j394q08K13J033
5494e67J315R46r1r39j321r59j81Q19J389J150J44p45j287j149l65Q02J347J092
5512A400L44l95j386j193n27L99J179J211P62m27j070j172p55J62Q87J378Q88
5529A685K1j051j305r25j13Q49J260J264Mo09j437r74n21P57J227J164N14m59
$$ plain form
5547 1351 94 -1108 -1692 -1434 -222 1091 1665 1586 490 -897 -1697 -1591 -632 668 1654 1718 655 -618
5565 -618 -1598 -1673 -771 496 1495 1653 1018 -170 -1447 -1760 -1220 46 1250 1790 1327 41 -988 -1701
5583 -1701 -1316 -206 916 1683 1517 388 -724 -1742 -1652 -636 714 1560 1630 840 -444 -1469 -1671
5600 -1671 -858 471 1420 1625 1023 -180 -1243 -1657 -1143 -82 1230 1753 1259 182 -995 -1680 -1470
5617 -1470 -343 1027 1587 1456 610 -672 -1596 -1626 -667 518 1526 1473 856 -437 -1501 -1565 -1015 295
5635 295 1412 1602 1025 -91 -1216 -1569 -1075 -87 1177 1702 1332 198 -899 -1620 -1398 -252 932
5652 932 1615 1441 431 -734 -1727 -1491 -621 582 1506 1631 871 -377 -1362 -1659 -949 332 1347 1435
5670 1435 1010 -7 -1159 -1591 -1205 -129 920 1713 1228 282 -861 -1565 -1360 -527 778 1626 1403 586
$$ packed form
5547A351j257j202n84K58J212J313N74p9j096j387q00J06R59J300R86O4j063j273
5565f18r80p5R02J267R99J58o35j188j277l13N40J266J204N40m63j286j029p13
5583a701L85J110J122P67j66j129j112j018R0J016J350Q46P0p90j284j025k02
5600a671Q13J329R49K05o02j203j063m14N14J061J312N23m94j077j177o85K10
5617a470J127J370N60j31q46j282r24l0R59J185J008n3o17j293j064o4N50J310
5635B95J117J90n77j116j125l53M94R88J264N25l70j134j097p21K22J146J184
5652I32O83j74j010j165r93K36Q70J203R24J25p60j248r85k97P10J281J015Q8
5670A435m25j017j152m32L86J076J049P93m85r46j143p04K05Q33J305Q48k23q17
$$ plain form
5688 586 -628 -1557 -1460 -688 540 1484 1602 915 -267 -1288 -1665 -994 153 1304 1660 1116 -53 -1151
5706 -1151 -1573 -1269 -128 958 1604 1387 309 -840 -1550 -1446 -420 636 1452 1481 583 -674 -1544 -1553
5724 -1553 -816 396 1353 1552 937 -222 -1291 -1493 -1056 45 1228 1603 1083 -28 -1087 -1579 -1328
5741 -1328 -237 872 1604 1306 313 -874 -1471 -1388 -445 703 1544 1499 794 -417 -1467 -1622 -794 446
5759 446 1329 1604 871 -228 -1171 -1572 -1136 44 1102 1547 1150 149 -1048 -1595 -1163 -263 877 1470
5777 1470 1321 324 -730 -1481 -1373 -438 543 1374 1421 635 -422 -1349 -1497 -863 304 1337 1508 866 -235
5796 -235 -1175 -1444 -1137 -6 1080 1576 1044 217 -829 -1508 -1236 -241 833 1534 1319 551 -678 -1415
5814 -1415 -1369 -587 562 1245 1401 757 -379 -1323 -1467 -896 239 1291 1422 928 -133 -1081 -1558 -1010
$$ packed form
5688E86j214r29R7P72J228R44J18o87j182j021l77O71J147J151L56n44j169j098
5706a151m22L04J141J086O46k17j078j149p10J04J026J056Q16K9q98j257q70r
5724a553P37J212R57J99o15j159j069k02M37J101J183L75n20j111j059m92K51
5741a328J091J109P32k98r93j187n97Q3R43J148Q41m5p05j211j050j55Q28J240
5759D46Q83K75p33j099r43m01M36J180J058M45l97j001j197n47M32R00J140N93
5777A470j49r97j054p51J08R35R81Q31M7p86j057r27j48O34J167J033J71o42j101
5796b35r40k69L07J131J086M96n32q27j046o79K72R95J074P01k15p68j229p37
5814a415M6P82J149O83J56o44j136r44j44N71J135J052J31m94j061r48m77N48
$$ plain form
5832 -1010 13 1026 1555 1190 192 -974 -1458 -1239 -367 804 1502 1339 445 -626 -1428 -1521 -556 571
5850 571 1342 1401 811 -288 -1218 -1418 -778 382 1210 1413 932 -143 -1087 -1408 -991 -55 912 1513 1113
5869 1113 279 -777 -1455 -1217 -432 609 1545 1237 499 -449 -1293 -1374 -486 540 1300 1427 764 -427 -1192
5888 -1192 -1441 -825 157 1224 1364 862 35 -1041 -1505 -1004 -201 887 1412 1116 276 -728 -1491 -1172
5906 -1172 -312 653 1352 1289 590 -439 -1340 -1488 -588 368 1341 1330 764 -182 -1276 -1344 -909 183 1102 1363
5926 1363 970 -19 -908 -1508 -1180 -151 955 1543 1070 310 -660 -1428 -1189 -500 564 1398 1421 505 -336
5945 -336 -1119 -1359 -701 341 1175 1364 716 -283 -964 -1425 -948 -62 1041 1339 986 104 -855 -1323 -1161
5964 -1161 -126 893 1359 1237 252 -621 -1218 -1260 -513 509 1178 1360 633 -265 -1108 -1361 -802 244 1081
$$ packed form
5832a010J023J013N29l65r98j166m84K19Q72J171O98j63q94j071q02r3R65J127
5850E71P71N9n90j099r30k00O40J160Q28K03m81j075r44l21M17R36R67O01m00
5869A113q34j056o78K38P85J041R36l08p38r48q44q1Q88J026P60J27o63j191p65
5888a192k49O16R82J067J40n02q27j076m64N01Q03J088N25k96q40j004p63L19
5906a172Q60R65O99o3o99j029r01j48R00R56R73j1n66r46j094o8M35J092R19K61
5926A363l93r89q89o00L28J029J106N88m73p60r70p68K39O89J064Q34K3r16q41
5945c36p83k40O58J042Q34J89o48r99o81m61M77Q86J103K98l53q82r59m68J62
5964a161J035J019M66j22r85q73n97m2P47J022O69J82p27q98q43k53N59J046Q37
$$ plain form
5983 1081 1358 787 -145 -1072 -1308 -954 -62 995 1338 1013 58 -876 -1271 -1049 -287 706 1214 1228 249 -675
6003 -675 -1270 -1186 -456 518 1159 1295 491 -293 -1085 -1295 -740 164 1132 1229 826 -119 -1030 -1316 -958 -201 981
6024 981 1405 1027 132 -758 -1318 -1114 -278 735 1191 1126 531 -533 -1237 -1135 -492 403 1008 1390 614 -384
6044 -384 -1046 -1292 -820 187 1083 1220 864 -133 -924 -1272 -1037 -67 813 1273 1116 214 -803 -1253 -1072
6063 -1072 -350 657 1168 1229 516 -604 -1288 -1205 -592 484 1124 1311 629 -259 -994 -1232 -869 105 1026
6082 1026 1433 896 -64 -911 -1184 -973 -32 785 1312 974 178 -722 -1222 -1085 -327 552 1203 1244 479 -453
6102 -453 -1177 -1249 -490 263 996 1260 638 -310 -999 -1279 -839 83 963 1343 885 33 -874 -1364 -914 -144
6122 -144 718 1252 1050 309 -647 -1288 -1111 -228 604 1098 969 448 -464 -1127 -1057 -655 262 1050 1202 650
$$ packed form
5983A081K77n71r32r27k36L54Q92J057L43l25r55r34l95K22P62R93N08J4r79r24
6003f75n95Q4P30R74O41J36q04p84p92k10N55R04R68R7m03r45r11k86L58P57J182
6024I81M24l78q95q90n60K04Q36J013M56o5n95j064p04J02O43Q95O05L82p76r98
6044c84o62k46M72J007Q96J37l56r97p91l48K35R70Q80M60j57r02j017m50J81
6063a072P22J007N11O1p13j120o84Q3O13J076O40J87o82q88p35k38L63R74R21
6082A026M07n37r60q47k73K11R41Q17N27l38p96r00n00J37P58Q79O51M1p65r32
6102d53p24p2P59P53P33K64o22r48o89k80M40R22Q80L80m58q52r07m90M50P70
6122a44Q62N34k02p41r56o41J77Q83Q32M94j29n21r12o63P0M02R17P88J52n52
$$ plain form
6142 650 -105 -927 -1211 -831 116 882 1189 882 50 -871 -1209 -872 -157 682 1149 1120 390 -567 -1154 -1062 -354
6163 -354 494 1284 1132 482 -442 -1014 -1149 -688 381 985 1193 726 -59 -923 -1241 -774 113 956 1112 846
6183 846 31 -882 -1299 -976 -244 632 1109 1018 364 -590 -1054 -1216 -320 402 1087 1227 515 -428 -1073 -1205
6203 -1205 -637 141 930 1123 757 -188 -829 -1147 -941 24 739 1137 853 25 -635 -1184 -924 -138 658 1252
6223 1252 1000 272 -525 -1042 -1215 -351 467 995 1055 603 -391 -1018 -1059 -673 209 955 1104 650 -81 -894
6243 -894 -1120 -716 26 839 1113 871 175 -723 -1088 -991 -236 599 1116 970 341 -435 -931 -1102 -400 421
6263 421 910 1022 457 -358 -1047 -1067 -646 100 930 1052 646 -80 -798 -939 -852 -99 724 1065 868 277 -632
6284 -632 -1066 -939 -362 484 1109 966 228 -487 -957 -1048 -524 283 1061 1079 542 -292 -1009 -1118 -703 66 683
$$ packed form
6142F50p55q22k84L80R47P66L07l07q32r21l38L37P15Q39M67k9p30r57n87R2P08
6163c54Q48P90j52o50r24n72j35M61J069O04K08m67p85q64l18M67Q87Q43J56k66
6183H46q15r13m17L23P32Q76M77r1o54r54m64j62Q96P22O85J40p12r43o45j32
6203a205N68P78P89J93l66r45o41l18K06R65P15L98k84q28o60n49K60P86P96N94
6223A252k52p28p97n17j73Q64Q18N28O0m52r94o27m1L86Q82P46J49m54p31q13
6243h94k26M04P42Q13K74k42o96q98l65R7P55Q35N17j46o29p76m96j71P02Q21
6263D21M89J12n65q15o89k0M21P46Q30J22m06p26p18j41Q7P53Q23L41j97n91r09
6284f32m34J27N77Q46O25j43p38p15m70r1N24Q07P78J8n37q34p17j09M15P69O17
$$ plain form
6305 683 1119 764 -80 -739 -1087 -758 -111 660 1083 787 232 -608 -1077 -770 -332 502 995 922 266 -392
6325 -392 -967 -931 -453 236 941 933 517 -185 -818 -981 -595 72 827 1013 825 -103 -724 -1004 -879 -33 558
6346 558 1038 790 108 -581 -1011 -813 -374 535 927 900 473 -379 -879 -1008 -491 391 987 910 484 -222 -874
6367 -874 -883 -506 131 799 1174 619 -69 -824 -1010 -754 -8 660 1088 970 226 -685 -992 -840 -111 501 935
6388 935 810 292 -399 -936 -857 -405 323 894 952 343 -224 -802 -928 -654 132 701 1073 697 -41 -693 -948
6409 -948 -761 -106 636 934 934 77 -499 -894 -931 -226 421 899 878 321 -329 -907 -989 -561 327 871 1000 635
6431 635 -219 -711 -882 -545 89 760 975 704 -80 -615 -913 -893 3 481 868 797 197 -522 -970 -744 -238
6452 -238 437 840 931 340 -281 -865 -881 -468 259 846 834 512 -133 -692 -1017 -628 108 707 882 623 79
$$ packed form
6305F83M36l55q44o59l48L29O47P71M23k96n55q40m69L07M38Q34M93p3o56o58
6325c92n75L6M78O89P05qm16p02o33j63L86O67P55J86j88r28o21k80J25Q46N91
6346E58M80k48o82o89m30J98M39R09L92k7m27q52n00j29N17Q82N96p7m26p06o52
6367h74rL77O37O68L75n55o88p55j86K56P46O68M28j18p44r11l07J52P29O12M34
6388I35j25n18o91n37P9M52P28N71N8o09n67n78j26K74P86N69L72l76p38o52k55
6409i48J87O55P42K98%q57n76l95l7P05O47M78k1n57o50n78q2M28Q88N44J29l65
6431F35q54m92j71L37O34O71K15k71p84n35k98K0Q96M78L87p1o00p19m48K26N06
6452b38O75M03R1n91o21n84j6M13P27N87j2l22o45n59l25L89P36N99J75k59n44
$$ plain form
6473 79 -635 -1038 -656 -201 545 936 814 132 -534 -896 -902 -253 437 870 849 464 -388 -951 -833 -425 222
6494 222 754 868 579 -221 -751 -900 -559 123 737 911 625 -66 -589 -968 -653 -98 567 866 613 209
6514 209 -423 -886 -803 -259 533 771 792 200 -267 -733 -843 -484 194 787 927 595 -79 -702 -857 -666 82
6535 82 563 1002 599 75 -532 -743 -707 -97 536 817 745 159 -482 -908 -730 -273 431 699 933 355 -355
6556 -355 -706 -788 -465 232 709 770 412 -90 -633 -887 -585 29 680 861 618 119 -525 -827 -690 -259 504
6577 504 794 738 214 -370 -894 -690 -274 218 742 793 374 -312 -818 -888 -399 88 648 739 449 -190 -637
6598 -637 -918 -534 -15 597 942 615 -8 -515 -839 -574 -108 494 911 830 202 -415 -763 -683 -268 285 720
6619 720 730 362 -240 -653 -740 -411 133 829 885 615 -32 -630 -859 -580 -19 623 866 537 38 -529 -753
$$ packed form
6473G9p14m03L82M55P46L91j22o82o66l62oO49O90M33k1l85q52n63J18M08O47
6494B22N32J14k89q00n30j49L41O82O14J74k86o91n23l79L15N55O65K99k53m04
6514B09o32m63Q3N44P92K38K1n92m67m66j10L59O78N93J40l32o74o23j55J91P48
6535H2M81M39m03n24o07k11L6O10O33K81p2n86o41m26J78M57P04K68K34n78p10
6556c55l51q2L23O97M77O1l58n02n43k54L02O14O51J81k43m99o44l02J37M31P63
6577E04K90n6n24n84n24K04M16M92N24N1m19o86n06p0M89M87N60R1k90o39m47
6598f37k81L84N19O12L45l27o23n07l24K65M66O02M17q1o28o17l48Q0M15N53M35
6619G20J0l68o02m13q7L29N44O96N6k70o47n98k29K79N61O42K43l29m99n67k24
$$ plain form
6640 -753 -558 -108 338 789 732 332 -428 -748 -707 -336 206 758 723 500 -255 -655 -739 -301 166 700 832
6661 832 434 16 -562 -802 -500 51 419 794 590 113 -517 -828 -566 -76 442 713 702 312 -391 -720
6681 -720 -687 -319 332 609 702 342 -131 -625 -787 -472 94 815 733 505 -177 -520 -885 -440 -41 518 769
6702 769 579 105 -494 -823 -737 -88 387 693 613 286 -306 -625 -684 -251 179 725 770 297 -137 -739 -717 -359
6724 -359 69 596 776 564 -164 -642 -745 -465 21 484 746 509 112 -452 -748 -519 -68 210 714 565
6744 565 302 -308 -728 -627 -237 210 713 848 352 -419 -619 -867 -349 202 702 710 464 56 -532 -735 -479
6765 -479 50 522 675 485 95 -397 -681 -620 -74 324 693 605 229 -307 -630 -701 -294 300 645 636 307 -127
6787 -127 -692 -732 -411 123 499 684 505 -42 -512 -660 -458 -66 508 612 553 -25 -332 -616 -621 -188 286
$$ packed form
6640g53J95M50M46M51n7m00p60l20M1L71N42N52l5k23p55m00q4M38M67N34J32
6661H32l98m18n78k40L02N51L68L75k04m77o30l11K62M90N18K71j1l90p03l29
6681g20L3L68O51K77R3l60m73m94j62L15N66P21q2k28o82l43l65M45L99N59K51
6702G69j90m74n99l29Q6O49M75L06q0l27n92l19n9M33M30N46M5m73m34o02K2L58
6724c59M28N27J80k12p28m78j03K80M86M63K62k37l97n64k96K29M51K78N04j49
6744E65k63o10m20J01L90M47N03J35m96p71k00k48N18N51N00Qk46m08n88k03K56
6765d79N29M72J53j90l90m92k84O1N46L98L69q8l76n36l23p1M07N94L45rl29m34
6787a27n65m0L21N34L76J85j79n47m70j48K02L92N74J04n9n78l07k84nM33M74
$$ plain form
6808 286 564 479 244 -157 -593 -517 -271 124 572 671 230 -130 -444 -586 -410 -48 568 652 421 28 -456
6829 -456 -637 -608 -23 465 570 406 124 -212 -544 -507 -130 266 655 558 333 -141 -569 -604 -255 258 573
6850 573 599 285 -188 -641 -449 -444 80 506 674 403 86 -433 -590 -360 -37 388 654 587 22 -303 -592
6871 -592 -567 -240 213 470 595 273 -75 -541 -702 -352 279 582 505 401 -131 -497 -571 -280 109 409 651
6892 651 285 38 -432 -520 -445 74 474 603 429 79 -325 -598 -338 -86 347 628 550 175 -148 -493 -651
6913 -651 -120 153 485 540 256 -371 -542 -419 -345 71 383 542 370 -122 -269 -496 -320 -8 427 477 350
6934 350 46 -352 -582 -349 -168 270 723 541 243 -181 -566 -540 -251 147 463 411 211 -62 -453 -552 -296
6955 -296 -63 476 526 410 -59 -365 -547 -380 -23 371 605 444 118 -336 -624 -402 -67 274 415 379 291
$$ packed form
6808B86K78q5k35m01m36P6K46L95M48R9m41l60l14j42J76L62O16Q4k31l93m84
6829d56j81K9N85M88J05j64k82l36l32L7L77L96L89r7k25m74m28l5L49N13L15
6850E73K6l14m73m53J92NN24M26J68k71l17n19j57K30L23M25K66o7n65l25k89
6871e92K5L27M53K57J25l22l48m66j61L50O31L03p7j04n32l66p4K91L89L00K42
6892F51l66k47m70q8P5N19M00J29j74l50m04k73K60K52M33K81p8l75l23l45j58
6913f51N31K73L32N5k84o27j71J23P4M16L12J59j72m92j47k27J76L12M35N0j27
6934C50l04l98k30K33J81M38M53j82k98m24l85K6K89L98L16n2k00k73l91r9K56
6955b96K33N39N0j16m69l06j82J67L57L94K34j61l26m54k88K22L35L41J41l6q8
$$ plain form
6976 291 -159 -504 -409 -173 155 389 512 207 -60 -331 -573 -204 36 412 451 268 -51 -359 -615 -324 -30
6997 -30 279 471 389 214 -275 -551 -548 -10 233 524 400 175 -239 -464 -544 -174 48 451 413 220 -110 -440
7019 -440 -418 -243 5 370 685 319 -36 -502 -540 -356 -127 349 524 314 30 -185 -546 -465 -59 147 409
7040 409 544 166 -186 -449 -348 -200 153 367 487 220 -166 -444 -343 -260 32 429 369 251 -57 -396 -418
7061 -418 -247 27 340 492 325 42 -307 -455 -484 -261 260 426 495 176 -229 -442 -455 -223 200 293 336 153
7083 153 -192 -371 -461 -328 79 462 447 340 -115 -395 -405 -336 -73 312 514 199 -13 -207 -486 -387 -9 213
7105 213 504 469 73 -181 -402 -415 -193 94 414 268 153 -66 -392 -369 -377 103 388 423 173 -127 -468 -482
7127 -482 -170 -32 296 486 374 -84 -201 -517 -273 -91 210 488 500 65 -261 -438 -310 -262 186 400 344
$$ packed form
6976B91m50l45R5K36L28K34J23l05k67k71k42L69K40L76L9j83l19l08k56K91K94
6997c0L09J92q2j75m89k76LN38K43K91j24k25m14k25q0L70K22M03l8j93l30l30
7019d40K2J75K48L65L15l66l55m66l8J84K29M76J75k10k84k15l61Q1M06K06K62
7040D09J35l78l52k63J01J48L53K14J20k67l86k78J01Q3K92L97o0j18l08l39k2
7061d18J71K74L13J52j67k83l49j48k9K23N21J66O9l19m05k13j3K32M23R3M3j83
7083A53l45j79r0J33M07L83j5j07m55k80j0O9K63L85K02l15k12j94k79R9L78K22
7105B13K91l5l96k54k21j3K22K87L20j46j15k19l26K3qM80K85L5k50l00l41j4
7127d82L12J38L28J90j12m58j17l16K44J82L01K78J2m35l26j77J28M8M48K14n6
$$ plain form
7148 344 137 -70 -246 -440 -173 25 442 430 189 -104 -259 -370 -317 -64 417 486 366 -34 -351 -450 -338
7169 -338 -169 246 382 358 31 -246 -373 -366 -162 88 414 298 107 -81 -513 -390 -265 57 511 352 197
7190 197 -110 -338 -443 -241 -51 251 431 286 -104 -322 -365 -255 -172 296 403 258 64 -96 -305 -320 -38
7211 -38 271 402 372 119 -101 -490 -438 -332 162 324 462 190 -133 -310 -375 -325 92 252 392 181 92 -234
7233 -234 -394 -325 -120 260 408 327 61 -176 -367 -306 -111 182 240 406 49 -25 -430 -351 -128 134 352 374
7255 374 216 -168 -230 -428 -201 76 284 389 189 49 -245 -369 -329 -40 176 400 330 17 -195 -440 -250
7276 -250 -130 185 396 286 65 -61 -284 -356 -195 92 304 263 168 -63 -191 -265 -183 1 300 286 229 -47
7298 -47 -269 -332 -324 68 162 329 281 104 -189 -367 -255 -37 44 266 355 148 -251 -228 -214 -27 96 317 411 217
$$ packed form
7148C44k07k07j76j94K67J98M17j2k41k93j55j11N3K53M81O9j20m00l17r9J12
7169c38J69M15J36k4l27k77j27PK04K50L26j16j91j88m32J23J25L22M54j59j55
7190A97l07k28j05K02J90L02J80j45l90k18m3J10Q3M68J07j45j94j60k09j5K82
7211c8L09J31l0k53k20l89N2J06M94J62J38k72l23j77o5N0M17J60J40k11q9l26
7233b34j60O9K05L80J48q1k66k37j91O1J95K93N8J66l57p4m05P9K23K62K18K2
7255C74j58l84o2j98K27K77K08J05k00j40k94j24M0K89K16K24p0l13k12k45J90
7276b50J20L15K11j10k21j26k23p2J61K87K12m1r5k31j28p4Q2J84K99j4n7k76
7298d7k22o3QL92R4J67m8j77k93j78J12K18Q1K22Q9k07l99K3J4J87J23K21R4j94
$$ plain form
7322 217 -82 -249 -357 -145 32 267 230 112 11 -275 -324 -236 11 244 267 239 178 -185 -266 -296 -101 44 272
7345 272 146 102 -115 -266 -331 -55 106 342 117 210 -48 -261 -255 -274 38 262 313 281 31 -187 -212 -229 -80
7368 -80 290 306 258 25 -161 -244 -283 -44 -17 357 390 -50 -95 -266 -355 -266 207 328 289 197 -50 -323 -269 -46
7392 -46 15 259 233 195 -73 -157 -331 -234 -79 255 294 163 -20 -208 -225 -177 -104 190 366 250 103 -257 -357
7415 -357 -178 -176 55 261 156 139 -90 -279 -365 -66 55 344 366 174 -91 -211 -301 -320 25 196 320 278 -49
7438 -49 -259 -305 -235 14 162 235 180 183 -42 -309 -154 -82 189 453 356 183 -58 -249 -338 -192 124 215 333 220
7462 220 14 -115 -303 -235 91 133 319 271 -127 -265 -320 -259 5 182 252 189 139 -205 -288 -240 -65 298 322 181
7486 181 140 -21 -275 -246 -153 38 172 274 189 -104 -235 -195 -243 44 275 272 108 113 -166 -355 -211 -92 213
$$ packed form
7322B17k99j67j08K12J77K35l7j18j01k86m9Q8K47K33K3k8o1l63q1l0J95J45K28
7345B72j26m4k17j51o5K76J61K36k25R3k58k13Oj9L12K24N1l2k50k18k5j7J49
7368h0L70J6m8k33j86q3l9K39K7L74L3m40m5j71q9Q9M73J21l9r2k47k73N4K23
7392d6O1K44k6l8k68q4j74R7J55L34L9j31j83j88j7M8P3K94J76j16j47l60j00
7415c57J79KK31K06j05j7k29j89q6K99J21K89K2j92k65j20r0j9L45J71J24m2l27
7438d9k10m6P0K49J48P3n5Lk25k67J55P2K71K64r7j73k41j91q9J46L16R1J18j13
7462B20k06j29j88O8L26M2J86m8l98j38n5O1K64J77P0o3n0l44q3M8J75L63K4j41
7486A81m1j61k54K9R3J91J34J02q5k93j31M0m8K87K31lj64Nk79j89J44J19L05
$$ plain form
7509 213 306 349 118 -264 -324 -306 -104 127 317 222 148 -69 -152 -238 -55 48 290 171 163 16 -180 -311 -132
7532 -132 166 151 184 228 -12 -189 -263 -276 -24 225 222 170 -37 -198 -283 -190 -96 68 296 227 115 -38 -272 -235
7556 -235 -97 134 152 328 137 -139 -237 -350 -152 8 256 317 106 50 -198 -257 -138 164 207 264 160 -30
7578 -30 -187 -216 -100 -115 68 406 296 98 -27 -344 -298 -99 133 336 205 168 -63 -202 -216 -29 23 284
7600 284 289 126 41 -106 -189 -132 -101 100 188 99 -63 -102 -355 -255 -92 189 224 148 144 -79 -235 -353 100 92 143
7625 143 244 157 -160 -253 -190 -94 -23 329 152 107 -11 -205 -240 -158 91 137 127 200 89 -89 -234 -185 -92 159
7649 159 313 217 53 -86 -275 -267 -103 -18 285 231 278 -170 -296 -252 -154 87 299 191 242 -65 -123 -253 -222 -49
7673 -49 282 202 107 20 -142 -208 -267 -27 60 291 221 10 -67 -253 -207 -69 155 283 266 185 71 -228 -154 -66 -53
$$ packed form
7509B13R3M3k31l82o0J8K02K31J90r5p4k17q3q6J83J03K42j19qj47j96j31J79
7532a32K98j5L3M4k40j77p4j3K52K49ln2k07j61q5R3R4J64K28o9j12j53k34L7
7556b35J38K31J8J76j91k76r8j13J98J60K48O1k11n6k48n9J19L02M3N7j04j90
7578c0j57k9J16j5J83L38j10j98j25l17M6J99K32K03j31l7k31j39j4J87N2K61
7600B84Nj63q5j47q3N7L1K01Q8q9j62l9k53J00J63K81L5p6mk23j56j18M53qN1
7625A43J01q7l17r3O3R6P1L52j77m5j18j94l5Q2K49M6j0P3j11j78j45M9R3K51
7649A59J54r6j64j39j89QJ64Q5L03n4M7m48j26M4R8K41K12j08N1l07n8j30L1J73
7673d9L31q0r5q7j62o6n9K40Q7K31p0k11p7j86M6J38K24J28j7q1j14k99P4Q8J3
$$ plain form
7698 -53 205 227 163 -3 -264 -208 -149 63 197 120 248 18 -171 -182 -103 -66 78 269 129 28 -168 -348 -331
7721 -331 -74 126 292 207 37 -92 -307 -219 -24 -12 292 236 55 -8 -233 -334 -170 104 141 179 187 91 -265
7744 -265 -223 -220 40 86 290 310 6 -177 -208 -225 -185 94 166 319 31 -123 -255 -331 -38 44 188 376 170 -61
7768 -61 -112 -265 -103 -28 164 326 228 7 -111 -194 -221 6 189 271 208 18 -6 -281 -258 5 172 366 176
7791 176 248 -199 -146 -316 -148 133 124 226 147 -15 -148 -312 -282 52 194 243 161 -68 -120 -207 -158 37 126 217
7815 217 206 71 -174 -219 -183 -40 41 224 205 106 -26 -133 -219 -122 121 168 214 -63 -101 -223 -288 -161 99 186
7839 186 157 202 15 -160 -266 -187 -88 155 192 222 -98 -169 -333 -216 -45 66 291 250 50 -44 -244 -419 -188
7862 -188 60 183 198 56 -130 -117 -192 -106 -80 245 270 59 -22 -202 -224 -269 30 118 187 325 168 -193 -331 -150
$$ packed form
7698e3K58K2o4j66k61N6N9K12J34p7J28k30j89j1P9L7J44J91j40j01j96j80J7
7721c31K57K00J66q5j70j29k15Q8J95J2L04n6j81o3k25j01J64K74L7L8Qr6l56
7744b65M2LK60M6K04K0l04j83l1j7M0K79P2J53k88j54j32p6K93Q2J44J88k06k31
7768f1n1j53J62P5J92J62r8k21j18q3k7K27J83Q2o3j90k4k75K3K63J67J94j90
7791A76P2m47N3j70J68K81rJ02p9j62j33j64L0L34J42M9q2k29n2q7M9J95Q9R1
7815B17j1j35k45m5L6J43Q1J83j9r9j32j07q6R7K43M7M6k77l8j22o5J27K60Q7
7839A86k9M5j87j75j06P9R9K43L7L0l20p1j64J17J71J11K25m1k00r4k00j75K31
7862a88K48J23J5j42j86J3p5Q6K6L25K5k11q1j80k2m5K99Q8O9J38j57l61j38J81
$$ plain form
7886 -150 -60 130 277 388 73 -122 -205 -307 -17 163 230 199 139 11 -193 -314 -128 64 240 300 132 22
7908 22 -240 -275 -207 14 241 152 112 17 -101 -233 -228 -90 145 217 90 161 -140 -205 -341 -169 22 238 122 164
7932 164 -143 -184 -252 -147 130 132 170 129 -48 -46 -295 -154 -30 245 259 317 8 -87 -134 -291 16 169 242 145 45
7957 45 -150 -155 -216 -178 47 164 237 147 -35 -139 -204 -57 21 131 203 81 -113 -95 -188 -201 47 45 217 293 149
7982 149 -129 -249 -241 -63 63 161 291 -29 -61 -72 -230 26 48 221 141 121 -46 -126 -191 -139 1 340 227 256
8006 256 15 -114 -285 -224 47 257 250 162 -7 -96 -237 -321 -122 -11 274 306 79 -145 -180 -239 -103 42 255
8029 255 259 195 -177 -201 -87 -132 -17 217 324 198 7 -275 -296 -164 -139 279 317 179 131 -110 -227 -213 13
8052 13 174 331 159 -1 -205 -282 -78 -191 76 239 187 147 3 -250 -231 -97 -29 250 214 283 113 -304 -115
$$ packed form
7886a50R0J90J47J11l15j95q3j02K90J80O7l1o0j28k04j21J86J92J76O0j68j10
7908B2k62l5O8K21K27q9m0r5j18j32NJ38K35P2j27P1l01o5j36J72J91K16j16M2
7932A64l07m1o8J05K77KL8m1j77Kk49J41J24K75J4N8l09r5m7j57L07J53P3r7j00
7957D5j95no1L8K25J17P3r0j82j04o5J47P8J10P2j22j94J8r3j3K48kJ72P6j44
7982A49k78j20QJ78J26R8J30l20l2j1j58K56K2J73q0k0j67q0o5N2J40L39j13K9
8006B56k41j29j71O1K71K10pq8j69q9j41q4J99J11K85L2k27k24l5n9J36J45K13
8029B55Mo4l72k4J14m5J15K34J07j26j91k82k1J32K5M18L8j38m8k41j17J4K26
8052A3J61J57j72j60k04p7K04j13K67J63n2m0j44k53J9J34O8K79l6O9j70m17J89
$$ plain form
8075 -115 -203 -80 337 189 150 -57 -96 -203 -193 70 120 317 162 25 -58 -211 -164 -78 67 123 218 -56 -118 -248
8099 -248 -208 -123 -6 247 387 120 -184 -236 -274 -163 -38 177 214 191 -54 -166 -227 -131 -33 127 277 216 169 -94
8123 -94 -209 -266 -112 58 255 260 218 -20 -127 -143 -112 85 262 195 99 -15 -221 -300 -255 -122 108 248 238 -88
8147 -88 -186 -260 -99 50 -22 132 194 190 -67 -233 -283 -44 85 234 230 89 -135 -191 -242 -61 32 161 193 211 -113
8172 -113 -246 -226 -177 22 128 335 191 -16 -197 -177 -226 -43 89 196 84 53 -47 -145 -140
$$ packed form
8075a15q8J23M17j48l9k07l9j07J0K63N0J97j55j37q3j53M7Q6J45N6R5k74o2j30
8099b48M0Q5J17K53J40k67l04n2l8J11J25K15L7k3k45j12o1R6R8J60J50o1m7k63
8123i4j15n7J54J70J97Nm2k38j07j6L1J97J77o7r6j14k06p9M5J33K30J40j0l26
8147h8r8p4J61J49p2J54O2mk57j66n0K39J29J49mj41k24n6n1J81R3J29L2J8l24
8172a13j33K0M9J99J06K07j44k07j81K0m9J83J32J07j12l1j00r8N
8191a40
$$ Imaginary data points
##PAGE= N=2
##DATA TABLE= (X++(I..I)), XYDATA
$$ plain form
0 0 0 0 0 0 0 0 0 0 0 0 5 -8 8 -8 8 -8 16 -16 16 -24 24 -29 35 -37 45 -50 55 -66 70 -81 92 -101 114 -126
34 -126 142 -158 173 -193 214 -235 262 -289 319 -355 391 -438 487 -544 615 -694 790 -912 1063
53 1063 -1265 1538 -1941 2577 -3703 6119 -13448 80469 436828 320039 -17667 -113836 -30595
66 -30595 -113488 -280262 -173079 192611 387919 222519 -49125 -169731 -186835 -186583 -101918
77 -101918 94401 241361 214110 80410 -56700 -196480 -288975 -186473 104560 305614
87 305614 221398 21619 -51161 -65475 -188729 -282250 -86447 270897 374218 126674 -125534
98 -125534 -146819 -100720 -153022 -147866 72338 312275 277989 13069 -192324 -210053 -143643
109 -143643 -67151 56233 200850 234965 105391 -78602 -194730 -215875 -140190 35337 221291
$$ packed form
0@%%%%%%%%%%Nj3J6j6J6j6K4l2L2m0M8n3O4p2Q2r5J05j21J36j51J73j93K15k40
34a26K68l00L31l66M07m49M97n51O08o74P46q29R25j031J159j309J484j702J975
53A063k328K803l479M518o280R822j9567R3917L56359j16789l37706r6169Q3241
66c0595q2893j66774J07183L65690J95308j65400k71644j20606j7104K52Q4665
77a01918J96319J46960k7251j33700j37110j39780r2495J02502K91033K01054
87C05614q4216j99779p2780j4314j23254r3521J95803L57344J03321k47544k52208
98a25534k1285M6099n2302N156K20204K39937l4286k64920k05393j7729O6410
109a43643P6492J23384J44617L4115j29574j83993j16128k1145P5685J75527J85954
$$ plain form
120 221291 255296 104822 -74844 -151342 -161044 -158128 -71491 134967 290360 204247 -42709
131 -42709 -198462 -179539 -110166 -54231 56751 208448 240100 73504 -144641 -228994 -164757
142 -164757 -48509 69219 175263 208294 110437 -64049 -188765 -197569 -112722 22056 160961
153 160961 223338 141264 -38015 -173758 -185940 -116904 -22192 96243 204711 196898 33769
164 33769 -157768 -217753 -135049 -13786 85175 163692 186680 93327 -83003 -207004 -188130
175 -188130 -62975 76549 168650 181791 101947 -41200 -164647 -190976 -111407 21779 141722
186 141722 191815 136491 -5851 -147532 -193445 -125560 -3644 106578 169012 155835 48955
197 48955 -106442 -201584 -162975 -30962 96871 161320 153109 72232 -59722 -172432 -184938
$$ packed form
120B21291L4005j50474j79666p6498r702K916Q6637K06458J55393q6113k46956
131d2709j55753J8923O9373N5935J10982J51697L1652j66596k18145q4353O4237
142a64757J16248J17728J06044L3031r7857j74486j24716q804Q4847J34778J38905
153A60961O2377q2074j79279j35743j2182O9036R4712J18435J08468p813j63129
164C3769j91537n9985Q2704J21263R8961P8517K2988r3353j76330j24001J8874
175a88130J25155J39524R2101J3141p9844j43147j23447k6329P9569J33186J19943
186A41722N0093n5324j42342j41681m5913O7885J21916J10222O2434j3177j06880
197D8955j55397r5142L8609J32013J27833O4449q211q0877j31954j12710j2506
$$ plain form
208 -184938 -83474 62091 161742 169336 90712 -33704 -142326 -175233 -110222 16695 134216
219 134216 176834 121937 518 -120259 -173792 -128841 -11498 109495 167437 136498 34533
230 34533 -89108 -168504 -153387 -47854 83757 163300 151151 60892 -59334 -150159 -161383
241 -161383 -81062 46618 147237 164676 91980 -29291 -131908 -160897 -102436 11609 120388
252 120388 163529 114176 395 -111958 -161215 -123382 -20508 93386 156918 132179 30630
263 30630 -88253 -156429 -139586 -49713 66046 146483 146892 65374 -53430 -142326 -150180 -73971
275 -73971 40720 130483 150460 90637 -19163 -119749 -152731 -97780 12551 113887 151137
286 151137 107258 5806 -99431 -149344 -115912 -19083 88189 148643 127778 34607 -77786
$$ packed form
208a84938J01464J45565R9651P594p8624j24416j08622l2907O5011J26917J17521
219A34216M2618n4897j21419j20777n3533M4951J17343J20993N7942l0939j01965
230C4533j23641p9396J5117J05533J31611P9543j2149r0259j20226r0825j1224
241a61383Q0321J27680J00619J7439p2696j21271j02617k8989N8461J14045J08779
252A20388M3141m9353j13781j12353m9257L7833J02874J13894O3532k4739j01549
263C0630j18883o8176J6843Q9873J15759Q0437M09q1518j18804q8896p854P6209
275g3971J14691Q9763J9977n9823j09800j00586l2982N4951J10331J01336L7250
286A51137m3879j01452j05237m9913L3432R6829J07272O0454k0865r3171j12393
$$ plain form
297 -77786 -145152 -130802 -46361 60350 133734 136175 64487 -46007 -132604 -143748 -73103 35406
309 35406 119887 136774 80756 -18201 -110618 -145222 -97338 7544 106344 142072 99547 5573
321 5573 -90993 -139614 -112416 -22025 81674 139729 119987 34872 -67832 -132768 -124392 -47885
333 -47885 53893 125266 128201 61224 -39838 -119345 -132119 -70977 29573 112457 132252 79943
345 79943 -14591 -101227 -133343 -91131 3131 96429 135325 99392 10377 -82437 -130599 -107871
357 -107871 -25383 71955 128790 113340 36101 -60063 -123194 -119302 -50086 45793 115906 121110
369 121110 58652 -36207 -111034 -124771 -69816 23230 102779 125676 79917 -10063 -95039 -127453
381 -127453 -88812 -1434 85935 125673 96950 15999 -73170 -122893 -104738 -27967 64026 119412
$$ packed form
297g7786o7366J4350Q4441J06711P3384K441p1688j10494q6597j1144P0645J08509
309C5406Q4481J6887n6018r8957r2417l4604M7884J04882R8800L5728m2525r3974
321E573r6566m8621K7198R0391J03699N8055j9742q5115j02704o4936Q376P6507
333d7885J01778P1373K935o6977j01062p9507j2774O1142J00550Q2884J9795n2309
345G9943r4534q6636l2116M2212R4262R3298L8896l5933q9015r2814m8162K2728
357a07871Q2488R7338N6835j5450p7239r6164o3131L892O9216R5879P0113N204
369A21110o2458r4859p4827j3737N4955R3046P9549K2897m5759q9980q4976l2414
381a27453L8641Q7378Q7369L9738k8723q0951q9169m9723J8155P6771R1993N5386
$$ plain form
393 119412 108539 38759 -51348 -112797 -112419 -49905 40705 109149 116283 59140 -29880 -101960
405 -101960 -117969 -68923 18070 94882 119339 78481 -5510 -86435 -120032 -87780 -7402 76768
417 76768 117647 93287 18841 -65260 -114130 -100632 -31229 55897 111442 104494 40250 -44585
429 -44585 -104061 -107663 -52877 32509 101104 112613 60542 -24001 -93204 -111622 -70947 7904
441 7904 83971 115036 80245 -551 -79297 -112114 -83842 -12118 65619 109244 93339 24399
453 24399 -59090 -108175 -95339 -30490 49675 102745 100339 42404 -38732 -97779 -102606 -51553
465 -51553 28137 93858 107605 60627 -20724 -87942 -104698 -66239 4969 74841 107687 80520
477 80520 4549 -74940 -108536 -79485 -10473 59237 97960 88107 29313 -51036 -104910 -96238
$$ packed form
393A19412j0873o9780r0107o1449L78O2514R0610O8444P134n7143q9020p2080
405a01960j6009M9046Q6993P6812K4457m0858q3991q0925l3597L2252Q0378Q4170
417G6768M0879k4360p4446q4101m8870J3498O9403Q7126N5545o948o4244q4835
429d4585n9476l602N4786Q5386O8595J1509n2071q4543o9203j8418M0675P8851
441G904P6067L1065l4791q0796p8746l2817K8272P1724P7737M3625j5905o8940
453B4399q3489m9085J2836O4849Q0165N3070k406n7935q1136n9047m827N1053
465e1553P9690O5721J3747m6978q1351o7218j6756L8459P1208O9872L2846k7167
477H0520p5971p9489l3596K9051O9012O9710L8723r853n8794q0349n3874Q672
$$ plain form
489 -96238 -31694 46447 94549 92030 43323 -29576 -89786 -101706 -55041 22780 86263 101593
501 101593 61730 -11902 -78783 -101029 -66818 1917 67905 98671 78414 13810 -62333 -103708
513 -103708 -82068 -13480 57220 92540 80744 30462 -38517 -92816 -96109 -39078 41903 93219
525 93219 88381 40086 -24394 -78466 -95040 -58674 14942 80803 97821 59604 -8240 -70258
537 -70258 -95401 -68803 -3254 63235 93024 72284 13861 -53647 -94654 -82987 -21610 51969
549 51969 91907 77921 25439 -36002 -81233 -88072 -44793 30721 89670 92025 40984 -25647
561 -25647 -72783 -84473 -55355 7305 72006 95976 62145 -5364 -65324 -88386 -65179 -6544
573 -6544 57124 89455 71186 14298 -48821 -85870 -77702 -25752 43150 88120 80352 27146 -37152
$$ packed form
489i6238O4544P8141M8102k519m8707p2899o0210j1920M6665P7821O3483J5330
501A01593l9863p3632o6881k2246L4211O8735O5988L0766k0257o4604p6143m1375
513a03708K1640O8588P0700L5320j1796n0282o8979n4299l293N7031Q0981N1316
525I3219m838m8295o4480n4072j6574L6366P3616O5861J7018l8217o7844o2018
537g0258k5143K6598O5549O6489K9789k0740n8423o7508m1007J1667O1377P3579
549E1969L9938j3986n2482o1441m5231o839M3279P5514N8949K355n1041o6631
561b5647m7136j1690K9118O2660O4701K3970l3831o7509n9960k3062K3207N8635
573f544O3668L2331j8269n6888o3119l7049Q168N1950O8902M4970p768n3206o4298
$$ plain form
586 -37152 -78319 -79599 -41614 20775 76776 89848 47337 -22496 -74581 -82705 -50223 6093
598 6093 61263 86094 61898 833 -60491 -86255 -64594 -8348 52780 84606 68752 15893
610 15893 -43594 -79531 -73931 -27818 36537 81857 80298 32881 -31377 -75741 -77614 -38961 18709
623 18709 67736 82618 51813 -10998 -68379 -84333 -51163 7282 58075 77970 58341 7165
635 7165 -50626 -82151 -67122 -12785 49023 80937 65729 16862 -37487 -72868 -72797 -32417 30310
648 30310 76598 76736 32885 -25842 -68502 -75831 -42525 15551 65066 76868 46983 -7076 -58516
661 -58516 -79682 -55122 2895 57460 76656 54090 6208 -44287 -74269 -65429 -16979 44326
673 44326 78640 64953 17367 -33834 -66372 -68411 -34530 24883 73453 75234 31349 -23320
$$ packed form
586c7152m1167j280L7985O2389N6001J3072m2511o9833n2085q124L2482N6316
598F093N5170K4831k4196o1065o1324k5764K1661N6246O1128L1826j5854n2859
610A5893n9487l5937N600M6113O4355M5320j559m7417o4258m4364j873L8653N7670
623A8709M9027J4882l0805o2811n7381j5954L3170N8445N0793J9895j9629n1176
635G165n7791l1525J5029N4337O1808L1914j5208m8867n4349l5381P1M0380O2727
648C0310M6288J38m3851n8727m2660p329L3306N8076M9515J1802k9885n4059n1440
661e8516k1166K4560N8017N4565J9196k2566m7882n0495k9982Q840M8450O1305
673D4326L4314j3687m7586n1201l2538k039L3881N9413M8570J781m3885n4669
$$ plain form
685 -23320 -59829 -69000 -45774 7695 63008 79539 45237 -10631 -53558 -68675 -53002 -7251
697 -7251 48573 77823 58459 5731 -45002 -68952 -59032 -19502 33556 70906 66803 22874 -31695
710 -31695 -65090 -64281 -32458 18449 63912 72629 35502 -20098 -57625 -63472 -42519 236 52092
723 52092 78412 52127 -8435 -55957 -64835 -44653 -9148 35599 70355 64886 14242 -45367
735 -45367 -71505 -54266 -13201 29200 59207 62963 30822 -24028 -65638 -65545 -28335 20623 56660
748 56660 65010 38616 -12155 -56133 -65291 -39079 3499 45134 68584 53772 1405 -52881
760 -52881 -69350 -44282 -3642 33038 58466 59491 22795 -35879 -72852 -59815 -12963 32123
772 32123 54771 53549 29573 -14890 -58670 -68384 -33200 20918 56519 58842 34084 -6896 -47628
$$ packed form
685b3320l6509r171K3226N3469N5313J6531l4302n5868m2927j5117J5673M5751
697g251N5824K9250j9364n2728n0733k3950R920L9530N3058L7350m103m3929n4569
710c1695l3395Q09L1823N0907M5463Q717l7127n5600l7527n847K0953M2755N1856
723E2092K6320k6285o0562m7522q878K0182L5505M4747L4756n469n0644n9609
735d5367k6138J7239M1065M2401L0007L756l2141n4850m1610R3L7210M8958L6037
748E6660Q350k6394n0771m3978r158K6212M2578M1635K3450j4812n2367n4286
760e2881j6469K5068M0640L6680K5428J025l6696n8674l6973J3037M6852M5086
772C2123K2648j222k3976m4463m3780r714L5184N4118L5601K323k4758m0980m0732
$$ plain form
785 -47628 -64642 -43065 3529 45519 62224 47883 7256 -41613 -67227 -50271 -4611 37235
797 37235 56199 50696 21529 -24668 -62854 -62616 -20628 31520 58846 51788 23274 -13814 -48674
810 -48674 -62228 -38143 13183 55731 60929 32217 -8230 -42585 -58396 -44560 -2576 42549
822 42549 61115 44608 6490 -34559 -59856 -52694 -12947 34319 58244 48432 16519 -21717
834 -21717 -52228 -57897 -28245 22175 58230 56112 23035 -16559 -44801 -53446 -36356 4789 48302
847 48302 62647 37136 -7767 -42559 -53676 -39923 -5146 36200 58894 46272 7401 -32833
859 -32833 -54338 -48547 -16073 28247 56728 50390 15939 -22779 -48416 -51603 -27996 14990 52302
872 52302 57585 26955 -16768 -46546 -50742 -31973 2911 40443 58043 40286 -3054 -42306
$$ packed form
785d7628j7014K1577M6594M1990J6705j4341m0627m8869k5614J6956M5660M1846
797C7235J8964n503k9167m6197l8186K38M1988N2148K7326p058k8514l7088l4860
810d8674j3554K4085N1326M2548N198k8712m0447l4355j5811J3836M1984M5125
822D2549J8566j6507l8118m1049k5297P162L9747M7266K3925r812l1913l8236
834b1717l0511n669K9652N0420L6055k118l3077l9594k8242q645J7090M1145M3513
847D8302J4345k5511m4903l4792j1117J3753L4777M1346K2694j2622l8871m0234
859c2833k1505N791L2474M4320K8481o338l4451l8718k5637l187K3607M2986L7312
872E2302N283l0630m3723k9778m196J8769L4884L7532J7600j7757m3340l9252
$$ plain form
884 -42306 -54410 -37630 -4246 31554 53253 45865 10524 -30947 -52982 -45576 -15111 23975
896 23975 51518 49984 19006 -21291 -47835 -48479 -24998 12616 46081 54349 29970 -11819 -44480
909 -44480 -50986 -31075 3714 37345 52646 38965 1608 -37259 -53462 -38535 -4258 30314
921 30314 49415 43215 12463 -26650 -50742 -45198 -14957 22143 47133 47244 20812 -17531 -45955
934 -45955 -48531 -24973 11861 42766 50438 29613 -7668 -40154 -50252 -32960 2102 36019
$$ packed form
884d2306j2104J6780L3384L5800K1699p388l5341m1471k2035P406L0465L9086
896B3975K7543j534l0978m0297k6544o44K3481L7614L3465Q268k4379m1789l2661
909d4480o506J9911L4789L3631J5301j3681l7357l8867j6203J4927L4277L4572
921C0314J9101o200l0752l9113k4092N544L0241L7100K4990J11k6432l8343k8424
934d5955k576K3558L6834L0905P672k0825l7281l2486j0098J7292L5062L3917
$$ [...]
8191D2
##END NTUPLES=NMR FID
##END=
