##TITLE=1H_PR90_R9
 DMSO-d6, 8 sc, 
 9.1.2019
##JCAMPDX= 6.0         $$ Bruker NMR JCAMP-DX V2.0
##DATA TYPE= NMR FID
##DATA CLASS= NTUPLES
##ORIGIN= UXNMR, Bruker Analytische Messtechnik GmbH
##OWNER= root
$$ XWIN-NMR		Version 3.5
$$ Wed Jan  9 14:41:52 2019 Russian Standard Time (UT+4h)  she@DPX200
##.OBSERVE FREQUENCY= 200.1313
##.OBSERVE NUCLEUS= ^1H
##.DELAY= (6, 6)
##.ACQUISITION MODE= SIMULTANEOUS
##.ACQUISITION SCHEME= undefined
##.AVERAGES= 8
##.DIGITISER RES= 18
##SPECTROMETER/DATA SYSTEM= spect
##.PULSE SEQUENCE= zg30
##.SOLVENT NAME= DMSO
##.SHIFT REFERENCE= (INTERNAL, DMSO, 0, 15.7039)
##AUDIT TRAIL= $$ (NUMBER, WHEN, WHO, WHERE, WHAT)
$$ ##TITLE= Audit trail, XWIN-NMR		Version 3.5
$$ ##JCAMPDX= 5.01
$$ ##ORIGIN= Bruker BioSpin GmbH
$$ ##OWNER= she
$$ F:/spectra/data/she/nmr/H-F/1/audita.txt
$$ ##AUDIT TRAIL=  $$ (NUMBER, WHEN, WHO, WHERE, WHAT)
(   1,<2019-01-09 14:37:56.37 +0400>,<she>,<DPX200>,
      <created by zg, POWCHK disabled, PULCHK disabled
       configuration hash MD5:
       00 E9 B6 7A A2 85 ED C7 34 08 36 98 17 FE 4E 26
       data hash MD5: 16K
       97 83 6D BC 25 13 B9 9D 5D 14 8B 76 A9 7A A9 31>)
$$ ##END=
$$ 
$$ hash MD5
$$ 80 4A 9D F6 31 A2 04 F6 DF AD 47 45 CC 50 FF 2E
##$RELAX= 
##$RELAX= 
##$RELAX= 
##$RELAX= 
##$RELAX= 
##$RELAX= 
$$ Bruker specific parameters
$$ --------------------------
##$DU= <F:/spectra>
##$EXPNO= 1
##$NAME= <H-F>
##$PROCNO= 1
##$TYPE= <nmr>
##$USER= <she>
##$AMP= (0..31)
100 100 100 100 100 100 100 100 100 100 100 100 100 100 100 100 100 100 
100 100 100 100 100 100 100 100 100 100 100 100 100 100 
##$AQSEQ= 0
##$AQ_mod= 1
##$AUNM= <au_zg>
##$AUTOPOS= <>
##$BF1= 200.13
##$BF2= 200.13
##$BF3= 200.13
##$BF4= 200.13
##$BF5= 200.13
##$BF6= 200.13
##$BF7= 200.13
##$BF8= 200.13
##$BYTORDA= 1
##$CFDGTYP= 0
##$CFRGTYP= 5
##$CHEMSTR= <none>
##$CNST= (0..31)
1 1 145 1 1 1 1 1 1 1 1 1 1 1 1 1 1 1 1 1 1 1 1 1 1 1 1 1 1 1 1 1 
##$CPDPRG= <>
##$CPDPRG1= <>
##$CPDPRG2= <>
##$CPDPRG3= <>
##$CPDPRG4= <mlev>
##$CPDPRG5= <mlev>
##$CPDPRG6= <mlev>
##$CPDPRG7= <mlev>
##$CPDPRG8= <mlev>
##$CPDPRGB= <>
##$CPDPRGT= <>
##$D= (0..31)
0 1.2 0 0 0 0 0 0 0 0 0 0.03 0 0 0 0 0 0 0 0 0 0 0 0 0 0 0 0 0 0 0 0 
##$DATE= 1547030276
##$DBL= (0..7)
120 120 120 120 120 120 120 120 
##$DBP= (0..7)
150 150 150 150 150 150 150 150 
##$DBP07= 0
##$DBPNAM0= <>
##$DBPNAM1= <>
##$DBPNAM2= <>
##$DBPNAM3= <>
##$DBPNAM4= <>
##$DBPNAM5= <>
##$DBPNAM6= <>
##$DBPNAM7= <>
##$DBPOAL= (0..7)
0.5 0.5 0.5 0.5 0.5 0.5 0.5 0.5 
##$DBPOFFS= (0..7)
0 0 0 0 0 0 0 0 
##$DE= 6
##$DECBNUC= <off>
##$DECIM= 24
##$DECNUC= <off>
##$DECSTAT= 4
##$DIGMOD= 1
##$DIGTYP= 9
##$DL= (0..7)
0 120 120 120 120 120 120 120 
##$DP= (0..7)
150 150 150 150 150 150 150 150 
##$DP07= 0
##$DPNAME0= <>
##$DPNAME1= <>
##$DPNAME2= <>
##$DPNAME3= <>
##$DPNAME4= <>
##$DPNAME5= <>
##$DPNAME6= <>
##$DPNAME7= <>
##$DPOAL= (0..7)
0.5 0.5 0.5 0.5 0.5 0.5 0.5 0.5 
##$DPOFFS= (0..7)
0 0 0 0 0 0 0 0 
##$DQDMODE= 0
##$DR= 18
##$DS= 0
##$DSLIST= <SSSSSSSSSSSSSSS>
##$DSPFIRM= 0
$$ [...]
##$SUBNAM2= <"">
##$SUBNAM3= <"">
##$SUBNAM4= <"">
##$SUBNAM5= <"">
##$SUBNAM6= <"">
##$SUBNAM7= <"">
##$SUBNAM8= <"">
##$SUBNAM9= <"">
##$SW= 24.933730806125
##$SWIBOX= (0..15)
0 0 2 0 0 0 0 0 0 0 0 0 0 0 0 0 
##$SW_h= 4990.01996007984
##$TD= 16384
##$TD0= 1
##$TE= 0
##$TE2= 300
##$TE3= 300
##$TEG= 300
##$TL= (0..7)
0 120 120 120 120 120 120 120 
##$TP= (0..7)
150 150 150 150 150 150 150 150 
##$TP07= 0
##$TPNAME0= <>
##$TPNAME1= <>
##$TPNAME2= <>
##$TPNAME3= <>
##$TPNAME4= <>
##$TPNAME5= <>
##$TPNAME6= <>
##$TPNAME7= <>
##$TPOAL= (0..7)
0.5 0.5 0.5 0.5 0.5 0.5 0.5 0.5 
##$TPOFFS= (0..7)
0 0 0 0 0 0 0 0 
##$TUNHIN= 0
##$TUNHOUT= 0
##$TUNXOUT= 0
##$USERA1= <user>
##$USERA2= <user>
##$USERA3= <user>
##$USERA4= <user>
##$USERA5= <user>
##$V9= 5
##$VALIST= <valist>
##$VCLIST= <CCCCCCCCCCCCCCC>
##$VD= 0
##$VDLIST= <DDDDDDDDDDDDDDD>
##$VPLIST= <PPPPPPPPPPPPPPP>
##$VTLIST= <TTTTTTTTTTTTTTT>
##$WBST= 1024
##$WBSW= 4
##$XGAIN= (0..3)
0 0 0 0 
##$XL= 0
##$YL= 0
##$YMAX_a= 181359
##$YMIN_a= -233644
##$ZGOPTNS= <>
##$ZL1= 120
##$ZL2= 120
##$ZL3= 120
##$ZL4= 120
##$ABSF1= 10
##$ABSF2= 0
##$ABSG= 5
##$ABSL= 3
##$ALPHA= 0
##$AQORDER= 0
##$ASSFAC= 0
##$ASSFACI= 0
##$ASSFACX= 0
##$ASSWID= 0
##$AUNMP= <proc_1d>
##$AZFE= 0.1
##$AZFW= 0.1
##$BCFW= 1
##$BC_mod= 2
##$BYTORDP= 1
##$COROFFS= 0
##$CY= 11.3945322036743
##$DATMOD= 1
##$DC= 2
##$DFILT= <>
##$DTYPP= 0
##$F1P= 18.9103706918063
##$F2P= -1.10871071338519
##$FCOR= 0.5
##$FTSIZE= 0
##$FT_mod= 4
##$GAMMA= 1
##$GB= 0.15
##$INTBC= 1
##$INTSCL= 1
##$ISEN= 128
##$LB= 0.24
##$LEV0= 0
##$LPBIN= 0
##$MAXI= 10000
##$MC2= 0
##$MEAN= 0
##$ME_mod= 0
##$MI= 1.114404
##$NCOEF= 0
##$NC_proc= 0
##$NLEV= 6
##$NOISF1= 3.799351
##$NOISF2= 2.8
##$NSP= 1
##$NTH_PI= 0
##$NZP= 0
##$OFFSET= 15.70392
##$PC= 1
##$PHC0= -8850.682
##$PHC1= 6.67572e-05
##$PH_mod= 1
##$PKNL= yes
##$PPARMOD= 0
##$PSCAL= 0
##$PSIGN= 0
##$REVERSE= no
##$SF= 200.130013532006
##$SI= 16384
##$SIGF1= 3
##$SIGF2= 2
##$SINO= 400
##$SIOLD= 16384
##$SREGLST= <1H.CDCl3>
##$SSB= 0
##$STSI= 0
##$STSR= 0
##$SW_p= 3612.71676300578
##$SYMM= 0
##$S_DEV= 0
##$TDeff= 0
##$TDoff= 0
##$TI= <>
##$TILT= no
##$TM1= 0
##$TM2= 0
##$TOPLEV= 0
##$USERP1= <user>
##$USERP2= <user>
##$USERP3= <user>
##$USERP4= <user>
##$USERP5= <user>
##$WDW= 1
##$XDIM= 8192
##$YMAX_p= 0
##$YMIN_p= 0
$$ End of Bruker specific parameters
$$ ---------------------------------
##NTUPLES= NMR FID
##VAR_NAME=  TIME,          FID/REAL,        FID/IMAG
##SYMBOL=    X,             R,               I
##VAR_TYPE=  INDEPENDENT,   DEPENDENT,       DEPENDENT
##VAR_FORM=  AFFN,          ASDF,            ASDF
##VAR_DIM=   8192,          8192,            8192
##UNITS=     SECONDS,       ARBITRARY UNITS, ARBITRARY UNITS
##FACTOR=    0.0002004,     1,               1
##FIRST=     0,             0,               0
##LAST=      1.6414764,     0,               0
##MIN=       0,             -233644,         0
##MAX=       1.6414764,     181359,          0
$$ Real data points
##PAGE= N=1
##DATA TABLE= (X++(R..R)), XYDATA
0@%%%%%%Oj4J6j6K4l2L2m0N6o4P2q8J09j33J53j77K08k40K78l20L64m16M73n33
30b82O01o78P60q51R53j062J182j314J459j619J793j985K197k435K699k990L319
47A747l694M120m612N189n877O713p751R085j0872J3413j7337K4267m0193J44885
61A19083M5847k03613J3362J00511J06169n8290j24954r4754L0498O5507L3137
72C2503l5990l3006j1704Q731o717N264L2838M8695q22n7995n8994K3485R1605
85C7893O7914l8745j03095n6177N6824J03366L7303o8227r2815k1949N9579O4494
97D6365L404m9513m2134j124K4107J8286N722L882Q56j5011k5988n416L4253M7151
111D4840O342m8751n5368j57N9476N5195q625o2722m8702J5412N8093L7030j7232
$$ plain form
0 0 0 0 0 0 0 0 6 -8 8 -8 16 -16 16 -24 32 -32 40 -48 61 -72 81 -96 112 -128 150 -170 194 -222 251 -282
30 -282 319 -359 401 -450 503 -559 623 -691 768 -851 942 -1043 1154 -1281 1418 -1572 1747
47 1747 -1947 2173 -2439 2750 -3127 3586 -4165 4920 -5952 7461 -9876 14391 -25802 119083
61 119083 164930 -38683 -25321 75190 181359 123069 -1885 -96639 -66141 -634 32503
72 32503 -3487 -36493 -48197 -39466 -46183 -40919 -8081 40614 39792 -18203 -77197 -53712 37893
85 37893 105807 67062 -36033 -92210 -35386 67980 105283 37056 -55759 -77708 -18129 46365
97 46365 49769 256 -41878 -43002 -18895 -609 5113 8995 9851 -5160 -31148 -36564 -2311 44840
111 44840 51182 2431 -52937 -53094 6382 61577 52952 -9770 -58472 -43060 15033 52063 34831
124C4831m6110k4435J3864K9465J5565n047j1989j0771p955k164J0887K0898J1565
137B8604j5848l3299j7229K1325L9735J6431k7261m2490j2379L1282M1020Q144
149C8035k9709l3783l385K6039K5465J323j8700j7806l254P987R866O658J376
162A0112n701j1427r766L836J7941J6152m089k2354j9212N778K5427J9326p362
175A8661k5891j7075Q028K3978J4817o390j9700j2116M303J4796J0148j406r727
188B426j0262m267N341J1072Q062k260j2188j1432P84J3605J3764J27j4141j6170
202a5539j689J3797J5615P66j3714j5381j672J3193J4737L104r833j2926l544
215a3086Q981J1801M766o184j0956o831L308J0199Q279j090r734r189O04R006
$$ plain form
124 34831 -11279 -35714 -21850 7615 23180 18133 6144 -4627 -12582 -14746 -3859 17039 28604
137 28604 12756 -20543 -37772 -16447 23288 39719 12458 -30032 -42411 -11129 29891 38035
149 38035 8326 -25457 -28842 -2803 22662 23985 5285 -12521 -15775 -7788 2078 8736 10112
162 10112 4411 -7016 -16782 -12946 4995 21147 17058 -5296 -24508 -18730 6697 26023 18661
175 18661 -7230 -24305 -16277 7701 22518 16128 -3572 -15688 -11385 3411 13559 12153 2426
188 2426 -7836 -12103 -6762 4310 12372 10112 -2076 -13508 -12724 881 14645 14772 631 -15539
202 -15539 -17228 -3431 12184 12950 -764 -16145 -17817 -4624 10113 13217 3384 -9542 -13086
215 -13086 -4105 7696 12462 6278 -4678 -11509 -8201 1998 10277 9187 -547 -9736 -9132 -126
229a26R944J009q602j0586k136P349J0282K582o655q992l425N848R830M663l161
244G824q821n238K796P595N993j951q350p456j42P341P700J58o424p351o44O337
260f33P203J931n508q097l457L877P026L370l433o852m645K504P071O067j077
275E347o593n781N34O351O419J28n954p250j287O053P169J775m570o890j915L979
291b485O954K915l321o745m283J649N923M904j498n851m836L74O373N847N30n129
307A321o010j027N476N938J596m509o563k315L455P071K776l342o279l549K130
322c831O206L957j966o062m398P46N124N300l17m305n164n95M003N083J542l314
338B009n679k745L108N194L114j739n070l356J391N340M721N3n421n437R1M903
$$ plain form
229 -126 9818 10827 2225 -8361 -10497 -3148 7134 9716 3061 -5931 -9356 -3508 6322 10985 7824
244 7824 -997 -6235 -3439 4156 10149 8198 -152 -7608 -7750 -409 7291 7449 1025 -6326 -6970 -633
260 -633 6570 8501 2993 -5104 -8561 -4684 2342 5712 2279 -4573 -9218 -6714 357 6424 5347
275 5347 -1246 -7027 -6493 -142 6277 6405 451 -6799 -8086 -2033 5136 6911 2341 -4549 -6464 -2485
291 -2485 4469 7384 4063 -2682 -6965 -5316 607 5511 4013 -1838 -6674 -6300 73 5920 6450 1321
307 1321 -4689 -5716 -240 5698 7294 2785 -3778 -6093 -2638 4433 7209 3867 -2412 -5961 -3831
322 -3831 2375 6332 4366 -1696 -6094 -5348 -224 5076 4759 454 -4710 -5305 -1302 3781 5323 2009
338 2009 -3670 -6415 -3307 1887 5001 3262 -1808 -5164 -3773 1567 6288 6341 920 -4517 -4426 477
354D77M934k73n046n215m62M622M936N69l419m418o14K104M023J719j683m136
370a882k414M86L368L170j84k236l824r03L807M452J472k748m711k174K410M372
386B461K033k734n046k651K904M609K128j554m334j487J342L301K658o95l091
401a56k697k10K273K785P38j397l363j187J853L931J950j419l451k379J033L286
417A590K368q49l471k978M2L494L140N1k958l063n68K579L258Q19k549l763p57
434c615J820L026J383j678k518j487J358K772J967o00k108k225l42K018K541O34
450B946k050l321j420J614L508J671j521l241k127J630L642K006j289l417k247
465c616J049K567K272j48k137j709j61J504K152R36o17k307j936K09K486K439
$$ plain form
354 477 5411 5138 92 -5123 -5585 -963 3973 4542 1123 -3295 -3909 -1805 2218 3937 2254 -1882
370 -1882 -4296 -3810 -442 2728 2544 308 -3516 -4419 -612 3840 5312 2564 -2147 -4321 -1911 2461
386 2461 4494 1760 -3286 -5937 -3033 1576 3704 2150 -2184 -3671 -2329 972 3630 2935 -156
401 -156 -2853 -3063 -790 1995 2733 1336 -2027 -3214 -1361 2570 4520 3101 -350 -2729 -1696 1590
417 1590 3958 3109 -362 -3340 -3298 196 3336 3387 429 -2634 -3202 -623 2635 3454 905 -2858 -3615
434 -3615 -1795 1231 2614 936 -1582 -3069 -1711 1061 3028 2428 320 -1905 -2247 -229 2312 2946
450 2946 896 -2425 -3845 -2231 1277 2948 1427 -1814 -3941 -2311 1331 3337 2048 -1369 -3616
465 -3616 -2567 0 2272 2124 -13 -1722 -1883 -379 1773 2709 2092 -215 -2151 -1942 544 2983
481B983r0k418l674P5L247L201M76l289l281n52L040K651k67k347k146n8J550
498h99J441L24M13r18j193j056Q68K419J968p46l603k820R42M194K877j415m878
515b082j742K219L954J676j895l440j632J883J402J091o50j414m56o73M40R47
531c72K039O76j648k431j248K528L190P94k793l831m59L214L684J19l234k590
547b362q5K519K310j75j465j948k67K81P16O03P59m42j526j228N36K295K068l19
565B270k780k484M16L047K541p50k720k407J89K825K670k2j880k432l67J637K184
582A937R13j028k249k510M80J855K655M77k460k531n02K403L211J160k649l180
598b018j357K172L260J191j824l017j540J169L164J674n87k483k195L71K245K184
$$ plain form
481 2983 2893 475 -3199 -3124 123 3324 3800 511 -2770 -3322 -282 2369 2102 -245 -2391 -2449 -899
498 -899 542 866 1279 361 -832 -1888 -1020 1399 3367 2621 -982 -3802 -2860 1334 4211 2796 -2082
515 -2082 -3824 -1605 2349 4025 2130 -1310 -2942 -1059 343 1434 784 -630 -1086 -1759 -1319 -372
531 -372 1667 2343 695 -1736 -2984 -456 2734 3528 735 -3096 -3555 -341 3343 3462 228 -2362
547 -2362 -2447 72 2382 2207 742 -1206 -1473 -1192 -476 127 886 444 -1082 -2310 -1774 521 2589 2270
565 2270 -510 -2994 -2578 469 3010 2260 -460 -2867 -2678 147 2817 2795 915 -1517 -1884 -247 1937
582 1937 2850 1822 -427 -2937 -2457 -602 2053 2530 70 -2461 -2963 -560 2651 3811 1162 -2018
598 -2018 -3375 -1203 2057 3248 1424 -1593 -3133 -1964 1200 2874 2287 -196 -2391 -2020 225 2409
614B409l7j663k385j008J247K572J028j264k162j695J314K159J340N8j914k091
630b092R5J357K153O49j715j762r66J273K317J469j312k396j425J547K456O00
646B248j598j712j90O09J131K69n48k58O9m1o16l3N44J133Q4j598j525M79K621
665A068J210j045k631p19J373K630K60k048j739P02J737O77j712j091Q08J642
681A122P3k028j093O75L278Q13k620k985J33L046K744j139l647j531J829K838
697A508R80k048j837o9J746Q57m15j061M23M85l84j596J54J897J411j87k860j892
715b888J793L168J133k663l435k35K883K826l95l078j943R26K586R98j345j349
731a018N77O46N41n70p42J206M54m29j894o44K072J836l80k710r93J004K655Q53
$$ plain form
614 2409 2372 709 -1676 -2684 -1437 1135 2163 899 -1263 -2958 -1644 515 1855 1913 -1 -2092
630 -2092 -1997 -640 1513 2162 447 -1315 -2281 -1008 1309 2778 1466 -930 -2355 -808 1648 2248
646 2248 650 -1062 -1252 -643 488 757 209 -49 20 -21 -637 -670 -126 1007 1091 -507 -2032 -1553 1068
665 1068 2278 1233 -1398 -2117 -744 1886 2146 98 -1641 -939 798 1475 -237 -1328 -520 1122
681 1122 1195 -833 -1926 -1251 2027 2840 220 -2765 -2632 414 3158 2019 -1628 -3159 -1330 1508
697 1508 2488 440 -1397 -1466 280 1137 722 -339 84 569 185 -1411 -1257 640 2051 1864 -996 -2888
715 -2888 -1095 2073 3206 543 -2892 -3127 -244 2582 2187 -891 -2834 -1908 678 1676 331 -1018
731 -1018 -441 205 746 176 -566 640 1094 665 -1229 -1873 199 2035 1655 -1055 -2048 -1044 1611 2464
749B464k538k033M28K128J789j606k199l91J657K080n07k000q11J204K041n0j992
766c36j394J478J413M62j614j339P14J719J52j072j049J37J676J22j031j468M47
783i83K054O32j780j884J71K143J702q40k712r22J613K275M48j692j901j4J717
800B7J362l49j185o57K08J235Q0j36m67L32k69o33n06O28J057L11j109j323o8
819a462J460J526j5j962j369P96K129Q57j073j483r71J178J355Qo22j008J22N91
837E7M96J17q7n42N4n97l10M70J083J28q58j149N8R26J136J32j282o94k1R95N55
858F67p0r64l15N66R7M96k03lk46j6l15k9P32K63l50j085n9J93Q34N07m52r67
880g19N5P23M31p4m4l72k51K47K98o8m0k89j09K51n4O0J16K25l12p3p6J29M34
$$ plain form
749 2464 -74 -2107 -1679 449 2238 632 -1567 -1958 -301 1779 1272 -728 -1539 -335 1706 1656 -336
766 -336 -1730 -252 1161 1623 9 -1330 -616 1103 1255 183 -866 -729 947 1069 38 -1430 -983
783 -983 1071 1703 -77 -1961 -1790 353 2055 1215 -1497 -2419 -806 1469 1917 225 -1676 -1690 27
800 27 1389 1040 -145 -802 -594 641 721 585 118 450 181 -452 -958 -330 727 1038 -71 -1394 -1462
819 -1462 -2 1524 1509 -453 -1822 -1026 1103 1960 887 -596 -1567 -389 966 974 352 -656 -534 57
837 57 553 670 583 41 95 -502 -812 -342 741 869 11 -1138 -1080 -154 982 1114 -168 -862 -883 112 667
858 667 597 -367 -682 -116 -19 477 274 271 25 9 -306 -335 397 660 310 -775 -834 -641 193 700 248 -719
880 -719 -664 59 490 416 372 0 -251 -4 294 226 186 -103 -212 39 -15 45 161 386 74 1 -75 54 488
903D88Q5m26n95n1L61M72k7k84l06k84M28q3N67P7r38j0J45Q88J0o54j70n6M11
926D8L57n1k30o5n14N66L38m98J25j29p8J73j36L4j75M05j27J28J1k10j71J9K29
949D9m2J71j65K11m10j4r1M40L85k01o42j88M52P51l02m61k89m4N96K73M5m37
971H7n35j53M31L89K63n34k37J02J09M42k25j69m30K62K49J90Lk94K07l49J95
992CM5J55n7j35J57k17j45L79q4j94K17j59j98L97j4J7o6j85n24M19K72N2k90
1015a55p5r8L03O1J46k18j08J27K61p0k31J82o2Q3m36P9M83j00J30n43K59j86
1037a68K33J39k46L3j63n4O49l56k0l15P5J46M1K23k76Nl74P92j16j3m49j18O8
1060b64J23K79j94J76k11j27J18P7L52j87k90k45K05N1L03J44m67j78L5N25j54
$$ plain form
903 488 573 147 -448 -499 -138 334 307 23 -283 -567 -139 -222 345 422 -516 -526 -381 507 517 -137 -307 -363 48
926 48 405 354 124 59 -455 111 449 -49 76 -53 -131 42 -94 -60 -235 170 43 171 182 -28 -199 -180 49
949 49 7 178 13 224 -186 -200 -291 149 534 333 -309 -497 -45 706 404 -57 -346 -390 206 479 524 87
971 87 -448 -601 -170 219 482 -52 -289 -187 -78 364 139 -30 -460 -198 51 241 244 -50 157 -192 3
992 3 48 203 146 11 168 -49 -194 185 101 -93 124 -35 -233 164 150 167 101 -84 -608 -189 83 135 -155
1015 -155 -230 -328 -25 36 182 -36 -144 -17 244 174 -57 125 63 146 -290 -211 272 172 302 -241 18 -168
1037 -168 65 204 -42 -9 -172 -226 423 67 47 -268 -193 -47 -6 217 -59 -54 -428 364 248 235 -214 -332 -264
1060 -264 -141 138 -56 120 -91 -218 -100 -23 329 142 -148 -393 -188 -137 166 310 -157 -335 -300 225 71
1081G1J00j95j09j39L35K53k51L8n2p4J7j97M66k05J35m18o1K98J87L48m35n96
1103d84JM97l6O04m70k74p07M65L86K88K17p82j79L22K56J43k28j80k45L00N82
1124D76k59K35k36J19k75l55J98M36J21m39n56k05L46Q89N83j051r68m11J301
1143e1Q66K17j088j020J49R26Q95n90j76n17L2N65J18m9j30J97j96j55m39J68
1163b78J167K8q77j028K26P57J344l87j046j082L61J391P79j034j060m68R82N26
1181C01M10l90n68n2L77j0j46M39K58l76n89k39K67R08P47r21j076j009J349J782
1201A462l6j277j376L74J063Q54l07j192n35P11O66p0l24k22J44M5k62l54O66
1220C0P49J16r19j238j27J725J560r44j506j060M61J969P63q42k049L41N45J015
$$ plain form
1081 71 171 -24 -133 -272 63 316 65 103 51 -23 -6 -203 263 58 193 -225 -286 12 199 547 112 -484
1103 -484 -483 14 -22 582 112 -162 -869 -404 -18 270 487 -295 -474 -152 104 247 19 -161 -406 -106 476
1124 476 217 452 216 335 60 -295 -97 339 460 21 -535 -740 -394 495 1078 27 -941 -1352 -51
1143 -51 815 1032 -56 -1076 -927 -1 894 304 128 -389 -357 208 326 277 147 344 148 -7 -446 -278
1163 -278 889 917 40 -988 -762 -5 1339 952 -94 -1176 -815 576 1355 321 -739 -1207 -225 301
1181 301 711 321 -247 -299 78 68 -78 361 619 243 -346 -585 -318 590 1337 416 -660 -1669 -320 1462
1201 1462 1426 149 -1227 -853 210 1064 757 -435 -970 -259 407 337 13 -209 -65 -20 -282 -636 30
1220 30 779 895 -24 -1262 -1389 336 1896 952 -554 -1614 -1153 816 1579 737 -1312 -971 -426 589
1238E89K00l74j183M55L99J42j37j9J32M34p39q54O84J001N50p39j779n80J975
1257A57J038L80j577j205j20J720Q38m21j309n61J10J489K32o60k01m0l2J33N6
1276B7J32M19k6j041p06O79R54J091q92j819k59R24J461O05j121j384k87J055
1294a88J278k20j093m73j59P28O25j93O8m67m42K53k3M08O27j55j207j03K23J011
1314D98O31n06r45q97J049M49Q92q72p99k59M77Q48O7m31m87O8j81M67J59J61
1334C89n18k7j74J33K22O69k99q49k64N11M47L22j16n92o13K57N95K21k58m30
1354c74j95J91N81R6lj82j40k09M09M9k5J76n21k44K16J26L69N7op00J20O1P38
1377E90k04M0p50J90m62R60J02k07n86M37l39M7J91L54k89p31O28J33NJ0j06J69
$$ plain form
1238 589 789 415 -768 -313 86 228 91 72 204 638 -101 -955 -271 730 1280 541 -1238 -1818 157
1257 157 1195 1575 -2 -1207 -1327 393 1231 810 -499 -1060 -950 539 771 111 -90 -130 -162 -29 27
1276 27 159 578 552 -489 -1195 -516 438 1529 637 -1182 -1441 -517 944 1549 428 -956 -1243 -188
1294 -188 1090 870 -223 -696 -855 -127 498 305 373 -94 -536 -283 -306 102 729 574 -633 -736 -513 498
1314 498 1129 623 -322 -1219 -170 279 1171 299 -500 -759 -282 566 633 202 -285 -217 -398 69 228 389
1334 389 -129 -156 -330 -197 25 694 395 -454 -718 -207 240 562 446 -146 -759 -502 93 314 56 -374
1354 -374 -569 -378 203 299 296 114 -26 -235 174 223 198 374 -147 -391 -175 -49 320 377 371 -329 -209 -148 590
1377 590 386 426 -324 -134 -596 364 466 259 -327 110 -229 -182 9 363 74 -657 -29 104 109 119 13 182
1399A82m31J34rJ62K45j04j06n35L78L37m6j72l4j80k42L81M56k93k0k76K3K40
1421I0J37k59r2j3J52M1o0L26n3k31l66K12j03N24k47L0k28l33M33J83j1j70l69
1444d07M46k15K52K62l20k05k01M04K6K00J23l07l01J93L69k6q8jl19p0K54L98
1466D67k03m03m8k29N48l15M23J27j47n11L46k99M82L07m00r7k55J3N13r5K84
1487E08p57o9L66J90L7J81m77k78L49k40L43J85k63j12r9J8k21N22k42k3N4j60
1509a88k36O59j10j1m79k08M09J80K83Ll68k37P7K93%K51k58l90J00M2N18P8M8
1532D56o05N1j44M28J97N08p48o66n4N87M83R4m71l04j9O09J26l06k84k55l84
1553g01O73J91J38k8k44n49J70K26Q30k57k58o13n22O13M18M87k87m65m04M20
$$ plain form
1399 182 -249 -115 -124 38 283 179 73 -462 -84 253 207 35 1 -179 -421 -40 416 123 103 -173 -150 90
1421 90 227 -32 -124 -137 15 56 -4 322 269 38 -328 -116 -219 305 58 88 -140 -473 -40 143 132 -38 -407
1444 -407 39 -176 76 338 18 -187 -388 16 42 242 365 58 -243 -50 319 293 205 204 -115 -185 69 467
1466 467 264 -139 -187 -416 132 -183 240 367 220 -291 55 -244 238 545 145 48 -207 -194 319 224 508
1487 508 -249 -318 48 238 275 456 -21 -299 50 -190 153 338 75 -37 -136 -118 -339 183 -59 -82 -28 -188
1509 -188 -424 235 125 114 -365 -573 -164 16 299 302 -66 -303 -226 67 67 318 60 -330 -230 -188 330 408 456
1532 456 -149 -98 -242 186 383 891 143 -523 -577 10 493 587 116 -188 -207 402 528 222 -62 -317 -701
1553 -701 -28 163 301 273 29 -520 -350 -124 706 449 191 -422 -944 -331 87 574 287 -178 -582 -162
1573a62O71m7O4r84j45M85M95J5l68j36k24L04R4N5j25J1j26n20L83J70N03J10
1595E23m87l48j38K45N11J65n55m03J27N19P9J05j01n01j25l0O91l1m50j34nJ59
1617a84QN89M8k79k18n58L21K94K41K39q05M3o8L50M77k40l26l08lO55K10j72
1639C14j13j52l96K96J23J05O4j00l35o3J64M96n4k74o76O29j10M35K15m47l87
1660b66l89O74K66J9j78n50J43K99N5o5L59k70k17l48K31N90P1q8m00l78j81O47
1682B4K89k10j58m90oJ100j89j90l28P4K18J0K10k65k44O9J02j35k8J70K92m93
1704a78k9j08M25j1j17J92o24N2M08J03L18k44l86k20M89k75M79j97k13nqO2K37
1727A50N9k29k8PM2o1P3j07K29m70J17M12N1n66L63j75K8j05K50K94n13K14j67
$$ plain form
1573 -162 509 462 526 -458 -603 -118 377 392 24 -112 -336 -32 62 117 -8 3 -123 -643 -260 -90 413 523
1595 523 36 -312 -450 -205 306 471 -84 -487 -360 159 238 343 242 -259 -384 -414 277 246 -204 -338 -343 -184
1617 -184 -176 413 461 182 -36 -594 -273 21 262 501 -304 -261 -329 21 498 258 -68 -376 -379 276 486 314
1639 314 201 49 -347 -51 72 177 241 141 -194 -257 -93 403 349 75 -601 28 -82 353 568 121 -266
1660 -266 -655 19 285 304 126 -424 -281 18 73 8 367 97 -120 -468 -237 353 424 336 -64 -442 -623 24
1682 24 313 103 -55 -545 -551 549 360 170 -158 -84 134 144 354 89 -155 -86 16 -119 -147 23 315 -178
1704 -178 -207 -315 110 99 -18 174 -450 -398 10 113 431 187 -199 -419 70 -205 274 77 -136 -141 -149 -87 150
1727 150 209 -20 -48 -41 1 -60 13 -94 135 -335 -218 194 245 -321 42 -133 -105 -210 40 334 -179 35 -132
1750a32L47k63L05p8k51J95P7l94N05j89n66L56Q8N7k27m3K67J2j44L14l49J6
1772i7M4r1K88q9n9K61k71j11J69k79N3J16n6J23p5r3j9N25k38j42J8j91J2J19
1796h3J10l6k41j03PK62J19j37K5j60L03L8j92K0k19M11j74K02l09j8K26P5rk92
1820a75J61k6P8k6j6l54M92k45K04j59J91Q4j11Q1L34k39l10q9Q8l26N88j94n0
1843a9K2j68j6J13J94j34j65n4L15j49J91l8j92o2pP5J52l15J91K5M5J05m74J17
1867b48J4M5L66l82J34K9N13k05o35J57P8L50j36l23L27l81K34K42k03j00R2J74
1889A42J02j98j96N07j80k95j43%j33N59n1k2k08l4MK60J11j43l66Mn4J94J73
1912C3l34L19J04o4l47L50k93L92j76j91K1L50J78m07P5k71L05K41j44j26k38
$$ plain form
1750 -132 215 -48 257 179 -72 123 200 -194 311 122 -444 -88 0 57 -170 -213 54 66 -78 236 -113 -97
1772 -97 -53 -144 144 55 -4 257 -14 -125 44 -235 -182 -66 -122 1 -74 -167 -186 339 101 -41 -23 -214 -202 -83
1796 -83 27 -9 -250 -353 -346 -84 35 -102 -77 -237 66 104 -88 -68 -287 124 -50 152 -157 -175 51 126 117 -175
1820 -175 -14 -40 38 12 -4 -358 134 -111 93 -66 125 209 98 179 513 274 -36 -125 -37 -363 225 31 -19
1843 -19 3 -165 -181 -68 126 -8 -173 -227 88 -61 130 92 -100 -162 -169 -94 58 -257 -66 -41 4 109 -365 -248
1867 -248 -234 -189 177 -205 -71 -42 471 266 -369 -212 -134 216 80 -243 84 -297 -63 179 -24 -124 -32 142
1889 142 244 46 -150 357 177 -118 -261 -261 -394 165 114 92 -116 -150 -146 114 225 82 -284 -280 -334 -140 33
1912 33 -301 18 122 58 -289 61 -232 160 -16 -207 -186 164 342 -65 10 -261 44 285 141 15 -223
1933b23p2K26L09l5P8p19J88N8N53l15k05q4Q6J53J30k64M10Oj99k10j69N37J71
1956D10l90Lk68pM07O5j33j72L8n5K92j02o9J55k88L6J65r4Pj86J74M7n26L75
1980a16n3K67j90k3nJ22L13J03l05o62L05L29Q7P7r8O6l71k6L21m4p1l2J08l33
2004b31J20M12k35J04m03j7qN04N2k74k03j75K74K55J60l15n6r2k40N16o5k6q4
2027b7j00J63k72K87M90n06m1N5k58L41k83J44M1K31m64P1O36k81k05r5J03Q8
2049A18j81l4J84P8l23l3n0N98l65j42k16L58l3K04J4j17l9j69J15k0K61m51N8
2072a85LJ91J98k64J76m06K21K1J07p6qK77l47K45j70k11K83M6k53J53J09L9k0
2095A29j77l5j83K24K88l97N9J04j04J90J00k17m8M22K2m55p9Q7j17n6L23L4k99
$$ plain form
1933 -223 -295 -69 240 205 283 -436 -248 -190 363 48 -157 -241 -155 -2 128 -136 274 280 81 -129 -298 239 410
1956 410 20 23 -245 -252 155 220 87 -85 -47 -102 190 88 19 174 -114 -78 87 -7 0 -186 -12 35 -491 -116
1980 -116 -169 98 -92 -115 -120 2 315 418 113 -549 -244 85 172 249 151 217 -154 -180 141 97 26 -6 102 -231
2004 -231 -111 301 66 170 -233 -250 -258 246 298 24 -179 -354 -80 175 335 20 -36 -128 -368 148 83 57 -27
2027 -27 -127 36 -236 51 541 35 -6 49 -209 132 -151 -7 34 265 -199 -128 508 227 22 -73 30 118
2049 118 -63 -97 87 165 -158 -191 -241 357 -8 -150 -366 -8 -41 163 177 60 21 -148 -33 -53 208 -243 -185
2072 -185 -182 9 207 -57 119 -287 -66 -45 62 -14 -22 255 -92 153 -17 -228 55 101 -152 1 110 149 129
2095 129 -48 -83 -266 -42 246 -151 -92 12 -92 98 198 -19 -67 355 377 -78 -157 -70 -187 -243 80 114 -185
2118a85K61L28m28Q6J28J04j70p5J53k13L28m10j05J98l2N0J46K28l74n9j51K70
2140G8j07o8L7J87J5M4O4k22K74l85J24o4P5j2j10N5J08q4j11K77q0j75J4K2P4
2165C0%o3j22K13q4j38J08n0j0Q1k43K48L25r4K7l17J23L2j42J11o3Q0R2n4P1
2190A61k29M1J02j73q3K56m1k08J63K30k38J30k73k10L16lK39k98k56J05L48Q7
2212A66k96J94k22k1L77r9o2o3r3J94j37M0K13j39j81L11l12K73k70K65l50K23
2234A1j38j71L56K24J20q27N16r7k10M38k01k48M2K04ok4k08M62j07j42k53K23
2256c6P0M6N7k26L75j28K86l29j91j28J74m7o1j8J54l7q8J78m9K84k12k8k18K86
2280A14K13n50K98m4k36n0K32q7l8R3Q9j84M13O2j32o4m40L26m3l3J88j65N2P
$$ plain form
2118 -185 76 404 -24 62 190 294 124 49 202 -11 317 -93 -198 0 -32 18 164 392 18 -41 -192 78
2140 78 -29 -97 -60 127 142 186 250 28 302 -83 41 -23 52 40 -70 -15 93 9 -102 175 95 -80 -66 -44 30
2165 30 30 -33 -155 58 -26 -164 -56 -106 -116 -35 -278 -30 295 201 228 -89 34 66 -76 35 -28 52 144 90 161
2190 161 -68 -27 75 -98 -181 75 34 -174 -11 219 -19 111 -162 -372 -56 -59 180 -118 -374 -269 79 166
2212 166 -130 64 -158 -179 198 99 37 -26 -119 75 -62 -22 191 52 -129 182 -130 143 -127 138 -212 11
2234 11 -127 -298 58 282 402 -425 91 -6 -216 222 21 -227 -185 19 13 -11 -219 243 136 -6 -259 -36
2256 -36 34 80 137 -89 286 158 444 115 -76 -204 -30 -77 -138 -156 -2 -39 -127 51 2 286 74 46 -172 114
2280 114 327 -223 75 31 -205 -255 -23 -110 -148 -55 34 -150 263 325 193 129 -311 15 -28 -61 127 -38 14 21
2304B1L9K7j95N03k08j09j67N6j31J26j57M30m98jN75o5j43m47K07q1L36J03l94
2327a73L61l06j42K43q8J19K5K1j58m0L54J4N8j26l27K49m79L01jJ79j80k8L74
2350B50j14J17k69N2j84J78Q5m9j65J10k03M38m54M04R2m75j78J40J81N8m7L3
2372@r3JP7pJ40m4l30O7RK3J98k54J90j03K36k41M75k79q2k92K86L70k47j30q6
2397a16j63O6J9L02J89k09m25J66j54K42M82j14k24k92p1J72J84n3l04k5J40J43
2419d5J19J78m36PN0J10N7l04J02J68k74L50k15L89m7L5l82J79lK36o2j33j95
2442a16m6Q9L09L8j76j57n6J00J01j39J6O0J00j29oo1j59jJ78r1J75m3K25j54
2466E7k91p4Q9K70L61j74m92l8J00K24N6J01m90L35J02j49J93P7l74K34m90N61
$$ plain form
2304 21 60 87 -108 395 187 78 -89 -33 -164 -38 -195 235 -263 -264 311 246 103 -344 -137 -218 118 221 -173
2327 -173 188 -118 -260 -17 -105 14 39 60 -98 -138 216 230 288 162 -165 84 -395 -94 -95 84 -96 -124 250
2350 250 136 253 -16 36 -148 30 115 66 -99 11 -192 246 -208 196 288 -187 -365 -225 -44 14 -33 0
2372 0 -93 -92 -15 -22 118 74 -256 -189 -180 -157 41 -213 -23 -126 110 -131 344 65 -17 -309 -23 347 100 -30 -116
2397 -116 -279 -213 -194 108 297 88 -337 -171 -325 -83 399 285 61 -231 -302 -130 54 1 -303 -328 -188 -45
2419 -45 74 252 -184 -177 -127 -17 40 -264 -162 6 -268 82 -133 256 209 244 -138 41 38 274 212 79 -116
2442 -116 -162 -73 236 274 98 -59 -115 -15 86 -53 -37 23 123 -6 -12 -73 -232 -233 -55 -146 29 -14 211 57
2466 57 -234 -308 -219 51 412 238 -254 -292 -192 32 88 189 -301 34 136 -13 180 257 -117 117 -373 188
2488A88k74J71k01J43L7j43K15J1J17k07l98K85K74j3j52Oq8k4J25J24k05L0j98
2511a77J6L40k29R3j01OJ6r3K46K0q5j13k0n1J45K36l15K87k2l33J83l27K83J08
2535A13k09J24p3o1L26l83l4lJ82J59J05lm43r2M44K74l94p5k9m5L8L00j79K86
2559C28k08j87J15l36N13l19N4j46p9J52L35R6k73Q1o8k50K09J75l3j26j57K40
2581A16j85J70Q1j72J62m63N4M36k96J58k67N4O8j3L6J95K2k53j36J69O7J32K33
2604C68m14m33M39K1P5q1j83K40j70j13M60l5l48M51k37k8L66j20k18M8j47K28
2626A69j75J16k67J81k2j34M00o5J8N4l54J02j31L57j84j90j49l2L88M7m0J95
2648B84m81O3k05K09K10n7m6j14q5L94m66K05lJ38K4j22M05l50J75k52m1K46p1
$$ plain form
2488 188 -86 85 -116 27 64 -79 136 147 264 57 -341 -56 218 205 53 59 -29 -53 72 196 -9 21 -177
2511 -177 -161 179 -50 43 -58 -52 -36 -129 117 137 52 -61 -81 -132 13 249 -66 221 199 -134 49 -278 5 113
2535 113 -96 28 -45 -106 220 -163 -197 -200 -18 141 246 243 -200 -292 152 426 32 -43 -72 -117 -79 221 42 328
2559 328 120 -67 48 -288 225 -94 -40 -186 -265 -113 222 318 45 126 58 -192 17 192 159 33 -124 116
2581 116 -69 101 182 10 172 -291 -237 199 -97 61 -206 -152 -84 -97 -61 134 156 -97 -233 -64 3 135 368
2604 368 -46 -479 -40 -19 56 -25 -208 32 -138 -251 209 174 -174 277 40 12 378 258 40 88 -59 169
2626 169 -6 110 -157 24 2 -132 268 203 221 275 -79 23 -108 249 65 -125 -274 -306 82 129 89 284
2648 284 -197 -134 -339 -130 80 23 -23 -137 -222 172 -294 -89 -92 46 70 -52 353 3 178 -74 -115 131 60
2671F0k57P5J21m3J18j78L79j53o8K3k24R5M46l7m85j6K37N3J44m7q2l82K19o1
2695f3P9L54k23k15k48P9L71M5N0k43K04j72J43k8l6j72J69k00K79J64l19K91
2717C09m89nj84O28Pj2l13KN4k65M12l22l3j2o5K34J70J77k86j93lL08q4p8p6
2742a19K20m3p1J88l76L75j48n3k35P39p9j70k85q1J63l64M35K20L2j39l59M4
2764a06N6K24L9rl88L5K00O6k49J84k04J89Q3o4L82l82j67L10l02K22j16j61J20
2787c8j24K36m03N02j72j77R9r4K13K4j18K68n47K85K16k16j2k00k1K09o0K75
2809A45k5k29P2k11k5L51j10l21M81j77J11m5NJ07j94K33k2k67J92l53M49m07
2831b40J72J05j26J94k22J06J35P0k67Q7o4J82o8L7l25N15m28J3M5l17L59L74
$$ plain form
2671 60 -197 -122 -1 -44 74 -104 275 122 54 77 -147 -52 394 357 -128 -144 93 146 290 243 161 -221 -2 -63
2695 -63 16 370 147 -68 -316 -237 134 179 229 -14 190 18 161 133 97 -75 94 -106 173 337 18 309
2717 309 -180 -185 -369 259 266 254 -59 -57 -3 -268 144 -178 -211 -223 -288 -54 116 293 7 -186 -189 119 35 -43 -119
2742 -119 101 58 -13 175 -201 174 26 -27 -262 477 398 228 -57 -138 25 -339 96 316 348 209 -150 -106
2764 -106 -50 174 213 204 -184 -149 51 117 -132 52 -152 37 120 56 438 56 -111 199 -103 119 3 -158 -38
2787 -38 -162 74 -329 173 1 -176 -77 -171 42 66 -52 216 -331 -46 170 -46 -58 -258 -279 -70 -130 145
2809 145 120 -109 -37 -248 -273 78 -32 -353 128 -49 62 17 22 129 -65 168 146 -121 71 -282 167 -240
2831 -240 -68 37 -89 105 -117 -11 124 194 -73 14 -50 132 64 101 -224 291 -137 -124 -79 -396 -37 337
2853C37o19L83Mk09l21J06M74j03k44NL26j40j19K56j87P0L4o3K14k22K31k78
2875f5J25k76L03k82K55p0K89m27Q4Q2K10l99J16L1J39j00J7j95J03P7J7Q5r2
2898B7K92l18o0J32k8L10k04k97K72l14K25m06J05K10k1R5j44K02J18j64M2j20
2920d6J36j63K58k24n6q1j93L28q8O25o22j48K74j90J02K1K61m05o6L50k43K5
2942a45J01P5j38M6L60k71j82Q2P4r7J09j94J95k5M24j60k5l53J35L1j16J20k1
2965B5j22j76L39k63M92k50K30l72J49J0l4K18j78L06m81J41J39k14J74k61K9
2986i9L48o08L19L66M4n45J7L79m80J37o8J95P0n99P72l51J87j32J23l66L09j8
3008@K14k4p1J95n27M1J55N5j14p5J97k19pJ96Kj29K99l03J23J23j01j0J8j84
$$ plain form
2853 337 -282 101 105 -104 -425 -319 155 52 -192 -187 139 -1 -120 136 -51 19 53 -10 204 -18 213 -65
2875 -65 60 -216 87 -195 60 -10 279 -148 -64 18 228 -171 -55 -24 115 15 32 -163 -60 17 34 119 27
2898 27 319 1 -59 73 45 355 151 -146 126 -188 37 -369 -264 -54 -75 20 -124 78 196 32 74 -46
2920 -46 90 -73 185 -39 -95 -176 -369 -41 -129 496 -126 -274 0 -190 -88 -67 194 -211 -277 73 -170 -145
2942 -145 -44 31 -107 -61 299 28 -154 -72 2 -95 14 -180 15 -10 414 254 229 -124 11 42 -74 46 25
2965 25 -97 -273 66 -197 295 45 275 -97 52 62 28 246 68 374 -107 34 173 -41 133 -128 -99
2986 -99 249 -359 -40 326 370 -175 -158 221 -259 -122 -190 5 75 -524 248 -103 84 -48 75 -291 18 0
3008 0 214 190 119 314 -213 -172 -17 38 -76 -151 46 -173 -180 16 18 -111 188 -115 8 131 30 20 38 -146
3032a46Q8L43m3J57m32j24j03J69J21m2Q1l33J27J13QK5QJr5R3j88K66j29l7P
3057f5k02K79P1l70M14mnj10k48M68l50P0M3L96m77K2O5L7o5M32n07j30O26n93
3081b03M53k42p4K82k86J5K4p0Q8K23k43J65j23L92m57J53q9K6n4j02J18q8K57
3104A65J9pk83j2K50k43J35J06N9m23J5N02k38j8N0m7J2j8Kk18j14O6K12no5N57
3130D59l12p7N3K3k77M5N37m97K5K7q1L8j95M05j72k07L58J68K8k06M8n8j90j58
3154b16L04r2o6j68J59J38j9r4oK3K12j22Q0J8r0j96K48j19j19L2Q5k47L1J96
3178b8j09L51k54o2k17N10q8j45J04Lq0J5qj52K83K15l71L12l13k8OJ45L9j23
3202Em3K76l05R0J01o4J14j14J47k10j17R4J59k35M01r6l12J54k76O09m83K18
$$ plain form
3032 -146 -58 285 242 399 -33 -157 -260 -91 30 -12 69 -264 -137 -24 -16 9 17 18 -77 16 -172 94 -35 -72 -65
3057 -65 -267 12 83 -287 127 123 118 8 -240 228 -122 -52 -9 387 -90 -68 -3 34 -31 401 -106 -236 390 -203
3081 -203 250 8 -66 216 -70 -55 -31 -101 -13 210 -33 132 9 401 -56 97 8 34 -20 -122 -4 -92 165
3104 165 184 177 -106 -118 132 -111 24 130 189 -234 -219 283 45 27 77 30 42 24 26 -192 -306 -240 -28 -33 -98 459
3130 459 147 70 123 146 -131 -86 451 -46 -21 6 -75 -37 -232 173 1 -206 152 320 348 142 190 132 -58 -216
3154 -216 88 -4 -70 -238 -79 59 40 -54 -60 -37 175 53 133 151 61 -135 113 -6 -125 -93 -8 -255 -224 -28
3178 -28 -137 214 -40 -102 -319 191 103 -42 62 65 -15 0 -8 -160 123 338 -33 279 -34 -62 -56 89 128 5
3202 5 -38 238 -67 23 124 60 174 60 207 -3 -120 -26 133 -102 299 203 -109 45 -231 378 -105 113
3224A13J37j18m1J29k57p4J09J17k24K82k61q8K62Q9l61Q7J88j37Q6l02J39J57
3246C2R6l3j9k04K74j23j28J99r6QN9k46L62l05K29m1k56j4Q0L8J59l6K16j34
3270A17L7l91K62L62n80L26k51J2j57M32o6k1m53K35M17n38L08r0J22n81L14L37
3292A53j03k02m4O1N7r5J06K60k19P8o6j08M17m14J50k13K30p6J41Q6l05L63l69
3315a12K73j68L18R2k72k2J40l47L89k68j62O1nJ32M08n38L9K9qp9j35PN00k37
3339C5K69n57M12j51Q3l39M79j71mK55n66K38j8j27M55k28j72J84j64M09j48l05
3361a31j94L67j78j0J61l8j68N3j82K12K01l17L30j19n8J98P6j15j99j90K96J58
3383A53p4k94J92J62l93K75o5k6l4p1M42j55j1p8L8j32o2J75j35J41K1K54m48
$$ plain form
3224 113 250 132 91 220 -37 -111 -2 115 -109 173 -88 -176 86 175 -186 -99 89 -48 38 -264 -125 32
3246 32 128 95 76 -128 146 23 -105 94 -2 6 65 -181 181 -124 105 64 -192 -206 -126 -88 71 35 251 117
3270 117 154 -237 25 387 -193 133 -118 -106 -263 169 103 82 -371 -136 281 -257 51 -39 83 -498 -184 153
3292 153 50 -152 -196 -135 -78 -173 -67 193 -26 52 -14 -122 295 -119 31 -182 48 -28 113 199 -106 257 -112
3315 -112 161 -7 311 403 131 109 249 -98 291 23 -139 -78 -83 49 457 -81 -42 -13 -21 -100 -235 -228 272 35
3339 35 304 -253 159 8 91 -248 231 60 56 311 -255 -17 -35 -162 293 65 -107 77 -87 322 174 -131
3361 -131 -325 42 -136 -146 15 -23 -191 -138 -320 -108 93 -224 106 -13 -71 127 203 88 -111 -301 -5 153
3383 153 79 -215 -23 139 -254 21 -44 -70 -104 -175 267 112 101 23 61 -71 -133 42 -93 48 69 323 -125
3406a25M81j47Q7l96J81M1j12J76r7l80K15M4j94L04k90J96j74n8J13L72j77j07
3428d7J92k26J82j12p1O8j79K87J02l23M50l34k36K26K96j99P9L9j96P3l63L29
3450C7j39r9J23P3K63l58J83n2k90L63j89M4K3Q6j35J78j73L22p8j14K34l05M1
3473C8k49L53j03M9j55K24j65j33J68j10L18kl71J20j51L14n8k44L16j57M16n29
3495a11J6J85J24k65J35j00K0l91L50o7P7qj25L83n28L56j39J21J09k4o2J4J23
3518A93l08J81l44K22O5k0K91n37K05j12oJ46K5Q5J31l6j98J12J35k97j18N6Q4
3541d5r6K4K8J11m6K15m2R3k90j35K06J42K57m39J96J78K76o38M5K35k7k23j08
3564h3K03r8k57J40J82k00J80j16j03J63k59K09K78l16o6K11k04J9J6O3K16k29
$$ plain form
3406 -125 356 209 296 -100 81 122 10 186 89 -291 -76 -32 -226 78 -212 -16 -190 -248 -135 237 60 -47
3428 -47 145 -81 101 -11 -82 -14 -193 94 196 -127 323 -11 -247 -21 275 76 155 194 -2 71 -292 37
3450 37 -102 -201 -78 -5 258 -100 83 31 -259 104 -85 -41 -18 68 -67 111 -62 260 182 68 302 -3 38
3473 38 -211 142 39 88 -67 157 -8 -141 27 -83 235 233 -138 -18 -169 145 87 -157 159 2 418 -111
3495 -111 -95 90 214 -51 84 -16 4 -387 -37 -104 -27 -35 -160 223 -305 51 -88 33 142 118 56 70 193
3518 193 -115 66 -278 -56 9 -11 280 -257 -52 -164 -170 -24 1 86 217 181 -17 95 230 -67 -185 -129 -45
3541 -45 -141 -117 -89 22 -24 191 149 242 -48 -183 23 165 422 -17 179 357 633 -5 40 275 248 25 -83
3564 -83 120 22 -235 -95 87 -113 67 -49 -152 11 -248 -39 239 -77 -143 68 -136 -117 -101 -38 178 -51
3586e1L93l87O8k13L37m5m9J1p0J22k8J45l94ML33m52J20K30L74l33k79l2rn1
3610b56L42j31J14p0m9Q8k48J84l9j01P0K31m32K92O2J60j55j3p8Q9J5k2j11q8
3634a46j3M7L32l76K05l4K79l71N1j1N9j0J47k70J82n6M7K4j2j92K02K8M3k39
3658h4K11j37J62M2j2nj51J52n9J28m25J74J37k81R0J46l06l4J71pj8J17j34O7
3682e6L34o60L33K70l22k60K58J23O1J86j85j77n7J27J39m19L89j08O4L1j60O8
3704b1L73l02K4P3m9k88J95J6N4j34M8p0K41n0k06L09L8k74j82K43q4L3k54L35
3728F8J55k74Qp4J87k69J66J02J40j06n23O30m46K60Q2k57K01l8k71J73j99K33
3750e2m8L25j67j95K57j08j86K93l07J21J64j57J82m5l08M81m15J02J23O6j14
$$ plain form
3586 -51 342 -45 23 -190 147 102 53 64 -6 116 88 233 -161 -157 176 -276 -156 74 448 115 -164 -196 -205 -256
3610 -256 86 -45 69 -1 -50 38 -210 -26 -65 -166 -96 135 -297 -5 57 217 62 49 -29 60 75 53 -58 -146
3634 -146 -159 -112 220 -156 49 15 294 -77 -26 -37 22 12 159 -111 71 15 62 86 74 -118 84 112 155 -84
3658 -84 127 -10 152 194 182 177 26 178 119 247 -178 -4 133 -148 -58 88 -218 -252 -81 -88 -106 11 -123 -56
3682 -56 278 -382 -49 221 -101 -361 -103 20 81 267 82 -95 -152 -25 114 -305 84 -24 40 71 -89 -21
3704 -21 352 50 74 147 98 -190 5 21 75 -59 -11 -81 160 110 -96 213 251 -23 -205 38 -46 -13 -267 68
3728 68 223 -51 -43 -117 70 -199 -33 69 209 103 -420 210 -236 24 106 -151 50 12 -259 -86 -285 -52
3750 -52 -100 225 58 -137 120 12 -174 119 -188 -67 97 -60 122 77 -231 250 -165 -63 60 126 12
3771A2q6k91M92k35K7J99N1j02P5n01M27K56r7o09L98o9J75n5j67k57K28O6J34
3794G1oq3K83j63nj49RP0q0K16l14L8N6L9K6M6K95j91qQk05lR0j35L11k67m0J59
3822F8l81L37J77p6N7k78K61k50J64R6o6o8O3%K05j93o3J00n10J73L78q4k70q8
3846b48L13k58J8L11k58M57n58K99q9O4J39k37K6J55q7J9l13J14K97k01J02n9
3868Fj23J79O7m29L50k04J49J20j53J19l49Q7K35K89l17r0M46m83M5Q8Q9p4n1
3891dk5J37Q4l1r5Q2j74Pj18J52m3J98k51L35l71J65K5n4k5r2j13N64l33J60k66
3916h6K12r2K6l6l1l3M9M7k70K87q4k3n8J46Q5k46J3L6j51Q2K50j5J83k52qL57
3942C88m28K46j76J64p9j93r5J93K8n7Q8k36K59k82j57L50l25K45p5K06n3j85
$$ plain form
3771 12 -74 -365 127 -108 -81 118 169 67 142 -359 68 324 227 -382 16 -53 122 67 -100 -357 -129 -63 71
3794 71 65 -18 265 102 97 -52 -43 27 -53 163 -151 -113 -57 -18 8 54 349 158 150 158 -47 -50 40 -95 216 -51 -91 68
3822 68 -313 24 201 125 182 -96 165 -85 79 175 109 41 104 104 309 116 53 153 -357 -184 194 110 -160 -248
3846 -248 65 -193 -175 136 -122 335 -223 76 -13 51 190 -47 -21 134 47 66 -247 -133 164 -37 65 6
3868 6 -117 62 129 -300 50 -154 -5 115 -38 81 -268 -181 54 343 26 -64 382 -101 -56 32 121 47 -4
3891 -4 -29 108 192 161 66 148 -26 -19 -137 15 -28 170 -81 254 -117 48 73 19 -6 -98 -211 353 20 180 -86
3916 -86 126 34 60 24 -7 -40 9 56 -214 73 -11 -34 -92 54 139 -107 -94 -58 -209 -127 123 108 291 39 31 388
3942 388 -40 206 30 194 115 -78 -173 20 48 -9 79 -157 102 -180 -337 13 -312 -67 -142 64 11 -174
3964a74K23q7M1P7J11o9p9l9q1j10j27J36L55r8K8Q5p7p9J5n0k19L38k24m2M11
3989B65j39j42n5J05p9P0N6J4J8N0K7j2j16L36m24j86L78k11N6R5j51k9K54j35
4013D5oL68m37l1L22l22J26k31K29L2j67K49j16l94L28o6J52j23K14j85n6K08
4035A39j55M1l34N31Qj03j68J83j42n5K1L26j40k30K19j28L3L16l60k5j23M18
4057B72j67k21M51j87J31l37pM2m9m7K22jj2J0k19K03k13K89N9m71M44k65j12
4080a85J43j11J6J12j85L58q3j64P0K01j97J40k70K12l98M64l46Q7O6N9J83m86
4102c14M02l04M03l25j62K71J78N5k84K78j17J4r6M5L4M4L0l01J13l03K5K37J15
4125C8r7Kj35J41l03L95k79K71J07k26J67j56m1O2j18K46k69K88k39O1j32K38
$$ plain form
3964 -174 49 -38 3 80 191 122 43 4 -77 -187 -314 -178 177 79 107 192 115 36 51 1 -218 120 -104 -146 265
3989 265 126 -16 -71 34 -45 25 81 95 113 163 190 178 62 398 -26 -212 166 -45 11 106 -45 -74 180 45
4013 45 39 407 -30 -61 261 -61 65 -166 63 95 -72 177 61 -333 -5 -71 81 -42 172 -13 -69 139
4035 139 -16 25 -309 222 230 127 -41 142 0 -55 -34 292 152 -78 141 13 46 362 2 -23 -146 272
4057 272 105 -116 335 148 279 -58 -65 -23 -72 -119 103 102 90 100 -119 84 -129 160 219 -252 192 -73 -185
4080 -185 -42 -153 -137 -25 -210 148 65 -99 -29 172 -25 115 -155 57 -341 123 -223 -136 -70 -11 172 -314
4102 -314 88 -216 187 -138 -300 -29 149 204 -80 198 81 95 -1 44 78 122 152 -149 -36 -339 -314 -77 38
4125 38 -59 -57 -192 -51 -354 41 -238 33 140 -86 81 -75 -116 -54 -172 74 -195 93 -146 -85 -217 21
4147B1l1L17l37o9K21K04j78o4k23l6J30K06m42L67k6J09m08L59j77J2j60KM02
4170A99n39J20K32J20k45K93k22q9J82q0J61J30K5j39J21l72M7l13L11L28k93
4191b3n1J01R0k73L04k6l3j29R3k13K52K76k57m07K03K91n88L30o0K44j87K66
4213B03p0J55k67j3%n6j48jM32l91K59K04l4k18k6q5J13OJ60k53L0K5jm3J4J06
4239A01j25L60m20Q6J1j79K2J81L0O7l21J67J01l5K17k58n1o7L66j47k77O4n2
4262a59p0K23M4jk3J86k29k24N65k11L6k46n1K45K31n89K44j4r3L0jK27m4j24
4286d8Nn1M43j16J31k57j64k01J82jj10L18k6O5k51K47Q5k93P7l43J27j03K21
4309f3j25Q7J67k44O3KK00L2l05J57N4j9n4k7Q3J95m12M62m07K76k24J57K39m41
$$ plain form
4147 21 -10 307 -30 -99 122 326 148 84 -139 -175 -45 161 -281 86 60 169 -239 120 -57 -45 -205 -203 199
4170 199 -340 -220 12 132 -113 180 -42 -131 51 -29 132 262 287 148 269 -103 -56 -369 -58 270 -23
4191 -23 -74 27 117 -156 148 122 89 -40 53 -160 92 368 111 -296 -93 198 -390 -60 -120 124 -63 203
4213 203 133 288 21 8 8 -48 -196 -197 235 -156 103 307 273 55 29 -56 57 63 223 -30 0 25 24 -19 -5 101
4239 101 -24 336 -84 2 13 -166 -144 37 67 134 -187 -20 81 46 263 5 -46 -113 253 106 -171 -107 -159
4262 -159 -229 -6 38 37 14 200 -29 -253 312 101 137 -109 -160 85 316 -273 -29 -43 -136 -106 -107 120 76 -48
4286 -48 -43 -94 349 233 364 107 -57 -258 -76 -77 -187 131 105 170 -81 166 251 -42 35 -308 -181 -284 -63
4309 -63 -188 -101 66 -178 -115 -113 87 119 -186 -29 25 6 -48 -75 8 203 -209 253 -154 122 -102 55 294 -147
4333a47K52k73K26k35J21L17r9n6j77p2L60k40j42O6P1L0j78P7J2R0J58j77K32
4356B16m27L19j1k39J45J7J16K22n03L5N2n8K52l96R5J62K39j90k17K15J54r7
4378A01O6j53j98L82k2j21p7lJ81m00J79J24m61K93J69o1J02j08j62j26J17J15
4400f3K83l94K27j37P8R8o3l79M00j5k43J98M1J79r3n6O2n8o1K83m66J26Q3M01
4424D31k02j70l1j31J14J45j80J07m19L06J52j74k9J14l27L54k7k79J07j6J73
4445A8Nk89J32L38l10mK87k70J5J12j87K29r5q9J15J38k62j37K35L2q5K3n6r1
4469a96L05k0m4N2j79J55r1j15K5K5J73k94K49L4k11L70k35L82k92j2m07J27K18
4492A9J1m3l24L63j48k39K48j15N0J20mN0J48P6n11N48m26N4r3P9l04N84p7K9
$$ plain form
4333 -147 105 -168 58 -177 -56 261 162 106 -71 -143 217 -23 -165 -99 -28 2 -176 -99 -87 3 161 -16 216
4356 216 -211 108 97 -142 3 20 136 358 -145 -110 -58 -116 136 -260 -165 -3 236 46 -171 44 198 101
4378 101 167 14 -184 198 176 55 -22 -25 156 -244 -65 59 -402 -109 60 -1 101 -7 -169 -295 -178 -63
4400 -63 220 -174 53 -84 -6 92 29 -350 50 35 -208 -10 31 210 117 61 123 65 4 287 -179 -53 30 431
4424 431 229 59 28 -103 11 156 -24 83 -336 -30 122 -52 -81 33 -294 60 33 -246 -139 -155 18
4445 18 23 -266 -134 204 -106 -110 177 -93 -78 34 -153 76 -19 -108 7 145 -117 -254 -19 13 -72 -49 -105 -196
4469 -196 109 89 45 97 -82 73 -18 -133 -108 -83 90 -204 45 79 -132 238 3 385 93 81 -326 -199 19
4492 19 30 -13 -337 26 -122 -361 -113 -228 -178 -58 -62 -12 136 212 -299 249 -177 -123 -216 -137 -441 143 66 95
4516I5l4OR3m6k88J96O7Km97L23L24k81Q6q0J41k17K0K04k85J79Q4n0J18l16L19
4541A63k29L21l12J0J63l38J49r0Q6L42m0l37K08n64M11J31q9J66j93l9K85K2
4563B26j06J2Q7k15k07K34J62p5j20J70k3l23K65Pj02Q1k62J11K04J55m40J92
4585C3K20j01m9l5j4j67j34L88k75K48j35Q1J30j14J19k46j67K52J88j19l36K18
4607a5k6k06J51j46L61l61M96k54l32N40j37j08L5q6O1L0J15k46J26N7L0k23J12
4630b6r2M0K26k73kK25j43j33K00K82R3m77K37j9r0j72R9j11J70k23J99M4M1j94
4654i9R6N9J14k53j27M49r9j11j87K99k37K03M8r9n8k20O28m40n0K17j58J62n5
4677H2l25J64n4q8J75J98k15J89j97L28j17k77K49Q6R0k50n8L45j57k08J51Kj24
$$ plain form
4516 95 61 67 160 114 -174 22 89 91 -406 -83 241 -40 46 -34 107 -110 -90 114 -171 8 92 42 160 -156 163
4541 163 -66 255 -57 -47 116 -222 -73 -163 -77 265 225 -112 96 -468 -57 74 -15 151 -42 -81 204 226
4563 226 120 132 219 4 -203 31 193 118 -2 168 145 -178 87 94 -8 73 -189 -78 126 281 -159 33
4585 33 253 152 103 68 54 -113 -247 141 -134 114 -21 60 190 76 195 -51 -218 34 222 103 -233 -15
4607 -15 -41 -247 -96 -242 119 -242 254 0 -332 208 71 -37 -2 -88 -27 3 118 -128 -2 55 85 -138 -26
4630 -26 -118 -78 148 -125 -127 98 -45 -178 22 304 397 -80 157 138 48 -124 -25 -136 34 -189 10 54 95 -99
4654 -99 -3 56 170 -83 -210 239 140 29 -158 141 -96 107 155 56 -2 -222 406 -34 -84 133 -25 137 82
4677 82 -243 -79 -133 -221 -46 152 -63 126 -71 257 140 -137 112 198 288 38 -20 325 168 -40 111 113 -11
4700a1J37k41J06j87J10J03k69J45j1M79k72J6m7ooK00k37P6O9J74m69L62j69
4723E2K8k56O0N3oL86l76L06k32j45r3m4M39k05K92l25K9m7O4K26k89J19r9K43
4747A80k60R4N3K09m52j49K64K2q5K02J04J98m23J69j4l52l3M80l60J68J6n6M9
4770B4K27l51K43k74N5L10j57j15K32j26o2p6K54p5j84K1K15m4Q0j21Jj07K21
4793A91m38K32N3k80J91j85M41k59K90k15r6J67r8o5k37L63Q4J22j66m4j07J58
4815A02j15l16J68K70k07L20j19k23q4J52K81l94M68m27ML42n17Q0j44Q3K37M6
4837GmP8R0k37qJ21J07l06J01J16m3j7R4Lk05k59K47J36k29k0J50J81j2Q5j19
4862E7j35J27K94l99j26K17O1k23K77r5J9J1L8J86l06J49N6l69N23k37j55J85
$$ plain form
4700 -11 126 -115 -9 -196 -86 17 -252 -107 -118 361 89 105 58 52 46 246 9 85 154 328 -141 221 52
4723 52 80 -176 -116 -63 -69 317 -59 247 15 -130 -223 -267 172 -33 259 -66 -37 -84 -20 206 -83 36 -63 180
4747 180 -80 14 67 276 -176 -325 -61 -39 -124 78 182 380 -43 126 112 -240 -273 207 -153 15 31 -25 24
4770 24 251 -100 143 -131 -76 234 77 -38 194 68 6 -70 184 109 -75 -54 161 117 197 76 77 -30 191
4793 191 -247 -15 38 -242 -51 -236 205 -54 236 21 -75 92 -6 -71 -308 55 139 261 95 51 -56 102
4815 102 -13 -329 -161 109 -98 222 103 -120 -204 -52 229 -165 303 -124 -120 222 -295 -215 -359 -276 -39 7
4837 7 3 81 171 -66 -74 47 154 -152 -51 65 22 5 99 102 -103 -362 -115 21 -208 -228 -78 103 91 176 57
4862 57 -78 49 343 -56 -182 35 96 -127 150 55 74 85 123 309 3 152 208 -161 362 125 -30 155
4884A55j59l7k07L56l00J23P3j02R8j32lK48j58J16J04k99L44p9k14J59m6n5o0
4907g5K14m1Q6k10K47l46J34l00N4kJ95P0l62L66l98M80k08K96k14MlK93j91p1
4931A8J13j97K44m12J29J31P3m1O0j36J64K6j44K2m3R6qj87M58n62M83j06ql1
4955A42j35OR4k6oj31o0J46q3m3K52k79O1K50j21J8k47J27L7j26M34l80P2K07
4979B09k46P0j60P5K79j6j4k27k31K00k07N50m48k5L63l41J95R0j9m13N81k51
5001A4k1p9p4R9j0M01n32L87k36J49j59J20J08J9j63j15K16J9r6o8k86L42N2j22
5025c5J98k59pl2m3n0L67k04O0L94l93p4j80P9J88o5Q2K1M6k25J38J18J3l62L05
5050H0q7J08K96m30K10q8k38M15m46K31m7J36r1k84K48J56j70P0j12L22j21qj04
$$ plain form
4884 155 -4 -41 -248 108 -192 -69 4 -98 0 -132 -135 113 -45 71 175 -124 220 141 -73 86 40 -15 -75
4907 -75 139 98 184 -26 221 -125 9 -291 -237 -239 -44 26 -336 30 -368 112 -96 200 -14 -10 -13 280 89 18
4931 18 131 -66 178 -234 -105 26 99 58 118 -18 146 172 28 50 7 103 95 -92 366 -196 287 181 173 142
4955 142 7 13 107 81 75 -56 -116 30 -53 -96 156 -123 -62 188 67 85 -162 -35 2 -124 310 -70 2 209
4979 209 -37 33 -127 -52 227 211 197 -30 -261 -61 -268 282 -166 -191 172 -169 26 116 97 -316 265 14
5001 14 -7 -86 -160 -61 -71 330 -202 185 -51 98 -61 59 167 186 23 -92 124 143 47 -21 -307 35 87 -35
5025 -35 163 -96 -103 -135 -178 -228 139 -65 -5 389 -4 -78 -258 -179 9 -56 26 47 93 -132 6 124 137 -225 80
5050 80 -7 101 397 -33 177 89 -149 266 -180 51 4 140 49 -235 13 169 -1 69 -43 279 158 150 46
5073D6n6j9k07R2K43j45l70K96K57p7j17k52M15p6J13j37n9j53K72m09L71p1o2
5096a05J70k40L31k59J00m6M2o5M35o68M08j21j00q2K12j54K35k37j47J29J77
5117A5J63J22l21QJ42K98j96k68k6m7J90k83L34l28L56k68P9Ol05Q1K47K28j97
5140C0k0K82l94R1j92K31j27J9j40K74m0j11J11k76K47J23k93J98Q7N2m83J86
5162a45j28K47P7L3P2L24l00j29j40K51j57K87l93K55j31j62J56K41j79k8L1J21
5184B03nk01K75Pl59j22R3j48q2M0J94M0m5N3J17j40q7J65j39o4O27l63k54J62
5208c3K28k01k14K68k21M09k31j55J73j63J62k2j09L01q1j56K51k43J67j39J5
5229Fk5M5O9l2l3JJ3J89l26L05k39J98R8J8l47K29j55Q2k79J96k36R8j3K56j56
$$ plain form
5073 46 -10 -29 -236 -144 99 -46 -416 -120 137 60 -57 -309 106 30 143 6 -53 -206 66 -343 28 -43 -105
5096 -105 65 -175 156 -103 -3 -49 -7 -72 363 -305 103 -18 -118 -200 12 -142 93 -144 -291 -162 15
5117 15 178 300 -21 -13 129 427 231 -37 -63 -110 80 -203 131 -197 159 -109 -30 -24 -329 -248 -1 227 30
5140 30 10 292 -102 -11 -203 28 -99 -80 -220 54 14 -97 14 -262 -15 108 -185 13 100 152 -331 -145
5162 -145 -273 -26 51 84 156 480 180 51 -89 162 5 292 -101 154 23 -139 17 258 79 51 82 203
5184 203 198 -3 272 279 -80 -202 -109 -257 -339 -299 -105 -65 -110 -57 60 -80 -167 -2 -141 -205 422 59 -195 -33
5208 -33 195 -6 -220 48 -173 236 5 -150 23 -140 22 0 -109 192 111 -45 206 -37 130 -9 6
5229 6 -19 26 95 63 30 31 44 233 -93 212 -27 171 269 287 -60 169 14 96 -183 13 -223 -125 -138 118 -38
5254c8J03j9J93k16l4k42L03J5j7J43j44J04p5Q6k65k3K10r3q8J57J03m06K9K41
5278B7k36K38j90j54M11j65l53N14M09k04k04j56J02j70O57m22l76M90l46O02
5298D74n54j54K34j51L10J32n26K15J13L94n16J13j41j63K23kp8J03l24M09k97
5319a86Q7j8J10l53J60M64l10R1j65j2K27J48l57J48J35j57l09M26N9j12j60j03
5341a87J86K67m92K52J05l34M0J1O1kK58J2M4k07J1j42J06m22L31J79Jj60J92
5364A10j72Q8J02l79M22Nk35R7L19k54k85O0K44j14J21%J8j16n3J95j82R0p3L73
5388C81o06J17J23j67N22m45M21k65k5R4n35N27jk44J27j09K14j25j04M1L15k6
5410B30j72j66J95k00L98q3q6Q5q2k07m7q2K31J9Q8kL45l02j35J56l67J22M60
$$ plain form
5254 -38 65 46 239 23 -11 -253 50 65 48 191 47 151 76 162 -103 -126 84 -9 -97 60 163 -243 -214 27
5278 27 -209 29 -161 -315 96 -69 -422 92 501 297 93 -63 39 -131 526 104 -272 218 -128 474
5298 474 -80 -234 0 -151 159 291 -235 -20 93 487 -29 84 -57 -220 3 1 -77 26 -298 111 -186
5319 -186 -99 -117 -7 -360 -200 264 -46 45 -120 -132 95 243 -114 34 169 12 -297 129 188 76 -84 -187
5341 -187 -1 266 -226 26 131 -203 -163 -152 -91 -93 165 177 221 14 25 -117 -11 -433 -102 77 78 -82 110
5364 110 -62 26 128 -251 171 176 -59 38 357 103 -182 -122 122 8 129 129 147 31 -22 173 -9 81 8 381
5388 381 -225 -108 15 -152 370 -75 346 81 56 150 -385 142 141 -103 24 -85 129 4 -100 -59 256 230
5410 230 58 -108 87 -113 285 202 116 201 119 -88 -135 -217 14 33 121 119 464 162 27 183 -184 -62 398
5433C98m14O3k26L18k7J26K30n00O1K7j74k03L45J44j47k80J7N13l55P5kK41l27
5456i7K43j80M6K13l88k2j71O1J52J90l1k69M38j65J20k25J0k87N86l29LO0m9
5479i1N6j61L07k36r8J79K53Q6j24j50J18l34M40k23L2J24k0k59K1J70j57J70
5501A03rk12K55l79O09p69K77O1n6N6K1O7K83k44rj69m5K39q3J62j79j86J87q3
5525a03J50R9k20J22J81%k29k59P7L90q1rj79J35R4j64K14n88O45l52n2J35O9
5548G5J69N6n37L70M2j51P1L8k63L5J47j85M3O9M4Q4n6K6L9j54q7M3j06J54j60
5573a94J46J79l49N30k63p2O1J3o5k46R0M10n0m50RK46N8J75k41P1L5j54N9j37
5597a39J19k14L29m24L74M4k53J73N4L2Q0l49N1Q3P6k4J47k2k98L40L4l37K89
$$ plain form
5433 398 -16 47 -179 139 112 238 468 -32 29 56 -118 -321 24 168 21 -259 -242 271 -84 -9 -11 230 -97
5456 -97 146 -34 12 225 -163 -185 -356 -295 -143 47 16 -253 185 20 140 -85 -75 -362 224 -105 -102 -42 -91
5479 -91 -35 -196 111 -125 -223 -44 209 295 171 21 139 -195 245 22 54 178 158 -101 -80 90 -67 103
5501 103 94 -118 137 -242 367 -402 -125 -64 -120 -64 -43 24 307 63 54 -115 -160 79 -4 158 -21 -207 -20 -103
5525 -103 47 146 -74 48 229 229 0 -259 -182 208 127 118 -61 74 168 4 218 -370 275 -77 -129 6 75
5548 75 244 300 -237 133 175 24 95 133 -130 -95 52 -133 -90 -21 23 107 51 77 116 -38 -125 -82 -188 -34 -194
5573 -194 -48 131 -218 312 49 -23 38 51 -14 -260 -170 240 190 -260 -251 -5 53 228 -13 58 93 -61 -2 -139
5597 -139 -20 -234 95 -329 45 89 -164 9 63 95 175 -174 -123 -40 36 12 159 137 -161 179 213 -124 165
5620A65j83K37m2m05K31k07J25Q3K3l8m9r8J29J60m10J68l0O5K1j4J54qj34J13
5644E6P9j99K45r1o3N7j37m3m9K56j40k7K68l33L10M2k39p3J91k5K3J5j74J54
5668A03J09o13N22m2j8k14j53L56N3J20P5j66P4m33K22O3L1K13k95r1K62j00J6
5691I4k15M9j6J90j28K35J69k46R1k05q1j62J99l68N50o4j90K65j89n6J03M7J03
5714A75l10K65J7j61l3K44l59j27R6J47j00K07n5M3j14K55k61J57K4p6J21m1j54
5737d0K00j60l37L44K6K33j95j19j10J59l9P2J97j80k45J36N3J61l04j01K85l5
5759AK8Kj3j55o1M61k05R1j71j02J72j13K95k12M0l3k10q3J80K40J64l34k4M9
5783Gr6j84n5M82j32R5l6J51j03n00P56j46n4l51O8J86k27K02n6n6R3j31L20k39
$$ plain form
5620 165 -18 219 177 -228 3 -204 -79 4 27 -11 -60 -158 -29 131 -279 -111 -141 -76 -55 -69 85 77 -57 56
5644 56 135 -64 181 90 27 84 -53 -96 -145 111 -29 -56 212 -121 189 231 -8 -81 110 85 108 123 -51 103
5668 103 212 -401 121 79 61 -153 -306 50 103 223 298 132 206 -227 -5 58 89 302 7 -84 178 78 94
5691 94 -121 -72 -88 102 -26 209 378 132 223 18 -63 -225 -26 -394 156 92 -98 167 -22 -78 25 72 175
5714 175 -135 130 147 -14 -47 197 -162 -289 -193 -46 -146 61 6 49 -65 190 -71 86 110 34 155 114 -40
5737 -40 160 0 -337 7 33 266 71 -48 -158 1 -38 34 231 51 -194 -58 -5 156 -148 -249 36 1
5759 1 29 31 18 -137 -198 263 58 149 -22 -124 48 -65 230 18 58 25 -185 -268 -88 152 316 -18 -42 7
5783 7 -89 -273 -328 154 22 117 81 232 129 -371 385 239 185 -166 -98 88 -139 63 7 -49 44 -87 233 -6
5807fR6j47K49j35k66O5J65o7r9j7J49n4J37k6mO4j4k02l79L81J61k6j20P6mK59
5833B36l42J84k68J76K46l70j06M03p5l78L54J20m1M5j38K4J90j00o9k28N2J39
5855E4k50J71J20k7J66R4m11j54K72p7J01J4K2Q5k92J57j38K03l69K03or1K38
5878H5j06R3Jn9l08N21l19J61j29K35j48K75m60K75o3j65J15q8P7r4J67j76pK47
5902A30l87L92R7k53l0J3J26l0N4k2j18K02j8k80K66j56k1j38Q0q5K41j46K59
5925A76%m95L48m9m0J62j40Q4k75J64k10J76J54J41j99K5q5RJ45o7q5Q3J41p9
5949H4O5j86L10l32J69l69J33M9o8L15l3l74K93k2q2p1m0J54K33l73L23p4k15
5972a11L23j78n8L9l8J10M1n6j85J80L0J84j73R7l34J24J2j13J29k58J46K10m
$$ plain form
5807 -6 90 -57 192 57 -209 -144 21 -46 -145 -162 -13 -67 70 44 40 104 90 -112 -491 -110 51 25 -95 -19 -23 236
5833 236 -106 78 -190 -14 232 -138 -244 159 84 -294 60 180 139 184 46 70 260 160 91 -137 -85 54
5855 54 -196 -25 95 68 234 328 -83 -237 35 -42 59 73 95 180 -112 45 -93 110 -259 -56 -62 -153 85
5878 85 -21 72 73 14 -294 227 -92 69 -60 175 27 302 -158 117 54 -111 4 -84 -7 -101 66 -110 -117 130
5902 130 -257 135 232 -21 -51 -38 88 58 112 90 -28 174 156 -124 142 -14 -35 -173 -93 -178 63 -83 176
5925 176 176 -319 29 -20 -60 102 -38 46 -229 -65 -275 -99 55 196 -3 22 -63 -54 91 24 -61 22 163 84
5949 84 149 -37 273 -59 110 -259 -126 -77 -145 170 137 -237 56 34 -48 -119 -159 -5 228 -145 178 104 -111
5972 -111 212 34 -24 15 -23 87 128 72 -113 67 97 281 108 205 -129 -5 7 -106 23 -235 -89 121 117
5995A17o2J97k43k72K32J05j66L92l50R5L05l69J1k53L48j84L1j11J52J49k18
6016i4P6j21K03jN2j06k18pK73k15j03K21K61l02K0J61j86K0J37j1L3K0j59j48
6040a94J23J38R2q8k34O3oJ72r1K35l47K44J11l07J10J03j62K49l39K59J56m79
6062a92L9M82p7j32j11J91j32n9K18k88R9J05K09l24L68l33J93R3l00j27M7L9
6084Hk86K45J14j36J29K42j43j58K1L4K12l44M25m23K28l47M88j27j35l66N83
6105B64m61O3l7K8J29j6n8Q7Q9M9o6k85K59K61m90K14N7%l2KN7p1k32K98Q5k25
6131c1MQ9p0J3Ol9J28k53K7l1J61n1J8qn1m7l9L51k40J05m0K61j81J13m47J90
6157f2LJ75j84J51k22K60M4l93J86p7K01o3J6p1J11j57j23J54o0n9J20j16M9K06
$$ plain form
5995 117 55 252 9 -263 -31 74 -92 300 -50 45 350 -19 -8 -261 87 -97 -66 -177 -25 124 -94
6016 -94 -18 -139 64 63 115 9 -209 -216 57 -158 -261 -40 221 -81 -61 100 -86 -66 71 60 93 113 -46 -194
6040 -194 -71 67 159 71 -163 -100 -106 66 -25 210 -137 107 218 -89 21 124 -38 211 -128 131 287 -192
6062 -192 -153 329 252 120 9 200 68 9 227 -61 38 143 352 28 396 63 256 349 49 -78 -31 8
6084 8 -278 -33 81 -55 74 316 173 15 36 70 282 -62 363 -60 168 -179 309 182 47 -319 264
6105 264 -197 -134 -171 -143 -14 -30 -88 -1 88 137 71 -214 45 306 -184 30 87 87 55 57 114 43 -189 109 194 -31
6131 -31 -27 62 -8 5 11 -28 100 -153 -126 -157 4 -47 -29 -37 -88 -135 -174 177 -63 42 2 263 82 195 -252 -62
6157 -62 -59 116 -68 83 -139 121 165 -228 -42 -119 82 19 35 -36 75 -82 -205 -51 -111 -170 -50 -166 -117 89
6181H9j17j1J34m15N89l82K22j27j85m2N20l06J12o8M7m7j39J99q3j19R4m7K7
6204e5K41l70K34l8Q8k47R8j13L20m06L35Jq7MK35r4k22n4J51K8j61J91m0J48
6228A87j85l9K7k78J19J80K52m13J51J6j72L44k01J38l56j1M49n14M85R2l16L9
6250fK06m47J41R6K18j79l4K37n7q4p8j58K18j33K66q0k88J07K80k69J75j56N
6273b0J9mK4K1J51l61K26k15l6p6J72K57k07O0Q3N6j32k50K54n5m9K91m44Q4J73
6298B2J83n24O69m30P6N7K17k53j92J57l26L62J44l40L66j01k8o2J0K23o07M41
6320F4qk96K48J11j25q1oR1j18j67K82K48l90o3J26J96k34M00P3j70k97K82l01
6343a35jR7J90r4M1o2K8j94J36K89l07K45j43o1L91l56l61J47L09j15j67L22k23
$$ plain form
6181 89 -28 -39 95 -320 269 -113 109 -18 -203 -245 275 -31 81 13 60 13 -126 73 -10 -129 -35 -82 -55
6204 -55 186 -184 50 12 100 -147 -49 -162 158 -248 87 88 1 5 240 146 -76 -130 21 49 -112 79 39 187
6228 187 2 -37 -10 -288 -169 11 263 -150 1 17 -155 189 -12 126 -230 -241 208 -306 179 271 -45 -6
6250 -6 200 -247 -106 -10 208 29 -5 232 175 91 13 -145 73 -60 206 126 -162 -55 225 -44 131 -25 -20
6273 -20 -1 -5 19 40 191 -170 56 -159 -195 -271 -99 158 -49 11 94 150 18 -232 22 -33 -82 209 -235 -151 22
6298 22 205 -319 350 -80 -4 53 270 17 -175 -18 -344 18 162 -178 188 87 59 -3 7 230 -377 64
6320 64 56 -240 8 119 -6 -87 -93 -2 -120 -287 -5 243 -147 -210 -84 112 -122 278 351 181 -116 166 -135
6343 -135 -136 -39 151 57 98 36 64 -130 6 295 -12 233 90 29 420 64 -297 -150 159 44 -123 199 -24
6366b4n9L06k01k37J86Q3k27MJ3L61m0j7k50j33K62lK30l17qQ6j30K51j38j33
6390a35K13J75l38J38l3L9q7J29J19l53N4K66N2j43k12J25K4J44J1p0r7q3J67
6413A05m7k34R7k0Q5P6j46j1QK89j19l6j41J92k67p1L71j39k27N23l90K32j24
6436Fq2J42l58K42L06l9j35M0l16P4m0K13J07j17j94J44m0q6Q8r3r3K52j89J67
6460ajP8j57L8J28j11Ok8K36l76N81n35K52L8l71L14q8J59J64n30J73j26J49J04
6484I6j5k09L4J87J74k34q4K22J48j40l43K37O1pn7r0L7k01K96j16j38J60K4J8
6508F0j74n6R6J52j55J06r1KQ2K46l51L6j93L65l05J03P6L60k88l7J98j14J47
6531B65k19k05p3K70l7j24J34l9L50o34N56j55l41L56q1Mn3J43l36J40J53k0j27
$$ plain form
6366 -24 -83 223 22 -215 -29 54 -173 -169 -156 205 165 148 -102 -235 27 24 254 -63 -71 15 -115 136 -2 -135
6390 -135 78 253 -85 53 20 59 -28 101 220 -133 -79 187 239 96 -116 9 33 177 188 118 21 -62 105
6413 105 58 -176 -79 -99 -14 62 -84 -95 -87 202 83 47 -94 98 -169 -240 131 -8 -235 288 -102 130 6
6436 6 -76 66 -292 -50 256 217 82 122 -194 -120 -160 53 160 43 -151 -7 -47 -133 -45 -138 -231 21 -168 -1
6460 -1 -2 76 -81 -43 85 -26 -20 -48 188 -188 393 -142 110 148 -223 91 3 162 326 -204 -31 -157 -8 96
6484 96 81 -128 -94 93 267 33 -51 171 319 179 -164 73 134 127 70 -20 17 -184 112 -4 -142 18 42 60
6508 60 -114 -170 -74 78 -77 29 -62 -60 22 268 -83 -47 -240 125 -180 -77 -1 359 71 34 232 118 265
6531 265 46 -159 -232 38 1 -123 11 -28 322 -312 244 89 -252 104 23 27 -26 117 -219 -79 74 54 -73
6554g3J00p1k49L57q9K00k60L48k57M5j0K28j63K42m35K57j7j74Q5k2J12k50M08
6577C12l11K2k27L66k09k5Q3l50K51L29j20K23n50L78j74J85j25l83L52J50j13
6598F4r3Q6k59J1K31j12J66k06o7J72N1J14j95j93J95j37L61p9j26K64j65j36
6620e3L03nk63Q8j5J57k47Q2rN7J71n22L81o6R8q8k18J05L04m30j0J18P6n1l3
6645g0j58L22k2jl34K81J21q2j53K9oJ83L0j5q1k24J11J66l69M94j76lk14M85
6669C14m01r7P9Q9j44L7P6o6k7j3R8j19J61jK40m11K24K2n4j65L13j76J5k55K59
6694bJ36n8j59L5J96l79MJ26K1J10j6r4J24J35k10J14r5k5L2k85L50k15K98l9
6718A04l47K33pP7O1K29n67J28L27q5k07K51j88j43L29m83J97p0J89k67N27m47
$$ plain form
6554 -73 27 -44 -293 64 -25 175 -85 263 6 51 41 269 106 348 -87 170 153 -21 64 42 154 -96 312
6577 312 1 23 -204 162 -47 -72 11 -339 -88 241 121 344 -206 172 -2 183 58 -325 27 177 64
6598 64 -29 57 -202 -191 40 -72 94 -112 -179 -7 44 158 -37 -230 -35 -172 189 110 -16 248 83 -53
6620 -53 250 245 -18 70 55 212 -35 47 38 95 266 -256 125 59 157 69 -149 -44 260 -170 -180 -62 14 -37 -70
6645 -70 -228 94 72 71 -263 18 139 57 -96 -67 -73 110 140 125 44 -180 -69 97 -272 222 46 43 -171 314
6669 314 -87 -184 -105 -16 -160 -123 -47 -113 -140 -153 -55 -174 -13 -14 226 -185 39 61 7 -158 155 -21 -6 -261 -2
6694 -2 134 76 -83 -48 148 -231 -227 -101 -80 30 14 -80 44 179 -31 83 -12 -37 -5 -290 60 -155 143 104
6718 104 -243 -10 -17 60 121 350 -217 -89 238 153 -54 197 9 -134 195 -288 -91 -161 28 -239 288 -159
6740a59M3K30m56M20j88K8j1L33k76l7jK09j8j28J24q5K6k19jl7M21r7K8j93J51
6765A07o3K33m34K00L45n01J85K51m54J33o7r3M20j31j95J60J93k18n0K93l70
6786e6l0J66Q1k16K88J7l33l6M0L6L7O3n4L3k59j02L76K52l13r8L86k48o4M3K49
6811B58l92k20N12m1L0J43M8n52L80j64N2j20K30k54J09j41J09L1ql87L99j17
6833i5l06K44L74k42O7P7j12M3p6K94l31J1j21K37k54J53R1l9l0P7M3J27k26k6
6857b0M99n85J84l13J67J8n0J68L6m02L41j12K1j60j30L99R4j27K8j34k0Q0J36
6880A18k2j52J76l88J66j4J48Q6l7j68J11jJ0J83k99J38r0j11K3J26j71K63J19
6903B14k85J52j34j4Kq7J94j47J12k9N7J15j52M13l67j5p0o3J14K21l75k24N17
$$ plain form
6740 -159 -116 114 -342 78 -110 -82 -93 240 -36 -73 -74 135 117 -11 113 28 54 -165 -166 -203 218 121 149 -44 107
6765 107 44 277 -157 43 388 -113 72 323 -131 2 -65 -158 262 131 -64 96 289 71 21 314 -56
6786 -56 -86 80 161 -55 233 250 -83 -119 -79 -43 -6 57 3 36 -223 -325 51 303 -10 -108 278 30 -34 9 258
6811 258 -134 -354 158 117 147 290 338 -214 166 2 54 -66 164 -90 19 -122 -13 18 10 -377 22 -95
6833 -95 -401 -157 217 -25 42 119 7 50 -26 268 -63 -52 -173 64 -190 -37 54 15 -15 62 105 232 6 -20
6857 -20 479 -106 78 -235 -68 -50 -100 68 104 -298 43 -69 -48 -208 -338 61 155 28 56 -78 -98 -18 118
6880 118 96 -56 120 -268 -102 -116 32 118 81 -87 24 23 33 216 -83 55 -35 -146 -123 3 -168 95 214
6903 214 -71 81 -53 -67 -65 -152 42 -105 7 -22 35 150 -2 411 44 29 -41 -104 10 231 -144 -368 149
6926A49j49J96k21j26L14J19o10O56l35J68j32J10J0l25K68j75o5k39N36m32O30
6947C47o45K82QJ29j46K36k38j8J90r8M39o26m5O7k84J44K71Nl12L21j30K03k4
6970G6j50o9J96J22L3j94J13j52J25m12L27j36J36J5k09K48LJ02j83m2j35L2K16
6993F2q0J48j43p8K13m77N04k57L0L81l20O6O8n2r7Q3k44N71o34M68M4p5N1m16
7017a84K2qJ07j19L91q7o7J41q9n1j64Q0N4k11n7M19k80K38P6k17K52k41p1K20
7041A54l27p2M76l95L72k40K03j75OJ21l7Lp4J58k60J59n5K25j56P0p7k33K28
7064G4j75K21K09k49j13K1J03p6J69l63l4K93J26j16k62J84k36K71J77o0N7n56
7086c35L50r9k97K18K90l86K68o3K70n45L47J19l24J70LK96j46N7n16L53l4J21
$$ plain form
6926 149 0 196 -25 -151 163 282 -328 328 -7 161 29 139 149 -176 92 -83 -148 -387 149 -283 347
6947 347 -298 -16 -8 121 -25 211 -27 -45 145 47 486 -140 -185 -118 -402 -258 13 18 -294 27 -103 100 76
6970 76 -74 -143 53 175 208 14 127 -25 100 -312 15 -121 15 30 -179 69 72 174 -9 -51 -186 -154 62
6993 62 -18 130 -13 -91 122 -355 149 -108 -78 303 -17 49 117 65 -32 51 -193 378 -256 212 256 181 232 -184
7017 -184 -162 -170 -63 -182 209 122 55 196 107 56 -108 -28 26 -185 -242 177 -103 135 211 -6 246 5 -66 154
7041 154 -173 -245 231 -164 208 -32 171 -4 2 123 86 89 15 173 -87 72 17 242 86 156 79 -154 74
7064 74 -101 120 329 80 -33 -12 91 15 184 -179 -213 80 206 90 -172 12 -224 47 224 164 221 -335
7086 -335 15 -84 -381 -163 127 -259 9 -54 216 -329 18 137 -187 -17 -14 282 136 193 -323 30 -4 117
7108A17j58K64l31r7K33r8k4Q3P7m29M28j59K23j78L78l61K14J37l63J51l05J16
7130h2L00j98j41nQ5j15K8J66M5k73J33K31l52R0M8j28L04j14k26R1K04q2j0l80
7154c81K45J21j61J70L23l58J45L3q7M9j93k2o3J59j99J26R2l33M2L07p4K65r7
7177A09k70j53L85M1k47j21K83j07k8m9L54k11J08r2k74K88k9l34M12R3k20m7
7199a09K34J26j65k29K26K09m92M70j4l68N2j41J75j12M39l24J18K11ln36O17
7220C84k8j68R6j93j51M9P0k07K47k71K76o8n4K19j28k60J59J46j19n2J96j69
7242b6m42K92K4K37k69J80k48M87l77J62j39J11Rm8L41l04K13j48K7k79K98K03
7264C04k34j60m9M0L1r5J53k05J2L84l06J01L32k88J35n5j4l21K14J78l0k75L74
$$ plain form
7108 117 -41 223 -108 -205 28 -70 -94 -11 66 -363 65 -94 129 -49 329 -32 182 319 -44 107 -198 -82
7130 -82 218 20 -121 -126 -41 -156 -128 38 83 -190 -57 174 -178 -88 -40 -168 136 22 -204 -113 91 9 -1 -381
7154 -381 -136 -15 -176 -6 317 -41 104 137 50 99 -94 -116 -179 -20 -219 -93 -1 -334 -292 15 -59 206 109
7177 109 -161 -314 71 112 -135 -256 27 -80 -108 -157 197 -14 94 2 -272 16 -13 -347 65 158 -62 -109
7199 -109 125 251 86 -143 83 292 -200 270 256 -112 -60 -201 -26 -138 301 -23 95 306 303 -233 384
7220 384 356 188 284 91 -60 -11 59 -148 99 -172 104 36 -18 201 73 -187 -28 118 -1 -53 143 -26
7242 -26 -468 -176 -152 85 -184 -4 -252 235 -142 20 -119 -8 1 -47 294 -10 203 55 82 -197 101 304
7264 304 70 -90 -139 -99 -68 -163 -10 -215 -203 181 -125 -24 308 20 155 100 86 -235 -21 157 127 -148 226
7287B26k17q4L89o76M76j7J32k67L7J56j57j1j89R0k3K14l8K5r7R7m1k9J7q5K14
7312A42j49J30j54j15K73k95J89K2np8j1pR4k32K65o1K55l42J90M5O5k06j54J52
7336A3J26k12J96Q9k1k15j36M00m02L27m6l11k9K73j91K68l17K31m0L01k26k75
7358a97K46o0r9J72J40l15oj29Q1K8K84j19n8J04l3n1Qj78N4J70k42J67K9J50
7382A46j9k27n2M02m46J0J50J62l69o4L55j15q8N3P9j39J42k97M26l10M08j13
7404I4k79J67k9rk3KK82m66J59J09P9k06K26j28j33mK09P2j82r6J82L38m81K81
7428A64J55l95K74l72L15k99K05J01k79L74l98J87k16j0M1K87l83L9J27K83M5
7449B45k16J36l41K49K62k51K31l68j40K66J01k49J10N3j62k47J49K64K3j53L20
$$ plain form
7287 226 9 -75 314 -362 114 97 229 -38 -1 155 -2 -13 -202 -112 -135 79 41 66 -31 66 25 -4 13 -72 142
7312 142 -7 123 -31 -146 127 -168 21 43 38 -40 -51 -58 36 -196 69 8 263 -79 111 156 221 15 -139 13
7336 13 139 -73 123 212 191 -24 -160 240 -162 165 119 -192 -221 52 -139 129 -188 43 3 304 78 -197
7358 -197 49 -11 -110 62 202 -113 -119 -248 -167 -139 145 26 -32 72 39 -12 -4 -182 -128 42 -200 -33 -4 146
7382 146 127 -100 -152 250 -196 -186 -36 126 -243 -307 48 -67 -155 -102 -23 -162 -20 -317 109 -201 207 94
7404 94 -185 -18 -47 -56 -79 -77 205 -261 -102 7 86 -120 106 -22 -155 -159 50 122 -60 -156 26 364 -117 164
7428 164 319 -76 198 -174 141 -158 47 148 -131 243 -155 32 -184 -194 -153 134 -249 -210 -83 200 245
7449 245 29 165 -176 73 335 84 315 -53 -193 73 174 -75 35 88 -74 -321 -172 92 115 -38 282
7470B82k30j31o6l2j67N20J16n27K31q5J58k0j48o4L98j03j62J26l4o6n6J28j15
7493d7L71k32J32p3k62Kpp4K73p9q3K47Q7j61jl71L83k05O6L24k58M9o2pm8N8
7519B2qK46m46N82j69N3l83P6J16j67K81l54N46m14m0J65Lm7l32K79k87N50l36
7542f4j08M90k77j8l3J02m1J39k87J46j32o0J93J69j26L4r6l1o6K94l19L11j16
7565A04k7K72n04K67k65Q7N2K3j11K07p4l4M0j39N3K16m56L8K73k18K3J33m5J39
7589E4n1J31oJ23l79K52j54J4M3J3J08P9j85j1N0j98r2K61j41n9L16j75J7J14
7613A24l32J7J56R2o1J89k78m9J62k9j56L11j71O6J25m14J94J55l91M47j99K8
7635a4j42Q1j98J94K8R0J27j17j53j12L67M7q8Ql92Q0L69j42r7j0j01L44k11k71
$$ plain form
7470 282 52 -79 -145 -177 -344 176 292 -235 -4 -89 69 49 -99 -163 235 132 -30 96 62 -4 -60 68 -47
7493 -47 324 92 224 151 -111 -109 -116 -190 83 4 -79 168 255 94 93 -278 105 -100 -34 290 32 81 19 12 -36 22
7519 22 14 260 -186 396 227 280 -103 -27 89 -78 203 -151 395 -19 -59 106 109 62 -270 9 -278 272 -64
7542 -64 -172 318 41 23 -10 92 51 190 -97 49 -83 -143 50 219 93 127 31 0 -66 228 -91 220 104
7565 104 77 349 -155 112 -153 -66 -14 9 -102 105 31 -3 37 -102 -49 167 -289 -251 22 -196 -173 -40 -85 54
7589 54 3 134 128 251 -128 124 -30 -16 27 40 148 227 42 31 81 -117 -209 52 -89 -148 168 -7 10 124
7613 124 -208 -191 -35 57 -4 185 -93 -142 20 -9 -165 146 -25 41 166 -248 -54 101 -290 157 -42 -14
7635 -14 -156 -75 -273 -79 -51 39 166 49 -104 -216 151 198 110 118 -274 -194 175 33 -64 -74 -175 169 -42 -313
7659c13K02O01o29p7J11O2N5j76O5P0k00K54p8K00l1j7k30J48n3k75M15l9N9l8
7683H6l66J66K15l8r3l6n5K23rqo8j45K0J43Q3j09Q6o7J32j10j26r7J23Lj53L20
7709A20oM8j23q2m2M1J3K43j57j36K33k60J22Q1m8m32L07L51j60q1K7m0l4L40
7733C25j70j21J68l01K51k27N9j29J19j84J35J04j27K90n64M82K14j95j22J38
7753A45k1r9q2M26k71k16J34K34l65J21j6q6M33j02m28L17j78J7L05j74P0n7J40
7776B47l60m5J21k96K00K63j20o5J02J44m12j11N05j73j6J22N5k44J34K2j48m4
7798a19m8K48n9k86L93j70L2K60k74l1p5J10n5j48J27K62j89k9J78p4j88K4R3
7821a8j15K27q8J67l12K93Nk02Q7J13j22o0J67k46J86n4JN6Q8k06K28l79K21P6
$$ plain form
7659 -313 -111 490 -139 -216 -105 -43 12 -164 -99 -29 -229 25 -53 147 116 99 -131 17 -36 -311 104 65 124 86
7683 86 -280 -114 101 63 -30 -66 -121 102 93 85 17 -128 -108 35 118 9 95 28 160 50 -76 -173 -50 -47 -200 120
7709 120 114 162 39 -43 -85 -44 -31 212 55 -81 152 -108 14 95 47 -385 -78 273 113 32 59 19 -15 325
7733 325 155 34 202 -99 152 -75 -16 -145 -26 -210 -75 29 -98 192 -372 110 324 129 7 145
7753 145 124 25 -57 369 98 -118 16 250 -115 6 -10 -96 337 235 -193 124 -54 -37 268 94 164 107 247
7776 247 -113 -158 -37 -333 -133 130 10 -55 47 191 -221 -332 173 0 -16 106 161 -83 51 73 -75 -119
7798 -119 -167 81 22 -264 129 -41 -9 251 -23 -54 -129 -19 -74 -222 -95 167 -22 -51 127 53 -135 -111 -18
7821 -18 -133 94 6 173 -139 154 159 -43 44 157 35 -25 142 -104 82 28 29 85 173 -33 195 -184 37 113
7845A13k50K09j49K7K01j64r5J11J09j87K20J80j02m70L93j07k75K7M60l51P1
7866b9nj61L24m0o9j67J57k1K98j89k32J85k19P0m0J0M7K36l14J78j53P1L4jK3
7891gk42N27n4k05r8J51j7lJ76n23L20KJ35k73k17J66N5L54j62l04M03j28k31
7914a75J45k84L07O5K3n9M8j40L7N1j85K53l67J36M69m67P7M14r7l61J27J66K3
7937B06k62mK54n02L26K81k93r8N17r0l38q6K90k02J89k13K28k99J03J2rJ57Q6
7960B53Q1k95MK08l60k07N93k69L1p2R5n7k15M49m48J59P9k39L08k31J19k2R0
7983E4K98p06L82j34J40k91J44Q9J5Nn5J22L5k19K00r4j0J78J52k45m5r9L31m23
8007a76L7M26m85M83j37k85M06Ml33n6l7nPJ46k45pK7K40J7j33L42l50l4J61J18
$$ plain form
7845 113 -137 72 -77 -50 151 -13 -108 3 112 -75 145 325 223 -247 146 39 -236 -209 251 -100 -29
7866 -29 -34 -195 129 89 20 -147 10 -11 287 98 -134 51 -168 -98 -138 -128 -81 155 -159 19 -134 -63 -29 -30 -7
7891 -7 -249 278 224 19 -79 72 55 52 228 -295 25 27 162 -111 -328 -162 -107 247 85 -219 184 56 -175
7914 -175 -30 -314 -7 58 81 22 70 -70 -33 18 -167 86 -281 -145 324 -143 -66 348 251 -110 17 183 206
7937 206 -56 -60 194 -308 18 299 6 -92 425 335 -3 -89 201 -1 188 -25 203 -96 7 19 10 167 253
7960 253 334 39 43 251 -109 -316 277 8 39 -33 62 5 -210 239 -209 -50 29 -210 98 -133 -14 -36 54
7983 54 352 -354 28 -106 34 -257 -113 -24 -9 -4 -59 63 98 -121 79 -15 -25 153 305 60 15 -84 247 -176
8007 -176 -139 287 -198 285 148 -137 269 273 -60 -116 -153 -158 -151 -5 -250 -257 -230 10 27 -106 236 -114 -148 13 131
8032A31p0l16L89O3n23M43P4k53j6j25K43J3L8k20Q5l2O1J93l34J29P4j0j08K22
8056A51k78L6L97k02o4m7J82j02N4p1Q8m90M05J05k05Q8J16r1J8k39K68n20L75
8079b6K04k84R1n1L28k62J8r8QJ17j40J81K19k69N6l71K87q7j39p4J42J88k6j85
8103a73jL34k59K71k23J34j37K44m47K66o2j31M34P9k02j39N8J64k26K7O0j84
8125a13K52p1o9l47K59J48J09N3k74O2J4K33k36n2L09m14q0L22k33K16k10%K14
8148I2j91L09k59Q0j33K4j31K19K02p5k76R6o3J69j71j54K41J96l11O4Pn6j9n
8172a45k7K37J1j75l03N58l42j4L59j21m39O61m88J59R3k13L32n0K70
$$ plain form
8032 131 61 -255 134 197 -326 117 191 -62 -78 -203 40 53 91 -129 -44 -76 -15 178 -156 -27 47 37 -71 151
8056 151 -127 -91 306 104 40 -7 175 73 127 56 144 -346 59 164 -41 47 163 72 90 -149 119 -401 -26
8079 -26 178 -106 -15 -66 262 0 18 -80 -72 45 -95 86 305 36 92 -279 8 -79 -218 -292 -150 38 12 -173
8103 -173 -174 160 -99 172 -51 83 -54 190 -257 9 -53 -184 250 329 127 -12 46 210 -16 11 71 -113
8125 -113 139 68 -1 -348 -89 59 168 221 -53 9 23 256 20 -32 277 -137 -217 105 -128 88 -122 -122 92
8148 92 -99 210 -49 31 -102 -78 -209 10 212 137 -139 -43 -106 63 -108 -262 -21 175 -136 -72 -65 -121 -140 -145
8172 -145 -172 65 76 -99 -402 156 -186 -200 159 38 -401 260 -228 -69 24 -189 143 93 363
8191C63
$$ Imaginary data points
##PAGE= N=2
##DATA TABLE= (X++(I..I)), XYDATA
0@%%%%%%%%%Qj6J6j6K4l2L2m0M8n6P1q2R3j08J26j46J66j89K16k45K76l12L51
32A85l93M41m92N47o09O77p51Q34r25J023j132J254j388J538j709J904k127K385
50A262k687L048l493M051m775N761p183R436j3572K3671r4339j54824J16098J66716
64D9170R1270p8398j10043k4536R1886Q6601P219o4348m8510p146J2974m436j271
77D32J6026J6608k8219o0546k8778N2257Q4903K5615p3003r1886o065R4242R2562
90I4148o679r3850p2756K4412Q6380N0976k9336o6627l2199K0169L5263J2899
102B2800r319j1686r338j3805j2550J0218L6856K9158j7018n3422l2288L0157
114c0237O5726L1648l9280o7493k3591M3386O0192J3666m2106m8296o906L2491
$$ plain form
0 0 0 0 0 0 0 0 0 0 0 8 -8 8 -8 16 -16 16 -24 24 -32 39 -43 50 -58 68 -78 88 -101 115 -130 146 -166 185
32 185 -208 233 -259 288 -321 356 -395 439 -486 537 -595 659 -729 809 -900 1004 -1123 1262
50 1262 -1425 1623 -1870 2181 -2594 3167 -4016 5420 -8152 15519 -78820 -233644 -117546 49170
64 49170 140440 62042 -48001 -72537 19349 105950 113169 48821 311 -6835 6139 1703 432
77 432 16458 33066 4847 -55699 -84477 -32220 52683 78298 5295 -86591 -92656 1586 94148
90 94148 87469 -6381 -79137 -54725 31655 82631 53295 -13332 -45531 -25362 9901 22800
102 22800 13481 1795 -7543 -21348 -33898 -23680 13176 42334 25316 -28106 -60394 -30237
114 -30237 35489 67137 27857 -39636 -63227 -19841 40351 54017 11911 -36385 -43291 -10800
126a0800L2573L753j8521j7723o402K372P992J3713J3146r18k1911k4550R26L1559
140E209L1824m227l8571l3485Q139M1347L0387j2704l9934k4324J4331L4643J8418
153C1053j2286k5465j2487P000J4999Q479m28o292r340q902j815J0596J6429O215
167A7756j3053k1729p492J7725K5582P542j8835k5899o165J9337K3458M595j7140
180E682k0302l302J4008J6250M394q912j2434n903L107Q992Q590R29q654j2359
194i914n411Q063J5115P834p093j5712q768Q078J7310R955p852j6957j0390O209
208i533J5747R190n854j5063r462M039J2734R733j600j0584r906n25Q125R914
222F955K423p086j0937m960O020J1165N789m120j0414n984L312J0371P810l067
$$ plain form
126 -10800 21773 25526 7005 -10718 -17120 -14748 -6756 6957 20103 19185 -2726 -27276 -26350 5209
140 5209 37033 32806 -5765 -39250 -31111 10236 40623 27919 -12015 -36339 -22008 12635 31053
153 31053 18767 -6698 -19185 -12185 2814 11293 10865 4573 -4767 -13669 -15484 -4888 11541 17756
167 17756 4703 -17026 -24518 -6793 18789 26331 7496 -18403 -24568 -5231 18227 22822 5682
180 5682 -14620 -17922 -3914 12336 16730 7818 -4616 -10519 -7412 1580 10170 11099 2445 -9914
194 -9914 -15325 -7262 7853 15687 8594 -7118 -15886 -7808 9502 19457 11605 -5352 -15742 -9533
208 -9533 6214 15404 9550 -5513 -14975 -10936 1798 11531 9931 -653 -10559 -11084 -2959 6955
222 6955 9378 2292 -8645 -13605 -7585 3580 9369 5249 -5165 -11149 -7837 2534 10344 7277
236G277j0082p691J758Q747P420k12p120p274n20P561Q600K199n548q281l744
251f910M302Q147L538m776q879m971L464Q551N081j655p146n349J531P500O313
266H741m99o473o779j305N345O674J797m991p028k825M935P517L473l751p730
281b899m313K587P170M397k885p360n348J460O919N321m66n202n621m05N412N970
297D737J774m748o810k367M069O342L363l082o887l135K901O904M180j881o180
312h20m842Q61N679N456l41n973n868l12N627N261J154m470o124j828L930N877
328C267J923k996n765k689K672N219M046r71n240l996Q20N116M195j51m234n153
344c937j499L611N133K311l412n756k413L273N724K965k545n832l403K133N691
$$ plain form
236 7277 -2805 -10496 -8738 9 7429 7217 97 -7177 -7697 -136 8464 10663 5115 -3166 -6910
251 -6910 -2608 5539 9077 4301 -4578 -9549 -6085 2466 7547 5892 -1254 -6603 -5072 2428 8741
266 8741 8242 1769 -5010 -6315 -970 5704 7501 2510 -4518 -7343 -2408 5109 8582 4831 -2899
281 -2899 -7212 -4625 2545 6942 4057 -3303 -8651 -7191 -272 5049 4583 -619 -6240 -6645 -1233 4737
297 4737 6511 1763 -5047 -7414 -3345 2997 6360 3278 -3609 -6744 -3843 3061 7241 5360 -820
312 -820 -5662 -4801 878 6334 5993 20 -5848 -6160 -533 4728 5882 1412 -4712 -6540 -2610 3267
328 3267 5190 2194 -3571 -6260 -3588 1631 5677 4706 -534 -4530 -3710 1406 5601 5450 1216 -3937
344 -3937 -5436 -1825 3308 5619 2207 -3549 -5962 -2689 3035 6000 3455 -2377 -5780 -3647 2044
359B044K950k194n250k823J514M370L507L0l252l093o29K717L561P29k090l848
375a757k388J079M174L103j016m083l352Q91M349L784l12m368m806j19M253L726
391C158n53l687l503l84L511L747Q59k163k802j007J928K676J913j295k975k778
407c355J44K943L016l4l013k993k20K749L699R49k367l835j611K674L391J382
423C519j999l779j893J504L716K542p80l253k406J034L293K676p29k981k868j96
439b600K460K746M50k005k587j395J789K749J484q99k841k162J80K261K627L79
455B636l066l151k75L013L472N51k965k980k81K282K905O18j514k906r22J415
471a168J907J323Jk119j235o40O17L448J023j756l207k005J437L663J835j378
$$ plain form
359 2044 4994 2800 -2450 -5273 -3759 611 4118 4148 896 -2197 -2826 -109 3452 4181 2091 -1757
375 -1757 -4145 -3066 1108 4211 3195 -888 -4240 -3349 1000 4784 4472 104 -4702 -4821 -568 3158
391 3158 2605 -1082 -4585 -4969 -1458 2289 3148 985 -1817 -2824 -896 1780 3693 2398 -577 -3355
407 -3355 -3211 -268 2748 2714 -299 -3292 -3512 -763 2936 3885 1518 -2317 -3928 -1254 2137 3519
423 3519 1520 -2259 -4152 -2648 1068 3610 2830 -423 -2829 -1795 1498 4174 3445 464 -2404 -2600
439 -2600 -140 2606 3056 1051 -1536 -2931 -1142 1607 3091 2192 -649 -2811 -2631 -370 2257 2636
455 2636 -430 -3581 -3856 -843 2629 3180 215 -2765 -3046 -764 2141 2759 1245 -1661 -2583 -1168
471 -1168 739 2062 2063 -56 -1291 -1931 -1314 2134 3157 1401 -1806 -3811 -2374 1289 3124 1746
487A746l939k172K199L913J876j835k926r26R70J874J251p24m32j247j104j06
503a582J286K713P25k022k993j564K879L928L92l669l971k86L608L629k19l114
519b60l300M90L079K144L2j991j078l07J76O15J419R11q75j922j623J521K578
536A609K172o01l754k824J112L846K068j619m038j945J883L213J147j237j998
551i66q03N45J197J025rk08j284j283k97J463K091Q27j583k507r74J823L332J091
569C480j816l469r87J456K867J332j849k371j789Q12K544J718N9j966k424m7J344
586a106K575J035j392k869j962J543L165K437r42k963k529O40L326K840k30l535
602C3k736K09K521K350K52j846k963o56J721K404J641j386k303j862P25K295J594
$$ plain form
487 1746 -2193 -4365 -2166 1747 3623 1788 -1138 -2064 -1094 780 2031 1307 875 -372 -1476 -1582
503 -1582 -296 2417 3142 1120 -1873 -3437 -558 3370 3762 93 -3878 -4164 -556 3073 2854 -260
519 -260 -3560 -3070 9 2153 2185 194 -884 -1191 -1015 -400 1019 1930 1055 -867 -2490 -969 1609
536 1609 3781 3180 -574 -3398 -2286 1560 3628 2009 -2029 -3974 -2091 1122 2269 1032 -966
551 -966 -1769 -1224 -27 998 989 781 -503 -1786 -2083 -620 1471 2298 715 -1792 -2766 -943 2389 3480
569 3480 1664 -1805 -2792 -1336 1531 2863 1014 -1357 -3146 -2334 210 1928 1987 21 -2403 -2450 -1106
586 -1106 1469 2504 1112 -1757 -3719 -2176 989 3426 2484 -479 -3008 -2368 958 3798 3568 33
602 33 -2703 -2494 27 2377 2629 783 -2180 -2836 -1115 1289 2930 1544 -759 -2621 -1896 399 1993
619A993j33j942k585j15K246K454L31j637j962p29J137J872J475m92j934k177
635b198L04J964J981K87k559j899k33K185K088m54j777j685Q62J082J030n46o32
652b00P7p6q2R4L3Q00R42r35j778k82J247J765N76k058j838L25J983J818q15k154
672e58j218J281J590J45j514q33R11J224q99j321n55J487K314m38k524k252J884
689a276L555Q79k178l143m18K977K388p13l165j029P91K101M22j023q59P46Q44
706H99j065r97L20J859Q32j583k540n53K667K976n40l219k400J499L564J752j790
723A681l334n87K017K025J15k183j499R78J567j35o97m19R00M18p60j365l7K395
741A080N39q51k819l82K074K312l08k695j442J296K919L71k076j814M51K491O36
$$ plain form
619 1993 1860 -82 -2667 -2782 -536 1918 2249 612 -1350 -2079 -942 930 2405 1913 -21 -2198
635 -2198 -1894 70 2051 2338 -221 -2120 -2353 -168 1920 1466 -311 -1996 -1134 -52 978 432 -200
652 -200 -123 -199 -281 -187 -154 646 1588 653 -1125 -1407 -160 1605 2181 123 -1715 -1390 593 2411 1596 -558
672 -558 -1776 -495 1095 1240 -274 -1107 -196 1028 129 -1192 -1747 -260 2054 1616 -908 -3160 -1276
689 -1276 2279 3158 980 -2163 -2581 396 2784 2071 -1094 -2123 -1332 769 1191 168 -691 55 899
706 899 -166 -1163 -843 1016 1848 265 -2275 -2828 -161 2815 2275 -944 -3344 -1845 1719 3471 1681
723 1681 -1653 -2240 -223 1802 1917 -266 -1765 -787 780 645 -52 -471 429 847 87 -1278 -1315 1080
741 1080 1619 768 -2051 -2433 -359 1953 1645 -1050 -2492 -1196 1723 2094 18 -1796 -1345 1146 1782
758A782r24k306j58K272J065n06k159j44J224J774p64j710p61Q58J419N7j937
775i18l75P28J444j78j646m08J255J834o80j663j240J243K168N38j832k374L31
792a773J873K223q98j763j684J007K243J72j023j102m88Q95P27l12l82M1N21m34
810a57j93j59N98R40j01j603p92N52J701P74p05k294j97J411J433P49j506j876
828a425P7J457J448q08j004j031L49R05O08Q0n62l90j65J37O9M26L13R7r17o37
848i73K04J005J039l71j711j50M73J459K92r62j018J13N63N66L1k29l89l04J52
867b10l4J74N54j0n18n56j94Q34O85j72n76q47R2Q90Q56m89n06o09O36K76K11
888D87j3m50j92M0K55l19J20K60O6n96j73M19J96K79o4o10k45J44L29L38j23l88
$$ plain form
758 1782 858 -1448 -1606 666 1731 1225 -934 -1078 146 1920 1156 -554 -1315 -457 962 1019 -918
775 -918 -1293 -565 879 701 -945 -1353 -98 1736 1056 -607 -1847 -604 1564 2102 270 -2104 -1773
792 -1773 100 2323 1425 -338 -2022 -1015 1228 1400 377 -725 -1213 -318 409 97 -285 -244 277 -157
810 -157 -350 -509 89 1029 928 -675 -1467 -915 786 1560 855 -1439 -1636 -225 1208 1957 451 -1425
828 -1425 -1348 109 1557 749 -255 -1286 -937 -32 576 656 94 -296 -461 -324 -255 171 484 581 -336 -973
848 -973 -769 236 1275 904 -807 -957 -484 975 1267 305 -713 -600 -37 529 560 331 -58 -362 -210
867 -210 -244 -70 484 474 -44 -600 -794 40 725 553 -23 -870 -778 112 968 479 -27 -636 0 276 487
888 487 474 24 -168 -128 127 -192 -72 188 254 -342 -515 -96 100 379 315 -295 -540 -396 -67 271 148 -240
910b40Jl25L58L25k84J90l9j09J93N72J28p31m92K40M32j20R3n15k31L29R6P1
932e8K47l11j34J98N09m72n7j15J09J75J24k74K50m68K40J77r6R1J25j87O3j10
954B6j41N34j5j95k86PJ33M60k19k03m70k0K39M16J3l10o10J3P98K68j66n80k80
977e88J44N88N22m63l71K52l60L20M1K05j80k87Q4J15K36q1KN2l46k35M49j10
999a1L21n29L2k90O32m02N33n2l14l2Q9L5J16Q5j54nm50L55L37j01k80P8j89M97
1023C01k2k19k39J3K16J99k34O5J78k94j51n8R4L59O5j83l57p2M65L4j0l14r0
1046b54LK33K94J99n66N3K55pr4p9K86k42k99L66L5j34K3k83k01P3K25L68n2n25
1070c23J15J47N22m17Q6j42n50N83K14O4j24l26m7L38mJ02j64k9k05J45K8J75
$$ plain form
910 -240 -239 -564 -206 119 -165 25 -14 -123 70 642 770 39 -453 -213 219 99 192 -323 -554 -225 -129 -58
932 -58 189 -122 -256 -58 451 -21 -78 -193 -84 91 215 -59 191 -277 -37 140 44 135 260 73 136 26
954 26 -115 419 404 209 -77 -70 63 523 304 101 -369 -389 -150 266 279 -31 -641 -628 170 438 272 -308 -588
977 -588 -444 144 666 203 -168 84 -276 44 85 290 110 -177 -93 22 258 177 179 231 -115 -350 99 -11
999 -11 310 -219 -187 -477 155 -247 286 234 -80 -112 -23 12 128 213 59 54 -396 -41 296 195 -85 -7 -196 301
1023 301 279 60 -179 -166 50 249 15 80 258 -36 -187 -245 -151 208 273 90 -267 -339 126 160 150 -164 -254
1046 -254 -251 -18 276 475 -91 -38 217 210 116 37 323 81 -218 148 183 49 72 -211 -412 -339 -114 254 202 -323
1070 -323 -208 -61 461 44 130 -12 -562 21 235 299 175 -151 -198 140 136 238 74 45 -160 -15 13 188
1092A88J32m24R0l36K22J15J63l4j93n84L86L14L0L68q09K74k33L1P17J07n62
1113c8k28j30J37P41Q3n65l45l4J32P24j70j68k67j90J8K53K75K90j90k10n37
1134d19j44O81O25k51n39j054M72J072M83j84j276n75O38J141J35p86o96K23L22
1153a32N76k49n0l61J71J08n36J0L37N51Op32p30O76J333K69q14j397m20J240
1173a44J013N6q85j492N51J315O31j87j207l48L65Q04k92q8pJ91k29n06r6N11
1193d4R45K8j075j139J30J395J034n42j321q77R29J384L14q13j146k86J037P88
1211G41M3o71m53L18k42N2J44J15O12k59q42o74N19J426Q85j331j783l24J699
1230b5J576j52j820r59K82J391P14l00j073l76K60P15J1m34J20K14j79m95l85
$$ plain form
1092 188 320 -104 -14 -350 -128 -13 150 116 -77 -661 -275 39 69 437 -372 -98 -331 -300 417 524 -38
1113 -38 -266 -396 -259 482 565 0 -345 -379 -247 477 307 139 -128 -318 -300 -47 228 518 328 118 -419
1134 -419 -563 118 743 492 -47 -1101 -629 443 926 742 -534 -1109 -471 670 805 19 -677 -454 -132
1153 -132 444 195 145 -216 -45 63 -473 -463 -126 425 431 -301 -1031 -355 978 1247 433 -964 -1384 -144
1173 -144 869 925 40 -1452 -901 414 1045 858 -349 -697 -332 472 180 92 85 276 47 -459 -555 -44
1193 -44 901 929 -146 -1285 -1155 240 1274 732 -589 -1466 -537 847 1161 348 -798 -1084 -47 741
1211 741 784 113 -340 -22 -264 -212 -68 47 659 400 -442 -1116 -597 829 1714 383 -1400 -1724 -25
1230 -25 1551 1399 -421 -1380 -1098 293 1007 707 -366 -742 -482 233 244 -190 -70 144 -35 -530 -915
1249i15J029J045q5j102j034M8J460J095o79j684j093R12J941O14j254j196m02
1266a300J547M97k06n00k24l80K03K14M34o1L24k08r61n3M88R99N42j162j378
1285a185m3J237J497l93j533r50M02J478J065p61j166q62P12R57k2j62j57m08
1303b94j83m5N64L92J1m66m12p1K20J183k01p82j128K11J133O15q5p38p24K83
1323e17M45J026m55r62K6J72p9M67M66k73l30k09j24K70M74N1l00m47o14Q42N07
1344D36m3l28o62O3L63O07K0o69l3l7r1M92K8l1l10o8J3N8N29K17l24o21m3M42
1368HJ31m32N62p6l00nK45L30k29j69m04O9J99M26q0j4o26K86j48L01J73j43k84
1391a80J13k03M78k50L62j50l97kL15J66j94M5j26k3l91M62l7J97k39m10j43L99
$$ plain form
1249 -915 114 1159 1074 -28 -1062 -1014 446 1541 862 -822 -1915 -1003 938 1552 298 -898 -1300
1266 -1300 247 744 538 38 -186 -566 -363 -149 285 224 548 340 -621 -674 -186 813 1355 193 -1185
1285 -1185 -1228 9 1506 1113 -420 -1370 -968 510 1575 814 -352 -1214 -502 455 433 271 114 -294
1303 -294 -477 -522 42 434 445 -21 -433 -504 -284 899 698 -84 -1212 -1001 132 747 662 -76 -800 -517
1323 -517 -72 954 499 -463 -437 -265 -344 123 589 316 -14 -223 -347 -77 397 448 148 -299 -913 -71 436
1344 436 393 65 -597 -534 -171 436 456 -213 -246 -283 -374 118 146 115 -195 -263 -250 -192 337 554 230 -391 -434 8
1368 8 139 -293 269 193 -107 -112 133 463 234 65 -339 -270 -71 355 275 261 -365 -79 -227 74 247 104 -180
1391 -180 -67 -270 208 -42 320 170 -227 -229 86 252 58 103 -23 -46 -437 25 -12 185 -54 -464 -607 -208
1413b08L67n5M5l49j54M95L09K7k48m77K68Q2k75L92m1k95l1P0L59n6j14k18J4
1436i3k73L3N21J93j12j92J26m4RJ08k48l47O7L2J55J53M53m73k54l3K76K22J62
1459D41k26p69K78L90j32J01J03k36j02J26J04k8J9N6L6j49n1J1K30j7p9l92Q8
1482a98L44K00M0l96p8l45N57J66K55l29m03k65L73K36k32J60m71K32K24M9k17
1503i8K39k8j5m50n3M83L87k17l58l06L47P1J70K07l55m04K42j24N75J02l70j67
1525a22k54J29K41L37k36J74m18m25M93M30O4j55n71j15L75L30K52l24m81m73
1545g49N81L14M14k31l63l08J53L18j20J37l59R2Q7j16K15J1J24M5n36j75O00
1566A34K39km05n90L80L85N09j51n48l25N7L82M79l46l38j47j49M84K42n0P9l11
$$ plain form
1413 -208 159 104 149 -200 -354 141 450 477 229 -248 20 102 -173 219 178 -117 -148 -78 281 225 111 -107 -93
1436 -93 -366 -333 188 381 269 77 203 159 168 276 28 -319 -252 -220 -65 88 541 68 -186 -219 57 279 441
1459 441 215 -554 -276 114 -18 83 186 -50 -152 -26 78 50 69 125 161 12 -39 -28 202 185 106 -286 -198
1482 -198 146 346 386 -10 -88 -433 124 290 545 216 -187 -452 -79 157 -75 85 -386 -154 70 119 -98
1503 -98 141 113 98 -352 -405 78 465 248 -110 -416 -69 2 172 379 24 -380 -138 -262 313 415 45 -122
1525 -122 -376 -247 -6 331 95 269 -149 -574 -81 349 413 258 -313 -428 -53 277 529 205 -276 -749
1545 -749 -168 146 560 329 -34 -342 -189 129 9 146 -213 -121 -34 -150 65 76 200 245 -291 -466 134
1566 134 373 371 -34 -624 -244 141 650 499 -49 -374 -317 65 544 198 -140 -287 -436 48 290 240 319 8
1588Hj63k78L49M85M5p9k28o26M10K31J04P2m31n90M34L09L56Ok40p34N42L22
1610C04o0P3o0n94l1J69K15K1L93k28m31K2M2L59o8j6l53j62N16J56J40l93m41
1633d27K45J84M02j82j71J1k29p0L84J7K89m45j91q2Q3M88j18O2l61n24N52M83
1655D00M2l28m39r5K35N57q3j31k90m7K08K52q4K7k85n0R6on8J35%l4l53Rm8N66
1681A96K08l32o01K07N64O3L18o97q0l30M72RP4Q0n00L76q0J35pJ49J55m78J3
1704h6l81K30M2O08l91l39R0L85K58l79l04k36K94L76J83q2o46J66J79oK88j5
1726B34l47K28l55M65Q8j07k32Q2k5n07O14k09q0K40m86K69J48n0K59j87p5m49
1748d82O46j64L58l47J2l27J90J93rk7j2j18j76M57j38K35n64K27L92k92M4k1
$$ plain form
1588 8 -155 -433 -84 401 446 367 139 -487 -77 154 258 330 -101 -691 -257 52 408 414 174 -560 -18 304
1610 304 244 317 257 -337 -368 -199 16 37 430 202 -229 -207 -165 194 126 110 -243 -405 111 267 407 14 -427
1633 -427 -182 2 404 222 51 62 -167 -237 147 164 453 8 -183 -265 -182 306 188 250 -111 -635 -83 400
1655 400 442 114 -325 -420 -185 372 289 158 -132 -179 29 281 197 224 -61 -111 -15 -21 -79 56 56 22 -331 -322 -370 196
1681 196 404 72 -529 -322 242 305 623 -74 -154 -484 -12 -3 71 151 -349 27 -53 82 75 224 379 -99 -86
1704 -86 -467 -237 -195 413 22 -317 -227 158 416 37 -267 -503 -209 167 350 268 -378 -212 -33 -39 249 234
1726 234 -113 115 -240 225 313 206 -26 56 31 -476 138 -71 -151 89 -397 -128 20 -30 229 42 -33 -482
1748 -482 164 0 358 11 23 -304 -114 79 70 43 31 -87 -263 194 56 291 -273 -46 346 54 98 77
1770G7j78j81J39K05M25l94k26J58m05J22L51M0l40L58M4k57J25K57j34O9k57
1791bj48N4J14P9j11Lr1R4q2K16J38q8n69N87q7J72l46J50J43l82Q1J21j37j43
1815b34J44O4J77o3k02L6J81j15k27L71j22k25M48j77R3j34j42j1K4J31J6pk7
1838al6J96Q3O2l21j10o0K85r3J80j70q7J44L3Q4m40P0J89o6K6n0L44j18k12k79
1863c47K94p5K94j5j66J71n75L86M65j01k01j20n5kK29o9J6k84j27J67L46k29
1885Bk7o3J11L5m78O50k49J91k00J06m90N95R2m54j10K96j84N39l09K68n47j73
1907c99K05L39j43j03Q5p1R9L87l37k26O6k30K02J79P3r5L03k8n56j3M46J20r8
1930B05l42Q9j61L84R5r4l06m58N56R7n9r0Kj7K18l03M29o0k16J56j75k34J56
$$ plain form
1770 77 -101 -282 -143 62 487 93 -133 25 -380 -258 93 133 -207 151 195 -62 63 320 186 255 -2
1791 -2 -150 -96 18 97 -14 -11 -102 -8 -90 126 264 176 -393 194 107 279 -67 83 226 -156 -75 46 -91 -234
1815 -234 -90 -26 151 88 -114 -78 103 -12 -239 132 10 -215 233 56 149 15 -127 -138 -114 17 33 26 -1
1838 -1 -37 159 242 304 -17 -127 -187 98 5 185 15 -72 72 105 189 -251 -181 8 -58 -32 -82 262 144 -68 -347
1863 -347 -53 -128 166 151 -15 156 -419 -33 432 331 130 10 -45 -47 182 113 129 -155 -282 -115 231 2
1885 2 -25 -88 23 58 -420 230 -19 172 -28 78 -412 183 275 -179 -289 7 -177 362 53 321 -226 -399
1907 -399 -194 145 2 -101 -16 -87 12 399 62 -164 -98 -328 -126 53 126 31 334 306 -250 -263 183 303 205
1930 205 -137 -48 -209 175 270 176 -130 -588 -32 65 6 -84 -82 -99 119 -184 245 185 -31 125 -50 -284 -128
1953a28M48p3o0l65j68K35M29j89o4l61q6M55J87j34j37J13j86L29l31K03j9K51
1975C49n94J80j45M4L86j77l3k35J12L9K47O9o66K95N4J31R9J80m28l24K77L0
1997a10K21l8O9k67j03K28J91j47J00j23k43j02L83J7O4j72k29O3K53J71J33k72
2019H7j36j56K56j17K59j39M1j95K00J34R0J23n81J41R5j88M19q2m53J71m31K10
2041b52K70L26m1m25O1om8K68l24J89k01N21l1l59Kr0J79o8k84K94J2K62O6m88
2065a67R3j42K90L00k76l12lJ29L25j4k58P9k85M28k48N4N4j69N0J76j72K8K32
2088A92j73rk98K78K1Rj17K17jJ86l90L20l73L32j95j93K14k44o7L31j17J65j11
2111b3M4J33k61L02k22l8K03k85N1k7j66R7M51l71J0K15R9j31J27n54N72l59K8
$$ plain form
1953 -128 320 247 187 -178 -346 -111 318 129 65 -296 -382 73 260 126 -11 102 -84 245 -86 117 98 349
1975 349 -245 -65 -210 -166 220 43 10 -225 -113 -74 173 242 -424 -129 -75 56 155 335 -93 -417 -140 -110
1997 -110 111 73 142 -125 -228 0 191 44 144 21 -222 -324 59 76 140 -32 -261 -198 55 226 359 87
2019 87 -49 -205 51 -66 193 54 95 -100 100 234 324 447 -134 7 102 -86 333 251 -202 -31 -462 -252
2041 -252 18 344 303 -122 -61 -67 -115 153 -171 18 -183 338 307 -52 -50 -140 39 -29 -313 -19 -7 255 321 -167
2065 -167 -74 -216 74 374 98 -214 -217 -88 237 223 -35 44 -241 187 -61 -7 47 -122 -72 104 -68 -40 192
2088 192 19 10 -288 -10 11 20 -97 120 119 305 -85 235 -138 194 -1 -194 20 -224 -291 40 -77 88 -23
2111 -23 21 154 -107 195 -27 -65 138 -147 -96 -123 -289 -192 259 -112 -102 113 212 81 208 -346 226 -133 -105
2134a05k2k70M77K87j74l51K72k04l8L55J37j71j20JJ9mj7pk08K72j12l8J58k1
2158A16M7j58k0M76n74L27J6k70N0L37m49j79kM60j64j66J45Q3k28M22j32J55
2180B92j95m07L99k75K15j76M05k20j06ML63k67j70K59L24o61Q8L84j47r7L4J53
2202A99l82K85j19K1J08j77r8j00J39K0K75J8j01n2k59K16j70J17K05k30O4L7
2224A6J44Ql34q8J05J77k4mm51L69L89k72j2P3k97O1O6J11L9l5j40j39JL27j37
2249d7N72n70k25L13k52L68j74K01k54K2k30L73K7Nj2P1l28K09j57K53l21o0J78
2272c8K13Ol80M11k80M4n1J77l6n8m4l10K76L92m37L69r2k80K78r8K10n13J15
2295a26K55p9j88L81k4j46J37k7j65J11p4J5j01M01m04j43O4N16k48j06K1j46
$$ plain form
2134 -105 -127 -397 80 367 193 -158 114 -90 -128 227 364 193 73 74 93 89 72 65 -143 129 17 -21 137 116
2158 116 163 5 -15 461 -113 214 230 -40 10 347 -102 -281 -283 177 13 -153 -8 75 -153 269 137 292
2180 292 97 -310 89 -186 29 -147 258 38 -68 -64 299 32 -138 121 445 -216 -128 256 109 12 46 199
2202 199 -183 102 -17 4 112 -65 -163 -263 -124 -104 171 189 88 36 -223 -7 -177 -60 145 -85 -21 16
2224 16 160 168 -166 -254 -149 28 4 0 -451 -82 307 35 23 96 -201 -140 -74 37 76 41 -99 -238 -237 90 -47
2249 -47 525 -45 -270 43 -209 159 -15 186 -68 -46 -276 97 124 129 117 188 -140 69 -88 165 -156 -216 -38
2272 -38 175 181 -199 212 -68 -24 -75 102 66 8 -36 -346 -70 322 -115 254 162 -118 160 62 272 -241 -126
2295 -126 129 50 -138 243 219 73 210 183 18 129 55 70 -31 370 -34 -177 -113 403 155 49 70 -76
2317g6M13l16k60J04J18j0M68p91K96j05j12K73K84l38J34j45JJ91j9j62K70m2
2339A76j32k51m2N74l31J1k21L67O2m46L46k5J8j23o5K12j18P0r9J1J3J14L8l40
2363a81k0O1Q0J32Q7J73l00l5j74L91o5k57K82l24j4K63r7K24J48j67l69q1M35
2386A92k53J65j18j39J33K52l07o9K42j29R7r4J62m4j73M0N3J84j44J99k43j24
2408a18J55N5j01J5M58n29j79L8L50n8P7o1k84Pp8K14N2L3j63J46j58K57J08R2
2432C28l20K48m87Q5L21l35N11k74n37J29M59K31l33k05M8n5J94J36k5k45j94
2453c20O4L03K87k17O5q0m55K91J86J96J48n02m1J11J94k15L21m12j59J23j77
2474b89L33J74k93J88l71L14O9Q3j20j59L2pK14J81k29Q6k07k26J99j85N56n13
$$ plain form
2317 -76 337 21 -239 -135 -17 -27 441 -350 -54 -159 -271 2 286 -52 82 -63 -62 129 110 -52 218 176
2339 176 44 -207 -249 325 -6 5 -216 151 213 -233 113 88 106 -17 -82 130 12 82 -17 -6 7 121 159 -181
2363 -181 -201 -140 -60 72 159 332 32 -3 -177 214 149 -108 174 -150 -164 99 2 226 374 207 -162 -243 192
2386 192 -61 104 -14 -153 -20 232 -75 -144 98 -31 66 -28 134 90 -83 -43 10 194 50 249 6 -118
2408 -118 37 92 -9 6 464 -65 -244 -206 144 86 163 102 -182 -175 -253 -39 13 46 -117 29 -129 128 236 328
2432 328 8 256 -231 -146 175 -160 351 77 -460 -331 128 359 26 -179 -131 -186 8 144 119 -126 -320
2453 -320 -256 47 334 117 182 102 -353 -62 124 320 468 -34 -75 36 230 15 336 -76 -235 -112 -289
2474 -289 44 218 -75 113 -258 56 125 208 88 -71 -39 -46 168 349 120 206 -1 -227 -28 -213 343 -170
2496a70j73K95l27M71J01j83k53K48R3K8K06k62l03J24J79L10k12J66j73l02j8
2517a55Q3K69k85J56m08M46l76L47jj49Q3q1K62j04j40O9j30j12l36L65O18l88
2539C3j0rl23L20K88j28m7m13J85J67m2K08j20j28j70o0L85J30l60k8J21k54L55
2562A00k41M36l21o6K18j49K35k94K1k13K9J80M72l46O3P4k72j76L32M0R1j69
2584D4k78J80p3L70j06k20K52j51j03K87j25NN1k48j02L05j9J29j41k65K4K92
2606A08m03L67l5j96P8o9J84J30j0m25L16j23J0NJ37m87K25j37P80l02J42j60
2628A35m06L22Q0j8J05j74p5N8k75M18l67J85k82J15L86j04J11K0k18ql51L93
2650E0J77r4J18m27M1J57L49m12k04J40K8j33N36o4j93j43k0q0k3K33J14J2n50
$$ plain form
2496 -170 -343 -48 -375 96 197 14 -239 9 102 130 336 74 -229 -105 74 384 172 338 165 -137 -155
2517 -155 -72 197 -88 68 -340 106 -270 77 76 -73 10 -71 191 87 -53 16 -114 -226 -562 -197 421 33
2539 33 23 14 -309 11 299 171 124 -289 -104 63 21 229 109 -19 -189 -249 136 266 -94 -122 -1 -255 100
2562 100 -141 295 -26 -92 126 -23 212 -82 -61 -274 -245 -65 407 61 124 198 -74 -250 82 122 213 44
2584 44 -234 -54 -127 243 137 -83 169 18 -85 202 77 82 133 -115 -217 88 69 198 57 -208 -184 108
2606 108 -295 72 37 -159 -81 -150 34 164 154 -271 45 -78 -68 -63 74 -413 -188 -325 455 153 295 135
2628 135 -271 51 131 113 218 44 -31 27 -248 170 -197 -12 -294 -179 207 103 214 234 16 8 -343 50
2650 50 227 133 251 -176 -135 22 371 -41 -245 -105 -77 -210 326 262 69 -74 -94 -174 -197 36 150 162 -388
2673c88J90O02ml5l18Pj74J27m6l3j20J94rk65J92J59N4k37K13j50m2L21j64r2
2697a8k29j58N0O36r7l66J07j28J7J02P9K0k93k2m2M31Q5m1j28j6k71J71J92j05
2721b4K32m95L49J53J55l03k76o7J85j35L81j24Ml07J5J22L76N3j98J39k43k6
2743c4k66M63Q6k92j1Kl9K65k42J38k51k95K83K4J93J37l9j00m03M17L9K15l75
2766h5j67l3L88j0j78M04k50R4k84L64j80L6j13j44J16K1L22j01l59J22J1j7K22
2789A79k22k2J91l67K96n6j35J82O3l31M4J30L12l43p8K35l01L3N80l38j17j23
2811a88j81K70J85j04J7j77k57K65K60j40Q7k63K26J33j40M6j83J79k12k03Q9
2832b91N11q1l51KK36j71L12k52K73k79J22M7R2p8l10j10J4r8K26KL15J41j62
$$ plain form
2673 -388 -198 404 400 365 47 54 -120 7 -39 -72 -192 2 -7 -272 -80 79 133 -104 109 -41 -83 238 74 -18
2697 -18 -247 -405 -355 281 184 -182 -75 -203 -186 -84 -5 15 -278 -300 -342 89 174 133 5 -11 -282 -111 81 -24
2721 -24 208 -287 62 215 370 67 -209 -276 -91 -226 155 31 35 -272 -257 -135 241 294 96 235 -8 -34
2743 -34 -300 163 249 -43 -54 -52 -91 174 -68 70 -181 -476 -193 -169 24 161 122 22 -381 36 75 290 -85
2766 -85 -252 -285 103 93 -85 319 69 163 -121 243 63 99 -14 -158 -42 -21 301 200 -159 -37 -26 -43 179
2789 179 -43 -65 126 -241 55 -1 -136 46 109 -222 -178 -48 264 -79 -157 78 -223 -190 390 52 -65 -188
2811 -188 -369 -99 86 -18 -1 -178 -435 -170 90 -50 37 -226 0 133 -7 39 -144 35 -177 -380 -291
2832 -291 220 139 -212 -210 26 -145 167 -85 188 -91 31 78 170 92 -218 -328 -314 -412 -186 -184 131 272 110
2855A10j52J04k6J43o9k93K15k80M51k47J19j17j13J52L3j56n5J92L9k6J9O8n3
2878E8l35J10k30M92k34J95J32k55o1N0jJ46q1j12J67J74j06j37N2k05K20k12
2900a73N49l90k26O9J86J89j8p6j1k01J59j45J78j13K12l09k78L57Q5r6j13L98
2922B33P6m27R8m9j36K44J23k58PQ3K55j87J08r9k06m0K74j47J93q8j64J2k88
2945c83P24o30P0J52j22K69j23%L3L20k84j71M01k27J32J76o47L9L85P2J49k09
2967A26j67p4M20k58K58k76P4j53J35K38l87L25m16J71k36K42r2J20l68K25K9
2988f4J10P6l05K82k56J30J2KJ16l24k7J30M5J96l7p8j44J06j15R4J51j36J89
3011A53m53L07k0M7l7n8j14K45n2k99L83k38K47l27N99m74L2j7L07l99J62K67
$$ plain form
2855 110 -42 62 36 179 110 -183 32 -248 203 -44 75 -42 -155 -3 30 -126 -181 11 50 24 43 111 58
2878 58 -277 -167 -397 95 -139 56 188 -67 -128 -78 -79 67 -14 -126 41 215 109 -28 24 -181 39 -173
2900 -173 376 -14 -240 -171 15 204 186 110 99 -102 57 -88 90 -23 189 -120 -398 -41 44 -52 -165 233
2922 233 309 -118 -20 -69 -205 39 162 -96 -89 -6 249 62 170 71 -135 -175 99 -48 145 57 -107 -95 -383
2945 -383 341 -289 -219 -67 -189 80 -43 -43 -10 310 26 -145 256 29 161 337 -310 -271 114 186 335 126
2967 126 -41 -115 305 47 305 29 103 -50 85 323 -64 261 -155 16 -220 22 -70 50 -318 -93 -64
2988 -64 46 122 -183 99 -157 -27 -15 -13 103 -221 -248 -118 -73 123 86 8 -136 -30 -145 -51 100 -36 153
3011 153 -300 7 -13 34 -3 -61 -175 70 18 -281 102 -136 111 -216 383 -91 -59 -76 231 -168 -6 261
3033B61Jl82J4J50j01J10j3J08j98L17k51J09l06J98k38L26l83P9L64R3l55J72
3055G5n6j30P6j8j19K61J07k97Q5J97j48m6N2l0j02K42k24L5Q4m3J33k18J07J90
3079B13k73R7J48k09j20L46m06K98j79J30j08n1J80o5j4J90l1k14k7j1Qn8L72
3102B16k2j09l79l1K57L01R9n05J03Jm5Q6K77o27L42j25K73k3M3K73k53l68O1
3125a55J66K04l17J76L1j42J60J31k23j61K54j48Q2J26nJ33k22lQj34J05q9J75
3148A52j77j66J92K58j82Q3j93j85L46K37l76R2l5n7J6qJ9J10j30N0k36J46K77
3171B33k39j25L65l80p0L28K68k48k20L19n05J85j05NL31l73J82l3J39k04O7K49
3193A69j3k57L32J6l14mr0K70l4M6p5j02l9K98k12J6J20Q0l59K18M3K62l90k39
$$ plain form
3033 261 262 -120 -106 44 -57 53 40 148 -50 267 16 125 -181 17 -221 105 -278 -199 165 258 -97 75
3055 75 19 -111 -35 -53 -172 89 196 -101 -16 181 33 -13 39 9 -93 149 -75 -40 44 1 134 -84 23 213
3079 213 -60 37 185 -24 -144 202 -204 94 -85 45 -63 -114 66 1 -13 177 146 -68 -95 -106 -98 -156 216
3102 216 194 85 -294 -325 -68 233 332 -173 -70 -69 -114 -28 249 -378 -36 -161 112 89 132 405 152 -216 -155
3125 -155 11 215 -102 74 105 -37 123 254 31 -130 124 -24 58 184 179 312 90 87 95 -39 66 -23 152
3148 152 -25 -191 1 259 77 160 -33 -218 128 365 -11 81 46 -11 5 -3 16 126 -4 46 -190 -44 233
3171 233 -6 -131 234 -146 -216 112 380 132 -88 231 -274 -89 -194 -189 142 -231 -49 -82 57 -147 -80 169
3193 169 156 -101 231 247 -67 -71 -161 109 75 121 46 -56 -95 203 -9 7 127 207 -152 66 109 371 -19 -258
3217b58K93J7J7k01K39n4k90J23N2n0L3J3L5J48q6r8o1L66p4j95J9K91j52j20
3241Gk65N35k06j72L51j22p6J7k71K50K6j73P2J96k54L87m54J12r0K29o8k67K61
3264B5J23j42O8J87o86L75M6j37L30r7N4r3M3n2l07K87l35J19L72J6k46pK9q7
3288a15J7K51j62J22m06P13l68N3j30J36k29J04j11K35m15K26M98o33R1J34L5
3309D6k07q4L88m03J91o0l7K58j78jn8K97j48k08J52j46J05j21J98k05J02rO7
3332f1j03J54r1P3J6L9K43l10K25j79L20n03R5R9n3L1r5J89M6k83K32l48M82k73
3356e5l04M87m1j23k13J27R0J00jK11k26l20K71K70l78N9J63q2K28m47M6J42o9
3379f5O0l3O2l3j58L19k6k29J15J8k00N1L54j83l31M42l77L03k7m4J49j35o0M
$$ plain form
3217 -258 35 52 69 -132 107 53 -237 -114 -62 -112 -79 -66 -31 117 31 -67 -128 238 164 -31 -12 279 127 7
3241 7 -258 277 71 -101 250 128 52 69 -202 48 74 -99 -27 169 -85 302 -152 -40 -130 99 31 -236 25
3264 25 148 6 74 261 -425 -50 -4 -141 189 92 146 53 96 44 -263 24 -311 -192 180 196 -50 -57 -28 -115
3288 -115 -98 153 -9 113 -293 420 52 105 -25 111 -118 -14 -125 110 -305 -79 419 -214 -123 11 46
3309 46 -161 -245 143 -260 -69 -129 -166 92 -86 -87 -145 152 4 -204 -52 -198 -93 -214 -16 -221 -119 -128 -61
3332 -61 -164 -10 -101 -28 -12 27 270 -40 185 6 326 -177 -82 17 -36 -5 -100 89 135 -148 84 -264 218 -55
3356 -55 -359 128 87 -36 -249 -122 -32 68 67 278 52 -268 3 273 -105 -46 117 35 263 -184 -138 4 -65
3379 -65 -5 -38 24 -9 -167 152 126 -103 12 30 -170 -119 235 52 -279 163 -214 89 62 18 167 32 -28 -24
3403b4rJ19l64L11j29J26r7m4m3J86L9J30j38k23J26K0k73J62P4n0L84k62N1J09
3427A81k34J40l11J01K17o0k8K8K06k70n0O8J98k87K50k89N6N02k58P3O5j14J20
3450C04j01m9j94J7J5j86K67j6n50M41p7P1R3j73j41J08L96m6K4Q7m93L45J41
3473B83j62j2l48Q2L29J55n39M65l63o8J06J38J61k83Q5kJ01o2j84J50m8K40J63
3496C87l39o4K15l89J19P7r5J95k85J51j8k1J64l29K20p2L01l59J39M4l00K87
3518B8O4k30j35L8L00m7j71K07j83J93j81K18k6J20J26k51j98QK49l25J27m8j30
3541b47O13k39k11L1o7Q2R2m8k52j32J65J74K11j36j64L33p2l81J58o2J68L6M6
3564I8j18L80n1o62K96m1k6K98j22L04m32k25L05m5J72K06q8j88j67N2K91l46
$$ plain form
3403 -24 -33 86 -278 33 -96 30 -67 -111 -154 32 71 201 63 -160 -34 -14 -287 -125 -51 -101 283 21 72 181
3427 181 -53 87 -224 -123 94 34 6 34 240 -30 -80 -12 186 -101 149 -140 -84 418 160 233 298 184 304
3450 304 203 154 -40 -23 -8 -194 73 57 -493 -52 -129 -58 35 -138 -279 -171 225 179 203 290 -203 142 283
3473 283 121 109 -239 -157 172 327 -212 253 -110 -178 -72 66 227 -56 29 27 128 66 -118 32 -16 224 387
3496 387 48 -16 199 -190 -71 6 -89 106 -179 -28 -46 -67 97 -232 -12 -84 217 -142 -3 41 -259 28
3518 28 92 -138 -273 -235 65 18 -153 54 -129 64 -117 101 75 195 321 70 -128 -120 129 -196 -69 -117 -247
3541 -247 366 127 -84 -53 -120 -38 54 6 -246 -378 -213 -39 172 36 -128 205 133 -248 -90 -152 16 52 98
3564 98 -20 360 309 -353 -57 -98 -124 174 52 356 -76 -301 4 -41 131 337 249 61 -106 -54 237 -109
3586a09K25j27j32J30R7Q5n8J4l07K18J00k38O5K4J39M2j87J43k78j1J45q1l6
3609a37K95l82L60k40K04K06j71l99L54k27j99K82J72m19M19L9M1l60M8J35qj94
3631a81J75K88k21q4K32m7k63J27m9J50j72k55J18%J03p3K09j74K42j1l98P8J0
3654a96K02K64j94L8p3j5j20J58M8K3r9k09J28J4m6J91k05n6J07J25k47P4J67
3677G9j18j25J33K0j31j7J66j34L01R0j24j70L03m89K31K27q2J06l16J99k11J44
3699H2k08J13O1k41Q1LL23k70Q7KlK33k35l14k41K82K32L39n88L35l7P4r5j05
3723i0K58j40J9j00J71L9k31K66l91R0P5L39j16k67j9Q6m0J89k43J80j18j33J66
3746a0k82N5L60J27l97K36j08p8K28l31R1k38L91n9J05j49qN57o75L71k38P7j68
$$ plain form
3586 -109 116 -11 -143 -13 84 169 111 125 -182 36 136 -102 -37 -13 126 168 -19 124 -154 -165 -20 -101 -137
3609 -137 158 -224 136 -104 100 306 135 -264 90 -137 -336 -54 118 -301 118 157 198 -162 -114 21 13 -181
3631 -181 -6 282 61 -23 209 162 -101 26 -23 127 -45 -300 -182 -182 -79 -152 57 -117 125 114 -284 -206 -196
3654 -196 6 270 76 114 41 26 -94 64 112 135 36 -173 -45 -31 -77 114 -91 -147 -40 85 -162 -88 79
3677 79 -39 -164 -31 -11 -142 -159 7 -127 174 264 140 -30 273 -216 15 242 160 266 -50 149 -62 82
3699 82 -126 -13 48 -193 -112 -109 214 -56 31 33 30 263 28 -286 -527 -245 -13 326 -262 73 36 110 15 -90
3723 -90 168 28 47 -53 118 157 -74 192 -199 -109 -34 305 189 -78 -97 -11 -51 138 -105 75 -43 -176 -10
3746 -10 -292 -237 123 250 -147 89 -19 -97 131 -200 -109 -347 44 -15 90 -59 -67 490 -185 186 -52 25 -143
3769a43J98j49N3K3k19L61l27K82J0K00k50r3M2mr7m9k4Q2j88K78K70m75K44j28
3793a03O7K5p4J78N3j92K2K18j66k10K85J84l10K28k99J34j82K29oJ53k01j91
3815a58K01J49j69j30J88j15K33j67J08l28K63q4k39M00k00M5J03K06k20K3j79
3836g0r2L11k94n5l6L82m48K53K17j70o8p3L55l85J45Pj16K54o7J47j61k95j8
$$ plain form
3769 -143 55 -94 -41 -18 -237 124 -203 79 89 289 39 -54 -12 -16 -113 -162 -186 -104 -292 -14 256 -219 25 -103
3793 -103 -36 -11 -85 93 146 -46 -24 194 28 -182 103 287 -23 205 -94 40 -142 87 81 234 33 -158
3815 -158 43 192 23 -107 81 -34 199 32 140 -188 75 -9 -248 152 -48 -3 100 306 86 109 -70
3836 -70 -162 149 -145 -200 -236 146 -302 -49 168 -2 -70 -143 212 -173 -28 -21 -137 117 50 197 36 -259 -277
$$ [...]
8191A16
##END NTUPLES=NMR FID
##END=
