##TITLE=1H_PR90R_k'
 D2O, 8 sc, 
 4.6.2019
##JCAMPDX= 6.0         $$ Bruker NMR JCAMP-DX V2.0
##DATA TYPE= NMR FID
##DATA CLASS= NTUPLES
##ORIGIN= UXNMR, Bruker Analytische Messtechnik GmbH
##OWNER= root
$$ XWIN-NMR		Version 3.5
$$ Tue Jun  4 14:12:24 2019 Russian Standard Time (UT+4h)  she@DPX200
##.OBSERVE FREQUENCY= 200.13155
##.OBSERVE NUCLEUS= ^1H
##.DELAY= (6, 6)
##.ACQUISITION MODE= SIMULTANEOUS
##.ACQUISITION SCHEME= undefined
##.AVERAGES= 8
##.DIGITISER RES= 18
##SPECTROMETER/DATA SYSTEM= spect
##.PULSE SEQUENCE= zg30
##.SOLVENT NAME= CDCl3
##.SHIFT REFERENCE= (INTERNAL, CDCl3, 0, 15.7039)
##AUDIT TRAIL= $$ (NUMBER, WHEN, WHO, WHERE, WHAT)
$$ ##TITLE= Audit trail, XWIN-NMR		Version 3.5
$$ ##JCAMPDX= 5.01
$$ ##ORIGIN= Bruker BioSpin GmbH
$$ ##OWNER= she
$$ F:/spectra/data/she/nmr/H-F/1/audita.txt
$$ ##AUDIT TRAIL=  $$ (NUMBER, WHEN, WHO, WHERE, WHAT)
(   1,<2019-06-04 14:10:44.57 +0400>,<she>,<DPX200>,
      <created by zg, POWCHK disabled, PULCHK disabled
       configuration hash MD5:
       00 E9 B6 7A A2 85 ED C7 34 08 36 98 17 FE 4E 26
       data hash MD5: 16K
       C5 F6 25 90 41 85 33 62 F8 CE 99 58 7B 73 04 3E>)
$$ ##END=
$$ 
$$ hash MD5
$$ 7C 5E 43 D3 71 E8 19 54 64 70 3F 35 EB 30 20 06
##$RELAX= 
##$RELAX= 
##$RELAX= 
##$RELAX= 
##$RELAX= 
##$RELAX= 
$$ Bruker specific parameters
$$ --------------------------
##$DU= <F:/spectra>
##$EXPNO= 1
##$NAME= <H-F>
##$PROCNO= 1
##$TYPE= <nmr>
##$USER= <she>
##$AMP= (0..31)
100 100 100 100 100 100 100 100 100 100 100 100 100 100 100 100 100 100 
100 100 100 100 100 100 100 100 100 100 100 100 100 100 
##$AQSEQ= 0
##$AQ_mod= 1
##$AUNM= <au_zg>
##$AUTOPOS= <>
##$BF1= 200.13
##$BF2= 200.13
##$BF3= 200.13
##$BF4= 200.13
##$BF5= 200.13
##$BF6= 200.13
##$BF7= 200.13
##$BF8= 200.13
##$BYTORDA= 1
##$CFDGTYP= 0
##$CFRGTYP= 5
##$CHEMSTR= <none>
##$CNST= (0..31)
1 1 145 1 1 1 1 1 1 1 1 1 1 1 1 1 1 1 1 1 1 1 1 1 1 1 1 1 1 1 1 1 
##$CPDPRG= <>
##$CPDPRG1= <>
##$CPDPRG2= <>
##$CPDPRG3= <>
##$CPDPRG4= <mlev>
##$CPDPRG5= <mlev>
##$CPDPRG6= <mlev>
##$CPDPRG7= <mlev>
##$CPDPRG8= <mlev>
##$CPDPRGB= <>
##$CPDPRGT= <>
##$D= (0..31)
0 1.2 0 0 0 0 0 0 0 0 0 0.03 0 0 0 0 0 0 0 0 0 0 0 0 0 0 0 0 0 0 0 0 
##$DATE= 1559643043
##$DBL= (0..7)
120 120 120 120 120 120 120 120 
##$DBP= (0..7)
150 150 150 150 150 150 150 150 
##$DBP07= 0
##$DBPNAM0= <>
##$DBPNAM1= <>
##$DBPNAM2= <>
##$DBPNAM3= <>
##$DBPNAM4= <>
##$DBPNAM5= <>
##$DBPNAM6= <>
##$DBPNAM7= <>
##$DBPOAL= (0..7)
0.5 0.5 0.5 0.5 0.5 0.5 0.5 0.5 
##$DBPOFFS= (0..7)
0 0 0 0 0 0 0 0 
##$DE= 6
##$DECBNUC= <off>
##$DECIM= 24
##$DECNUC= <off>
##$DECSTAT= 4
##$DIGMOD= 1
##$DIGTYP= 9
##$DL= (0..7)
0 120 120 120 120 120 120 120 
##$DP= (0..7)
150 150 150 150 150 150 150 150 
##$DP07= 0
##$DPNAME0= <>
##$DPNAME1= <>
##$DPNAME2= <>
##$DPNAME3= <>
##$DPNAME4= <>
##$DPNAME5= <>
##$DPNAME6= <>
##$DPNAME7= <>
##$DPOAL= (0..7)
0.5 0.5 0.5 0.5 0.5 0.5 0.5 0.5 
##$DPOFFS= (0..7)
0 0 0 0 0 0 0 0 
##$DQDMODE= 0
##$DR= 18
##$DS= 0
##$DSLIST= <SSSSSSSSSSSSSSS>
##$DSPFIRM= 0
$$ [...]
##$SUBNAM2= <"">
##$SUBNAM3= <"">
##$SUBNAM4= <"">
##$SUBNAM5= <"">
##$SUBNAM6= <"">
##$SUBNAM7= <"">
##$SUBNAM8= <"">
##$SUBNAM9= <"">
##$SW= 24.9336996594482
##$SWIBOX= (0..15)
0 0 2 0 0 0 0 0 0 0 0 0 0 0 0 0 
##$SW_h= 4990.01996007984
##$TD= 16384
##$TD0= 1
##$TE= 0
##$TE2= 300
##$TE3= 300
##$TEG= 300
##$TL= (0..7)
0 120 120 120 120 120 120 120 
##$TP= (0..7)
150 150 150 150 150 150 150 150 
##$TP07= 0
##$TPNAME0= <>
##$TPNAME1= <>
##$TPNAME2= <>
##$TPNAME3= <>
##$TPNAME4= <>
##$TPNAME5= <>
##$TPNAME6= <>
##$TPNAME7= <>
##$TPOAL= (0..7)
0.5 0.5 0.5 0.5 0.5 0.5 0.5 0.5 
##$TPOFFS= (0..7)
0 0 0 0 0 0 0 0 
##$TUNHIN= 0
##$TUNHOUT= 0
##$TUNXOUT= 0
##$USERA1= <user>
##$USERA2= <user>
##$USERA3= <user>
##$USERA4= <user>
##$USERA5= <user>
##$V9= 5
##$VALIST= <valist>
##$VCLIST= <CCCCCCCCCCCCCCC>
##$VD= 0
##$VDLIST= <DDDDDDDDDDDDDDD>
##$VPLIST= <PPPPPPPPPPPPPPP>
##$VTLIST= <TTTTTTTTTTTTTTT>
##$WBST= 1024
##$WBSW= 4
##$XGAIN= (0..3)
0 0 0 0 
##$XL= 0
##$YL= 0
##$YMAX_a= 364552
##$YMIN_a= -294948
##$ZGOPTNS= <>
##$ZL1= 120
##$ZL2= 120
##$ZL3= 120
##$ZL4= 120
##$ABSF1= 10
##$ABSF2= 0
##$ABSG= 5
##$ABSL= 3
##$ALPHA= 0
##$AQORDER= 0
##$ASSFAC= 0
##$ASSFACI= 0
##$ASSFACX= 0
##$ASSWID= 0
##$AUNMP= <proc_1d>
##$AZFE= 0.1
##$AZFW= 0.1
##$BCFW= 1
##$BC_mod= 2
##$BYTORDP= 1
##$COROFFS= 0
##$CY= 11.3945322036743
##$DATMOD= 1
##$DC= 2
##$DFILT= <>
##$DTYPP= 0
##$F1P= 18.9103706918063
##$F2P= -1.10871071338519
##$FCOR= 0.5
##$FTSIZE= 0
##$FT_mod= 4
##$GAMMA= 1
##$GB= 0.15
##$INTBC= 1
##$INTSCL= 1
##$ISEN= 128
##$LB= 0.24
##$LEV0= 0
##$LPBIN= 0
##$MAXI= 10000
##$MC2= 0
##$MEAN= 0
##$ME_mod= 0
##$MI= 1.114404
##$NCOEF= 0
##$NC_proc= 0
##$NLEV= 6
##$NOISF1= 3.799351
##$NOISF2= 2.8
##$NSP= 1
##$NTH_PI= 0
##$NZP= 0
##$OFFSET= 15.70392
##$PC= 1
##$PHC0= -8653.828
##$PHC1= 3.20018
##$PH_mod= 1
##$PKNL= yes
##$PPARMOD= 0
##$PSCAL= 0
##$PSIGN= 0
##$REVERSE= no
##$SF= 200.130013532006
##$SI= 16384
##$SIGF1= 3
##$SIGF2= 2
##$SINO= 400
##$SIOLD= 16384
##$SREGLST= <1H.CDCl3>
##$SSB= 0
##$STSI= 0
##$STSR= 0
##$SW_p= 3612.71676300578
##$SYMM= 0
##$S_DEV= 0
##$TDeff= 0
##$TDoff= 0
##$TI= <>
##$TILT= no
##$TM1= 0
##$TM2= 0
##$TOPLEV= 0
##$USERP1= <user>
##$USERP2= <user>
##$USERP3= <user>
##$USERP4= <user>
##$USERP5= <user>
##$WDW= 1
##$XDIM= 8192
##$YMAX_p= 0
##$YMIN_p= 0
$$ End of Bruker specific parameters
$$ ---------------------------------
##NTUPLES= NMR FID
##VAR_NAME=  TIME,          FID/REAL,        FID/IMAG
##SYMBOL=    X,             R,               I
##VAR_TYPE=  INDEPENDENT,   DEPENDENT,       DEPENDENT
##VAR_FORM=  AFFN,          ASDF,            ASDF
##VAR_DIM=   8192,          8192,            8192
##UNITS=     SECONDS,       ARBITRARY UNITS, ARBITRARY UNITS
##FACTOR=    0.0002004,     1,               1
##FIRST=     0,             0,               0
##LAST=      1.6414764,     0,               0
##MIN=       0,             -294948,         0
##MAX=       1.6414764,     364552,          0
$$ Real data points
##PAGE= N=1
##DATA TABLE= (X++(R..R)), XYDATA
0@%%%%qQqJ6j7K5l2M0n6O5p9J02j20J42j67J95k30K69l14L63m17M81n49O22p08
29c77P99r01J017j140J275j424J591j772J965k184K426k684K972l294L646m037
45b122M474m969N528o164O905p771Q800j0051J1607j3608J6290k0094K5961l6280
59b1494N9719k05163o077M18583m0666j82976l9223J36722r7880k48583o1862
70b88900K72436K40404m569j45190p7776o3778p9069j4069J22368J24344M5642
81A31843P665q408j39614k19819m3623K38015K27251l7355j43290K6032P7070
92A15767j49922k60793L5044L49924K22171j45439k19457M69P0843j03022j39601
103b24016J06400K77996J13721j45325j83126o3000m830o49O4936J33516Q3446
$$ y = [0, 0, 0, 0, 0, -8, 0, -8, 8, -9, 16, -16, 24, -32, 33, -46, 56, -64, 78, -89, 106, -124, 145, -169, 194, -223, 258, -291, 331, -377, 422, -479, 538, -602, 673, -751, 840, -932, 1033, -1151, 1275, -1409, 1563, -1731, 1915, -2122, 2352, -2617, 2911, -3253, 3652, -4119, 4681, -5370, 6237, -7371, 8919, -11175, 14786, -21494, 38225, -166938, -173015, 245568, 204902, 21926, -17297, 119425, 21545, -227038, -288900, -16464, 223940, 219371, 74181, -3595, -67373, -146442, -160511, -38143, 86201, 131843, 139508, 131100, -8514, -228333, -271956, -33941, 193310, 155955, 12665, 38697, 115767, -34155, -294948, -259904, 90020, 312191, 166752, -52705, -52236, 18607, -84415, -224016, -117616, 160380, 274101, 128776, -54350, -117350, -122180, -122829, -57893, 75623, 159069]
114A59069k6965p3640q3646j17526p7733J03176K34355J11873j14455j40642r79
125b7113J2643j16744q6104J65275K77481M5193k22244j79899K6497N9145m7221
136i3091j2137J59075J74335l6835k03574j43199L735O1260O2810Q8776Q6682
147A47837j835r6834j07462o6420k4925M8969J47536J44996r814j52130j20883
158i0965n447J6108k0622M4234J64072J22754q9837k13323j03971N8414P7392
169d1191K4564N2408J04667K9917j27079j71886n5462P4306J06567Q0263N0672
180A27746n3p6165j14703p4109M117O7285J04921J01783K4237r3510j41204p2167
192a41822K6377O1720N9427P6609P1305k1439j38722j40746j7233R3342R8640
$$ y = [159069, 132104, 58464, -25182, -142708, -220441, -117265, 117090, 228963, 114508, -26134, -27113, -14470, -131214, -217318, -52043, 225438, 270631, 48387, -131512, -105015, -45870, -93091, -105228, 53847, 228182, 191347, -12227, -155426, -151691, -90431, -27621, 61155, 147837, 146002, 49168, -58294, -124714, -149639, -100670, 46866, 191862, 182048, 29918, -90965, -96412, -80304, -100926, -56692, 107380, 230134, 140297, -73026, -176997, -118583, -41191, -16627, 35781, 140448, 170365, 43286, -128600, -184062, -109756, -3189, 77074, 127746, 127693, 51528, -63175, -137284, -133167, -65882, 39039, 140822, 165059, 71549, -69655, -141822, -115445, -53725, 5702, 82311, 153616, 132177, -6545, -147291, -164524, -71182, 27458]
203B7458N4604L1986K230p1400j27274q1741L5239J15092J04380M3171k0909p3029
215C9807r8332p1887J365P4471J03485P7986J0666o8318j12924q6161m716P0573
227f3985R4873P3005K5391l7110r5089j04460m1535N2674J06275Q9309K9431l3834
239I4945q0055r3492n7377J9252Q8830J03845N6744j9255q0446r6975o1526O175
251a19335P0256R7855P2570O004o6219j00681p6108r864N8724R3871Q0474K3852
263A31399m9435r6515q6334k6915M3368Q6789Q5683M0673k9813q8073r5719m4842
275a29734K9893Q1698Q7554N0635j1747p2459r6498o3241R046P3199R2950O2946
287A14242K209o1478r3741p2578q811N7427Q8749P3820K2018m5047r1950q4978
$$ y = [27458, 82062, 114048, 116278, 44878, -82396, -164137, -128898, -13806, 90574, 133745, 112836, 39807, -58525, -130412, -129047, -54576, 48909, 126895, 137561, 69243, -43681, -129842, -134558, -63985, 30888, 103893, 129284, 92174, -2915, -107375, -148910, -96236, 10039, 99348, 128779, 94945, 14890, -78602, -135979, -116727, -27897, 75948, 132692, 113437, 32991, -63984, -125510, -119335, -49079, 48776, 121346, 127350, 61131, -39550, -115658, -125522, -66798, 27073, 107547, 131399, 81964, -14551, -100885, -127800, -84432, 2357, 88040, 128713, 98900, 10827, -84892, -129734, -99841, -18143, 69411, 120046, 108299, 35840, -60658, -123899, -114853, -41654, 51296, 114242, 116451, 54973, -38768, -111346, -120157, -62730, 26019, 99839, 121857, 76810, -15140, -100118]
299a00118k4754M7028Q5076P6071L3352k5550p8061r1464m7681K8549Q4193Q5658
311G2299M2525j6850o6325q6277o0132M356O9679R2265O0233k610o0591q5980
323c7408o6363r770N3933Q6976P1144J6300m6336q3934p6328k4946M1658Q2892
335G818P6802K9787l1535p5882q0998m1159K3417P5750Q4049M4609j8019o8785
347B5854q2106n2356O488O3137Q5094N9150q66n9374q3410o1293o781N0608Q1418
360B5563O8358J6370m6223q2197p0422k0230L9238P5978P3038L1358l0020p6244
372D567p9011l5511K6612P0892P5860M2033j4202o5005q1381n0699J0053O3524
384c2268P9714N2221j961n5094p9048n9573o029N1283P9065O2753J2354m4536
$$ y = [-100118, -124872, -77844, 7232, 83303, 116655, 91105, 13044, -78420, -126101, -97552, -13359, 72299, 114824, 97974, 31649, -54628, -114760, -110404, -40725, 51540, 111773, 109163, 48572, -37408, -103771, -113541, -59608, 27368, 98512, 114812, 68476, -15458, -91786, -116732, -75074, 7818, 84620, 114407, 82872, 6990, -74008, -115167, -91750, -16000, 68049, 112658, 94639, 25854, -56252, -108608, -102120, -38983, 46111, 105261, 104395, 45021, -38389, -99682, -106463, -55855, 25563, 93921, 110291, 64068, -18129, -88551, -108781, -69543, 6435, 79473, 110831, 80811, 4567, -74444, -109955, -83343, -12451, 63409, 105442, 91240, 26235, -55146, -105845, -95792, -32268, 47446, 99667, 97706, 42612, -36436, -96009, -102038, -50755, 28310, 91063, 103417, 58881]
396E8881p7285o7303j9306L9310P4826O8899K6159l0494p1596p3837l3813K5790
408g9769P0263P3683L7407j7697o2919p4863m6436R550O1373P7757M9343n659
420I2033n4773p3788n4510o208M8006P7090O2035R882m6512p3661n9941j6895
432i7242L3036O8937P0149K9406l2520p4030o8892k5672K5209N9691O7637M2340
444I8049j1519o4136p8089m2735J4895N7928O8723M6530K49n0143p4366n4761
456h9375l854M6734P1331N9460J3497m4179p5717n8725r938L4884N8387O1123
468F3628L5559k1328p6019p8969k3364L8785O0822N0446L2031R30m9170q3210
480d9859n5883J7873P1657O7537L0775n825l7961o3846n8938j0448M8908P4489
$$ y = [58881, -18404, -85707, -105013, -65703, 9123, 78022, 104181, 73687, 2091, -71746, -105559, -79769, -9506, 64177, 101584, 83887, 20968, -53895, -100331, -90781, -29408, 48349, 97692, 92033, 37260, -36528, -91038, -97246, -49240, 27850, 89885, 99767, 53255, -20406, -80347, -97242, -64206, 4731, 74880, 104286, 71766, -2264, -71156, -96828, -71619, -11928, 55709, 98049, 86530, 22394, -55695, -98430, -83535, -25607, 43116, 89646, 89895, 39752, -34614, -89375, -93229, -46495, 24836, 84296, 97793, 53614, -22103, -80828, -90766, -55882, 2505, 63628, 99187, 77859, 1840, -77129, -100493, -61708, -886, 49560, 81591, 82521, 33351, -49859, -105742, -87869, -16212, 51325, 82100, 76275, 38314, -25532, -84470, -94918, -46010, 28479]
492B8479N4242Q947l9941p0997o1121j0659M2399O0526M7426K4750j0246n9923
504A3882q4581m0539M2472Q1973N1336N921j1678k6915o1196o7917m780P6886
516b5136Q9794K9456k9699m4730m3509m4137k0616L5784P8127O1490L911m6056
528D4679o5792n4610j4002L9872O7187M8447J0141j8325m3236o6408n1845J9597
540h4295Q7630P7157M905m2011l5916l0073m5281k7222M7086J00141N8764l2393
552G8492p3507m7899j6729o620J6887N9363O8918J8227m9180p4612n0871o444
564h3975L7140O2325N1973J0628k9332m6344m9210l8399M433O7045Q6727K8924
576A01935m7879o5806l2356j1245r722J9212P2374P3730l411q0047p6505j7216
$$ y = [28479, 82721, 91668, 51727, -19270, -80391, -91050, -48651, 11875, 59301, 84051, 73805, 13882, -70699, -111238, -68766, 13207, 64543, 70464, 58786, 31871, -29325, -97242, -102022, -25136, 64658, 94114, 64415, 19685, -23824, -67961, -88577, -52793, 25334, 86824, 90735, 44679, -21113, -75723, -89725, -49853, 17334, 65781, 75922, 57597, 14361, -52047, -103892, -84295, 3335, 80492, 85397, 43386, 7470, -22603, -67884, -95106, -48020, 52121, 110885, 78492, 4985, -42914, -59643, -66263, -49376, 9987, 78905, 97132, 47952, -26660, -77531, -83975, -46835, 15490, 67463, 78091, 48759, 2415, -46795, -85194, -80761, -13716, 73011, 101935, 54056, -11750, -44106, -55351, -65073, -45861, 26513, 100243, 96832, 16785, -59720, -76936]
588g6936K2233K8446L7500N0338K6825l3582p6056n9846m686M3721O1442M7655
600F7054J0869l0849n2463m6706k3475J0256N0474P1307M0302k8571p3054n5840
612f0696q640J9161K8655M4412N1817J3417n3923q2396m1915K2106N2372M5355
624B9725K9513R872k3157n7445n9092j6774L9895O7913N0756N805l4927n1435
636i351m3628j9549J4747M9112O1279L3258k1065o1512n8473k1458J9475M4524
648a2641M9816L4196j688m2852o1549m2270L354M5969O0360L9935k201l9741n1978
661b1290l9404j1643K5011N6524N7917J6070l8475o0465m1718j0015J6659M2773
673h056N7341L3928k1748o1303n2329j6645J3063L5817N3946M5227n334n7866
$$ y = [-76936, -54703, -26257, 11243, 61581, 88406, 54824, -21232, -81078, -85764, -42043, 19399, 67054, 77923, 47074, -5389, -52095, -75570, -65314, -14840, 56467, 96769, 68198, -4856, -60696, -69336, -50175, -21520, 22892, 74709, 88126, 34203, -48193, -90108, -68002, -15630, 29725, 59238, 69110, 45953, -11492, -70584, -87358, -47463, 20450, 71206, 77011, 42084, -9351, -52979, -72528, -57781, -8669, 52610, 85868, 64803, 3291, -55182, -76640, -57165, -12641, 37175, 71371, 69683, 26831, -34718, -76988, -73634, -27665, 32695, 72630, 70429, 30688, -21290, -60694, -72337, -47326, 9198, 67115, 83185, 44710, -15755, -57473, -67488, -50829, -8056, 49285, 83213, 61465, 162, -52167, -68812, -55749, -19932, 34014, 79241, 73907, 16041]
685A6041o1850k2850J2942K8798M2447M9551J7853m3099p3265m1238J1523L5626
697b7521L7443L9713K6184k1015o5082n6046o267L1709M1718M3738L1756j3323
709F3007o2153n9893j0508K6828L1025L5151M4331J4011n4233q3165l0794L7738
721d8655M7528K1462K0482K7853j2082p4031p0612O072O4971N1278J3809L897
733E1972m800m1216o3299k5688L6383N7897L8353J5718q980m6807o4337k4585
745g9389L4895M8726K5561J7766J8690k2098p8754o3436K5170P9695M3158r305
757D0679n023Q249l3003p6874l4736N9507Q7758K7169k7751k5876j7362l7554
769c4817l8932J3093O5229N5878Q258k4651l8885m8551l2296K0427N9577M2404
$$ y = [16041, -45809, -68659, -55717, -26919, 15528, 65079, 82932, 39833, -33432, -74670, -63147, -27521, 9922, 49635, 75819, 54804, -10278, -66324, -72591, -40882, 836, 44574, 76330, 63007, 854, -59039, -69547, -42719, -11694, 23457, 67788, 81799, 27566, -55599, -86393, -48655, -1127, 20335, 40817, 68670, 56588, -17443, -88055, -81983, -17012, 34266, 48075, 51972, 47172, 5956, -57343, -83031, -46648, 11249, 49602, 65320, 56340, 9533, -54804, -79389, -44494, 4232, 29793, 47559, 66249, 44151, -34603, -98039, -72869, 6826, 49984, 40679, 35656, 43905, 10902, -65972, -100708, -41201, 46557, 73726, 45975, 20099, 2737, -34817, -73749, -60656, 4573, 60451, 68709, 44058, 5173, -43378, -75674, -55247, 4330, 46734]
781D6734L241p490j0679m3921o5422j2099P1980Q0857P853m2084k1760l965l5745
794c2500m8963J6486Q8429O7105j9982o1854l4007q435j5126m357M2132O4668
806E3596K5267l2531n2308l9541j9215J1364M8374N4057J5272k4927l0195k6116
818a6903l5458k2439L6561Q1354M4773l3646n9064k3593j938j6998o735N0067
830d019P5804J7674o0097o7417j7925J3670J2331K1407M4833L5825j6586n8331
842b831m9638j2202J9730L9921M6208K4603j7908m4021l6165j7539l540K1301
854c2081N4624N1997l948n8939n4051r806J3764J1991K4606M7646L1486k9803
866D7486p0669m5024J0556L6289L0473K5632K1308n503m4371n4113k0658K3526
$$ y = [46734, 49975, 42485, 31806, -12115, -77537, -89636, -17656, 63201, 71054, 28970, 7210, 3245, -32500, -81463, -64977, 23452, 90557, 70575, 8721, -25286, -33721, -48847, -53204, -11072, 53596, 78863, 46332, -5976, -45517, -64732, -53368, -4994, 49063, 64335, 39408, 9213, -16903, -52361, -74800, -38239, 43115, 87888, 54242, -4822, -28415, -30353, -47351, -54086, -4019, 71785, 89459, 29362, -38055, -55980, -42310, -29979, -8572, 36261, 72086, 55500, -2831, -52469, -64671, -44941, -5020, 41188, 65791, 47883, 3862, -32303, -49842, -53382, -32081, 22543, 74540, 70592, 11653, -42398, -52204, -38440, -26449, -1843, 45803, 77289, 47486, -23183, -68207, -57651, -21362, 9111, 34743, 56051, 50548, 6177, -47936, -68594, -45068]
878d5068M4949M0579K0012j1603m0676m4615k0751R606K9650M0067L6210N444
890F3804l9384n7632l0096J3104L3857L1943K6977J5416j6474n0963m9714p101
902f6263L5993M6218K9292P461j3857l5556m4104k3145J7091M5530M3261J7530
914E9451j3939l7572m2622k3861R538L6064M1500K6755j624l1945m7012l3113
926e8380K895L4827M2633K8247L278k3389m1593l8433j0282K5797M5712L6860
938D8172Q823k0996l9260l8157j6676J5439M0191M2010J9108j3954l7947m0963
950c4210k2369Q377L5268M2732K6010n214l3340m2388k8368J227K9618M2116L1705
963E1164L847k7296m3291l4024n658K4693L9955L4837J1536j8748m0259l9257
$$ y = [-45068, -119, 40460, 60472, 48869, 8193, -36422, -57173, -47567, -17917, 22150, 58360, 63804, 24420, -33212, -63308, -50204, -16347, 15596, 42573, 57989, 41515, -9448, -59162, -66263, -30270, 15948, 45240, 52701, 38844, 3288, -40816, -63961, -46870, -1340, 41921, 59451, 45512, 7940, -34682, -58543, -49005, -12941, 28559, 55314, 53690, 21745, -25267, -58380, -55485, -20658, 21975, 50222, 53500, 30111, -11482, -49915, -60197, -34400, 11312, 48172, 56995, 35999, -3261, -41418, -58094, -42655, -2464, 39546, 58654, 44700, 6753, -34210, -56579, -48202, -12934, 29798, 55808, 50594, 17254, -25134, -53502, -52275, -22657, 19459, 51164, 55011, 27715, -15576, -49600, -55258, -30565, 9390, 44227, 55763, 37015, -3244, -42501]
975d2501j5028J7666L9243L8708J7418j2734l5936l9780k2045Q212L4214M1538
987B8975K5842n157l3251m1996k6641K490K8840L9475L0393M485k5473m2776l4609
1000d9403n275K5847M0191L2489Q999j8434l7610l7722j5428J7158M0066L8411
1012C9289J5242j4683l5584l7535j9859Q756L3564M0347K4201o146l3322m0977
1024b6707k5090L671K9592L9011K7994K354k6161m0509l2193m699K5180L9956
1036A2399L2132P646k0567l7713l4824j2494J7291L7640L6844J5235j4510l6103
1048B976l7382j8076J0815L3454L7930K2064o402l1942l9809k4920M322L0161
1060a6809L8351K6249R98k5930l9493l0497l838K5319L8418L0799O903j9961l7066
$$ y = [-42501, -57529, -39863, -620, 38088, 55506, 42772, 6836, -32944, -54989, -46777, -12563, 28975, 54817, 49660, 16409, -25587, -52228, -49738, -20898, 18577, 48970, 53455, 27982, -14794, -49403, -54678, -28831, 11360, 43849, 52848, 34414, -3196, -40918, -56346, -39188, 878, 39289, 54531, 39848, 4264, -33271, -53130, -44374, -10810, 29537, 53738, 47592, 14270, -26707, -51797, -48126, -18534, 20477, 48471, 50825, 24664, -15845, -48038, -52737, -27557, 12399, 44531, 52177, 31610, -6103, -40927, -53421, -36130, 1510, 38354, 53589, 39079, 2976, -34406, -52482, -41667, -8213, 29717, 51781, 45379, 13437, -26372, -51292, -46970, -16809, 21542, 47791, 48789, 22859, -16634, -47131, -50969, -25650, 12768, 43567, 50470, 30509, -6557]
1073f557l4436j1568J8531L7344L4447J3293j4097l4296l6385j8248J1056L4590
1085f326L7328J9566q380l0772l7102k3619L654K9510L8837K5639j693k6896l7088
1098a7342k7858l628K3773L8472L0910N569k2322l6547l1016r791J7133L5925
1110C278L4897J3002j6199l5237l3729j5120J0628L1700L7068K0466r251l2566
1122H937l5818j9958M117K6257L7152K7628p88k9563l8374k3608M2K0479L3382
1135I885L1548J0284k2410m1181l0893l703J9301K9838L0072J6521j1093l6944
1147A225l8003j3296J5414L0909L1207J9365m931l1079l8552k0183Q248K6313
1159a3363L1798K5487M179k6825m3340k6419O832K6076K6502K2634J3399j2358
$$ y = [-6557, -40993, -52561, -34030, 3314, 37761, 51054, 36957, 2661, -33724, -51972, -40916, -6326, 31002, 50568, 42188, 11416, -25686, -49305, -45651, -16141, 22696, 48335, 46642, 19746, -17342, -45200, -48828, -25055, 13417, 44327, 49896, 27574, -8973, -39989, -49780, -32647, 3278, 38175, 51177, 34978, -259, -33988, -49108, -38480, -6780, 30288, 50754, 41503, 8937, -26881, -46839, -42722, -16465, 20687, 48315, 47527, 17964, -20410, -44018, -43976, -23497, 9885, 41433, 51717, 29307, -11874, -42767, -46470, -27169, 2669, 32741, 49262, 38169, 1225, -36778, -50074, -34660, -3751, 27456, 46821, 41890, 10811, -27741, -47924, -39676, -13363, 18435, 43922, 48101, 21276, -22064, -48483, -41651, -15575, 10927, 33561, 46960, 34602]
1171C4602m1683m1104m310L1023L4171J8577P304l896k6262m1479k2798J8045
1183c7810M0913L0834Q679q702k3404l4340k4132O397L1880L2610J8421R46k0603
1196B1689l9904l2842M387L5918L2228J1135J565m171k6911m4650j9918L2079
1208b9395N1804K1822j1877j4352j1102k5857l1558K591M5848M5757O295k4258
1220B5718k6034k0920j8183j448K7670L8539J9501p073k2293l0943l0154m570
1232e0190L4314M4357J4560j4536j4798j1669k7649k9943J2359N7585M4085j2636
1244D5839l9888j9035k084j4977j3783K5868N5246K6091k9145m5893k1234L3M102
1257b8860J4611L2031K7448l685k9429l1626k1130m271K3676M4246K7796j3743
$$ y = [34602, -7081, -48185, -52495, -21472, 12699, 31276, 38580, 34684, 8422, -33057, -55855, -37810, 3103, 33937, 42616, 33914, 10510, -23830, -47962, -41565, -9685, 22925, 41346, 42292, 21689, -18215, -51057, -46670, -10752, 21476, 32611, 34176, 30005, 3094, -41556, -61474, -29395, 22409, 44231, 32354, 18002, 6900, -18957, -50515, -47924, -2076, 43681, 49976, 25718, -316, -21236, -39419, -40867, -13197, 25342, 44843, 37770, 15477, -15466, -45620, -50190, -15876, 28481, 43041, 28505, 13707, 2038, -25611, -55554, -43195, 14390, 58475, 45839, 5951, -13084, -15168, -30145, -43928, -18060, 37186, 63277, 34132, -11761, -32995, -32962, -28860, -14249, 17782, 45230, 41545, 12116, -19510, -40640, -44911, -21235, 23011, 50807, 37064]
1269C7064l2465j7283p192j6116o168L6585N7281J2806m6756m7394l688J4779
1281a8547k557M48L5809M3358o691n5146m3637L010K4996J7246J5331K1117O903
1294D1640k3932l7872k2903J889K2252L5803L0503k316l5542l2935o495M820k16
1307b5304J3741M2028L2455k3802o1026l0987K0310K7700M401O602K9022J6602
1319E1742l4565n7521j9243L1179L8600J5237L042J585j2103l1429k8454q54K5976
1332a6808L4396K5447J051k8488l8301j7115J0371J6866J2884K0563K5134l664
1344D2336m6255m7467N63L9108K9153L154J907R440j1042m2635l4973J3284M7159
1357C732L3677J83j5365j5266j8549k1655p041K0320L5823K6764L42k6250l6389
$$ y = [37064, 4599, -12684, -19876, -35992, -42160, -5575, 51706, 64512, 17756, -29638, -33326, -18547, -21104, -20656, 15153, 58511, 51820, -3326, -46963, -43953, -18957, -1711, 13620, 34737, 41640, 17708, -20164, -43067, -41178, -18926, 16877, 47380, 45064, 9522, -23413, -29908, -25088, -25304, -11563, 30465, 62920, 39118, -21908, -52895, -32585, -4885, -484, 6118, 35140, 51742, 17177, -40344, -59587, -28408, 10192, 25429, 28471, 30056, 17953, -13476, -41930, -42784, -16808, 17588, 43035, 44086, 15598, -22703, -39818, -29447, -12581, 303, 20866, 46000, 42336, -3919, -51386, -50823, -11715, 17438, 20592, 22499, 31939, 20897, -21738, -56711, -43427, 3732, 37409, 37592, 22227, 6961, -11588, -33243, -40284, -19964, 15859, 42623, 42965, 16715, -19674]
1370a9674k1671O225K3701K1434J4391J0636k482k9015m1632j5397K7546M1824
1382A5886J9177n453j0409j1323k2793k6707j513L3948M2004J4578j8383k8986
1394B6k0823j0154m76J4248K8291K7120M912k4149l6881k3800M185K4764K6003
1407A3266J5873M091q672k4375l1278j5143J7212L7103K7699K364j6903k2702
1419a465k0538j3487K874K3568L3006J9988q779l0768l0514j1696R187K0269K2269
1432A3914J8469N048j7322l4342k6910J346K6463K9475J5780M18j1754k3303k7322
1445c0040j2059J5403L3055K6607M986j4120k4745k4637j2695R023K6380K7126
1457B4284J3139o353k2682k9512j8802N919K6799K7737J3314k950j5705k5843
$$ y = [-19674, -41345, -35120, -11419, 10015, 24406, 35042, 32560, 3545, -38087, -53484, -25938, 15886, 35063, 29610, 19201, 7878, -14915, -41622, -43135, -9187, 32817, 47395, 29012, 26, -20797, -30951, -31427, -17179, 11112, 38232, 43144, 18995, -17886, -41686, -37501, -12737, 13266, 29139, 33230, 24558, 183, -31095, -46238, -29026, 8077, 35776, 38140, 21237, -1465, -22003, -35490, -32616, -9048, 23958, 43946, 35167, 4399, -26115, -37811, -28624, -8355, 13914, 32383, 37431, 20109, -14233, -41143, -39797, -13334, 16141, 31921, 32339, 20585, -2718, -30040, -42099, -26696, 6359, 32966, 37952, 23832, -913, -25550, -38245, -29222, -2842, 24284, 37423, 31070, 8388, -21124, -39926, -34007, -7208, 20529, 33843, 30893, 15188, -10655]
1469a0655k4843m716K2689L3060J9491j960j5881k2203k2955j1449J3024L1754
1481E356K7201M810j5124k2887k2493j4160N914K7540L0735J1715j1391k2501
1493D715k2711j6235m52K1938L2340J8786o099k1942k3668j7804m328J5899L0591
1506A1030K4263R70j9195k5140j9719p995J0609K8074K8252P668j6233k5673k0569
1519b3658j0262M812K2842L0689J6104j0990k7424k3929j0529L003J7161K7685
1531A5504K1739j917k4613k8241j5489J330J6010K5348K2687M144j8297k7989
1543i784k0380m160J2853K4983K5022R234j3929k7323k3009p406Q889K1562K5501
1556B2053J5215p052k6149k7430j1674P283K0060K3864J7189j71k0601k8987j8200
$$ y = [-10655, -35498, -40214, -17525, 15535, 35026, 33066, 17185, -5018, -27973, -39422, -26398, 5356, 32557, 37367, 22243, -644, -23137, -37297, -31383, -3843, 26892, 38607, 27216, 4715, -17996, -34231, -34683, -12745, 19595, 38381, 32282, 10340, -13328, -31132, -35460, -19561, 11030, 35293, 36263, 17068, -8072, -27791, -35786, -25177, 2897, 31149, 38817, 22584, -3089, -23658, -33920, -29108, -6266, 24423, 40527, 29537, 2113, -21816, -32345, -29342, -12181, 15504, 37243, 35326, 10713, -17528, -33017, -31687, -15677, 9671, 32358, 36502, 18205, -9784, -30164, -34324, -21471, 3512, 28534, 37768, 23839, -3484, -26493, -33899, -25010, -3448, 22053, 37268, 30216, 4067, -23363, -35037, -27754, -7694, 16170, 33359, 33188, 12587, -16400, -34600]
1569c4600K339J9011K4913J9160L062j5873k7039k1712l744J4873K5297K2160
1581B7847P442j2546k5316k3822q735J0659K3827K3960J1559p748k2818k5511
1593b1202j3585N944K1947K5413J5216l250k0082k6080j7088J170J8390K5467
1605A2260J9170J660j6819k6005k0389l290J4900K4901K1706O001j3075k4294
1617c274k2256q391R808K3466K4925J1032r833k3723k3055j1123N341J9522K5095
1630A7534J6574l317k2037k6370j4757L310J7665K3347J8037K478j6328k6624
1642a0488k0412j871J6222K4247J9889N248j3006k4103k1651o999J0588K2542
1654B06K3273J0881q798k4365k4141r618Q068J9229K1808J5116j472k0069k7478
$$ y = [-34600, -32261, -13250, 11663, 30823, 33885, 18012, -9027, -30739, -34483, -19610, 5687, 27847, 35289, 22743, -2573, -26395, -35130, -24471, -644, 23316, 34875, 27127, 4309, -21202, -34787, -28843, -6896, 18517, 33733, 30483, 10401, -15679, -32767, -31597, -13207, 12260, 31430, 33090, 16271, -9734, -30123, -33413, -18513, 6388, 28094, 34095, 21020, -3274, -25530, -33921, -24113, -647, 24278, 35310, 25477, 1754, -21301, -32424, -27083, -7561, 17534, 34108, 30791, 8754, -17616, -32373, -29063, -11398, 11949, 29986, 32464, 16136, -10488, -30900, -32771, -16549, 7698, 27587, 32835, 19829, -4274, -25925, -32924, -22336, 206, 23479, 34360, 25562, 1197, -22944, -32562, -24494, -5265, 16543, 31659, 30187, 10118, -17360]
1667a7360j6344M703J9775K2457J5204J509j4080k4727k1084l433J6769K5198
1679H587J9127L781j2576k2717k1227p560J0679K2903K2187R574q376k2455k3844
1692b1917j1232Q260K0998K2091J2230l031j8144k4859j6730K585K0106K4373
1704A4730J4704j151j5151k2161j8807m037J4914K5343J9869K930j4090k2200
1716e107j9127o809R843K2340K2425Q919r809k2359k1704r638O911K0015K2595
1729A8495J2535m508j9619k3449j4050K966J8365K3274J5454q99j6455k2886j7040
1742b7817k240J4713K3672J9223L175j4285k2628j8085n500R851K1132K1837R379
1755C2427j0039k3268k1380p870Q082J8476K0685J3012l411j9539k4733j3720
$$ y = [-17360, -33704, -29001, -9226, 13231, 28435, 29944, 15864, -8863, -29947, -33380, -16611, 8587, 27714, 31495, 18919, -3798, -25025, -32585, -21906, 997, 23184, 32758, 24382, 1927, -21917, -33149, -24889, -3891, 18200, 30430, 27399, 9255, -15604, -32334, -29749, -9643, 14730, 29434, 28283, 13132, -9029, -27836, -31873, -16959, 8384, 28253, 31183, 17093, -5107, -24234, -31043, -21200, 1140, 23565, 32484, 22675, 316, -21388, -31026, -24115, -4100, 18495, 31030, 26522, 6903, -16546, -30596, -27630, -9265, 14009, 29463, 28564, 12109, -10777, -27817, -30057, -15344, 8328, 27551, 30726, 16441, -6187, -24272, -29772, -19921, 1211, 23048, 32427, 22388, -880, -22260, -30130, -22048, -3572, 17113, 30125, 26714, 7175, -17558, -31278]
1767c1278M953J8996K1311J3600m11j4816k2358j7874k268J5327K4021J8180K224
1780B9607j4301k1645j7500n026R924K0383K1071R076r452k3255k1896p101R390
1793b0725J9060J8739J1219k972j7730k4090j5035M607K0443K2384J1969k871
1805B4998j4844j9947j6206k998J3743K4011J9545J994j6200k2608j5581k707
1817b6800R742J8314J9832R909q646k3615k2336o873J1015J9335J7869R660l873
1830B3533j7187k2413j3960L872J9314K2413J3289l354j7277k0755j3294J10J2966
1843a2743K0259J8533M499j5047k5428j7280N84J3795J6994J5316Q510o103k2064
1856a75k4143p450J3342K0931J6235O929l611j6136k2416j3826N833J9898J9958
$$ y = [-31278, -26325, -7329, 13982, 27582, 27171, 12355, -10003, -27877, -30145, -14818, 9203, 27383, 29607, 15306, -6339, -23839, -28865, -18941, 1442, 22513, 31589, 22137, -1118, -23014, -30115, -20725, -1665, 17074, 28293, 25321, 7591, -16499, -31534, -26927, -6484, 15900, 27869, 24998, 10154, -9793, -25999, -28997, -15254, 8757, 28302, 30296, 14096, -8512, -24093, -26800, -17058, 1256, 21088, 30997, 22351, -1264, -23600, -30473, -19458, -123, 17746, 27406, 23533, 6346, -16067, -30027, -26155, -6841, 15572, 28861, 25507, 8230, -12525, -25819, -25709, -12743, 7516, 26049, 30548, 15501, -9927, -27207, -26623, -12828, 4166, 19482, 27992, 21889, -175, -24318, -31768, -18426, 2505, 18740, 25669, 22058, 5922, -16494, -30320, -24487, -4589, 15369]
1869A5369J1168j722j4937k2441j5919K386J7339J9097J2538L367r611k2151k1872
1882b7389l152J7512K1661J2446K775n353j6133k3063j1867J1593K4717J7771
1894B1518L069n927j2898j9859j6299M122K3240K2057O503n449j1109j7453j8493
1907b6978l146J9497K5935J1230n112j0905j3884j7752r851J2421K7166J8415
1919B7036k103j2437j3830j5258j2100N279K4371K2939L451j1910j3647j4079
1931a2288j3860j420K0994K7789Q871j2309j5851j0366j1295q197J1250K9619
1943A2937K0188p749k1756j4357o092n479K850K1073K5284M644j8732k1384j0700
1956a9273l279L420J6847K3342R415j3071k0196j2664o213j228J3114K6597J6965
$$ y = [15369, 26537, 24815, 9878, -12563, -28482, -26096, -8757, 10340, 22878, 26245, 16634, -5517, -27389, -30541, -13029, 8632, 21078, 23853, 18500, 2367, -20696, -32563, -20970, 3747, 21518, 24587, 18660, 5762, -14097, -30396, -26274, -3034, 19023, 25526, 20077, 8968, -8485, -26978, -30124, -10627, 15308, 26538, 21426, 10521, -3363, -21115, -30966, -18545, 8621, 27036, 24933, 12496, -1334, -16592, -28692, -23413, 958, 23897, 27348, 15438, 1791, -12288, -26148, -27568, -6574, 21215, 30086, 17777, 1926, -8440, -19735, -27932, -16682, 12937, 33125, 25376, 3620, -10737, -16829, -22308, -19458, 1615, 26899, 31543, 12811, -8573, -19273, -22552, -19132, -2285, 21057, 30472, 17401, -2795, -15459, -21672, -22900, -9786, 16811, 33776]
1969C3776j1035k5176j3788p97j119K365J9425K6560L531k6133k6734m626Q160
1982a5591N339Q726J9526J3767j1745k8054j7831K121J1021J3043J6037J1328
1994B7687p020k1967j7971l534N223J0333J8455J8716j974k5684k4134j789J0771
2007a2888O671P392J8259J3108j4709l3587j7016J1796J9140Q452N751J0099p31
2020B1737k1871k5773m553J7278J9642J1633M469m523j6751j9896o954Q718J4518
2033b326J4116J2442J574j8355k6943j0616J3263J7918Q140N242P957l705k4913
2046f206k5571J699K5467K0627K523l169j948j0702k1148j2285J2160K5134J6542
2059B3123L24r542j4405j5855q366O883J7110J5432P860j333j3708k2277j4732
$$ y = [33776, 22741, -2435, -16223, -17020, -18139, -15774, 3651, 30211, 33742, 7609, -19125, -23751, -15591, -10252, -1526, 18000, 31767, 20022, -8032, -25863, -23742, -12721, 322, 16359, 27687, 20667, -1300, -19271, -22805, -17582, -7249, 11206, 29922, 27948, 2264, -21870, -23659, -12888, -6217, 1175, 19434, 32542, 17833, -15754, -32770, -20974, -1834, 6618, 12369, 22468, 21737, -134, -25907, -30460, -13182, 6460, 18093, 22562, 18039, 1288, -18608, -25562, -16844, -2326, 11790, 24232, 25806, 7451, -19492, -30108, -16845, 1073, 9213, 14455, 22412, 18707, -6206, -31777, -30078, -4611, 16016, 18539, 15370, 13422, 2720, -18428, -30713, -18553, 6581, 23123, 23447, 13905, -500, -16355, -24721, -17838, -728, 14704, 22564, 21231, 7523, -14754, -29486]
2072b9486P266K2127J6424K372k982m574j4073k0766p056J8743K7471J0920q268
2085A8118j2133r192j1235r843M979K1533K1146L284j3094j7678j3496n119O145
2098a6585J5854J6338P402m442j3830j7920j2743L177J9206K0536O653o960j1726
2111D960j1877j1922n673J0692K3352J7162l265j6698j5718q255k357M971J5283
2124F55J8486P152j0405j9548j5286m071P633J5443J5465P057n102j4244j6241
2137a3006j0377K399J5456J9557J0288m979j4854j5076r192o21R748J7692J5518
2150B2553J589j3955j8977j1960R2R524J4665J4257N502p867j7670j6171n090
2163b3508Q078J6340J5475O443o176j4961j5475q443L340J4195J7471J0530l367
$$ y = [-29486, -22220, -93, 16331, 18703, 15721, 11147, -2926, -23692, -30748, -12005, 15466, 26386, 18118, 5985, -3207, -14442, -24285, -19306, 2227, 23373, 26657, 13563, -4115, -17611, -22730, -16585, -731, 15607, 23009, 18567, 4737, -13183, -25926, -22749, -3543, 16993, 23646, 16686, 4960, -6917, -18839, -24512, -13820, 9532, 26694, 23429, 6731, -8987, -17242, -19599, -14628, 655, 19141, 26293, 15888, -3660, -18946, -23017, -15384, 59, 15524, 22581, 17479, 3235, -13006, -23383, -20984, -5528, 14029, 24317, 19338, 4484, -10592, -19784, -20405, -10657, 7035, 22553, 24142, 10187, -8790, -20750, -20658, -11134, 3531, 17788, 23290, 15423, -2247, -18418, -23508, -15430, 910, 16385, 22828, 16652, 1691, -13784, -22227, -18887, -4692, 12779, 23309, 19942]
2176A9942j4712j6699j0088J728J2029J6349J2156R83j1480j7464j3261j505J0917
2189a1105J6648J3360L269q977j6186j4759m609P574J5572J5498O509o356j5680
2202G58j5851p108M946J4160J5614R233k883j3241j6662j0661J594J2943J6941
2215I783J1147o92j1487j5947j2231k075J0109J6849J3876K863r687j6505j3855
2228a7852l867Q190J5236J4324N740n955j5045j5930p482N922J5439J5205P224
2241B1149m177j2612j5278j0270J431J3232J7239J0729k176j2365j5217j0818
2253a9133j041J0024J6466J3063J838j0353j5994j2880l215Q361J6063J3873L954
2266B1026p394j4260j4068o891N108J5391J6274O662o058j3629j4035p933J547
$$ y = [19942, 5230, -11469, -21557, -19829, -7800, 8549, 20705, 21688, 10208, -7256, -20517, -22022, -11105, 5543, 18903, 22172, 13195, -2991, -17750, -22359, -14785, 787, 16285, 22794, 16438, 758, -15093, -22201, -17255, -3095, 12519, 21752, 18869, 5628, -11034, -21695, -20101, -7158, 9783, 20930, 20238, 8751, -7196, -19427, -21502, -11393, 5456, 19332, 22195, 12508, -3997, -17852, -21719, -13529, 1707, 16031, 21771, 15816, 771, -15159, -22641, -16719, -1280, 13925, 21149, 16972, 4360, -10918, -21188, -19757, -6525, 10714, 21443, 19267, 6902, -8315, -19133, -20174, -10150, 6316, 19379, 21217, 10864, -5130, -18010, -21225, -12864, 3199, 17072, 21026, 13632, -628, -14696, -21587, -16479, -1088, 15186, 21848, 15790, 2161, -11874, -19807, -18260]
2279a8260J2134J6922J0899k498j3408j5273r448K12R464J5568J2984J693j1024
2292I965j5916j1650k107P441J4726J4495M824q293j5852j2920m576N006J3037
2305a820J5328Q378n030j5273j4818o388L271J1115J4767J0811q37j3271j6392
2318a0159r164J459R847J3760J2452K598j0262j7031j1743o69Q555J2855J2696
2331A5194N964o467j6378j5016l810P632J2709J2678P233k760j3575j6478p873
2344b0947M745J2874J3405Q626n80j1233j5940j0698J388J1457J3835J0293K108
2357A9333q563j6170j3244j463J0352J4039J0562L980n042j3914j5710o070Q126
2370a3784J5534J2245M127l879j1062j4540r386L296J4424J5240P017l274j0738
$$ y = [-18260, -6126, 10796, 21695, 19197, 5789, -9484, -18932, -18720, -9256, 6312, 19296, 20989, 9965, -5951, -17601, -19708, -12267, 2459, 16954, 21778, 13485, -2367, -15287, -19863, -14857, -1820, 13508, 21886, 16856, 1583, -13235, -19623, -16352, -5237, 9530, 20341, 19504, 6233, -10159, -19323, -17864, -8017, 5743, 18195, 20793, 10531, -6500, -18243, -18912, -10357, 2498, 15194, 21158, 14691, -1687, -16703, -20513, -12881, -172, 12506, 19739, 16979, 3404, -13074, -20947, -16202, -3328, 10077, 18703, 18123, 6890, -9050, -19748, -18360, -6903, 6932, 17225, 19333, 10770, -5400, -18644, -20107, -9755, 4284, 14846, 18826, 13784, -130, -15840, -21910, -13784, 1750, 13995, 18122, 14243, 3181, -11359, -20745, -17449, -3025, 12215, 19232, 15958, 5220]
2383E220j3566j0145j45J1230J5462J0336k48r391j4042j1985k450R391J5222
2396D889J1502J955o946j2471j2856o581N864J5616J4553L885o615j1622j1837
2409a0664p757J347J2331J6352R144m558j2807j2667p609q1Q742J4742J2342M40
2423A9297j1254j5021r760j031P568J3351J2606L852p897j4224j2142m058N385
2436a3328J3051J3962O389o087j3624j2432n512K738J0160J4489J0335k459j3960
2449C722j4854o451K944Q248J1603J1374L258j0022j7205j1198J210J0013J1298
2462C940R738M435n184j4437j4171m038P812J3467J1574N012m307j2748j3559
2475a2466n998M298J1248J2435Q729r47j2189j6224q113M399J0790J0617Q018
$$ y = [5220, -8346, -18491, -18636, -7406, 8056, 18392, 18144, 8753, -5289, -17274, -19724, -10333, 4889, 16391, 18346, 11400, -1071, -13927, -20508, -14644, 972, 15525, 19410, 12795, 1173, -10664, -18421, -17074, -4743, 11609, 20753, 16195, 3388, -9279, -16888, -16969, -8227, 6515, 18857, 19297, 8043, -6978, -16738, -17769, -10201, 3150, 15756, 19608, 11711, -2513, -14655, -18713, -13328, -277, 13685, 20074, 13987, 363, -12069, -17581, -14843, -4683, 9806, 20141, 17682, 3722, -11132, -17583, -14639, -6391, 5212, 16586, 19844, 9822, -7383, -18581, -17371, -7358, 3940, 13678, 18113, 12929, -1508, -15679, -19717, -11905, 1562, 13136, 18148, 13841, 1093, -12466, -18464, -14166, -2918, 9517, 18246, 17299, 5110, -11114, -19227, -14828, -4038, 6579, 14597]
2488A4597K814o829j5996j3860j74J2540J3934P222Q71m385j0786j3875o659P387
2502a3199J5902J2607K452o279j1215j1601o400L445J1809J3119P331j995j1463
2515D513j4979q725L651J2307J1833O179J01o055j2705j3466l027J1792J6613
2528H032Q956k165p392q988j0049o661L950J5039J5043L822q409j3005j0271l972
2542a6070L310R869J2341P981j591j1284j4844q681L290J2514J2746N893j663
2555A3811o976j0776j1200l888Q954J6608J1566j182j0361j1073p469l157L135
2568a2008J1334J4047O549o791j5127j2201k764O153J0240R838O249p32r690j4496
2582i399r558K616J3139J3887N585l384p857r927r115l246P439J5079J1996M07
$$ y = [14597, 17411, 10582, -5414, -19274, -19448, -6908, 7026, 14248, 15119, 10734, -52, -13927, -20586, -13199, 2703, 15310, 17762, 11483, 268, -11333, -17733, -14288, -2479, 10640, 17971, 15976, 4513, -10466, -19191, -15540, -3233, 8600, 14779, 14880, 8825, -3880, -17346, -20373, -8581, 8032, 16988, 14823, 7431, -1557, -11606, -18267, -14317, 722, 15765, 19587, 11178, -1827, -12098, -16070, -12760, -2891, 9450, 17431, 15840, 4556, -10288, -18969, -15679, -3165, 9581, 15474, 13811, 6835, -3941, -15141, -19029, -10075, 6533, 18099, 16917, 6556, -4517, -11986, -15143, -12008, -674, 13373, 19922, 13131, -1996, -14197, -16961, -10808, -568, 9270, 15519, 14787, 5097, -9399, -18957, -16341, -3202, 10685, 16270, 12886, 5029, -4898, -14013, -17259, -9820, 5259, 17255, 17662]
2596A7662j0273j3070q037j263N469J0060J0971O162m523j3053j3770n123O905
2609a1883J2937J0040L648k631p791j1555j0160J48J2418J5610P317m649j0089
2622C360r269p000k493N910J3675J2320J200r765j3215q928j332O374J1176J0472
2636A2485L846n065j1004j1916o082M384J2894J3027M222n786r531r119o760r42
2650a5347Q670J5196J0190l219j2662j1108n006o0N230J1252J2056K597r522j3936
2664e669q690n64O157J0466J0963M202o178j2092j0164m003L450J0304J2887O959
2678A8028n104j2582j0592l876J853O948J1748J0353j14j2063j3928n793K418
2691a2704O956R250R777L676p897j4249r951K59P012R860R625M810n111j2913
$$ y = [17662, 7389, -5681, -13718, -14981, -9512, 548, 11519, 17681, 13158, 105, -13665, -18788, -11883, 1054, 11094, 14742, 12111, 4320, -7235, -17395, -17247, -4829, 10781, 18098, 13449, 3360, -5909, -12909, -15402, -9492, 4183, 16503, 17703, 7938, -5277, -14205, -15537, -9163, 2013, 12485, 16331, 11266, 262, -11654, -17736, -13352, -458, 12569, 16791, 11005, 1474, -7645, -14405, -15347, -6677, 8519, 18709, 15490, 2828, -8280, -13286, -13346, -8116, 3136, 15192, 17789, 8267, -5669, -14359, -14923, -8766, 1700, 12663, 16865, 10687, -1405, -11569, -15572, -12122, -1818, 11069, 18028, 12924, 342, -10250, -14126, -12273, -5325, 6423, 16776, 16662, 4599, -9329, -15122, -12704, -5748, 3502, 13279, 16955, 9058, -5191, -15142, -14883, -7871, 1989, 11614, 16424, 11313, -1600]
2705a600j1484k483N605R299J0076O497k131j1865j3136m963M745Q924R394P423
2719A4301P20r184j3938q361K556R529R698P481K392o297j3187j0806n55Q682
2733f969J0478P967L355l820j1504j2366l848O849J1146Q712M267k064r437j2569
2747i803o895M098J0995J0216N339r87p719j2163q785J282R712J1175O907N80
2761A3952o155j1592j0370j822Q710J1772P666J651m627r677j1161m936N913J2206
2775A530R949K884l823q914j0713o407K831J0801J1015N398k033q143j1228q002
2789a4855Q51R267J1478O836j77o477j0446r637k451P559J2263R018P51n909r378
2804a307r448m439M248J1349J0810L800m497r594j0296n581K800R991J0890N297
$$ y = [-1600, -13084, -15567, -9962, -663, 9413, 15910, 13779, 1914, -11222, -16185, -11440, -2516, 6878, 14301, 15021, 5837, -8101, -16462, -13906, -4377, 5321, 12802, 15194, 8897, -4290, -15096, -15651, -6969, 3509, 11476, 14831, 11011, -493, -12859, -16707, -9858, 1288, 10000, 14267, 12203, 2766, -9803, -16698, -12600, -1605, 8611, 13950, 12963, 5244, -6919, -15704, -14422, -4710, 6465, 13372, 13952, 7797, -3795, -14165, -15987, -7277, 4495, 12161, 13812, 9185, -492, -11653, -16589, -10676, 1530, 11479, 14363, 10540, 1626, -9087, -15494, -12663, -1862, 9153, 14551, 12518, 4375, -6853, -14855, -14004, -4737, 6741, 13577, 13400, 6923, -3523, -13160, -15611, -8052, 4211, 13229, 13980, 8071, -1307, -10755, -15194, -10946, 403, 11213, 15013, 10516, 922, -9374, -14955, -12155, -2164, 8726, 14023]
2818A4023j865p874j0741q261L83R406J2157O639j157p120r383q427k568O169
2832h619J2219R803J295o985j0356q402l107M486J0066J0157M087m046r736j0481
2846i619n485L311J0449J0884M382l124p608r070p522o87Q601J2864P625k247
2860A2754q767r135o262j570N035J0763J0101K042p043j1417q637j674N423R779
2874A392Q970L359l800r243j0044n463L070J0612J1421M278m480q758q038n382
2888a2106l24O612J2094R021j455j0285j0704n068Q38N397Q729Q729L041n962
2902H557j1743r459j616O657J0152Q096K237l908q564r144n221K402R823J1574
2916I843N271m594j0077q612l715J373N827R609Q779N52r250j2301o561K178P464
$$ y = [14023, 12158, 4284, -6457, -14718, -14335, -4929, 7228, 13867, 12710, 5590, -3793, -12220, -14788, -8619, 3600, 13403, 14698, 7713, -2643, -11045, -14152, -9666, 400, 10557, 14644, 10598, 862, -9619, -15104, -11793, -1344, 9540, 13922, 10798, 3190, -5880, -13402, -14089, -5488, 7376, 15001, 12754, 3987, -5148, -11410, -12980, -7945, 2818, 12919, 14961, 7918, -3499, -12136, -13810, -8387, 1392, 10362, 13721, 9921, 678, -9366, -14829, -11759, -1147, 10274, 14552, 10072, 1314, -6724, -12106, -12430, -5818, 6276, 15297, 13842, 3557, -7147, -12215, -11377, -5980, 2749, 11478, 14519, 8557, -3186, -12645, -14261, -7604, 2548, 10644, 12881, 8973, 409, -8735, -13956, -11554, -1731, 9843, 15114, 10520, 443, -8169, -11884, -10511, -4684, 4925, 13704, 14256, 5006, -7295, -13856, -11678, -4214]
2931d214Q220O349K425m505j0202j0136k826O677J1142Q445J366n079q041q054
2945h433m330J969Q702J1256N707l739j0523r553l629K657O736Q499O820R16p357
2960E698j1831p996J412Q579R628N614K91m876q413q768l554N459J1479R412J422
2975A3556o536r096o937k942K676P659J0178N874l288j0622j0055l608L590P559
2989a992Q195N554p9o891j0664p407N65Q244J0242O367o12o482q524o806k223
3004a2513M600R920R527K513o424j0458p613j270L995P042Q542N532k288r800
3018A305j0732m079L952Q592P790M661n84o563j0054p260Q12P933R838O317k63
3033A1665o443r154o970j218N422Q910Q261K662m957j0117q868j898N201Q288
$$ y = [-4214, 4006, 10355, 12780, 8275, -1927, -12063, -14889, -8212, 2930, 11375, 12741, 7662, -379, -8433, -12763, -10794, -2092, 9164, 14871, 11132, 609, -8944, -12573, -9916, -3180, 5319, 12139, 13055, 5698, -6133, -14129, -12717, -4138, 5490, 11104, 11395, 6519, -1894, -10662, -14216, -8757, 2722, 12134, 13556, 7020, -2076, -9013, -11955, -9279, -1620, 8558, 14432, 11144, 522, -9533, -13141, -9551, -1992, 6203, 11757, 11678, 4787, -5877, -13284, -12719, -4475, 5767, 12134, 11522, 5040, -3484, -10290, -12513, -7913, 2007, 11534, 14047, 7623, -2835, -10448, -11718, -7723, -681, 7861, 13393, 11105, 1305, -9427, -13506, -9554, -962, 6828, 11489, 10905, 4342, -5712, -12972, -12160, -4227, 5611, 11928, 11665, 5222, -3932, -10902, -12120, -6698, 2212, 10473, 13135, 8178, -1939, -10807, -12705, -7504, 784]
3047G84P371L651j646q260j0430n483L804R427Q429L777j541n980q992p193m6
3062a2328Q151J0201O025r42o215q760o883j470N603R719P702J459n180q748q134
3077i800k970M657R265Q152K624l511p419q312n434K177R178R657L984l020p087
3092B141p550n611n61O755J0565O822j383p480q133n576j268M512R247Q521J525
3107A2526o169q969o654k117L365Q152R056L494m338q791p651l168J979P063R392
3122G170N727k732q624q328l912R66N450Q787P304K59p900r584n369O97M653P604
3138B168P609K895n703j0079p306m07M347O991P545M233l251r495q813k279L874
3153g671O733P121N131p60q056j0091m574L014O985O929N373J024o000j0045o972
$$ y = [784, 8155, 11806, 10160, 1900, -8530, -14013, -10209, -782, 7647, 11424, 9883, 3903, -5089, -12282, -12328, -4177, 6024, 12049, 11107, 4892, -3868, -10751, -12221, -6618, 3101, 10803, 12262, 7082, -1666, -9800, -12770, -8113, 1152, 9304, 11928, 8417, 998, -7314, -12748, -10571, -1393, 8264, 12248, 9228, 2141, -5409, -11020, -11581, -4826, 5739, 12561, 11178, 3698, -4435, -10011, -11279, -6767, 2480, 11001, 12526, 6357, -2612, -9266, -11383, -8018, 134, 9190, 12684, 8346, -445, -8096, -11264, -9285, -2222, 7170, 12897, 10165, 1541, -6787, -10699, -9733, -4283, 4504, 11808, 12067, 4167, -5417, -10786, -10089, -5436, 2168, 9777, 12672, 6969, -3110, -10416, -10823, -6476, 515, 8060, 12293, 9042, -453, -9266, -11545, -7671, -938, 6183, 11314, 10554, 2498, -7593, -12167, -9153, -2168, 4761, 10134, 11158, 5158, -4887, -11859]
3168a1859J276O782P286N587J894l834r341q633r67O074P776N861K840k077p925
3183G40r947l701N065Q692O195K655o42n695r531o621K411Q940Q228L022r48m540
3199D323p834p302q70P198R314N171j48m275p481p691k335N597R083O209J016
3214I975k948o342q357n040L873R869P643J408l079m901o765o481j16Q304J0423
3229G466M203l328o238n986n142j555M972R618P106n42o140p478n914j732M246
3244f444Q630P010J343m358o699o707l978K265Q886R138K267m601o682n469l798
3259i197n26N847R938O484l003q341p172l046M47L968P541P208R67o169r056n748
3275i858p9M757P533O531J551m334p446o201k805K497P463Q524L762m641q206
$$ y = [-11859, -10583, -3801, 3485, 9072, 10966, 7132, -2209, -10842, -11809, -5735, 2041, 7902, 10742, 8665, 740, -9207, -12908, -7843, 849, 7044, 9699, 9057, 3362, -6169, -12790, -10379, -1439, 6789, 9811, 8863, 4323, -3511, -10813, -11683, -4485, 4829, 10000, 9852, 5577, -1904, -9595, -11930, -6333, 2750, 8959, 9975, 7027, 685, -7672, -12712, -8839, 1030, 8673, 10081, 7002, 2101, -4664, -11145, -11261, -2957, 7466, 11669, 8341, 2103, -3883, -9025, -10580, -5608, 4010, 11116, 10574, 4434, -3044, -8958, -10690, -6444, 2186, 9196, 10539, 6181, -518, -7225, -11203, -8938, -52, 9086, 11353, 6752, 70, -5399, -9197, -9723, -3876, 6062, 12546, 9543, 1202, -5970, -9016, -8569, -4601, 2940, 10148, 11115, 4946, -4110, -9858, -9937, -5180, 2353, 8884, 10435, 6101, -1345, -7546, -10351, -7854, -391, 8133, 11895, 7254, -952]
3290i52n959k051J368M738P690O546r01q234r251l345K435N236O296N280J409
3305A0305n030q806o604m32N858P970N808R01m463p282o146k077K986O911P823
3320G722L695l613q510p249j854L082N500O188M796k01o473r328m932K234P076
3335a867O822L983j11m416p273o457j107N135Q519O313N72n161p332n669j438
3350i487L316O442P003L426l032p951p761k553L688O662O128L372j138n667p740
3365e292n144J252O802P906M415j555n602o639m918m34M495P530O536R91n397
3380D946q116n621m56M137O234O024K841k872p331p381k978L563P233O500K664
3395I387k083o001o687m121J013N843P892M642j113o167p374m150M90M737O541
$$ y = [-952, -6911, -8962, -7594, -2856, 4834, 11380, 10479, 2245, -7006, -10351, -7916, -2680, 3616, 8896, 10305, 5275, -3531, -10135, -10567, -4709, 3261, 9069, 9970, 5507, -1775, -7921, -9998, -7012, -101, 7722, 11417, 7804, -706, -7955, -9809, -6727, -1227, 4961, 9757, 9556, 3083, -6245, -11177, -8943, -1867, 4955, 8938, 8827, 4411, -2862, -9319, -10426, -5291, 3228, 9541, 10113, 4952, -2380, -8049, -9487, -6171, 271, 7274, 10700, 7668, -283, -8044, -10597, -6909, -247, 5881, 9253, 8115, 2448, -5292, -10436, -9184, -2382, 5524, 9939, 8384, 2782, -3857, -8775, -9209, -4714, 2816, 9352, 10343, 4946, -3170, -8791, -9247, -5110, 1124, 7148, 9989, 7117, -214, -7595, -10573, -7010, 223, 6723, 9387, 7304, 1303, -5384, -9505, -8492, -2649, 5243, 9885, 8772, 2605, -4769, -8919, -8429, -3692, 2849]
3410B849N638J244m566p916o352m45M784O850N435J622l038o595o635k892L147
3425f870O957O859K942k692o718o555l258J928N528O821M435o57n988p845m527
3440i640J314N561O463M410O73m105p206o175r88N022P232N393J156l666o605
3455a161o119k244L226O519O274L053k276o728p197l114K780N983O109L613o56
3470H062n104p656n176J348O132O885L967l27m192o650n567j097M751P211N486
3485H073Q87l813o592n980j909L602O631N723K203k091n961p149l497K714O878
3500b81O071K646j330m667o765m878M81O045P421M030j058m359o211n307q67M567
3516d462P436N073N01l810o190n723k128L427P151N956J541l023n425o052l592
$$ y = [2849, 8487, 9731, 5165, -2751, -9103, -9548, -4764, 2086, 7521, 9143, 6105, -490, -7125, -10017, -6870, 87, 6946, 9888, 7196, 478, -6077, -9335, -7407, -1879, 4942, 9377, 8720, 2732, -5113, -9640, -8326, -2765, 3698, 8108, 8781, 4676, -2530, -8705, -9693, -4671, 2561, 7954, 9110, 5444, -1161, -7280, -9524, -6298, 221, 6495, 9548, 7272, 544, -6653, -9767, -6987, -1004, 5105, 8718, 8062, 2958, -4698, -9874, -8526, -2394, 4491, 8458, 8131, 3939, -2711, -8278, -9375, -4624, 2587, 8073, 8960, 5147, -1445, -7425, -9334, -5732, 899, 6622, 8825, 6734, 773, -6376, -9873, -7159, -281, 5790, 8436, 7106, 2439, -4326, -9204, -8723, -2678, 4743, 8773, 7715, 3356, -2855, -8162, -9029, -4462, 2974, 8047, 8548, 4738, -1452, -7175, -9303, -5876, 1275, 7231, 8772, 5749, 324, -5728, -9320]
3531i320J878O823O939K701k514n202n708m115J60N579P652M074j297n015n850
3546c215m538j031M191P549N586k5m481n892m827j928K581O720O765J864l841
3561E478o290n084k280J317N435P292L590k502o238n664l192O87M776P034M710
3576I069j249n495o113l768k13L441O827N964N59n195o735m153m17K448N321O387
3592F678K899l476p367n773j167K725M994N448L725j531o123o775k918J831N165
3607a665O089M045p33n413o541l732N13L927N992N530R37m910p210m808L25L769
3623c885M977M841K785k335o926p044j483L898O066M660K150j186n020o589l872
3638h963J747N954O091L380r92m949o180m020O24M149N863M695J018m113p034
$$ y = [-9320, -7442, -619, 6320, 9021, 6507, 1305, -4403, -8518, -8358, -2779, 4873, 8947, 7650, 2635, -3215, -7753, -8784, -4593, 2956, 8542, 8517, 4036, -1856, -6683, -8611, -6030, 690, 7455, 9319, 5478, -812, -5896, -8176, -6859, -1424, 5868, 9458, 6956, 718, -4946, -8138, -7451, -2675, 4359, 9069, 7820, 2325, -3788, -7556, -7769, -4328, 2499, 8463, 9022, 3827, -2908, -7061, -7478, -5030, 291, 6678, 9577, 6101, -1266, -7039, -8206, -5481, -487, 4961, 8686, 7155, 1032, -5743, -8661, -6830, -1665, 4424, 8469, 7736, 2323, -4218, -7950, -7437, -3510, 2482, 8012, 8949, 4039, -3171, -7979, -7654, -3885, 1092, 5933, 8718, 6383, -543, -7587, -9070, -5172, 894, 5554, 7704, 6518, 1498, -5091, -8963, -7216, -1262, 4829, 8209, 7217, 2268, -3912, -7932, -7308, -3159, 2704, 7399, 8417, 4304, -2730]
3653b730n579K70M511N648L969J385j801n629o856k537L497P075N251J224k259
3668E439m518n293l846O57N774O958L458j703n304n719l437K84M288N989M247
3683G274P60m019o629n233m36M681O089M251L70k468n008n581k882K526O926O289
3699F910J394l333n121m551k623N20M825O720M064j519n865o283k734J195M031
3714b370N288M136M93l655o476n267l45M551O213M322K49k964n052m976k267K204
3730e916O281O169K109l371n859m812j875J447M347N626M071p75n716o860k969
3745h103J649M832N200L061M00l283o076n120p07M463O481M372P2l614m746m529
3761e648k102K118N835O175K188l277n873n097j780J968M428N209L459n93n107
$$ y = [-2730, -8309, -8039, -3528, 2120, 6089, 7474, 5673, 44, -6812, -9349, -5852, 1223, 6474, 7698, 5439, 921, -4372, -8218, -7561, -1787, 5171, 8629, 6926, 1622, -4097, -7534, -7250, -2962, 3027, 7274, 8034, 4015, -2614, -7847, -8283, -3602, 2487, 6738, 7108, 4640, -368, -5949, -8831, -6305, 621, 6910, 8304, 4971, -150, -4701, -7324, -6804, -1979, 4741, 8805, 7286, 1421, -4862, -7596, -6401, -2370, 2918, 7054, 7547, 3892, -2584, -7851, -8196, -3645, 2568, 6890, 7139, 4175, -877, -5853, -8120, -5916, 365, 6534, 8643, 5272, -587, -5399, -7274, -5827, -1480, 4146, 8217, 7442, 1726, -5134, -8103, -6454, -1622, 3578, 6639, 7039, 3756, -2320, -7440, -8147, -3684, 2797, 7169, 7241, 3627, -1119, -5648, -7750, -5632, 203, 6378, 8566, 5289, -584, -5681, -7461, -5493, -1065, 4144, 7603, 7010, 1903]
3776A903o436l602J270N288N627K672j96l575n185m730j159M072O730M954j17
3791G516m298n074l730j429J771N176O095K602l047o464n081j312K306M277M988
3806D296K967o12m923o220l395J232M868N877L135q16m097n095l772o27L160O071
3822B049N320P24m622o160l558j50K247M109N221L049k250o562n933j144L056
3837d604M592M144K783n05m485o243l510J301M844N521L172m51m100n719l493
3852f753J33L380N117M537J461l578o632m684J36L498M369L865K164j179n418
3867D16o664k220L554N806M047J395q29l858n574l898J224N270N586K711p05l991
3883B270n385l866L19M109N222L539O70k857n775n199n98M330N443L317O74j667
$$ y = [1903, -4533, -8135, -6865, -1577, 4050, 6722, 6526, 2951, -2234, -6964, -8123, -4051, 2679, 7633, 7516, 3218, -1856, -5586, -7015, -5244, -68, 6027, 8629, 5582, -882, -5963, -7275, -4969, -692, 4296, 7263, 6651, 1728, -4492, -7887, -6655, -1787, 4090, 7225, 6409, 2312, -2783, -6555, -7182, -4022, 2049, 7369, 8093, 3471, -2689, -6247, -6397, -4150, -41, 5180, 8229, 5979, -583, -6516, -7660, -4604, -12, 4132, 6915, 6410, 1925, -4318, -7828, -6527, -1683, 3838, 7010, 6559, 2459, -3260, -6753, -6620, -3240, 1877, 6414, 7875, 4297, -2335, -7019, -6883, -3385, 984, 4849, 7013, 5834, 416, -6248, -8468, -4914, 892, 4939, 6334, 5505, 1647, -3927, -7825, -6601, -1331, 4255, 6966, 6261, 2270, -3115, -6981, -6662, -2553, 2669, 6208, 6878, 4021, -1754, -6953, -7551, -3221, 2222, 5539, 6213, 4546]
3899D546m204n602l080K794O466M916P80k135l737m524l413N33N216O186K576
3914G318j651m057m801l513j83M294N845L421m82l267m594m425j501L516O397
3929B317M141P4l187l993m044k552J592N752N878J472l157m370l987k316L44M320
3945a716O089L126j733m669m546k802k01L539N722M151m03m059m889l257r16K371
3961d193N584N015Q10l665n058l563j269J552M418N513K460k672n139m384j602
3976f193Q19L848N309L620j408m964m945k408P49L073M897M387K06m384n558l176
3992f128J94K679M425M453J437k886n584m100j070K267M475M690K200j967n198
4007a13m770j567J558L878M622L307r30m705n472k354J244L382M283L623O94l658
$$ y = [4546, 342, -5260, -8340, -5546, 920, 5836, 6616, 4481, 744, -3780, -7193, -6660, -1444, 4742, 7318, 5667, 1610, -3191, -6704, -6887, -2593, 3252, 6673, 6191, 2924, -1670, -6095, -7596, -4080, 2317, 6458, 6532, 3345, -648, -4692, -7244, -5652, 100, 5978, 7450, 4293, -77, -4064, -6380, -6036, -1716, 4373, 7499, 5766, 1097, -3449, -6251, -6452, -2913, 2809, 6960, 6557, 2498, -2391, -5648, -6564, -4193, 1391, 6406, 7216, 3551, -1507, -5070, -6339, -4787, -369, 5144, 7604, 4932, -207, -4591, -6193, -5374, -1526, 3783, 7403, 5995, 1031, -3914, -6322, -5573, -2500, 2397, 6784, 6990, 2606, -2952, -6128, -5934, -3255, 1170, 5623, 7060, 4174, -1410, -5510, -6580, -4313, 162, 4852, 7052, 5085, -113, -4883, -6450, -4892, -1014, 3608, 6915, 5985, 1280, -4192, -6546, -5302, -1920, 2363, 5986, 6680, 3022]
4023C022n650l970L07L497M719L588R66k473n015m489j240K589M808M317J791
4038F767k044m929m574j659J768M019M374K709m04m483n730k719J401M386M198
4053C080K532J59k773n185m239l01L858N294L464K31k846m540l926j283K385M718
4069F28M433J717k174n022m644j414K116M153M067K144n69l831n336l256J167
4084e821M863M768K051p35k961m091l712r06L215N598L903J11l486m718l411m79
4100e811K208M068M310J872j980m893m925j495K416M438M039J473j097l351m461
4115c189l385O10M444N543K478j409l855l903k481m59K535M778M371O13l617n339
4131b265l618J55K798L917L372J657j513m476n084j975K704M985L957J130j613
$$ y = [3022, -2628, -6598, -6291, -2794, 1925, 5513, 6479, 4006, -1009, -5498, -6738, -4149, 659, 4976, 6767, 4723, -206, -4780, -6439, -4671, -652, 3722, 6431, 6027, 1544, -4186, -6905, -5504, -1118, 3080, 5612, 5771, 2998, -2187, -6426, -6727, -2869, 2425, 5889, 6120, 3274, -1266, -5192, -6475, -4090, 628, 5061, 6778, 4604, -418, -5062, -6476, -4360, -207, 3860, 6004, 5435, 1604, -3732, -6988, -5821, -958, 3810, 5861, 5126, 2165, -1926, -5638, -6544, -3329, 2269, 6172, 6283, 2797, -1921, -5332, -5811, -3603, 465, 4775, 6647, 4667, -226, -5151, -6646, -4230, 208, 4247, 5720, 4623, 1272, -3189, -6574, -5964, -1520, 4023, 6501, 5092, 1237, -2666, -5147, -5606, -3071, 1707, 6078, 6691, 3074, -2265, -5883, -5728, -2930, 987, 4359, 6016, 4503, 27, -5057, -7032, -4328, 657, 4614, 5744, 4131]
4146D131l335l989k683K06L843N277L146j103m297m507k236O01K784L684L665
4161E187J213k740n577m321L4L650M367K679P25j409l572m747k451K190N280M524
4177E032J141k319l603l674k093L99L548M811L079n27m323m934k733J369L490
4192a337L655K532N60k104m706m608r33M162N365K794n26j933l267l538k423J461
4208d846N185M986J144k714m277l293j572R71L381M418K551p11l897m657k964
4223f295R83M208M306K066o62k334l619l757j362L079N706L900o78l503l419k592
4239c973j241Q43M188N117J854k770m884l588q89J440L233M113K414r43l932m411
4255c429k606Q44L700M680K584r47l366l668k547o32K125M823M358L24l805m608
$$ y = [4131, 796, -3193, -5876, -5670, -1827, 3450, 6596, 5493, 1196, -3311, -5547, -4946, -2162, 1522, 5187, 6400, 3660, -1917, -6238, -6204, -2554, 1813, 4492, 5217, 3808, 236, -4511, -6962, -4772, 508, 5032, 6173, 3854, 251, -3423, -5516, -5117, -1569, 3242, 6321, 5794, 1471, -3463, -6196, -4827, -1337, 2318, 4850, 5410, 3306, -1400, -6008, -6941, -2779, 2586, 5380, 4854, 2921, -346, -3884, -6307, -4846, 339, 5325, 6469, 3755, -522, -3815, -5387, -4416, -1035, 3383, 5934, 5223, 1326, -3331, -6295, -5312, -1104, 3202, 5268, 4606, 2272, -1347, -5104, -6466, -3387, 2319, 6219, 5541, 2038, -1381, -3973, -5214, -4371, -183, 4934, 6788, 4018, -866, -4454, -5343, -3903, -670, 3443, 5857, 4914, 982, -3429, -6035, -5191, -1491, 3189, 5773, 4826, 1460, -2208, -4755, -5387, -3262, 1561, 5919, 6243, 2438, -2170]
4271b170k460j39J542L028M375K313k083n103m235p24K201L112L621K370o95m011
4287I42m538k148R93L327M272K967m75l764m421k175L46K313L583L827J088k880
4303C257n349l296L71K494L147L041J992j071m709m701j363K666L851L124J665
4318E119n29l264m721k566J230L746L913K134r7k827m712l103N02L233L840K814
4334D712O92k118m497m086n14L056M102K739R19j146l694m399k100K188M694L510
4350D058R79j067k931m102k553N89M252M136J766p02k710l794l167l82L405M652
4366B429K692k83k341l513l574j083K322M619L586K81k158l298l496j743J455
4381d105M102M177J208j555l356l539k174L21L637M768K056j210l169l255k618
$$ y = [-2170, -4630, -4769, -3227, -199, 4176, 6489, 4406, -697, -4932, -5656, -3455, -343, 3278, 5648, 4953, 942, -3596, -5744, -4751, -1424, 2848, 5815, 5340, 1576, -2845, -5020, -4674, -2361, 1222, 5049, 6137, 3257, -2092, -5388, -5017, -2523, 624, 3665, 5657, 4586, -123, -4824, -6187, -3521, 330, 3454, 5119, 4590, 1326, -3395, -5961, -4731, -985, 2928, 5062, 4965, 2138, -2574, -5677, -5175, -1942, 1898, 4712, 5404, 3286, -1211, -5297, -5811, -2755, 1347, 4086, 5005, 3859, 165, -4234, -6334, -4146, 548, 4058, 5037, 3970, 1039, -3063, -5616, -5027, -775, 3361, 5127, 4425, 1715, -2079, -5246, -5628, -2223, 2429, 5121, 4838, 2497, -1016, -4590, -5673, -3351, 1268, 4854, 5135, 2977, -321, -3817, -5560, -4105, -3, 4174, 5382, 3827, 471, -3068, -5242, -4921, -1284, 3484, 5540, 4330, 1161, -2094, -4712]
4396d712m59K665M669L369m29l203l709k384p42J831L815M087Q75k526m042l242
4412d137r84J515L586L778J789j607l843l496j730P78L276M346K316j086l785
4427G16l559j891K71K293L996L496J31l535m353k296L39J887L460L185J320k146
4443C314m318l658n81K166L753L211J121j283l633l599j627R77L528L944K151
4458E466j030l791l822j722Q56K510L358L006M70l088m729k780N91K876L405K350
4474C926Q55j417l890l918j247K504M244L064Q29j745l124l298j883P69L672L897
4490C238K121r88l643l992j693J018K793L117K571M03k540m311l358K85L340L820
4506B181J979J47j617l226l475j456J956M291L753P38k338l588k760j183Q48K937
$$ y = [-4712, -5171, -2506, 2163, 5532, 5103, 1900, -1809, -4193, -4935, -3104, 711, 4798, 5673, 3147, -895, -4137, -5121, -3606, -20, 3758, 5547, 3940, 97, -3399, -5129, -4351, -1075, 3271, 5587, 4501, 716, -2843, -4734, -4463, -2170, 1826, 5322, 5453, 1918, -2435, -4731, -4392, -2505, 955, 4140, 5460, 3314, -1004, -4662, -5243, -3077, 676, 3887, 5008, 3725, 92, -3507, -5134, -4157, -629, 3315, 5466, 4436, 645, -3177, -4899, -4043, -1533, 1825, 4831, 5301, 2213, -2516, -5296, -4705, -1829, 1576, 3926, 4781, 3364, -526, -4444, -5691, -3187, 1057, 4121, 4950, 3205, 81, -3217, -5100, -4331, -659, 3238, 5359, 4371, 728, -3264, -4957, -3939, -1146, 1971, 4542, 4945, 2405, -1906, -5264, -4979, -1639, 2181, 4160, 4307, 2690, -536, -4011, -5467, -3511, 780, 4533, 5271, 2933, -655, -3415, -4598, -3750, -813]
4522h13L819K250q06l781m107j581J170L013L108K128K5k288m007l108j36L074
4538b040M272K387k40k120l187k831j001J324L773L972J178k354l910k978q62
4553d617J617K584L112K158m26l311m359k190J363L521L109J588k19k002l475
4568a547l011m17K739M193K825k65k699l166k513n45J447L348L492J365j688l984
4584d26l671p79J974L140K727J318l64k615l908k732Q55L849L647J402q79k130
4600A408k918k539p18K417M146K973j23k687l599k357m25K010L045K866J221j342
4616C378l523l613j523J956L810K980P11j099k183l315k254K4L598M281J833j484
4632C577k809k679k066k71K158L560L039K13k721l634k569k73K274L253K536Q12
$$ y = [-813, 3006, 5256, 4450, 669, -3438, -5019, -3849, -836, 2272, 4400, 4425, 2137, -1870, -4978, -5114, -2040, 2232, 4619, 4379, 2259, -928, -3759, -4760, -3436, 337, 4309, 5487, 3133, -777, -3755, -4617, -3000, -416, 2696, 4854, 4428, 1117, -3242, -5432, -4069, -548, 2561, 4149, 3930, 1928, -1547, -4558, -4975, -2236, 1957, 4782, 4517, 1818, -1348, -3861, -4406, -2959, 389, 3881, 5246, 3558, -426, -4097, -4876, -2902, 238, 2965, 4283, 3919, 1304, -2604, -5336, -4481, -632, 3015, 4417, 3538, 1408, -1510, -4049, -4767, -2350, 1796, 4769, 4646, 1959, -1640, -3997, -4422, -2412, 633, 3499, 4720, 3378, -145, -3758, -5281, -3325, 485, 3465, 4176, 3077, 894, -2421, -4675, -4651, -1053, 3228, 5061, 3577, 768, -1911, -3977, -4248, -2090, 1470, 4509, 4722, 2001, -1633, -4202, -4475, -2201, 1052, 3588, 4400]
4648D400j656l094l091j432J399L837L368R84j775l008k443j565J05K564M169
4663B762K443j183l480l256j297M25J913L111K841L23k672l614k550j68K173L267
4679A038K816N74j956l202k592j138J229L158L664J416j823l608k717r16Q67K231
4695i59L333K489n92l457l727j575R72K291L078K071L22k434l641k276l2K064
4711b073L298K603O02k040l408k639m87J586K767L033J452j392l582l337p04J418
4727b903K562K767J781j47l117l721j886J095K812K822J788K47k387l584k479
4742d350K00K466L021K451M08j823l404k922l20K024K900K510J087j277l029l363
4758c421j194J607L118K804J177p53k504l353j987Q73K854L159J615k79k145l356
$$ y = [4400, 2744, -350, -3441, -4873, -3474, 363, 3731, 4715, 2940, -68, -2511, -4076, -3971, -1407, 2762, 5205, 4022, 542, -2714, -4011, -3586, -1673, 1438, 4279, 4602, 1930, -1684, -4234, -4402, -2229, 1038, 3854, 4428, 2472, -730, -3322, -4460, -3231, -73, 3591, 5007, 3184, -424, -3141, -4057, -3190, -959, 2374, 4863, 4271, 814, -2913, -4488, -3516, -1225, 1853, 3924, 4246, 1812, -1829, -4105, -4137, -2073, 1225, 3828, 4430, 2390, -1018, -3657, -4144, -2558, 209, 3242, 4694, 3302, -280, -3617, -4321, -2903, -341, 2426, 4207, 4060, 943, -2778, -4664, -3569, -757, 2065, 3853, 4100, 1713, -1871, -4350, -4150, -1684, 1337, 3788, 4196, 2373, -1031, -3953, -4273, -2249, 651, 3161, 4248, 2971, -58, -3421, -4615, -3008, 110, 2914, 4091, 3338, 834, -2519, -4506, -3633, -779, 2380, 3995, 3716, 1571, -1785]
4774a785k412L6K608L250K001J0j522l059l014n57K141L383K408M72j374k714
4790a28l063j270J362L202L057J067r71k684l210j676Q10K806L215J600n52k270
4806A295l041k279j33K628L510J980l72j829k673k494q14J609L533K915L64j898
4822B301k845k518q58R86K966K949J274j053k928l005j462Q34K803L034J526o14
4838C390k519k705k111J28K233L432K370n81k361k646k059l29J344L141L017O71
4854D415k059l338k399n04J482K540K591J202p91k658l364j439J111K948K909
4869B646J197q34k285k653j835rK278L300K385l34k528l046j810J0J576K742K484
4886C284R33j653l322k892m72J942K788K193P99p95k362l128j574Q83K984L182
$$ y = [-1785, -4197, -4161, -1553, 1697, 3698, 3708, 2186, -873, -3887, -4444, -2303, 1080, 3488, 3960, 2586, -128, -3191, -4461, -3099, 103, 3160, 4227, 3256, 572, -2638, -4314, -3504, -698, 2517, 4117, 3565, 1295, -1746, -4025, -4158, -1530, 1980, 3960, 3588, 1759, -914, -3408, -4222, -2613, 920, 3835, 4199, 2301, -544, -3062, -3920, -2934, 32, 2981, 4255, 3202, 274, -2731, -4193, -3359, -556, 2478, 4004, 3390, 871, -1834, -3945, -3817, -1584, 1848, 4218, 3637, 1276, -1370, -3429, -3758, -2414, 727, 3744, 4415, 2356, -982, -3381, -3885, -2403, 137, 2728, 3930, 3139, 481, -2883, -4322, -3211, -263, 2646, 3843, 3009, 724, -1929, -3764, -3773, -1495, 1805, 4190, 3856, 1328, -1718, -3528, -3518, -1942, 800, 3284, 4217, 2564, -758, -3650, -4122, -2180, 608, 2801, 3600, 2805, 443, -2685, -4259, -3376, -392, 2790]
4902B790J368j156k467k596j345j3J812L207K435j0k633l248k027M39J808K638
4918A002K037Q13j508k830k920q69J756L348K341M11j238k266k360j539M14K590
4934h18L626J497j300k876k435j117M13J745K671K418J20k435l444j900L27K087
4950a421K656J894N19j509k702k547j007J630L059K833M21j660k490k212r70O62
4966b844K019L161J921r20l068l113p81J089J786K124K015L76j936l651k275L31
4982c766K545K797J625J93j582k475k468p21J510K898K698P29j698k984k246o30
4998c575J222K069K287J834m50k836l538j096J315K517K069J269K26j713k948
5013a348k549k9K715L018J704m34j538k348k203o35J464K757K517Q33j529k765
$$ y = [2790, 4158, 3002, 535, -2061, -3406, -3419, -1607, 1600, 4035, 4025, 1392, -1856, -3883, -3444, -1636, 1002, 3039, 3852, 2344, -486, -3406, -4275, -2519, 829, 3170, 3581, 2343, 77, -2283, -3822, -3408, -818, 2808, 4305, 3005, 129, -2306, -3423, -3010, -1265, 1406, 3824, 3944, 1509, -1935, -3835, -3508, -1421, 1235, 3129, 3648, 2139, -563, -3110, -4117, -2487, 572, 3405, 3826, 2166, -324, -2536, -3506, -2844, -825, 2336, 4257, 3337, 269, -2844, -3625, -2536, -750, 1374, 3389, 3765, 1829, -1822, -4097, -3766, -1221, 1576, 3201, 3394, 1812, -663, -3131, -3852, -2342, 556, 3254, 3983, 2285, -699, -2945, -3575, -2353, -284, 2003, 3837, 3387, 551, -2987, -4083, -2768, -251, 1818, 3087, 3313, 1600, -1348, -3897, -3926, -1211, 1807, 3511, 3077, 1539, -809, -3012, -3647, -2183, 574, 3091, 3924, 2395, -370]
5029c70k709n72J345K524K167J089l90k316l152j694Q98K912K538Q35n42j353
5045A210k351k397k74K217L486J872o31j937k182j906m66J202K768K510O09j700
5061B030k596k314p45J373K565K318O53p59k105k470j750M60K892L008J083r93
5077B650k085k043j525l97J634L300K278k69k496k392j474j43J005K467K613O36
5093C759j528k867k284o53J277K315K558R18j129k230k285j110L98K045L018J707
5109C909q36k680k369j033K20J343K466K392K24k340k936j664L32J463K022K188
5125B701R14j257l011k380l25J295K348K191J031j080k277k660q38P35K203K285
5141A875J658m42k415k723j264O35J725K145J758O05j959k907k149K99J856K258
$$ y = [-370, -3079, -3651, -2306, 218, 2385, 3474, 3084, 768, -2384, -4078, -3180, -268, 2270, 3105, 2563, 1210, -1141, -3538, -3812, -1595, 1891, 3763, 3132, 1195, -987, -2893, -3359, -2157, 611, 3121, 3730, 2030, -566, -2880, -3625, -2252, 313, 2631, 3284, 2525, 420, -2050, -3800, -3340, -448, 2560, 3643, 2650, 565, -1478, -3003, -3400, -1766, 1534, 3812, 3543, 1047, -1345, -2819, -2962, -1957, 510, 3123, 3759, 2231, -636, -2920, -3573, -2296, 19, 2577, 3495, 2366, 136, -2149, -3259, -2861, -816, 2202, 3909, 3073, 393, -1976, -3009, -2789, -1446, 1020, 3412, 3636, 1296, -1640, -3304, -2972, -1509, 513, 2701, 3615, 2358, -653, -3033, -3358, -2063, 285, 2476, 3507, 2427, 150, -2510, -3348, -2613, -410, 1875, 3533, 3091, 676, -2047, -3311, -2676, -951, 1194, 2952, 3557, 1598, -1309, -3458, -3159, -1303, 955]
5157I55J659O82j220k551k455p02J576K536J990P57p94k355k565j122J106K205
5173b98K285J150l65j975k580j677O07K181K376J286j32j358k732k064j2J968
5189a340K592J611K01j394k216k399m79J329K742K109M74j055k251k242j230J023
5205b525K466K285R34o05k061k281j498L45K182K621J251m21j570k570j655l1
5221c133J809K700J682j51j303k349k045n24J469K475K223K39j193k162k152r03
5237c318Q67K466K394R63j042k196k096j102L43K062K413J527m72k112k397j336
5253c036M6J935K310J798j30j708k147j925m24J512K655J938K81j323k148j925
5269b291p50Q84K242K293J082j088k406k125r49P58J943K193J243k90j926k544
$$ y = [955, 2614, 3296, 2076, -475, -2930, -3632, -2056, 480, 2470, 3227, 2433, 78, -2487, -3609, -2503, -298, 1987, 3137, 2772, 797, -1783, -3460, -2853, -672, 1704, 2990, 2858, 1500, -1232, -3296, -3308, -1340, 1252, 2863, 3064, 1670, -546, -2945, -3424, -2095, 647, 2756, 3230, 2175, -76, -2318, -3548, -2525, -59, 2226, 3160, 2555, 494, -1787, -3285, -2940, -758, 1863, 3114, 2693, 1123, -1447, -3102, -3133, -1324, 1376, 3058, 2907, 1604, -745, -2790, -3314, -1845, 630, 2853, 3092, 1899, -263, -2415, -3318, -2451, 15, 2409, 3372, 2330, 134, -1962, -3064, -2721, -659, 1754, 3281, 2809, 697, -1700, -3036, -2990, -1055, 1255, 3053, 2923, 1215, -932, -2857, -3281, -1769, 886, 2824, 3105, 1782, -366, -2291, -3041, -2157, 85, 2378, 3460, 2372, -34, -2159, -3108, -2350, -407, 1786, 3029, 2739, 813, -1731]
5285a731j482M53J921K326J416j41j492k334j702l39J487K476K031K43j485k397
5301g50j852k44Q24K187K051J100j073k298k219r06Q70K116K215R77m40j746k289
5318a477j621J91K027K580J246m35j627k056j543j33J216K436K123K82j596k566
5334i53j674k94J214K020K006Q06r61k242k285q93J126K292J960Q09o58j833k030
5351a590j367K7K157K491J463o24j975k053j173J7J248K163K043L34j627k456
5367i22j879j41J439K163J572O79r68k099k110q60Q32K254K345Q36q80k163j921
5384a823r12L71J485K339J609k22k198k379j105M09J580J820J561K77j199k515
5400i02k012n8J565K197J657L89j040k081k038p94J084K049K150J068j061k297
$$ y = [-1731, -3213, -2760, -839, 1487, 2903, 2762, 1270, -1064, -2766, -3105, -1618, 858, 2889, 3132, 1647, -750, -2602, -2846, -2022, 165, 2216, 3316, 2243, -55, -2274, -3180, -2310, -194, 2021, 2998, 2558, 812, -1477, -3098, -2907, -880, 1700, 2946, 2511, 884, -1172, -2715, -2848, -1632, 804, 2927, 3209, 1613, -953, -2627, -2921, -1707, 313, 2319, 3125, 2164, -78, -2363, -3256, -2130, 162, 2122, 2931, 2273, 440, -1590, -2957, -2930, -773, 1718, 3181, 2557, 582, -1471, -2644, -2627, -1379, 784, 2827, 3161, 1534, -922, -2801, -2942, -1503, 660, 2232, 2911, 1943, -156, -2266, -3126, -2294, -40, 2305, 3141, 2261, 98, -1823, -2735, -2364, -879, 1460, 3069, 2847, 649, -1730, -2835, -2426, -846, 974, 2535, 2812, 1613, -902, -2914, -2972, -1407, 790, 2447, 2836, 1796, -285, -2323, -3117, -2033, 16, 2166, 3234, 2173, -124]
5416a24j950o18O88J475J900J531k34j795k555j526Q51J882J693J227J85j276
5432A354k232j970k29J685K377J482K64j145k141j705n66Q87K058K077Q49p45
5448B300k301k319p33J051J804J771J058j92j488k488j728N83K147K204Q91k21
5464B339j108k136j643l50J490K380J713lj294k058j739m51J100K027J866P42
5480B875q91j801k324q74Q93K284J808Q03n62j528k069j438J16J978K467J111
5496B848n45j451j843j518k87J282K507J763J12j648j938j581m43J076K050J894
5512B278O30j093j986j621j022P64J946K053R58q56j804j696j156J51J489K475
5528A510J363l12j936j975j062p5J074K196J883J73j475k191j580j68Q57K106
$$ y = [-124, -2074, -2692, -2004, -529, 1371, 2902, 2668, 873, -1682, -3208, -2357, -475, 1218, 2445, 2630, 1354, -878, -2848, -3077, -1392, 985, 2467, 2731, 1586, -555, -2260, -2826, -1939, 119, 2196, 3045, 2300, -1, -2320, -3053, -2002, -198, 1573, 2631, 2439, 951, -1537, -3265, -2682, -535, 1669, 2560, 2339, 1231, -905, -2548, -2898, -1408, 972, 2685, 2682, 1388, -670, -2409, -2860, -1760, 267, 2133, 2875, 1984, 183, -2141, -3015, -2122, 162, 1970, 2773, 2211, 683, -1386, -2824, -2708, -730, 1737, 2848, 2303, 852, -991, -2509, -2796, -1514, 993, 2756, 2868, 1220, -718, -2299, -2742, -1666, 384, 2278, 2908, 1815, -171, -1792, -2814, -2050, -104, 1949, 2907, 2051, 247, -1449, -2605, -2454, -965, 1510, 2873, 2561, 625, -1350, -2412, -2487, -1413, 783, 2666, 2839, 1364, -827, -2407, -2575, -1718, 388]
5544C88J840O26j024k022j739q23P89J641K218Q91p31j841j925o95J77J452K009
5561A231J647l17j834k183j164L91J227J952J428L14j339k182j610k41J182J947
5577D49J682O31r22k021k023l87Q66J665J906Q09m69j971k033q78O69J588J819
5594A380J207k04j613k059j318J66J677J809J426J78j326k181j631j74J216K044
5610E97J461N88q75k025j849p47J088J879J725O25n13j541j962j235N76J823J932
5627A547R47k80j492j878j332j8J425K157J319J08j301k000j488k44J278J843
5643E91J410N15q79j839j995n38Q55K062J716N67n76j633j877j015L91J796K002
5660A553J082m34j771j612j254J22J452J930J248J51j302k088j431j84J406J839
$$ y = [388, 2228, 2854, 1830, -192, -1931, -2754, -1965, -324, 1894, 2785, 2054, 213, -1712, -2407, -2230, -778, 1231, 2878, 2561, 727, -1456, -2620, -2229, -1002, 950, 2378, 2692, 1353, -829, -2439, -2680, -1498, 449, 2131, 2762, 1840, -181, -2204, -2591, -1725, -60, 1846, 2655, 2186, 215, -1818, -2696, -2027, -439, 1380, 2587, 2383, 770, -1289, -2607, -2441, -764, 1045, 2471, 2649, 1323, -858, -2489, -2663, -1447, 597, 2058, 2646, 1771, -254, -2103, -2850, -1762, 117, 1842, 2467, 1954, 413, -1549, -2784, -2208, -385, 1547, 2494, 2214, 722, -1156, -2488, -2506, -1081, 1076, 2395, 2503, 1202, -798, -2286, -2530, -1252, 591, 2001, 2516, 1637, -202, -2197, -2735, -1880, 182, 1898, 2465, 1889, 256, -1621, -2636, -2245, -449, 1553, 2635, 2201, 430, -1182, -2436, -2314, -862, 1068, 2316, 2467, 1165, -923, -2354, -2538, -1132, 707]
5676G07J357L93r89j794j735n53R66J936J674O80r58j757j596p52M68J458K008
5693A513J058l35j868j935r16K82J506J694J161L00j381k092j334k05J594J799
5709H41J348J05r25j729j654o32J018J882J851N09r00j805j666o60O69J579J655
5726A486J046m11j622k017r56K87J650J758J071k1j241j832j597j03J341K117
5742I56J506k10j152j588j411o19Q36J806K004N64j021j837j608n12N02J597J776
5759A589R07m07j773j724j106K78J809J870R47l80j292j639j071l48J170K227
5775A057J411k76j242j746j174j84P56J617J734Q43j110k045j597l22P64J532
5791A8J579P28m20j659j786r63M22J580J948J076n25j555j541r39p6J029J825
$$ y = [707, 2064, 2457, 1468, -326, -2061, -2614, -1648, 288, 1962, 2642, 1684, -73, -1669, -2421, -1953, -495, 1513, 2571, 2236, 368, -1567, -2483, -2201, -695, 999, 2160, 2460, 1079, -1013, -2347, -2552, -958, 841, 2189, 2294, 1369, -360, -2014, -2646, -1628, 254, 2105, 2614, 1714, -91, -1757, -2417, -1748, -169, 1486, 2532, 2121, 499, -1518, -2474, -2187, -537, 1221, 2292, 2271, 1030, -802, -2399, -2502, -1161, 956, 2462, 2252, 1100, -488, -1899, -2518, -1682, 124, 2128, 2692, 1671, -166, -1774, -2286, -1784, -187, 1589, 2496, 2089, 316, -1408, -2514, -2236, -427, 1443, 2390, 2010, 718, -921, -1992, -2340, -1170, 1057, 2468, 2192, 950, -796, -1970, -2154, -1398, 219, 1953, 2796, 1686, -359, -1956, -2278, -1514, 18, 1597, 2325, 1905, 246, -1540, -2503, -2081, -501, 1447, 2523, 1998, 443, -1098, -2037, -2113, -1084, 741]
5808G41J593J82j530k077j042M5Q74J514J379P10o40k076j855m20J253J604J370
5825A625P06n09j626j737q95M75J481J766J177l69j699j752q15L51J049J559J356
5842B143K29j162k207j442K04J318J506J110M68n41j697j884n92J089J898J346
5858A786L94n95j392j606r95N22J557J786P89j70j509j922q97K80J435J524Q82
5875A869K95r88j876j662P8J364J768J026L0p79j268j659o51P57K075J478L74
5892B231p27j457j412q51M69J468J730Q49l73j501j672j061L44J415J803Q74l23
5909A806q53j568j578j98J238J836J392L8j028j440j317n88N83J887J778K74p37
5926A525j640j422o43L91J617J647Q24m93j411j599r31L44J224J710J127m14j183
$$ y = [741, 2334, 2516, 986, -1091, -2133, -2088, -1214, 300, 1679, 2389, 1749, -327, -2182, -2602, -1349, 255, 1625, 2331, 1822, 196, -1541, -2436, -1961, -480, 1286, 2463, 2094, 395, -1357, -2172, -1821, -772, 787, 2143, 2372, 1210, -997, -2439, -2235, -917, 589, 1699, 2167, 1626, -71, -1955, -2547, -1458, 440, 1786, 2180, 1585, 193, -1413, -2408, -1886, -329, 1457, 2246, 2076, 567, -1355, -2252, -1972, -537, 987, 1869, 2164, 1176, -700, -2362, -2284, -920, 848, 1874, 1904, 1125, -143, -1802, -2453, -1696, 379, 1857, 2231, 1504, 47, -1365, -2216, -1747, -279, 1451, 2300, 1927, 426, -1246, -2307, -1963, -548, 1255, 2129, 1806, 953, -615, -2193, -2391, -1153, 683, 2075, 2113, 1085, -355, -1672, -2260, -1677, 210, 1988, 2262, 1525, -115, -1537, -2180, -1789, -172, 1475, 2299, 1806, 395, -1204, -2135, -1791, -567, 1143, 2270, 1856, 673]
5943F73j443j171j37J084J704J390J24j201j655r39n08O45J570J585O14q48j709
5960b22j506l33M73J439J667P37m59j596j450q53K74J283J650R93j47j306j542
5977h98j164J41R35J718J360J32j175j756j187j84Q75J432J563N82r27j726j290
5994a569n85P14J416J442P61n27j504j518p78L92J315J578Q16l3j275j711j117
6011b183J39J237J576J142K05j039j730j236j16R21J598J216M44r53j437j555
6027a771l79P94J398J437P39o44j367j700o58N66J317J494O79p6j201j722r20
6044b014N6J361J567R49n6r65j659j007l90J083J515J349L00r27j580j271l55
6061b044P37J442J312P55p24j378j584p39N43J636J451N52k58j296j307j138Q1
$$ y = [673, -770, -1941, -2078, -994, 710, 2100, 2224, 1023, -632, -1571, -2079, -1434, 136, 1721, 2335, 1487, -222, -1728, -2061, -1588, -149, 1518, 2255, 1796, 200, -1250, -2103, -1829, -546, 1104, 2097, 1950, 644, -898, -2062, -1921, -986, 732, 2092, 2224, 1049, -707, -1894, -2078, -1203, 229, 1792, 2374, 1447, -279, -1569, -2154, -1440, -24, 1418, 2179, 1652, 148, -1370, -2148, -1756, -441, 1137, 1953, 1920, 645, -1066, -2183, -2044, -807, 769, 1911, 2116, 1077, -653, -1889, -2005, -1084, 514, 1730, 2174, 1221, -216, -1771, -2150, -1356, 42, 1479, 2218, 1574, 207, -1493, -2151, -1585, -268, 1226, 1905, 1829, 628, -1094, -2014, -1958, -597, 970, 1919, 1863, 898, -761, -1768, -2158, -1075, 440, 1789, 2089, 1162, -418, -1689, -2044, -1307, 135, 1447, 2202, 1478, 100, -1484, -2223, -1680, -44, 1407, 1959, 1701, 405, -902, -2040, -1959]
6078a959J246J678J184l05j000j746j103L6R54J568J253M07j022j666j355k44
6094b074R82J358J207N16n09j488j469o53N37J576J352P32n50j202j402q67L31
6111a623J053J604J016j62j133j670j109K72R53J311J185K67o97j658j475l41
6127b207J091J458J173L25n40j270j484o77N32J617J525N67n04j347j519o74K12
6144a722J069J588R05P0j213j543j170K8J362J435R29O7o04j552j327n27J108
6161a097J566J206K56q26j387j020n84M20J371J641N75m91j471j405o04K54J333
6178b63J195R23j14j044j667j047J68J228J508R41j20r06j235j140n07Q09J642
6195C71J453J65r55j335j112l55M87J085J572Q78o42j770j264n57L91J350J460
$$ y = [-1959, -713, 965, 2149, 1844, 844, -902, -2005, -1969, -1015, 553, 1806, 2213, 1191, -475, -1830, -2074, -1092, 266, 1473, 1989, 1480, -8, -1477, -2130, -1593, -17, 1335, 2067, 1517, 315, -1087, -1954, -1623, -570, 1034, 2050, 1888, 755, -915, -2024, -1752, -799, 512, 1697, 1964, 1267, -391, -1866, -2207, -1116, 342, 1515, 1840, 1300, 30, -1454, -2131, -1599, 18, 1543, 2110, 1606, 259, -1260, -1934, -1722, -653, 935, 1840, 1910, 697, -846, -2016, -1988, -626, 809, 1738, 1805, 1201, -351, -1678, -2205, -1097, 469, 1675, 1931, 1105, -282, -1302, -1886, -1466, -95, 1546, 2121, 1630, 159, -1246, -1850, -1596, -263, 932, 1855, 1741, 697, -970, -2017, -1849, -621, 887, 1828, 1708, 802, -433, -1573, -2080, -1271, 371, 1824, 1989, 1034, -301, -1413, -1768, -1281, -196, 1376, 2254, 1612, -158, -1422, -1979, -1588, -238, 1222]
6212A222P02k84j159j526q49N5J167J734Q51n5j356j212q40k62P52J470J466K79
6230B155j021j748j085o7O45J129J389O61m15j621j481m48M90J248J289O85l21
6247A484j102j544o83K89Q30J562J167m5j255j554q79J49O98J303J162M92q33
6264A241j717j303l8R22J149R63N79l16j340j525o12P13J278J276N19k55j172
6281C62j293q59L02R31J377Q81J60j097j551j064J75J067J157R08K55n41j487
6298c17j454k31R69J434R66K72n09j078j259p65N57J397J310M89m58j139j123
6315i39q96K78J385J187Q34j79j120j364j058J10J107J451O89O3o01j311j097
6332a461m01Q55J465J201R6p64j215r76o31N88J315J170N96o24j231j085o57K89
$$ y = [1222, 1924, 1640, 481, -1045, -1894, -1839, -672, 1062, 1913, 1858, 502, -710, -1550, -1812, -1060, 410, 1876, 2155, 1134, -614, -1699, -1766, -1121, 8, 1397, 2058, 1643, 22, -1459, -1907, -1417, -169, 1120, 1805, 1484, 382, -1162, -1845, -1556, -726, 836, 2003, 1958, 703, -851, -1730, -1581, -883, 420, 1582, 2074, 1241, -476, -1779, -1817, -895, 254, 1217, 1796, 1480, 140, -1385, -1997, -1284, -6, 1270, 1789, 1534, 362, -931, -1790, -1488, -557, 820, 1701, 1861, 764, -787, -1851, -1676, -609, 548, 1456, 1711, 1170, -317, -1771, -2002, -1033, 401, 1367, 1639, 1130, 52, -1207, -1972, -1415, -18, 1292, 1781, 1323, 184, -939, -1835, -1557, -172, 1015, 1849, 1670, 550, -814, -1872, -1762, -655, 796, 1485, 1548, 947, -364, -1461, -1862, -1007, 458, 1659, 1755, 991, -224, -1200, -1831, -1243, 72, 1242, 1838, 1214, -17, -1102, -1759, -1470]
6350a470J216J242Q23m27r15j189j036Q0J066J395Q08lq28j245j068k03O21J348
6368B15J312K94r37j115j111l88M92J214J155P17n34j247j157p01M31J019J342
6385A001P84k05j204j214r48J64R87J332R67kj046j096j036p8O92J244J327N6
6403A725p56j247j040m36O33J140J094O38m11j415j177m33L63J207J145P27k41
6420A516j202j333p11L17Q92J318Q49o2r63j178j074N0Q40J179J083J14o15j344
6438c24j087k76N86J259J087L63m14j240j137n85O19R52J278N91k79j198j191
6455i96o89K93J037J180Q06j48r65j161q89K1P37J323R44J24p42j343q34j84N76
6474i10J202R74N42p50j158j132m95M85J278J057M73k47j010j344n89K39J081
$$ y = [-1470, -254, 988, 1811, 1384, 469, -720, -1756, -1676, -610, 785, 1593, 1590, 762, -483, -1551, -1754, -1133, 215, 1527, 1821, 884, -231, -1342, -1730, -1238, -24, 1131, 1848, 1314, 67, -1090, -1791, -1360, -341, 1001, 1785, 1580, 376, -838, -1786, -1622, -635, 697, 1664, 1662, 616, -480, -1516, -1594, -902, 342, 1669, 1725, 969, -278, -1318, -1754, -1121, 19, 1113, 1751, 1340, -75, -1252, -1685, -1322, -115, 1030, 1757, 1516, 314, -1019, -1730, -1413, -521, 797, 1646, 1584, 621, -557, -1631, -1581, -741, 438, 1521, 1635, 1020, -324, -1411, -1687, -1101, 158, 1245, 1608, 1194, -46, -1183, -1768, -1149, -197, 1081, 1672, 1393, 195, -996, -1685, -1392, -355, 825, 1631, 1483, 518, -643, -1532, -1511, -774, 549, 1493, 1617, 875, -468, -1302, -1486, -910, 292, 1266, 1808, 1058, -100, -1232, -1727, -1242, 36, 1093, 1566, 1319, 309, -1035, -1624, -1385, -304]
6491c04J156P61j74j058j191o43j01R06J344Q33O5r25j130r84k07Q25J168R46
6509A287M31p07j164j212l34N42J228J128M79l97j004j245o76J88J158J293N75
6526A570j89j012j245o40O5R11J114R80L6q22j285q56k16P96J153R28K74n28j163
6545a29j225l50O33J137J069L49l17r11j404n51M08J115J191O33l05r17j193p38
6563a505J07R26J123P23P0p44j246r00r9Q31J194Q62J81m84j309q98m59N56J105
6582C4J256L36n16j105r84o18J93J244J056P74m68r77j014p35N7Q70J285Q24p9
6601A433p82j166r89m3Q62J238Q89M0p58r90q78l85M13J473R49L65q46j010q67
6620a052n92M77J030J133O34k73j153j091o69K29Q24J243P34j36p63j245o92j
$$ y = [-304, 852, 1613, 1439, 381, -810, -1453, -1554, -648, 696, 1529, 1594, 669, -461, -1445, -1652, -827, 341, 1287, 1718, 1011, -153, -1365, -1699, -1157, 71, 1199, 1678, 1281, 277, -968, -1644, -1456, -298, 995, 1570, 1381, 369, -876, -1516, -1451, -540, 574, 1554, 1590, 768, -517, -1373, -1589, -793, 360, 1288, 1562, 1034, -129, -1354, -1704, -1071, 66, 1135, 1484, 1167, 256, -1148, -1699, -1291, -176, 1015, 1648, 1343, 426, -767, -1505, -1398, -472, 651, 1374, 1444, 700, -546, -1446, -1545, -714, 480, 1342, 1523, 1039, -270, -1168, -1627, -1071, 34, 1290, 1626, 1110, 5, -979, -1597, -1404, -160, 896, 1670, 1202, 225, -789, -1524, -1467, -597, 688, 1512, 1433, 651, -515, -1504, -1547, -685, 553, 1442, 1482, 724, -266, -1144, -1529, -1116, 357, 1306, 1671, 825, -185, -1052, -1644, -1167, -137, 996, 1630, 1357, 204, -887, -1556, -1327, -503, 740, 1474, 1338, 575, -670, -1362, -1363]
6638a363N59J357Q44O4p28j030r53k83N45J188J148L57o37j268r80k47M18R17
6656i2J070O32l27j169j077n41K25Q51J143O99q2q22j167q31P1P02J321Q41N7
6675A504n86j313q85j88O52R77J043L49m68j339r27l29M63R36J024O17l13r72
6693B45j133n62K19J008R43O59q1r52j030p05p0R25J072P66J97q74j166r44n4
6712a537Q64J008R57J56k88j357j088l64P25Q92J168L89l46j150r08o83K77J071
6730b14J094N44k27p14j247n91n8Q85J196O50Q2p45r72j109l7P83J044R43P1m58
6750I20j040r59m83M83J186J085K59l84r04j024p49M39R17J072O41k56r01j030
6768g28o68mR31J017Q42J0p54j179q40kO92J145Q72K2o26j016r40k96N60J033
$$ y = [-1363, -804, 553, 1397, 1461, 733, -297, -1250, -1533, -988, 200, 1348, 1705, 1068, -200, -1180, -1427, -1009, -92, 978, 1610, 1283, 114, -963, -1504, -1279, -428, 715, 1414, 1332, 510, -657, -1488, -1417, -715, 606, 1447, 1504, 918, -395, -1280, -1468, -816, 161, 1204, 1553, 1085, -254, -1181, -1510, -1047, -111, 913, 1530, 1217, 245, -888, -1450, -1231, -223, 720, 1379, 1298, 346, -684, -1389, -1459, -534, 538, 1304, 1501, 627, -539, -1483, -1537, -673, 335, 1292, 1448, 1160, -197, -1285, -1649, -924, -32, 1136, 1525, 1179, 29, -879, -1562, -1285, -214, 880, 1424, 1197, 483, -764, -1355, -1413, -528, 668, 1318, 1400, 655, -317, -1426, -1463, -680, 364, 1307, 1378, 920, -120, -1079, -1562, -1079, 107, 1192, 1451, 1067, 163, -861, -1610, -1171, -254, 818, 1459, 1203, 302, -728, -1396, -1400, -469, 548, 1390, 1400, 646, -533, -1373, -1375, -683, 462, 1334, 1356, 730, -286, -1226, -1522, -962, 71]
6788G1J048L76m70j086r00m49K96Q77J029O19j64j055j042n49J34P58J171P61
6806A425k7r72j015p08j26Q13J051J003K9p24j113p86l23N75J043R53L68n28j000
6825f2r71l97L09J193P76N00j18j100r98m60J78Q10R92P69k16o81j113p98J80
6844a207O31J031P69R8n15j149q89PL45J062R02L59n08j027j074l66N21Q88J054
6863I32O17l54j039j025m79K36P88R83O98r0r45r86n96p1P52J062P96Q2p57r91
6883c87q78j11N47J176R62J19m96j102p98m38M94Q92J038M70m71q32j028n94L34
6902a103Q62J026O19k22p47j107o76O3Q14J088N93J48p67j038q17r8N97J011Q88
6921A134K62m91j118q68l56M29R99R66N08m41q85j050n87M78P90J108N17k34r17
$$ y = [71, 1119, 1495, 1025, -61, -961, -1410, -1114, -237, 792, 1411, 1247, 192, -850, -1399, -1265, -507, 664, 1425, 1398, 426, -589, -1297, -1423, -610, 441, 1444, 1473, 749, -364, -1150, -1473, -898, 145, 1098, 1466, 938, -62, -1033, -1430, -1121, 72, 848, 1348, 1230, 130, -868, -1328, -1150, -340, 652, 1421, 1205, 524, -589, -1387, -1207, -576, 455, 1224, 1322, 807, -342, -1231, -1224, -879, 183, 1085, 1444, 936, -91, -1165, -1531, -1010, -122, 932, 1549, 1195, 156, -869, -1348, -1112, -324, 659, 1357, 1267, 322, -664, -1260, -1331, -579, 483, 1279, 1361, 604, -387, -1265, -1376, -829, 347, 1309, 1428, 932, -170, -968, -1406, -912, -20, 1018, 1488, 1017, 185, -843, -1437, -1103, -241, 785, 1404, 1182, 435, -672, -1348, -1285, -471, 617, 1210, 1358, 591, -447, -1264, -1362, -765, 246, 1134, 1396, 905, -213, -1081, -1437, -1008, -9, 957, 1465, 1024, 139, -911, -1498, -1020, -230, 878, 1395, 1161, 244]
6940B44q24p77J65Q50R19O98M3o89j157p58q5O80J017P72L40o03j079r36j24M36
6960h68Q76R52M79l63r20j054n76L36R49J045N78k97q68j084n94J93Q38Q59Q17
6979A298J9p87j082p20k6P20R89P19K15n37r88j037j02N34R63Q66L25m68q85r28
6999i12m26K52J025R55N58l61r31q62o73J61Q54J153N70k67n46j227n09j32P59
7018e59R82Q76Mo79r33p49m16O36J023R54J63l24j036q64m18K60R74R64N10l91
7038I77p49j049m19P5Q96R86P33l29o16j076p75P4P56R81O78K34q15r68q76l5
7058a317N01J089R90k5l17j041q46m83N40Q19Q48P25m78r54q86n16K93O84J123
7077G49O27j51r03r21q03J77O66J111O91J36o48j239n89j36N19Q71R43L68q08
$$ y = [244, -580, -1357, -1192, -342, 577, 1275, 1318, 629, -528, -1286, -1371, -691, 326, 1098, 1438, 835, -244, -1180, -1304, -868, 8, 960, 1439, 1076, 156, -898, -1474, -1138, -189, 856, 1434, 1137, 269, -815, -1409, -1216, -378, 481, 1298, 1317, 530, -552, -1272, -1298, -578, 411, 1130, 1345, 808, -180, -1217, -1319, -785, 178, 1044, 1369, 901, 16, -912, -1338, -1086, -61, 894, 1452, 1091, 160, -702, -1375, -1214, -360, 793, 1363, 1096, 550, -677, -1186, -1318, -559, 423, 1299, 1303, 624, -309, -1058, -1474, -838, 185, 1139, 1302, 978, -58, -922, -1340, -1080, -106, 858, 1368, 977, 228, -821, -1240, -1165, -269, 717, 1450, 1121, 505, -571, -1346, -1272, -516, 465, 1143, 1377, 562, -406, -1282, -1317, -816, 273, 1263, 1238, 921, -120, -966, -1449, -909, -90, 758, 1483, 1005, 51, -835, -1351, -1058, -374, 749, 1376, 1225, 322, -599, -1402, -1225, -559, 552, 1243, 1379, 731, -508, -1097, -1233, -714, 157, 1100, 1468, 660]
7096F60q58q64j52M53O61R34M51l27q82j023m87M11Q95Q78N99l10p75r92m42P0
7116a100O13R13P97J6p27j089o80J28N84Q29Q36J72n39q56j094j00M85J004P05
7135H97M27k86q82j106m42L16R97Q49N51k31q78r60m44K01N43R91O45n5n90j033
7155d90o58p6P69Q51O84R8m20q07j082k45O03J012Q50K06m16q62p91m14K07R49
7175c2Q43N86m20p25r79o27K65P91Q07O86p9p07r45n30n7N84R60P21p9m12q70
7196b19r33j52N10J103P91R8k84r79q04l81K83Q78J000M28l12r19r14n14K89Q22
7216b09Q32N45K4p81j048o03M7O49Q71R66r9n02j044r19K4O02P59Q97L13o12q39
7237a27r61j62L55R66P96M61l16r12r83l24K71O63R39N51j82p20r55n87j2P18
$$ y = [660, -198, -1062, -1214, -761, -100, 834, 1285, 958, 76, -947, -1434, -1023, -128, 750, 1349, 1039, 264, -728, -1170, -1100, -487, 426, 1223, 1239, 512, -577, -1257, -1129, -545, 284, 1120, 1292, 753, -103, -1197, -1297, -812, 192, 897, 1324, 1038, 156, -950, -1392, -1076, -79, 770, 1321, 1090, 212, -748, -1192, -991, -448, 543, 1188, 1133, 543, -490, -1148, -1224, -455, 396, 1080, 1178, 758, -49, -1131, -1376, -773, 239, 1089, 1295, 879, 17, -774, -1188, -981, -32, 811, 1397, 977, 252, -727, -1354, -1089, -298, 509, 1195, 1116, 409, -536, -1066, -1123, -539, 421, 1142, 1063, 651, -219, -1152, -1304, -794, 309, 1100, 1198, 914, -65, -869, -1250, -967, -89, 911, 1339, 1027, 108, -806, -1320, -1031, -209, 623, 1168, 1192, 411, -637, -1240, -1193, -544, 327, 1293, 1194, 692, -352, -1271, -1247, -645, 114, 1011, 1324, 712, -127, -1088, -1250, -895, 71, 867, 1328, 1012, 100, -883, -1207, -936, -273, 666, 1217, 1035, 315, -640, -1227, -1239, -521]
7257e21J019P16j17n58q52o13m13O19J020Q09Q5n07r17p32k48K68R90P62N04l49
7277I65q30q82m90L12P62Q11M81p7o70r30o07P3Q28Q58N36N3o33r08o62k42O27
7298f25R33P81K23m76j098p36k67M85Q05Q89L19l66p62q96n15K98Q39R04N05j98
7318A042p95q81o71K80O33R43O00J3o73r14p72j2N76R14P82J23n16r50o18j95
7338a091M95O70P71M42m32q83q07l13K40P93Q34M51j42q59r94l60J97N72J054
7357F38N87o4p32r85m82j23P61Q34O11J90o20q63p54j88M60P88Q46K92k82r92
7377g8p46m36M85P45P00N99l80p48q60m93K43O26J069M32j14o15q60p65J48M75
7397e73J027N60J66o03r45o24k51N84Q38Q27J18k67r24q41m21M90R30Q58K61l22
$$ y = [-521, 498, 1214, 1097, 539, -313, -926, -1339, -720, 300, 1109, 1194, 687, -230, -962, -1210, -942, 48, 810, 1314, 965, 135, -747, -1237, -925, -163, 648, 1129, 1052, 382, -548, -1155, -1082, -254, 604, 1140, 1193, 560, -348, -1010, -1252, -625, 308, 1089, 1312, 836, -262, -998, -1265, -780, 25, 914, 1233, 867, 105, -791, -1306, -1008, -169, 735, 1240, 1042, 247, -634, -1305, -1025, -392, 551, 1151, 1164, 491, -423, -1195, -1207, -631, 283, 1065, 1188, 672, -278, -896, -1091, -596, 74, 845, 1287, 855, -28, -835, -1148, -908, -115, 719, 1170, 1028, 169, -825, -1185, -988, -416, 638, 1225, 1161, 429, -556, -1038, -1161, -400, 434, 1045, 1235, 615, -248, -1002, -1190, -730, 58, 904, 1196, 914, -78, -824, -1260, -775, -30, 670, 1269, 889, 141, -719, -1212, -969, -343, 726, 1158, 1044, 429, -431, -1196, -1048, -573, 454, 1014, 1180, 577, -368, -992, -1243, -659, 179, 1006, 1124, 857, -67, -908, -1329, -839, 91, 949, 1210, 888]
7417H88p74q97m60K39P22R63N10j43o40r21q28J99P66Q25O64j15l92q43p95l12
7437a344O69R93O89J42m67q40o47m29M43O91R09L44l55n30j079m71M07O77P81
7456E83O36j24p62p59o61jP71Q57N13J37n58j021o93l4M25J004O76J84n18p29
7476g4q34j57K46Q43R19K83l43p96p55m56J98O51R51L86q3p46p01o04O1N03R52
7497D44P01l0o86r01n83j24N85R25O69J76n45q11p98k83O28P34O46M26k38r10
7517B5q71l18J90Q13Q43M81k22p84p37n82J36O74Q00O85N7q50q54o38J7N99Q17
7538B81O95J51m03j009p44j48M74Q18P38L78l28p80j054j70Q3R38P92M76l06o00
7558B82j108l45J42P56Q75N60o7o51r04o38J9N00R67N68J27m88r46o26j45L83
$$ y = [888, 114, -783, -1243, -1004, -282, 681, 1191, 1048, 408, -513, -1341, -1142, -376, 449, 1113, 998, 606, -237, -1032, -1344, -675, 318, 1007, 1149, 682, -158, -805, -1234, -791, -100, 809, 1153, 798, 268, -811, -1282, -875, -198, 583, 1219, 1095, 333, -426, -1087, -1088, -317, 540, 1053, 1190, 632, -389, -1082, -1116, -691, 313, 989, 1173, 655, -74, -908, -1065, -819, 24, 943, 1226, 883, 87, -668, -1124, -926, -275, 676, 1062, 979, 233, -468, -1072, -1011, -508, 444, 1145, 1115, 429, -472, -1055, -1179, -594, 331, 1000, 1176, 631, -180, -978, -1261, -633, 101, 747, 1173, 935, 25, -846, -1164, -974, -161, 682, 1163, 941, 157, -580, -1162, -1026, -352, 448, 1133, 1190, 340, -514, -1152, -1135, -536, 281, 976, 1127, 724, -285, -1029, -1177, -703, 115, 853, 1231, 903, 123, -931, -1101, -1018, -80, 712, 1188, 882, 282, -826, -1171, -1029, -273, 602, 1162, 1095, 444, -460, -1098, -1079, -579, 388, 956, 1083, 595, -351, -977, -1122, -739]
7578g39Q94P07L46m59p98q09l58M16Q31O06M62j84p40q53m82J65O72Q66N96k61
7598H78m84r57o02J18N34Q10P83J5o06q39o14k18N13Q99P14J66m03p40p03m66
7618a202L12Q92O92N24l81p12q09n03K45P05Q97L54J4p45r49m98J14O52Q62O47
7638A111q4o18o29p12j83M93Q30P13K59n29q30p05j41K88Q49P19K76k74p92o59
7658f18m18J15O59R16M76k35n43r29m74P7O08P71N88M4m61r79o14j27O09P48P61
7679I74J46l56r51o10m05M59Q67P23K44l03p47q48k82K86P91O53M65j75o34q77
7699e80n45J48P29O92O28j51l64r02o35j62N52Q67P05Q2l48r02p81k63N23Q31
7719A24P01K59k64q04o99n36L80O77P61N67j37p23r34l96K0Q18P24M56ro10p61
$$ y = [-739, 155, 862, 1208, 749, -49, -858, -1216, -800, 31, 637, 1099, 915, 175, -678, -1160, -995, -323, 543, 1139, 878, 394, -563, -1165, -1047, -513, 297, 1080, 1095, 489, -350, -964, -1182, -669, 230, 944, 1110, 707, -33, -736, -1202, -890, 2, 694, 1218, 837, 125, -684, -1187, -942, -237, 660, 1014, 1028, 283, -666, -1164, -1050, -398, 464, 1111, 1027, 409, -220, -932, -1115, -622, 208, 921, 1180, 651, -179, -884, -1025, -737, 112, 831, 1107, 833, 41, -618, -1036, -921, -262, 654, 1130, 895, 352, -577, -1051, -974, -366, 405, 993, 1037, 576, -403, -1017, -1144, -535, 213, 974, 1120, 764, -187, -797, -1202, -743, 124, 847, 1091, 788, 41, -807, -1089, -803, -12, 641, 1106, 931, 297, -580, -1125, -977, -248, 444, 1072, 921, 557, -345, -980, -1142, -590, 277, 982, 1064, 716, -186, -967, -1230, -707, 124, 825, 1084, 820, 16, -683, -1219, -839, -162, 599, 1166, 1029, 306, -628, -1024, -1004, -186, 538, 994, 985, 375, -386]
7740c86n97n1L66J004O17J44m65p35q80n1M22P69P31L15m07r07p15j74Q9Q13P60
7761F62N82l70o37q47n18J70P42P69N52n6o61p86o10J4L79Q99P00K13p07p79n60
7782h49j84L57P15P62K72l36q41q39k35L37P60P33L82j22p66q98l46K00P08P64
7802E74L99mn64q30n36o5M80R26O40R2o42q62n81KL34Q40N98K85k89q50p79j67
7824i99K49Q10O80K74k13p24q15l66J87O48P30O57j47o06r51l71M1M66Q40N83
7844I73Q1n61q29p07J3N20O97O76K46l71p16q12l22L85P30O87L29k90n52q37l98
7865a058N0R01Q02L00n5p11q61l67N2N54Q03N48J27o31q96n16R4K79Q26O76P4
7886I91l58p76q00k03M86P77P70K72m31q46o33l30L53O63P09L83n5p91q71m04
$$ y = [-386, -983, -1034, -668, 336, 953, 1097, 632, -103, -983, -1034, -612, 157, 888, 1203, 796, -111, -826, -1000, -911, -98, 662, 1244, 874, 237, -610, -1128, -958, -216, 553, 1105, 1049, 388, -398, -1008, -994, -615, 284, 984, 1197, 490, -289, -849, -1033, -676, 39, 801, 1073, 737, -104, -943, -1178, -841, -81, 652, 1034, 912, 146, -752, -1098, -898, -190, 574, 973, 969, 405, -425, -961, -1026, -546, 380, 1020, 1112, 470, -392, -973, -971, -637, 203, 801, 1086, 797, -53, -832, -999, -750, 60, 740, 1014, 801, 77, -738, -1104, -917, -269, 461, 1118, 971, 365, -586, -957, -916, -450, 390, 973, 1054, 493, -336, -1043, -1030, -510, 187, 863, 1109, 738, 22, -790, -1112, -727, 3, 690, 1019, 729, 177, -660, -1058, -1008, -107, 695, 995, 940, 229, -632, -999, -947, -393, 410, 958, 1085, 454, -442, -958, -864, -585, 241, 917, 991, 633, -143, -943, -1146, -660, 117, 887, 1159, 728, -118, -751, -1081, -728, -65, 644, 1027, 972, 181, -690, -1094]
7906a094K17O47N73N61j2n59o49p40j0N03R50N03R6m53q43n89j38K84Q73O57L17
7927A094l53o86q16l24L38N44Q69M76k52p77p72m15K16N76Q75L67K3o23p42n62
7947i44j5N26P59N45J94n57q08n68q3L93P43O86K24l95o25r04k49K93O83Q30L04
7968A032l25n86o35o11K72O29P03L91K4o53p86l05k9M91P93N55M7m77p61o50j32
7989a013M19Q69M26L47m12q21o19j96K12O88Q99J89k62n72p13m81J98O85Q26L72
8009A041j58n51q44m70J6N94Q58M84j8n62o84o72j7M77O50O37K47l52q41o15k31
8030a011L27N78Q20L80l40o99p14l50J39P01Q06K29K8o20q19m72L6P61N10P19
8050A009k48m42n74o89j08N40P40O26l6j27r23n94k40M24P39O51L02k63p40q02
$$ y = [-1094, -877, -230, 343, 904, 892, 333, -316, -1056, -1066, -563, 387, 890, 986, 533, -310, -899, -1037, -753, 120, 777, 1094, 741, 55, -761, -1085, -747, -203, 666, 1142, 890, 113, -659, -1074, -858, -282, 593, 960, 983, 360, -382, -944, -959, -433, 326, 871, 1065, 508, -300, -868, -951, -558, 185, 871, 1095, 700, 75, -829, -1078, -785, -102, 728, 1032, 707, 121, -514, -1125, -853, -224, 479, 870, 894, 241, -545, -850, -879, -388, 405, 960, 1007, 530, -231, -881, -1013, -594, 275, 701, 1048, 636, -185, -804, -1000, -788, -100, 799, 988, 726, 154, -559, -1040, -842, -157, 669, 1041, 883, 332, -512, -982, -966, -372, 486, 970, 952, 390, -294, -966, -983, -506, 144, 781, 1028, 676, -165, -780, -1011, -684, -106, 714, 1094, 754, 55, -659, -1009, -870, -169, 637, 866, 894, 274, -545, -1017, -981, -220, 290, 1009, 761, 319, -255, -944, -1052, -512, 228, 854, 818, 691, -232, -826, -1066, -642, 97, 748, 1050, 787, 47, -755]
8070g55k41K44N46Q85L31k17m87q51n52J50N28R23M75j2n93p03n05j74N12P99
8090C03N75J30l83p60p57q3L74P64O24J70k19p79p01k78K79O82P13K72j26n27
8110B73p88n72J58P64O39M70j56l72p48n95j6N75O50N15K34m48q09n76j94L46
8130f50P57P42K04m13n60q55k90K43Q12P41K44k11n72p50m62P6P27Q02L35j50
8150G70n07p73n01K37M10P64M86n2l76p03n75k90N55P03P29J94m46p22o33k64
8170i94L24P25O37L38j68r38m49m32J88M71P34N15m3o47p61m74L4O09P34M90l
$$ y = [-755, -996, -752, -206, 679, 1010, 793, 306, -545, -1097, -947, -419, 504, 979, 967, 374, -329, -834, -1008, -496, 303, 878, 1008, 625, -135, -892, -975, -601, 163, 787, 957, 738, -41, -742, -1020, -741, -59, 654, 926, 800, 273, -515, -1087, -929, -165, 474, 944, 788, 416, -332, -927, -943, -368, 282, 797, 1031, 583, -226, -802, -996, -650, 107, 849, 1053, 640, 80, -775, -1065, -822, -10, 731, 975, 764, 192, -558, -1020, -944, -217, 585, 920, 770, 263, -510, -1011, -774, -364, 400, 886, 834, 458, -245, -820, -1110, -555, 148, 877, 1071, 625, -97, -730, -994, -670, 55, 692, 1030, 862, -76, -525, -957, -769, -298, 436, 951, 908, 261, -500, -974, -940, -331, 403, 893, 890]
8191H90
$$ Imaginary data points
##PAGE= N=2
##DATA TABLE= (X++(I..I)), XYDATA
0@%%%%%%%%%%Kj0J4j4J6j6K1k9L2l7M3m6N4o3P1q3R3j04J17j32J51j67J87k09
34a09K33k62K87l18L55l89M29m76N28n86O49p22Q05q96J007j137J288j478J715
53I23k021K435l022L919n442Q503j6903Q0785K95375j28274l05765m8926J32506
66A4093m7614j77006M9463L03888J72607j47795k34442p8636J8841J1508N7550
77e7543J38696R1572l9782q7116o8315j06081j05969P9259K73481J64531j37758
88A44975k11865m727P9564r7325j49987J33061L44275J05647k70439k62273L8551
99a50543J35206l6239p2222J40333K28741o011k47942j90109K0474J01091O6352
110a0869P2049Q7309L906j07999j15859n6064k3054L1521J52007J85573M126k01890
$$ y = [0, 0, 0, 0, 0, 0, 0, 0, 0, 0, 0, 2, -8, 6, -8, 8, -8, 13, -16, 16, -21, 22, -24, 30, -33, 38, -45, 48, -56, 61, -71, 80, -87, 100, -109, 124, -138, 149, -169, 186, -203, 226, -250, 278, -308, 341, -381, 424, -472, 535, -602, 686, -792, 923, -1098, 1337, -1685, 2234, -3208, 5295, -11608, 69177, 364552, 236278, -69487, -118413, 14093, -33521, -210527, -161064, 142824, 315431, 167636, -66806, -145442, -126601, -115093, -57543, 81153, 172725, 132943, 45827, -22488, -128569, -234538, -155279, 118202, 282733, 144975, -66890, -71617, 7947, -89378, -239365, -106304, 237971, 343618, 73179, -189094, -150543, -15337, -51576, -123798, 16535, 245276, 239265, -8677, -198786, -178312, -77221, -10869, 61180, 148489, 152395, 44396, -71463, -127527, -150581, -119060, 32947, 218520, 222646, 20756]
122B0756j63666K9128P1328l8714j3737J74744J93852p9377k89129j47497J14674
133a27638J37722k963l367J18560Q3540j29676k26589p3906J13795J36322O6355
144I2155L3194M811p3838j26630p6643J5331O6562R5216J13866M9195j04723j85927
156i7431q2722P0247Q9185K5546M3682J02128K2318j62295k01173j7898J53280
167e5133J25173J4508L15K8514m1200j49339j19228M4154J54179J16722K2397
178A41062l5425o8867r7002p8547L428Q3723J04657P5780J8573o4300j32815j08835
190a58568P961J05005R9913M3624J4295j0920q1585j35115p0305P6438J49757
201D0500Q8448p245m5982n5958q2717q0475L016J09693J31244N3078m2396q9870
$$ y = [20756, -142910, -113782, -42454, -81168, -94905, 79839, 273691, 194314, -94815, -242312, -127638, 10084, 7121, 3754, 122314, 205854, 76178, -150411, -224317, -110522, 25800, 92155, 125349, 130160, 56322, -70308, -146951, -131620, -65058, 30158, 144024, 193219, 88496, -97431, -180153, -109906, -20721, 4825, 48507, 150635, 172953, 10658, -190515, -208413, -55133, 70040, 84548, 84863, 113377, 72177, -77162, -196390, -152236, 1943, 118665, 141062, 105637, 36770, -60232, -138779, -135351, -51628, 53029, 128809, 147382, 83082, -49733, -158568, -150607, -45602, 54311, 97935, 112230, 101310, 19725, -115390, -185695, -109257, 40500, 128948, 121703, 75721, 19763, -62954, -143429, -140413, -30720, 100524, 153602, 111206, 21336]
213B1336r0398n8600L689P4312J05277P3756K098o8526j05697q6496j1878P4312
225f6815J10300P5568O969n2148q5727q7985m3055M1131J08771J02819K9865n0381
237H9312r0300q4116m4129K0242Q3486J03524N9317k1786q6774r9467n7485J2829
249a15347P5141R6678O6581J103o7155r9948p6196p921O4454R7480P6327J5950
261A27147n1811r4583q6045k6436M8872R3146Q3730L1985l4784q4860r2166m6016
273a31821L0722Q8678R1747M4161k1690p3845r0266n9932Q081P5283R7214O1386
285A19718n790o6163r1155o9241p782O1122R3328P1538J3013m9319q7359q1450
297i9540k7091M7478R2944Q0210K4070l6877p6677q1636m5282K4193Q4512R2806
$$ y = [21336, -69062, -127662, -123973, -49661, 55616, 129372, 131470, 62944, -42753, -129249, -141127, -66815, 43485, 119053, 126022, 73874, -11853, -99838, -142893, -101762, 7009, 109828, 139693, 89312, -988, -85104, -129233, -108991, -25505, 78019, 137336, 115550, 28776, -70691, -128176, -115347, -40206, 56472, 123053, 124156, 57001, -42947, -119143, -127064, -62610, 34870, 111197, 127147, 75336, -19247, -105292, -131728, -82856, 10290, 94020, 126005, 91221, 6361, -85805, -131821, -101099, -12421, 79326, 123487, 101797, 27952, -62314, -122246, -114165, -38882, 58332, 119718, 113928, 47765, -43390, -112631, -120413, -59291, 34037, 105575, 118588, 69269, -18090, -99540, -126631, -79153, 13791, 94001, 118071, 81194, 4517, -77119, -122401, -98208, -13696, 79110]
309G9110M2843k7201p4426q1661n0995O777O6859R2286O2285n636o7288q7599
321d4646o1669m134N5892Q7041O9840J2614n1000q5055p2963k1469M3062Q4599
333A2112P7597K6343l7878p9039p7618l5886K5799P5768Q3925M3505k1854p3383
345A9391q2417m7569J2216O4749Q3673N6680l172o1472q5243o0122j791N5134
357d9943Q1624O4521J2478m7658q2524p0585j7950M4043P9509P0299K5116l3327
369G5603p5140p7246l4831K9056P5356P7321L6976k0657o6463p7896m7811J0933
381i4799O5669Q1816N0769p431n8954p8120n5974l132N3040P9746O1512Q557m8266
394E4433p7687o4996j6557M1980P6864O8168K2059l5380p2449p0990l0817K7756
$$ y = [79110, 121953, 94752, 20326, -61335, -112330, -105553, -38694, 53592, 115877, 110241, 42953, -44646, -106315, -110449, -54557, 32484, 102324, 114938, 63938, -21117, -94080, -115549, -72487, 12112, 89709, 116052, 78174, -865, -78483, -114369, -88570, -12802, 71123, 114628, 92774, 19391, -63026, -110595, -98379, -33630, 50043, 106723, 103551, 42079, -43164, -103286, -105077, -49943, 31681, 96202, 108680, 61022, -21502, -92087, -110037, -65994, 13515, 83814, 108930, 75603, 463, -76783, -111614, -82558, -7202, 70119, 107095, 86438, 19975, -57921, -105732, -94799, -29130, 52686, 103455, 96024, 37070, -41050, -97024, -100156, -47116, 32630, 94142, 102699, 54433, -23254, -88250, -104807, -62827, 14037, 82205, 104264, 68884, -3565, -74555, -105372, -77616]
406g7616P1393P4800L5290k3019o6395p3061m1767J2452O1758P7236M8816q051
418I1836n9547p5606n0667J58M9997P4666N9554R650m8031p7406o0907j1157M0677
$$ y = [-77616, -6223, 68577, 103867, 80848, 14453, -58608, -100375, -87923, -26165, 51071, 99887, 91836, 32289, -43317, -93984, -93826, -43829, 30837, 90391, 100041, 52010, -25396, -86303, -97460, -56783]
$$ [...]
8191d47
##END NTUPLES=NMR FID
##END=
