##TITLE=1H_PR90R_KSO
 DMSO-d6, 8 sc, 
 5.6.2019
##JCAMPDX= 6.0         $$ Bruker NMR JCAMP-DX V2.0
##DATA TYPE= NMR FID
##DATA CLASS= NTUPLES
##ORIGIN= UXNMR, Bruker Analytische Messtechnik GmbH
##OWNER= root
$$ XWIN-NMR		Version 3.5
$$ Wed Jun  5 15:58:07 2019 Russian Standard Time (UT+4h)  she@DPX200
##.OBSERVE FREQUENCY= 200.13155
##.OBSERVE NUCLEUS= ^1H
##.DELAY= (6, 6)
##.ACQUISITION MODE= SIMULTANEOUS
##.ACQUISITION SCHEME= undefined
##.AVERAGES= 8
##.DIGITISER RES= 18
##SPECTROMETER/DATA SYSTEM= spect
##.PULSE SEQUENCE= zg30
##.SOLVENT NAME= CDCl3
##.SHIFT REFERENCE= (INTERNAL, CDCl3, 0, 15.7039)
##AUDIT TRAIL= $$ (NUMBER, WHEN, WHO, WHERE, WHAT)
$$ ##TITLE= Audit trail, XWIN-NMR		Version 3.5
$$ ##JCAMPDX= 5.01
$$ ##ORIGIN= Bruker BioSpin GmbH
$$ ##OWNER= she
$$ F:/spectra/data/she/nmr/H-F/1/audita.txt
$$ ##AUDIT TRAIL=  $$ (NUMBER, WHEN, WHO, WHERE, WHAT)
(   1,<2019-06-05 15:57:04.23 +0400>,<she>,<DPX200>,
      <created by zg, POWCHK disabled, PULCHK disabled
       configuration hash MD5:
       00 E9 B6 7A A2 85 ED C7 34 08 36 98 17 FE 4E 26
       data hash MD5: 16K
       1C 6D 34 CE 32 52 3D 6A F4 E3 45 11 01 93 10 12>)
$$ ##END=
$$ 
$$ hash MD5
$$ 8F 90 17 A9 41 12 95 1A 92 60 F8 89 3A 40 C0 6C
##$RELAX= 
##$RELAX= 
##$RELAX= 
##$RELAX= 
##$RELAX= 
##$RELAX= 
$$ Bruker specific parameters
$$ --------------------------
##$DU= <F:/spectra>
##$EXPNO= 1
##$NAME= <H-F>
##$PROCNO= 1
##$TYPE= <nmr>
##$USER= <she>
##$AMP= (0..31)
100 100 100 100 100 100 100 100 100 100 100 100 100 100 100 100 100 100 
100 100 100 100 100 100 100 100 100 100 100 100 100 100 
##$AQSEQ= 0
##$AQ_mod= 1
##$AUNM= <au_zg>
##$AUTOPOS= <>
##$BF1= 200.13
##$BF2= 200.13
##$BF3= 200.13
##$BF4= 200.13
##$BF5= 200.13
##$BF6= 200.13
##$BF7= 200.13
##$BF8= 200.13
##$BYTORDA= 1
##$CFDGTYP= 0
##$CFRGTYP= 5
##$CHEMSTR= <none>
##$CNST= (0..31)
1 1 145 1 1 1 1 1 1 1 1 1 1 1 1 1 1 1 1 1 1 1 1 1 1 1 1 1 1 1 1 1 
##$CPDPRG= <>
##$CPDPRG1= <>
##$CPDPRG2= <>
##$CPDPRG3= <>
##$CPDPRG4= <mlev>
##$CPDPRG5= <mlev>
##$CPDPRG6= <mlev>
##$CPDPRG7= <mlev>
##$CPDPRG8= <mlev>
##$CPDPRGB= <>
##$CPDPRGT= <>
##$D= (0..31)
0 1.2 0 0 0 0 0 0 0 0 0 0.03 0 0 0 0 0 0 0 0 0 0 0 0 0 0 0 0 0 0 0 0 
##$DATE= 1559735823
##$DBL= (0..7)
120 120 120 120 120 120 120 120 
##$DBP= (0..7)
150 150 150 150 150 150 150 150 
##$DBP07= 0
##$DBPNAM0= <>
##$DBPNAM1= <>
##$DBPNAM2= <>
##$DBPNAM3= <>
##$DBPNAM4= <>
##$DBPNAM5= <>
##$DBPNAM6= <>
##$DBPNAM7= <>
##$DBPOAL= (0..7)
0.5 0.5 0.5 0.5 0.5 0.5 0.5 0.5 
##$DBPOFFS= (0..7)
0 0 0 0 0 0 0 0 
##$DE= 6
##$DECBNUC= <off>
##$DECIM= 24
##$DECNUC= <off>
##$DECSTAT= 4
##$DIGMOD= 1
##$DIGTYP= 9
##$DL= (0..7)
0 120 120 120 120 120 120 120 
##$DP= (0..7)
150 150 150 150 150 150 150 150 
##$DP07= 0
##$DPNAME0= <>
##$DPNAME1= <>
##$DPNAME2= <>
##$DPNAME3= <>
##$DPNAME4= <>
##$DPNAME5= <>
##$DPNAME6= <>
##$DPNAME7= <>
##$DPOAL= (0..7)
0.5 0.5 0.5 0.5 0.5 0.5 0.5 0.5 
##$DPOFFS= (0..7)
0 0 0 0 0 0 0 0 
##$DQDMODE= 0
##$DR= 18
##$DS= 0
##$DSLIST= <SSSSSSSSSSSSSSS>
##$DSPFIRM= 0
$$ [...]
##$SUBNAM2= <"">
##$SUBNAM3= <"">
##$SUBNAM4= <"">
##$SUBNAM5= <"">
##$SUBNAM6= <"">
##$SUBNAM7= <"">
##$SUBNAM8= <"">
##$SUBNAM9= <"">
##$SW= 24.9336996594482
##$SWIBOX= (0..15)
0 0 2 0 0 0 0 0 0 0 0 0 0 0 0 0 
##$SW_h= 4990.01996007984
##$TD= 16384
##$TD0= 1
##$TE= 0
##$TE2= 300
##$TE3= 300
##$TEG= 300
##$TL= (0..7)
0 120 120 120 120 120 120 120 
##$TP= (0..7)
150 150 150 150 150 150 150 150 
##$TP07= 0
##$TPNAME0= <>
##$TPNAME1= <>
##$TPNAME2= <>
##$TPNAME3= <>
##$TPNAME4= <>
##$TPNAME5= <>
##$TPNAME6= <>
##$TPNAME7= <>
##$TPOAL= (0..7)
0.5 0.5 0.5 0.5 0.5 0.5 0.5 0.5 
##$TPOFFS= (0..7)
0 0 0 0 0 0 0 0 
##$TUNHIN= 0
##$TUNHOUT= 0
##$TUNXOUT= 0
##$USERA1= <user>
##$USERA2= <user>
##$USERA3= <user>
##$USERA4= <user>
##$USERA5= <user>
##$V9= 5
##$VALIST= <valist>
##$VCLIST= <CCCCCCCCCCCCCCC>
##$VD= 0
##$VDLIST= <DDDDDDDDDDDDDDD>
##$VPLIST= <PPPPPPPPPPPPPPP>
##$VTLIST= <TTTTTTTTTTTTTTT>
##$WBST= 1024
##$WBSW= 4
##$XGAIN= (0..3)
0 0 0 0 
##$XL= 0
##$YL= 0
##$YMAX_a= 258198
##$YMIN_a= -461065
##$ZGOPTNS= <>
##$ZL1= 120
##$ZL2= 120
##$ZL3= 120
##$ZL4= 120
##$ABSF1= 10
##$ABSF2= 0
##$ABSG= 5
##$ABSL= 3
##$ALPHA= 0
##$AQORDER= 0
##$ASSFAC= 0
##$ASSFACI= 0
##$ASSFACX= 0
##$ASSWID= 0
##$AUNMP= <proc_1d>
##$AZFE= 0.1
##$AZFW= 0.1
##$BCFW= 1
##$BC_mod= 2
##$BYTORDP= 1
##$COROFFS= 0
##$CY= 11.3945322036743
##$DATMOD= 1
##$DC= 2
##$DFILT= <>
##$DTYPP= 0
##$F1P= 18.9103706918063
##$F2P= -1.10871071338519
##$FCOR= 0.5
##$FTSIZE= 0
##$FT_mod= 4
##$GAMMA= 1
##$GB= 0.15
##$INTBC= 1
##$INTSCL= 1
##$ISEN= 128
##$LB= 0.24
##$LEV0= 0
##$LPBIN= 0
##$MAXI= 10000
##$MC2= 0
##$MEAN= 0
##$ME_mod= 0
##$MI= 1.114404
##$NCOEF= 0
##$NC_proc= 0
##$NLEV= 6
##$NOISF1= 3.799351
##$NOISF2= 2.8
##$NSP= 1
##$NTH_PI= 0
##$NZP= 0
##$OFFSET= 15.70392
##$PC= 1
##$PHC0= -8504.682
##$PHC1= 19.8002
##$PH_mod= 1
##$PKNL= yes
##$PPARMOD= 0
##$PSCAL= 0
##$PSIGN= 0
##$REVERSE= no
##$SF= 200.130013532006
##$SI= 16384
##$SIGF1= 3
##$SIGF2= 2
##$SINO= 400
##$SIOLD= 16384
##$SREGLST= <1H.CDCl3>
##$SSB= 0
##$STSI= 0
##$STSR= 0
##$SW_p= 3612.71676300578
##$SYMM= 0
##$S_DEV= 0
##$TDeff= 0
##$TDoff= 0
##$TI= <>
##$TILT= no
##$TM1= 0
##$TM2= 0
##$TOPLEV= 0
##$USERP1= <user>
##$USERP2= <user>
##$USERP3= <user>
##$USERP4= <user>
##$USERP5= <user>
##$WDW= 1
##$XDIM= 8192
##$YMAX_p= 0
##$YMIN_p= 0
$$ End of Bruker specific parameters
$$ ---------------------------------
##NTUPLES= NMR FID
##VAR_NAME=  TIME,          FID/REAL,        FID/IMAG
##SYMBOL=    X,             R,               I
##VAR_TYPE=  INDEPENDENT,   DEPENDENT,       DEPENDENT
##VAR_FORM=  AFFN,          ASDF,            ASDF
##VAR_DIM=   8192,          8192,            8192
##UNITS=     SECONDS,       ARBITRARY UNITS, ARBITRARY UNITS
##FACTOR=    0.0002004,     1,               1
##FIRST=     0,             0,               0
##LAST=      1.6414764,     0,               0
##MIN=       0,             -461065,         0
##MAX=       1.6414764,     258198,          0
$$ Real data points
##PAGE= N=1
##DATA TABLE= (X++(R..R)), XYDATA
$$ [...]
2100c35j071J175J580m71j931M0J662N80j333r00Q45Q76k5j042m13P43K35K77
2118D92l76q18m9J122P01j415p22M20J313O4j303p26J465J247n78j949lJ544O67
2137A096j203q15P4J630K80j324o13M20J229K34r33j209O95J102M86j607q73J207
2155a24J372j75j799l90J530Q08j020j069j00J492N57p03r23k47J697M81j316
2172G1j018K15J805K65j940o02J095J264l29j628l06J269R74n71j172m36J174
2189A30J139m80j921J80J285O35j267j385J206J373l28r66n94J030Q51o89p72
2206e73J03N17N01n5j042k18Q93O96l10j160k36J162P70r23j176M77J366M58j471
2225b21p14P73J657o44j773l4J596M82j178q38N96O39K02m08l27Q7m4J011o72
$$ y = [-335, -1406, -231, 1349, 878, -1053, -1013, 649, 1229, -104, -1004, -159, 717, 692, -350, -763, -20, 215, 492, 116, -702, -751, 371, 1072, -343, -1065, -645, 668, 732, -571, -1297, 168, 1415, 837, -1112, -1115, 429, 1096, -107, -922, -848, 782, 1062, -262, -875, -455, 774, 1008, 75, -1134, -439, 663, 1149, -458, -1331, -124, 1248, 1073, -726, -1116, 414, 1222, 202, -867, -967, 525, 1082, 379, -544, -791, 906, 1387, 71, -947, -732, 1073, 1338, -602, -1204, -109, 1155, 826, -802, -1108, 161, 1135, 564, -608, -1044, 130, 1269, 789, -1132, -952, 333, 968, -299, -1684, -478, 895, 567, -399, -993, 37, 888, 199, -573, -470, 47, 548, 493, -549, -767, 126, 822, 512, -648, -884, 278, 1048, 125, -1051, -574, 792, 1250, -221, -935, -162, 1495, 851, -922, -956, 640, 1122, -56, -894, -298, 341, 543, 135, -192, -105, -149, 862, 190]
2244A90n35k45Q10Q02j002j419R83J562l88j271m94J355M94q95r31P97O37J45
2262E95q42k77K68O20k31J40l29l95M93K77r4o74l1R29J78p90p64P76J019l02
2282E66j117m68J252K12p86l18O68L84j70m86K80M8l06K30L23n55J38L9N56j60
2302C30p95R5R41l9p29o65J016M30m78m40oP67j83l50m22P67L9j14l84J6K76k2
2324E0m6n4q1j66J6O71n2p97J58L80L31m28m57K73P21k28p96L40P27k03p07k13
2346e61Q03M7n50j29N87k49oN7K10l34O5j15L99M12o03l75O06L49q55m51P67N72
2368F46l41o57j20O57J98l39j34K27L62m63l42K64M61l88j49L02j22k42k2N70
2388C68R3n20l52R37m6o01l69N22O95o09r36L19J088N3j110k96J096L96q40m58
$$ y = [190, -345, -590, 220, 1022, 20, -1399, -416, 1146, 758, -513, -1007, 348, 842, -53, -984, -187, 450, 595, -247, -524, -256, 364, 133, 273, -56, -451, 42, 319, 225, -449, -480, 449, 627, -163, -927, -151, 868, 566, -551, -1019, 233, 445, -341, -659, 9, 393, 223, -263, 17, 65, -241, -11, 312, -243, -105, -66, 490, 330, -465, -370, 571, 532, -197, -862, 154, 584, 106, -334, -340, 427, 244, -106, -528, 239, 278, 164, -220, -204, 72, 50, 4, -50, -131, -297, -281, 390, 338, -459, -301, 79, 410, -18, -475, -202, 519, 291, -505, -165, 562, 359, -348, -561, 242, 289, -261, -390, 197, -52, -58, -1, 209, -125, -60, -175, 224, 636, 33, -342, 264, 613, -242, -693, 74, 646, 305, -352, -472, 185, 383, 44, -90, 137, 499, 36, -306, -42, 419, 31, -118, 184, 62, -180, -202, 368, 461, -59, -411, 526, 480, -121, -490, 32, 727, 118, -818, -499, 589, 642, -468, -764, 332, 728, -112, -570]
2408e70K72N77k35k89K20J85m06J77N23p1q22j90J084j8p55k36P05Q37o93r11
2428f16O80Q56q76n60O8Q69L18j034n13R50L04m08k52J35j14J57L61q7n30l92
2448f84O81R68r60j016L64J332K65j498p18J492J071j404o86J94J658l04j047
2465b92n68R19M86l11o40K17o5O27Q9k20r19R7J272J80r94j005J089J354p92j625
2485a101J34J717N35j575p58R92J006k96j193m07J007M44j19o00m93J43J200%
2503F36j027o22J141J034n34j495k48J718N65j068j275N73J574j76j228p02J121
2520a3R51o47q25j64N00J073n40r30k93J107Q29n50j570O34J084N79j131j350
2538a256K42K022K60j658r89J361J064l17j536m31J329Q89k83j637J95R78J150
$$ y = [-570, -298, 279, 44, -245, -25, 160, -246, -69, 454, 383, -439, -629, 455, 437, -318, -554, 151, 988, 295, -616, 64, 920, 44, -516, -448, 421, 739, -295, -808, 142, 446, 38, -214, -79, -193, -36, 325, 238, -292, -684, -3, 965, 5, -1011, -647, 685, 950, -548, -1266, 226, 1297, -107, -793, -599, 1059, 755, -292, -860, 59, 545, 234, -406, -189, -254, 373, 462, 242, -677, -580, 692, 872, -122, -1127, -38, 1316, 524, -1101, -967, 750, 1285, -290, -1048, -56, 950, 654, -539, -946, 61, 505, 386, -214, -707, -564, 636, 636, -391, -1013, 128, 1162, 628, -867, -1115, 603, 1168, 100, -1175, -602, 972, 796, -432, -1134, -13, 938, 291, -534, -698, -198, 875, 335, -595, -888, 219, 1048, 498, -1072, -438, 646, 1225, 94, -1256, -1014, 1008, 1268, -390, -1379, -18, 1046, 729, -807, -1238, 91, 980, 697, -940, -745, 233, 1383]
2555A383r35j226o9J514N40j380r46P02J511m43j265p49J174J424l97j422m74
2572a058R86J099m94j544Q0J400O32p70j442M19J484K15j235r11Q70J184o7j149
2590c01r33R87J173q35p76OQ13N41q2j657L67R96Q78q02j367N40Q52L40j044o74
2610i78M19J394J88j424o79J342R71r16j137L16O98M02k22j118M15Q41K16p65
2628c7o71P9R01L65q63j131Q51Q75M24j434m48R31J209p06j152L98Q27J68p46
2647a60o57N38O78J37q42j73K98N93K34r21k91K88J041k35j144k64O33Q60n43
2666G0n03J82N83L89j130k91M21Q14k29q71j42O28O65k08m70l98P00J90j95q00
2686e95L48M64j6l19m58K13M80L35p82k83N33P12r9r64P0K51M42k00m59L91j15
$$ y = [1383, 448, -778, -847, 667, 1207, -173, -1119, -417, 1094, 651, -614, -1363, -189, 1235, 838, -584, -1058, -72, 1027, 533, -1011, -931, 469, 1101, 331, -1111, -692, 792, 1007, -228, -1139, -269, 915, 848, -301, -1234, -247, 926, 91, -685, -679, 134, 675, 593, -1064, -697, 299, 1177, 375, -992, -452, 400, 740, -304, -978, -559, 835, 1023, -401, -1080, 262, 1233, 317, -820, -504, 194, 596, 374, -744, -329, 512, 728, -37, -708, -629, 272, 637, -226, -1357, -506, 369, 793, -641, -1089, -158, 1051, 345, -807, -409, 418, 586, -160, -817, -279, 399, 536, -306, -479, -181, 412, 646, -275, -566, -278, 763, 528, -616, -880, -247, 613, 70, -433, -251, 332, 721, -409, -700, -279, 535, 306, -565, -707, -79, 586, 378, -92, -490, 210, 400, 205, -595, -247, 217, 201, -118, -576, -363, 117, 452, -330, -613, -80, 632, 533, -431, -361, -110, 332, 132, -327, 64, -51]
2707e1M33l73m46K54N60l5n52l80O26L91j26n83j72P84j26j43p33R3Q61K2j87
2728A17m46K10L55K55m15n10J78O78k27l51l57O97L75o03m53k16R29N47q83k60
2748c80L99L13q7k45k96M39J94n44q3n9M33O8R3l98j39k2N80l5m73j40Q80l4n38
2771g4o27N61P89j80q78r7P15L44o13m07M37M82J43r25N48k62J28K95k36n83J23
2792c17O19N1n23m74O13L34L20q67l33P22M85n78n78M17M95M3q30K31M6N7Q0l50
2814c37L10k68K60j34J40k10j3O73J9l04n59M66M06l16p14j87J031N75p18p23
2834f03O80L27j17m24rj07L82j06N9j82k16O57k31j07m03M25J52L2o32K37N72
2855C86J03p27n6j66Q48m09n2n19L49N01k14j77k86N76n2j39j76J3K86q6L89o95
$$ y = [-51, 382, 9, -437, -183, 377, 342, -210, -590, 36, 427, 301, -282, -454, 330, 204, 61, -672, -579, 282, 304, 117, -329, -119, 236, 491, 76, -434, -256, 422, 195, -156, -513, 184, 559, -44, -497, -713, 216, 763, -120, -380, 19, 332, 245, 0, -296, 143, 337, -207, -290, -349, 84, 152, 245, -153, -292, -314, 266, 231, -242, -382, 498, 464, -74, -701, -140, 649, 469, -409, -506, 209, 553, -60, -467, -30, 452, 595, -330, 218, -44, 84, 379, 143, -440, -317, 302, 353, -170, -644, -31, 303, 623, -244, -577, 145, 630, 52, -526, -109, 386, 429, -401, -170, -124, -67, 13, -337, -27, -295, -35, -169, -29, -239, -252, 421, 440, 136, -423, 43, 449, 133, -581, -768, 263, 838, 120, -603, 77, 404, 287, -137, -146, -253, 129, 23, 82, -100, -316, 341, 110, 3, -400, 25, 177, 209, -423, -186, 386, 489, -238, -294, -460, 388, -21, -73, -592, -243, 258, 44, -133, -419, 157, 105, -34, -210, -197, 89, 3, 392, -303]
2877c03j1M37K93l79k10k00Q66n4p15j26L76J56mk11k97N69K21j44n58K77o0M54
2899C77m00k30J37K49L30p59j16K50L17J01m98J86j41M12rn26K19J37P5Q2k60
2920f7j83L30pq8n08K74O38k37k65K50k22J80J12k57k66M20k1o3k17J26J73Q3
2942A85l70j79L74K27j38J23k98r6J1K75j38j49K06k1l7N1p3J05J43k93k58L07
2964d3M52m15k40K19P2K55k22l37J08j40M45K42m12k35N50l08J24k58K38J21l0
2985A86l08o3J68J59j00k48rM41j32j4o28L48K99K84k34l71J08K37K27m20J08
3006C8m09O06L9r6l48J2N47j54j09n00L10J74L1k47j27M09K51k20n42J23O20j16
3028B92m45n54M58Q87l46m54j11K17L59j88l30j5J09K38J47j49m19L5N46p4n27
$$ y = [-303, -314, 123, 416, 37, -173, -373, 493, 439, -276, -402, -26, 130, 126, -85, -382, 187, 408, 264, -294, -17, -77, 377, -23, -253, -116, 133, 463, -296, -412, -162, 155, 256, -242, -56, -197, 215, 206, -320, -101, 36, 111, 193, -67, -250, 80, 73, -15, -523, -249, 389, 152, -113, 137, -85, 95, 207, -50, -316, 104, 83, 20, -197, -71, 102, 185, -185, -364, 10, 237, 99, 222, -76, -172, -161, 114, -24, -173, 33, 12, -25, 26, -47, 58, 201, -92, -350, -43, 409, -6, -246, -27, 45, 300, 78, -259, -151, -291, 154, 396, -16, -251, 299, -9, 115, -143, 95, 216, 186, -122, -185, -17, 142, 42, -206, -215, 226, 94, 80, -548, -200, 99, 383, 149, -222, -114, 123, 350, -70, 38, -371, 235, 274, 178, -170, -158, 389, 235, 126, -374, -64, 110, 141, -106, -233, 176, 427, 207, -335, -212, 408, 292, -153, -707, -249, 638, 292, -162, -273, -56, 303, 115, -215, -230, -121, 117, 264, 115, -304, -269, 277, 203, -324]
3049c24lM89M06p23n78M59N65L80r68k51M79N67o76r3Q6J03M12l39j17m93N98
3070b1N09l64j46l46O26M02o04l92J45P22K10j003k07M00P69n02p07J82N43J96
3090D12o11n24Q47j20l2J64l04j44L69L64k63n32L3O97P12j070q03M06R92j97
3110C96q82k39J157N14j080k26l2P71O8o77j05O38k96J26J28k96n44P21L02k70
3130A74o96j33J193J13j275k37Q05P91l19j131R1R13J29n70n76N97P84m13p69
3149e29J57M63j64L59j84j00j14K41M03p07k31K54P30k44p89j39R25L71p33p34
3169g65M41J131l81o49m81Q88K97m31o30L18N67J33l64j41j80L26J12r1l09l22
3189e31N28O78n90q73M76N57M47q69l99M00O10k32q02L56L96k06K62j47l53L82
$$ y = [-324, -327, 162, 568, -155, -733, -274, 291, 671, -297, -548, -69, 498, -178, -271, -185, -82, 330, -9, -126, -619, -21, 488, 124, -22, -368, 258, 660, 56, -336, -191, 531, 741, -262, -469, -69, 700, 198, -509, -327, 216, 412, -199, -723, 124, 4, -28, 136, -168, -312, 57, 421, 158, -374, -341, 356, 1068, -2, -805, -399, 593, 396, -486, -725, 432, 946, -134, -360, -392, 379, 447, -230, -335, 303, 7, 133, 261, -35, -579, 142, 444, 174, -522, -655, 538, 651, -624, -861, -56, 735, 416, -715, -624, 289, 418, -152, -728, -131, 653, 240, -529, -372, 91, -73, 286, 102, 2, -112, 129, 532, -175, -406, -152, 578, 334, -455, -594, 331, 702, -31, -765, -324, 807, 426, -223, -704, 184, 481, 50, -580, -262, 305, 438, 74, -67, -247, 79, 191, 100, -209, -531, -3, 675, 85, -788, -312, 245, 692, -177, -576, -176, 434, 202, -600, -244, 152, -54, 208, 61, -292, 90]
3209I0P7K6k39k30N12J31k63n22P3M66L38l66n19O84N48p87m93K87M38J78m15
3230A4j74L2K90L58l83%j93j49L73k24k43N76k57P07r17k39M11j21K94n72k13
3251f30O32K47k91k14n2P86M5p53k24N66J83j52k35j59Q6K91k26L01m84J08M22
3272B47N7n43j22L27K98l08k99K36K99q2r6n28N09L21k19j73k83M40k7p0m4o6
3294a26J46L30k47j99L1M28k34j2m28K52O55l15m42l07L32L47k38m54J18N71O1
3315B69l05k74K2M08j12R1k00j96M45J22n5m53J67K41j07o8J48k11M10l14j76
3336a48J59k58O10l02j63j26M4O37l20k09r8J12K92l55JLK60M8k96L0L73p8j32
3359H4m07K09J49R4P8n24Q5J40o4J15L6J7kK39l43N0K39l9q0j14j7M94m07l2j04
$$ y = [90, 167, 193, -46, -276, 236, 367, 104, -418, -345, 121, 459, 93, -426, 258, 806, 19, -474, -187, 251, 429, 14, -160, -128, 162, 520, 137, 137, -56, -205, 168, -56, -299, 277, 20, 727, -190, -429, -18, -139, 155, -417, -630, 2, 249, -42, -256, -308, 478, 523, -230, -454, 112, 295, 143, -92, -251, -165, 126, -100, 201, -283, -175, 247, 304, -239, -361, -34, 264, -44, -343, -107, 192, 110, 14, -514, -5, 316, 97, -76, -359, 81, 54, -16, -60, -126, 20, 350, 103, -96, -65, 363, 129, 117, -311, -59, 596, 281, -161, -468, -136, 211, -27, -481, -363, 208, 269, -36, -310, -288, 120, 8, 99, -101, -297, 148, 270, 215, -238, -71, 170, 63, -5, 143, -68, 342, 28, -148, 11, -247, 363, 61, -102, -228, -184, 453, 133, -76, -174, -62, 230, -125, -124, -121, 139, 187, -109, -79, 294, 216, 84, -323, -114, 35, 129, 207, -317, -232, -92, -156, -41, -5, 12, 10, 249, -94, -44, 195, 156, 76, -38, -55, 439, 32, 0, -104]
3384a04j87K27N06j42n08P2J98k1r8rJ73P7o19M97k09J54K69l28K81m46M19l01
3406i9K36l02J04j61O45l22L0j62k16L38j18Qk25M67k79l30K99L31l14M16l73
3427b7L07k45k08L01l07jK37k05j72L13o3J78O6j1r6k59K10N9J16j87k46J26N2
3450f2j09J9K63k96J45j58L35M3j68l2m8K39l6R8k46j10J90j07j32M77k69r5n4
3473a13N35l55r4Q7k98L22l6J75j45M9j8j52j33N4J32K6m7r1J91oj91j19N21j45
3497A49j70j50K98L8k15k6M70l64k9l1j6M18l30j98O5j13K81L11l50p3j6j84K27
3520hJ70j37k06P0L83n21K53J22q9j60l8N41n88l3L70j66L5J94M8Ll92K76o8j09
3544e0J50l5q8O7L6k48M6J06o9J67m39L02L22l4m06N0qJ6M04p65L83N6M6l8n6
$$ y = [-104, -291, -64, 442, 300, -208, -136, 62, 41, -57, -66, 107, 184, -435, 62, -147, 7, 276, -52, 229, -217, 202, -99, 137, -165, -61, -222, 423, 101, 131, -31, -247, 91, -27, -19, -244, 223, -56, -386, -87, 244, -70, 346, -27, 280, 35, -173, 128, -179, -180, 57, -148, -320, -7, -70, 108, 174, 163, 67, -192, 18, 77, 193, 6, -240, -114, -62, -171, -152, 111, -185, -40, -198, 137, 180, 12, -20, -68, 171, 135, 233, -13, -123, 67, -40, -172, 305, 36, -59, -113, 422, 67, -27, 60, -238, 84, 48, 223, 78, 127, 109, -43, -176, -122, 10, 36, -11, -102, 89, 83, -108, -227, 294, 149, -21, -171, 127, 165, -50, -76, 394, 30, 1, -30, -46, 372, 42, -156, -91, -204, 77, 388, 38, -35, -51, -235, -8, 162, 25, -181, -111, 272, -249, 4, 126, 37, -123, -161, 380, -208, -241, 129, -37, -2, 192, 240, 243, -149, 127, 59, -50, 100, 65, -23, 44, 80, -168, -122, -16, -85, 82, -357, -55, 267, 233, -173, -123, -131, -115, 289, -476, -93, -37, 9, -29, -85]
3569h5r6L84k14K25k45j37Q2M35k94k81lJ09M16l37q2p3K62L83n02r2J68K58j41
3592A40j93QK23K7j08j60J98k51L15j90J58l12L32r1ql87j39M61K89m22j63j38
3614d11M21M45n08M4J38j96M1k16J87J28j2m0pL7j98J84K07k12j80J12L20m32
3636a48j74O6N25k74p5j76K58M69q3l49j98K81j54j16k79J99K60j39L81m51K85
3657A08o4j44L62n62L62J46q2j45k70L3M22r4m12J99L2N03n76M3l3K53J82j22
3679A41j98j99K40L10k17n05L79j1K17jk76K09R7p2o7k98K25m3J60j58m06L08
3701a65M37j06j03l05K58L03j10k84j63M34L77l83m23M84j12J21k26l40N3M73
3721B20j65m64J32m3L87K61n26l3L52J01l06P1j10P0O18l82l17q3K35J27m42L2
$$ y = [-85, -181, 203, -11, 214, -31, -168, -86, 349, 55, -226, -229, -120, 296, -41, -123, -196, 66, 449, -53, -145, 23, 281, 140, -53, -45, 178, 205, 97, -63, 135, -116, 199, 9, 167, -145, 187, 96, 88, -299, -438, 23, 312, -110, -273, -411, 10, 455, -53, -9, 129, -67, -26, -242, -55, 73, 61, 21, 14, 51, -147, 37, 244, 32, -148, -36, 284, -148, -322, -256, 269, -5, -80, -256, 2, 471, 388, 39, -159, 122, -32, -148, -427, -228, 32, -107, 274, -177, 108, 44, -100, 262, -300, 62, 208, 126, -19, -289, -256, 166, 72, -340, -141, -109, 394, -182, -139, -172, 81, 263, 141, -57, -256, -16, 294, 77, -428, -49, -60, 157, 156, -120, 89, 186, 114, 47, -251, -26, -69, 91, -67, -473, -165, 272, 166, 63, -242, 16, 319, 209, -75, -238, 196, 573, 190, -233, 251, 139, 260, 34, -306, -253, 220, 55, -409, -277, -320, 67, 328, -198, -231, 121, 222, -84, -13, -123, -53, 565, 183, -134, -217, 18, 145, -297, -265]
3743b65L45L1M56p66K40P3Mj50j43P9J43L03o5k35J72k76M19k04o46M29M77l33
3765H8k11k40M7N39j7l77O2K72ok77l94O09m3K9j72L7j82L14j64J49n1K48J15
3788C75j26k63R5j73J19J35l35J17R0j8j33J7J07qK03l45J2J45r4R7O1j31j57
3811b10L12P1k05k60K65J23R4m13j05L39K13q3l68J20L04o8n2k88K28J50l21L33
3833A79k54K82j66K6r6j37l7M01K61n33r7K1M82l20j13K33O0j57j67J48J91J7
3855B24n08J94J37Q6J85n39J36K44j47O1k88K08k8K04m7p0J49m76J64K01J24k29
3877a5jJ18j38j70K73J9Q1k10M5L07m9k29K46n20J57m0j8O0J13K34m37K19r5L3
3901a7R8O7j03m05K41K75l32J89k72J99Pj67L72n29O69m02L55l69K68l77K39J69
$$ y = [-265, 80, 111, 567, -199, 41, 114, 118, -32, -175, -96, 47, 350, 285, 50, 222, -54, 365, 161, -485, -56, 421, 88, -123, -363, -316, 223, 206, -171, -109, 163, 157, -120, -514, 95, 52, 81, -91, -54, -236, 78, -86, 63, 12, 260, 375, 249, -14, 81, -92, 27, 162, -173, -56, 34, 16, -117, -100, 7, -1, 202, -143, -131, 14, -80, 17, 78, -53, -210, 102, 173, -32, -292, -27, 96, 190, -223, -328, 11, 224, 141, -227, -107, 197, 129, 77, -211, 17, 167, -154, 179, -75, 207, 41, 67, -29, -166, -203, 198, 459, -74, -171, -150, 332, 12, -101, 132, 192, 35, -132, 16, 207, 224, -284, -90, 47, 133, 318, -221, -85, 159, 12, 73, -215, -7, -35, 169, 122, 52, 201, -275, -111, 90, 214, -15, -16, 102, -36, -206, 67, 86, 167, -43, 2, 309, 260, 31, 277, -243, -86, -126, -144, -84, 29, 263, -174, 45, -50, -17, 81, 148, 45, -360, -119, 156, -176, 13, -259, -60, -53, -220, 152, -377, 292, -110, 245, -124, 144, -233, 6, 175]
3923A75k04J8j73j13J24O5j65J44P1K38k60R1J0M25m20K66k55J32k16Ll16M99
3945A39j49M1r4j9O8j31R0J34m6M3o8j37n3L12j6J17j90j8l39M49k16J95j76P
3969e7N9j73J68j16M77m81L16k96J1oK83j94k28K10kl14L55J47j25K79j27j66
3991B0k47L12j10j92L79n76L15P7r1r9K01K1r2K04l82L02q3N4J49m06K93p5J36
4014A10k73J97K0k78K83k04L08k65J85k04J32K06l72P9J9J18j3k88K43J34l60
4035b23p9L79k66L0M21m78N9R9N2j94n4J63nk94K57J34J22N3k2j55J21J2k23L3
4059e8J62R9j89k70L64j32j69J31J11Q4K09m07r6K78R2j18j85L0N1o8J55J45m7
4082A72n59L05M34l40L89m08k24J57k9J84R3j05k38J67M5k33J05r9L78P0m34j70
$$ y = [175, -29, -11, -184, -297, -173, -108, -273, -129, -58, 180, -80, 11, 21, 446, 26, 292, 37, 169, -47, -44, -360, 139, -10, 31, -63, -82, -14, -145, -55, 79, 33, 76, 8, -129, -182, 130, 114, 231, 41, 23, -316, 133, -83, 112, -64, -57, 2, -171, -3, -119, 358, -123, 193, -103, -92, -98, 185, -9, -237, -27, -29, -343, 12, 159, 34, 313, 186, 20, -227, 85, -25, -217, 162, -414, -99, -22, -113, -212, -11, 10, -82, 122, -260, 42, -41, 13, 162, -244, 49, -26, 110, -163, 34, 54, -224, 59, -145, 163, -102, 83, -121, 11, 217, -155, -76, -57, 61, 48, -240, 3, 137, -223, -302, 77, -189, -159, 262, -216, -157, -58, -6, -200, -254, -91, -96, -390, -133, 1, 123, 176, 154, -1, 120, 132, -91, -58, 104, 203, 14, -256, 108, -24, -193, -62, 49, 133, 342, -65, -161, 117, 209, 91, -94, -64, -13, -81, 74, 219, 172, -387, -82, 352, 12, 401, -7, -231, -74, -103, 81, 174, 69, -169, -2, 43, -190, -85, -184, 194, 264, -170, -340]
4104c40L01K85k38J1J02M3m18J04R0K58l47j3l8K03R2J13m49M87j25k75j0K18
4126E4j9P0J09l68N1R3q2%J38Q0l36L13J16Kr9k96K42PO6l3OJ53n6j42j27M00
4152C42k52M8j44J95j84K80j5m85Q1o3K40J32k97k8O9P2p3j6J01k40L50m42L3
4175b96K00K22K0k56M35j61K6k84j64N7L11k32J45n1J83o8j13J44l32J8L99l03
4197a00J03O4j8j72k12J86J64J71l43Q8J66n7j40P1N7M3j12o4n6J04L09m76m8
4220b72M41k10k35N64l65O4k4J13J65l78M6K03j82k55qL21J06N5L7O2k95k74L11
4243a0l93K81L3J62l26J70J3j03P7j37N02j72P0N5k21J6j51J11J06K25l97J39
4265E0J43l22K93M3k34K85r1n45L85j07j8M50l29j96L72r6Rj46R5k5J27O1k14
$$ y = [-340, -39, 246, 8, 19, 121, 164, -254, -150, -60, 198, -149, -162, -200, 3, 95, 208, -241, 246, 121, -154, -164, 54, 35, 105, 214, -154, -103, -10, -92, -92, 46, 126, -210, 103, 219, 221, 122, -174, 68, 75, 141, 108, 114, 267, 211, 69, -58, 342, 90, 138, -6, 189, 5, 285, 270, -215, -134, -197, 43, 175, -122, -150, -81, -9, -82, -98, 3, -237, 113, -329, -296, -96, 126, 146, -110, 325, 164, 190, -94, -258, -201, 110, -122, 23, -28, 155, 87, -26, 118, -214, -196, 203, -100, 3, 67, 49, -123, -335, -149, 15, 186, -157, -69, 97, 40, -100, -29, 28, 71, -41, -105, -161, -57, 252, -224, -272, 169, -41, -276, 288, -77, -13, -37, 76, 241, -137, -91, 112, -70, -325, -333, -12, 94, 149, 186, 248, -47, -321, -10, -403, -122, -89, 73, -253, -83, -70, -173, -96, -233, 269, 97, 167, 222, 1, 17, -134, -23, 83, 308, -89, 50, 193, -129, 164, 207, -27, 258, 167, -378, 7, -100, -118, 332, 3, -193, 179, 83, 92, -54, 41, 16, 143, 204, -10]
4288a0L0J42l17Q8j15L14k06K74%k05j52j2L55o6l06Q0j44M11j56r1L83q1Q0m38
4312a42L45j68L21j29l37r6K7K64K9J37r3l42K32J47j26L9r6L18M6l23k89J54
4334h2K75n39M28L1j15Q1m79L82oL61j58j23J51J19n27M7J18j64M29n82M42j98
4356a09Q2N0o5P2n9JM3P1K01l27N6r6L6R3J99l74L05l63j9L14K0k90J57R0M3k33
4382a02lK64l77J89R0N3l87M8J68J79l7j34L36j83j95J00O4j05j50K16J50k19
4404c5m02O08j12J64j26o6J48j00J34k73j37K31m2m5J44q2k42j32K7M16l52J22
4426a52j97L61J74m34L91j25k40K32K59J8m8O0n45Q28l62K7p19J02N33r6N8k83
4448a58J88J3j93J06o7J10R9J26l21l4K22J72l40O4j55J74l63N21q4J7j76K0K24
$$ y = [-10, 20, 162, -155, -67, -182, 132, -74, 200, 200, -5, -157, -169, 186, 120, -186, -106, -250, 161, 5, -86, 297, 216, 296, -142, 203, 35, 356, 227, -110, -206, -179, 85, 114, 251, 158, -184, 48, 195, 69, 108, 12, 330, 376, 53, -236, -82, 193, -346, 82, 113, -2, 79, -400, -18, -24, 337, 179, 56, 207, 326, -201, -154, -36, -200, 229, -353, 89, -109, -27, 23, -42, 30, -29, -28, 15, 86, 287, -40, 16, -80, -44, 49, 248, -126, 179, -184, -203, 111, 131, -159, -2, 88, 131, -102, -105, 159, -218, -29, 61, 114, -273, -225, -57, 122, 85, -49, 287, 104, -91, 9, 73, -32, -182, 34, 184, -35, -437, 171, 59, 223, 97, 31, 179, 79, 213, -60, -197, 34, -8, -53, 91, 9, -233, -365, -338, 78, -274, -152, -349, 12, 186, -248, 143, 18, -222, 10, 269, 287, 239, 299, -246, 582, 220, 247, -472, -370, 163, 67, 125, -158, 30, 43, -150, -44, -111, -1, 98, 224, -97, -131, 91, 263, -77, -13, -168, 6, -357, 164, 80, 97, -79, -59, 165]
4471A65j9L5jk88m6N33m21J03R5k73O1j73K17J58j34K3p8k6P4j45L66j68J19j42
4495C5M5k75m9M93j11K2k44K7JO5KK6k4K83l93M05k13J46m50J31J7K99k88K47
4519A97m60j46L36K44l06K11o2j25J46R4j77k75Q2MK50J96j01p9o3M28n07J41
4541B8k53K58j46jJ15J23n9P6k46Q3J91M2L1k95N9k02L01k89J01L30k56q3J78
4564H6j39o8K6K06k53J72j32P2n8J92j76o7K31k35R4o0K67j83Q9LJ24j69rp0K74
4589B17r0K6k6j20J04J09l05J38k69J6Q1j3J16R3j78P0q7j06J68K78L3k31K24
4612B48j16m72J56L89l12J13m8j17L24J08m26o2L77l08p7L7L53l01o0N5qj53J65
4635a35R1J38p1r3j02r1J41M64r0l06L07q9k12J27k08L17k58K44m3KK1j35J22
$$ y = [165, 146, 181, 180, -108, -154, 379, -42, 61, 156, -117, -56, -229, -12, 146, 12, 35, -43, -69, 5, -140, 226, 58, 177, 35, 80, -195, -244, 249, 138, 160, -84, -57, -56, 9, 11, 37, 13, 296, -97, 308, 95, 241, -209, -78, -61, 238, -50, 197, -263, -409, -73, 171, -135, 76, 14, -111, 35, 129, -48, -323, -241, -237, 13, 209, 108, 29, -34, 394, -113, 28, -225, 33, -113, -114, 1, 124, 65, 141, -105, -22, 169, 211, 242, -53, 6, -196, 105, -184, -83, 247, -9, -92, 86, -53, -121, -95, 111, -142, 30, -102, -30, -88, 104, -72, -139, 92, -143, -49, -109, 158, -25, 64, 67, 191, 22, 13, -57, 217, 127, 153, 127, 7, 111, 220, -85, 53, -216, -200, -119, -132, -16, 77, -101, -31, -118, -224, -56, 222, 255, 24, 248, 132, -340, -184, 205, -107, 6, -42, -159, 165, 273, -153, -215, 162, -146, -223, -186, 167, -134, -194, -139, -147, -300, -135, -44, 94, 23, -70, -172, -263, -122, 342, 252, -54, 253, 164, -48, 79, -129, 188, -70, 174, 131, 133, 154, 19, 141]
4658A41l55K43o8n4K9N1J42l13j43N81j45r6j96j8m9J25J24Q7j32j44K40j20k16
4681b86L56oN2j80K77j21k28J8M7k4K07j34k71L27k84J83K23J9k57J13p2lr6R
4705a31j59M40l20L08M3O0nk91L12k15m4J37n23K94j7J12j16l1M8j87L78K20l63
4728e0N0QM1o7J05l08M25j94L83n61K14k05J34P9K8Q0l19m2O61m38M3k93K86j24
4752f4J30mLJ28k85J24k14J45J14j30j14k2L25o7m0j03k28N43k53J66j08K06m06
4775a54K44j11p7Nj02j53J86J19j44N43m82K17l19L32k65j77M25N8k14K77l45
4796a37Q6J31k50o6L37m0K56m75J07j4J63k95l2K05L3l7j61N03l55J15j90K7J24
4819C5JL51k81K7q0k76K70R5k29j93J68J88q8j77J4M74j07m97M76l75J07L1oj28
$$ y = [141, -214, 29, -39, -93, -64, -13, 129, -184, -327, 254, 109, 13, -183, -201, -250, -125, -1, 86, -46, -190, 50, -70, -286, 70, 64, 116, -64, 213, 92, -136, -118, -71, -95, 112, -22, -293, 34, -250, -67, 156, 175, -82, 31, -41, -44, -140, -131, -290, 150, -170, 138, 181, 241, 236, -55, 257, 42, -2, 135, -388, -94, -111, 1, -115, -146, -98, -285, 93, 313, -50, 0, 8, 49, -18, 87, -221, 204, 10, 393, -168, 46, -159, -25, 54, 82, 162, -157, -199, 462, 24, 67, -226, 60, -64, 66, 62, 65, 193, -92, 32, -182, -37, 77, -53, -167, -189, 136, 69, 29, -74, -302, 241, -12, 154, 46, 252, -154, 90, -21, -98, -93, -195, -348, -162, -43, -187, 356, -126, 91, -228, 104, -161, -338, 87, 145, -69, 208, -137, -51, 80, -170, -236, 101, 61, 317, -158, -51, -65, 98, -197, -229, -24, 9, -28, -189, 314, -41, 74, -116, -89, 35, 36, 387, 106, 133, 53, -223, 47, 142, -87, -280, -112, 76, -12, -189, -175, 299, 192, -305, 171, -204, -97, -66, -72, -200]
4843b00L03n1K42m22N0J04J86j26m86L87j26J64R0j55J24r4pK46k66L9P6pj44
4866g3k6K40j15j50oR0J31Q4j10j36J00L53m24O5q4J02M6m9j73P8j31J9M11j64
4890G8J2l88L18N7l48Q8J14k89K63K14k27j15L8L01J51k5j42J21J0m87j92L82
4912f6n8j29O18m66L39j98J51j22K33m12j3L75l92K78l26J54K4j65K79l07L38
4933A35j68l15M41k50J60N6J1j82N5P3J1J47k65m0K60o5Qk71L19j60n2k29P6M61
4957B16m02J94l12K65J29n8j48Q9j04J83J81j47k27J00J43j08o5P9r7J83j75o4
4979a45m0J79P6k33J66M6J6J10l12K6J17J54P3j97Mj14L2j8m7m3k42L83p8J46
5003E9k06J94j8qj90J62M93n59P1k1K56k78j35O4Q7k5l9K63j04k03J15j37L47
$$ y = [-200, 103, 52, 294, -128, -78, 26, 212, 86, -400, -13, -139, 25, 115, -40, 84, -10, -17, 229, -37, 2, 78, 71, -73, -99, 141, 26, -124, -130, -40, 91, 175, 65, -71, 29, 382, -42, 23, -61, 41, 87, 38, -135, -57, -188, -169, 242, 78, 90, -298, 20, 77, -271, -183, -69, -358, -95, 119, -108, -223, -185, 116, 267, 242, 100, 221, 231, -256, -448, -66, -124, -253, 365, -101, 238, 40, 191, 69, 302, -110, -123, 252, -140, 138, -188, -34, -10, -175, 104, -203, 135, -33, -348, 93, -157, 3, 59, 70, -112, -57, 16, 27, 174, -91, -131, 129, 64, 72, -199, 120, -40, -92, -321, -245, 216, -186, 8, -304, -39, 90, 32, -116, -27, -131, 52, 233, 86, -141, -41, 102, -6, -71, 8, -89, 94, -81, -145, -185, -6, 70, -163, 3, 49, 65, 175, -137, -111, 6, 160, 233, 36, 40, -74, -42, -60, -107, -150, -392, -9, -87, 59, -147, 47, 29, 21, -169, -7, 486, -73, -2, -23, 233, -45, -180, -116, -29, -54, -93, 170, 66, -137, -22, -159, 188]
5026A88n50L07j51L79%j57k67L13mk8j48Q0%J14k33J48M3J1j54Q2j57J85j37K20
5050H4p9K26l31J53Q0q6o8O9l30L12Q1k69L26k72J14mj9j09K0q0K58P0jmk35J03
5076IK55n34J61j30L09l5pk02K93J7j26P4k90L28l53J29l0L17k7m23K45m4p3P3
5100f4L8K29j48m34M8L96k42R7m6K11R9k23k40M47j97k2J88O6j79j14N77m02j76
5123i1J34J00j69N2r7L33j92oo4j25K7j77L70k67J4L9K5K46M6k4j55j94J24L7
5147a4o5N5pj30J19l1R1K17J33k03j6j14J72m57L06O9N0k14o7J16%r9L23l72k5
5172a63J28ql7L80k72k67M36K9j59j86J53l63O12l33Q5j27J37j32J53j80j24M68
5194B30j49J39P8l73O0p1j9J45P1l17J65J18j30k18J01L81j05j51o3N1N8L6J58
$$ y = [188, -362, -55, -206, 173, 173, 16, -251, 62, 58, 30, -118, -38, -38, 76, -157, -9, 34, 45, -109, -27, -184, 1, -136, 84, 5, 231, -100, 53, 133, 47, -21, 48, -282, 30, 111, -158, 168, -104, 10, 6, -13, -122, -102, -182, 76, 146, 145, 141, -94, 9, 264, -270, -109, -239, 70, 35, 28, -174, 119, 136, 10, 84, -206, 122, -231, -102, -132, 185, 158, -265, -20, -64, -137, -64, -26, 203, 55, -379, -331, 65, -177, -80, -126, 85, 184, -39, -279, 168, -29, -51, 137, 203, 24, -90, 487, 85, -91, 43, 143, -26, 26, -71, 262, 70, 64, 0, -125, -98, -275, 95, -172, -158, -119, -94, 152, 198, 174, 19, -175, -51, -14, -79, -24, -31, -161, -42, -73, 18, 235, 368, 165, 149, 35, 207, -250, 56, 125, 175, -39, -106, 10, 10, -89, 234, -138, -163, -35, -43, -80, 300, 28, -239, 197, 226, 67, -119, 34, -329, 283, -50, 35, -92, 45, -87, 66, -114, -238, 230, 81, 220, 298, -75, -15, -86, -105, 40, 111, -206, -41, 77, -53, -271, -170, 211, 106, -45, -108, -57, 1, 37, 195]
5217A95j53j46L85k23k27J01k2K10k6j86J18O4k76K0L47l32K16N1l45K20L12j8
5239B85n24M11k48j11J7K98k20L15k49n2K37j93J6N0O6R2l08K02J01k78m1J58
5261B4K39k13K5j25k07J64k8K81J3L2k64J5J80q9j53J81J2R3J06m43pp8L2M85
5285B75j41j99J17j98J92k40L13k07K59m38L5N68n44L54q6oJ20k18K14l03J27
5306fL85l29K7J03j55j77J65l4j29K70Q3k86j70L86r7qL2K7J32k31j69K23j01
5329e9j98K31j63K0K61k24q2K53J93j62j79L8Q3k75K83q1K17l80o5K87N2L9j43
5352e4P7J48J06j70M2j41j34J72k71J95K72j20P9k25MJ5j59K22j10K34lj2j2k36
5376h1K62L8l42K82k98K26K1o6k42M06j00k35L01k97J82j23J67J17l29K04j35
$$ y = [195, 42, -104, 281, 58, -169, -68, -90, 120, 94, -92, 26, 90, -186, -166, 181, -151, 65, 116, -229, -9, 303, 285, -239, 172, -76, -187, -170, 128, -92, 223, -26, -78, 159, -34, -18, 32, 98, 190, -118, 84, 185, -93, -134, 24, 263, 50, 75, -50, -257, -93, -121, 160, 173, 205, -59, -44, 136, 47, -106, 75, 87, 180, 286, -157, -164, -242, -210, 275, 134, -65, 52, -146, 46, -194, 119, -88, 171, -267, -232, 336, -208, 146, 60, 54, 174, -44, 170, -133, -6, 379, 50, 77, 180, 25, -152, 13, -21, -150, 120, 203, -83, -253, 133, 36, 28, 60, 87, 219, -12, -181, 42, -59, -257, -26, -189, -169, 92, -132, -214, 39, 232, 70, -109, -71, 12, -263, 20, -61, 156, -224, -289, -2, 50, 89, -54, 23, 171, 277, 107, 149, 8, -126, 46, -225, -30, 242, 122, 201, -24, -20, -5, -164, 58, -52, 182, 179, 167, 155, -81, 181, 219, -123, 159, -139, 87, 108, 42, -200, 206, 106, -129, 172, -125, 57, -66, 101, 218, -111, 93, -42]
5397d2O5k25K28k02K19o0K4O5k59M76n82J62k03M13j25m4K54k7J25j45l8l11L51
5420A19l49L52l03K09p8J06J0P8J5j82O0J01J31l22M5m8lK10J06j68j65j57J63
5443g0p6J76J90n2j00j59N84m70q3P7k47J92o7J21J77j58J49l95M29n9l49L02
5465A12Qj65k20K69k70M02j99k43M21k05J08NJ29k52M07m00j7K76j3l98K86n4
5487a3m1J28n8k68M62M2n42P9R4J43j14O8J10J13l41J42k72J72kK6J11k46mO1
5511a50N5j57J74K2J59k23j03M53r1r1j65J79j82M5r1J38j98K41j11K0k3n1J31
5534a9Q5N6O6j87Q8j02K71j81q9L65l62q4N7Q2k60J72J75j13r3L06o0k75R9k29
5558b32L63l94L39P2J7k49L05n8n7m4j99J88m9Q3m7K24m89L16l18p5L45j3N4j97
$$ y = [-42, 23, -202, 26, -176, 43, -17, 7, 72, -187, 289, -293, -131, -334, 79, -46, -90, 164, 137, 262, 117, 79, -232, 119, -230, 122, -181, 28, -50, 56, 66, 144, 159, -23, 37, 138, 269, -53, -8, -56, -59, 151, 257, 89, -76, -233, -70, -146, 30, 220, 168, 68, -91, 493, 23, -60, 17, -230, -38, -105, 16, 193, 35, 184, -211, 218, 159, -190, 112, 120, -45, -265, 4, -266, 136, -63, -306, 115, -90, 18, 23, 152, -100, 307, -93, -110, 166, 153, -245, 41, -13, -54, 74, 16, -252, 210, 252, -290, -211, -117, 26, -88, -20, 90, 203, -138, 4, -268, -96, -98, -72, 39, -207, -211, -150, -95, -252, -78, -56, 103, -120, -223, 230, 139, 48, -117, 62, -120, -75, -166, -28, -226, 15, -96, -76, -99, -150, -19, 66, 122, 188, 1, 89, -13, 258, 77, -12, 353, -9, -93, -36, 46, -214, -42, 133, 20, -73, 233, 173, -102, -3, -232, 131, -263, 76, 148, 165, -84, 221, 163, 106, 62, -137, 51, 2, 85, 38, 262, -227, 89, -229, -304, 41, 28, 82, -115]
5582a15K45R7m45J43J60j29r7K6j52J9L76m0M5r7kM4n7J30k53J83k4n4J70j27
5606D6L4o0k7j80J94K80l69K45k99J65k48J13K30j24k0j66J50j75O7j6R1K13N5
5629A99j69k41J93k41L89k38j55K12oK67j12J8j59j09K9L9q6J22q9J30L91m70
5651h6M3j94L37L3j40p8J86j9N0k47L89m33K1L15l41K57j24J62m99L40L60l39
5673gJK10r7j53J13M0j69L01k26k13R5r5K68l60K61mL5P8o8K8o7J08k67M07O0
5698B79k95j02O5J49j0k61N81n08j12R9q1K63J35j93J9M6j78J78k67Q4K00J95
5720B86m12K14j50j17K30J88j39m6l28R6N08l60N9k75M27l46J54K02k97J66P3
5741A33N8o9l34M63n60K23k4L85ok25J07k5l52K53n4j75Q2j04L60O7l66J82Q6
$$ y = [-115, 130, 227, -218, -75, 85, -44, -141, -115, -267, -248, 128, 88, 133, 36, 34, 78, 21, 151, -102, 81, 57, 3, 173, 46, 80, 20, -7, -187, 7, 287, -82, 163, -136, 29, -219, -106, 124, 0, -20, -186, -36, -211, -144, -160, -69, 144, 199, 30, -211, -18, -259, 130, -108, -263, -51, -57, 210, 98, 116, -43, -152, -123, -84, -170, -48, -137, -7, 384, -86, -43, -237, 100, 133, -7, -85, 101, 82, 132, -115, 274, -159, -138, 177, -164, 93, -31, 131, -368, -28, 332, -7, -6, 204, 107, -46, 67, 107, -62, 239, 13, -200, -105, -200, 68, -292, -31, -35, 0, 78, 10, 38, -29, 79, -188, 219, 279, -16, -118, -53, 96, 86, -175, 406, -102, -214, -115, -196, 67, 202, 9, 28, 74, -104, 74, -193, -109, 91, 286, -126, 88, -62, -179, 51, 239, 100, 54, -274, -178, 330, -30, 29, -246, 181, -165, -11, 191, -106, 60, 133, 191, 122, -212, 251, -309, -86, -110, 275, 269, 44, 151, 126, -226, 27, -27, -202, -120, -224, 136, 203, -163, 19, 105]
5764A05P2j23q4Jp9J35M0M8k21k05K53km8k5K17j3j76P5j18J61r5j83K87k26M35
5789B31j63K16k34j87R7j56J01j13K86o9K4j55Q9q2J56q3q7jK75N7q1M0J73l15
5813A9K09j10m8J48O5k84k49J01N2k1JP4k31M9p0P4K15j45K90k87J86j17J96j42
5837b5k89J66P4L93m13K44k41J24j60K81J9n71M78q4J5J91l25M07k88l3K95k53
5859Em1J47k54J36N6m5Q2l7k7J19P0l02J52K28n85J98K24Jj7k20k8N7K30k42L60
5884B67k1j4j99r8M54l49j18m5J70j13j59K10P7j12K22k08ml62L36M4m3J69j24
5907b0L4o4K46m21J38L70j71o7j18L03k11j52J51q8k33K89q0J73J3l01J33R3J5
5930C2O0L5j29J72l85K10J37j28m01K39K10j55K25k04K97l48K16Rj44q7P4N1m3
$$ y = [105, 177, 54, -30, -29, -108, 27, 67, 115, -106, -311, -58, -60, -108, -133, 84, 71, -105, -30, -148, 13, -82, -265, 22, -204, 231, 68, 284, 50, -137, -40, -196, -95, -208, 78, 9, 33, -122, -33, -115, 41, -42, -129, -130, 145, 202, 121, 161, 334, 19, 228, 118, 70, 218, 283, -1, -250, -149, -97, -118, -117, -43, -274, -225, -295, -221, -6, -151, 139, -148, 38, -79, 117, -25, -314, -148, -74, 319, -94, 150, -91, 33, -127, 154, 173, -398, 80, -4, 11, 202, -123, 284, -4, -37, 258, 5, -36, 111, -143, -7, 49, 4, 86, 49, 22, 141, 211, -91, 61, 289, -296, -98, 126, 127, 110, -110, -138, -81, 149, -93, 267, 246, 232, 33, -65, 389, 40, -78, -123, 47, -66, -225, -15, 62, -50, 172, -36, -40, -402, -66, -22, -65, 104, -20, 14, -50, 196, -225, -87, 283, 112, 45, -73, 230, 19, -133, 18, -70, -303, -14, -94, 79, 92, -209, -76, 17, 32, 92, 127, -2, 170, -215, -5, 132, 4, -397, -158, 52, -103, 122, -82, 215, -133, 83, 92, -52, -139, -65, -14, -57]
5953e7K07J73k48j86J07R9O2n12K83L0L8o2Nk3J62j55M9K8r8K26k66J94M7j98
5977i5J05r8L60n80J52R6J3J08L8m3j76K39j28J06k75M92n34L73k76L45j68j47
5999i3J68j24oN6J25M1n7k80J00J64Jj21j8J93J16l81J98m78K03J23R9K33m54
6022a92J01p4J61p8J55m51K10L53l35P9K17j59k15K89j16R7L10m85K9j80j72L2
6044d24L94L4j10P8M9J67p69M39K69J30k60k28J04L37k7l77l3K25O7j29P6r6J06
6067B2j99L30k56O6K0p0K93j87k95J62J57l52K30nK02k26qK63K2m55K98j87j06
6090b81L9N54k18J51j92k60K68m3M2r1J54M9M0j95j44M4J94m4OK1j35N0K19R6
6114C24k30k21L99n35L47O6J09k73qL78m51l02L44j1j45J62R7J1K35n20L70J23
$$ y = [-57, 150, 323, 75, -111, -4, 95, 157, -355, -72, -42, -4, -66, -61, -84, 78, -77, -28, 0, -98, 128, -138, 56, 103, -95, 10, -88, 272, -308, -156, -60, -47, 61, 99, 56, -120, 119, -9, 97, -178, 314, -220, 153, -123, 222, 54, -93, 75, -49, -55, 1, 126, 167, 110, -170, -70, 94, 95, -26, -44, 149, 265, -116, 82, -396, -193, -70, 29, 262, -192, -91, -165, -4, -82, 73, -378, -168, 185, -150, -71, 146, -13, -228, 61, -55, 42, 352, -133, -104, -284, -456, -424, -30, 4, -106, -28, 21, 188, -581, -142, 127, 257, -3, -231, -127, 210, 183, -194, -227, -2, 65, -64, 12, -84, 22, -177, 153, -103, -37, -17, -87, 206, 19, -276, -114, 43, -309, -79, -84, 118, -108, -116, 147, 169, -286, 12, -175, -281, -242, 312, 94, 245, 53, -207, 61, 18, 60, -31, 123, 172, 212, 17, -127, -83, 111, 67, 73, 94, -41, 9, 228, 324, 94, -127, 272, -263, 84, 150, 259, -14, -22, 356, -95, -397, -53, -64, -209, -47, 50, 61, 296, -224, 146, 269]
6136B69j02j02j28m0K01n56M62L22l72J77ll5o4m9L3l0l8lJ34j23O0L45m55P9
6160a8p7q2J6K44J27k30J60l96J07J24Q8L28m70n9p3K20j1K86r0j78Q6k16MK34
6184A24K9KN3l31K24r0No2j52K14j75J21l2J99k20L98l11K3Q3Q3j53r0j88J07
6208a39R9n2M7j36K98Kj71l5J32j25n4K05l6l53J71M09o9m52L25N2l58L44P6j74
6232FL33l58K79q6k73J59k56K04L8l3P9k88J41k63N66k94J33k97N10l13j13L41
6254B15k44j83K25j58j15J71LK9K11J12k58m4M6j67q0K21k3l31J85Q2J16j66K59
6277A06J69j29j11j11p7J74L99n80L84j93M60m54J6k49L62j93J5J3J60k94J05
6298b8J40j37n9j38N4L64o4j71Jj02J20R1j42N6R0j33j20J80J9Mo5J01j26K89
$$ y = [269, 167, 65, -63, -103, 98, -458, 4, 326, -46, 131, 128, 93, 29, -20, 13, -17, -55, -58, 76, -47, 13, 358, -97, -18, -95, -177, -161, 83, 210, -20, 140, -256, -149, -25, 63, 391, -79, -138, -211, 9, -2, 284, 194, 16, 102, -114, -110, 124, 153, 155, 208, -123, 101, 11, 16, -46, -198, 16, -159, -38, -70, 129, -91, 307, -4, 19, 102, 185, 32, -58, -246, -139, -40, -92, -45, -181, 117, 119, -52, -87, 45, -80, -134, 71, 35, -318, -147, 262, 193, -259, 66, 118, -240, 104, 180, 6, 339, -19, 260, 174, -99, 60, -196, 8, 46, 13, 92, -196, -55, -318, 248, -46, 87, -210, 300, -13, -126, 215, -29, -212, 13, -145, -260, -89, -86, -57, 154, 266, 8, -36, 10, -157, -237, -16, -39, -370, -185, -103, 13, -153, 106, 275, 146, 35, -76, -153, 21, 420, -160, 224, 31, 491, 37, 53, -196, 166, -27, -12, 1, 161, -133, -28, 112, -25, -84, -222, -168, 196, 132, -39, -38, -140, -20, 71, -71, -15, 75, -58, -178, 2, 21, 25, -40, 61, -65, 224]
6322B24j24l11M85p8j20j31k6J83r0q9j39k5K98J42K1J04l49J24k51J67j74J02
6344e7O6q5K23j21J52j25n7R6K93m94r8K86k28J89O3j02J27k82M05j97j30L47
6366B71k82qm2J41j38M6j47j87P6L44j41K17j71k03J95J52k26L5j38Q1M1k33K26
6389i1o1%m5J07J08p6K85k28k90L94K36m81k9K62m4j03K57k6m00K73p0L44m87
6412a65j45M70l90K15jO9p2k98K64K2k86K95j9J66l43J00n8L46j81K7J03j63l4
6435g8k22L20J32P5l58J76k76L61%l70P1K04k6m5q0J41K6l4Q5j97K29j63J02K23
6459B96n8k23j28L20j63j38k9K45k04K8J8J37k27J39J63N6m84K47J48l0j61jJ6
6482c3J19P5j97L27l06L51l14m52L94Q3J85j53R7n11L96O9q9j64J88m44M39o1
$$ y = [224, 100, -211, 274, 196, 76, -55, -81, 102, 12, -77, -216, -241, 57, 199, 220, 324, -25, 99, -152, 15, -159, -57, 9, -76, 147, 26, 178, 53, -4, 92, 385, -109, -207, 79, -149, 40, 103, 1, 128, -154, 251, 54, -76, 271, -11, -19, -61, 80, -58, -12, -159, -346, -270, 74, -67, 150, -21, -224, -29, 123, -103, -68, -206, -125, -84, -317, -91, -152, -152, -197, -90, 18, -58, 227, -1, -291, 103, 339, -142, -171, 91, 47, -56, 201, 175, -225, 48, -22, 322, -165, -310, 160, -230, -15, -16, 53, -19, -317, -53, -31, -317, -22, -41, 125, -218, -118, -176, 170, -11, 16, 119, -44, -78, -300, 20, 152, 227, -131, 45, -231, 130, 130, -240, -169, 35, 9, -36, -116, 25, 51, 17, 102, -95, 134, -29, 73, 296, 238, 15, -113, 207, 44, -94, -123, 122, -82, -54, -36, 101, -126, 13, 176, 232, -252, -5, 143, 113, -48, -49, -33, 86, 161, -36, 291, -15, 336, 22, -430, -36, 47, 232, 79, 176, -335, 61, 130, 41, -123, 65, -379, 60, -1]
6504aK22r9l3j91P6J77j00pJ89k80l2o0o2L06K0j13l37M79k37o5J49l4o6J83k52
6529a68J22kJ08j61J15j45K23o3O7j18Q8%N5k06N4M6L6P6l34J15J25nJ16J39j90
6554I3m22N18l28nK82m14J90J50Q6k58R2k29M32rk47O3O8j23Q7P2j69J03k34q6
6578b88J98J03j81L34n08L72J21j80K5J4l3j64K49J5j63l4M6L79j20n31L5M92
6600A81k03j10L31l24L55j86j7j06J45j56J75j09J00j96o5P7j22L02L5j01Q6k3
6622F9P2j4j1m3n1p0p9J84n2R3j21lOrj18O3J24M8J69l17j97N36l16J20N8j51
6648a0j49J03M6K07K26p40L84K0K37m44M20m01K08n9J1j47K07k88O15k40j13m70
6670c77L73j18M4L06J1k63J12l19J78j7k4r6P8L22l21M05j84n09N56J1j73l35
$$ y = [-1, 221, 122, 89, -102, -26, 151, 51, 44, 233, -47, -79, -139, -201, 105, 125, 12, -325, 154, -83, -148, 1, -33, -99, 84, -168, -46, -48, 60, -101, 14, -131, 92, 29, 96, -22, 66, 66, 121, -85, -31, 15, 51, 127, -207, -92, 33, 28, 144, 283, 93, -329, 189, -139, -144, 138, -276, -86, 64, 150, -108, -16, -245, 187, 178, -69, -6, 62, -61, 26, 98, -71, 32, -202, -288, -90, 13, -168, 166, -342, 30, 151, -29, -4, 10, -23, -187, 62, 77, -86, -120, -74, 305, 185, -346, -311, 181, -22, -132, 199, -125, 230, 44, 27, -79, 66, -90, 85, -24, 76, -120, -185, -108, -230, 72, 107, 6, 92, 69, 141, 127, 116, 73, 22, -48, -127, 57, 5, 98, -23, -26, -20, -29, -147, -84, 40, 88, 257, -60, -257, 279, -37, 83, 141, -10, -159, -56, -10, 197, 423, -317, 67, 87, 324, -120, 300, -101, 107, 48, 59, -88, 119, -169, 446, 206, 93, -377, -4, -122, -78, 228, 239, -24, 88, -231, -53, -70, -94, -190, -112, 210, -111, 294, 110, -399, 157, 168, -5, -340]
6692c40M43m8m5Q9P6j23J06j42j22P3R7l9k7K56m14o4L05K3k10L46k93Kp2J91
6716F8J93k42K36l22q8M5n0L1K17P2j63J5k90K40K47l28K31q3M8j93K87l52L74
6739A93j29j34m3K43K17m49j1o8L03j89Q0j4n0J45J81n24M16M3l88K89J75j18
6761A68j16J78j62k3R2k66N2J88j78k59R2J15J33R1n8N9p8J27j60j5N9l5j1J42
6785A35L5l49K87n4J18J10m99J07J15J75k30j41J05K23r1Jk61K9J77K7j47N2k6
6808a02K09K83l91j2j03K26k80M05m49J96K19j38k01K03k69M03l02L01p5m4J57
6829B36m39K76l57J29J35m7j13L65n38J05L07j46M2m4m1K26j53J52k78K31N7J86
6851B91l52N8M3j36k8J29q1NO9O1l46L64r9K25j39q9o5k4L97j67J10m63J26R0
$$ y = [-340, 103, 55, 10, 99, 175, 52, 158, 16, -106, -33, 64, 25, -2, 254, -160, -224, 81, 104, -106, 240, -53, -51, -123, 68, 261, 19, 255, -67, -155, -110, -160, -129, 88, 160, -3, 12, -278, -38, 209, -119, 112, 29, 77, -116, 171, -181, 193, 64, -70, -113, 130, 347, -102, -113, -181, 122, -67, 13, -1, -51, 94, 275, -249, 167, 210, -178, 111, 286, 168, 52, 230, 68, 45, 137, -129, -77, 111, -67, -326, -234, -119, 14, 105, 47, 106, 28, 155, -5, -20, 39, 4, -7, 135, 170, -179, 108, 54, 172, 282, -217, -110, 5, 180, -50, -191, -86, 137, 46, 47, -214, -185, -8, 19, -128, -76, -102, 107, 390, -1, -13, -116, 110, -170, 235, -214, -18, 201, 63, -138, 65, -204, 199, -103, 198, 123, 79, 236, -203, 73, -284, -155, -20, -67, -180, 185, -353, -248, 59, -87, -45, -89, -130, 96, -57, 95, -183, 48, 105, 291, -61, -3, 40, -96, -124, 5, -76, -71, -2, 59, -287, 77, -22, 203, 64, -25, -90, -114, 283, 116, 226, -237, -111, -21]
6875b1n2rJ32k69J49m5L43j40m5J02j54k69L03J75l67%R4J06l34K60Q5o0l87L21
6899h2J22R5j10k42m6K80o7Q4Nk45M68R8q1k67N8j5K91l86O3M5r4J15j13j12N
6924a31K5r9J08KL30j58L4J75j0m49K52l4K3p5J25J49l21j0k13L40k63J25M2J
6948c2J20j60J31m3o5K77k29j81J44M2k16J19k8K8L2K66k89R2J15j8k84L39k57
6971i7j22M07j25j99j40L52j99K20j06L4l09J96K65R9m26qJ06l6J70l18K83m1
6993Fk57J93J17j5P2K9o8J93l92K42k65qK3M2j25L65j50N9K14l65J25o1J96k25
7017e5M92l21l32R5L00n1P1l16L25k71m1L07P4k01J26j16p09N93k52K55j98J12
7039a13J74j8K47j14k6j10j45O6J22k30L93j70k05K21k22j70M17K56n00j47N05
$$ y = [-21, -73, -82, 50, -219, -70, -115, 228, 88, 43, 145, -9, -278, 25, 200, -167, -167, -73, 33, -301, -41, 44, -16, -403, -82, 40, 135, 25, -217, -263, 17, -50, 34, 39, -206, 262, 360, 279, 12, 70, 55, 346, -40, 23, 68, -26, 89, -24, -136, -131, -106, -205, -97, -95, 235, 77, 111, 286, 276, -173, 79, 45, 68, -7, 118, 267, -54, -64, -277, 63, -200, -75, -33, -32, 88, -72, 59, 16, -49, 228, -1, -182, -38, 4, -212, -93, -121, -93, -61, 205, -84, 8, 123, 105, -179, 160, -97, -219, 188, 63, -136, -276, 76, -123, 97, -9, 25, -284, -88, 177, 276, -150, -158, -52, -88, 82, -236, 47, 6, -251, -58, 59, 44, 116, 145, 77, 270, -122, 120, -145, -153, -130, -88, -213, 152, 2, 61, 275, -90, 35, -26, 170, -55, 437, 116, -216, -121, 179, 128, 199, -117, 208, -63, -104, 203, 277, 76, 202, 86, -623, -30, -282, -27, -225, -113, 61, 43, 290, 176, 150, 40, -105, -39, 83, -147, 246, 76, -129, 92, -130, -300, 117, 373, -127, -274, 231]
7060B31l51m1K49q5J18R0m66J58K44oj47k6K21l90j01l8J5L56L3k3k61K29R3J06
7084B08k74J11N0k19MN4J34J27k36K05j02k52N4J14k8R5k75Q7L56k59k72M63J12
7107B57m34J7K95j28K1L6j91K8J02L15l67J55m78L38J4J35j32K30j96L45m63J5
7129h6o8J43J25k19J34O8l17K02j67J23J7R8j99L20k63J86l43L05j97k5J61j82
7151a84k43Q24k56k50J82l13K27J88k14K51j82nM3R1P6j11k23K93k50J35k4p6
7173b1j02M09r4l29M44l54k59J68O7j40L31m7l81L35j76K01O0k18J27L6k07J96
7195D6l40K33o7M8n8L34k23j28N5%J73N8k11J00j74j1M94l51K04k75K5l2R3q0
7219h7k37M40r0p8M0k43J70J4M0j06J47L0K26k23pj36J26o5Q8q5N9j15P7j07j39
$$ y = [231, -120, -161, 88, 3, 121, 211, -255, -97, 147, 141, -6, -32, 189, -201, -302, -340, -325, 31, 64, 41, -220, 9, 102, 208, -66, 45, 95, -124, -120, -66, 68, 195, -41, 164, 62, -190, -136, -22, -50, 45, -230, -143, 213, -46, -318, 145, 257, -177, -160, 135, 7, 28, 64, -127, -99, 3, 318, -49, 106, -372, -34, -20, 115, -17, 213, 17, 362, -101, -86, -154, -11, 114, -105, 29, 97, -220, -18, -185, -62, -45, 53, -146, 174, -89, 97, -246, 59, -138, -163, -2, -184, -427, 397, 141, -109, 73, -240, -13, 175, -39, 212, 30, 25, 68, 159, 235, 124, -99, 194, -56, 79, 55, -21, -123, 286, 192, -137, 307, -47, -306, -138, -71, -211, 120, 73, -308, 27, -149, 52, 112, -106, 21, 57, -150, 46, -294, -61, -128, -80, -138, 196, -27, -155, -100, -100, 73, 131, -80, 20, -154, -165, 329, -22, 182, -93, -68, -100, -7, -87, -324, 116, 26, -52, -12, -255, -85, -71, -31, -137, 10, 40, 266, 43, 36, -100, 26, -39, 49, -36, 23, -92, -15, -122, -261]
7244b61K16Q8j07m3J47K67l38J82o6k47K47k64K6J73j38J92K65m58R4K01j84K2
7266A4K74m75J27J44p4K46k10q8R9p6l2J92k06K87k06K71k81J19j51j39p7K19
7288b3j4M3k75J93K16j21k83L94K18n00q2J72K05k57K34j50J27l71q0N84l26Q
7310h8N60l78J29l57J80N7j59J46k61p6J36K89J21m02k29K25p4K12l95O17K1j61
7332A13nJ0j84L45l89K14l23J48K18l3l23K24j83K0M6K03k23J75j81j03K86j94
7354a39K78J2r3j8Q9j86k6k0L61p0j66L52l84j68K33m2j72m7L93j61R9k64L18
7377A79k84K5k61M62j04K20j37l67J72o0J97j16L70p1m2n1q7P7k24l4J59O2l63
7400b78j16J99K48k24J07L3K26l17mL15n18K31Q0L7p6L5Nk2j47L44p5l5o1j76
$$ y = [-261, -45, 43, -64, -107, 40, 307, -31, 151, 85, -162, 85, -179, -153, 20, -118, 74, 339, -119, -25, 176, -8, 14, 288, -187, -60, 84, 10, 256, 46, -42, 57, -19, -51, 141, -65, 222, 16, 287, 6, 125, -26, -165, -242, -23, -37, 6, -269, -76, 140, 19, -264, 130, 348, -152, -234, -62, 143, -114, 120, -30, 97, -274, -354, 230, -96, -88, 472, 94, 223, -134, 46, 103, -56, 90, -171, -247, -111, 178, 299, -103, -332, -107, -181, 31, -364, 253, 274, 113, 108, 118, -66, 279, -110, 104, -219, -71, 147, 114, -209, 15, -168, -148, -102, 101, -122, 53, -128, -231, 55, -139, 139, 151, 58, 40, 129, -57, -83, -103, 258, 188, 22, 374, -10, -178, 55, 13, -159, -206, 187, 26, 125, -139, 179, -105, -80, -341, 121, 17, 237, 100, -267, -95, -155, 42, -74, 296, 225, 183, 132, 45, 122, -102, -136, 23, 85, -278, -394, -195, 53, -171, -64, -31, 195, -122, -126, 189, -329, -98, -18, 19, -57, -22, -17, -39, -186, 158, 83, 48, -13, -189]
7424a89K09L73J13q03J51o5K57k51M1L17j45o1p4l3L65l04R6j27J83n4j4q0P4
7447b1K49l71K73J05q3J66j95l06K29K30l65j76L4J6R5J39N1J48R9l71K99j74
7469G1l1J53j23Qo1J33J53k40J39l83J39J91l65J83l06K81j78J82J34j14L7j8
7491a5k91M4J27Nno5L33k51L71k62rJ64j83J43j05K19k56j27Q0J25K75j6k39R8
7515A60q7j64p9K00L28m55q3R5J79k21K37q4J3k91O0L56j54L05l96q1K25j3j00
7538e0L2O8j19K4p4J91k76K32J90j65K1j76L20m59J84j7J46rnK71k62j71J45J17
7562A58k21K55j73j17N4K23p3p0Q4j63l03n7L85r0j48M00n32L76p3J14M5P1k18
7585g3j77Q1l6Q2L9J93p7n5k87J46K16k3l66J31L42j36k79N62l86JJ39j89J65
$$ y = [-189, 20, 393, 506, -297, -146, -211, 46, -205, -164, 153, 8, -53, -127, -160, 205, -99, -3, -130, 53, -1, -15, -95, -21, 228, -143, 130, 235, 152, 318, 123, -183, 46, 276, -89, -265, -231, -215, -120, 19, 70, 218, 317, -54, 245, 71, 40, 193, 70, 78, 17, 150, 303, 63, 202, -181, -42, 149, -216, -33, -339, -58, -236, -54, 80, -34, 3, -15, -306, -262, -135, -130, -135, -200, 133, -118, 253, -9, -18, 146, -37, 106, 1, 220, -36, -163, -83, 42, 317, 301, 62, 160, 73, -91, -170, 30, 358, -97, -180, -85, 94, -127, 110, 26, 39, -252, -192, 164, 10, 315, -81, -162, 63, 50, -50, -18, 50, -69, -45, -119, 72, -204, 28, 218, 53, 74, -102, 218, -241, -57, -74, 72, 63, 58, 329, 67, -104, 41, 158, -63, 192, 19, -98, -44, 179, 106, 36, 120, -43, -346, -403, -18, -108, -256, 144, -388, -12, -85, 29, 74, 145, -73, -250, -169, -205, -123, -84, 109, 32, -23, -310, -164, 52, 29, -337, -206, 136, 0, -279, 283, -103, -102, 37, -152, 13]
7608A3K00M1m72J50j25Q6q9K13K24o01K61R0l5o1J00m4K37n03L97L1j06r5K6K22
7632A60j88k4J64J97m83j01M08nM1l97J94K62k97Q6n0j78K11k78J06J65J10q5
7654A8J12p0j57r3L89l44J76j7l9K97N6l48L32l94k6K70l40L88o8j88k69j48M11
7677e2M5J34L4o9j18J39l32K80Lp0l8J91r5m8k07L12jj40N3j18J34k86N67l14
7701DJ91k72J50M11o85J24j08K98m6j5O3j96O2oo0M7p8K34k19j62K50J07j69K55
7725A80k05J86k04J94j76m0j31J89J15j84n0PJ39j87M13n5k41L25k11j9q1J43
7747A07r6l61M54J15q5m5Q4q9R1k15Q4k82j39N83k98J77j47j97P33o03K94j32
7769C3L0j0j47J13k86K36k9j04K24k35K53L0k5J0k80R6K41P6k89J0J05j41K6L74
$$ y = [13, 213, 254, -218, -68, -193, -107, -196, 17, 241, -360, -99, -9, -44, -105, -5, -49, 188, -315, 82, 113, 7, -88, -62, 160, -28, -52, 112, 309, -174, -275, 133, 128, 169, -228, -34, 228, -69, 17, -33, -211, 0, -278, -172, -7, 103, 18, 130, 60, -97, -190, 199, -145, 31, 14, -25, 272, 328, -20, 312, -82, -108, 162, -178, 210, 142, -46, -315, -463, -52, -7, 127, 161, 92, -26, 113, -219, 61, 64, -6, -44, 147, 52, 4, -203, 109, 108, -32, 21, -97, 37, -249, 318, 4, 195, -77, 73, 484, -201, -77, -185, 113, 67, 52, 115, -81, -19, -25, -85, -38, -116, 118, -101, -263, -13, 94, -75, 180, -25, 161, -43, 151, -25, -65, -196, -7, 108, -76, -126, -119, 20, -167, 246, 191, -50, 275, 64, 45, -36, 107, 11, -350, 104, 219, 134, 89, 173, 84, 175, -40, 44, -238, -377, 206, -92, 85, -62, -259, 474, -129, 165, 33, 63, 53, -94, 19, -267, -31, -60, -164, 60, -175, 78, 108, 83, 93, -187, -91, 150, 226, -63, -53, 52, -89, -63, 311]
7793C11p10L52M96n74O7J48Q5J5j40K05n21M58j08j79K31N6l76N0l4M7K44j72
7815d9K39k43J19j49M69k88K0K8K3q1k12L1R6J4P8j91r1K70o0j91M03j61l1k18
7839a75P40l30k23oL34j98m55N16k39j71K92l04K26j0M5p6j02J73J35j37j83K20
7861G2j42j2K52k76m5r4L9J58M1j4m75N07K40l66K63l5j64K9K04l14K1J46o4q5
7885a14R6OL7J30j31Q8K47k33k90L63m16L75k98L04K0j83L01l92j33M57k67N0
7907A7kj03N3K2j42NQ2k2j74L27l06J49Q3N9k38M47o67M97r2M6k79L00J33R6m47
7932a56K42k07K05K60j97j21J25l26j20M68k55J1K61j24j90j45K86o4O1l77k8
7953c91P37o87J89L95j81%pj23m4p3K87J37k12M9m3o5J21L2j99K6J23J2q9j4p1
$$ y = [311, -399, -47, 449, -125, -58, 90, 175, 190, 50, 255, -266, 192, 84, -95, 136, 192, -184, -134, -168, -121, 123, -49, 190, -53, 66, -83, 386, 98, 118, 146, 169, 88, -124, -93, 3, 17, 95, -96, -187, 83, 23, -168, 235, 74, 43, -175, 565, 235, 12, 6, 340, 142, -313, 203, -36, -207, 85, -219, 7, -3, 42, -34, -136, 37, 172, 35, -148, 72, -70, -82, 170, -106, -151, -245, -206, -48, -7, -21, -496, 11, 251, -115, 148, 113, -51, -22, 182, -132, -111, 35, -29, -114, -18, -12, 25, 155, 24, 112, 359, 126, -164, 199, -217, 158, -140, 164, 184, 1, 302, -90, -223, 234, -33, 17, 15, -88, -35, -13, -155, -150, -68, -90, -264, 63, -243, -94, -11, 48, -190, 257, -410, 87, -5, 41, -238, 62, 195, 291, -156, 86, -121, 84, 344, 147, 26, 151, -175, -295, 173, -82, -71, 190, 66, -124, -269, 17, -47, 14, -363, -391, 346, -341, -152, 243, 62, 62, 55, -68, -112, -185, 102, 239, 27, 76, 33, -32, 89, 121, -78, -52, 71, 83, -6, -20, -91]
7978i1N5Q5K4q1j36J19J18j78J04k18J18N5j20j04J86j87L17j81N6J2K28l47J89
8001B3K04l53p8J80j5N1P1k1j31J02q1q6l3L06n65M18j20K58J26k20l7M3k17K84
8025A09k29l4J74L37m05K02q9J6K7l21j77K89L9L1L76l84m2J04n0p5K08j43Q4
8048D7J81p7l24K60p9k80j9J75km7j70M40n7N5k87M53k38J45J9j21J20J2k16j24
8072a34L78m86L63j90R3n3Q6j94o1L51j36j32J99j96JL9k06L67j07j56M6L35q3
8095A24rk6k75J47j21J08Q9J0j58K10k91K7jK61j31J92k74m0j05NK32j48K97k1
8119A02R7k48j18L32l04J78Mj52J23j00K14P1n35M39k26K57J17j20N3N7k12J29
8141A58p8j67K91l39L60q3K64p59J65m6K88L2q5Qj05j49L19K30m00K03k5P2l65
$$ y = [-91, -36, 49, 73, -8, -144, -25, 93, -85, 19, -199, -81, -26, -146, -250, -64, -251, 66, -115, -59, -47, 181, -166, 23, 227, -126, -204, -24, -39, 12, 83, 62, -69, 33, -48, -134, -167, 139, -426, -8, -128, 130, 256, 36, -1, 42, -175, 109, -120, -154, 20, 357, -48, 154, 65, 81, 108, -213, -390, -101, -62, -31, 345, -39, -81, 23, -27, -102, 106, -37, 47, 228, 151, -173, 87, 8, -272, -291, -116, -118, -165, -335, 105, 48, 103, -184, 269, 31, 176, 195, 74, 194, 206, -10, -134, 244, -242, 121, -69, 24, -29, 57, -137, -198, 153, 17, -115, 84, -112, -111, -72, -278, 89, -18, -174, -128, 207, 124, 115, 89, -186, -39, -160, -52, 37, 47, -111, 99, -192, -165, -166, 95, -36, 156, -118, -158, -263, -258, -26, -174, 123, 102, 199, -49, -167, 165, -139, 39, 43, -109, 14, -86, 128, 199, -336, 103, -123, 134, 251, 131, 184, 241, 29, 158, 80, -87, 204, -135, 225, 142, 406, -353, -188, -234, 54, 86, 1, 9, -96, -245, 74, 304, -96, 107, 82, 154, -211]
8164b11K45j16k5J15j32J85k52J07q1M1J38r8N0j61K94k38J05o9l24K72J74j45
8186a26J23J72q3l54K88
$$ y = [-211, 34, -82, -107, 8, -124, 61, -191, -84, -165, -124, 14, -84, -34, -195, 99, -139, -34, -103, -427, -155, 19, -126, -3, 169, 86, -268, 20]
8191B0
$$ Imaginary data points
##PAGE= N=2
##DATA TABLE= (X++(I..I)), XYDATA
0@%%%%%%qJ6j6J6k4L2l2M0n6O4p2Q8j04J25j49J73k00K32k67L01l42L93m47N02
30B65n65O38p15P99q93R97j107J228j364J512j675J854k053K275k520K795l108
47a637L462l866M337m895N563o380P413q765J0609j3293J7590k5558M5191j78764
61a48993l12072L46956K89367j25831k70338N9321J79111k6188j55678K9688J35845
72A188K2159q8416k9745M215n329N2563J11511l4224j86797m2158K22429J34304
84A61700j90887k01943J43316K43741p6355k61637J0173K59121O7354k17725j21710
95a84852J50457J45791p0977j20904J3513P1101J2738q116L32l8733l5727O8728
107C351R0038o8063j44532L7845J87840J7284k04334q2819J88397J43627j42197
$$ y = [0, 0, 0, 0, 0, 0, 0, -8, 8, -8, 8, -16, 16, -16, 24, -32, 32, -40, 48, -56, 69, -80, 93, -107, 125, -142, 159, -183, 210, -237, 265, -300, 338, -377, 422, -471, 526, -581, 647, -717, 795, -880, 974, -1079, 1196, -1324, 1471, -1637, 1825, -2041, 2296, -2599, 2964, -3416, 3997, -4768, 5841, -7452, 10138, -15420, 29771, -148993, -461065, -114109, 175258, 49427, -220911, -161590, 17521, -8667, -164345, -134657, 1188, 23347, -65069, -94814, -90599, -95928, -43365, 68146, 33922, -152875, -195033, 27396, 161700, -29187, -231130, -87814, 155927, 79572, -182065, -171892, 87229, 154583, -63142, -184852, -34395, 111396, 40419, -80485, -66972, 4129, 16867, 8751, 9083, -29650, -65377, 3351, 93389, 25326, -119206, -81361, 106479, 123763, -80571, -163390, 25007, 168634, 26437]
118B6437j80177P9710J87847j6444j65996l3165J21085N9059o6401n6180J8954
129b5271K9041J2355J4449j7479n8620k904R0731M1864j02051q8722Q9122J30657
141A13172n3757j55301N143J57790M4562j37045q3494R7619J03201n2319j01412
152f1841J1176Q0012J7972m6239k7018Q725J6442J8886R832l2643m2436K6408
164b0724P1563l798q7869k8471Q9488O1785p4600q8039M5004J00872j0276r6347
176d1412k2164P7708M4567m8335n2478J8227M4587O127k6915k0394J877K1085
188B480K1117q431l7753j1813M2455L5492l4614n3858J5512O3078Q728o1617k9888
201d9112M8284M7766k7574n3798M919M9713J5034l6039k8494J6891L0189K672
$$ y = [26437, -153740, -74030, 113817, 97373, -68623, -101788, 19297, 78356, 11955, -44225, -25271, 3770, 16125, 30574, 13095, -45525, -48429, 42302, 84166, -17885, -106607, -17485, 113172, 59415, -95886, -90743, 67047, 111609, -25436, -108930, -11311, 91890, 39571, -61841, -50665, 29347, 47319, 1080, -25938, -17213, -771, 18115, 27947, -4696, -47132, -20724, 50839, 47041, -40828, -69299, 20189, 81974, 7374, -80665, -35661, 65211, 54935, -41412, -63576, 14132, 58699, 10364, -42114, -23887, 20700, 26827, -88, -20482, -18605, 2480, 23597, 15166, -22587, -34400, 8055, 43547, 8933, -44925, -29413, 33665, 42393, -19224, -49112, -828, 46938, 19364, -34434, -29515, 20198, 35232, -807, -29301, -12410, 17779, 20451]
213B0451k3701j6644J0069K2584O126k0525k1050J0681K9738K928l0699j7923
225b7965K5127K9728j2571l3966j318L1668J4034k3518k2642J1868K4975N67k1716
238e729j1869J3703J8087k806j8838p916J4046J5469o844j8848k779J7213J1146
251A4035j1629j5661M632J7019M495j4394j1126P776J4119J85j3868p441J0340
264a518J2958l371j4778l696J2950R950q664j4718K309J5480M290j2704r900Q460
278b952J2844k224j2761l872R948P871n534r941K23Q760N395n652p811P14Q310
293C318M489o970q777K657J0571K106j0667o690Q129J0532l127j2127j542J0686
307B588N757p343r582K987J0139K222q345o019N024Q645p95q617l729O426O347
$$ y = [20451, -3250, -19894, -9825, 12759, 18885, -1640, -22690, -12009, 17729, 20657, -10042, -27965, -2838, 26890, 14319, -19647, -20965, 10703, 24737, 1219, -21423, -9555, 15420, 15987, -5729, -17598, -3895, 14192, 11386, -7452, -15368, -1322, 14147, 7303, -11545, -14324, 2889, 14035, 2406, -13255, -8623, 8396, 12891, -1503, -12629, -4853, 9266, 9451, -4417, -11858, -1518, 11440, 8069, -6709, -10405, 2545, 12495, 3831, -10887, -8578, 6902, 11192, -1512, -11412, -2952, 9892, 7668, -5093, -8965, 983, 8854, 3320, -6621, -6398, 2362, 7757, 2105, -5706, -4992, 3318, 7807, 837, -7940, -5283, 5288, 7394, -3273, -9963, -1834, 8698, 5571, -6556, -8098, 2588, 8345, 1002, -8580, -5593, 4546, 6768, -1577, -7596, -2572, 6073, 5278, -3339, -7068, -642, 5705]
322E705k340p991r99O779M860l516o359l42O513M026m619o680P82P489L487n922
338H73p474L318R687Q82r623n608P927Q362m504j0262P6R898L587p390n720M252
354a719O200k72n529j811J970K819J156j878l733n23N518L827n638p173L490R373
370F077o42j0468l530R990O009o825q665M410R041q69p923j500N384K950k597
385H42k960K35J500J452Q66j224l485J56N468K000o324m799N325P173k993q987
401e755P85R222K268p674n033N646O326k864o923L21N851J686k967k379L15K452
417A277J309r38k501j706L019L180j478n493J53N463L114n598n291L390O986j071
433C815p305j943O042M897m511n604N99P559J546o228m105L636N574j000n878
$$ y = [5705, 3365, -4626, -5625, 1154, 6014, 2498, -3861, -4203, 2310, 6336, 1717, -4963, -4181, 3308, 6795, 873, -6601, -3283, 6404, 7286, -2337, -7945, -18, 8344, 3840, -6422, -6346, 3552, 7139, -251, -5971, -1719, 4481, 4209, -1320, -3131, -1161, 1658, 2814, 936, -2797, -3320, 2198, 6025, 387, -6786, -3296, 6077, 5435, -5033, -8563, 1427, 7436, 611, -8054, -3644, 5397, 4528, -3395, -4895, 489, 3439, 842, -2118, -1883, -383, 1069, 1935, 711, -2774, -2618, 2850, 4850, -1474, -6273, -948, 6225, 3232, -5755, -4970, 4252, 6520, -1154, -6187, -541, 5785, 2921, -4002, -3681, 2170, 3856, 889, -1490, -1175, 1277, 2586, 1648, -853, -2559, 460, 3640, 2162, -3331, -3178, 2285, 5399, -199, -5490, -2100, 4886, 3815, -3490, -5433, 609, 5506, 995, -4609, -4010, 3549, 5095, -1133, -5238, -1602, 3972, 2972, -2906]
448b906j824N058L751k297m892j98M285K169k107l880n38L612L936j716o040j413
464e000P121N541o378r243L549J1869O8j2467m891J1703R126q466j2381M857J2755
479G763k26j1270l514P698N623l655n126m86K538L002K481l252p286M26J0637
494E353M516j2440j0534J0755J6614o704k0233L16K1198P066j9579j3056J4107
507b621J7144p716j7291N65J4442M389q597n644J872L537L528J677o481q286N353
522d129J5303n99k0017o855K1515J5293j7971k3517J1900K7277k774k7817o772
535a9163K3771J3903j6102j6598P268J5115Q21r322n918J299N583P035j343j3129
549f780o184J5063J6170j2257k4770M208K9386O519k9119j7148K2912K5962j3734
$$ y = [-2906, -4730, 328, 4079, 1782, -3110, -3308, 977, 3146, 1039, -2841, -3379, 233, 4169, 2453, -3587, -5000, 2121, 7662, 1284, -7959, -4410, 7459, 7527, -4940, -9831, 1872, 10998, 2532, -9849, -4992, 7763, 7537, -3733, -7247, 451, 6074, 2419, -2707, -3193, -655, 2347, 4828, 1576, -5710, -5284, 5353, 9869, -2571, -13105, -2350, 14264, 7560, -12673, -12357, 8841, 15907, -3672, -16728, -2621, 14523, 6807, -10484, -9919, 4523, 8912, 315, -5329, -3457, 80, 3608, 5285, -1196, -9482, -4129, 11174, 10575, -9442, -16297, 5218, 20511, 2540, -20977, -9077, 18200, 15426, -12391, -19163, 4608, 18511, 2409, -14189, -6921, 8194, 9015, -307, -6225, -4926, 657, 7692, 6349, -6780, -12964, 2099, 18269, 6012, -18758, -14550, 14836, 21355, -7764, -24912, -2000, 23962, 10228]
562A0228k8864K073K6918Q874k0165j5449R452J6294J460j1482j0077K584J3150
575D996Q856j0126j8404J437K4097R264k3324k1253J7221L0176o409l3310o408
588b3187L0197J8377k1483k5196Q584K6643L547k1248j3341J1046J7692J635j5762
601b496j2602Q267J9179L202j9965j5132J3910K4173l775k7491q501K4656J9762
614B3187j5607k7070L381K7804R907k2560k0104J1364K4822J870k3040j3098J4547
627d597K1631l583k3083r388J8454J8971q227k3896l854K1826J5637j3983k3011
640a7103K397K4076R505j8637j8889Q203K3606L807k1132j5545J3431K3163j380
653A5502k5249j0753K0166K0898j0906k5420p40K4247J1402j7748j8269P750J9904
$$ y = [10228, -18636, -16563, 10355, 19229, -936, -16385, -6933, 9361, 10821, -661, -10738, -8154, 4996, 13852, 3726, -14678, -13241, 10856, 20120, -3204, -24457, -7236, 22940, 16531, -16779, -23187, 7010, 25387, 3904, -21292, -12708, 13935, 17482, -3766, -17107, -6061, 11631, 13266, -2496, -15098, -6831, 12348, 15550, -4415, -19547, -5637, 18536, 14761, -12730, -21231, 3425, 23187, 7580, -19490, -16109, 11695, 21602, -958, -21062, -9698, 15124, 16994, -6046, -19144, -4597, 17034, 13451, -9632, -19020, -566, 18405, 10178, -13718, -17572, 4254, 19891, 5908, -17103, -14706, 9370, 18875, 238, -18651, -10448, 13158, 16965, -4167, -19712, -6281, 16882, 15502, -9747, -20500, -334, 20564, 9658, -15762, -16502, 7745, 19147, 1399, -16870, -9120, 10784]
666A0784K948j6210j1040P408J5065L131j2657j2971O372J8354L911j9435j4039
679a8379J4591K2591o971k6600l531K5886J3260j9454k0353J0536K2191o91j9740
692f664o817J2377J0997m461j0067k923M991Q326K814r324j1050N419J7307K603
706A3528k0856j1434J8885J9824j3247k5415N238K7614L391k5446j1066J9769
718G85J5347j2153j5569N299J2086l79o547j093P06o58L808N132o091j1373N550
733e150J7260j398k1339m482K2055J1429j9347j7133J4511K0286q673k0905K492
746a0394J9203K204j5535m415J0599M455p003k199M965j533m628M115P073o207
760G00r936O489J3378m801j6817J725J8509K435j8440o565J6720R622j4192j0852
$$ y = [10784, 13732, -2478, -13518, -6110, 8955, 12086, -571, -13542, -7170, 11184, 15095, -4340, -18379, -3788, 18803, 11832, -14768, -18299, 7587, 20847, 1393, -18960, -8424, 13767, 13076, -6664, -13481, -1104, 9893, 5432, -4635, -7558, -2567, 5759, 8573, -751, -11801, -6382, 10925, 13528, -7328, -18762, 123, 19947, 6700, -18715, -13477, 14137, 17528, -7918, -18984, 785, 16132, 3979, -11590, -6291, 5795, 5416, -1131, -2224, -1518, -2176, 1632, 6764, 673, -10700, -5150, 12110, 10712, -10627, -15109, 6946, 18375, -972, -18105, -3594, 16692, 8019, -12886, -10394, 8809, 11013, -4522, -8937, 1662, 6117, -886, -3085, 1880, 347, -4281, -166, 6907, 700, -9236, -2747, 10631, 5830, -10987, -9262, 9247, 11682, -6758, -13323, 3397, 13019, -1173, -12025]
774a2025J0880J1113p992j0482O233Q679n157o495N109N010o155m642P627N343
788G046q324p240Q597Q835q326j0074P170J1141n040j1791L303J1573j388j0737
802e255j58R234J355q433j414P688J470p200j320O924J621p211j374P085J351
817D363p233k608P668L582p129m355O379M488n514m887N288N161m453n193L553
832h90N483l428m796K593M771k777m509K153M607j794m338J497L884j361l765
847b670J717L161p62l439N44L027j79k723k37K970p6j995o98K016N23j107q48
864g76R09J78j63k23Jk0p0k8O75m59j09J46O07m21q38K44R9O11m58k3n0k79M06
887d1P24k67j177P5J330K46k065n32K465J032k010k039J627K094r70j765L28J526
$$ y = [-12025, -1145, 9968, 1976, -8506, -2273, 6406, 1249, -5246, -137, 4873, -1282, -5924, 1703, 7046, -1278, -8518, 79, 8914, 588, -9486, -2316, 8825, 3785, -8006, -4703, 6870, 5482, -5255, -5413, 3821, 5176, -3257, -4671, 3017, 4487, -2713, -4033, 2891, 4512, -2699, -4073, 3012, 4363, -2870, -5478, 2190, 5772, -1357, -5712, 667, 5155, -359, -5246, 42, 5203, 750, -4443, -890, 4593, 1165, -3631, -1038, 3733, 956, -3553, -1400, 3207, 1413, -2925, -1428, 2456, 1095, -2670, -953, 2208, 1446, -1993, -1449, 1578, 1399, -1324, -1561, 1409, 1333, -662, -1360, 656, 1179, 72, -776, 133, 311, 148, -75, -74, -94, -164, -192, 483, 24, -85, 61, 668, 247, -591, -347, -248, 363, -95, -118, -168, -447, -41, 683, 416, -761, -686, 644, 890, -1175, -1707, 758, 1790, -220, -2259, -632, 1462, 492, -1273, -945, 581]
905E81m92q19M30J116q86r06J827O74k687j111L446J702k817l590K790M155k006
922A407m287Q31M367M52m031j374L233J494j678j429N85O45L20L73k81j346j105
939a824K404K324k560l597J379N386l11n265j803M939L703m299m537K110N066
954C115n23m436q22K945K151j779j371p95Q51J329R76j187k971R50L647Q07m129
971a242k922L649N056k580o064P27O187J185m777l497L256M554j120m241j044
986b873K831K743j130k948j006K170K539l67l321j304K507L689j718m745l30N056
1002A793K292l442m653J745N088N50m694k434K982L850p86m132j469L635K989
1017C314j618l856m11L351K282j955l871Q11L484J533l168l035J737L543K58l297
$$ y = [581, 89, -730, -300, 816, -70, -976, 851, 1525, -1162, -2273, 1173, 2875, 58, -3532, -742, 3413, 1407, -2880, -2049, 2318, 2770, -1261, -2635, 598, 2092, 414, -1015, -430, 215, 535, 908, 627, -719, -1824, 580, 2904, 344, -3253, -1874, 3512, 3201, -2064, -3867, 1072, 4775, 476, -4061, -1951, 3115, 2592, -1844, -2666, 279, 2430, 651, -720, -1515, -664, 665, 1641, 454, -2517, -1567, 2080, 2887, -1242, -4164, -515, 4541, 1961, -4103, -3376, 2811, 3996, -781, -4278, -1022, 3532, 2412, -1829, -2873, -42, 2701, 1571, -1377, -2383, -213, 2326, 1959, -1362, -2666, -159, 3530, 1812, -2933, -3263, 1793, 4085, 643, -4010, -2265, 2823, 3373, -1321, -3755, -773, 3077, 2291, -1841, -3310, 325, 3314, 1696, -2160, -2571, 780, 3062, 1107, -2764, -1953, 1531, 3064, -104, -3139, -1402, 2141, 2399, -898]
1033h98k129K268L315m61l569r22J982K862r38l372p84L073K516k039l327R1M133
1050A801P31l031k359K221K581m81k429r28J769J956j089j796k87J552J300q04
1066G07j841k90J917J318j064k278K18K185R65j752j732R31K363o88k241l81K032
1083C69J575j342j820L50J758j6j624l07J477P59j145q67L68J002k92n06J61N9
1101d1M62M4l79k45k04O65J18n23o62M00J460m89j627l97K418R38k246j910K139
1120g9K521j274l555N64L601O36l452j906L256K195j951k504J336J805m71j257
1136e35K31J52l59N73J613j406k292O02L955Ln127j608N930L240n079n769M317
1153a559O578k085p299J28O642J959n545k869L977K690j880k268J321M93j121
$$ y = [-898, -3027, -759, 2556, 2095, -1474, -2396, -414, 2448, 1510, -1862, -2646, 427, 2943, 904, -2423, -2332, 1801, 2532, -499, -2858, -637, 1944, 1463, -966, -1894, -125, 1831, 742, -1054, -1341, 211, 1511, 707, -1134, -1424, 493, 1811, 747, -1531, -1313, 872, 1837, 85, -1647, -716, 1647, 959, -1282, -1663, 369, 1944, 602, -1218, -868, 890, 874, -750, -1057, 420, 1179, 34, -833, -465, 537, 245, -261, -100, -41, 421, 465, 86, -159, -363, 302, 420, -103, -765, -365, 1095, 606, -1021, -1418, 1000, 1938, -308, -2218, -79, 2442, 1168, -2387, -1823, 1778, 2414, -1038, -2944, 312, 2507, 556, -1948, -612, 1193, 722, -535, -304, -152, -511, 62, 1675, 269, -2023, -1421, 2534, 2537, -2590, -4198, 1732, 4972, -107, -5876, -1559, 5019, 2934, -4365, -4237, 2405, 4364, -1181, -4050, -73, 2617, 737, -1531, -210, 283, -838]
1168h38J515J457k216l666K696N948k540p401N52Q907J866q938m718Q236O980
1183G840o507p777L236Q743j309p579p48O012J351l840q39J854k25j425K371J759
1199B917m841k623N430N293n593p895M264J0671k327j1419o78J0981L876j0104
1213b048n730P665P029n290o452K646N018j336l554J717J514k665k86M712n5o826
1229c941j022Q709L415r720o067Q934Q736p245j0445M507J1389j567j1157p84
1243f258R485K615p512k943N236K429l889p65L479j193m030K408N568k452p548
1258e370J997R103k90j0336k316J0813M395r558o689P670P904n488p879L298P254
1273D508j777n791P23M619r47l132J540K748l188k655L834M032m403n384L988
$$ y = [-838, 677, 2134, -82, -3748, -1052, 4896, 2356, -5045, -4493, 4414, 6280, -2658, -7376, 860, 7840, 1333, -6444, -3208, 5535, 4226, -3353, -4101, 1911, 3262, -578, -1417, 437, 212, -1213, 1158, 2917, -1924, -4547, 883, 6176, 583, -7312, -3048, 7623, 5296, -6123, -6801, 4180, 8056, -2048, -7778, -113, 6916, 1626, -4826, -2180, 2838, 1502, -2052, -335, 1179, -1486, -1772, 2940, 2885, -3941, -4963, 3746, 7161, -2559, -8626, 308, 9044, 1799, -8646, -4139, 7250, 5683, -5474, -6258, 3227, 5842, -1670, -4613, 623, 3052, -837, -1602, 1877, 684, -3346, -938, 4630, 2178, -5370, -3373, 5730, 5440, -4896, -7212, 3601, 7996, -1562, -8251, -581, 7323, 1835, -6044, -2746, 4508, 2731, -3060, -2337, 2282, 1335, -1797, -257, 2491, -697, -3352, 482, 4514, 111, -5273, -1285]
1288a285O990l302p994J654Q706L82q654k497Q165L276o696l575M938L995l750
1303C53l353L230K424l130j482K894J317l656j114M336J439m842k302M923L416
1318D453m896l777L920M424k701n013K020M583j242m167P79L374j72k943J24K854
1334A620m29k522M19K168r8k546K91K626n2k666o66L407J54k934o92K595J147
1351A822k128j803K394K011k491k044K139K168j773k208J721J656r34j980Q44
1366f06J893m57j918L80J266l10o24oJ237r88m66N97J008j133q38P46J064m31
1384D14j121k19J284M00p45r02M00J479o08j021K96M66M42k98o15j55R17J74m55
1403A33o03k22Q79O64n08r31M8P67M87q27p11L57J079Q7q70o14O45N24J8q68n6
$$ y = [-1285, 5705, 2403, -5591, -3937, 4769, 5151, -3503, -6000, 2165, 5441, -1255, -4830, 108, 4103, 353, -3000, 230, 2654, -476, -1958, 936, 2253, -1403, -2517, 1819, 3258, -1584, -3886, 1037, 4453, -443, -4220, -300, 4124, 1423, -3590, -1570, 3013, 1771, -2396, -1617, 1757, 1585, -1358, -1234, 1620, 1191, -1331, -912, 1256, 1158, -1388, -1097, 1529, 1477, -1189, -1855, 1552, 1706, -1228, -1920, 675, 1822, -306, -2109, 285, 2296, -195, -2239, -100, 2068, 295, -1913, -192, 1464, 530, -1450, -606, 1287, 830, -1088, -708, 558, 248, -376, -382, 855, -133, -599, -2, 1006, -127, -965, -219, 845, 414, -707, -926, 358, 758, 13, -889, -489, 990, 382, -639, -343, 123, 565, 267, -348, -503, 414, 588, 133, -470, -692, 187, 851, 343, -588, -540, 227, 714, -113, -824, -467, 612, 699, -171, -785, -140, 384, 402, -466, -522]
1424e22J68Q63O9r18n15J064Q20n07j115j93J460M9q03p24K65R03l2p8p83j46
1444f75O28P03p04q08M06Q68O4r51j65N05O86j4n77l63k11R18J05m29p52K06J132
1465E72K46j542m55J287J211o11j755N97R83p7m79j94m4K01K14K78l30o97R1J189
1485F85K84j608q01J458J518q11k355L60K355M51j930j092J271J383o27j325R7
1502f87P42M74j30m76l68l97R93J352r77k613R84L107K99l948j281L889K174k878
1520B59l609J957M018m85l909n85K950Q07j107r29O49k68K77J061k54k575l86
1537b129L799J650l828l629L482M877k011o123L65O021J951n482l231L998L872
1552C582k131l854N57K818O16j638l72P2j53O44J821j294l626N76N351Q06n909
$$ y = [-522, -354, 509, 578, -340, -855, 209, 1029, 522, -593, -786, 674, 723, -80, -804, -539, 364, 332, 254, -529, -675, -47, 656, -48, -856, -450, 418, 482, -469, -634, -129, 557, 543, -34, -397, -608, 310, 415, -14, -766, -560, 572, 818, -724, -1179, 108, 1319, 708, -1047, -450, 533, 456, -23, -217, -261, -60, 154, 432, 102, -595, -504, 685, 969, -639, -1440, 18, 1536, 725, -1630, -1270, 1085, 1536, -394, -1486, -215, 1168, 541, -784, -687, 55, 529, 399, -77, -445, -842, 151, 1503, 526, -2087, -1103, 2004, 2303, -1645, -2926, 963, 3137, 259, -3350, -1393, 2625, 2140, -1769, -2354, 596, 1403, 296, -633, 16, -252, 25, 1086, 832, -1743, -2129, 1670, 3320, -508, -4137, -655, 4222, 2211, -3912, -3547, 2474, 4425, -1057, -4288, -290, 3582, 1451, -2403, -1846, 972, 1588, -50, -422, -350, -503, 141, 1962, 668, -2958, -2382, 2969, 3775, -2134]
1569b134l072N879M935m631o604L031P110p49o817j235N604L007m238k846J770
1584i90K351n69j084N4p15l31K868J522l955l168K892N696j914p045Q0P571K140
1601E403o813m275N189N799l369o002J268N081Q88l730j613J846J429j17j53j145
1617c14j550P48L560R6m428k194M983M427m643n944L171O655n41p107j875O957
1633B001K878m554m471K825M014o94k914o41J345Q18L14k68j183j795K021L274
1649B970j398m389l09N737J598n133m189M300N716k561o051N09N416J603m610
1664g91k607L451K294j304k039r0R93O01K68l54j569m71K286K023k640l176J301
1681a824M589r4m799j461M459K660l194l450J445M188j92l745o42K266J562j205
$$ y = [-2134, -5206, 673, 5608, 977, -5627, -2596, 4514, 3765, -3052, -4287, 1317, 4324, 86, -2760, -990, 1361, 792, -292, -238, -953, -1284, 1584, 3106, -849, -4017, -1125, 4571, 2657, -4388, -4308, 3263, 5403, -1410, -5685, -496, 5303, 1934, -4068, -2800, 2281, 3169, -561, -2174, -328, 1101, 984, 831, -314, -1864, -1116, 2444, 2540, -1888, -4082, 901, 5328, 685, -5259, -2088, 4567, 4026, -3081, -4956, 2001, 4879, 325, -4146, -1321, 2693, 1999, -915, -1556, -211, 607, 921, 653, -530, -2325, -304, 2970, 1572, -2817, -3126, 2611, 4209, -924, -5113, -813, 4903, 2342, -3709, -3200, 2216, 3819, -791, -3398, 53, 2347, 1043, -996, -1086, -93, 508, 776, 422, -1147, -1618, 668, 2691, 51, -3125, -1824, 2765, 2671, -2128, -3589, 870, 3530, 336, -3114, -1669, 2519, 2327, -1418, -2060, 206, 1768, 563]
1697E63j495o6R76P16L86j284r53O90J630N75k687r48J736K725j998l106Q53L308
1715A621J87k453j546J956K062j124j752l38J940P12j315r42L67R70O89p85r36
1732f87K6P77J165q18j491J34J432P68j594j278J288J619l91k112k82J755Q64
1749A175j383q23L86J701j80j172m35L95R08J42r20m66O04K98O81j248j91n3J380
1768G99k65j235k23R00O88m81o43j47Q92O27j076n95N93R00l63o13m70O39O40
1787E67m80n97j28J158k32j03o80M31M87j07p35l9N62M09l32l29J4j50R48m34
1807B30k91j37L42P6k26m59J63M83M37n37n74K5Q31K3m55m47L15Q93o3j125K4
1828d72Q64K80r71j92K77P61o43n6R2L15j95k98N37k57j41l4M50j77n39P8M52
$$ y = [563, -932, -998, -22, 694, 1080, -204, -1157, -467, 1163, 1738, -949, -1897, -161, 2564, 566, -2540, -1687, 1621, 1808, -645, -2191, -235, 1827, 703, -1049, -1387, 553, 1265, -50, -992, -625, 345, 1034, 249, -687, -661, 116, 1281, 463, -1028, -894, 538, 1306, -288, -1566, -278, 1341, 950, -1162, -1444, 311, 1175, -208, -1031, -645, 1056, 876, -296, -731, -336, 572, 714, -206, -672, -68, 230, 911, -337, -528, -581, 799, 534, -701, -924, -24, 664, 183, -460, -607, 285, 912, -164, -759, -166, 734, 371, -242, -712, -73, 567, 87, -510, -638, 520, 288, 185, -495, -64, 423, 316, -419, -458, 104, 513, 181, -148, -134, -284, 664, 230, -61, -198, 144, 220, -6, -465, -302, 181, 618, 81, -493, -468, 363, 386, -69, -516, -201, 692, 629, -496, -472, 392, 672, -299, -491, -214, 547, -96, -152, -60, 255, 60, -238, 299, 42, -99, -133, 317, 140, -399, -321, 131]
1849A31L82r65j18O29N17n20n58N47N20l01o22Q2O92k82n09L09R57n54j224O68
1869b19R35k66j007k77J297L27j541N6J016L05j362m3P31P26j191j85J401j48
1887E55q52k51Q49K98j232j43J408N22j385o68J349R06j231j528R03J534p85j037
1905g88J54J460k49j205L18R40k95o65N1R13o46r26O83J340m36j890O65J855j99
1924A080k117m18K415M86j916q36J623J237j533j352R34J369p43r10M99Q79q91
1941a94j8N31N9j196k10J488O07j350j109J467J367j104j901R51J820j79k019
1958i90n9J588K36j105o37J088M16o04k09L60j71l93P27N51o89q91L51J537j29
1977I77k099L01J331O63j770j020J704J144r88j112J00J370l97k33L02n36J44
$$ y = [131, 513, -452, -570, 59, 576, 56, -502, 45, 565, 264, -358, -276, 416, 134, -375, -66, 891, 337, -887, -219, 716, 450, -557, -834, 463, 790, -751, -695, 321, 626, -736, -779, -48, 678, -513, -698, 703, 555, -297, -548, 301, 599, -633, -776, 632, 1154, -231, -899, 450, 1356, 125, -1403, -500, 1034, 249, -788, -634, 826, 577, -628, -310, 630, 335, -330, -279, 634, -12, -938, -255, 1085, 649, -1241, -576, 1279, 1080, -1037, -1455, 960, 1446, -470, -1306, 317, 1554, 21, -1331, -397, 972, 229, -681, -182, 697, -194, -212, 319, 378, -818, -1028, 460, 1067, -283, -1392, 75, 1442, 338, -1563, -612, 1208, 1029, -990, -1049, 539, 775, -330, -967, 121, 537, -67, -276, 84, -87, -480, 247, 798, 109, -782, -431, 1106, 977, -1122, -821, 510, 1173, -597, -1617, 87, 1231, 243, -869, -769, 601, 204, -29, 273, -263, -119]
1994a19j33P40n50n62J91J032K85j433k27J027R94j049j613Q12J671o11j015J03
2012d57Q51M07r95r0R9K89K3J01r7l67m1M60P02j105o62Q17P36K13j614J46R82
2033C98N52o53j178Q10K46Q9o89L41R9J81O0k24n42k61P86J033p49r85j09J438
2053F43N1j190n87J301M86n54m13j59M08L27k46m11k78K87O90L29q83p00O30J138
2073H69l42j292q6J274O33j072j259R87J229j90j106l76J102M92n87m47n14N74
2091a11M85M5j86q92M87Q24L13j648m27J186J280q10j503K46J748jr85j167Q28
2110b88J149l11j100k74Q11M03j00l51o99J55J402j37q43r94R24J400n93j607
2128a053j74J700J212j425j450L91J524K33q84q00J17J283k6j025n01N56J109
$$ y = [-119, -252, 488, -62, -624, -433, 599, 884, -549, -776, 251, 1245, 196, -1417, -605, 1066, 455, -560, -457, 394, 801, -194, -284, -185, 104, 127, 228, 131, -236, -277, 183, 885, -220, -882, -65, 671, 884, -730, -584, 398, 950, 297, -881, -71, 175, 264, -425, -84, 15, 196, 256, 32, -510, -771, 15, 1048, 299, -686, -795, 643, 694, -496, -1083, 218, 704, 150, -263, -422, -14, 313, 67, -344, -622, -335, 355, 684, -199, -899, -269, 869, 527, -765, -851, 423, 1056, -16, -1275, -288, 941, 751, -355, -731, 371, 863, 276, -171, -685, -111, 374, 419, 233, -659, -172, 652, 965, -683, -1110, 76, 1356, 546, -957, -711, 1037, 1036, 51, -1116, -288, 861, 550, -550, -824, -13, 390, 290, -61, -760, -605, 797, 660, -183, -1177, -253, 1147, 554, -1053, -1227, 473, 1685, 260, -1190, -799, 725, 958, 74, -726, -609, 674, 648, -377, -878, -322, 787]
2145G87j91r64m57N48J390k05j613n84J258J335j007j547K97J506P59j486j072
2162a246P56J453L48j478o50M86J365j73j049q53Q16J385l29j729k20J311J037
2179A230o30j586J48J112Q57q68j034L2J361N56r14j498M48J618R2j533r36J560
2197A5J051n82j169n18J364Q52o07j241K58N97P73q15q21L60P35M65o66r57J78
2216g28J256K76r79j252Q77J561j58j376p19J267J125r71j303M67J319L42j397
2233c93l35P22O04l34l32k00k43N39L01l3p17l52J250P23j272j185O74J735l76
2252G76j758J51J531K52o82j327N71J339l26j083J89M49N37m10j70l07R7K34L14
2271C77j01j016L03J070k81n19o93N50J061m69j053J59J071J46j022m70O63P03
$$ y = [787, 596, -368, -825, -277, 1113, 908, -705, -1289, -31, 1304, 297, -1250, -953, 553, 1312, -174, -1246, -490, 963, 1311, -167, -817, -331, 1034, 861, -188, -1041, -225, 1160, 831, -898, -1118, 193, 1230, 600, -986, -838, 274, 1131, 263, -771, -739, 622, 1178, 264, -1234, -786, 832, 924, -609, -1545, 15, 1066, 484, -685, -1203, 161, 1013, 406, -835, -577, 20, 793, -22, -843, -483, 252, 717, 51, -906, -728, 528, 804, -175, -1427, -550, 1011, 853, -523, -1242, 25, 1150, 179, -1124, -657, 662, 1004, -393, -728, -6, 598, 264, -68, -268, -511, 28, 329, 296, -421, -773, 477, 1200, -72, -1257, -583, 1152, 776, -982, -831, 700, 952, 270, -1057, -486, 853, 527, -556, -367, 82, 619, 209, 39, -268, -171, 63, 377, 276, -740, -437, 633, 352, -167, -860, -310, 751, 282, -771, -612, 459, 605, -417, -887, -224, 479]
2289D79n87q2L29L3J23j92o8q0r2L03K63m75l44J38N59K96p84l93O12O86p34o59
2311f69K32J149l39j008J23O73j46k48Q7K54j52m3M1K09j6k23j99O67L34q55k92
2332d21P08N13p79n84M75Q43m67q15J49O62Q9q37K23N96j19n37p1N26N9k61m7
2353i5N68l22k94j63P20k44j51k69L61O32p31l50K75M09j98m09K68L71k1p08j91
2374e42N86M56m49n34M37L14j35m37M77j22q5m88Q15N2p07K31K76K90p40k79M32
2395a52Q96r98n27K35J090R4j334J51Q64M90r95n87M55P72l11k40J41J63l04k75
2415c72M12J21m09K71O62m41q58j23J270N20j540o13R96J330q11j290N49J059
2433G33l70p77l94O74M87m24l99K51J12J18M03m30m20n5Q02O18j009q16L39J429
$$ y = [479, -108, -190, 139, 172, 295, 103, 35, -45, -137, 166, 429, -46, -390, -252, 307, 603, -181, -574, 38, 724, -10, -669, -437, 712, 373, -635, -512, 161, 15, -233, -146, 108, -44, -87, -46, 163, 147, -76, -275, 392, 726, -129, -421, 287, 800, 21, -563, -88, 755, 288, -527, -378, 284, 373, -464, -241, 355, 236, -301, -372, 154, 213, -48, -95, 473, 151, -143, -306, 414, 170, 19, -250, 111, 743, 12, -338, -63, 346, 148, -261, 7, 378, 357, -351, -542, 44, 500, 51, -483, -46, 268, 133, -304, 173, 51, -34, -522, 293, 345, -362, -131, 145, 435, -305, -584, -152, 744, -254, -781, -546, 544, 638, -696, -545, 319, 809, -186, -773, -318, 454, 143, -97, 44, 207, -97, -372, 40, 161, -248, 23, 685, 244, -614, -737, 533, 1053, -487, -1100, -104, 1226, 415, -875, -326, 733, 363, -414, -808, -134, 353, -71, -470, -219, -107, 11, 414, -16, -436, -491, 311, 929, -80, -896, -557, 872]
2453H72J10j650o77J593J107j534q48N90J613n28j202m43J261L29m51m41o9K05
2471a63M01K00m73q38L17J002O93k006m61J544R49o29j801N43J834L2j870l14
2489a040J007J377r87j011k59J402J3l96n17k68N16R16k39r51l94Q63R46p68j171
2508i61K01J680M74j565j040P89J496k11j826j27J360P39l46j434j57J160O78
2525I10p10j229K70J297Q14r68j262L18J452J44j057j525J331J510l24j584o39
2542a252J143J342m80j617j70J560P52j039j220J09J671L44j415p39O87Q83N41
2559A100j582o67P81J500l07j643l20J289R02p15j101o4J203P90j280q41J51J447
2577F43M14j063j048N68J420l5j528m52J143R96n49j252l95J138R19p45n44k63
$$ y = [872, 982, -668, -1345, 248, 1355, -179, -1027, -437, 1176, 648, -554, -997, 264, 593, 142, -299, -368, -163, 238, 438, -35, -873, -556, 446, 1139, -867, -1328, 216, 1165, 536, -1265, -722, 1112, 1144, -726, -1040, -33, 1344, 357, -654, -913, 489, 502, 106, -411, -679, -163, 753, 514, -437, -831, 32, 978, 210, -961, -760, 920, 1394, -171, -1211, -422, 1074, 863, -963, -1090, 270, 1009, 663, -771, -928, 232, 910, 200, -1029, -759, 538, 1352, 384, -878, -560, 892, 1036, -21, -1546, -215, 1295, 971, -613, -1252, -109, 1233, 753, -864, -1034, 526, 1278, 239, -981, -872, 799, 1143, -272, -1011, -324, 559, 1100, -482, -1149, -368, 1132, 825, -818, -1138, 151, 1053, 338, -763, -827, 376, 1166, -114, -955, -804, 643, 1057, -6, -1054, -486, 934, 899, -629, -1081, 62, 1058, 509, -743, -1138, 0, 919, 174, -370, -633]
2595f33J312K86p38j079O8J320K40o72j160P84J053J3j300n50J164J221q58j295
2613h24J00P15J196j048q71J70J548k0j076o66N48P33p5o68n97L19J181j64r30
2632d29l22N87J341q01j131J4R30Q91r39r49L91R49L2q49m31N70P31j68r33j30
2652f46O75O87k53r38j07M89N94l16n39Q1N70M80j062n38P45O50j70o39l43P44
2672A64K57r3p53l5M19O31o88k35j71P76L59m97l88k00Q57J7k96p07M23O99k3
2693E16r05j49P66J44l79k27k37L55N08l26n88K07M29K36j03n79O5N63l74k88
2713c66j80M62N06l72m66L76L41P5n25k99L97L21q4k75k26Q1Q12k99l70j75M60
2734A94M04j86o57j30O59K32o55k37O1P08J12j191o7Q83N17m67p98K60M01K78
$$ y = [-633, 679, 965, 227, -852, -784, 536, 776, 104, -1056, -272, 781, 794, -506, -1056, 108, 1329, 471, -824, -724, -9, 1187, 139, -732, -562, 986, 966, -110, -776, -228, 505, 430, -238, -835, -516, 665, 501, -429, -751, -164, 1177, 376, -755, -741, 189, 1080, 141, -808, -417, 532, 564, -285, -716, -146, 585, 417, -516, -646, 29, 716, 463, -475, -582, -93, 501, 185, -354, -273, 297, 777, -285, -823, -78, 572, 402, -237, -580, 164, 421, 328, -425, -460, -41, 590, -98, -333, -504, 272, 631, 134, -254, -454, 403, 420, 124, -583, -160, 539, 516, -389, -538, 228, 372, -7, -234, -471, -116, 392, 66, -522, -315, 114, 350, 247, -332, -267, 296, -78, -366, -546, -84, 422, 50, -416, -40, 301, 376, -149, -448, -51, 270, 186, -89, -315, -234, 578, 279, -91, -266, 194, 598, 412, -245, -375, 284, 516, -139, -376, -315, 393, 505, -686, -753, 130, 647, 180, -618, -358, 43, 321]
2754C21m64l23L31J90K61k88k88j81M35K15J07j037L98Q64n6n87o49Q50N52m17
2774B34m60o6Q51k2p68l85O74M33l99k60nL03j32J29j34p24L44N82J97j90o15
2795d13K23O96L8j005o9J020j24n93l17P6R83k98n17j26N82m4k18j67L09J95k6
2816B05j68n7J78j95M77m06n23k2O29Q37p76o40J37P93j82k93o83P71J82j18l68
2837b22o7L54K17j35r0o04N58M26k25m95K11K65j48R7l28j3N09M42r48j09O2O37
2859C94j93n13pM48J52j65k43k74N12p7O9m46J99K54J59j03m26K86K42j92k7k31
2881a82K6K88p8k88p5L02L30j11n61K73J77O6m04j25L00L28j41l1pj12K88k92
2903b9M8o1K26Q5j03m51J44J84J02p8k03L8J64nK5l00K70J30j26k11l04N19K86
$$ y = [321, -143, -466, -135, 55, 316, 28, -260, -441, -6, 209, 316, -721, -323, 541, 485, -102, -751, 99, 651, 234, -226, -292, 559, 537, -231, -616, 58, 491, 92, -168, -173, 130, -2, 127, -7, -731, -387, 195, 392, 202, -413, -190, 506, 544, -461, -530, 490, 366, -227, -544, -468, 515, 217, -300, -426, 156, 112, -106, -273, 36, 231, 205, 37, -20, 158, -37, 440, 34, -489, -511, 118, 955, 179, -461, -324, 469, 287, -6, -689, 82, 264, 146, -222, -289, 65, 282, 147, 57, -547, 11, 437, 212, -283, -72, 193, 45, 142, -186, -199, 310, 752, -196, -305, -243, 394, 201, -312, -319, 129, 281, 116, -127, -401, 111, 34, 103, -343, -144, 110, 269, 166, -260, 26, 268, 76, 49, -182, -156, 132, 54, -234, -309, -7, 323, 212, -349, -76, 101, 167, -237, -362, -62, 266, 125, 94, 87, -25, 263, -29, 19, -42, 184, 269, 166, -285, -141, 43, 145, 67, -136, -98, 66, 61, 86, -214, 56, 186, 60, -151, -455, 64, 350]
2926C50n18N1J25j9N1K0j97k2R8Q2k3j78q0J25L85n99J43L0J91K22l34r3R9M03
2950C12k25k27K76q4K47k13l49J49K5M11l94J46P8M1k41k53K39N6J63N3o51M71
2972C0J6K52k43o6k32L45j7o0m14L40L78k14j31j57N1M89m60M2l60R2O73j5n16
2995a77m6K53l6j67k70O8O37n4k60l33K75L80n8o98M33j10K96L2n26q5N82J92
3017C28j82k85m01Q88J04n03J23m58P90j22l33k47K08N78l43m11R2N73j73j99
3037B7k48o8N57j01J4l13j19K15L03k25n33OP80J82l23q29O10Q84m70p42J94K62
3059F3J51M6o23M11K32K0L5n58R4J67L67m22l99j17P53L38l03p80K85N90K75o86
3081f1l75N66N98m34q63K73P42n4n35o35P31J98L86n11m57L49K80J40k14k26l34
$$ y = [350, -168, -117, 8, -11, 40, 60, -137, -159, -61, 21, -2, -180, -260, -135, 250, -349, -206, -176, 15, 237, -97, -190, -91, 312, 87, -140, 136, 52, 299, 86, -263, -114, -89, 322, -72, 74, 152, 193, -48, -301, -62, -6, 157, 210, -441, 30, 46, 298, 55, -11, -243, 102, 85, 25, -389, -49, 329, 115, -16, -173, -122, 367, -93, -51, -411, -319, 354, 339, -177, -223, 30, -6, -173, -443, -375, 262, 208, -52, -385, -110, 270, 212, -486, -53, -163, 133, 165, -361, -446, 136, 328, 146, -139, -540, 348, 452, -51, 72, -386, 404, 282, -51, -298, -90, 488, 145, -266, -174, 399, 226, 27, -221, -289, 268, 167, 181, -132, -251, -36, 267, 42, -491, -485, 295, 477, 154, -675, -65, 819, 349, -393, -199, 63, 214, 260, -363, 48, 280, 300, 335, -223, -129, 38, 405, -17, -416, -533, 220, 558, 255, -525, -240, 350, 625, -61, -436, 130, 728, 294, -569, -296, 446, 392, -143, -778, -47, 151, 537, 26, -431, -82, 198, 338, 124, -102, -436]
3102d36N99L50o58n21L67J038m18r71K28N88M23q71m09M46P10k23j06o38K2N53
3122G3L54m69k34M07J34j49k02o73O58K48J32q23N9R31L07o45p45K58Q94M7q49
3143b87k65L43J022o49p35J32P46j74j60k81j3N9P87J3p83k9M80J55J29j128k4
3164f62J107K32r68o23L86J518q11o30rQ60Oo61k01M16L45J56m86j49j02M32M60
3185F16m10m29K3M31N31p51o18L97P45r7o70l18P74M34q71k88L03N68J85n39p75
3206g59N83K35K75j73l11j30J91P26o57k10j21O66J03p02m75Q09K90j72n10M4
3226b98N63J50q16k39O11J73Q2j27k81J85M45k61m33N5K41K55Rl23m52N98J71
3247C08J49p67m0N00L09k64m12j46Q58j66j71l70M39K32l04j42m08P18p5o74N16
$$ y = [-436, 163, 513, -145, -666, -299, 739, 321, -650, -422, 166, 589, -282, -691, -245, 465, 242, 136, -502, -480, 73, 427, -42, -276, 131, 265, 116, -86, -759, -101, 147, 279, -544, -485, 446, 753, 108, -637, -379, 515, 562, -287, -552, -209, 813, 164, -571, -439, 307, 133, -27, -308, -321, -262, 525, 538, -245, -274, 206, 361, 490, -638, -662, 445, 677, -291, -914, -528, 990, 179, -451, -460, 400, 406, -255, -456, -40, 305, 461, -25, -174, -276, 156, 616, 206, -223, -200, 231, 762, 11, -607, -210, 535, 438, -232, -550, 224, 658, -213, -501, -198, 370, 555, 16, -759, -176, 59, 334, 161, -150, -280, -89, 637, -20, -230, -351, 315, 418, -284, -759, 50, 340, 168, -342, -298, 265, 415, -401, -640, -29, 144, 226, 99, -182, 3, 448, 187, -246, -191, 50, 305, 314, -9, -461, 137, 308, 457, -310, -350, 150, 459, 195, -217, -363, 495, 329, 158, -212, 227, 459, 155, 13, -395, 323, 248, -426, 90]
3268I0k60O3K46K13n00j72L50M90p24j06M05l6L2J2n80M57L83l65m0k23L95M2
3290A72M8o28L01J72o4r7l63K49N40n11K6l26Q48o8l13r1O4j97M80j08k39P9p0
3313i6K54R5p20O44p0J12k67m0J95K97j38n15M5J67P2K83n05Q6J22m7J8k38L25
3336G9o9J31n9l54J55J47J6j44j31L94J79j83j03j88L33l63K74k42oL59j30j30
3358c5j44MM87r2l17j90K75J78p9l27K1O6K50k85r6J07K60L3ml33K63K11j37l13
3382a97Q0q7M75m10J40k34o4P48l93K8j78K60k52K72j96j28J8K34J5j73k78K73
3404d7O6N5l91J52J73J37k57j53K68K46K4k79K27k20N2J34k41l08N28k28j00J99
3426C7o8J63l41J35l4o2K83m56N62J3n08Q3J59M4j95K2K65j35j17N2M0K45j34
$$ y = [90, -170, -107, 139, 352, -148, -320, 30, 520, -204, -310, 95, 59, 91, 103, -477, -20, 363, -2, -42, -265, 130, 172, 220, -408, -107, 65, 1, -96, -459, -210, 330, -181, -155, -481, 367, 299, -14, -105, -41, -238, 242, 134, -105, -26, -96, 158, 253, -467, 177, 107, 219, -48, -88, 107, 404, 266, -249, -204, -37, 35, 318, -187, -101, 21, -26, -8, -246, 79, 10, 141, 82, -272, -117, 30, 46, -98, -229, 165, 344, 161, 58, -130, 203, -160, 114, -128, -134, 225, 95, -35, -179, -175, 312, 220, -97, -287, -12, 166, 87, -240, -219, -153, 97, -188, -284, -177, 83, 116, 112, -221, 42, 253, 116, -197, -117, -204, 271, -139, 1, -233, -297, 451, 58, 86, -92, 168, -84, 188, -8, -136, -118, 116, 131, -42, -320, -47, 19, 74, -317, -165, 8, 145, -112, -265, 3, 249, 273, -6, 221, 1, 53, 187, -54, -362, 166, -62, -162, 37, -31, 132, -209, -74, -108, -170, 113, -343, 219, 232, -276, -193, -34, 10, -185, -163, 102, -33, -150, -98, -58, 187, 53]
3449E3m6j22M3J35K6L9j82j9J06O5j85j30L22k33J30j30L32j16M5l65J34L83k31
3472E4j4r6Q8J53K30n46K60l48K88j58M03Ll94R4j1J4m05M59L50l66k6o5k51L42
3496E8m5J03J61j83j4j35R8K20p27J94J16K58m62K15j24K93j22Mk60K37J11o5
3518f9l6kj96J62J43J19J96o32N23j45l2k45K89j45K56l12j2P4n1J50k9j5j43
3541a52QJ02m2l9J24j23J16k00M37k87L34k08l39K41j8L44o1l81K57J48K0l45
3563f4j37M24k43N4j91L92k79J16J23k28n8P9K97P0l23j78P5Q0J34l66P2M25l00
3586b6k38PN93j83r0p6O0J32j10n5j56J78oJ41l93J69r1J78K58j91l69P5M41Q2
3610C30j83n66R2M17K45n81P3K06J1k50N2O9J84J30l69J61QJ00L75n56j00M9j79
$$ y = [53, 7, -115, -72, 63, 89, 128, -54, -73, 33, 98, -87, -217, 105, -128, 2, -128, 204, 88, 133, -232, -98, 285, 54, 40, -56, 32, 185, 415, -131, 129, -219, 69, -89, 314, 317, -77, 17, 6, 20, -385, 74, 424, 58, 32, -33, -284, 58, 13, 116, 277, 94, 80, -55, 43, 263, -464, -270, -154, 104, -358, -143, -267, 26, -96, -92, -352, -115, -4, -69, -105, -107, -303, -141, 2, 121, 317, -315, 208, 63, 31, -214, 75, -70, 186, -126, -138, -64, -115, 35, 6, -9, -152, -144, -42, -84, -123, 1, -122, -6, -206, 231, -56, 278, 70, -269, -28, -46, 298, 237, -144, 113, 261, 281, -64, -201, 223, -20, 34, -157, 235, -44, 72, 195, -33, -91, -12, 285, 355, 32, -146, -71, 9, 143, -223, -151, 274, -26, -264, -257, 336, 153, 63, -13, 47, 179, 69, 14, -142, 36, 30, 171, -222, -53, -144, 34, 292, 101, -268, -193, 248, 330, 147, -419, -327, 90, 335, -246, -173, 33, 44, -206, -154, -85, 99, 229, -140, 21, 29, 129, 504, -52, -152, -103, -282]
3633b82L71k61m32N70J76Q0j60o7J13J23J48o30K96J57l24L73l07m4J79J94l47
3654g4k85M71k7J10L0m32K26L44m11j3l60L80K51J18o82K03O0K50R7l24l03L03
3676f8J96m00Q8l2M70J26l17j61j32N38j29j5m16oM33q0k04K36k38J40k18j66
3698c55M64j59O15m48m79R7N04J7j48m95m1N67K66m80k77J07K20j5K3l45K46K83
3720A67k09k14k40O15J13o5l36O0M83k51J39q6m78M81K03m90p3L42j83K70Ml16
3742f4q4N63k05m72j5M14M1M0m52j52M62K91k89l44LN30j29j10l00K97M07n09
3764g7ql80O61K59m25n15J49L26L01n12K36k8l2j5Q9j55k04O23j20k93q0J69J00
3787F9j10l8j90K30M09J04o10j52N5M80m98J28k24L71J30j20r0KJ78L1l2m31K93
$$ y = [-282, 89, -172, -604, -34, 142, 222, 62, -5, 108, 231, 379, -251, 45, 202, -122, 251, -56, -100, 79, 273, -74, -359, 112, 85, 195, 225, -207, 19, 363, -48, -61, -421, -41, 210, 328, -354, -151, -91, 159, 256, -68, -371, -68, 128, -272, -184, -216, 254, 380, 63, -98, -230, 308, 179, 164, -252, -258, 175, 95, -109, 127, -111, 29, -189, -355, 109, -50, 565, 117, -362, -265, 239, 256, 108, -387, -428, 139, 405, -75, -352, -245, -25, -40, -17, -362, -116, 167, -42, -256, -496, 119, 232, 167, -169, -109, 374, 123, 262, 176, -302, 179, 382, -108, -181, 161, -22, 248, 252, -64, -148, 415, 210, -262, -277, 137, 178, 218, -234, -386, 76, 367, 78, -266, -263, 267, 138, 28, -272, 25, 432, -77, -85, -465, 196, 455, 30, -485, -336, -10, 291, -221, 15, -13, -45, -60, 29, -126, -330, 293, 173, -120, -200, -31, 69, -41, -79, -269, -39, 370, 474, -136, -288, -233, 247, -251, -123, -347, 24, 154, 34, -56, -54, 124, 155, 123, -308, -15]
3810a5pM02m23K9j12L63r5n23L51K33q6K15q14M74N37j99o90M12K93l35J98l36
3832a28p8J56j2J15O2m7l12M59j30r2k83J78K64J10n34J83K66o9k64oK75J08l11
3855i0o7l09L94J34j95O7JK0k8M7O6l54K18j04J16M5PJ35L5r5o7J93q0m82M77
3880H4j25J35J30m63J78R7Om8k94M06J16l61O0L3J26j02Q6o4n0P5j0L74k61k85
3904a57L16j29j81L68l30K91r6j28O8L1p6N8k83Q2N76k8l61j83J44QK70l52J72
3927H0n1O8K4J25l18m2j19k4K28k26L8K49J86k80kK46rr4j68Q8%L88j27j69p7
3952A4M9k96K66k4j58K84j86r9J26J39n0m09L73j52K40o5j78J71j33k80K80K16
3974A28J81m04Qn7j19M9j60M73J0o0P8j62j31J01o4L31k04J57j73Q1r3J71k18
$$ y = [-15, -22, 380, -43, -14, -126, 237, 142, -381, -30, 203, 117, 332, -482, -8, 529, 330, -360, 52, 345, 10, 208, -128, -206, -50, -62, 53, 115, 68, -244, 215, 85, -7, -290, -112, 152, 262, -272, -89, 177, 108, -156, -162, 113, 221, -90, -157, -466, -72, 62, -133, -66, -65, -45, -73, -26, 40, -314, -96, -200, -84, -39, -32, 103, 138, 43, -24, 169, 89, -393, 84, -41, 94, 224, -239, -61, 36, 42, -6, -300, 106, 222, -139, -79, -46, 80, -22, 64, 0, -50, 25, 15, 389, 128, -157, 159, 30, -151, 217, -113, 178, 82, -46, 22, 53, -23, 35, -248, -166, 410, 382, 21, -162, -18, -10, 260, -92, 80, 29, 97, 121, 246, -72, -114, -233, -257, -29, -255, -217, 32, 218, -62, -64, 182, 173, 79, -89, -1, -1, 387, 260, 91, 14, 63, -233, 33, 9, -149, 135, -51, -150, -24, 115, 65, -344, 29, -123, 117, 52, -126, 45, -88, -368, -88, 128, 309, -95, -87, -144, -263, -214, -374, 99, 109, 49, 127, -35, -166, -65, -129, 202, -2, 155, -18, 63, -30, 141, -77]
3997g7j73K14j05K73J67l37n7K24j24M0n8k6n3R8K3p5o3J87J70l12N9m0J08j38
4021g5K2j0k36L32k70K58m1k4n7K49o6j68J17k9N9q6j41M15K7j97q4J31k03J06
4045B9O2k48R0l0KJ08k74M73l17J41r2J26m11L25o5J72k37J34K92k80k71j18N86
4068A97j49J5k58M3L31j78N6J98j15j74m6lJ00j42j65M30q6j42J47k62L20j78
4090f1q7Q9L6J89L4o3j86K0J40o3j42O9rJ54m13L59l29O47k54Q4j34j21j26L5
4114a32p4L05k59J95j20j62K46m6J65K41k27j01k9JK36l39j44L04J83p00M73M5
4136F1J7n8j69m1J27K18k32L29p21J6O90j46J71l82J97K61k39J16l22K1L39n44
4158b91M83l92J12j28L32l10O4K16M2j34K15j82m5J54j96k11J06K90Q8k78JK85
$$ y = [-77, -250, -36, -141, 132, 299, -38, -95, 129, 5, 45, -13, -39, -92, 6, 29, -46, -109, 78, 248, -64, -5, -45, 63, -75, -53, -63, -299, 33, -237, 21, -20, -44, -101, 148, 82, -86, 31, 2, 61, -25, -166, 249, 276, 79, -5, 126, -77, 29, 91, -157, -67, -97, -95, 13, -261, 212, -105, 36, -56, 70, -341, -16, -81, 91, -146, -12, 280, 0, -271, -389, 197, 48, 63, -195, -152, 179, 1, 57, 255, 140, -34, -80, -83, 17, -125, -290, 140, 54, -88, 59, -203, 117, -61, -148, -59, -23, 166, 200, 137, -49, -29, 111, 48, -94, -25, -34, 120, -293, 66, -263, 384, 130, 214, 80, -41, -167, -132, -206, 99, -160, 35, -85, -247, -1, -47, 118, 359, 132, 31, 2, 3, 239, -100, -244, 60, 243, -457, 16, 61, 78, 20, -149, -190, -63, 155, -77, 252, -469, -453, 237, 91, 262, -120, 77, 338, 99, 215, -107, -86, 253, -291, 192, -200, -88, -216, 116, -194, -130, 86, 128, -6, 209, 27, -18, 136, -60, -271, -165, 125, 213, -65, -64, 221]
4180B21l42J30K46j82j9j85pK24j72M8K6L7J87m23J53mJ53r2k26M50l23K85N3
4203B38j10k51M7k24O1K79rp7J50qoj27K0j73J67J05k81M90n59K18j63J10J91
4226H8k83K42j61J61q9p7J64j1k17L8J75J78k65J60k68J59J0M1j5J3L8K03l63
4249g9K05k12J16n1j11j71J90J93r3j14J74J87j43M6L8J02k65J25n49K08L95m37
4271b46J41K56j06J00k07Q2J8P8N4Q1l45pj3J5j72L50q1R6j01J19j95J4j22K04
4295A3l5M2n0K51j94J79l12q9J65J09K58m48L25k32O1k29J85J4J70j02k51K14
4317D4P2J25n75K30K46j17r4l53N53l19K29j75J12r9J40l5o2mJ90k18j43K74r5
4340g4l19K74R1j52J3J40R6j23M05k27k42M3L42j50k23M44m78L84%k87JK55n9
$$ y = [221, -121, 9, 255, 73, 54, -131, -138, 86, -86, -38, -12, 25, 212, -211, -58, -62, 91, -1, -227, 223, -100, 185, 238, 128, -123, -76, -300, -239, 40, 31, -46, 104, 96, 90, -37, -17, -190, -23, 82, -199, 291, -268, -50, -213, -103, 88, -195, 47, -114, 47, -42, -119, 45, 34, -183, -145, 30, 208, -57, 103, -165, -6, 4, 45, 30, 43, 81, 284, -79, 126, -86, 30, -21, -132, -303, -113, 80, -13, -127, 47, 234, 91, 137, 175, 277, 12, 137, -412, -204, 191, -246, -105, 151, 45, 145, -62, 20, 38, 116, 170, 251, -94, -101, -114, -99, -271, 79, -2, 94, -7, 112, -83, -69, -191, 13, -22, 20, -30, 221, 27, 206, -106, -195, -30, 79, 337, -111, 214, -18, 43, -186, -1, 13, 183, 81, -170, 44, 116, 241, -334, -104, 142, 25, -69, -422, 131, -188, 41, -134, -22, -121, 19, -16, -78, -82, 108, -110, -253, 21, -74, -393, -119, -28, -180, -167, -27, 69, -54, 351, 124, -118, -75, 267, 117, -106, 338, -140, 244, 244, -43, -42, 213, 154]
4363A54k67m8J2j26L48k07Q6L0l8J74k26J03mm4j11M3K85m48K33K30o4k03J84
4386I6j46K52k24J35j15J59m04K61M83m97J56k45J52n2j26k4k08M78q4l29J34
4407a48K30j93J30J59p4l35q1K56o5Q1L2L32j56j67p6l3o3K20M5Rk13J00l21M6
4431b85J17L06k69M21l72P1o9J89L2J7K44n62M70o31L10l8l28J51L22l08L4J05
4453g3J45l2j13K28k15J96oM6l65L98k08K00j13J35m98N68l62j40K08J02j31j55
4475a85K14m27Q11n92R7jL23m20P7j10L51R5k00J41k54J33N8j62m7m0J11p7J00
4498dj41K97K32k28j80K00j87K19o6j53o8J45K04k52J21J63n0m9j45J25j70k39
4520b26J13L78p4k87J88p0K1k92L44j96M18j9m98J86k5j3J55k88L93j93K1O4j84
$$ y = [154, -113, -161, -149, -275, 73, -134, -48, -18, -56, 118, -108, -5, -9, -53, -164, -121, 164, -284, -51, 179, 115, -88, 96, -50, 202, -22, 113, -2, 157, -247, 14, 497, 0, 156, -89, 63, 11, -115, -139, -347, 131, 47, -282, -148, 82, -111, 19, 178, 104, -231, -312, -56, -121, -40, -8, 324, 168, 1, -75, -108, -171, 49, 94, 103, -110, -10, -331, -285, -168, 138, -131, 290, -82, -11, -80, 109, 141, 158, 402, -160, 310, -321, -11, -49, -377, -226, 96, -212, -178, -73, 72, 40, -73, 155, -60, 136, 130, 176, -189, 209, 1, 201, 88, 223, -275, 293, -69, -209, -1, 101, -30, -185, 29, -398, 413, -179, -82, -83, 240, -180, -103, -213, 138, 233, 33, 174, -80, 53, 111, -51, -98, -138, -27, -104, -4, -145, 152, 384, 156, -24, 176, -11, 208, 142, -11, -79, 66, 270, 18, 139, 302, 252, 203, 58, 183, 13, -226, -113, 265, 191, -96, 92, 22, 43, -249, 95, -101, 317, 298, -200, -14, -39, -52, 103, -185, 208, 15, 36, 100, -84]
4543h4L42k94K22k99L72K8n21K50M3J90J54m79K07k81N4qN16m15RJ13m63K01J11
4566c2mo8N1K6m1n5M50l26J73k80J34J42k18J9K8k62L36K9k13J26l06N0J86l61
4590d16N84k35k19M17l51K76k67M18p7k42P8J2k20M06j25j60K29o5j47k19L44
4611B1L0J21k84n4K22j15M0j79L13j5l11N6J33k14L03l47L72j18j6o4J97J01k36
4634d4J21j39l3Q8j00r9L70k54k5K8l08M40K12j63q2m5j12O6L86k87J28j03J26
4657A71n27K39o2K68l2n9j30J41l8k79M46j27J27j61j34L7K55O7m29N78l58L7
4679C0L6j12j60K17k32K72J58J55k38l2k62k7M04k03J43k40J70K0l51R7J75k18
4701a98Q9P4J31J0J87k43j91K37k95K69j48K74k11j78J9M35mj31k17K93m40J38
$$ y = [-84, 258, -36, 186, -113, 259, 287, -234, 16, 59, 249, 403, -76, 131, -150, -96, -104, 412, -3, 6, 119, -344, -143, -32, -36, -104, -53, -27, -68, -123, 327, 1, 174, -106, 28, 170, -48, -29, -1, -263, 73, 102, -111, 15, -291, -241, -55, -416, 168, -67, -286, 131, -220, 56, -211, 207, 130, -112, -34, -22, -242, 164, 39, -121, 108, 43, -104, -323, 21, 51, 172, -112, -166, 56, -59, -19, -198, 115, 100, -211, -155, -22, -236, 67, -280, 92, -26, -42, -106, 91, 192, -44, 77, -62, -95, -7, -107, -206, 164, -90, -115, -87, -395, 45, 257, 94, 12, -33, -145, -79, 307, 20, 148, 45, 171, -356, -117, -179, 89, 57, -2, -132, 9, -29, -308, 138, 11, 138, -23, -157, -120, 135, 202, -227, 351, -7, 30, 66, -46, -206, 11, -221, 51, 209, 364, 126, 94, -168, -195, 209, 6, 149, -91, 79, 99, -252, -155, 20, -198, -109, -35, 96, 106, 293, 50, -141, 96, -199, 70, -78, 196, -15, -193, -174, 261, 257, 126, -91, 202, -238, -100]
4723a00J36rL7J06m14J75k4o7K07j74J57O3j06m2J99k3J40l82M87l02j7m7k22
4746b22L14j65K15j29K05k1j87P8j15k12M01k81K68l20m4O4j23K67j52k8K30o8
4768b5o6O2L06m21K57K79k59j28k94O7J67On9m2N2k21L32O2k94Q8j25L16m1p6
4792e7r7J8k6K69k51M8R7j42NQ0O6j2m9J3p9K50k80K13k37j4M04j22m6K76j61
4817A66j55j39J84j46J71j33m3L4J64p8J66n3k43L52k74l0J22k85m3J76K1N6J38
4840A28n6p1j86J54K47r2p4n7K02Jo7k99J67L85l04q9n5k6R2p6N3K85m12K75J0
4865A35k03M0J58k1O5pk18L4r9M73k40j14qp1J25k00K26j62K06k58K62j90M2n7
4889h2Q8J60j7k89m21P96j99J04k34K21j98o3M64l65L56m16P2k26L03j66LP5o5
$$ y = [-100, 36, 27, 64, 170, -244, -69, -93, -160, 47, -127, 30, 93, -13, -55, 144, 121, 261, -121, 366, 64, 47, 0, -222, 92, -73, 142, 13, 218, 197, 10, 88, -27, -239, 162, -119, 149, -171, -215, -151, -274, -7, -159, -187, 43, -25, -91, -29, 277, -144, 113, 392, 133, 5, -289, -222, -55, -49, -108, -150, -98, -319, 13, 75, -219, -131, -256, 60, 19, -57, -154, -136, -162, 107, -144, -96, 1, -141, -136, -56, 10, -2, -51, -38, -117, 133, -147, 66, -171, -185, 219, 97, 51, 327, 166, 11, -128, 56, -90, 81, -52, -95, -61, 103, 25, 191, 138, -105, 247, -27, -57, 65, -220, -263, -87, -66, -10, 128, 72, 1, -185, -31, 216, 124, 50, -7, 195, 196, 129, -170, -3, 382, 78, -11, -66, -92, 0, -76, -23, 262, -150, 125, 135, -68, -28, 130, 109, 174, 167, -51, -17, -116, 357, 117, 3, -5, -76, 49, -151, 75, -87, 119, -139, 123, -67, -25, -82, 6, 166, 149, -140, -561, 235, 36, 140, -94, 127, -71, -134, 330, -35, 321, -95, -23, -249, 54, -112, -109, -34, -99]
4912i9M94j85j07l30K83j29K92M9NL3m26k3J78J75r7j35j01K90N9j16j77j03K18
4935D8l15K24j88L2J44M9m25M60J66J63n68L49o6K69k57j28n1j74O0K5K24j80
4957a39J07j5O3K5N2k85q2M05k00j87L44M7j15j77M1K31J58o56K57NP1K30kj91
4981a3k33j7L39k40L92k82J29P5q0Q3M6J9k65k10K52J27l48L50k10K61l41j49
5003c15M69l19M13l71J58L29m88J97o2Kp8K38oj18J38P0l91J73j97L93k6l67K75
5026A17L5J62m59j36L81j32O2Q9j25J13j36K40l64L31m07J06L72k93P4J6j44J88
5048I0j44r7R1q5K41k09K02KK19l76PL5J64j18k00q4M19j78k87J95k30M13j21
5071e1j54K10k12J36K4J32k29qL3J58K1k12JK55j01L9M2j03j27J8L7j7J61r2K5
$$ y = [-99, 395, 210, 103, -227, 56, -73, 219, 268, 273, 306, -120, -143, 35, 210, 113, -22, -123, 167, 226, 110, -67, -170, 48, -267, -43, -231, -199, -55, -6, -431, 29, 195, 358, -210, 139, 73, 342, 85, -43, -94, -268, -208, -183, 41, -139, -32, -47, 16, 41, 93, -192, -274, 131, -69, -256, 88, 135, 20, -157, -116, 115, 273, -383, -126, -121, -50, 180, 178, -13, -246, -263, 76, -164, 228, -54, 75, 150, 70, 153, 199, 218, -47, -257, -5, 122, -226, 124, -86, 175, -166, -315, 154, -165, 248, -123, 35, 364, -124, 73, 11, 13, -65, 173, 167, 49, 187, 257, -134, 39, -158, 235, 209, -158, 117, 152, 314, -145, -281, 100, -32, 30, 119, -6, 107, -29, 211, -153, 178, -229, -123, 249, -44, 30, 46, -98, 90, -54, -151, -60, -145, 96, -113, 89, 91, 310, -66, -59, -24, 140, 22, -178, -262, 157, -21, -308, -113, -343, 70, -51, -205, 5, -207, -71, -47, 85, -144, -152, -119, 39, 60, -152, -151, 104, 3, 42, 84, -19, -146, -128, -91, -108, 53, -39, -14]
5096a4p9O0J19J46j05j29O2k50L85k97J9J5j90N2Q3L15k24j84J29M9J20P3K1q3
5120I3R9l8k67K12o3J58l87L66j22K37l87L9j6k79K75O4k35O63j88l95K64k0l23
5143b50K1M19j08l28J25J03Q4N5n8l55M11j73k38J88k54J58K16kJ09k28P3K15
5165A83j83k07NM95l76K20K27m97N3K00P9q5k47J38J16j55K08k16k4R2L5l1l72
5188c42O7K39K26k64K3J91q9j16k07K06M04n9Pl27j06J36j20N8R9J5j06K58k25
5211c2R6k21M61j51k19J62n8j78K89k06J71q4Q8l0j65K27l7q3j09K43k02J39r2
5234IL2k22M29k66K71k49k0J22m01M26o7J7J30l91K12j01m56L40L23j65R4J22
5256A89J3m13J30O2L49m74J99j77J84j10Q1o3K18j77N4L5l8j59O7Q6j68L68m66
$$ y = [-14, -93, -33, 86, 232, 127, -2, 60, -190, 195, -102, -83, -68, -258, -206, -123, 192, -32, -216, -87, -38, 82, 155, 176, 93, 192, 154, -113, 99, 36, 194, -193, 173, 51, 288, -99, -60, -76, -355, -80, -16, -251, 412, 224, -171, 93, 73, -250, -229, 190, 82, -246, -121, -18, 66, 121, 63, -292, 119, -54, -292, -104, -358, -200, 16, 14, 123, -105, -32, 183, 0, -207, -202, 293, -83, 137, 364, -133, -80, 120, 199, 114, -133, 5, 121, -34, 174, -42, -66, 26, 61, 30, -342, -275, -36, 190, -74, -51, 140, 51, -65, -272, -66, 338, 279, 286, -41, -147, -11, -131, -73, 26, 41, -65, 193, -32, 64, -157, 304, 153, -66, 96, 38, -140, 149, -57, 114, 30, 118, 88, -77, 150, 113, 30, -79, 164, -38, 101, 9, 41, -181, 248, -18, 253, 4, -16, 106, -295, 131, 64, 81, 211, -180, 32, -69, -525, -185, 138, -27, 67, 189, 202, -211, -81, -19, 330, -144, 55, -122, 62, -48, 33, -30, 188, 11, 65, 100, 62, -97, -30, 56, -112, 256, -210]
5279b10JK68k13J39K0J51k86L91l03O4Q3j16Lj90K39R1j22K89k70J48k9l36O3
5302a25K89J92n46R3j19J78k28J93m2J9L87j29j12k3K67k36o7j49q3M89l03K91
5324B36j21N6l43R9P3R7n9l09M87l58K18j26rK8P0K57l04L07l51J84k50K77m8
5347A11m2K0q1j97pL1K62M4l93L80%J74o07N09l61J83l3j09J27k29L10l19K91
5370F4k3P9J93l65O9J31l8J27l01Q6k01N32q9n94M04m8J97k78k59K93K61l39N8
5393d1j45R0j04K49j18J19q5j2n9j5K18j63J45j36K45j76j5L5j02M24n36J42m58
5416d98K67M01l25K37l44L49L23n03j79J64J50o4l4J91J14m8l43J42K1J15l39
5437b03j40L43k5L21k49J06k41j50J05P5J02P1j72rmO9j06K20k86Q9K84l26J93
$$ y = [-210, -209, 59, -154, -15, 5, 156, -130, 261, -42, 22, 105, -11, -8, -198, 41, 132, 10, 299, 29, 177, 148, -188, -125, 164, 356, -190, -97, -216, -38, -266, -73, -115, -96, 291, 162, 50, 27, 294, 58, -9, -158, -241, 248, -55, 236, 115, 171, -172, -73, 0, 97, 38, -271, 216, -142, 76, -50, -59, -31, 39, 296, -8, 299, -52, 132, -118, 159, 111, 69, 89, 8, -189, -196, -165, 97, 141, -252, 128, 128, 302, -305, 204, -157, 26, -7, -116, 11, -218, 92, -227, 64, 41, 120, 313, -52, 17, 148, 110, 237, -64, 22, -179, 353, 264, -330, 74, 26, 223, -55, -314, -21, 240, -99, -41, -186, -96, -200, 49, -69, 50, -35, -47, -106, -121, 97, -66, 79, -57, 188, 12, -3, 32, -70, 354, -182, -40, -498, -231, 170, -155, 82, -262, 87, 410, -93, -272, -108, 42, -22, -56, 135, 249, 201, -142, 0, 21, 136, -203, -343, 0, -25, 296, 47, 153, -88, -238, -133, -58, 44, 115, -57, -66, -70, -1, -107, 113, -173, -84, 200, -126, 67]
5460F7R6q5m82M11j2p1k2J4J66j7J58n69M30J13j17k89M15n0j45j40J01J51k05
5483h2Q1J23J1l90J26lK43k28L41O3j65rL8j55M1L9m34K60j38N9M45k3m19K85
5507A09m21pO95n62k5o3L56m8m4m7K6J83m83M78Kk56J16R1l13Q3nj45J93K65l27
5532a49K60j09n4l4pK69k03n2J56j42j51L01k35K22j22n4J13j12J97k88K30J8
$$ y = [67, 163, 78, -404, 7, -5, -76, -98, -84, 82, 65, 223, -346, 84, 197, 80, -209, 206, 156, 11, -129, -28, 123, -82, -1, 122, 133, -257, -131, -134, 109, -119, 222, 285, 120, 111, 149, -6, 35, 74, -360, -100, -238, -179, 266, 243, -176, 109, -312, -319, 376, -186, -211, -274, 82, 34, -10, -57, -31, 152, -331, 147, 149, -107, 9, 100, -213, -130, -135, -280, -87, 178, -149, 111, 2, -52, -86, -93, 176, -27, -79, 77, -65, -216, 85, -150, 72, -50, -104, 9, -103, 94, -194, 36, 54]
$$ [...]
8191A19
##END NTUPLES=NMR FID
##END=
