##TITLE=1H_PR68_HCl
D2O
 8 sc, 
 2.11.2023
##JCAMPDX= 6.0         $$ Bruker NMR JCAMP-DX V2.0
##DATA TYPE= NMR FID
##DATA CLASS= NTUPLES
##ORIGIN= UXNMR, Bruker Analytische Messtechnik GmbH
##OWNER= root
$$ XWIN-NMR		Version 3.5
$$ Thu Nov  2 17:49:09 2023 Russian Standard Time (UT+4h)  she@DPX200
##.OBSERVE FREQUENCY= 200.1305
##.OBSERVE NUCLEUS= ^1H
##.DELAY= (6, 6)
##.ACQUISITION MODE= SIMULTANEOUS
##.ACQUISITION SCHEME= undefined
##.AVERAGES= 8
##.DIGITISER RES= 18
##SPECTROMETER/DATA SYSTEM= spect
##.PULSE SEQUENCE= zg30
##.SOLVENT NAME= D2O
##.SHIFT REFERENCE= (INTERNAL, D2O, 0, 15.7039)
##AUDIT TRAIL= $$ (NUMBER, WHEN, WHO, WHERE, WHAT)
$$ ##TITLE= Audit trail, XWIN-NMR		Version 3.5
$$ ##JCAMPDX= 5.01
$$ ##ORIGIN= Bruker BioSpin GmbH
$$ ##OWNER= she
$$ F:/spectra/data/she/nmr/H-F/1/audita.txt
$$ ##AUDIT TRAIL=  $$ (NUMBER, WHEN, WHO, WHERE, WHAT)
(   1,<2023-11-02 17:47:15.50 +0400>,<she>,<DPX200>,
      <created by zg, POWCHK disabled, PULCHK disabled
       configuration hash MD5:
       00 E9 B6 7A A2 85 ED C7 34 08 36 98 17 FE 4E 26
       data hash MD5: 16K
       33 93 0B 6D 21 91 BF 8D 82 83 A6 54 3D 5A 0B 4A>)
$$ ##END=
$$ 
$$ hash MD5
$$ F9 B7 72 72 6E 9B B6 66 E0 A1 64 C7 7C D7 74 EC
##$RELAX= 
##$RELAX= 
##$RELAX= 
##$RELAX= 
##$RELAX= 
##$RELAX= 
$$ Bruker specific parameters
$$ --------------------------
##$DU= <F:/spectra>
##$EXPNO= 1
##$NAME= <H-F>
##$PROCNO= 1
##$TYPE= <nmr>
##$USER= <she>
##$AMP= (0..31)
100 100 100 100 100 100 100 100 100 100 100 100 100 100 100 100 100 100 
100 100 100 100 100 100 100 100 100 100 100 100 100 100 
##$AQSEQ= 0
##$AQ_mod= 1
##$AUNM= <au_zg>
##$AUTOPOS= <>
##$BF1= 200.13
##$BF2= 200.13
##$BF3= 200.13
##$BF4= 200.13
##$BF5= 200.13
##$BF6= 200.13
##$BF7= 200.13
##$BF8= 200.13
##$BYTORDA= 1
##$CFDGTYP= 0
##$CFRGTYP= 5
##$CHEMSTR= <none>
##$CNST= (0..31)
1 1 145 1 1 1 1 1 1 1 1 1 1 1 1 1 1 1 1 1 1 1 1 1 1 1 1 1 1 1 1 1 
##$CPDPRG= <>
##$CPDPRG1= <>
##$CPDPRG2= <>
##$CPDPRG3= <>
##$CPDPRG4= <mlev>
##$CPDPRG5= <mlev>
##$CPDPRG6= <mlev>
##$CPDPRG7= <mlev>
##$CPDPRG8= <mlev>
##$CPDPRGB= <>
##$CPDPRGT= <>
##$D= (0..31)
0 1.2 0 0 0 0 0 0 0 0.06 0 0.03 0 0 0 0 0.0002 0 0 0 0 0 0 0 0 0 0 0 0 
0 0 0 
##$DATE= 1698932835
##$DBL= (0..7)
120 120 120 120 120 120 120 120 
##$DBP= (0..7)
150 150 150 150 150 150 150 150 
##$DBP07= 0
##$DBPNAM0= <>
##$DBPNAM1= <>
##$DBPNAM2= <>
##$DBPNAM3= <>
##$DBPNAM4= <>
##$DBPNAM5= <>
##$DBPNAM6= <>
##$DBPNAM7= <>
##$DBPOAL= (0..7)
0.5 0.5 0.5 0.5 0.5 0.5 0.5 0.5 
##$DBPOFFS= (0..7)
0 0 0 0 0 0 0 0 
##$DE= 6
##$DECBNUC= <off>
##$DECIM= 32
##$DECNUC= <off>
##$DECSTAT= 4
##$DIGMOD= 1
##$DIGTYP= 9
##$DL= (0..7)
0 120 120 120 120 120 120 120 
##$DP= (0..7)
150 150 150 150 150 150 150 150 
##$DP07= 0
##$DPNAME0= <>
##$DPNAME1= <>
##$DPNAME2= <>
##$DPNAME3= <>
##$DPNAME4= <>
##$DPNAME5= <>
##$DPNAME6= <>
##$DPNAME7= <>
##$DPOAL= (0..7)
0.5 0.5 0.5 0.5 0.5 0.5 0.5 0.5 
##$DPOFFS= (0..7)
0 0 0 0 0 0 0 0 
##$DQDMODE= 0
##$DR= 18
##$DS= 0
##$DSLIST= <SSSSSSSSSSSSSSS>
##$DSPFIRM= 0
$$ [...]
##$SUBNAM2= <"">
##$SUBNAM3= <"">
##$SUBNAM4= <"">
##$SUBNAM5= <"">
##$SUBNAM6= <"">
##$SUBNAM7= <"">
##$SUBNAM8= <"">
##$SUBNAM9= <"">
##$SW= 18.0518050122584
##$SWIBOX= (0..15)
0 0 2 0 0 0 0 0 0 0 0 0 0 0 0 0 
##$SW_h= 3612.71676300578
##$TD= 16384
##$TD0= 1
##$TE= 0
##$TE2= 300
##$TE3= 300
##$TEG= 300
##$TL= (0..7)
0 120 120 120 120 120 120 120 
##$TP= (0..7)
150 150 150 150 150 150 150 150 
##$TP07= 0
##$TPNAME0= <>
##$TPNAME1= <>
##$TPNAME2= <>
##$TPNAME3= <>
##$TPNAME4= <>
##$TPNAME5= <>
##$TPNAME6= <>
##$TPNAME7= <>
##$TPOAL= (0..7)
0.5 0.5 0.5 0.5 0.5 0.5 0.5 0.5 
##$TPOFFS= (0..7)
0 0 0 0 0 0 0 0 
##$TUNHIN= 0
##$TUNHOUT= 0
##$TUNXOUT= 0
##$USERA1= <user>
##$USERA2= <user>
##$USERA3= <user>
##$USERA4= <user>
##$USERA5= <user>
##$V9= 5
##$VALIST= <valist>
##$VCLIST= <CCCCCCCCCCCCCCC>
##$VD= 0
##$VDLIST= <DDDDDDDDDDDDDDD>
##$VPLIST= <PPPPPPPPPPPPPPP>
##$VTLIST= <TTTTTTTTTTTTTTT>
##$WBST= 1024
##$WBSW= 4
##$XGAIN= (0..3)
0 0 0 0 
##$XL= 0
##$YL= 0
##$YMAX_a= 663442
##$YMIN_a= -765049
##$ZGOPTNS= <>
##$ZL1= 120
##$ZL2= 120
##$ZL3= 120
##$ZL4= 120
##$ABSF1= 10
##$ABSF2= 0
##$ABSG= 5
##$ABSL= 3
##$ALPHA= 0
##$AQORDER= 0
##$ASSFAC= 0
##$ASSFACI= 0
##$ASSFACX= 0
##$ASSWID= 0
##$AUNMP= <proc_1d>
##$AZFE= 0.1
##$AZFW= 0.1
##$BCFW= 1
##$BC_mod= 2
##$BYTORDP= 1
##$COROFFS= 0
##$CY= 11.3945322036743
##$DATMOD= 1
##$DC= 2
##$DFILT= <>
##$DTYPP= 0
##$F1P= 15.7292609196834
##$F2P= 12.9074282941183
##$FCOR= 0.5
##$FTSIZE= 0
##$FT_mod= 4
##$GAMMA= 1
##$GB= 0.15
##$INTBC= 1
##$INTSCL= 1
##$ISEN= 128
##$LB= 0.24
##$LEV0= 0
##$LPBIN= 0
##$MAXI= 10000
##$MC2= 0
##$MEAN= 0
##$ME_mod= 0
##$MI= 1.114404
##$NCOEF= 0
##$NC_proc= 0
##$NLEV= 6
##$NOISF1= 3.799351
##$NOISF2= 2.8
##$NSP= 1
##$NTH_PI= 0
##$NZP= 0
##$OFFSET= 15.70392
##$PC= 1
##$PHC0= -23880.82
##$PHC1= 12.85269
##$PH_mod= 1
##$PKNL= yes
##$PPARMOD= 0
##$PSCAL= 0
##$PSIGN= 0
##$REVERSE= no
##$SF= 200.130013532006
##$SI= 16384
##$SIGF1= 3
##$SIGF2= 2
##$SINO= 400
##$SIOLD= 16384
##$SREGLST= <1H.CDCl3>
##$SSB= 0
##$STSI= 0
##$STSR= 0
##$SW_p= 3612.71676300578
##$SYMM= 0
##$S_DEV= 0
##$TDeff= 0
##$TDoff= 0
##$TI= <>
##$TILT= no
##$TM1= 0
##$TM2= 0
##$TOPLEV= 0
##$USERP1= <user>
##$USERP2= <user>
##$USERP3= <user>
##$USERP4= <user>
##$USERP5= <user>
##$WDW= 1
##$XDIM= 8192
##$YMAX_p= 0
##$YMIN_p= 0
$$ End of Bruker specific parameters
$$ ---------------------------------
##NTUPLES= NMR FID
##VAR_NAME=  TIME,          FID/REAL,        FID/IMAG
##SYMBOL=    X,             R,               I
##VAR_TYPE=  INDEPENDENT,   DEPENDENT,       DEPENDENT
##VAR_FORM=  AFFN,          ASDF,            ASDF
##VAR_DIM=   8192,          8192,            8192
##UNITS=     SECONDS,       ARBITRARY UNITS, ARBITRARY UNITS
##FACTOR=    0.0002768,     1,               1
##FIRST=     0,             0,               0
##LAST=      2.2672688,     0,               0
##MIN=       0,             -765049,         0
##MAX=       2.2672688,     663442,          0
$$ Real data points
##PAGE= N=1
##DATA TABLE= (X++(R..R)), XYDATA
0@%%%%%%%%%%%%Qj6J6j6J6k4L2m0N6o4P2q8J00j16J36j53J80k11K39k75L13l54
$$ 0 0 0 0 0 0 0 0 0 0 0 0 0 8 -8 8 -8 8 -16 16 -24 32 -32 40 -48 52 -64 72 -81 99 -112 127 -148 165 -189
34a89M02m50N06n70O38p15P96q85R87j094J212j340J477j633J799j980K184k403
$$ -189 213 -237 269 -301 337 -378 418 -467 520 -574 638 -702 775 -858 941 -1039 1145 -1258
52a258K648k923L225l566L951m389M895n481O179p022Q057r379J1124j3547J7177
$$ -1258 1390 -1533 1692 -1874 2077 -2312 2583 -2898 3281 -3741 4316 -5063 6061 -7486 9691
67I691k3265L5950j08829L02026M47869l7298l72063n64939l55508K0687M07174
$$ 9691 -13574 22376 -86453 215573 663442 626144 254081 -310858 -666366 -645679 -238505
78b38505N16873L43171o2518l99344n06235k95237Q0711M17897M84934K71875
$$ -238505 278368 621539 559021 159677 -346558 -641795 -561084 -143187 341747 613622
88F13622j10585m15681m72632k34070J34195M26393M57197K16094j52510m18167
$$ 613622 503037 87356 -385276 -619346 -485151 -58758 398439 614533 462023 43856
98D3856m37386j89728J65231M13247M09963J65734j77381m05374l86073j37621
$$ 43856 -393530 -583258 -418027 -4780 405183 570917 393536 -11838 -397911 -535532
108e35532J88804L98728L61792J08501k05300l93595l43224q2688K20364L88811
$$ -535532 -346728 52000 413792 522293 316993 -76602 -419826 -502514 -282150 106661
118A06661L23654O1564k33309l82211l03515m3793K40678L75558K83848K7924
$$ 106661 430315 491879 258570 -123641 -427156 -470949 -230271 145287 429135 457059
128D57059k43855l65888k64053r242K46830L52742K42837j1819k53347l41509
$$ 457059 213204 -152684 -416737 -425979 -179149 173593 416430 404611 151264 -190245
138a90245k22443L0826K60647L28612K01158m8729k66590l19382j81881O2240
$$ -190245 -412688 -381862 -121215 207397 408555 359826 93236 -226146 -408027 -345787
148c45787K68221L09596J64645p4531k67915k98769j48497Q7634K67132K86329
$$ -345787 -77566 232030 396675 322144 54229 -244540 -393037 -305403 -38271 248058
158B48058J32845r9832k66238k71719j14317J11656K65853K57444R5974j21528
$$ 248058 380903 281071 14833 -256886 -371203 -259547 6306 263750 359724 238196
168B38196k64424k44439p8664J30960K61382K33285O3905j40071k57555k21341
$$ 238196 -26228 -270667 -349331 -218371 43011 276296 340201 200130 -57425 -278766
178b78766n0469J48133K53848K08036L7511j55385k50598j93856k3523J60704
$$ -278766 -329235 -181102 72746 280782 318293 162908 -87690 -281546 -305069 -144365
188a44365K45564J80369R660j64775k39388j68262L078J69053K32705J57091j3800
$$ -144365 101199 281568 291228 126453 -112935 -281197 -278119 -109066 123639 280730 266930
199B66930j72953k26420j44946K4237J77460K20139J31752l4197j79891k14763
$$ 266930 93977 -132443 -277389 -253152 -75692 144447 276199 242002 62111 -152652
209a52652j18852M4618J80815K07190J07199n4899j81777j99455r7505O2672J82416
$$ -152652 -271504 -226886 -46071 161119 268318 213419 31642 -167813 -265318 -202646 -20230
220b0230J91491Q6892p0856j82975j84160p5915P7515J83361J77087O4231q4305
$$ -20230 171261 258153 187297 4322 -179838 -255753 -178238 5123 182210 246441 162136
231A62136j82115j68081n3175R2184J80376J60582M2875r8356j77832j51697l3449
$$ 162136 -19979 -188060 -241235 -149051 31325 191907 234782 136426 -41406 -193103 -226552
242b26552J03893J77297J43197K4890j08406j75651j35521j5713J12539J72284
$$ -226552 -122659 54638 197835 222725 114319 -61332 -196853 -212566 -100027 72257
252G2257J26970N872j17215j68864j18956K920J20641J63954J09747j0703j23579
$$ 72257 199227 205099 87884 -80980 -199936 -197016 -76375 87579 197326 186623 63044
263F3044j60464j00555J8104J26544J57072R2645k5990j28054j52814q4300L4119
$$ 63044 -97420 -197975 -179871 -53327 103745 196390 170400 42346 -110468 -194768 -160649
274a60649J30046J48565P6588m0457j31774j42734o7976M6909J32426J36348O0034
$$ -160649 -30603 117962 194550 154093 22319 -120415 -188391 -141482 -9056 127292 187326
285A87326n2916j32882j31906n1849N7734J32409J26373M3749o4128j31710j21171
$$ 187326 134410 1528 -130378 -182227 -124493 7916 134289 178038 113910 -17800 -138971
296a38971l6546O9019J31277J14873K9108p3886j30377j08266k1721P7771J29087
$$ -138971 -175517 -106498 24779 139652 168760 94874 -35503 -143769 -165490 -87719 41368
307D1368J02157J4778q0401j27368r5801p514Q4057J24669R0700J327q7386j22634
$$ 41368 143525 158303 77902 -49466 -145267 -152781 -68724 55945 146645 147972 60586 -62048
319f2048q4196M503R0223J19743P7321j0367r2417j16591p1314J6329R3363J13725
$$ -62048 -146244 -141741 -51518 68225 145546 135179 42762 -73829 -145143 -128814 -35451 78274
331G8274O4720k1772r4663j10853n9301K7284R5680J06744N4254l1733r6785j03090
$$ 78274 142994 121222 26559 -84294 -143595 -116311 -20631 86113 140367 108634 11849 -91241
343i1241m6976L6066R7767R9621M0640m0721r7720r5271l4861M4934R7033R1286
$$ -91241 -138217 -102151 -4384 95237 135877 95156 -2564 -97835 -132696 -87762 9271 100557
355A00557K9940m8640r6635q6358k4815N2015R6486Q2266J9153n4877r5893p7876
$$ 100557 130497 81857 -14778 -101136 -125951 -73936 22550 104816 123969 69092 -26801 -104677
367a04677j4003N7695R4489P3834Q263o0234r2464o9622l312O2646R0567O3989
$$ -104677 -118680 -60985 33504 107338 115601 55367 -37097 -106719 -110031 -47385 43182 107171
379A07171l03o5173q9508n9687M391O6758Q7562N5466r061o8060q5529n1052J3529
$$ 107171 106868 41695 -47813 -107500 -103109 -36351 51211 106677 97616 29556 -55973 -107025 -93496
392i3496O9029Q2699M6775j7554p0443p9798m1803K1050P0910P7264L7691k4253
$$ -93496 -24467 58232 105007 87453 17010 -62788 -104591 -83541 -12631 64633 102324 78071
404G8071p1677p4590l3196K7969P2195P2455K8751l1117p2025o9444k5129L4438
$$ 78071 6394 -68196 -101392 -73423 -1228 71227 99978 68861 -3164 -72608 -97737 -63299
416f3299P1568O6468K1216l7138p1285o2801j6870L8600P0935N9551J2620m0803
$$ -63299 8269 74737 95953 58815 -12470 -75271 -92141 -53541 17394 76945 89565 48762
428D8762p0625n6473r123M3295O9592N4222M853m5867o8316n0549j499M7481O7444
$$ 48762 -21863 -78336 -87459 -44164 25428 79650 84503 38636 -29680 -80229 -81728 -34247 33197
441C3197M6818j041m9133o6410m3131M873M9937O4645M0064q226n1148o2878l6889
$$ 33197 80015 78974 29841 -36569 -79700 -74827 -24890 39755 79819 71593 20445 -42433 -79322
454g9322J0914N1977O1097L3672j3981n3326n9445l0433J6669N3663N7346K7098
$$ -79322 -68408 -16431 44666 78338 64357 11031 -48414 -78847 -62178 -8515 48831 75929
466G5929j9556n3743n5158k3711K2124N3921N3552K0551k4323n3490n1270j7504
$$ 75929 56373 2630 -52528 -76239 -54115 -194 53358 73909 49586 -3904 -55174 -72678
478g2678K6737N4809M8950J4815k8422n4160m6868j1789K9848N3365M4489Q847
$$ -72678 -45941 8868 57818 72633 44211 -9949 -56817 -68606 -38758 14607 59096 67943
490F7943l1496n2642m1899o044L3102N0893L9060K898l5040n1182l6495m71L6702
$$ 67943 36447 -16195 -58094 -64138 -31036 19857 58917 61815 26775 -24407 -60902 -61373 -24671
503b4671N0753L4711k402l7642n0014l2059M631L8426M9352L0082o121l8268m7236
$$ -24671 26082 60793 58391 20749 -29265 -61324 -56693 -18267 31085 61167 55046 16778 -30458
516c0458k7505Q475L8774M5553K4609j0753l9462m3862k1573J3555M0305M2274
$$ -30458 -57963 -49488 -10714 34839 59448 48695 9233 -34629 -56202 -42647 -2342 39932
528C9932J8513j6181m1764m1912j7024J7756M1401M0600J5069j9083m1441l9163
$$ 39932 58445 42264 500 -41412 -58436 -40680 721 41321 56390 37307 -4134 -43297
540d3297j3798J9938M0529L7029J1045k0909l9987l4253p865K2193L9780L1905
$$ -43297 -57095 -37157 3372 40401 51446 30537 -9450 -43703 -51568 -29375 10405 42310
552D2310N050k4481l9422l0157k404K6397L9855K9123J383k7608l9525k8000J05
$$ 42310 47360 22879 -16543 -46700 -49104 -22707 17148 46271 47654 20046 -19479 -47479 -47374
565d7374K8007L8821K6962j191k7473l7080k4421L550K7871L5764K2185n412k9021
$$ -47374 -19367 19454 46416 45225 17752 -19328 -43749 -40199 -12328 23436 45621 40209 11188
578A1188l4071j9050P568L0123L3875J6856r933l0858l4104j6135J1174L1529
$$ 11188 -22883 -41933 -34365 -4242 29633 46489 36556 5698 -28406 -44541 -33367 -1838
590a838L2848J4902j2267l1884l1969j3940J2615L0428L0088J1598j4054l0025
$$ -1838 31010 45912 33645 1761 -30208 -44148 -31533 -1105 28983 40581 26527 -3498
602c498k8202q825J5032K9992K6275O849j6967l0195k5078m850J8795L0674K4670
$$ -3498 -31700 -40525 -25493 4499 30774 37623 20656 -9539 -34617 -39467 -20672 10002 34672
615C4672L965j9772l0382k3899k510J9892L0414K2591J626j9844k9057k0962M3
$$ 34672 38637 18865 -11517 -35416 -37926 -18034 12380 34971 36597 16753 -12304 -33266 -33223
628c3223K0227K7979J8748k061k1126k7241j6889L618K2189K6965J5612n503k2904
$$ -33223 -12996 14983 33731 31670 10544 -16697 -33586 -29968 -7779 19186 34798 29295 6391
641F391k6738j4621N999K3554K6083J3719p056k3713k4938j2699Q161K3098K4211
$$ 6391 -20347 -34968 -28969 -5415 20668 34387 27331 3618 -21320 -34019 -25858 -2760 21451
654B1451J0951r079k3025k2944r169J0199K3260K1952P609j1400k3328k1219o472
$$ 21451 32402 23323 298 -22646 -31815 -21616 1644 23596 31205 19805 -3523 -24742 -31214
667c1214J3069K3423K0476N141j3239k3846j9534l758J3830K2970J8378K918j4330
$$ -31214 -18145 5278 25754 30895 17656 -6190 -25724 -29482 -15652 7318 25696 28614 14284
680A4284k2969j7157j541J4744K2563J5939K58j5756k1864j4815P08J6463K1700
$$ 14284 -8685 -25842 -27383 -12639 9924 25863 26121 10365 -11499 -26314 -25606 -9143 12557
693A2557J3847k007j6517k1361j2812L111J7143K0557J2092m034j7150k0256j0705
$$ 12557 26404 24397 7880 -13481 -26293 -23182 -6039 14518 26610 22576 5426 -14830 -25535
706b5535N253J7392J9244R402n729j7696j8623r075P241J7313J8261P398p506
$$ -25535 -20282 -2890 16354 25756 20027 2331 -16292 -25367 -18126 -813 17448 24846 17340
719A7340j8299j7220o582Q445J7741J6729N222q690j7829j5777m177R486J7501
$$ 17340 -959 -18179 -24761 -16316 1425 18154 23376 14686 -3143 -18920 -23097 -13611 3890
732C890J5066L292j0031j7274j4459k254J0634J7118J3802J630j1321j7098j2918
$$ 3890 18956 22248 12217 -5057 -19516 -21770 -11136 5982 19784 21414 10093 -7005 -19923
745a9923p39J1836J6666J1927n3j1734j6730j1309J406J1887J6425J0269j730
$$ -19923 -20662 -8826 7840 19767 19714 7980 -8750 -20059 -18653 -6766 9659 19928 18198
758A8198j2691j5679r347K522J2979J5320Q702l362j3192j4951p626L882J3236
$$ 18198 5507 -10172 -19519 -16997 -4018 11302 20004 16642 3450 -11501 -19127 -15245 -2009
771b009J4414P229n076j3387j3763o288N181J3619J3044N444o209j3234j3039
$$ -2009 12405 19634 14558 1171 -12592 -18880 -13699 -80 12964 18408 12199 -1035 -14074
784a4074m711O575J3677J2169L888o802j3334j1707l190P488J3269J0823K655
$$ -14074 -18785 -12210 1467 13636 17524 10722 -2612 -14319 -17509 -10021 3248 14071 16726
797A6726p833j2802j0938j228Q238J2857J0341Q94q836j2796r543l69R144J2426
$$ 16726 8893 -3909 -14847 -16075 -7837 5020 15361 16255 7419 -5377 -14920 -15289 -6145 6281
811F281Q783k98q868j2605q125O85R149J2319P418j464r591j1529o839K097R667
$$ 6281 15064 14766 5898 -6707 -14832 -14147 -4998 7321 14739 13275 3684 -7845 -14684 -12587 -2920
826b920J1354O318k782r966j0812n996L799R926J0921M979l606j0013j0782m214
$$ -2920 8434 14752 11970 2004 -8808 -14804 -11005 -1079 9842 14821 11215 1202 -9580 -13794
840a3794L597J0218J0218M079m761j0229r566l325M971R830R554K108n462r674
$$ -13794 -10197 21 10239 14318 9557 -672 -10238 -13563 -8592 1238 10792 12900 7438 -2236
854b236q828k017N547J0179Q203J705o354r949p764j346O678R816P696L56o635
$$ -2236 -11064 -13081 -7534 2645 10848 12553 6199 -3750 -11514 -12860 -6182 3634 11330 11686 5051
869E051r313p150L6O663R459O550n79o510r382n940R10P177R295N410j638p286
$$ 5051 -4262 -11412 -11376 -4713 4746 11296 10717 4207 -5175 -11115 -10205 -3028 6267 11677 10039 2753
885B753q794m820J818P246Q698M571k032p836q365m299K453Q200P467L755l031
$$ 2753 -6041 -10861 -9043 -1797 6901 11472 9440 1604 -6761 -11060 -8607 -407 7060 10815 7784
900G784p402q071l185L279P581P399K895l426q159p257k249L789P718P131J774
$$ 7784 382 -7689 -10874 -7595 -14 7385 10280 6854 -1305 -8562 -10811 -7022 696 7827 9601
915I601m085p698o720j447M490P481O450J423m934p375o058k05M808P541N395
$$ 9601 5516 -2182 -8902 -10349 -5859 1622 8072 9495 4561 -2814 -8872 -9077 -4269 3272 8667
930H667M99n235p021n238J06N183P269N041j40n658p426m014M93N657O725M326
$$ 8667 9166 3931 -3090 -8328 -8222 -3039 4230 9271 9131 3473 -3953 -7967 -7474 -1817 4908 9234
946I234j291n762o654l638J441N435O572L215j638n723o855k861K139N608O403
$$ 9234 7943 2181 -4473 -8111 -6670 -1235 5337 8552 6914 1191 -5664 -8525 -6386 -778 5625
961E625K607k167o233o099j868K396N642N828J856k721n956n333j670L098N588
$$ 5625 8232 6065 -168 -6267 -8135 -5739 -97 5731 7587 4866 -1090 -6423 -8093 -4995 593
976E93N347J455l441n835m968q96L473N533M982M75l372n671m320l02L763N527
$$ 593 5940 7395 3954 -1881 -6849 -7745 -4272 1261 6243 6718 3346 -2325 -6645 -6947 -3184 2343
992B343M079J15m008n142m128L67M082N647L549k34m439n251l331N88M327N211
$$ 2343 6422 6537 2529 -2613 -6741 -6374 -2292 3355 6904 6670 2231 -3020 -6351 -5763 -1436 3775
1008C775L140n06m536n065k711Q84M270M657K350j129m521m860k004J598M564
$$ 3775 6915 6409 1873 -3192 -5903 -5019 -749 3908 6258 5129 608 -4252 -6256 -4658 -94
1023i4M571J669k166m658m421j635K220M612M532J752k519l970m344j391K151
$$ -94 4477 6146 3980 -678 -5099 -6734 -4514 98 4630 6382 3863 -107 -4451 -5842 -3691
1038c691M212M042J117k313m274l485n41K477M370L104N31k971m199l438m4L017
$$ -3691 521 4563 5680 3367 -907 -4392 -4933 -2456 1914 5018 5549 2578 -1621 -5059 -5103 -2086
1054b086M387L130R2l173m558l100q2K903M269L039j36l132l890k522J69L180
$$ -2086 2301 5431 5523 2350 -2208 -5308 -5390 -2487 1782 4821 4685 1553 -2337 -4859 -4690 -1510
1070a510L757K288p99l264l632j637J049L233L861J794j219l757l723k016J518
$$ -1510 2247 4535 3736 472 -3160 -4797 -3748 -515 3346 5140 3921 164 -3559 -5575 -4057
1085d057L661L903J862j378l515l743j521J364L520L183J325j654l024l334n70
$$ -4057 -396 3507 5369 3991 476 -3267 -4788 -3424 96 3279 4604 2950 -74 -3408 -3978
1100c978J473L321K986L89j858l581k994r6J993L856K678N82k499l540k855j19
$$ -3978 -2505 816 3802 4191 2333 -1248 -4242 -4338 -2345 1511 4189 4771 2272 -1268 -4123 -4242
1116d242K145L271K403J82j891l313k342M6K360K701K009j36k470l050j674O42
$$ -4242 -2097 1174 3577 3759 1868 -1445 -3787 -3741 -1381 1320 3329 3193 723 -2327 -4001 -3359
1132c359K490L099J657n87k732l177j833R55K894K956J619o83k785k561j681P92
$$ -3359 -869 2230 3887 3300 568 -2609 -4442 -3487 -593 2363 3982 3299 514 -2047 -3728 -2936
1148b936K759K761R35p05k602k475r48J137K791K302N46j287k608k382o94J472
$$ -2936 -177 2584 3519 2814 212 -2263 -3211 -2074 717 3019 3565 2278 -330 -2712 -3406 -1934
1164a934K840K062O75j699k863k288l55J405K649K253L43j367k985j814j61J811
$$ -1934 906 2968 3643 1944 -919 -3207 -3562 -2157 492 2745 3088 1721 -1264 -3078 -3239 -1428
1180a428K507J862l19j535k329j845N02J573K509J615k36k034j858j718l3J919
$$ -1428 1079 2941 2622 1087 -1242 -3087 -2585 -1012 1497 3112 2876 842 -1016 -2734 -2767 -848
1196h48K518J398l40k294k202j468R59J799K022J140o67k059k259p53P67K270
$$ -848 1670 3068 2728 434 -1768 -3236 -2277 -478 1544 2684 2017 -42 -2301 -3054 -2287 -17
1212a7J829P65p81k206j609r01O88K446J763P80j188j783j724m77J122K101J684
$$ -17 1812 2577 1796 -410 -2019 -2920 -2232 214 1977 2757 1569 -214 -1938 -2415 -1293 808 2492
1229B492L57j285j907j497m19J287K041J462K0j329k042j675P6J442J847J510
$$ 2492 2849 1564 -343 -1840 -2259 -972 1069 2531 2551 1222 -820 -2495 -2419 -977 870 2380
1245B380j00j574j951j300J5J656J434J509l8j693j529j219L08J676J723J046
$$ 2380 2280 706 -1245 -2545 -2530 -874 560 2069 2031 338 -1191 -2410 -2102 -426 1297 2343
1261B343l99j452j789p25M06J387J998L53j47j597k047n67Q55J351J771M80n97
$$ 2343 1944 492 -1297 -2022 -1616 -229 1769 2122 1975 378 -1669 -2236 -1381 -30 1741 2221 1624
1278A624j605j742m15O71J517J360P01r12j354j490k73P94J527J101M50j079j394
$$ 1624 19 -1723 -2138 -1467 50 1410 2111 1199 -155 -1645 -1918 -1124 403 1504 1954 875 -519
1295e19j382j13J104J493J182J16r18j868j198M63Q54J711Q78J11j009j590j105
$$ -519 -1901 -2014 -910 583 1765 1881 963 -905 -2103 -1640 -786 925 1803 1914 905 -685 -1790
1312a790J28J078J275J353o68r62j283p96L46J163J352M41l75j179j154q67M30
$$ -1790 -1662 -584 691 2044 1376 414 -869 -1665 -1319 -156 1196 1637 1262 83 -1071 -1938 -1508
1329a508J374J449M61l64j043j344o42M39Q11J454O18o49j245r67l22O01J004
$$ -1508 -134 1315 1776 1412 369 -975 -1617 -1178 -367 1087 1705 1056 -189 -1156 -1478 -877 127
1346A27J042L89o97j090r13l15Q22J094R46K87o46j724o68l61Q49J393O95L83
$$ 127 1169 1558 861 -229 -1142 -1457 -635 459 1405 1692 1046 -678 -1346 -1707 -858 535 1230 1613
1364A613r83r59j212J67N32R86R50K85q79j205p99M60P95R66M37m9q78j118n79
$$ 1613 630 -329 -1541 -1374 -842 144 1094 1379 500 -705 -1504 -1044 -249 717 1154 1105 227 -891 -1470
1383a470O1J077J031P76l22q65j089p81L65R31J178N60n30n89j164L7l5P61J236
$$ -1470 -1409 -332 699 1475 1153 288 -801 -1582 -1217 -286 892 1452 922 333 -831 -794 -829 -68 1168
1402A168J75l47r77q81j95N22J072R14M7m82j037j045m2N97O62Q58L03o47q33
$$ 1168 1343 996 19 -862 -1057 -535 537 1451 1498 1016 -21 -1066 -1108 -511 151 1009 1312 665 -168
1421a68q22j27N76P87P01j88m85o67o58K3M63P47P84o9o85j019o66L82J52J246
$$ -168 -990 -1117 -541 246 947 759 274 -393 -1051 -1028 -565 182 966 897 212 -807 -1473 -1091 -939 307
1441C07L85j75o11p56n15O6J086P75J76nr15m97m19J56P12Q99L15j54q03m77l98
$$ 307 692 517 -94 -850 -1365 -1299 -213 562 738 733 -182 -679 -1098 -942 -230 669 984 830 27 -450 -848
1462h48K81Q28O43L46m26o13o36l45O06O32L59L66o01n01o13k42N67O10L83L59
$$ -848 -567 261 904 1250 824 211 -425 -770 -164 468 827 1193 592 91 -522 -764 -197 413 796 1155
1482A155n56q82k30m28O18O41O22j22m37n27o68l01P45O09L70R7l99q72m41j0
$$ 1155 599 -283 -513 -941 -323 318 940 818 381 -146 -814 -1115 -370 239 609 706 307 -565 -1006 -1016
1502a016Q77K98M68j58m22l50n96K37K82R21K72l70n61o44j40L23N26O53J89k90
$$ -1016 -139 159 627 469 47 -303 -899 -662 -380 541 813 443 -118 -762 -902 -579 -53 600 789 499
1522D99o11l66j85R9O50M00O11m81o22l62k42K66M88M93ol07m15n18N5L25M21
$$ 499 -112 -478 -663 -564 86 486 1097 616 -6 -368 -610 -344 144 637 631 324 -91 -609 -554 -229 192
1543A92N60K64p46p65L4l21K67P58N25m40j12m12p23J15N99N28L32j42l27m38
$$ 192 752 1016 270 -495 -461 -782 -515 243 768 328 216 -196 -919 -804 -205 323 655 513 186 -252
1563b52k59K0J94N53J63p3k35n22J06m1N30M65J40m2q82l82o8k0N91N50M27m21
$$ -252 -511 -491 -297 256 419 346 111 -411 -305 -346 184 649 789 747 -135 -517 -585 -605 -14 536 963 542
1585E42l95m05j67p1O31L69j18k74k68m33j85M15L05K73M00m15l99o43J64L40
$$ 542 147 -258 -425 -496 135 504 386 112 -156 -589 -774 -359 -54 219 619 204 -195 -838 -674 -334
1605c34M18N03j08k03n16k34m1J28N75M20R1n55p2m12J95J55L85J32o8l81l57
$$ -334 84 587 479 276 -240 -474 -515 -387 188 608 699 144 72 -340 -145 10 395 527 459 78 -279
1626b79k28L6M78J69K34j5j79n21m9k29O24p4K13J93m54m63q2K1L44N03J72k44
$$ -279 -507 -471 7 176 410 395 216 -305 -354 -583 41 -33 180 373 -81 -544 -626 -605 -261 242 414 170
1648A70k98k99M5K67J49M19N5k9m40m92j23L42K81J92J11J9k88n95J78k09N74
$$ 170 -128 -427 -382 -115 34 453 508 479 39 -453 -576 -234 47 239 350 369 81 -514 -336 -545 29
1669B9M72j7l23j06m21MJ34L06J38K89m61l62j04j6L34K34Q2J25j79n83J96k33
$$ 29 501 484 161 55 -366 -362 -228 78 216 505 44 -318 -422 -438 -104 130 212 337 158 -425 -229 -462
1691d62J49P32Jj95k42k27oq8M08J40K34k36Mp18J47M7K98M83j02P0m09l54j6
$$ -462 -313 419 420 225 -17 -244 -250 -338 70 210 444 208 212 -506 -359 -312 -14 469 367 437 28 -326 -342
1714c42J25L28N7R0q2l79j07j88L75L64J11j83J48o86J9n8K16K70K99j3l79k42
$$ -342 -217 111 168 258 176 -203 -310 -498 -123 241 352 169 317 -369 -350 -408 -192 78 377 364 -15 -257
1736b57M6n8j34P34j74K22m36N0j93k07J35L78J41M2l41j40j1J87N7L35j1j62
$$ -257 -211 -269 -403 331 157 379 -57 -7 -200 -407 -272 106 247 289 -52 -192 -203 -16 41 376 365 203
1758B03p5n30J60k14M89K05Q7j25l05m2j32N1O3J16M53m31j50r8J07j56J21N34
$$ 203 128 -402 -242 -456 33 238 325 200 -105 -147 -279 -228 -165 -49 404 -27 -177 -275 -168 -324 -203 331
1780C31k14K09k68l42L09M7q4K77m3k28l31J72l38K26N02K41l02K01l37j15l44
$$ 331 117 326 58 -284 25 72 -12 265 222 -6 -337 -165 -503 -277 225 466 164 365 28 -87 -431
1801d31K99L43j40J65M6k58q1K0j71J34K28k3l41q5m1L15K27J78k70L12m05j94
$$ -431 -132 211 71 236 282 24 -57 -37 -208 -74 154 131 -210 -295 -336 -21 206 384 114 426 21 -173
1823a73k13m5N07l09O32j35j92k27k83R4K10M12k02l9l7lj35J09O4J14K07n69
$$ -173 -386 -431 76 -233 399 264 72 -155 -438 -344 -134 278 76 37 0 -3 -138 -29 35 149 356 -213
1845b13m2m5N5K77K01J11j39L7l27j96j13k5Q14k51J08k77J56j05j4j50J46K5
$$ -213 -255 -300 -245 32 233 344 205 242 -85 -281 -394 -419 395 144 252 -25 131 26 12 -138 8 33
1867C3J44J32m68kK17q5J42K25j46M7l88M4j40J36K65mJ62p0j55l05K8LM2L82
$$ 33 177 309 -159 -161 56 -29 113 338 192 239 -149 -105 -245 -109 156 152 314 244 89 -216 -188 -185 -143 239
1891B39k76o2J70o58O13J36L6Om26J53n85J25L60lM57k15j05k15l4J42NL6j31
$$ 239 -37 -99 71 -587 26 162 198 204 -222 -69 -654 -529 -169 -172 285 70 -35 -250 -284 -142 -137 -101 -232
1914b32J51L51l38k17K68l5J05k03J80O5Mn30L20m2N23j82R2j26k2j16k7j26M53
$$ -232 -81 270 -68 -285 -17 -52 53 -150 30 95 99 -431 -111 -153 370 188 280 154 132 16 -11 -137 316
1937C16K48l62p0k57J75j13K75k64L39j11j12j47J47N8j51K87k52j6J37m04J89
$$ 316 564 202 132 -125 50 -63 212 -52 287 176 64 -83 64 122 -29 258 6 -10 127 -277 -88
1958h8P4K5K84k57k71O1K0k28J31O9J75p3Jp4J02m5q7R4K29k66K53k77k26K18
$$ -88 -14 11 295 38 -233 -172 -152 -380 -249 -180 -5 -78 -77 -151 -49 -94 -181 -87 142 -124 129 -148 -374 -156
1982a56J27J56p4Kk08J19j86K04j24j28N04l13K7k13K12O0P5l0J86o5k78L20m22
$$ -156 -29 127 53 55 -153 -34 -220 -16 -140 -268 236 -77 -50 -263 -51 9 84 54 240 175 -103 217 -205
2005b05M22j45M5o5J05m8mj52j6K79l06L04j97J50k82j26L3J49J07J31J31m71
$$ -205 217 72 117 52 157 109 105 -47 -63 216 -90 214 17 167 -115 -241 -208 -59 48 179 310 -161
2027a61J70L0r3J57j2r6j03K39k57j13P9L38j58J6K99n91R8J13p1J29J93l46J44
$$ -161 9 39 -54 103 91 -5 -108 131 -126 -239 -160 178 20 36 335 -256 -158 -45 -116 13 206 -140 4
2050Dk16J44J41l04K93j3k0k7N2q3k55J86j49K06Kj57L57k24K3j13L36k79K15
$$ 4 -212 -68 73 -231 62 49 29 2 54 -29 -284 -98 -247 -41 -39 -196 161 -63 -40 -153 183 -96 119
2073A19L7l71R9n4J65M94j96l04K5R8nj20l51N52j19j0j43r5L3L7kk2L30j73j8
$$ 119 156 -215 -116 -170 -5 489 293 -11 14 112 107 -13 -364 188 69 59 -84 -179 -146 -109 -111 -133 197 24 6
2098Fj83J62J2K52j63l4R0j50j97J48R7oK8J29k30L0P1j26M6J0J29j96K72n03
$$ 6 -177 -15 -3 249 86 52 142 -8 -205 -57 40 34 62 191 -39 -9 62 -64 -18 -8 121 -75 197 -306
2122c06K75J10j2m3k55J86L2m2j52J96n8K08J7l62K10l32J55P8P4L88m25J21J57
$$ -306 -31 79 67 24 -231 -45 -13 -55 -207 -11 -69 139 156 -206 4 -328 -173 -95 -21 367 -58 63 220
2145B20q9o8L10o20K37J7J11p6n6j25k10L71P7n9K7n2j07O8j61K56n1k36L45k5
$$ 220 131 63 373 -247 -10 7 118 42 -14 -139 -349 22 99 40 67 15 -92 -24 -185 71 20 -216 129 104
2169A04k45Ol2K49J50k53j7Q2n2m5R0J07M4p8j46L3r2k0J29p8o8J96k52J71P7
$$ 104 -141 -135 -167 82 232 -21 -38 44 -8 -53 37 144 188 110 -36 -3 -95 -115 14 -64 -132 64 -188 -17 60
2194F0j94j4m7M11r6j16k8q6K29l23J03J62O8j35Nj07R4j2J76k81p6J98J29k07
$$ 60 -134 -148 -195 216 120 4 -24 -110 119 -204 -101 61 129 -6 -1 -108 -14 -26 150 -131 -207 -9 120 -87
2218h7O1o2M2L54j50l1k30J67K6O2j65k7P3j61K12k49K60J6k46m8J86l26N01j07
$$ -87 -26 -88 -46 308 158 127 -103 64 90 152 -13 -40 33 -128 84 -165 95 111 -135 -183 3 -323 178 71
2242G1Q9k90K88P3j88j10J62j43K17j05J31j8p4j31l07M19k32M40k67J55m2l3
$$ 71 160 -130 158 231 43 -67 95 -48 169 64 195 177 103 -28 -335 84 -148 292 25 180 138 105
2264A05k07J86Mj07p1pJ16R4j44K5J15PLj21OP3j11j44L22N2k30J22p2J79m58
$$ 105 -102 84 88 -19 -90 -97 19 113 -31 -6 109 116 119 -2 4 77 -34 -178 144 196 -34 88 16 195 -263
2289b63L30J61k52Lp9K77m4l22J3J56j06J78J67j21l5j68J63m0K84k55l28M98
$$ -263 67 228 -24 -21 -100 177 133 -189 -176 -20 -126 52 219 98 63 -105 58 18 302 47 -281 217
2311B17j95j19J66q3pJ4K3k23O9J23j49M07k28m1p5K94j83l4J06n0M3O2j23n9
$$ 217 22 -97 69 -14 -21 -7 16 -207 -138 -15 -164 243 15 -26 -101 193 10 -24 82 32 75 137 14 -45
2335d5qK84l21J0K26r1k18R9j63k1J98J24J03l10K49p5Rk38N3Q9N6k60K99j34
$$ -45 -53 231 -90 -80 146 55 -163 -64 -227 -248 -50 74 177 -133 116 41 50 -188 -135 -46 10 -250 49 -85
2359h5j3K24k55J91P4l53J10L42l58J51R7K8j74J6P4M2k28L56m12M91k41Rm2L0
$$ -85 -98 126 -129 62 136 -217 -107 235 -123 28 125 153 -21 -5 69 111 -117 239 -173 318 77 86 44 74
2383G4l8kl4K86l23K2p6J06J59j65k45L73l8j21K59n36L22j31L39k82L06j34O3
$$ 74 36 34 0 286 -37 -15 -91 15 174 9 -236 137 99 -22 237 -299 23 -108 231 -51 255 121 184
2406A84l10J8O7o9L29j71J33n6l01J30P8o6J49J00j86M7j20K04L15l96k4J3n7
$$ 184 -126 -108 -41 -110 219 48 181 125 -176 -46 32 -34 115 215 29 76 -44 160 475 79 55 68 11
2429A1j12J26k29L39k93J73O9k0J7j27r8K55o9j84K31k5n6NK1J49P9m22J23J12
$$ 11 -101 25 -204 135 -158 15 84 64 81 -46 -144 111 42 -142 89 64 8 13 34 183 262 -160 -37 75
2453G5l5j09j15J17J53J4J16p6k40J34J28k19oK12j85K96l81j0P5n6jn5J83J05
$$ 75 40 -69 -184 -67 86 100 216 140 -100 34 162 -57 -63 149 -36 260 -121 -131 -56 -112 -113 -168 15 120
2477A20Q0k88J76o9J02k45L17j9m09K45k46L42J08M3j21j94M8Q8k28K12K6k76
$$ 120 200 -88 88 19 121 -124 193 174 -235 10 -236 106 214 257 136 -58 -10 78 -150 62 88 -188
2499a88J05J63j73Q4J04l1L0O9j96o9L0J82j47q8K71l96k4K65j66L01n0j62K3
$$ -188 -83 80 -93 -9 95 64 94 163 -33 -102 -72 110 -37 -125 146 -250 -274 -9 -175 126 76 -86 -63
2522f3o2K11j73K41k59J44J14Mj64J11l9j32L01Jl51J25m9L6P8M6k23J25k7Q3
$$ -63 -125 86 -87 154 -105 39 153 157 -7 104 65 -67 234 235 -116 9 -40 -4 74 120 -103 22 -5 78
2546G8j97p6K94j04k2N8n8L64k40j22L4j05J75j64Q4R8l33K66r4j37L81j36R4
$$ 78 -119 -195 99 -5 -27 31 -27 337 97 -25 9 -96 79 -85 -1 97 -236 30 -64 -201 180 44 138
2569A38j7Pl06Q9k1R8k9K8l38N70j66n3J55l53J47N6q2J14k29Q0J75L5j14K5Q
$$ 138 121 128 -178 -89 -110 -12 -41 -13 -351 219 53 0 155 -198 -51 5 -77 37 -192 -112 63 98 -16 9 17
2594A7J06J96j81j46N6j04O2j11R6q3M13j53j36q9j74K73N0K9j75J2r3K00j83
$$ 17 123 319 138 -8 48 -56 6 -105 -9 -92 321 168 32 -57 -231 42 92 121 -54 -42 -135 65 -118
2617a18QQ3J8k18R0K18n5J88l26N7j8R4J34j09j18j78K41j98K67l6j19Q2J89l58
$$ -118 -110 -27 -9 -227 -137 81 26 214 -112 -55 -73 21 155 46 -72 -250 -9 -207 60 24 -95 -13 176 -182
2641a82J08P4K23k77J64k57j23L61k6q9J32k63J15N1K2k01L28j79J66n2m32K71
$$ -182 -74 0 223 -54 110 -147 -270 91 65 -24 108 -155 -40 11 33 -168 160 -19 147 95 -337 -66
2663f6k79M73J04j60J11k11j05K79q5j60K36R3l91J20J39ll3k41J86R2O3r3j29
$$ -66 -345 128 232 72 183 -28 -133 146 61 -99 137 230 -161 -41 98 95 62 -179 7 99 162 69 -60
2686f0L38k69r9J70j75K23L0l50J55J47j31jl3m0m5K73l09J37M3J84m53M12q8
$$ -60 278 9 -90 80 -95 128 158 -192 -37 110 -21 -22 -55 -95 -140 133 -176 -39 4 188 -265 147 59
2709E9j02K04l31N7K56j38j15K07m8N0p7k69J32N6RJ04j53K31k05J26n9M7j00
$$ 59 -43 161 -170 -113 143 5 -110 97 49 99 22 -247 -115 -59 -50 54 -99 132 -73 53 -6 41 -59
2732e9n5L69j68O0j71K3J30k51K05l69O13m44l8n2Q4o4J90K3q8N5j55L5J68J23
$$ -59 -114 255 87 147 -24 -1 129 -122 83 -286 327 -117 -155 -207 -123 -187 3 26 -62 -7 -162 -127 41 164
2756A64o4k73J05K04l5k94K66j22R1J1J2R9k84M31k41p4Ko0o2J21l3l1n8J16k12
$$ 164 100 -173 -68 136 101 -193 73 -49 42 53 65 164 -120 311 70 -4 -2 -62 -124 -3 -36 -67 -125 -9 -221
2781b21K64q2L05l44o9K35q7J26M2k43N7N1j07Q1Pr6Mr1O8l7J09J63k23K14k60
$$ -221 43 -39 266 -78 -147 88 1 127 169 -74 -17 34 -73 8 15 -81 -77 -168 -100 -137 -28 135 -88 126 -134
2806a34P5j02K16Q7j38J51j93%N7l6K11l45J46j80K49j96O9J69J01m7l89L83m00
$$ -134 -59 -161 55 142 4 155 -38 -38 19 -17 194 -151 -5 -185 64 -132 -63 106 207 160 -229 154 -246
2829b46K65k51J30L64M7j25r4j09k41J0k2P8J74j55K68j3r4K32k59J60J00m2j61
$$ -246 19 -232 -102 262 309 184 90 -19 -260 -250 -272 -194 -20 -175 93 80 -14 218 -41 119 219 177 16
2852A6J76j00k05R8K7n3J09J5Oj86J91j47j38L85k82K21j51ko3mJ04j16J50l0
$$ 16 192 92 -113 -15 12 -41 68 83 89 -97 94 -53 -191 194 -88 133 -18 -20 -83 -87 17 -99 51 21
2876B1j1j01KN6j54J88p9K13j39P4R8j30j5K24l05K65l28K28j66M0O6N8j59n5
$$ 21 10 -91 -89 -33 -187 1 -78 135 -4 70 168 38 23 247 -58 207 -121 107 -59 -19 47 105 -54 -109
2900a09J04Mr7K7J20l3r7K06k15Rr7L55k53J24R7j23k40K06J1K1k8J26j97r8Q9
$$ -109 -5 -1 -98 -71 49 16 -81 125 -90 -81 -178 177 -76 48 145 22 -218 -12 -1 20 -8 118 -79 -177 -88
2925h8K0l3J65q0j2j33K62R7j2j45j04K91p3l5k01K48j52r2K07l55N16k40k5K58
$$ -88 -68 -101 64 -16 -28 -161 101 198 186 41 -63 228 155 120 -81 167 15 -77 130 -225 291 51 26 284
2949B84k19j01K77k59j78J82j37L86o71K98J23j55L5J38j55O1J74k47K42o9j5
$$ 284 65 -36 241 -18 -196 -14 -151 235 -436 -138 -15 -170 -135 3 -152 -91 83 -164 78 9 -6
2970fJ08k80L1J65j07j18K65Q8o2J8J2K4j25n2L17m90K21lqK93k64R6l66J83J55
$$ -6 102 -178 -147 18 -89 -207 58 146 84 102 114 138 13 -39 278 -212 9 6 -2 291 27 123 -243 -60 95
2995I5J35j47j37KR8J49j86k68J84J2n9J95r0k22M46l32O3p2j37M80l79J41j10
$$ 95 230 83 -54 -52 46 195 9 -259 -75 -63 -122 73 -17 -239 207 -125 -62 -134 -271 209 -170 -29 -139
3018a39P2O6O5r3L62l56J75o9r0j1J26k22K03j98N0K54j26P9j69K94m19j46L98
$$ -139 -67 -1 64 -29 333 -23 152 83 -7 -18 108 -114 89 -109 -59 195 69 148 -21 273 -146 -292 106
3041A06j80L6P9j76N6q5k8K85p5J44j9l18J31jJ33j15J38j13K25l63L79j23J19
$$ 106 -74 -38 41 -135 -79 -164 -192 93 18 162 143 -175 -44 -45 88 -27 111 -2 223 -140 239 116 235
3064B35j41j5l09K88j00J24P5N7l93M10m6r8k30J36K3J2j48P0K12k30J88k53J19
$$ 235 94 79 -230 58 -42 82 157 214 -179 231 185 87 -143 -7 16 28 -120 -50 162 -68 120 -133 -14
3087a4n6J75o6l3j10O5k49L22J0r7O2k87M20j10j65J41j8j2n3K00k38O7J07m2
$$ -14 -70 105 39 6 -104 -39 -288 34 44 -53 9 -278 142 32 -133 8 -10 -22 -75 125 -113 -46 61 19
3111A9K08r0j28J10J9j57K31k71k9Q3J25j25LL9K09m63K96pJ14k11J28J56n18
$$ 19 227 137 9 119 138 -19 212 -59 -88 -5 120 -5 -2 37 246 -217 79 72 186 -25 103 259 -259
3134b59P3J36j10J0r7L20Lj50K99k68P3j13L65l11J48l67J28L82n76N44l93K75
$$ -259 -186 -50 -160 -150 -247 73 76 -74 225 -43 30 -83 282 -29 119 -248 -120 262 -314 230 -163 112
3156A12n9r3L34j46j34j70j04qJ82K10p7j22jJ35p7J57j35m3m5m5K50n17M95k16
$$ 112 53 -40 294 148 14 -156 -260 -268 -86 124 47 -75 -76 59 -18 139 4 -39 -84 -129 121 -396 99 -117
3180a17J59l50K50J14p7K00k87r1L07J02k5j70j35J91K28l58p4r5K94n6J9j05
$$ -117 42 -308 -58 56 -21 179 -108 -199 108 210 185 15 -120 71 299 -59 -133 -228 66 10 29 -76
3202g6ko7L6J83l93M04l68K59J90o3p1r9J31k05K83P9l25J65j03QQ9k28K83k05
$$ -76 -78 -145 -109 74 -319 85 -283 -24 166 103 32 -67 64 -141 142 221 -104 61 -42 -34 55 -173 110 -95
3226i5K78j90Qp5J67j04j13K49j76P0p9Q3j74j36J42K10J72k34qK91k56k82N6
$$ -95 183 -7 1 -74 93 -11 -124 125 -51 19 -60 23 -151 -287 -145 65 237 3 -5 286 30 -252 -196
3249a96J0QK36k16K02l45M32j12j00K42j45M8j06O4l1j33L06j13l0J8K8k0J12
$$ -196 -186 -178 58 -158 44 -301 131 19 -81 161 16 64 -42 22 -9 -142 164 51 21 39 67 47 159
3272A59k27K62j38m4j65J10J89j96J35L14m18K05k73j35J53K02q5l81K34Q0k43
$$ 159 -68 194 56 12 -153 -43 146 -50 85 399 -19 186 -87 -222 -69 133 48 -333 -99 -19 -262
3293b62J39R9L7m7O1j35J44k09K15j86J36k53L27j8k10K84k98K07l7k5M5O1k68
$$ -262 -123 -24 13 -34 27 -108 36 -173 42 -144 -8 -261 66 48 -162 122 -176 31 -6 -31 14 75 -193
3316a93J61L25k38j12L16j96p3J01J17m38P8j49L71j32L1k53K20R7r0n2j08J53
$$ -193 -32 293 55 -57 259 63 -10 91 208 -230 -152 -301 70 -62 -31 -284 -64 33 -57 -109 -217 -64
3338f4K42j25J8Qk64O84l34K0r8k4j33L04k23p9j23L68l33K15j0O2r6K28k57J98
$$ -64 178 53 71 79 -185 499 165 185 87 63 -70 234 11 -68 -191 177 -156 59 49 111 15 243 -14 184
3362A84o7k7Q1n28M80l54K02L8K74j17q2M0Q6k50Q5k47J06J00o4K28l03j37M92
$$ 184 117 90 171 -357 123 -231 -29 9 283 166 84 124 210 -40 45 -202 -96 4 -60 168 -135 -272 220
3385B20l47M04q2m05J17J12j69l8k5R8L01l89K20R1N5l25J81m6m3J39J15j55j27
$$ 220 -127 277 195 -210 -93 19 -150 -188 -213 -115 186 -203 17 108 163 -162 19 -27 -70 69 184 29 -98
3408i8M5Rj12JN5J24O4k33K68L0P3r0j27k82L07l21J42L19k62j4N5L7L1J92k69
$$ -98 -53 -44 -156 -155 -100 24 88 -145 123 153 226 136 9 -273 34 -287 -145 174 -88 -102 -47 -10 21 213 -56
3433e6j61J89j09NJ60M6N1j35n8lJ10L7J1j20p8N9J43J35k6l80L81k46J7K59j61
$$ -56 -217 -28 -137 -132 28 74 125 -10 -68 -71 39 76 87 -33 -111 -52 91 226 200 -180 201 -45 -28 231 70
3458G0m2J24J3j22j09j0K28j94Q6m8J73l30J19q2J99jj32J45N0m4pP4k31K0l5
$$ 70 28 152 165 43 -66 -76 152 -42 44 -4 169 -161 -42 -124 75 74 -58 87 137 93 86 160 -71 -51 -86
3483h6p5K62l28K21j83O0n6K76J3j43L6p3j41L85k58J41J72j5k03j78J77j09o0
$$ -86 -161 101 -227 -6 -189 -129 -185 91 104 -39 -3 -76 -217 168 -90 51 223 208 5 -173 4 -105 -165
3506a65L9J39j25L77k57k41K30K51k33J80p4j68J98k23J45j09k31M60j1o9m3j67
$$ -165 -126 13 -112 265 8 -233 -3 248 15 195 121 -47 151 -72 73 -36 -267 193 182 113 70 -97
3528i7J89o6R1k68J58J18j98J38p4N0pk96J44J88k00M4Pk0L33k47j83K32j62J25
$$ -97 92 26 117 -151 7 125 -73 65 -9 41 34 -262 -118 70 -130 -86 -79 -99 234 -13 -196 36 -126 -1
3552ao0Q2r9NL16j29Q4j11J98k05o3j23J03J45k1r8M0M6k29J68Pj44J72p9K8J61
$$ -1 -61 21 -78 -73 243 114 198 87 285 80 17 -106 -3 142 121 23 63 109 -120 48 55 -89 83 4 32 193
3578A93n9m12Q6k9L17L5k48K17k96K74j73k3K62l60K08J06j54j45L53k2k09J35
$$ 193 134 -278 -192 -221 96 131 -117 100 -196 78 -95 -118 144 -216 -8 98 -56 -201 152 130 -79 56
3600E6j28OJ43k76J49j1J7K20k54K88k31J4J02Qj0l48L05o3m9J85Q7L5l60J40
$$ 56 -72 -66 77 -199 -50 -61 -44 176 -78 210 -21 -7 95 103 93 -255 50 -13 -62 123 210 245 -115 25
3624B5L4P8k61J56j87j34M61j87K32j76J92l01J68j63Q1m1N5Q6k26K52k15J45
$$ 25 59 137 -124 32 -155 -289 172 -15 217 41 233 -68 100 -63 18 -23 32 118 -108 144 -71 74
3646G4kj61p5k1K61J90k71N9j1j34K76j87J28j20k6n4L9L24k04j55N8l1L3k38
$$ 74 72 -89 -164 -185 76 266 -5 54 43 -91 185 -2 126 6 -20 -74 -35 289 85 -70 -12 -43 -10 -248
3670b48N18n05J17J40J16l1j16j35J36r7R3K34k48N4j6J32k31k5K87j14M5L6j65
$$ -248 270 -235 -118 22 138 107 -9 -144 -8 -105 -12 222 -26 28 12 144 -87 -112 175 61 106 142 -23
3693b3p0M9N4k9J31p8J22l33J36K28m15l2K23K5N9L5j97K75r1r1j75L92k55J50
$$ -23 -93 -44 10 -19 112 34 156 -177 -41 187 -228 -260 -37 -12 47 82 -115 160 69 -22 -197 195 -60 90
3717I0j32k02L38j30J40k77l7L34o1jP1k57L13k42K21R7j24p0o9P3o8Q6r2j45
$$ 90 -42 -244 94 -36 104 -173 -210 124 63 62 133 -124 189 -53 168 265 141 71 2 75 7 93 1 -144
3741a44j10L33j54j3O5K93j74K9oM9k30N7pj37L9P6j58J68Q1O0m08K99j15NK06
$$ -144 -254 79 -75 -88 -23 270 96 125 119 168 -62 -5 -12 -149 -110 -34 -192 -24 57 117 -291 8 -107 -102 104
3766A04j0J38J1k34n8k1o3K05j04M6J70j33k54J98Jr0j59K77l1QJ34J6k26J49
$$ 104 94 232 243 9 -49 -70 -133 72 -32 14 184 51 -203 -5 -4 -94 -253 24 -7 1 135 151 -75 74
3790G4N8j28j18K57k66J5q1J48k1K03J71J30n87R4j37J25k3K39j16L9k16J32l1
$$ 74 132 4 -114 143 -123 -108 -189 -41 -62 141 312 442 -145 -51 -188 -63 -86 153 37 76 -140 -8 -39
3813c9l6r2J02o1j22P0J4K12k9j45j0J85k61J96K08k91lK69k69O1j08J36J82k69
$$ -39 -75 -167 -65 -126 -248 -178 -164 48 19 -126 -136 49 -212 -16 192 -99 -102 167 -102 -41 -149 -13 169 -100
3837a00K18l1j20P2K0j43J70j15N0j44J28j1nJ71%k41O2k59K71j09n3K0J03r6
$$ -100 118 87 -33 39 59 -84 86 -29 21 -123 5 -6 -11 160 160 -81 -19 -278 -7 -116 -169 -149 -46 -142
3861a42L01k98K52P7k20p3J28R7p2j47J14J56j91J09n6J04j84P7j06K27q1N1j89
$$ -142 159 -139 113 190 -30 -103 25 122 50 -97 17 173 -18 91 35 139 -45 32 -74 153 72 123 -66
3884f6J11j71K00J1o1n8J1L26l81l5P3j97K62J39l30J1J50j08o7L32k06K6m4K16
$$ -66 45 -126 74 85 24 -34 -23 303 -78 -113 -40 -237 25 164 -166 -155 -5 -113 -180 152 -54 -28 -72 144
3908A44j69j67K72J1j3k50K62k08%Q2j44K47K39m43K25q9m2J13k52J08J0J30M5
$$ 144 -25 -192 80 91 78 -172 90 -118 -118 -36 -180 67 306 -137 88 -1 -43 70 -182 -74 -64 66 111
3931A11k33N8oJ66j42J66j52J26O1j68n7j71Q1J22P6J65k49j15K40L0j39J00N7
$$ 111 -122 -64 -70 96 -46 120 -32 94 155 -13 -70 -241 -160 -38 38 203 -46 -161 79 109 -30 70 127
3954A27m0J09Jm45L89m3k41K18K9Rk10K92j03p6j38K15j96k1J09J31j38K48r9
$$ 127 87 196 197 -248 141 98 -143 75 104 113 -97 195 92 16 -122 93 -103 -124 -15 116 -22 226 127
3977A27p1p8L1j42J34j46j0j45K94n3J11Q6l37L09k14O0p0Q0J03k68J92j78J71
$$ 127 56 -22 9 -133 1 -145 -155 -300 -6 -59 52 138 -199 110 -104 -44 -114 -34 69 -199 -7 -185 -14
4000a4J12j28m7M21o32L58p5J23k18K84K43n00R8O9m15K48N4o1O4L42n74O10l64
$$ -14 98 -30 -77 344 -288 70 -5 118 -100 184 427 -73 25 94 -321 -73 -19 -80 -16 326 -248 362 -2
4023bk62J81J69j48P7J89j26k71L39o6J50J35m24j01K78o9Rj72J28r0K5J31m9
$$ -2 -264 -83 86 -62 15 204 78 -193 146 80 230 365 -59 -160 118 49 58 -114 14 -76 -51 80 31
4046C1j32J76k03L6L63m09lo6J62LK39l10K00jj44l7J38q6nJ31m3j47m0K26j96
$$ 31 -101 75 -128 -92 271 -138 -141 -207 -45 -42 197 -113 87 86 -58 -95 43 -43 -48 83 40 -107 -147 79 -117
4071a17L3L6M6J31k69P1n1J99j8k6J3Ooj58j41M57l01K1J87L0j28j54L11k80K04
$$ -117 -84 -48 -2 129 -140 -69 -120 79 61 35 48 54 48 -110 -251 206 -95 -74 113 143 15 -139 172 -108 96
4096I6j91J13K9j3j63K18M9j36j82R2j7R6Mk45L67j47K92M8l27K04p5j35R6Oj40
$$ 96 -95 18 47 34 -129 89 138 2 -180 -88 -105 -9 -5 -250 117 -30 262 310 -17 187 112 -23 73 79 -61
4121f1J21R6j72q2K36j8L9r1k13N9KJ60j46O2r6m6L77j50k97P7J57J1L2l81M98
$$ -61 60 156 -16 -98 138 120 159 68 -145 -86 -84 76 -70 -8 -104 -150 227 77 -220 -143 14 25 57 -324 174
4146A74p7l63L49L9J74l6m5r6j46l32M96J62l05l8m0P5J6K1L3k90J78J84j72R7
$$ 174 97 -266 83 122 296 260 215 119 -27 -359 137 299 -6 -44 -84 -9 7 28 61 -229 -51 133 -39 58
4170E8n3J04R7m34J02J67j43j1Oj05J50p3K62j11Nm3J05j40K24l01J36R6j75j03
$$ 58 5 109 206 -228 -126 41 -102 -113 -107 -212 -62 -135 127 16 21 -22 83 -57 167 -134 2 98 -77 -180
4194a80J57r6O2K34j64q1J85P2k92l9J73J5l79N87l14r8K93j94k01L32JO1k14
$$ -180 -23 -119 -57 177 13 -68 117 189 -103 -142 31 46 -333 254 -60 -158 135 -59 -260 72 73 134 -80
4217h0M8l3r0K14K9l51K4K44n7K21j52K7n6O4p7J01j95K06J12m20K05N1m6j10
$$ -80 -32 -65 -155 59 88 -263 -239 5 -52 169 17 44 -12 52 -25 76 -119 87 199 -221 -16 35 -11 -121
4241a21O0Q6m1Q9M8j03OK02k45K39j01l94K74j69j37L69j94K49L6j32m9j5n1L6
$$ -121 -61 25 -16 73 121 18 24 226 -19 220 119 -275 -1 -170 -307 62 -132 117 153 21 -28 -43 -94 -58
4265e8j44J09M1m4O5N7k80L72j86K03J99j89j40K03l10J74n1L4n4O2j0j19J4J64
$$ -58 -202 -93 -52 -96 -31 26 -254 118 -68 135 334 145 5 208 -102 72 21 55 1 63 53 -66 -52 112
4289A12m8o%j21O9j38R7j35M92m13J52J31k7j12j80J49O2k52O9J14k8J82j27j36
$$ 112 64 58 58 -63 6 -132 -35 -170 322 -91 61 192 165 53 -127 22 84 -168 -99 15 -13 169 42 -94
4313i4J78j94L9J37n2k03P0j5P8J65j88J0P7L4k7q5o6M6J30n8j4P6M3k03K64j88
$$ -94 84 -110 -71 66 14 -189 -119 -134 -56 109 -79 -69 8 42 15 -70 -136 -90 40 -18 -32 44 87 -116 148 -40
4339d0k32L83J5m34J36K25j47j60K90J05P3l58L41p2n1K92m69R3J19k21J12O9
$$ -40 -272 111 126 -308 -172 53 -94 -254 36 141 214 -144 197 125 74 366 -103 -10 109 -112 0 69
4361F9p4J36k2K0k52K93j52J48j86J83m23Q2M11l13L6R0k25J13L44l66J85r6O3
$$ 69 -5 131 109 129 -123 170 18 166 -20 163 -260 -178 233 -80 -44 46 -179 -66 278 -88 97 1 64
4384F4j80j48J88j86K08R3j81K00oO0j13J32j84J59J34j5k84m0J30k45o5K92j62
$$ 64 -116 -264 -76 -262 -54 39 -142 58 52 112 -1 131 -53 106 240 225 -59 -99 31 -214 -279 13 -149
4407a49K93j54k7k0K43j31j52oK8K16m8j23J32k76J49L94j96l08K46O5k70K19
$$ -149 144 -10 -37 -57 186 55 -97 -103 -75 141 93 -30 102 -174 -25 369 173 -135 111 176 -94 125
4429A25j09m0j60L63j81J1o7j03Q5j78N51n36J51J77j26N5J46k07J2j29j6K34
$$ 125 16 -24 -184 179 -2 9 -58 -161 -76 -254 297 -239 -88 89 -37 18 164 -43 -31 -160 -176 58
4451E8j43j24J44jK09l60L12N7j90k0Q1l9m52L76M01l64Oj75K8J21J3J15j97K97
$$ 58 -85 -209 -65 -66 143 -217 95 152 -38 -58 23 -16 -468 -92 309 -55 -49 -224 -196 -75 -62 53 -144 153
4475A53j77m2O0p8K63l37J98j37P2Q0J63k89K55j48OJ90k87Q8rj51l6O3pmj7m0
$$ 153 -24 -66 -6 -84 179 -158 40 -97 -25 55 218 -71 184 36 42 232 -55 33 24 -127 -163 -100 -107 -111 -128 -168
4501a68L87n86L21j0Q7j29K7J38k96K84J57l4k47J03k7L6k11M0k7K70j76J2l7
$$ -168 219 -367 -46 -56 31 -98 -71 67 -229 55 212 178 -69 34 7 43 -168 -128 -155 115 -61 -49 -86
4524h6K12j77j1O1jQL9r1j51L20k81L73k24m2K66l68J57j98J75R1k81L37J01k09
$$ -86 126 -51 -62 -1 -2 6 45 -46 -197 123 -158 215 -9 -51 215 -153 4 -194 -19 72 -209 128 229 20
4548B0l59N30j32q2j99J48P7J02k12J00j85j47K11J95j83J87l3j63NK79lr5q0
$$ 20 -339 191 59 -23 -222 -74 3 105 -107 -7 -192 -339 -128 67 -116 71 38 -125 -120 159 156 61 -19
4571a9j20J24O7L5p6K09J21j71pj96m0k9L33L4k04j38j21K27J76P7k15K5P9j50
$$ -19 -139 -15 52 87 11 220 341 170 163 -33 -73 -102 231 265 61 -77 -198 29 205 282 67 92 171 21
4595B1M3J06n9k6J5l5l4j1o1p1j24N4K53o9J04Q9l22o2N7j01r6K32K82l94K68
$$ 21 64 170 111 85 100 65 31 20 -41 -112 -236 -182 71 2 106 195 -127 -189 -132 -233 -329 -97 185 -209 59
4620E9Q1l32J18J53nQ2p5k27K4J73j4L3n8J14k20ro7J83o4M2o9J80P0j19q4K2
$$ 59 140 -192 -74 79 74 156 81 -146 -122 51 37 70 12 126 -94 -103 -170 13 -51 -9 -78 102 172 53 -31 -9
4646iR0p3J45r2k18r5K65J16N3j42J59k92K52j16q3J41j30J92p3o1N0k05J85j22
$$ -9 81 8 153 61 -157 -252 13 129 182 40 199 -93 159 43 -40 101 -29 163 90 29 79 -126 59 -63
4670f3R4JJ62l04n4J36o9J35Nj07K02j14n0n1J16J60j88j00m0J54J87n91M75r9
$$ -63 31 32 194 -110 -164 -28 -97 38 43 -64 138 24 -26 -77 39 199 11 -89 -129 25 212 -379 96 -3
4694cM7j70L80j61k07K72r6L6k72K25k20M3k0M0m0O3l0P6R2m3j20J20Nk16J41
$$ -3 44 -126 254 93 -114 158 62 98 -174 51 -169 -126 -146 -106 -146 -83 -113 -37 55 12 -108 12 17 -199 -58
4719e8p7K32j77n3J68j07P9M23l56k84R5p3J06O4q4J98k43L14j2k58R3J4o2k33
$$ -58 -135 97 -80 -133 35 -72 7 430 74 -210 -115 -188 -82 -18 -102 96 -147 167 155 -103 -10 4 -58 -291
4743b91K28j15N1M01l54N20k85k34R3oO4J30l15P6L9j01J54j4P6j57J9r5j20K70
$$ -291 -63 -178 -127 274 -80 440 155 -79 14 8 72 202 -113 -37 2 -99 55 41 117 -40 -21 -116 -236 34
4767C4P6k13rK90p1K9l98L47p3j8o5J31R9l86R8K33K7l2r8l15K84j73K69o7J7
$$ 34 110 -103 -112 178 107 136 -262 85 12 -6 -71 60 159 -227 -129 104 131 99 1 -314 -30 -203 66 -1 16
4792A6k9O2q4J34j19J17j56QJ98l4k04J0j8M21k32q7k8M0l11J68K78k9l43M0M08
$$ 16 -13 49 -35 99 -20 97 -59 -51 147 113 -91 -81 -99 322 90 3 -25 15 -296 -128 150 121 -222 -182 226
4817B26l71K04j98j69QJ60K93k97J45K4P6j48K23m9k68R9N6%j12J16K31k37J80
$$ 226 -145 59 -139 -308 -300 -140 153 -144 1 25 101 -47 176 127 -141 -42 14 14 -98 18 249 12 192
4840A92l26K09j46j30L44k20K11l03L24l48K71P4n9K2j19Ro5J06p4j47K43O9J10
$$ 192 -134 75 -71 -201 143 -77 134 -169 155 -193 78 152 93 115 -4 5 -60 46 -28 -175 68 137 247
4863B47l66Q0m0k4K4J0j70J77j30R1K99l62L08j23j16mM3JJ08Q7mk83M04k15K7
$$ 247 -119 -39 -79 -103 -79 -69 -239 -62 -192 -101 198 -164 144 21 -95 -99 -56 -55 53 140 136 -147 257 42 69
4888F9m5J11M0j28o0J35l9l5K28m43J82R6p4k26M29k72pJ42k8p8N1J27j76k1n
$$ 69 24 135 175 47 -13 122 83 48 276 -167 15 111 37 -189 240 -32 -39 103 75 -3 48 175 -1 -22 -27
4913b7k35K96n4j27J87j91J46j8m8L56r9K5j96q3N2n2j14J8O5J54k5j36L49j55
$$ -27 -262 34 -20 -147 40 -151 -5 -23 -71 285 186 211 15 -68 -16 -68 -182 -164 -99 55 30 -106 243 88
4937H8Pj22O8P9k19J36ok16N14l73M9P7j06J32n9j23K7K49l87L27j64K45k37j88
$$ 88 95 -27 41 120 -99 37 31 -185 329 -44 5 82 -24 108 49 -74 -47 202 -185 142 -22 223 -14 -202
4961b02K99m8J8k73K49j20J04j5On7q4J7J14J37j34M3J78l32K34k26K08M6j88
$$ -202 97 49 67 -206 43 -77 27 12 18 -39 -123 -106 8 145 11 54 232 -100 134 -92 116 162 -26
4984b6q1j14J17L14j16M4l3j75K7M8j73K73L8pl47L60l48J69Q5M3q0K3j51M6R5
$$ -26 -107 -221 -104 210 94 138 105 -70 -43 5 -168 105 143 136 -211 149 -199 -30 55 98 18 41 -110 -64 31
5009C1o8P1j17j03J73J33k59K06q6J42l10K46Q7k97J32m2J98o8p6q4L04k22N6
$$ 31 -37 34 -83 -186 -13 120 -139 67 -19 123 -187 59 146 -151 -19 -61 137 69 -7 -91 213 -9 47
5032D7J46m27L16l36K04J14n2kj23L04l84K97j08k0J24q2j01j41P2L24M0m30J73
$$ 47 193 -234 82 -254 -50 64 12 10 -113 191 -193 104 -4 -24 100 18 -83 -224 -152 172 212 -218 -45
5055d5J67l46L11q9q0m8J52L5Q4j75%J7o0Jq2L94n7k25q9K41l04J81Pj10J56m9
$$ -45 122 -224 87 -2 -82 -130 22 57 141 -34 -34 -17 -77 -76 -158 236 179 -46 -135 106 -198 -17 -10 -120 36 -13
5081a3j5Q8r1J20q3j58M45k42k0M7o1Rn7M8K15n33K26K1j11k8J33r3M70l95n3
$$ -13 -28 60 -31 89 6 -152 293 51 31 78 17 26 -31 17 232 -301 -75 -54 -165 -193 -60 -153 317 -78 -131
5106a31P7q3L73j87l0j04L8L21k20J06k44Q9j05n4J23o7K06q7L7J16m91K87L0
$$ -131 -54 -137 236 49 19 -85 -47 274 54 160 -84 5 -100 -154 -31 -98 108 21 58 174 -317 -30 0
5129@Q5J09j64j46J78k40L10j40M8l4R4L1j04j05j11K15q9K6L5k00J22O1P7q6
$$ 0 85 194 30 -116 62 -178 132 -8 40 6 100 131 27 -78 -189 26 -63 -37 -2 -202 -80 -19 58 -28
5153b8m29L17KK6j0P1J91m14J41j48K64J00O7k85J12p8R8L01k91r8J4M2K6r9L
$$ -28 -457 -140 -138 -112 -122 -51 140 -274 -133 -281 -17 83 150 -135 -23 -101 -3 298 7 -91 -77 -35 -9 -108 -105
5178a05J24nL5K5j34n0Q0J08k52N05k0l53L4K08k47r0J20q8K19j87J99kq7k25
$$ -105 19 14 49 74 -60 -110 -30 78 -174 331 311 -42 -8 200 -47 -137 -17 -105 114 -73 126 124 37 -188
5202a88j16L14J79m0k82K1J44oq2k22K60j24K67j05j46l6K42o1J61k04n1O6J9
$$ -188 -304 10 189 149 -133 -112 32 26 -56 -278 -18 -142 125 20 -126 -162 80 19 180 -24 -75 -9 10
5225A0n9k13j64L46J92j2Q9k95j55K93l3K54l01j00K23mk39q4J32kL0J66J55l64
$$ 10 -49 -262 -426 -80 112 100 189 -106 -261 32 -1 253 -48 -148 75 71 -168 -252 -120 -122 -92 74 229 -135
5249a35J26M3j21L8j94L22J36m16l8L46j91J30k6k7j22q5L81p8k06m9J04o8N9
$$ -135 -9 34 -87 -49 -243 79 215 -201 -239 107 -84 46 20 -7 -129 -214 167 89 -117 -166 -62 -130 -71
5272g1Q3J57k75j5J87j39K83l03K37j28o7J40j40K44q1j76J68L8k62L68o6k97
$$ -71 12 169 -106 -121 66 -73 210 -93 144 16 -51 89 -51 193 112 -64 104 142 -120 248 182 -115
5294a15j10J29K09J18j27k3q8p2K7Q8O1J0o5Nn0K14j65Ll3R0j40j06K68l29J16
$$ -115 -225 -96 113 231 104 81 -7 -79 -52 36 97 107 42 47 -3 211 46 49 16 106 -34 -140 128 -201 -85
5319h5Q4r3M3r7J17J75n23K76L4o1R7L7J65q0Mk50K33l30K67J34o4r7l0Q6p0k2
$$ -85 -1 -94 -51 -148 -31 144 -379 -103 -69 -130 -33 4 169 89 93 -157 76 -254 13 147 83 -14 -44 42 -28 -50
5345e0Q4O9J13j25l41J69J16N9k04R9J71l47L18l80J52K81j63K59l29J4J0k9J41
$$ -50 34 103 216 91 -250 -81 35 94 -110 -11 160 -187 131 -249 -97 184 21 280 -49 -35 -25 -54 87
5368H7k85J73J46J48n83M70j10k7K46k30K7l14L20k34L8M35m04Q5J24l00L67j67
$$ 87 -198 -25 121 269 -314 156 46 19 265 35 62 -252 68 -166 -128 307 -97 -12 112 -188 179 12
5390A2p5K9k7J37j01L0j04J56k2j44K43j67P5r3L9J95j89J15Nj21J89q1M6j0k87
$$ 12 -63 -34 -61 76 -25 5 -99 57 35 -109 134 -33 42 -51 -12 183 -6 109 114 -7 182 101 147 137 -150
5415a50L49k62J41L02l74o0j55J57L57m91K37o4r2J89q4j2j3q6J21p9J80j73N
$$ -150 199 -63 78 380 6 -54 -209 -52 305 -186 51 -13 -105 84 0 -12 -25 -111 10 -69 111 -62 -57
5438e7o7N7N7k07J40N2L2K2J49L6p4k40J42j07K59k64J28p8q7q2O2M5j30J98j1
$$ -57 -124 -67 -10 -217 -77 -25 7 29 178 214 140 -100 42 -65 194 -70 58 -20 -107 -189 -127 -82 -212 -14 -25
5463b5K49k19q0OJ25K6k30L31p1l34M32l41J98k97L67j53m0j32J99k6p1K60j72
$$ -25 224 5 -75 -69 56 82 -148 183 112 -222 210 -131 67 -230 137 -16 -56 -188 11 -15 -86 174 2
5486BN2J4k1L6k50J92k68K55q5J38k17l01M13p0J93k31L59m9L5j93q0o5J87j74
$$ 2 54 68 47 83 -167 25 -243 12 -73 65 -152 -453 -40 -110 83 -148 211 162 197 4 -76 -141 46 -128
5510a28o9O9J17j06J04j7J98j09L2j23K07j44o9R6j88K27k39P1r1N0j82L41j0
$$ -128 -197 -128 -11 -117 -13 -30 168 59 91 -32 175 31 -38 58 -130 97 -142 -71 -162 -112 -294 47 37
5533C7J72k93k45L17M1q3J35j42j4J45m6p9k36K73r2J56r4R6N7r4J93j82m1P2
$$ 37 209 -84 -329 -12 29 -54 81 -61 -75 70 24 -55 -291 -18 -110 46 -48 48 105 11 204 22 -19 53
5557E3J43j87J03k18j1L8K82l09L00R0k57n3o7j69K31J19Nr0o4K75k31R3j09K2
$$ 53 196 9 112 -106 -117 -79 203 -106 194 284 27 -26 -93 -262 -31 88 93 3 -61 214 -17 76 -33 -11
5581a1p5O7j20k17L18K15m70N11j86o4J34n1k08j7L69m21K03P0L3j85J77O7l70
$$ -11 -86 -19 -139 -356 -38 177 -293 218 32 -32 102 51 -157 -174 195 -226 -23 47 80 -105 72 139 -231
5604b31K19O4j99M84k88J21q3j96O1K54k67K25L0q8Ml9J24k22J15l3j63J59k32
$$ -231 -12 52 -147 337 49 170 87 -109 -48 206 -61 164 194 106 110 71 195 -27 88 55 -108 51 -181
5627a81J10p4L7K24m0k9j31O6L5L0j10J53Qk50P6k1J38j03J99k35K49k12J01j28
$$ -181 -71 -145 -108 116 76 47 -84 -18 17 47 -63 90 98 -152 -76 -97 41 -62 137 -98 151 -61 40 -88
5651h8Q3j31K99j42N1j60Q2q8J26q8l6jK35j33k37L39J39j94P8l50J47J34k5l5
$$ -88 -5 -136 163 21 72 -88 -6 -94 32 -56 -92 -93 142 9 -228 111 250 56 134 -216 -69 65 40 5
5675Ej18P5k1J00q8J70l2l07K10J54k5k00M9j56N9J69j07K39j39j68J09R0J29
$$ 5 -113 -38 -59 41 -47 123 91 -216 -6 148 123 -77 -28 -184 -125 44 -63 176 37 -131 -22 68 197
5698A97l3K34m36R9o3j55L28l04mP7J40k77K25j0K1J37k01J74m32K41R7J9j35
$$ 197 164 398 -38 61 -2 -157 171 -133 -137 -60 80 -197 28 18 39 176 -25 149 -283 -42 55 74 -61
5721f1J38L2J10j38k5m5K0K13m48J76J45j94k1R1Qj78L34r6k23J37J04k23K15
$$ -61 77 109 219 81 56 11 31 244 -204 -28 117 -77 -98 -7 1 -177 157 61 -162 -25 79 -144 71
5744G1k01J88k92K09J9J01J1j75M5R9M5O7l96J77J3m0J29j18K56j34N7n7j95J1
$$ 71 -130 58 -234 -25 -6 95 106 -69 -24 75 120 187 -209 -32 -19 -59 70 -48 208 74 131 74 -121 -110
5768a10K06j65K27k4l66J00J24M9o3J43n1k53L4K23j23K05m7L6l89Q7L61k34J53
$$ -110 96 -69 158 134 -232 -132 -8 41 -22 121 70 -183 -149 74 -49 156 109 145 -244 -157 204 -30 123
5791A23p5kj25L85j66r6K4j17j2K98j37K71l46k90L40j83K85jj24j8N5k75M17
$$ 123 48 46 -79 306 140 44 68 -49 -61 237 100 371 25 -265 75 -108 177 176 52 34 89 -186 231
5814B31l67K50k78K15k31M67m16J29K12k83J18N8j21J73j96J77q3k22J42j71L30
$$ 231 -136 114 -164 51 -180 287 -129 0 212 -71 47 105 -16 157 -39 138 55 -167 -25 -196 134
5835A34j25N5r2M2OJ62j07p6RM8OJ04k69QK19j26j75K80L6R1j76o4p0r5L77j22
$$ 134 9 64 -28 14 20 182 75 -1 8 56 62 166 -103 -95 124 -2 -177 103 139 230 54 -10 -80 -175 202 80
5861H0l15J22K72m7k98K60l4r0K6Pk7o6J73j89K3L39k24M7Nj15j15J92j75qK73
$$ 80 -235 -113 159 112 -186 74 40 -50 -24 -17 -44 -110 63 -126 -103 236 12 59 64 -51 -166 26 -149 -157 116
5886A16n2k04p8Q3L11j80k41M69k60j02J80k02J15O7j89K20J37k02M0J18j76l9
$$ 116 64 -140 -218 -135 176 -4 -245 224 -36 -138 42 -160 -45 22 -167 53 190 -12 28 146 -30 -69
5908f9K28l77M64j94k1J86m15L57k05l4p5J81n9o2R3m8mjK77j67N6j07k06K64
$$ -69 159 -218 246 52 31 217 -198 159 -46 -80 -155 26 -33 -95 -2 -50 -54 -55 222 55 111 4 -202 62
5932F2J44j47m5J54q3j36OJ24j67M3N4kK04k23L2j36r2K53J9jl33N28j80P4j16
$$ 62 206 59 14 168 85 -51 -45 79 -88 -45 9 7 211 -12 20 -116 -208 45 64 63 -270 258 78 152 36
5957C6M7j24k17r7J37J13K14j97R9J96l02L1J36l13L37M1k91M37j88k00J41j29
$$ 36 83 -41 -258 -355 -218 -105 109 -88 11 207 -95 -64 72 -241 96 137 -154 283 95 -105 36 -93
5979i3J58j65N4L6k6K7N8j48O9J01J82j90j39J24N2j33N1k79M4K23q3m5L47j40
$$ -93 65 -100 -46 -10 -36 -9 49 -99 -30 71 253 63 -76 48 100 -33 18 -261 -217 6 -77 -122 225 85
6003H5k11P5R6l23J2K86l2j60L98l66J66j4j75K1J26N8l6R6j7k65n4K07l0J92
$$ 85 -126 -51 45 -278 -266 20 -12 -172 226 -140 26 12 -163 -142 -16 42 6 102 85 -180 -234 -27 -57 135
6027A35k28K28j78K78m46K49k51J56OK41k3k66l6K52J01k42J68j29M8o3j76K08
$$ 135 -93 135 -43 235 -211 38 -213 -57 -51 190 167 -99 -135 117 218 -24 144 15 63 0 -176 32
6049C2k04N0L16j58j91K92l32j1K94k88K77j16J01j90N2J28j09p5j4nJ34q5m0
$$ 32 -172 -122 194 36 -155 137 -195 -206 88 -200 77 -39 62 -128 -76 52 -57 -132 -146 -151 -17 -102 -142
6072a42N3J12j40K06k16P8k3J35j52J33r6J06k03K50k66K25k14J23n1O7n7n3K17
$$ -142 -89 23 -117 89 -127 -49 -72 63 -89 44 -52 54 -149 101 -165 60 -154 -31 -82 -15 -72 -125 92
6095I2p4k91K36j1K95k77j25J54m1Ql2M36m15K12j63k49K35o3Q9J03K3j36m9O7
$$ 92 18 -273 -37 -48 247 -30 -155 -1 -42 -34 -66 370 -45 167 4 -245 -10 -73 16 119 142 6 -43 24
6119B4O6l9j99K32k39J75l1r9L28l03K10j08J1m4j73k2M65j15l13K47j43L25k88
$$ 24 90 51 -148 84 -155 20 -11 -110 218 -85 125 17 28 -16 -189 -211 254 139 -174 73 -70 255 -33
6142c3K62k15p6J24j89N4L3J42l46K88p0l4l77M25k04j25M08J69l16J59j34l3
$$ -33 229 14 -62 62 -127 -73 -40 102 -244 44 -26 -60 -437 -12 -216 -341 67 236 -80 79 -55 -88
6164h8K15J86m15l6j35J99l9m1P9R2j2K76k08k5p4J42j05j10N3R9j97J58l7j71
$$ -88 127 313 -102 -138 -273 -74 -113 -154 -75 17 5 281 73 48 -26 116 11 -99 -46 53 -144 14 -23 -194
6188a94K76l4k91J34K56k32M70m44n9k2K1k6P4K10j2K7k58q6J63R1k07J96k14
$$ -194 82 48 -243 -109 147 -85 385 -59 -118 -140 -119 -145 -71 139 127 154 -104 -190 -27 64 -143 53 -161
6211a61J33K00l36K07q4J30P1l30K16k29J33l1j2P7J8k01J72l9J65L7j23O1J76
$$ -161 -28 172 -164 43 -41 89 160 -170 46 -183 -50 -81 -93 -16 2 -199 -27 -66 99 136 13 74 250
6234B50k54q5K40l01M8N1q5L1Q3M09j07m04J41J50j0j52j09J77n7n6J72k47J84
$$ 250 -4 -89 151 -150 -102 -51 -136 -105 -22 387 280 -124 17 167 157 5 -104 73 16 -40 132 -115 69
6257F9k5n6j03J77j14J59m9O6kj49O5l25K31JO8P1l4k82K73M7J17l93K57j01R7
$$ 69 44 -12 -115 62 -52 107 58 124 122 -27 38 -287 -56 -55 13 84 50 -232 41 88 205 -188 69 -32 65
6282F5l31M13j78J8QQN3N9k93K4k3J11J67p8j02MN4n8K61l22K31p6k9K55n12J18
$$ 65 -266 147 -31 -13 -5 3 56 115 -178 -154 -177 -66 101 23 -79 -75 -21 -79 182 -140 91 15 -14 241 -271 -153
6308a53P6J43jj10k4n7l4MJ79J25j73K8K43k85J59k17j2J92J5j71qq5K06p2k77
$$ -153 -77 66 65 -45 -69 -126 -160 -156 23 148 -25 3 246 -39 120 -97 -109 83 98 -73 -81 -166 40 -32 -309
6333c09K54oO5J15J11j44J92k28j05Q8j02q7K79j54k01L98j35j89L29k63M93l15
$$ -309 -55 -61 4 119 230 86 278 50 -55 33 -69 -156 123 -31 -232 166 31 -158 171 -92 401 86
6355H6l10K41R3j73j08K07j07R1p9K15p3j66J02j18K7j3o3J25%J35j22j15jP9
$$ 86 -224 17 110 -63 -171 36 -71 20 -59 156 83 -83 19 -99 -72 -85 -148 -23 -23 112 -10 -125 -126 -47
6379d7lj47L4J03J03q1kj88J75j70J26K10L7l68J71J34j32l0j03J53J48l8j31
$$ -47 -50 -197 -163 -60 43 -38 -40 -228 -53 -223 -97 113 150 -218 -47 87 -45 -75 -178 -25 123 85 -46
6402d6j2Q5o5%K6L0o8l3K36k29o2K08j25Q7k3J66l28p6L30j31p4j7K01K2r5J45
$$ -46 -58 27 -38 -38 -12 18 -50 -83 153 -76 -138 70 -55 32 9 175 -153 -229 101 -30 -104 -121 80 102 7 152
6428A52n1k79J48J46L1j56lKr9N4OlL0J03j58M39m90K00k15K24l02Q7R7J08j23
$$ 152 101 -178 -30 116 147 -9 -12 -10 -109 -55 -49 -52 -22 81 -77 362 -128 72 -143 81 -221 -134 -37 71 -52
6453e2j23L18J11k73K04k26R6n3J6J67o1j05j30j09L92p6o6j12L09k69j22N02
$$ -52 -175 143 254 -19 185 -41 55 2 18 185 124 19 -111 -220 172 96 30 -82 227 -42 -164 338
6475C38k90k48q5M21Q2r8l85N62k94J63n04M81l94J72K3L3L8L1J06j89J85j88
$$ 338 48 -200 -285 136 218 120 -265 297 3 166 -338 143 -251 -79 -56 -23 15 46 152 -37 148 -40
6497d0l9j71L01j26J32j23J02r7J37j19l19L78Jpq6L3K10k77J29L6m3k62M8L96
$$ -40 -79 -250 51 -75 57 -66 36 -61 76 -43 -362 16 17 10 -76 -43 167 -110 19 55 12 -250 -202 194
6521A94j11j19K1J51mk79m9N40l29j3r4J03j00L88j74j84k69M58o9m9N9p1L6k73
$$ 194 83 -36 -15 136 132 -147 -196 344 15 2 -92 11 -89 299 125 -59 -328 130 61 12 71 0 36 -237
6545b37K14J07P3l11j6K15q2l6J86k51J79O3k91J43J83j67K03k40L3O4j84K90
$$ -237 -23 84 157 -154 -170 45 -37 -73 113 -138 41 104 -187 -44 139 -28 175 -65 -32 32 -152 138
6567A38j17QP9J11l23J09m8K1l0m2J64j42n0p3J10n9Q3p6K02j78l5K64JJ38l79
$$ 138 21 29 108 219 -104 5 -43 -22 -52 -94 70 -72 -122 -195 -85 -144 -61 -137 65 -113 -148 116 117 255 -124
6592a24P1j95J13J5o0K83k83K16Qo1K24n17J28L67k61P2q5K34q7J32k23Q4o8J62
$$ -124 -53 -248 -135 -120 -180 103 -180 36 44 -17 207 -310 -182 185 -76 -4 -89 145 58 190 -33 51 -17 145
6616A45j21k3j71L80l57J92N6j58K67j49K4j03j43L04p6r%J77k64M5o6j13J54
$$ 145 24 1 -170 210 -147 45 101 -57 210 61 85 -18 -161 143 67 58 58 235 -29 16 -50 -163 -9
6639i%K7j70L25K6k06j1m8m8j49J61K10j54j03K5J09q8Q5J61l4p9k60L30k82K80
$$ -9 -9 18 -152 173 199 -7 -18 -66 -114 -263 -102 108 -46 -149 -124 -15 -103 -18 143 109 30 -230 100 -182 98
6664I8k83K19j75k42L61Rj67R5K65j48o8j91M02l71J15J97o8l7N6J09j0J20j67
$$ 98 -185 34 -141 -383 -22 -13 -180 -85 180 32 -36 -227 175 -196 -81 116 48 11 67 176 166 286 119
6687A19Q5k59p3J26k7J6l4M5J55j84o5J36j8q0K42k17nJ47j91J24o6J75o10L16
$$ 119 204 -55 -128 -2 -29 -13 -47 -2 153 -31 -96 40 22 -58 184 -33 -38 109 -82 42 -24 151 -459 -143
6711a43J53P4j9J1l3l0K9J4k08j6l1M80k83q3M52o14K68j86R0j39J7K00j16J39
$$ -143 10 84 65 76 43 13 42 56 -152 -168 -199 281 -2 -85 367 -247 21 -165 -75 -214 -197 3 -113 26
6735B6l1j9j47K84k75L86j57j51j26K05M3j14R9M9O0j77l2L21k80J54k05K43l08
$$ 26 -5 -24 -171 113 -162 224 67 -84 -210 -5 38 -76 23 72 132 -45 -77 244 -36 118 -87 156 -152
6758a52K97j70l8L3J25m8j58M8l3J97k58K52k15j43K61k0o9M7N3K03o4l76L82
$$ -152 145 -25 -63 -30 95 47 -111 -63 -96 101 -157 95 -120 -263 -2 -22 -91 -44 9 212 148 -228 154
6781A54J22j15k50K9J51L3l42K25j35M30m18L01k9k27M5pkq5K38p5pn0O5O0k98
$$ 154 276 161 -89 -60 91 124 -218 7 -128 302 -116 185 156 -71 -26 -33 -35 -120 118 43 36 -14 51 111 -187
6806a87rK80l7l21J87K30k39L01o6k09J08M3k45NJ32R5r4k45L65j97J22J90k98
$$ -187 -196 84 47 -274 -87 143 -96 205 139 -70 38 81 -164 -159 -27 68 -26 -271 94 -103 19 209 -89
6829h9K3J1J74j96J58P1n1m42N55l85N0PP8l8O2O9J8k37j29K30J61k13J46Kp5
$$ -89 -66 -55 119 -77 81 152 101 -341 214 -171 -121 -114 -36 -74 -12 57 75 -162 -291 -61 100 -113 33 35 -40
6854d0K66k49K8j01m4L92m98M36k28K17j34k54K8J62K44O4k77R7Mr2k24M02K1
$$ -40 226 -23 5 -96 -140 252 -246 190 -38 179 45 -209 -181 -19 225 289 12 109 113 21 -203 199 220
6877B20j60j40J39M8l0J53O5l68K5N3R1j17k34L65j69N8K43k90N2N8k81L14l33
$$ 220 60 -80 59 107 77 230 295 -73 -48 5 96 -21 -255 110 -59 -1 242 -48 4 62 -219 95 -238
6900b38K82j50K7j79nK55M7r9k06L04k99L27k40K20r0j09O6J14rQ6P1j14j19J28
$$ -238 44 -106 -79 -258 -263 -8 39 -60 -266 38 -261 66 -174 46 -44 -153 -87 27 18 104 175 61 -58 70
6924G0j23o7L33m05L27l52l2N14j05J1p9l0J9j12j02J00j12Q8j06J8K84k77J17
$$ 70 -53 -120 213 -192 135 -217 -249 265 160 171 92 62 81 -31 -133 -33 -145 -57 -163 -145 139 -138 -21
6947b1J82l4o5m0k10L3J33K66k26j33J61j86K4O3j32J68j58R4K97m17L43k11R5
$$ -21 161 127 62 22 -188 -155 -22 244 18 -115 46 -140 -116 -53 -185 -17 -175 -81 216 -201 142 -69 26
6970B6m8pN7k24N05m1k50J44P3k44j82m4J98q7j36J70P6R4J92l12J87j50J37p8
$$ 26 -22 -29 28 -196 309 268 18 162 235 -9 -191 -235 -37 -124 -260 -90 -14 80 272 -40 147 -3 134 56
6994E6pq3L2j45O3j77K45J54j05j95L8K98k40LQ6l7J08o9J72r6r8M8k7Nm6k7j15
$$ 56 49 -34 -2 -147 -84 -261 -16 138 33 -162 -124 174 -66 -63 23 -14 94 25 197 101 3 51 24 29 -17 -44 -159
7021a59K40l9Pl99N07j34q1Q7M7J72j76m7K9o7n8K49j33m8l7L26l67K41k46K52
$$ -159 81 42 49 -350 157 23 -58 29 76 248 72 25 54 -13 -71 178 45 -3 -40 286 -81 160 -86 166
7045A66j86K17l30J50N3j39mJ86O8l7k02K35l55M5j43J81N0j42J34J35k7J07P
$$ 166 -20 197 -133 17 70 -69 -73 113 181 144 -58 177 -178 -133 -276 -95 -45 -187 -53 82 55 162 169
7068A69l69K64J08k09J92k40j20L51k55K33k22L2J9J32p8J37l20J47N7l9L2q1
$$ 169 -200 64 172 -37 155 -85 -205 146 -109 124 -98 -66 -47 85 7 144 -176 -29 28 -11 21 -60
7090f0k17J65K25k52J93J02j54N0k35J81L37l23J27M0l57J84K98k73j7J86j01
$$ -60 -277 -112 113 -139 54 156 2 52 -183 -2 335 12 139 179 -178 6 304 31 14 200 99
7111I9j06J25J8j99J87k4j33J49k66P3J96o10M39K49j89j37K24N5J5p1m6l8l25
$$ 99 -7 118 136 -63 124 100 -33 116 -150 -77 119 -491 -52 197 8 -129 95 150 165 94 48 10 -315
7134c15J40lP3K6K0m5r0J26n6J07j06J32p9J51r5k9j2J53l25L06K8k83o9Q6J3
$$ -315 -175 -178 -105 -79 -59 -104 -194 -68 -124 -17 -123 9 -70 81 -14 -43 -55 98 -227 79 107 -176 -245 -159 -146
7159a46J2J22j62J89RL3J17r9J30l40K20l30n8M09k30J11J79l29K09lK8j21q7
$$ -146 -134 -12 -174 15 24 57 174 75 205 -135 85 -245 -303 106 -124 -13 166 -163 46 43 71 -50 -137
7182a37j08K73K8r5r7K40k14K38k81K67j80k53L47o2P5j71J42Q0p2p2K05l88L76
$$ -137 -245 28 56 -39 -136 104 -110 128 -153 114 -66 -319 28 -34 41 -130 12 92 20 -52 153 -235 141
7205A41J74l57J08j77o4M88k52J00J11k3k42j1j79k7J60k1N3Q1j57j91J71J92
$$ 141 315 -42 66 -111 -175 313 61 161 272 249 7 -4 -183 -210 -50 -71 -18 63 -94 -285 -114 78
7227G8j81L01m45K59K4p6qk49M09j99J52n5R2Nk00O3L4j72K99k75K38lK0mL7l39
$$ 78 -103 198 -247 12 36 -40 -48 -297 112 -87 65 10 102 107 -93 -30 4 -168 131 -144 94 91 111 107 144 -195
7253a95K25n6QP7k69K17j41M4n6K00j65m1k8J26q2J51J09pn9O5l62K43L42j95
$$ -195 30 -26 -18 59 -210 7 -134 -90 -146 54 -111 -152 -180 -54 -136 15 124 117 58 123 -239 4 346 151
7277A51r0r2Lj75L57j54M4m5P1J08P0l66Q5m1J82l76R9K23N5k88J46pn3j85L57
$$ 151 61 -31 -28 -203 154 0 44 -1 70 178 248 -118 -33 -74 108 -268 -169 54 109 -179 -33 -40 -93 -278 79
7302G9k80K17M4k17L17m67K58j94M27N3n0p9m3k40J3L47k07K29k96K7J7L7J72
$$ 79 -201 16 60 -157 160 -307 -49 -243 184 237 187 108 65 -175 -162 185 -22 207 -89 -62 -45 -8 164
7325A64l3k31K25J46j07p3K1j01J65l84J38R0j02k16K24N6l0J04j21J68j88q7
$$ 164 131 -100 125 271 164 91 112 11 176 -208 -70 20 -82 -298 -74 -18 -48 56 -65 103 -85 -172
7347a72K67q5k63N02j76o0Q1j73j8Q4j17J63QJ15k06K5R7j53L01J0l20L3K80k52
$$ -172 95 10 -253 249 73 13 94 -79 -97 -13 -130 33 41 156 -50 -25 72 -81 220 230 -90 -57 223 -29
7371b9J76j80k70M75l06J07J29j05q6j19K64k03J59j58K05k91K29n5l1J14L0K
$$ -29 147 -33 -303 172 -134 -27 102 -3 -89 -208 56 -147 12 -146 59 -232 -3 -58 -89 25 55 57
7393E7Q0j73Q8j39L09k01m7K9R4p7j52J31p9K2j26O0j2K98k56J6l7k4K72j56M01
$$ 57 137 -36 52 -87 222 21 -26 3 97 20 -132 -1 -80 -58 -184 -124 -136 162 -94 -78 -115 -139 133 -23 378
7418C78n23O3j75K25J70J29l74J0j5J35k1j44L1J07J33j6L0k56J79j12J20N5k46
$$ 378 -145 -82 -257 -32 138 267 -107 -97 -112 23 2 -142 -111 -4 129 113 143 -113 66 -46 74 129 -117
7441a17J63P6m07L04P2j82K81m71K19J16rO5j95K18k38r5l1K87j5r8K7N5K64j40
$$ -117 46 122 -285 19 91 -91 190 -281 -62 54 45 110 -85 133 -105 -200 -231 56 41 -57 -30 25 289 149
7465A49k28J91q7k72J68K32m13M25p5k30L3K23j58pR0k04k8J79n2P3K5J61qk52
$$ 149 -79 112 25 -247 -79 153 -260 165 90 -140 -107 116 -42 -49 41 -163 -191 -12 -64 9 34 195 187 -65
7489f5J42j79j45R1R0M4L2K44k80k4M0O4N5k77Q5J34qp4k61K68k88J2M48J6n5
$$ -65 77 -102 -247 -156 -66 -22 10 254 -26 -50 -10 54 109 -168 -83 51 43 -31 -292 -24 -312 -300 148 164 109
7514A09j05j98l4J45n4K97m20K16J3K7R1p3J2J23p5j14J83l33J42L5K8L92l89
$$ 109 4 -194 -228 -83 -137 160 -260 -44 -31 -4 87 14 26 149 74 -40 143 -190 -48 -13 15 407 18
7537A8J33l65K17J73k27J62k57M88j05k15J38k23kj53L33j37P3K6J26k50O2j29
$$ 18 151 -214 3 176 -51 111 -146 342 237 22 160 -63 -65 -218 115 -22 51 77 203 -47 15 -114
7559a14J78R2j75J47o6k27J86k16N5n0K8J62J74j57j70J07J46N9j16P4j42j80
$$ -114 64 156 -19 128 62 -165 21 -195 -140 -190 -162 0 174 17 -153 -46 100 159 43 117 -25 -205
7581b05M42l47K35k09r2J94l7Pj00N9P5N4k27n6mL92l36J16n2K61k36J77J44k04
$$ -205 237 -110 125 -84 -176 18 -19 -12 -112 -53 22 76 -151 -207 -211 181 -155 -39 -91 170 -66 111 255 51
7605E1j22k45K35J15n3P9K6J01j19l70K09J32j86J56P7j46O4J96l50M66k72j76
$$ 51 -71 -316 -81 34 -19 60 86 187 68 -302 -93 39 -147 9 86 -60 4 200 -150 316 44 -132
7627a32k2M1j29L59r0mK5Q2j32n2K0Q0q1r4J91J69j78j4Q7k32J71Q1j68j78O1
$$ -132 -154 -113 -242 117 27 23 48 130 -2 -54 -34 46 -35 -129 62 231 53 39 126 -106 65 146 -22 -200 -139
7652a39Q7J31P7k93O4P6J8k51M42k56r9J90J53j76L1Lm05K12L27l85O6K74l64
$$ -139 -52 79 156 -137 -73 3 21 -230 212 -44 -143 47 200 24 55 58 -347 -135 192 -193 -127 147 -217
7675b17J6J51O8k36J00J70j67O8k81O63j73J06k57J0p8m9O4Q5K7j11j26K1m7J34
$$ -217 -201 -50 18 -218 -118 52 -115 -47 -328 335 162 268 11 21 -57 -106 -42 43 70 -41 -167 -146 -193 -59
7699e9K11k77J32K12j15j94k26K06J46J6j64J46P5q2K9j82P5J34k87j29K33K90
$$ -59 152 -125 7 219 104 -90 -316 -110 36 52 -112 34 109 27 56 -126 -51 83 -204 -333 -100 190
7721A90j8k56k8R9J04j07J07J04j88J9j12m4J32M5j86nJ86j68O1l4M0Q3J33j43
$$ 190 172 -84 -112 -13 91 -16 91 195 7 26 -86 -130 2 47 -139 -144 42 -126 -65 -99 -59 24 157 14
7745A4J08j61p2j2P7NJ81l09K43j06k3J09r6j31P7k5L5K3J38j03q8Q9R5O1l73
$$ 14 122 -39 -111 -123 -46 -41 140 -169 74 -32 -55 54 -42 -173 -96 -121 -86 -63 75 -28 -116 -27 68 129 -244
7770b44R9O0l3q2L52j52K58l69N9jJ82j5k17J42Rj36j6K3J33j27K13k23K5j13
$$ -244 -145 -85 -118 -200 152 0 258 -111 -52 -53 129 114 -103 39 48 -88 -104 -81 52 -75 138 -85 -60 -173
7794a73L02o5K3j36o4J15J5n7J77m9m0j49l5L95j82k99J62LJ5K71j47n7k09Q5
$$ -173 129 64 87 -49 -113 2 17 -40 137 88 48 -101 -136 259 77 -222 -60 -57 -42 229 82 25 -184 -99
7818i9K50%k50m1J23J17J25j29j3n1N4j9KN3j01K42k23J1j78M9M7k27K08K29k32
$$ -99 151 151 -99 -140 -17 100 225 96 83 32 86 67 69 122 21 263 40 51 -127 -78 -31 -258 -50 179 -53
7843e3J96k34J89m1J20j21j7PJ76l89K25M5l02M81k15o7m4J0P9j32J26L2k87J45
$$ -53 143 -91 98 57 177 56 39 46 222 -167 58 103 -199 282 67 0 -44 -34 45 -87 39 71 -216 -71
7867g1n2J03j6k7N9K75j97k04J34k3j49L25j63r9J37Rm1K2K00l46k8J67p7J26
$$ -71 -123 -20 -36 -63 -4 271 74 -130 4 -19 -168 157 -6 -105 32 41 0 22 222 -124 -152 15 -62 64
7891F4k23N8J31J02k22RP2K24p4j76L4k58J7P7O8PJ67O4k97L38k86J01O7j78K70
$$ 64 -159 -101 30 132 -90 -81 -9 215 141 -35 -1 -259 -242 -165 -97 -90 77 141 -156 182 -104 -3 64 -114 156
7916A56j83L20l84P7J91m9k17k20L18Qk1l4%n0L01k80J15P6j7J4m7n1O2k65L82
$$ 156 -27 293 -91 -14 177 128 -89 -309 9 17 -4 -38 -38 -88 213 -67 48 124 107 121 74 23 85 -180 202
7941B02l10J65J71m15K61q6j96K24Q1j26Q7rJ4j18J98k23J15O6k40L64j94J16
$$ 202 -108 57 228 -187 74 -12 -208 16 97 -29 58 49 63 -55 143 -80 35 101 -139 225 31 147
7963A47j65m1J3J4Q1j35n0M89m10J39j81P1J25j02J63J7j16l7p0J00j34K31k52
$$ 147 -18 -59 -46 -32 49 -86 -136 353 -57 82 -99 -28 97 -5 158 175 59 22 -48 52 -82 149 -103
7986a03n1K44j02J53j16K51m07J13p5j3K11j80J88m2o1j60R4K4j1j54O2J25o4
$$ -103 -154 90 -12 141 25 276 -131 -18 -93 -106 105 -75 113 71 10 -150 -56 -32 -43 -197 -135 -10 -74
8009g4K32k2k79R8J06n3j07J57J73j93R9j76j60K38P7k39j5R2R6J23k63Q9J2l3
$$ -74 158 136 -143 -45 61 8 -99 58 231 38 137 -39 -199 39 116 -123 -138 -46 50 173 -90 -1 11 -22
8033b2J20p8k9j6j62r7L95N9Jm8r1j23O4k09J16K07Kj40R5Jj7k02L46j96L8o0
$$ -22 98 20 -9 -25 -187 -284 111 170 171 123 32 -91 -27 -236 -120 87 89 -51 44 45 28 -174 172 -24 14 -46
8059d6Q5o3J39k12Q8j09R8K47j64J8j21N9J47j20j00J16k85K73K1K76k52j6Q0
$$ -46 39 -24 115 -97 -9 -118 -20 227 63 81 -40 19 166 46 -54 62 -223 50 71 347 95 79 159
8082A59J1k29j14J68j9l9k7J86p0l2k1j60Q9K84j02j79K12j02j45L8n2K73j8q4
$$ 159 170 -59 -173 -5 -24 -63 -90 96 26 -6 -27 -187 -98 186 84 -95 117 15 -130 -92 -144 129 111 27
8106B7P8j13n1p1J69M2J15J8l49J35L7J94m12j6K84j48K17k76P5R8R3k1j11p7
$$ 27 105 -8 -59 -130 39 81 196 214 -135 0 37 231 -181 -197 87 -61 156 -120 -45 53 146 125 14 -63
8130f3k0p0L13k76jk1O3k0J9J60k19K11J00j22j77J00O7j30qJ64M9l9J22k42j94
$$ -63 -83 -153 160 -116 -117 -138 -75 -95 -76 84 -135 76 176 54 -123 -23 44 -86 -94 70 119 80 202 -40 -234
8155b34L94R9k17q1M9J63k00k49L11k21J28J38j00j38K10j28P5q5L63m63K14J19
$$ -234 160 259 42 -39 10 173 -27 -276 35 -186 -58 80 -20 -158 52 -76 -1 -86 277 -186 28 147
8177A47j50P4L3j26j89N8P1l0J98J28k91J01j16K78
$$ 147 -3 71 104 -22 -211 -153 -82 -112 86 214 -77 24 -92 186
8191A86
$$ Imaginary data points
##PAGE= N=2
##DATA TABLE= (X++(I..I)), XYDATA
0@%%%%%%%%%qJ6j6K4l2M0m8N6p2Q0r6J20j39J70k02K34k77L19l68M29m92N64o44
$$ 0 0 0 0 0 0 0 0 0 0 -8 8 -8 16 -16 24 -24 32 -40 40 -56 64 -75 95 -107 127 -150 169 -199 230 -262 302 -342
32c42P29q26R34j054J187j328J486j660J847k056K282k527K799l092L412l765
$$ -342 387 -439 495 -559 628 -700 786 -874 973 -1083 1199 -1328 1471 -1621 1791 -1974
48a974M148m573N038n548O116o746P452q247R146j0176J1370j2770J4444j6486
$$ -1974 2174 -2399 2639 -2909 3207 -3539 3913 -4334 4812 -5364 6006 -6764 7680 -8806
62h806J9038k2341K6799l3195M3207o1262J04188m02279m30398M96865M96962
$$ -8806 10232 -12109 14690 -18505 24702 -36560 67628 -334651 -765049 -268184 228778
73B28778M29182m1460l71208n54142l27414K5298M18180N05994L28009p7893l94149
$$ 228778 657960 616500 245292 -308850 -636264 -610966 -192786 313208 641217 563324 169175
84A69175n02731k73840R4292M21386M73932K59496j30406m19014m67500k25961
$$ 169175 -333556 -607396 -513104 -91718 382214 641710 511304 92290 -375210 -601171
94f01171J39324M25933M41192K03044j60834m18809m26919j75327J66798M09863
$$ -601171 -461847 -35914 405278 608322 447488 28679 -398240 -573567 -406769 3094
104C094L99268J50418j83646l98602l76307j23720J98540L94149L50725R8084
$$ 3094 402362 552780 369134 -29468 -405775 -529495 -330955 63194 413919 512003
114E12003k15136l91561l29962p2484K27420L88883L12169N1702k35825l80924
$$ 512003 296867 -94694 -424656 -497140 -269720 119163 431332 483034 247209 -133715
124a33715k95795l4067K40637L68744K76193J7305k46757l57198k55554k85K51896
$$ -133715 -429510 -463577 -222940 145804 421997 439302 192545 -164653 -420207 -420492 -168596
135a68596L45706K31574j9181k57464l36090k09340L9921K62486L26067J90600
$$ -168596 177110 408684 389503 132039 -204051 -413391 -373470 -110984 215083 405683
145D05683n6936k65405l14606j74087P1289K68332L03600J59164q1383k68293
$$ 405683 348747 83342 -231264 -405351 -334062 -65730 237870 397034 315651 47358
155D7358k91349j40910R2170K68271K78879J22400j04135k66678k65870j03876
$$ 47358 -243991 -384901 -292731 -24460 254419 376819 272684 6006 -259864 -363740
165c63740J16558K63771K51762Q7438j28390k61611k38394p2691J36797K59778
$$ -363740 -247182 16589 268351 355789 227399 -34212 -272606 -345297 -208500 51278
175E1278K25456N8147j43302k57652k13803m3390J50241K53515K01987K8701j56732
$$ 51278 276734 334881 191579 -66073 -279876 -323266 -173025 80490 282477 311178 154446
186A54446k47621j89247j5449J63598K40977J75149L960j68301k35307j61800
$$ 154446 -93175 -282422 -297871 -134273 106704 281853 285813 117512 -117795 -279595
196b79595O739J71518K30595J49299j8376j74861k24645j38215L0081J77223K17687
$$ -279595 -272856 -101338 129257 278556 260180 85319 -139326 -277541 -247460 -70237 147450
207A47450J26547m1117j80361k10219j14200M9640J82609K02233J02356n7824
$$ 147450 273997 232880 52519 -157700 -271900 -222260 -39651 162582 264938 207114
217B07114j83271j95554r0906O6221J82845J89268Q0703p3370j82002j81236o9895
$$ 207114 23843 -171711 -262617 -196396 -13551 175717 256420 183050 1048 -180188 -250083
228b50083Q2354J82051J72496N9745q9023j81459j63347m8381R4633J80585J54809
$$ -250083 -167729 14322 186818 246563 157540 -23919 -187266 -235647 -141014 39571 194380
239A94380L7492j00593j78237j47792k8905J05385J75257J39855J9796j11292
$$ 194380 231872 131279 -46958 -194750 -223655 -118270 56987 196842 216638 105346
249A05346j73394j31957j1557J15700J70478J22720K342j18582j66926j12923
$$ 105346 -68048 -200005 -211562 -95862 74616 197336 199678 81096 -85830 -198753
259a98753O975J21595J63522J04850j5210j23810j58552r6701K2712J27680J54179
$$ -198753 -191778 -70183 93339 198189 182979 59169 -99383 -196084 -173372 -45692 108487
270A08487Q9365k9870j30362j50217q0554L6502J31520J45211P1262m3723j32432
$$ 108487 197852 167982 37620 -112597 -193151 -156649 -25129 120082 191344 147621 15189
281A5189j40625o3409M9697J31837J34468N5347n5756j32131j28495m8302O1010
$$ 15189 -125436 -188845 -139148 -7311 127157 182504 126748 -5383 -133878 -182180 -121170
292a21170J32964J23455M0866o6202j32501j17570l2378P1293J31552J11880K5050
$$ -121170 11794 135249 176115 109913 -22588 -140158 -172536 -101243 30309 142189 167239
303A67239p5121j29627j05747j7470P9560J27467R9188J1438q3006j26050r3129
$$ 167239 92118 -37509 -143256 -160726 -81166 46301 145489 156927 73921 -52129 -145258
314a45258n271Q5378J23763Q6963j584q7900j21872q0930Q442R0527J18751P4951
$$ -145258 -150529 -65151 58612 145575 143991 56091 -65781 -146711 -138269 -47742 71009 145960
326A45960j4567r2457j14913o9035J9426R4688J11382O2271k3780r5623j08394
$$ 145960 131393 38936 -75977 -145012 -125586 -30898 80484 142755 118975 23352 -85042
337h5042n5939K9225R6485J05869N0143l4269r7379j01497m4548L9058R7569R6843
$$ -85042 -140981 -111756 -15271 90598 140741 106472 9093 -92404 -136952 -97894 -325 96518
349I6518L8786m3101r7359r2395l2866M6508R7210Q8707K6762m9990r6949q4967
$$ 96518 135304 92203 -5156 -97551 -130417 -83909 13301 102008 128770 78780 -18169 -103136
361a03136k1634N3357R5603Q0363J6568n6790r4610p5989j1428N9692R2993P0980
$$ -103136 -124770 -71413 24190 104553 121121 64331 -30279 -106268 -117696 -58004 34989 105969
373A05969O288o1898r1978o6587j173O3179R0322O2341k867o5506q8052n8259
$$ 105969 112257 50359 -41619 -108206 -109379 -46200 44122 106463 103596 38090 -49962 -108221
385a08221P402O7599Q6040N3965j1436o8634q3983m8749J5204P0058Q1473M3948
$$ -108221 -100819 -33220 52820 106785 95349 26715 -57268 -106017 -90813 -20755 60718 104666
397A04666j8966p0158p8970l9519K2820P1008P6482L5275k6680p1674p3381l1748
$$ 104666 85700 15542 -63428 -102947 -80127 -9119 67363 102638 75958 4284 -69097 -100845
409a00845K9780P2526P0674K7041l2701p2381o7836k2769L5190P1744O4700J8819
$$ -100845 -71065 1461 72135 99176 66475 -5906 -73742 -96511 -61321 10423 75123 93942
421I3942l7702p1180o1471j4702M0020P0412N8282J1160m2925o9727n4907p105
$$ 93942 56240 -14940 -76411 -91113 -51093 19319 77601 88761 45836 -23891 -78798 -85903
433h5903M4564O9435N1301L602m6444o8262m8536J18M7967O6874M5471l690m9503
$$ -85903 -41339 28096 79397 82999 36555 -31707 -80243 -80125 -32158 34716 80187 76497 26994
446B6994o5010m1791O045N0629O3605L8586r386n1986o2376l4788J2208N2733
$$ 26994 -38016 -79807 -73762 -23133 40472 79058 69672 17686 -44690 -79478 -67270 -14537
458a4537O0769L1770j5488n2866n8695k8411J8338N3804N6320K5657k0619n3713
$$ -14537 46232 78002 62514 9648 -49047 -77458 -59120 -5316 51004 76661 56042 2329
470B329n3876k2483K3413N4450N1647J9143k5425n4335n0318j6008K7035N4305
$$ 2329 -51547 -74030 -50617 3833 55480 74623 49198 -5137 -55455 -71463 -44428 9877
482I877M7978J3208k9733n3570m6099j0601L1044N2508M3184P512l2436n2246
$$ 9877 57855 71063 41330 -12240 -58339 -68940 -37896 14612 57796 65308 32872 -19374
494a9374m0096m460L4107N1272L8088J302l5725n0612l5469J802L7310N0564L3712
$$ -19374 -59470 -63930 -29823 21449 59537 60839 25114 -25498 -60967 -59165 -21855 28709 62421
507F2421l774l7898m9608l1032N215L8442M8282K8529p305l8924m6385k6468R498
$$ 62421 58647 20749 -28859 -59891 -54676 -16234 32048 60577 53272 14348 -32037 -58505 -49007
520d9007L9090M4316K2821j2858l9720m3121k0846J4857M0981M1739J8039j6916
$$ -49007 -9917 34399 57220 44362 4642 -38479 -59325 -44468 -3487 38252 56291 39375
532C9375m1920m1085j5863J8512M1814M0047J4436j9055m0965l8074j2158K0689
$$ 39375 -2545 -43630 -59493 -40981 833 40880 55316 36261 -4704 -42778 -54936 -34247
544c4247M0293L5767R770k1480l9214l3138o646K3919L9477L1096M082k5820l9435
$$ -34247 6046 41813 51583 30103 -9111 -42249 -48895 -24976 14501 45597 49679 23859 -15576
557a5576k9504k009K7351L9824K8712O93k7819l9437k7569O82K8051L8300K5614
$$ -15576 -45080 -47089 -19738 20086 48798 49491 21672 -17765 -45334 -44652 -16601 21699 47313
570D7313k447k7755l6587k3026L893K8043L4697K0273p057k9453l4494j8134R017
$$ 47313 44866 17111 -19476 -42502 -38609 -10566 24131 44404 37347 7894 -26600 -44734 -35717
583c5717L0295L3399J6513j0993l1431l3888j5549J1941L1531L2612J3958j2118
$$ -35717 -5422 27977 44490 33497 2066 -31822 -47371 -35430 -3899 28713 42671 30553
595C0553l0973l1215j2625J3471L0358K9365J0507j4205k9337k7022p772J6103
$$ 30553 -420 -31635 -44260 -30789 -431 28934 39441 25236 -4101 -31123 -38895 -22792
607b2792L0283K5781N740j7666l0529k4857l927J8976L1126K4194K794j9720l0514
$$ -22792 7491 33272 39012 21346 -9183 -34040 -37967 -18991 12135 36329 39123 19403 -11111
620a1111k3235k415J9999K9401K2173M11k0313k8522j9674O37K0244K7774J7888
$$ -11111 -34346 -36761 -16762 12639 34812 35223 14910 -13612 -33286 -32649 -12405 15369 33257
633C3257k806k1436k7047j6348M836K2202K6899J4874n672k3334k6416j4193P127
$$ 33257 30451 9015 -18032 -34380 -29544 -7342 19557 34431 28759 5425 -20991 -35184 -28057
646b8057K3257K6078J3030p588k3147k4969j1783Q630K3003K3483J0108r313k2887
$$ -28057 -4800 21278 34308 26720 3573 -21396 -33179 -24549 -1546 21937 32045 22732 -155
659a55k2628q396J0966K3133K1652O488j1935k3430k0702n476J2972K3445J9786
$$ -155 -22783 -31179 -20213 2920 24572 31060 19125 -4305 -25007 -30483 -17511 5934 25720
672B5720M444j3784k3356j9292l170J4081K2991J8152K158j4824k2374j6584j175
$$ 25720 30164 16380 -6976 -26268 -29438 -15357 7634 25786 27944 13120 -9254 -25838 -27013
685b7013J5544K1933J5822m29j5799k1736j4148J270J6502K1581J3245k357j7147
$$ -27013 -11469 10464 26286 25857 10058 -11678 -25826 -24556 -8054 13527 26772 24415 7268
698G268k1129j2004L526J7092K0340J0986m171j7777j9948j0241N535J7365J8973
$$ 7268 -13861 -25865 -22339 -5247 15093 26079 21908 4131 -15817 -26058 -20523 -3158 15815
711A5815R216o243j7841j8581p783O898J8146J7464P203q111j7869j6642o000
$$ 15815 25031 18788 947 -17634 -25417 -18519 -373 17091 24294 16183 -1686 -18328 -24328
724b4328Q849J7725J6536M755r337j7701j5360m029J0048J7806J4431L269j0992
$$ -24328 -15479 2246 18782 23537 14200 -3501 -18861 -22890 -12842 4964 19395 22664 11672
737A1672j7111j4126k018J0773J7332J3323J155j1478j7056j2257m03J2035J6324
$$ 11672 -5439 -19565 -21583 -10810 6522 19845 21000 9522 -7534 -19791 -20194 -8159 8165
750H165J1747m91j2158j6457j0691J768J2264J5853J0181k459j2912j5429r092
$$ 8165 19912 19421 7263 -9194 -19885 -18117 -5853 10000 20181 17722 4810 -10619 -19711
763a9711K781J3226J4962Q299l835j2975j4822p499M167J3664J4118O340m962
$$ -19711 -16930 -3704 11258 19557 15722 2747 -12075 -19574 -15407 -1743 12375 18715 13753
776A3753j3619j3780n642O095J3380J3145N115o376j3515j2553l900O466J3650
$$ 13753 134 -13646 -19288 -13193 187 13332 18447 12071 -1444 -13997 -17897 -11431 2219
789B219J1974L329o801j3583j1085k640P593J3204J0691J967q208j3042j0336
$$ 2219 14193 17522 10721 -2862 -13947 -16587 -8994 4210 14901 16868 8660 -4382 -14718
802a4718j261Q647J2665R755M09r085j2449r048k20R167J2462Q465n92r121j2257
$$ -14718 -15979 -7332 5333 15088 15497 6412 -6037 -15085 -15305 -6138 6324 14789 14197 5076 -7181
817g181p691R71R415J1946P324j671r841j1154o717K396J0009J1455N712l176
$$ -7181 -14872 -13901 -4486 7460 14784 13113 3272 -7882 -14599 -12203 -2194 9261 14973 11797
831A1797r908j1049n389L494J0245J0770M392l697j0334j0383m294M072J0283
$$ 11797 1889 -9160 -14549 -11055 -810 9960 14352 10655 321 -10062 -14356 -10284 -1
844aR891L224m163j0138r546l052N098R981R208K433n664j0048q313j998O232
$$ -1 9890 13114 8951 -1187 -10733 -13785 -8687 1294 10502 12935 7271 -2777 -11090 -13088 -6856
859f856R978Q088J202n832j0242p607p25O327R857P349N24p000r564o673N25O677
$$ -6856 3122 11210 12412 6580 -3662 -11269 -11994 -5667 4190 11539 12063 5063 -4501 -11174 -10649 -3972
875c972R249O181m20p474r278n609J286P217R019N179j803p503q739m853K237
$$ -3972 5277 11458 11038 3564 -5714 -11323 -10037 -2820 6199 11378 9575 2072 -6667 -11520 -9283
890i283P362Q161M689k464p406q454l938K882P273Q167L337k818p982p569k794
$$ -9283 -1921 6240 10929 8465 1059 -7395 -11333 -8451 -1178 6989 10326 7508 -474 -8043 -10837
905a0837L800P363P306K690l752p424p256k189M329P510O965J866m188p740o232
$$ -10837 -7037 326 7632 10322 6570 -854 -8110 -10299 -5970 1540 8505 10371 6183 -1557 -7789
920g789j747M891P781N529J282m823p800n141r47N163P355N314J55n182p425m653
$$ -7789 -9536 -4645 3136 8665 9947 5124 -2676 -7817 -8764 -3601 3754 9068 9223 4041 -3384 -8037
936h037l19N474P259M487q42n413o734m589J129N447O298M513j862n601o211m019
$$ -8037 -8356 -2882 4377 8864 8022 2609 -4125 -8714 -7585 -2138 4160 8673 6811 1210 -5001 -9020
952i020J573O068N907L644k210n837o165k640K069N859O069K023k057n943n576
$$ -9020 -7447 -1379 4528 8172 5962 125 -6040 -8680 -6611 -752 5317 7340 5283 -660 -6236
967f236k237K608O229N359K243l012n858n474j635L187O323M879J280l601n874
$$ -6236 -8473 -5865 364 5723 7966 4954 -904 -6378 -8013 -4826 1497 6376 7656 4055 -1819
982a819m251r48L374N815M484M65l383n560m255r7L719N457L750K33m015n777
$$ -1819 -6070 -7018 -3644 2171 6655 7120 3737 -1823 -6078 -6175 -2456 3001 6751 6984 2969 -2808
998b808l605O0M482N422L606p09m064n482l355N14M077N211K927j051m318m608
$$ -2808 -6413 -6353 -1871 3551 7157 6448 2384 -3098 -6453 -5939 -1862 3349 6276 5225 907 -3701
1014c701k760J039M375M671K229j312m239m996j816J917M480M508K161k138m697
$$ -3701 -6461 -5422 -1047 3624 5853 4541 302 -4694 -6510 -4593 -113 4395 6556 4418 -279
1029b79m296j344J659M806M297J446k119m376m002j369K223M498L342Q84k299
$$ -279 -4575 -5919 -4260 546 4843 6289 4170 -206 -4208 -5577 -3354 1144 4486 5370 3071
1044C071m244l594o58K981M271L137K02k934m666l284%L067M913K755K06l121
$$ 3071 -1173 -4767 -5425 -2444 1827 4964 5166 2232 -2434 -5718 -5718 -2651 2262 5017 5223 2102
1060B102m619l063J07L228M153K872k79l162l533k180M43K810L906J877p02l386
$$ 2102 -2517 -5580 -5473 -2245 1908 4780 4501 1339 -2194 -4374 -3931 -1121 2785 4662 3960 574
1076E74l632j701R72L677L838J742j310l848l581k058J463L654L538J781j620
$$ 574 -3058 -4759 -3787 -110 3728 5470 4160 312 -3269 -5327 -3864 -210 3328 5109 3489
1091C489l079l405j533J614L295K868Q94j638l137k970o88K196L385K696K59j858
$$ 3489 410 -2995 -4528 -2914 381 3249 4143 2505 -632 -3602 -4290 -2094 1291 3987 4246 2388
1107B388l692k776o54K441L240K736Q57k326l524k607j24J960L088K540J15k309
$$ 2388 -1304 -4080 -4734 -2293 947 3683 4540 2214 -1310 -3917 -4041 -2081 1007 3547 3662 1353
1123A353k881k001J64K150K965K233o04k702k823j724R00K256L356J503o37k641
$$ 1353 -1528 -3529 -3365 -1215 1750 3983 3379 677 -2146 -3870 -2970 -714 2642 4145 3508 867
1139H67l086j565R14K441L036J415m29k801k872j074M73K826K277R43q88k747
$$ 867 -2219 -3784 -2870 -429 2607 4022 3593 792 -2080 -3154 -2681 145 2422 3365 2477 -270
1155b70k222r28J156K681J958R47j437k845k243n39J584K598K376K71j243k693
$$ -270 -2492 -3420 -2264 417 2375 3322 1885 -960 -3203 -3742 -2158 440 2816 3087 1844 -849
1171h49k283l98J636K606K094N06j876k701j571K26J461K455J702O1j922k338
$$ -849 -3132 -3530 -1894 712 2806 3312 1436 -1265 -2836 -2610 -1149 1306 3008 3069 1147 -1191
1187a191j729L39J820K433J415l11j878k533j421K13K314K310J263l28k306k369
$$ -1191 -2920 -2581 -761 1672 3087 2776 898 -1635 -3056 -2843 -529 1781 3044 2716 410 -1959
1203a959j071K58K541J675J343n48k151j950j102Q98K121K272P28r38j887j810
$$ -1959 -3030 -2772 -231 1444 2787 2239 88 -1862 -2964 -2066 55 2327 3055 2117 230 -1580
1219a580j058R82K333J698M02p94j992k015m23J141J976J750K44j478j830j789
$$ -1580 -2638 -1656 677 2375 2777 1983 -9 -2024 -2447 -1306 670 2420 2664 1186 -644 -2433
1235b433k44J206K086J541K9j417j821j548q0J535K154J083L99j522j895j339
$$ -2433 -2677 -1471 615 2156 2185 768 -1053 -2601 -2681 -1146 1008 2091 2490 968 -927 -2266
1251b266K98J157K125J270l03j518j749r95J08J767J510R18o28j186k130l85L28
$$ -2266 -1968 -811 1314 2584 2281 763 -986 -1981 -1873 -106 1404 2322 1694 508 -1622 -2007 -1679
1268a679J540J532P34o00j562j637n87N06J479J533P48m52j829j386m53Q22J119
$$ -1679 -139 1393 2127 1527 -35 -1672 -2259 -1753 -274 1259 2007 1555 -274 -1660 -2113 -1291 -172
1285a72J690N44q25j528j266k60Q27J302J331K69j039j533j088J38P22J698J157
$$ -172 1518 2062 1237 -291 -1557 -1817 -990 312 1643 1912 873 -660 -1748 -1610 -888 810 1967
1302A967j11r94j676q40k77J077J334J386L17j508j386j015K63Q79J480N87R5
$$ 1967 1856 862 -814 -1654 -1931 -854 480 1866 2183 675 -711 -1726 -1463 -584 896 1483 1578
1319A578r86j612o48O53J034J191P41o32r26j702o05M45J371J392M65k72j420
$$ 1578 592 -1020 -1668 -1015 19 1210 1951 1319 393 -1309 -1914 -1469 -98 1294 1759 1487 67
1336F7j125p46O35J248Q76O83n88r98j056o90P17J088J230J77p93j037j270j44
$$ 67 -1058 -1804 -1169 79 955 1638 1050 52 -1004 -1694 -977 111 1341 1518 725 -312 -1582 -1726
1354a726P84J234J214R5o89j303j029k95P81J334Q90q7m37j162r55j35J041R39
$$ -1726 -942 292 1506 1601 912 -391 -1420 -1715 -934 400 1290 1203 766 -396 -1351 -1486 -445 494
1372D94Q22j55q73r83p27L10R14J274L94l54p36r24r55L67J249R37M71k03m47
$$ 494 1316 1161 288 -695 -1422 -1112 -198 1076 1470 1116 380 -544 -1499 -1132 117 1054 1525 1322 875
1391H75j508n96K22R31R47L94l99m04j160m77M78R47Q65K43n75j059r33k14O75
$$ 875 -633 -1229 -1007 -76 871 1265 866 462 -698 -1175 -697 250 1115 1358 783 -276 -1209 -1423 -748
1410g48R60R02K05q21r77q50l70N42J267N96K4o23o95p51o8N78R27N41K06p60
$$ -748 212 1114 1319 498 -479 -1329 -1699 -1157 110 706 730 107 -588 -1339 -1407 -829 98 639 845 85
1430H5n11r96J42R97O83N88K9q01p62n89Q4N33J005P48l60p58o13r1l99J088P15
$$ 85 -426 -1422 -1280 -283 400 988 1017 216 -546 -1135 -1051 -518 487 1235 875 117 -496 -587 -986 102 817
1451H17M49Kr34m48o05K29O23P79M73m36r85l88l26L96N54N12M24m39m55q53m25
$$ 817 1266 1268 334 -114 -719 -490 133 912 1385 949 -36 -424 -750 -354 200 712 1136 697 242 -611 -1036
1472a036M59Q33M15N96o22q16p47k05M78N07R15J30p47o54m57J39J89O52L82M90
$$ -1036 -577 256 671 1267 645 -171 -918 -1123 -645 -138 777 907 160 -494 -951 -812 -623 29 411 901
1492I01q47l08n15j68N32N58M18j02k74p19m86J56O00Q07K69k3o65o33k60K84
$$ 901 54 -254 -769 -937 -405 153 571 469 195 -524 -1010 -854 -254 553 822 799 134 -499 -759 -475
1512d75M59K93P27l27m22o81k42J72P39L99K04j04n67o66j64K15M96N40K34j90
$$ -475 -16 277 1004 677 255 -426 -668 -496 243 642 846 742 175 -491 -655 -440 56 596 830 640
1532F40o98o06l3M51M16K05M76l02p41l09k41N11N23M25j23k09p59n17l5M23Q79
$$ 640 -58 -664 -697 -246 170 375 851 549 -192 -501 -742 -231 292 717 594 385 -374 -891 -926 -503 376
1553C76M53l16l41l44n44N4M75M96J72K29m16l79l78K5N76L45K41j02m29o19j48
$$ 376 829 513 172 -172 -716 -662 -187 309 481 710 294 -85 -463 -438 138 483 724 622 193 -426 -574
1574e74K75L05L17M43k93k94n33m47J52M32N92K31J05p13k68k24m6L76O53j02
$$ -574 -299 6 323 766 473 179 -354 -801 -649 -217 375 606 711 -2 -270 -494 -540 -164 489 387
1594C87k12j67l59J95m8N38K11J50m76j89j25n56L31P56J64j46No10l01nj1Q12
$$ 387 175 8 -351 -156 -204 334 545 695 219 30 -95 -651 -320 436 600 454 459 -151 -452 -457 -468 344
1616C44M6P6m27j71m96L94Q2L53M10k67n47o8l36m0O02m2N47J40r81p2j13M8M03
$$ 344 390 466 39 -132 -628 -234 -152 201 611 344 -203 -271 -607 -647 -45 -87 460 600 -381 -453 -566 -518 -115
1639a15M84K20O3o47m93K17j05M57N40k61J32m43k20l72J88O09J82L48l82l95
$$ -115 369 589 652 5 -488 -271 -376 81 621 360 492 49 -171 -543 -355 254 436 784 402 7
1659Gm17j91M22j2N59l6k6l72n84M87L7J55L66m2k53j10k65k54N42K81J48q9j27
$$ 7 -410 -601 -179 -191 368 332 306 -66 -650 -163 -126 29 395 353 100 -10 -275 -529 13 294 442 353 226
1682B26k92k30k28N24J47KK81k25j78m52J21J02L36M18l01j81k12n30M27J73M35
$$ 226 -66 -296 -524 0 147 149 430 205 27 -425 -304 -202 134 552 251 70 -142 -672 -245 -72 363
1703C63L7m9j23n45J1M6L64J88k8j34Lm61J44j07J95N24j03j19l57J3k89L30K46
$$ 363 400 351 228 -317 -306 -260 104 292 264 130 133 -328 -184 -291 -96 428 325 206 -151 -138 -427 -97 149
1726A49j15M88k29n37m8k83K60K94N18k15j63q8k49j63L29J99K65r9j76l38n6
$$ 149 34 522 293 -244 -292 -575 -315 -21 497 282 119 31 -218 -381 -52 147 412 313 137 -201 -257
1747b57p4K28Q2K48p4k79k4P2k29L83k02M64O1l55l37J16j31O04j36j2K36m66
$$ -257 -331 -103 -21 227 153 -126 -150 -78 -307 76 -126 338 399 44 -293 -177 -308 296 160 148 384 -82
1769h2q7j80Q9O22l8P1k54q9l10k0l2L80jLl4J4m63m3O48j61K20j04km28M1J63
$$ -82 -169 -349 -260 362 324 395 141 52 -258 -278 -310 70 69 72 38 52 -411 -454 194 33 253 149 147 -281 -240 -77
1795g7K4J86L24j34k00l75o6J26P6j5L38k09J81k88j00P4J06J46O6k83p0k13n1
$$ -77 -53 133 457 323 123 -252 -318 -192 -116 -131 207 -2 179 -109 -209 -135 -29 117 183 -100 -170 -383 -434
1818d34Q7K75M05k4j47k91K3j04k1J6N81j77J9j77j22j23n0K50J60Q6n1k06q2
$$ -434 -347 -72 333 309 162 -129 -106 -210 -231 -215 366 189 208 31 -91 -214 -264 -14 146 232 181 -25 -107
1841a07m9J68J31J10p4l51j18J78m51L12L98L24M9m39j2k1j09j5P5J65m2J34q0
$$ -107 -156 12 143 253 179 -172 -290 -112 -563 -251 147 471 520 81 69 48 -61 -76 -1 164 122 256 176
1864A76k90J47K29l36J22l47L37j38K8j76K62M00k3k90j81j88k16K02J97J51N5
$$ 176 -114 33 262 -74 48 -299 38 -100 -72 -248 14 414 391 101 -80 -268 -484 -282 -85 66 121
1885A21J2k51J30m03K71J37j8L3p7L09m44J41j8K63N5o6j37l56L11k45L30m3J5
$$ 121 133 -118 12 -391 -120 17 -1 32 -45 264 -180 -39 -57 206 261 195 58 -298 13 -232 98 55 70
1908G0K99j63j67K5j72k30K92J87j6P4m3j99J28M5n4Q9K23l65j48J75K0M0k45
$$ 70 369 206 39 64 -108 -338 -46 141 125 199 156 -43 85 130 76 165 388 23 -125 50 70 110 -135
1931a35K90K35l26l81j76L62R1J96K2N1j44R3k09J41k24J26l5l41L42J1l95K50
$$ -135 155 390 64 -317 -493 -131 -40 156 178 229 85 178 -31 110 -114 12 -23 -364 -22 -11 -406 -156
1953a56kMK46j00M7l69N3K86L1j06j44K58j21j86l4J30q8J47J46p1k26K49j07
$$ -156 -158 -154 92 -8 39 -330 -277 9 40 -66 -210 48 -73 -259 -293 -163 -251 -104 42 -29 -255 -6 -113
1976a13q8K79m4o4P6j28k13J45K22N1L7l5k72M0l8n4L30OK3p0j77K58l95K58r6
$$ -113 -201 78 34 -30 46 -82 -295 -150 72 123 160 125 -147 -107 -145 -199 131 137 160 90 -87 171 -224 34 -62
2001f2J36k37L65J20m89M9M1r1K51M8l35J55Nk9N9p0k0J14n0k01L86l42L92N4
$$ -62 74 -163 202 322 -167 -118 -77 -168 83 131 -204 -49 -44 -73 -14 -84 -104 10 -40 -241 145 -197 195 249
2025B49j25j62J49l69K21j13J47j3J12j00K57j44o32M87j17O11k80K9l09Jl3J45
$$ 249 124 -38 111 -258 -37 -150 -3 -16 96 -4 253 109 -523 -36 -153 458 178 207 -102 -101 -134 11
2047A1k0j81N92j71j56m11L09k72L35N4L2m1k2L6l22K92l84N08k06J80l6k42J34
$$ 11 -9 -190 402 231 75 -336 -27 -299 36 90 122 81 59 95 -227 65 -319 189 -17 163 127 -115 19
2070A9n4J15mM3j84k2k2l9K52m9j29J11j58K58k51R7j33o2M51J61l17j14R7l06
$$ 19 -35 80 76 119 -65 -87 -109 -148 104 55 -74 37 -121 137 -114 -17 -150 -212 239 400 83 -31 66 -240
2094b40L13o9R7r8P8po0n7j43M14m8J98j60j56j19J53j00M8j00J36k13r9o9L01
$$ -240 73 4 101 3 81 74 14 -43 -186 228 180 378 218 62 -57 96 -4 44 -56 80 -133 -232 -301 0
2118@J59k54J4K9J86j96J35k01J23l15N17j05k31N6k79M12j08o2J24J8J40k35
$$ 0 159 -95 -81 -52 134 -62 73 -128 -5 -320 197 92 -139 -83 -362 50 -58 -120 4 22 162 -73
2140g3j5K53j86K36l43K63k84m5O2K52j61L7R1j77J97o0j4j12L40k74JK01j44
$$ -73 -88 165 -21 215 -128 135 -149 -194 -132 120 -41 -4 87 -90 107 47 33 -79 261 -13 -12 189 45
2163D5o4k73M5J58J81R5j75K1K7j53N07n02L40k23O8k75j92L72L0O6l2l6o5O8
$$ 45 -19 -292 -247 -89 92 187 12 33 60 -93 414 -88 252 29 97 -178 -370 2 32 98 66 30 -35 33
2187C3k40J36n1K87L3j64k16J0R6k01K69J5L6N8Q1k47k14L00m0M0K70l85K18j31
$$ 33 -207 -71 -122 165 198 34 -182 -172 -76 -277 -8 7 43 101 182 -65 -279 21 -19 21 291 -94 124 -7
2211gJ3j82r2L90j41r6J48j63J20L3l12J27K71m2m9o8N9J30m01N27k88J12l29
$$ -7 6 -176 -268 122 -19 -115 33 -130 -10 23 -289 -162 109 67 18 -50 9 139 -262 265 -23 89 -240
2234b40J86j51J24Q9J77j5l01K52k9qj45J1p1K65l3m03K43M1l34M55p5k04L08
$$ -240 -54 -205 -81 8 185 170 -131 121 92 84 -61 -50 -121 144 111 -292 -49 -8 -342 113 38 -166 142
2257A42k05q7K87l14Q2OJ16J18P7j59j8q4P4j19K10l4l61N59K7j75j38Q2O2M7
$$ 142 -63 -150 137 -177 -95 -89 27 145 222 63 45 -39 35 -84 126 92 -269 290 317 142 4 86 148 195
2281A95m32K04J95l28R8k56M93k88Q3Q1j84L54j44K2m2J3K4j05j02J83k29O2J61
$$ 195 -237 -33 162 -166 -68 -324 169 -119 -36 45 -139 215 71 93 51 64 88 -17 -119 64 -165 -103 58
2304E8j18J40J03k34K01o0p0r4k7o6L28l6j14J07j93K16j86j21K48j48J4J10J17
$$ 58 -60 80 183 -51 150 90 20 -74 -101 -167 161 125 11 118 -75 141 -45 -166 82 -66 -52 58 175
2327A75j95K05j55j0k19J32J97k08J66m42M53l9j81J32l7J45k63kl3K54R7R5j21
$$ 175 -20 185 30 20 -199 -67 130 -78 88 -354 99 60 -121 11 -26 119 -144 -146 -179 75 172 267 146
2350A46J14j74p4J18r1n7J01k54J37L0P0%j01P8P4k91K05O6o0J66j30j75J59J0
$$ 146 260 86 12 130 39 -18 83 -171 -34 -4 66 66 -35 43 117 -174 31 97 37 203 73 -102 57 67
2374F7l3L1R0k37l00K06J16L0m7o3j1K54O1k96M0J34j46J36O7rj38K73k43K1N0
$$ 67 34 65 155 -82 -382 -176 -60 -30 -77 -140 -151 103 164 -132 -92 42 -104 32 99 90 -48 225 -18 3 53
2399E3k34J20l7K03N0j77RJ88m50L89j97o2M70k92j16J04n7r0K29k19K36j02j67
$$ 53 -181 -61 -98 105 155 -22 -13 175 -275 114 -83 -145 325 33 -83 21 -36 -126 103 -116 120 18 -149
2422a49m8J23k0J29Ko8O8J23rj89r9MJ28J0O5o5J35k40R6r9R0k54J59K76k37O3
$$ -149 -197 -74 -94 35 37 -31 37 160 151 -38 -137 -133 -5 5 70 5 140 -100 -4 -103 -13 -267 -108 168 -69 -6
2448fJ22p4J34m05M6L03k07J55r0n0NkJ04p9J3J39o3K78n8o12L64l6j16K3J39
$$ -6 116 42 176 -229 -183 120 -87 68 -22 -72 -67 -69 35 -44 -31 108 45 323 265 -347 17 -19 -135 -112 27
2473B7m0J29l83J65J26M0J27j42J1j95L03l53J86R7k37K66k22J47J4k75K06P1
$$ 27 -13 116 -267 -102 24 64 191 49 60 -135 168 -185 1 98 -139 127 -95 52 66 -209 -3 68
2495F8j46M9L30j18m0N6l48R4L48k85j30N8O6k32L01j02q5K1L39k2O1j18Ml5k86
$$ 68 -78 -29 301 183 143 199 -149 -55 293 8 -122 -64 2 -230 71 -31 -116 -95 244 222 283 165 169 134 -152
2520a52k47M63ml0J01o7n5n6o2N6k4lJ97k76K2K63j47N0m9K79j76J3Q5j72j98
$$ -152 -399 64 60 30 131 64 9 -47 -109 -53 -77 -80 117 -159 -137 126 -21 29 -20 259 83 96 181 9 -189
2545a89L96j4m81N65k98l0J15j05J15j00N4M0j24K14j55n6j71qL3J56K00Q4r7
$$ -189 207 193 -288 277 -21 -51 64 -41 74 -26 28 68 -56 158 3 -53 -224 -232 -199 -43 157 241 144
2568A44m7l0Q4j40m23N56j74J79j25J23p4p9NJ15m5l09K61K25m5j62j58J1M13
$$ 144 97 67 151 11 -412 144 -30 149 24 147 73 -6 -1 114 69 -240 21 246 201 39 -119 -108 305
2591C05k63j07l02N06P8j73r2J84j84J19j04k1k1kK11p7K6k71J85K06l80J66j93
$$ 305 42 -65 -367 139 217 44 -48 136 -48 71 -33 -54 -75 -77 134 57 83 -188 -3 203 -177 -11 -204
2614b04M23j52K5j14JJ62N5l58K14J7n4MK26k02L1j24J91q2j77P9L4oj54L03j62
$$ -204 219 67 92 -22 -21 141 196 -162 52 69 15 19 245 43 74 -50 141 59 -118 -39 -5 -11 -165 138 -24
2639b4Pj3J89n0m9k7M0M1j30J91k46K2M4J08M2k10O6K28o5nj66M2k8J08r9l33
$$ -24 -17 -30 159 109 60 33 73 114 -16 175 -71 -49 -5 103 145 -65 1 229 164 159 -7 35 7 115 16 -317
2665c17N26j92j67Q7k0J44NK2n6j58K8N0R0j13K16q6k82Q6N6r7K29j27k7J33l03
$$ -317 209 17 -150 -63 -83 61 66 88 32 -126 -98 -48 42 -71 145 59 -223 -137 -81 -178 51 -76 -103 30 -273
2690b73K34r4J71J15l34J37n9O5J0%K33j61O6ok19P8p9l0K31k99K17J23o9j35
$$ -273 -39 -133 38 153 -181 -44 -103 -38 -28 -28 205 44 110 104 -115 -37 -116 -146 85 -214 3 126 57 -78
2714g8K08k82J93p9o4O7n0j01K55l19J05J26J20j9j70J40j08K3R5N3L9k32L28
$$ -78 130 -152 41 -38 -102 -35 -85 -186 69 -250 -145 -19 101 82 -88 52 -56 -33 62 115 154 -78 250
2737B50j43j63K2L07j40Q9l47l7J06n1M3J16k3P1j40p6J17n6j45J86Q2j89k8J56
$$ 250 107 -56 -34 273 133 222 -125 -162 -56 -107 -64 52 29 100 -40 -116 1 -55 -200 -14 68 -121 -149 7
2761Gk5q6j4Q8k26J33J54j00P7P1r5O9P3k20N7J81l93M90j32mk81J24J45J15j32
$$ 7 -18 -104 -118 -30 -256 -123 31 -69 8 79 -16 53 126 -94 -37 144 -249 241 109 105 -176 -52 93 208 76
2786G6pJ9p7J35%q9l40K44J00n1J62p0M8j46J45k31N0R3K1j8j58K88j55J47k70
$$ 76 69 88 11 146 146 57 -283 -39 61 10 172 102 150 4 149 -82 -32 61 82 64 -94 194 39 186 -84
2811h4K47k71J70Q3J06k67p5K10q7r4J47Jj47N1L11j39k37J09k9j6m7Q9N8P0N8
$$ -84 163 -108 62 145 251 -16 -91 119 32 -62 85 86 -61 -10 301 162 -75 34 5 -11 -58 31 89 159 217
2836B17j25k75K1J54J35j22QJ8j07Q0q9K85j71r0k29J66J17Q0k91K94%j00O9L47
$$ 217 92 -183 -162 -8 127 5 13 31 -76 4 -85 200 29 -61 -290 -124 -7 73 -218 76 76 -24 45 392
2860C92l00o2Q5l09J60K48l22L90j44j9k56J02o0n7j3J29J67j90L06m18R2J03
$$ 392 92 30 115 -194 -34 214 -108 282 138 119 -137 -35 -95 -152 -165 -36 131 -59 247 -171 -79 24
2882B4j00M0l4R7p3n8K55j04J52Qm5l70L80j82k0k9P7K6k82J85J00P2k5l78L97
$$ 24 -76 -36 -70 27 -46 -104 151 47 199 207 162 -208 172 -10 -30 -59 18 44 -238 -53 47 119 94 -284 113
2907A13j05j06K21k65K88j95K25k24M8Jm0J7J25k59L04l46L43n1j33J47l28R7
$$ 113 8 -98 123 -142 146 -49 176 -48 0 1 -39 -22 103 -156 148 -198 145 94 -39 108 -220 -123
2929a23j15J69L8k94K46M9L12k3k79rk0K91nn4j65K27m21J79L9j61k80K55j6Q1
$$ -123 -238 -69 -31 -325 -79 -30 282 259 -20 -29 -49 242 237 183 18 245 -176 3 42 -119 -399 -144 -160 -79
2953g9K48O4M8k85K47k72L30l48q6L37k3k86k04K56K62j34jR4M5k76P5l2J63k60
$$ -79 169 233 281 -4 243 -29 301 -47 -133 204 181 -105 -309 -53 209 75 74 168 213 -63 12 -20 143 -117
2977a17O9N9J63J6l27j43R6K01M1j80m6k7K20N9k14K50k01R7k41J79m4K16kJ2
$$ -117 -48 11 174 190 -137 -280 -184 17 58 -122 -168 -195 25 84 -130 120 -81 16 -225 -46 -90 126 124 136
$$ [...]
8191a60
##END NTUPLES=NMR FID
##END=
