##TITLE=1H_PR197_int
 D2O
 8 sc, 
 12.1.2022
##JCAMPDX= 6.0         $$ Bruker NMR JCAMP-DX V2.0
##DATA TYPE= NMR FID
##DATA CLASS= NTUPLES
##ORIGIN= UXNMR, Bruker Analytische Messtechnik GmbH
##OWNER= root
$$ XWIN-NMR		Version 3.5
$$ Wed Jan 12 10:27:47 2022 Russian Standard Time (UT+4h)  she@DPX200
##.OBSERVE FREQUENCY= 200.131346
##.OBSERVE NUCLEUS= ^1H
##.DELAY= (6, 6)
##.ACQUISITION MODE= SIMULTANEOUS
##.ACQUISITION SCHEME= undefined
##.AVERAGES= 8
##.DIGITISER RES= 18
##SPECTROMETER/DATA SYSTEM= spect
##.PULSE SEQUENCE= zg30
##.SOLVENT NAME= D2O
##.SHIFT REFERENCE= (INTERNAL, D2O, 0, 15.7039)
##AUDIT TRAIL= $$ (NUMBER, WHEN, WHO, WHERE, WHAT)
$$ ##TITLE= Audit trail, XWIN-NMR		Version 3.5
$$ ##JCAMPDX= 5.01
$$ ##ORIGIN= Bruker BioSpin GmbH
$$ ##OWNER= she
$$ F:/spectra/data/she/nmr/H-F/1/audita.txt
$$ ##AUDIT TRAIL=  $$ (NUMBER, WHEN, WHO, WHERE, WHAT)
(   1,<2022-01-12 10:26:32.40 +0400>,<she>,<DPX200>,
      <created by zg, POWCHK disabled, PULCHK disabled
       configuration hash MD5:
       00 E9 B6 7A A2 85 ED C7 34 08 36 98 17 FE 4E 26
       data hash MD5: 16K
       6E 44 A9 6B 35 48 A4 75 D6 5C FD 18 16 52 D9 4B>)
$$ ##END=
$$ 
$$ hash MD5
$$ 17 6E F8 85 33 65 1C B1 25 96 57 A0 9A 3C 17 9D
##$RELAX= 
##$RELAX= 
##$RELAX= 
##$RELAX= 
##$RELAX= 
##$RELAX= 
$$ Bruker specific parameters
$$ --------------------------
##$DU= <F:/spectra>
##$EXPNO= 1
##$NAME= <H-F>
##$PROCNO= 1
##$TYPE= <nmr>
##$USER= <she>
##$AMP= (0..31)
100 100 100 100 100 100 100 100 100 100 100 100 100 100 100 100 100 100 
100 100 100 100 100 100 100 100 100 100 100 100 100 100 
##$AQSEQ= 0
##$AQ_mod= 1
##$AUNM= <au_zg>
##$AUTOPOS= <>
##$BF1= 200.13
##$BF2= 200.13
##$BF3= 200.13
##$BF4= 200.13
##$BF5= 200.13
##$BF6= 200.13
##$BF7= 200.13
##$BF8= 200.13
##$BYTORDA= 1
##$CFDGTYP= 0
##$CFRGTYP= 5
##$CHEMSTR= <none>
##$CNST= (0..31)
1 1 145 1 1 1 1 1 1 1 1 1 1 1 1 1 1 1 1 1 1 1 1 1 1 1 1 1 1 1 1 1 
##$CPDPRG= <>
##$CPDPRG1= <>
##$CPDPRG2= <>
##$CPDPRG3= <>
##$CPDPRG4= <mlev>
##$CPDPRG5= <mlev>
##$CPDPRG6= <mlev>
##$CPDPRG7= <mlev>
##$CPDPRG8= <mlev>
##$CPDPRGB= <>
##$CPDPRGT= <>
##$D= (0..31)
0 1.2 0 0 0 0 0 0 0 0.06 0 0.03 0 0 0 0 0.0002 0 0 0 0 0 0 0 0 0 0 0 0 
0 0 0 
##$DATE= 1641968791
##$DBL= (0..7)
120 120 120 120 120 120 120 120 
##$DBP= (0..7)
150 150 150 150 150 150 150 150 
##$DBP07= 0
##$DBPNAM0= <>
##$DBPNAM1= <>
##$DBPNAM2= <>
##$DBPNAM3= <>
##$DBPNAM4= <>
##$DBPNAM5= <>
##$DBPNAM6= <>
##$DBPNAM7= <>
##$DBPOAL= (0..7)
0.5 0.5 0.5 0.5 0.5 0.5 0.5 0.5 
##$DBPOFFS= (0..7)
0 0 0 0 0 0 0 0 
##$DE= 6
##$DECBNUC= <off>
##$DECIM= 32
##$DECNUC= <off>
##$DECSTAT= 4
##$DIGMOD= 1
##$DIGTYP= 9
##$DL= (0..7)
0 120 120 120 120 120 120 120 
##$DP= (0..7)
150 150 150 150 150 150 150 150 
##$DP07= 0
##$DPNAME0= <>
##$DPNAME1= <>
##$DPNAME2= <>
##$DPNAME3= <>
##$DPNAME4= <>
##$DPNAME5= <>
##$DPNAME6= <>
##$DPNAME7= <>
##$DPOAL= (0..7)
0.5 0.5 0.5 0.5 0.5 0.5 0.5 0.5 
##$DPOFFS= (0..7)
0 0 0 0 0 0 0 0 
##$DQDMODE= 0
##$DR= 18
##$DS= 0
##$DSLIST= <SSSSSSSSSSSSSSS>
$$ [...]
##$SUBNAM2= <"">
##$SUBNAM3= <"">
##$SUBNAM4= <"">
##$SUBNAM5= <"">
##$SUBNAM6= <"">
##$SUBNAM7= <"">
##$SUBNAM8= <"">
##$SUBNAM9= <"">
##$SW= 18.0517287032376
##$SWIBOX= (0..15)
0 0 2 0 0 0 0 0 0 0 0 0 0 0 0 0 
##$SW_h= 3612.71676300578
##$TD= 16384
##$TD0= 1
##$TE= 0
##$TE2= 300
##$TE3= 300
##$TEG= 300
##$TL= (0..7)
0 120 120 120 120 120 120 120 
##$TP= (0..7)
150 150 150 150 150 150 150 150 
##$TP07= 0
##$TPNAME0= <>
##$TPNAME1= <>
##$TPNAME2= <>
##$TPNAME3= <>
##$TPNAME4= <>
##$TPNAME5= <>
##$TPNAME6= <>
##$TPNAME7= <>
##$TPOAL= (0..7)
0.5 0.5 0.5 0.5 0.5 0.5 0.5 0.5 
##$TPOFFS= (0..7)
0 0 0 0 0 0 0 0 
##$TUNHIN= 0
##$TUNHOUT= 0
##$TUNXOUT= 0
##$USERA1= <user>
##$USERA2= <user>
##$USERA3= <user>
##$USERA4= <user>
##$USERA5= <user>
##$V9= 5
##$VALIST= <valist>
##$VCLIST= <CCCCCCCCCCCCCCC>
##$VD= 0
##$VDLIST= <DDDDDDDDDDDDDDD>
##$VPLIST= <PPPPPPPPPPPPPPP>
##$VTLIST= <TTTTTTTTTTTTTTT>
##$WBST= 1024
##$WBSW= 4
##$XGAIN= (0..3)
0 0 0 0 
##$XL= 0
##$YL= 0
##$YMAX_a= 195894
##$YMIN_a= -194294
##$ZGOPTNS= <>
##$ZL1= 120
##$ZL2= 120
##$ZL3= 120
##$ZL4= 120
##$ABSF1= 10
##$ABSF2= 0
##$ABSG= 5
##$ABSL= 3
##$ALPHA= 0
##$AQORDER= 0
##$ASSFAC= 0
##$ASSFACI= 0
##$ASSFACX= 0
##$ASSWID= 0
##$AUNMP= <proc_1d>
##$AZFE= 0.1
##$AZFW= 0.1
##$BCFW= 1
##$BC_mod= 2
##$BYTORDP= 1
##$COROFFS= 0
##$CY= 11.3945322036743
##$DATMOD= 1
##$DC= 2
##$DFILT= <>
##$DTYPP= 0
##$F1P= 2.36226072786647
##$F2P= -0.459571619588291
##$FCOR= 0.5
##$FTSIZE= 0
##$FT_mod= 4
##$GAMMA= 1
##$GB= 0.15
##$INTBC= 1
##$INTSCL= 1
##$ISEN= 128
##$LB= 0.24
##$LEV0= 0
##$LPBIN= 0
##$MAXI= 10000
##$MC2= 0
##$MEAN= 0
##$ME_mod= 0
##$MI= 1.114404
##$NCOEF= 0
##$NC_proc= 0
##$NLEV= 6
##$NOISF1= 3.799351
##$NOISF2= 2.8
##$NSP= 1
##$NTH_PI= 0
##$NZP= 0
##$OFFSET= 15.70392
##$PC= 1
##$PHC0= -15872.31
##$PHC1= 15.80079
##$PH_mod= 1
##$PKNL= yes
##$PPARMOD= 0
##$PSCAL= 0
##$PSIGN= 0
##$REVERSE= no
##$SF= 200.130013532006
##$SI= 16384
##$SIGF1= 3
##$SIGF2= 2
##$SINO= 400
##$SIOLD= 16384
##$SREGLST= <1H.CDCl3>
##$SSB= 0
##$STSI= 0
##$STSR= 0
##$SW_p= 3612.71676300578
##$SYMM= 0
##$S_DEV= 0
##$TDeff= 0
##$TDoff= 0
##$TI= <>
##$TILT= no
##$TM1= 0
##$TM2= 0
##$TOPLEV= 0
##$USERP1= <user>
##$USERP2= <user>
##$USERP3= <user>
##$USERP4= <user>
##$USERP5= <user>
##$WDW= 1
##$XDIM= 8192
##$YMAX_p= 0
##$YMIN_p= 0
$$ End of Bruker specific parameters
$$ ---------------------------------
##NTUPLES= NMR FID
##VAR_NAME=  TIME,          FID/REAL,        FID/IMAG
##SYMBOL=    X,             R,               I
##VAR_TYPE=  INDEPENDENT,   DEPENDENT,       DEPENDENT
##VAR_FORM=  AFFN,          ASDF,            ASDF
##VAR_DIM=   8192,          8192,            8192
##UNITS=     SECONDS,       ARBITRARY UNITS, ARBITRARY UNITS
##FACTOR=    0.0002768,     1,               1
##FIRST=     0,             0,               0
##LAST=      2.2672688,     0,               0
##MIN=       0,             -194294,         0
##MAX=       2.2672688,     195894,          0
$$ Real data points
##PAGE= N=1
##DATA TABLE= (X++(R..R)), XYDATA
$$ [...]
2474B532K88r08j745k048j002K51J173K324J888J44r52j964j931r39K84J951J699
$$ 2532 2820 1912 167 -1881 -2883 -2632 -1459 865 2753 2897 1945 -19 -1950 -2889 -2605 -654 1045
2491A045J484K65q03k273j745q00M02J554K297Q27L50r18j775k085p56Q05J462
$$ 1045 2529 2794 1991 -282 -2027 -2827 -2425 -871 1426 2253 2603 1685 -90 -2175 -2931 -2126 -664
2508f64J444K092N9j827j411j331j035K02J944J797Q52O36j008k457j493J7J91
$$ -664 780 2872 2931 1104 -307 -1638 -2673 -2471 -527 1270 2122 2758 1750 -707 -2200 -2183 -1992
2525a992J137K335J343o01p20j712j898p05J359R54J616J554J24j531j913j009
$$ -1992 -855 1480 2823 2222 1502 -210 -2108 -2813 -1454 -500 1116 2670 2794 1263 -650 -1659
2541a659j104M00K173J586O15P24j150k357j383k07L76J014K674J209p52q39j398
$$ -1659 -2763 -2363 -190 1396 2011 2735 1585 -772 -2155 -2362 -1986 -972 1702 2911 2159 1320 -78
2558g8k274o73J213J348J305J753J05j608j949q90o03j4K248J716O89n7q18j826
$$ -78 -2352 -3025 -1812 -464 841 2594 2699 1091 -858 -1748 -2351 -2365 -117 1599 2288 2231 1413 -413
2576d13j925J03M19J085K236J575j151j078q73k161p82J342J623J327Q41N27j681
$$ -413 -2338 -2235 -1816 -731 1505 3080 1929 851 -22 -2183 -2965 -1623 0 1327 2168 2695 1014
2593A014j973p49o90L05J819K085Q4L01p28k422j381M7R44P76J901J616j016j132
$$ 1014 -959 -1708 -2398 -2093 -274 1811 1895 2196 1468 -954 -2335 -2288 -1344 -568 1333 2949 1933 801
2611H01j340j479p28J529J452J251O50M73j961j862n83k44k1J998J797M75l00
$$ 801 -539 -2018 -2746 -1217 235 1486 2136 2609 648 -1214 -1797 -2041 -2062 -64 1733 2208 1908
2628A908p78k058j309j48J151Q96J521J497o90j595j006j403o11J165J801R70
$$ 1908 1130 -928 -2237 -2385 -1234 -338 1183 2680 1990 395 -611 -2014 -2625 -1460 341 1311
2644A311P32L09j790j956n08p4J74J652K011K46n17r34j385j454l13J169J445
$$ 1311 2043 2352 562 -1394 -1902 -1976 -1802 -150 1861 2107 1590 656 -729 -2183 -2496 -1327 118
2661A18R86J452m94j482j339j051k27Q02J633R36O82k3j151j909j172K71M35J530
$$ 118 1104 2556 2062 580 -759 -1810 -2037 -1235 398 1334 2016 1993 842 -1067 -2239 -1968 -1533 -3
2679cJ646Q96p38j249j356j352k7J131J307J212O80k69j529j138j176j83Q19J515
$$ -3 1643 2539 1801 552 -804 -2156 -2183 -1052 255 1467 2147 1878 349 -789 -1965 -2148 -1329 186
2697A86J433N48n61j149j549r82Q1P85J537J310N49o14j445j294o95J83N64J505
$$ 186 1619 2167 1606 457 -1092 -2074 -1993 -1208 329 1639 2188 1574 129 -1165 -1860 -1677 -1113 392
2715C92J341M47p47r54j780q59K00R54J284J220N73n37j138j462p87j49J162J348
$$ 392 1733 2180 1433 479 -1301 -2160 -1960 -1006 278 1498 2071 1534 396 -1066 -1853 -2002 -840 508
2733E08J089L53k95j554j165r38K39O53J338J532J56n56r21j479j073K98J148
$$ 508 1597 1950 1655 101 -1064 -2002 -1763 -1110 228 1760 1916 1360 439 -1040 -2113 -1815 -667
2750f67R87J127P90q68j213j404k18m52J208J411Q90J02m28r67j508n82K4O66
$$ -667 320 1447 2237 1369 156 -1248 -1466 -1918 -710 701 1591 1693 1265 298 -1210 -1792 -1768 -1102
2768a102J516J465o2n30q07j480j139M40J254Q71J103O56n72j861p96q44J61N66
$$ -1102 414 1879 1817 1287 480 -1000 -2139 -1699 -445 426 1529 2185 1613 -248 -1044 -1888 -1727 -1161
2786a161J935J012j85r1j241j353q26M65O11J210J410J76j012p43j165j208M86
$$ -1161 774 1786 1601 1510 269 -1084 -1910 -1445 -834 376 1786 1962 950 207 -958 -2166 -1680
2803a680J301J244P61M47r48j361r95l39l30J109J613P19l1m68j075j429o26Q14
$$ -1680 -379 865 1626 2073 1125 -236 -1231 -1570 -1900 -791 822 1541 1510 1042 -33 -1462 -2088 -1274
2821a274P85J013R54N26j337q46r29r17M58J146J002Q25K60k15j904q14k3l15
$$ -1274 -489 524 1478 2004 667 -179 -1108 -2025 -1567 -421 581 1406 1666 1451 -453 -1267 -1290 -1605
2839a605P57J742Q88m73n6r20j686n90O84J027R56J106K26j462q10m85j029J98
$$ -1605 -848 894 1782 1309 1253 333 -1353 -1943 -1259 -232 724 1830 2056 594 -216 -701 -1730 -1532
2857a532J481J200K42K7k76j447p65n05L26N91J574N35j94n78r40j119m91P36
$$ -1532 -51 1149 1391 1418 1142 -305 -1070 -1575 -1249 -658 916 1451 1257 679 -261 -1380 -1871 -1135
2875a135Q67Q79R17L38j140q79r41n09K29J085J063O48Q1m00j457j102Q3L43N57
$$ -1135 -268 611 1528 1866 726 -153 -1094 -1603 -1374 -289 774 1422 1503 1103 -354 -1456 -1373 -1030 -473
2894d73J425P62m01r54o10j091m38O83J061R64L94L56p99j250q01l09O9J262J296
$$ -473 952 1714 1313 359 -251 -1342 -1780 -1097 -36 928 1322 1678 879 -371 -1172 -1481 -1412 -150 1146
2913A146L0j8m35j334q21K91K94N70J392L33r4j020q30o29k76K74J144P84N00
$$ 1146 1176 1158 723 -611 -1432 -1141 -847 -277 1115 1448 1354 334 -496 -1125 -1401 -1127 17 801 1301
2932A301J45p76j085o17n28M46Q58J217O56k68q27r56q12k86N49Q60R58O27j50
$$ 1301 1446 670 -415 -1032 -1560 -1114 -256 961 1617 1349 522 -434 -1246 -1532 -983 -123 835 1462 1312
2951A312j001o45r44j47O23R07P07N70K25j200q96p18j18N01Q69Q07L52O6q17
$$ 1312 311 -334 -1278 -1425 -802 105 812 1382 1607 407 -489 -1207 -1325 -824 45 852 1204 1270 453
2970D53j037n87k53N48Q90R76M03Kr52j126p66K10M01R13O03Q68n70o98p68p35
$$ 453 -584 -1171 -1424 -876 14 990 1393 1395 443 -683 -1449 -1239 -838 75 678 1546 976 278 -490 -1225
2990a225k93Q41P49Q03O04l15q04j187k11l15L95R79J223N5L3r32j098o10l1R26
$$ -1225 -1518 -677 72 875 1479 1164 360 -827 -1038 -1353 -958 21 1244 1299 1332 400 -698 -1308 -1339 -413
3010d13N45N59R83p65p10p77o08k84R29P69M42O57j05q32j257k0l77M88J090Q36
$$ -413 132 691 1674 909 199 -578 -1186 -1470 -541 228 670 1327 1222 390 -867 -887 -1264 -776 314 1150
3030A150j43p6r04p03p33K06Q69N15N86N29m11j000l43p16l44R65Q49M94K10J5
$$ 1150 1007 931 27 -676 -1409 -1203 -334 181 767 1296 885 -115 -458 -1174 -1518 -553 296 790 1000 1015
3050A015p63j191L0J5K17J071R36k7m41p28q35m47j30J158L62N29N93n75j067
$$ 1015 252 -939 -909 -894 -677 394 1330 1303 862 134 -701 -1148 -1278 -120 242 771 1364 789 -278
3069b78m43m50m2O36J066N42j34J2p70j149k09N81M1J067M76q8k34n73n34o85
$$ -278 -721 -1171 -1213 -577 489 1031 897 909 139 -1010 -1219 -638 -597 470 946 858 624 51 -483 -1168
3089a168K94M57P11O09N17o31j061j71m41r4M72J011M00k20L09p97j337J04K81
$$ -1168 -874 -417 294 903 1420 789 -272 -443 -884 -978 -506 505 905 685 994 197 -1140 -1036 -755
3108g55J81P19P35N6m23m56q27k10j7R12O39N44jm46o88n15l50k42Q20Q54N83
$$ -755 -574 145 880 936 513 57 -770 -980 -997 -85 554 1098 1097 651 -37 -552 -902 -1144 -324 530 1113
3129A113j85j56m54j303j57M32O04M58Q01k9n44o41n70m06L7R35N22K74J76j51
$$ 1113 928 772 318 -985 -1142 -710 -106 352 1153 1124 580 -61 -631 -1037 -1000 -65 457 731 907 756
3149G56j043n39M4j73M96J060K74l4m45l73o71j82L93L55N50L89K06m43q84k34
$$ 756 -287 -826 -782 -955 -459 601 875 841 396 23 -648 -830 -437 -82 468 857 1063 620 -264 -498
3169d98m39j84R63N19M13j57j82n34n85l40M80M64M05M18L2m57m00o05r2OP02
$$ -498 -937 -1121 -158 361 774 617 435 -99 -684 -1024 -544 -80 325 743 775 318 -82 -687 -779 -773 -71
3190g1N94K71J68n51p32l84k99M15L74O33L60J55p01l77m66k00L82J73Q57J24
$$ -71 523 794 962 411 -321 -705 -1004 -589 -215 418 778 933 232 -145 -611 -811 -429 -256 601 725
3210G25M3m81n50k14o31M77O59K14O39r1m77n62o97O2J82O28M41M13Q5m26n79
$$ 725 768 287 -263 -477 -1108 -631 28 242 881 790 313 -249 -946 -884 -702 -74 367 780 865 439 -140
3231a40m25k71J91M47O08N23l45k51m15p52O2J32N32P81J22p8n13p65m6j18J48
$$ -140 -565 -836 -645 -198 410 933 588 337 -78 -830 -768 -636 -104 677 799 721 208 -557 -603 -721 -573
3252e73N65K16M61P5m80o10k55k00K48N19M78N19m56j90o05m51J18K92K36Q77
$$ -573 -8 208 669 744 264 -346 -601 -801 -553 -34 444 963 507 317 -288 -739 -621 -329 -93 784
3272G84j26n8m53l74l99k50N13L22L96L70L9p59o72J82r5K59M78K78J24O5o58
$$ 784 658 600 147 -227 -626 -876 -363 -41 355 725 764 5 -667 -485 -580 -321 157 435 559 624 -34
3293c4k51k08m12M10K21R71J07l60m09l81k05l87P39J95L94K67j74k39o13k61
$$ -34 -285 -493 -905 -495 -274 697 804 444 35 -346 -551 -938 -199 -4 390 657 483 244 -369 -630
3313f30J37k4N87M69M1j51k9o46l80j10L04K76O31L56n01j38m23n76j64O21M92
$$ -630 -493 -517 70 539 580 429 400 -246 -626 -736 -432 -156 475 831 330 192 -231 -807 -971 -350 142
3334A42L45LQ9n03l33m45j2O9R39M94l42Kj09p24k06L5K50L88J96N71n47k10j90
$$ 142 487 490 579 76 -257 -702 -714 -645 294 788 446 448 339 -385 -591 -556 -306 82 278 849 302 92 -98
3357i8p31M0K41P92Q8M1J25m45l69l38J58J81N71K64K4r0k94n75j86k23L75L81
$$ -98 -829 -789 -548 244 332 373 498 53 -316 -654 -496 -315 256 520 544 454 160 -415 -601 -824 -449 -68
3379f8O26J96n05r7m19j42OK46M68J05K6j3n59j92k62K14N8O41J36%mk50l87m10
$$ -68 558 754 249 152 -267 -409 -403 -157 311 416 442 429 -130 -322 -584 -370 -312 329 465 465 461 211 -176 -586
3403e86J20N25j40K95M26k34o38k81q4q1K26M48O78Kj73q35J4j63P2K59M8M78
$$ -586 -466 59 -81 214 640 406 -232 -513 -597 -678 -452 -4 674 676 503 -332 -318 -481 -409 -150 -102 376
3425C76M40p35j86k60p6J94J5K97L82N7M0o30j47l34J85K48K65M15Nk55l67m23
$$ 376 816 81 -105 -365 -441 -247 -232 65 447 504 544 -86 -233 -567 -382 -134 131 546 551 296 -71 -494
3447d94J16P6j1L94M06K69n48l21o7k21m5K73M41K4J94k79m21j59L4J21L32J33
$$ -494 -378 -302 -313 81 487 756 208 -113 -180 -401 -446 -173 268 292 486 207 -214 -373 -339 -218 114 247
3469B47J18Q1k23k55l07K7%K63K22J67J39j71l37l76J34j40K93K47M08j41Q8n90
$$ 247 365 446 223 -32 -339 -312 -312 -49 173 340 479 308 -29 -405 -271 -411 -118 129 537 396 484 -106
3491a06j43l90N43q6L90J26Ol27j40p8j40J40N1M79j6N3n5k94p08L30P3J01L51
$$ -106 -249 -639 -96 -182 208 334 340 13 -127 -205 -345 -205 -154 325 309 362 307 13 -695 -365 -292 -191 160
3514A60K73l4l0l60j77r2j97N05L34j23R8l20o8P6m41J19P5L56J75j50J85m44
$$ 160 433 399 369 9 -168 -260 -457 48 382 259 357 37 -31 45 -396 -277 -202 154 329 179 364 -80
3536h0J7j75J13j89K21L04P8j87j23j25r5L26q5M2K50j68O1l50k49N6j93N21M79
$$ -80 -63 -238 -125 -314 -93 211 289 102 -21 -146 -241 85 0 42 292 124 185 -165 -414 -358 -551 -30 449
3559D49j40J6k20m8l21k03L68K19K59R4m4l54k05j66j97M34j42j3N33M0n2j51
$$ 449 309 325 105 57 -264 -467 -99 120 379 473 429 75 -130 -296 -493 -59 -201 -214 319 359 307 156
3581A56l07J22L1P6J42K40k20j62j00l13j65K77M63k20J4N20n70q7Rk37N7K50
$$ 156 -151 -29 2 78 220 460 240 78 -22 -335 -500 -223 240 20 34 554 -16 -103 -94 -331 -274 -24
3603b4J95r6J46j04p7p1j63J31Q3m9L70k68j08j0j89j07K98j38M23j08L73k43
$$ -24 171 75 221 117 40 -31 -194 -63 20 -29 341 73 -35 -45 -234 -341 -43 -181 242 134 507 264
3625B64n59J17L8j00J40K81j34po3Q9m12J96j21K02L10J65o4j87l64K2M34l94
$$ 264 -295 -178 -140 -240 -100 181 47 40 -23 66 -346 -150 -271 -69 241 406 342 155 -209 -187 247 -147
3647a47K43k05L59j09k05J14p0l92K01J48j9L19j07k3j08k08k55K58Q3J98n3M
$$ -147 96 -109 250 141 -64 50 -20 -412 -211 -63 -82 237 130 107 -1 -209 -464 -206 -123 75 22 26
3669B6j50o9P9j01j08K56P7L32j03O8l69j8l9l8J3j1L04l24M66j56j93k90J42
$$ 26 -124 -193 -114 -215 -323 -67 10 342 239 307 -62 -80 -119 -157 -144 -155 149 -175 291 135 -58 -348 -206
3692b06L39r6k7K88k22P2l00J76j41J09m1l2L40k56J50l9l06K73Q3L29l86p5Q4
$$ -206 133 37 10 298 76 148 -152 24 -117 -8 -49 -81 259 3 153 114 -192 81 164 493 107 32 116
3715A16N6j22j23p2J46P2K11j53r9J8k55m5K58o1OK86q5j41K64m11J49O6j88J22
$$ 116 172 50 -73 -145 1 73 284 131 32 50 -205 -250 8 -53 -47 239 154 13 277 -134 15 81 -107 15
3739A5k5j3J81j23N9k44L8J07M6j26M01k79R9l0j49j04P8M1m1J88j29j45O8K2
$$ 15 -10 -23 158 35 94 -150 -112 -5 41 -85 316 37 136 106 -43 -147 -69 -28 -69 119 -10 -155 -87 -65
3763f5J41j19J20K17j02j11N2Nl07P2M5J99k31K6k7K67M7m30J1J27K22j58M8J69
$$ -65 76 -43 77 294 192 81 133 138 -169 -97 -52 147 -84 -58 -85 182 229 -201 -190 -63 159 1 49 218
3787B18k38J04j42k0j84J50L75l04J73ql69K44j42j11n9K48K27p6j17m3K74l23
$$ 218 -20 84 -58 -78 -262 -112 263 -41 132 124 -245 -1 -143 -254 -313 -65 162 86 -31 -74 200 -123
3809a23K09r8PK16j83K89l38J27k75o2O2J77J11j17L2k91L71M5L7l29L13J94l12
$$ -123 86 -12 -5 211 28 317 -21 106 -169 -231 -169 8 119 2 34 -257 114 159 196 -133 180 374 62
3832F2k03L52J45l99j31j7J78OK38l95J79j33o3j4L15j80J91Jnj54J6n1k5N6L17
$$ 62 -141 211 356 -43 -174 -191 -13 -7 231 -164 15 -118 -181 -195 120 -60 131 132 127 -27 -11 -62 -87 -31 286
3857B86o8P0r9q4r1j38q9K03O0q7M8K73l90J29O7l36L6J66M90n20J16Rk1m1q5
$$ 286 218 288 189 105 14 -124 -213 -10 50 -37 11 284 -106 23 90 -246 -210 -44 446 -74 42 51 30 -11 -96
3882i6j71K66J3J58J36j2m51KJ32o3j08L61p5J03k26q5J8Q1j31Q7m8K27N4k09
$$ -96 -267 -1 12 170 306 294 -157 -155 -23 -86 -194 167 92 195 -31 -116 -98 -17 -148 -61 -109 118 172 -37
3906c7k62J02R2k0l4K06K49r1j84K3j17r4K64k69K67j02p5L48o1k10j84K47j30
$$ -37 -299 -197 -105 -125 -159 47 296 205 21 44 -73 -167 97 -172 95 -7 -82 266 205 -5 -189 58 -72
3929g2Q9K19o6o2j75J65l04J98k28K82o5J02J14mm18n6J3J94k06M74o8L3j02j58
$$ -72 17 236 170 108 -67 98 -206 -8 -236 46 -19 83 197 193 -225 -281 -268 -74 -280 194 126 159 57 -101
3953a01j41l8K73J04J17J45k55j45J8k25m1K15L19K12k86Qj56j39k44K01MK93
$$ -101 -242 -280 -7 97 214 359 104 -41 -23 -248 -289 -74 245 457 171 179 23 -116 -360 -159 -155 138
3975A38J7j68L19j85k0k01j14L7J39L16J8k72P1Qn04J07M23j36K05j84P9J20j38
$$ 138 155 -13 306 121 101 -100 -214 -177 -38 278 296 24 95 103 -401 -294 129 -7 198 14 93 213 75
3998G5l20n6Q0K81J29P0q6k59p8J15j83P0L98o0L0O4k24j92J04j98P9M18k49K69
$$ 75 -245 -301 -221 60 189 259 173 -86 -164 -49 -232 -162 236 176 206 270 46 -146 -42 -240 -161 257 8 277
4022B77m9p9l67N3m4J6K59L2K98l49N2l05J9J38J61n1K76K2j41k98J12j95R3J17
$$ 277 228 149 -218 -165 -209 -193 66 98 396 47 99 -206 -187 -49 112 61 337 359 218 -80 32 -163 -70 47
4046D7M0J4k3J46l92p8J79l33Q4O61J52k86j21J08l19l32K29J66K02K56J5r3l24
$$ 47 87 101 78 224 -168 -246 -67 -400 -316 345 497 211 90 198 -121 -453 -224 -58 144 400 415 322 -2
4069bj87j03k6J29J81K50L43k04J6r26K29Q8J09J75Q2J02j7n8m58k18K43K05J37
$$ -2 -189 -292 -318 -189 -8 242 585 381 397 -529 -300 -212 -103 72 154 256 239 181 -277 -495 -252 -47 90
4092I0K18P0k07k05o8k55k23P28p1M38j81j04o14K08J74m10L44J52N81m07O6n02
$$ 90 308 378 171 -34 -102 -357 -580 148 77 515 334 230 -384 -176 -2 -412 -68 84 665 258 324 -178
4114a78k9j95N5M69M2J41J00l06j85j03o8jK1L30J93L28m12o2n25K1P2R7M59l5
$$ -178 -207 -402 -347 122 164 305 405 99 -86 -189 -257 -258 -237 93 286 614 202 140 -385 -364 -292 -195 264 229
4138B29K8q4j61k78k75M02K72j36K37J61l60l2j71q8k9N93l4J47P9j43o2p25J14
$$ 229 257 173 12 -266 -541 -139 133 -3 234 395 35 3 -168 -256 -285 308 274 421 500 357 295 -430 -316
4161c16P8K8J97J41P2J8j43j20n20K14J13L52J43J89l86k90J11l70J59L19j00
$$ -316 -238 -210 -13 128 200 218 75 -45 -565 -351 -238 114 257 446 60 -230 -119 -489 -330 -11 -111
4182a11L93J52l79j03k70j29J19R0M14L39J6k46n28l5k26K63J61K26K76K2k89
$$ -111 282 434 55 -48 -318 -447 -328 -238 176 515 531 285 -243 -278 -504 -241 -80 146 422 444 155
4203A55k32k47%J23K05K77K6K61q4n80L3l85K85m7N82q4M6k40p5k54l26K95M54
$$ 155 -77 -324 -324 -201 4 281 307 568 484 -96 -63 -448 -163 -210 372 288 334 94 19 -235 -561 -266 188
4226A88j60L35O9l29j17l79j57L63L99k02N43l59O3n28j2j51J46K35K76K94r8
$$ 188 28 363 432 103 -14 -393 -550 -187 212 10 553 194 257 -271 -283 -434 -288 -53 223 517 419
4247D19l24j15k36k10K54K75K50Q8J14l24k33m65rN7N90J62K99j14k53l64r4K9
$$ 419 95 -20 -256 -466 -212 63 313 401 515 191 -42 -507 -516 -459 131 293 592 478 225 -139 -233 -204
4269b04m38P19N24k47K16k73l59j84l31L98K05K51J35j44l9m01k44o1K76K51L44
$$ -204 -642 77 601 354 570 297 -62 -246 -577 -179 26 277 412 268 229 -172 -416 -477 -201 50 394
4290C94o4j5J90j007J24l2N9N12L72q9J72k22l73p24J21M86P0K86Q2J24n11j05
$$ 394 330 315 505 -502 -378 -410 -351 161 533 444 616 394 21 -703 -582 -96 -26 260 342 466 -45 -150
4312a50j64o1j36O70L7L05j88m2o93M4o7L00J06M24J10l95l1j48n65K51J84L90
$$ -150 -314 -375 -511 159 196 501 313 271 -422 -378 -445 -145 -39 385 495 100 69 -79 -644 -393 -209 181
4334A81L81J11k30n15k34Q8k75L69J65K63n0K56n27l56k00K98j47N13L60Mj71
$$ 181 562 673 443 -72 -306 -218 -493 -124 41 304 254 510 -17 -373 -573 -275 -422 91 451 455 284
4355B84N9m76m81L42K05K81J68J81j57m07m59m9R7J04N51Q2K32l02k4m77j69p
$$ 284 343 -133 -614 -272 -67 214 382 563 406 -1 -460 -509 -412 -308 243 325 557 255 231 -246 -415 -422
4377d22L10K03N59J20l53m19p4l64L0J92K92K69K23j45p70N6k13J41L70J10L20
$$ -422 -112 91 650 770 417 -2 -76 -440 -410 -218 74 343 566 421 -349 -293 -506 -365 5 115 435
4398D35J41l94k05k67k11J45J35K71N42K72p54q5m07l72L32N17J23Q1J12j50n20
$$ 435 576 182 -23 -290 -501 -356 -221 50 592 864 110 25 -382 -754 -422 95 218 299 411 261 -259
4419b59k43q5q6M82O33j27L04j81l32j88n08J78L11L07K15L5l91k2m02k41J12
$$ -259 -502 -587 -673 -191 442 315 619 438 106 -82 -590 -412 -101 206 421 456 65 43 -359 -600 -488
4440d88L35L14L65j41j65l23l35j1j59L89M68K51k25N4l06l39l58L75J96J9N39
$$ -488 -153 161 526 385 220 -103 -438 -449 -608 -219 249 500 275 329 23 -316 -674 -299 -103 -84 455
4461D55p1m4k15k68m41p4L53M23L19q6r8n04j26k59K80K44K05N60m2l46l77k86
$$ 455 384 340 125 -143 -584 -658 -305 118 437 351 253 -251 -377 -636 -356 -112 93 653 611 265 -112 -398
4483c98k50L16J43N17K33j80j36m25o68L00m2M79N72K83Qo07k75j72l79L95M84
$$ -398 -648 -332 -189 328 561 381 245 -180 -848 -548 -590 -111 461 744 752 145 -130 -302 -681 -286 198
4504A98oN81l66O5o80k67j62L44K52L74K85l15J04n14m91M9Q1L64L89L23J55o66
$$ 198 192 773 407 472 -208 -475 -637 -293 -41 333 618 303 407 -107 -598 -549 -468 -104 285 608 763 97
4526I7l55j47l29K98L38K13N32N4m68m42k50J27m4N49j35O00k02l09j1m24j92
$$ 97 -258 -405 -734 -436 -98 115 647 701 233 -209 -459 -332 -376 173 38 638 436 127 116 -308 -500
4547e00L07J62L03J93J04n24j91k64k69J59N20N71j92j10L24p36m38K30J85J02
$$ -500 -193 -31 272 465 569 45 -146 -410 -679 -520 0 571 379 269 593 -143 -581 -351 -166 -64
4567f4K58N12k77n2n86j30l74L60O12J28K53q5m04k63k54k3J28M15N42%l73O8
$$ -64 194 706 429 377 -209 -339 -713 -353 259 387 640 555 151 -112 -366 -389 -261 154 696 696 323 391
4589C91p69r5q0K97J74N27M56k07n79j31k67l62K86N16q9M72P0n15n40j84K17
$$ 391 -378 -473 -553 -256 -82 445 901 694 115 -16 -283 -645 -359 157 68 540 610 95 -445 -629 -412
4610d12K44J78N09R3k80j37k65n84j9L34O36P7J94J12q21j53j76k10K99O27K5
$$ -412 -168 10 519 612 332 195 -70 -654 -673 -339 297 374 568 680 -141 -294 -470 -680 -381 246 271
4631B71L84Q6n06n64n3r9K63J74O21m1k18J70m74n99n5N30L30O13j42K38q61l68
$$ 271 655 741 235 -329 -382 -481 -218 -44 577 536 318 488 14 -585 -640 -110 220 833 691 929 68 -300
4653c00k63k39L65O94N14K2l58l26n06K7j53K51M84L06O8J59n50n53l87q4N87
$$ -300 -563 -802 -437 257 771 793 435 109 -397 -370 -523 -272 212 518 586 745 195 -358 -745 -829 -242
4674b42L36N35J08j69o98l99k32K9L27O99K98o0m99j8l81m29L11J45L25O13K53
$$ -242 94 629 737 568 -130 -529 -761 -732 -405 294 592 532 33 15 -366 -795 -484 -339 -14 599 852
4695H52j29o48m20j77k53N11K12N24J43k39j69m68k64O6K79L21P74l27L4o92k54
$$ 852 723 75 -345 -522 -775 -264 -52 472 615 376 207 -261 -525 -459 -180 141 915 588 622 -70 -324
4716c24l52mN01O43J55p2n3n56m36k30J49L25N90M20m5k89k57o36j24J9M17N49
$$ -324 -676 -680 -179 464 619 547 494 -62 -498 -728 -579 -254 336 756 711 422 165 -471 -595 -576 -159 390
4738C90L82P4l51n59m48r8J23M9R09L59r1m94j32o19k44L26M40L11L72J5k70m68
$$ 390 772 846 495 -64 -512 -610 -487 -438 471 830 739 245 113 -506 -750 -424 16 327 699 714 444 -24
4760b4l32l54K89L27L05M45J83k02p04n72J50k45L67Q42K10j19k35l39n22m61
$$ -24 -356 -710 -421 -94 211 656 839 637 -67 -639 -489 -734 -367 475 685 566 331 -8 -530 -991
4780i91M17L58N67M31n8l78n43m49j84L5O49O25J17j11n2n70n52J67J40J71O89
$$ -991 -574 -216 351 782 724 346 -197 -646 -830 -795 -146 479 596 485 433 -137 -689 -522 -382 -211 478
4801D78K20k41k19l85n99K13Q3M29L04N36K7n26m23l24j62j85P00N19L43l1k67
$$ 478 698 457 238 -147 -746 -533 -450 -21 283 819 846 320 -103 -427 -589 -774 -74 445 788 757 490
4822D90o35l85r4L40p3Q66K36k34q0n04m46p2J04K68M29O83j27p24l15l30Q0l03
$$ 490 -145 -530 -624 -284 -357 509 745 511 431 -73 -519 -591 -487 -219 210 893 766 42 -273 -603 -523 -826
4844h26R12J17L52J25l15q52n8j92L63K56O95L32k13m69k09p55k10M66M98N54
$$ -826 86 203 555 680 365 -487 -545 -737 -374 -118 577 909 696 227 18 -737 -947 -481 17 571
4864E71L42n8n26m57m37k03J45P20N58L01j08n94m79n73O6mO58P23M2M5m09l28
$$ 571 913 855 329 -128 -565 -768 -623 97 655 956 848 254 -225 -798 -732 -736 -78 645 687 732 323 -5
4886ep51K13l7M97M86L20L8m43q20j58J49l07Q02N59j1K17l91o43o40R2J31K84
$$ -5 -756 -543 -580 -83 403 723 761 318 -502 -660 -511 -818 -16 543 532 749 358 -285 -925 -833 -702 -418
4908d18R99K33j39m61m58j41m83K77Q01QP22j94m89l80o65R0K48O92M18J66k91
$$ -418 581 814 675 214 -244 -385 -868 -591 210 218 940 746 257 -123 -788 -698 -450 242 660 826 535
4929E35j03r61n05K73L05L78O70P0Mo79k30m10m3J97O90L33J69J3l23q51k37l
$$ 535 432 -529 -1034 -761 -456 -78 592 662 666 -13 -243 -653 -696 -499 191 524 693 706 383 -468 -705 -708
4951g08K07R78O3P7J8m65p53l28J23N96L89M88L01m33l52j91q45K72R5P17L30
$$ -708 -501 477 540 617 635 170 -583 -911 -788 -192 197 685 986 553 201 10 -835 -563 -468 249 579
4972E79Q7J45m78p79l45P9K85N12L59L74j96m42m50m52L13m2L93O70L69m37k58
$$ 579 666 811 333 -446 -791 -712 -427 85 444 818 622 180 -270 -722 -409 -451 -58 612 981 544 286
4993B86o50p14M19J92P09M39L91m27l35j092j97O1M73R01J94K80p0q11q23l85
$$ 286 -364 -1078 -659 -467 242 681 1072 645 310 -782 -979 -918 -445 456 650 930 860 49 -774 -1159
5013a159J86M72O50N76j5j93l42l94p66K99L20N74N02K21k89p02m80m14P7M51
$$ -1159 -973 -501 149 725 710 517 175 -219 -985 -686 -366 208 710 931 642 -60 -540 -954 -877 -426
5033d26P80K03K22O8o56n63l78K17J11N56N71K59l51n39n17n02R7M06O30L22K88
$$ -426 354 557 779 847 191 -372 -750 -533 -422 134 705 964 613 74 -443 -945 -848 -442 188 510 798
5054G98k86o38l50l07k45M26J123J34R7m4o45o76l53M36J99N49O75J23n28m28
$$ 798 512 -126 -476 -783 -1028 -602 521 655 752 708 63 -613 -966 -530 -331 218 893 1016 488 60
5074F0n47n25J9R21M82j7O74m26p50l68o24L80L0J153L39N9k53m71o41j63j77
$$ 60 -487 -1012 -993 -72 410 393 1067 641 -109 -477 -1101 -721 -691 462 801 860 607 136 -505 -668 -845
5095h45M47O77P10Q7q11l85j97o70O1P16M16N12M17l77q64p57R6J34M82O31L71
$$ -845 -398 279 989 1076 265 -120 -317 -987 -926 -210 206 718 1135 758 -106 -863 -767 -633 -151 480 851
5116H51J0l50m33j186K44M11M1N78R92r7r19k25n02n93K89R46J59L81J27P7q94
$$ 851 861 511 78 -1108 -864 -453 -412 166 1158 1061 142 -83 -585 -1178 -889 57 216 597 724 801 -93
5137i3p08j76Q5M63R70N15k86l22m97p53l42O04M57L94M94O7n56o14j39n68J52
$$ -93 -801 -977 -892 -429 541 1056 770 448 -49 -802 -1144 -540 -83 311 805 872 316 -298 -437 -1005 -853
5158h53N63R37J20O6m99o66m92o4M67J37P04N17M6o26m13l88n54K86P37K73N80
$$ -853 -290 647 767 833 334 -332 -824 -888 -421 -284 420 937 983 357 -56 -444 -998 -712 25 298 878
5179H78L32p59q48k50k49R0P54P00L90j12m46o50m72k01J52O48N94L93l2n60n32
$$ 878 1210 451 -397 -647 -896 -806 -52 648 1038 926 480 -170 -642 -843 -691 -43 551 944 912 352 -180
5200a80n61k54L92O94J92N96l1n23n72l37l91L04N38P97L00j25j77q40m19n33
$$ -180 -741 -995 -603 91 283 879 848 325 -247 -584 -975 -671 -133 664 964 839 662 -178 -597 -1130
5220a130M08O21N78O77l03n78o26m39o1P6P56Q01J46p5o42m23o69j17L13P02P56
$$ -1130 -722 -101 477 1154 851 273 -353 -792 -853 -777 -21 780 926 851 209 -214 -883 -1000 -687 15 771
5241G71P5q2m72m43q10j44L33P83J57O87j39k94j055j01k26M92M16M52P60l68
$$ 771 846 764 292 -151 -961 -1105 -772 11 168 855 716 422 -633 -734 -960 -468 -52 400 1160 792
5261G92m84m65p63j97M45N84Q25J06K5j89j094n02j87M51N55N34N35r6n97o71
$$ 792 308 -157 -920 -1117 -672 -88 737 843 868 679 -415 -917 -1104 -653 -98 436 971 875 278 -393
5281c93o52oM24L65R34M38k24n12p38n14l06O08R22K3N02J08q21p68k21k40L10
$$ -393 -1045 -1051 -627 -262 672 1110 886 374 -364 -878 -1184 -576 346 369 871 979 158 -610 -831 -1071 -761
5302g61P76O14K77j82m15p22l42j68M19M02Q27N18n66l54o00n27n76R52Q21K15
$$ -761 15 629 906 724 309 -413 -755 -923 -504 -102 725 1243 677 323 -277 -804 -1380 -428 393 608
5322F08K69L58j043p74j31m2L43Q21N97J47k25m87p43p38J28O07M40N58L96jj046
$$ 608 877 1235 192 -582 -713 -755 -412 409 1006 1153 928 441 -302 -1040 -912 -305 135 693 1089 1088 42
5343D2o03m52j7N63N77O30P4J59p09r87l05J31j2J054O65J03m22l41m96p15j96
$$ 42 -561 -1013 -1030 -467 110 740 814 973 264 -723 -1028 -897 -909 145 810 913 491 150 -346 -1061 -1257
5364a257R47O03N90L19n96l89q01l12QL41P88M62Q5K56p02r99j54J14K19Q51M86
$$ -1257 -310 293 883 1202 606 217 -584 -896 -888 -547 241 703 788 1044 342 -657 -811 -697 -478 373 859
5385H59m1l92k06n99q05K03O78O35M45P10n79j034m85l20j04N10R43K71K9o3n88
$$ 859 818 426 220 -379 -1184 -981 -303 332 777 1487 908 -126 -611 -931 -1035 -525 418 689 718 655 67
5406F7p38r4j5L11O14O99J26k67n31n36n78k6N31Q23L67K94k06o97n94m50P7J96
$$ 67 -671 -765 -780 -469 145 844 970 703 172 -364 -942 -968 -437 386 753 1047 841 144 -450 -900 -823 -627
5428f27Q70O79N7k36n40q94j77M6O47L83R03k94m91l01n10o49J5Q69N80N68J3
$$ -627 243 922 979 743 203 -691 -868 -822 -175 208 1111 817 326 25 -485 -1134 -1119 -250 330 898 911
5449I11j97q00o34j93l5L82R79M70J44k80p40o43m92M7Q71O10L40M12o26o86o85
$$ 911 714 -86 -720 -913 -948 -566 413 883 1027 747 7 -636 -1128 -1081 -210 400 740 1152 526 -160 -845
5470h45k67J70L63J059M34J2k48o06p12m47O36K03N51N61J08j64q92l57p46L84
$$ -845 -1112 -942 -579 480 914 926 678 72 -640 -1087 -451 -248 303 864 972 808 -84 -441 -1187 -803
5490h03M48Q12K67K64m36o54n53o14N65K54R99O11k04m48n27n30m40k0P64O99
$$ -803 -355 457 724 988 552 -102 -655 -1269 -704 -450 549 1160 956 508 -19 -549 -989 -1009 -245 454
5510D54L25M22m93j044l76j98J36N72O18O69j91k68o92l59o25q0Q07P45P59j69
$$ 454 779 1201 708 -336 -712 -910 -774 -202 416 1085 894 626 -66 -425 -1050 -1130 -323 422 1181 1012
5530A012n15o99l38k25k02R42M82M46L27r07n25n20j63J1N76R41R0q0l72k82r69
$$ 1012 497 -202 -540 -765 -967 -25 457 903 1230 323 -202 -722 -885 -874 -298 643 733 653 281 -1 -970
5551i70l03M82O92M76O04O6m73p66p48j72R8Q67P35l8K33l19n44p67j95J65N07
$$ -970 -1273 -791 -99 377 981 1047 574 -192 -940 -1112 -1014 -147 588 550 783 464 -80 -847 -1042 -877 -370
5572c70R47L76j49k90k35j138k44M75O91L11N53l0l60j010l18n4O3O91R54L75
$$ -370 577 953 804 514 279 -859 -1103 -628 63 374 927 897 537 -473 -791 -845 -782 -91 863 1238
5592A238l29k89r47o79J33Q9L71J094N39n51l55o27m26l62L15Q47L46L05M15n28
$$ 1238 909 620 -327 -1006 -873 -784 -413 681 1220 669 314 -313 -739 -1101 -786 61 407 712 1127 599
5612E99j025o37J66J30O27Q09K71n9m48r10n08J10M70J85Q65N33l59m59l37r11
$$ 599 -426 -1063 -897 -767 -140 669 940 881 433 -477 -985 -875 -405 -220 645 1178 819 360 23 -888
5632h88k39L88R40M18J45K89p09q49m58j06L73P38O83J66l7m08q08q38M9O93L24
$$ -888 -1127 -739 201 619 764 1053 344 -505 -963 -1069 -696 42 725 891 854 446 -362 -1200 -1151 -458 -134
5653a34N34P07j93q05k57n37k97N15O20M61M55k54o11n54k97k18k3J167O22j19
$$ -134 400 1107 914 109 -148 -685 -982 -467 153 614 1069 815 204 -350 -647 -865 -888 279 901 782
5673G82j68j98p45p62K46K40O20N39O56m09m63o73o49J9L57P78L49N90l77l88
$$ 782 614 416 -329 -1091 -845 -605 15 554 1210 801 338 -335 -984 -965 -608 170 519 1109 732 344
5693C44r83m67j0L37N79R25L95n52k81m35q29j26N46N85P47O7j32o15n62m22j53
$$ 344 -639 -1106 -1116 -779 -200 725 1120 568 287 -148 -977 -1103 -557 28 775 842 710 95 -467 -889 -1042
5714a042O06N57R39p1N3p15j038j78p1L53P03N51L14k06m72q24m22k8K69R07O24
$$ -1042 -436 121 1060 989 1042 327 -711 -889 -960 -607 96 647 961 755 283 -541 -963 -991 -722 185 809
5735H09R5k19m34q18l50j90N89O29O66L80k64o81n01o53j8N88N21N47J27j58p07
$$ 809 904 685 251 -567 -917 -1107 -518 111 777 1157 893 212 -289 -942 -960 -372 149 696 823 665 -42
5756d2n39l69j52O58N66R29M8m18n75m36n97j00N15N89O66J74l17p88m50k3k79
$$ -42 -581 -950 -1102 -444 122 1051 1099 681 106 -330 -927 -1027 -512 77 743 917 600 -188 -638 -661 -940
5777i40M53R73J76K50k21n84q41l90K43N70M62P98n0n54k47q30k15j53Q62L24
$$ -940 -487 486 662 912 691 107 -734 -1124 -881 -311 151 949 899 345 98 -732 -947 -1100 -238 86
5797H6M00O66n22n96o65j20k33O17O40M54K97k69o14r43k81K44M77P08N26K13
$$ 86 486 1152 630 34 -631 -751 -984 -367 273 727 1024 755 141 -802 -1083 -839 -362 346 872 1085
5817A085m55o01n49n07J33Q56K55O39J24k99p64m79m38L86P2R02P83l14j28n21
$$ 1085 630 29 -520 -1027 -894 -38 217 856 980 681 -83 -562 -1000 -614 -542 360 1143 829 701 180
5837A80r29n60L05O72O57N93M05j013l10p55k40J28Q82L51M17M10m00q79r20M67
$$ 180 -749 -1309 -1004 -332 325 918 1323 310 0 -755 -995 -867 15 366 783 1193 793 -86 -1006 -539
5857e39k41M09Q65L58J7k25p52n23n44M11N34K48P28M65m84p21l09r83M47O36
$$ -539 -780 -371 494 852 869 644 -108 -631 -1175 -764 -230 18 746 1211 727 6 -303 -1286 -839 -203
5877b03O42N03J46m27o26q12j43K08M5J191N14m1n55m72q67l83M45N95O39O12
$$ -203 439 942 1088 661 35 -777 -920 -712 -667 524 1038 997 442 -30 -897 -1280 -835 -240 399 1011
5897A011K85r16m58n18j60j04P85M87L31J22j85q53q42M8K52L22J046M22l34m10
$$ 1011 1296 380 -78 -596 -756 -860 -75 412 743 865 680 -173 -1015 -967 -715 -393 653 1075 741 331
5917C31l73o22m31N87M68P50K87N3o35m68n53k16j22O10Q07O09k49k17q38l11
$$ 331 -42 -664 -1095 -508 -40 710 997 1050 415 -53 -606 -822 -944 -334 473 1082 833 616 -222 -533
5937e33o07M61M96N29O46j94n93o8p78o13K74Q21P67M55j6m01r96o82k5K29R71
$$ -533 -1140 -679 -183 346 992 798 205 137 -641 -1254 -980 -159 608 1063 1047 646 -350 -1032 -1057 -828 143
5958A43N25K06R6o06n95k86p13M90N07O98L87K6p42n73k02j17J95M09P05M24N0
$$ 143 668 874 970 364 -231 -517 -1230 -740 -233 465 852 878 136 -437 -639 -756 -561 -152 553 977 1027
5979A027n49p03m69l02L94N11P73J08J58p15m52o08l88P72K06J101K44j16p02
$$ 1027 478 -225 -694 -996 -602 -91 682 790 948 233 -219 -827 -1215 -443 -237 864 1108 992 290
5998B90o88l52R0J47M93O73K22k32l08n65n43k34M20P12K90N03k3o65o59k19n25
$$ 290 -398 -750 -660 -513 -20 653 875 643 335 -230 -773 -1007 -587 125 415 918 895 230 -429 -648 -1173
6019a173N09N70P09L47k40m36n85p51K15L73L40Q50M17k98n15o10n72l26N92O43
$$ -1173 -664 -94 615 962 722 286 -299 -1050 -835 -462 -122 728 1145 847 332 -278 -850 -1176 -584 59
6039E9O16R8K07p01q61l65j55L52P95Q42R4p52J37o65o44K06M62L07O73N04m06
$$ 59 675 773 980 279 -582 -947 -1102 -750 45 887 981 229 366 -299 -943 -737 -275 32 705 1209 803
6060H03q96l43l31n60O71P99N09K70J16o69q76l88r2K67P04P53L35l72l87p52
$$ 803 -93 -436 -767 -1327 -656 143 652 922 1038 369 -507 -895 -987 -720 -16 737 1072 700 313 -439
6080d39l25n7K91N72P72K07j93q07m03m10k01L36J120J30K37M3m10r10j22k3M2
$$ -439 -764 -821 -530 42 814 1021 828 21 -382 -792 -993 -657 463 593 830 873 463 -447 -569 -592 -550
6101e50M38R30J00k77l04o52n37k08P53O44L31M89k65q63m49o24j60N03Q70O58
$$ -550 -112 818 918 641 337 -315 -852 -1060 -307 337 668 1157 892 29 -420 -1044 -1204 -701 169 827
6121H27J17j63n23p12o39K03K82O33Q07J44l00m90r91j30n2O74N95K86L49j33
$$ 827 944 781 258 -454 -1093 -890 -608 25 832 976 676 186 -805 -935 -987 -313 282 568 917 784
6141G84p25p12j53MK9J167P19l86L42j058o99k21k4M78M54R66J15n92n71l56l47
$$ 784 59 -653 -806 -802 -773 394 1113 727 1069 11 -688 -909 -933 -455 -1 965 1080 488 -83 -439 -786
6162g86l0M97O16J71M02p3o42r24J4l4K21Q77O50k03k35%j055k79o0O36M95N12
$$ -786 -816 -319 297 468 870 797 155 -769 -755 -789 -568 309 959 756 521 521 -534 -813 -873 -237 258 770
6184G70J7j74m47n55n43OO49O48L75K54k38j060j20m12J81J72R26M54J61m23o38
$$ 770 787 613 166 -389 -932 -926 -277 371 746 1000 762 -298 -418 -830 -649 -477 449 903 1064 641 3
6205Cr80J05K67K12P51K50J58j12q62l73m50Q5N23Q12N83j90qq15n86j17j27N10
$$ 3 -977 -872 -605 -393 358 608 766 654 -208 -581 -1031 -946 -423 389 972 782 774 -41 -627 -744 -871 -361
6227c61P08M94l88j93l45q16k60J91N28R07K23K60l92o07p54l52L22N90M17Q36
$$ -361 347 841 453 260 -85 -901 -1161 -970 -442 465 688 948 556 -51 -805 -1157 -835 -245 172 1008
6247A008j94m57n98n66M79l25O05L48M35J01k29n96r16J34J64J08R03O63n75r2
$$ 1008 814 357 -241 -807 -328 -653 -48 300 735 836 607 11 -905 -771 -607 -499 404 1067 492 400
6267D00o09m14m06J88N75O75O01j12m37n98k97k84J08O92J43L66K78m82n58p22
$$ 400 -209 -623 -1029 -841 -266 409 1010 898 461 -137 -434 -718 -610 82 225 591 869 387 -171 -893
6287h93l7O4P83N91N01l16l61l52q38J15L00K59Q71L08O5o40q34k75m49M34P26
$$ -893 -930 -866 -83 508 1009 693 332 -20 -858 -743 -443 -184 687 995 1060 420 -414 -689 -1138 -704 22
6308B2M67L20J75n87n47o16P9p2L88P32O67j67n43m18n39j16Q0P21N88J89K6l13
$$ 22 489 809 984 397 -150 -766 -687 -759 -371 361 1028 861 318 -100 -639 -755 -675 46 634 823 849 536
6330E36r43k39j41l6R34M46K34j66L8j084m15J84J47N12N52N23k44m84n94n14
$$ 536 -407 -646 -787 -823 111 557 791 625 663 -421 -836 -652 -505 7 559 1082 838 354 -240 -754
6350g54k41M22Q18L05L22j20o49l93l16k76K02P77N80J98j64j62o23q99M9M40
$$ -754 -995 -573 245 550 872 752 103 -290 -606 -882 -680 97 677 875 711 549 -74 -973 -924 -484
6370d84K21N63O61k73n88l51l92l08M82O77L05K48J62p37o65m94J56K43O90N69
$$ -484 -263 300 961 688 100 -251 -643 -951 -469 208 513 761 923 186 -479 -973 -817 -574 116 685
6390F85K15j31m48n79m65j46N01M00N50L32q6n80p29L3l66K91Q29L57K23j81n58
$$ 685 900 769 321 -258 -723 -869 -368 32 582 914 828 248 -481 -448 -814 -523 306 663 886 705 147
6411A47o20m32L31j29P38O64K96l41l44m81n29l57J022K06K92L53k62m22n96j95
$$ 147 -473 -905 -574 -703 35 699 995 654 310 -171 -700 -1057 -35 171 463 816 554 132 -464 -659
6431f59j56K78Q67R2K80J18n38m62p56M32J7N16O41J65k32o03l90l53j6N40M48
$$ -659 -815 -537 330 422 702 820 282 -180 -936 -504 -487 29 670 835 603 0 -390 -743 -759 -219 229
6452B29N96j29R9q65l45l38l45R17L61M32J6K7l67q88k74j15O21M60N41L37l61
$$ 229 825 696 795 -70 -415 -753 -1098 -181 180 612 628 655 288 -600 -874 -989 -368 92 633 970 609
6473F09o32m40o71L13M93M24M12N76n09n13p30l4k00M07P82L73J73j78m71o83
$$ 609 -23 -463 -1134 -821 -328 96 508 1084 575 62 -668 -702 -902 -495 287 660 833 655 184 -499
6493d99m12j6Q11R8N15J59o1p99j44l53j6N23K71O49R6n5o48p09k69J1N74N14
$$ -499 -911 -927 -116 -18 497 656 595 -204 -348 -701 -717 -194 77 726 822 767 119 -590 -859 -848 -274 240
6515B40L36K67k56o82j61n26J03K15R23J66M2on06p14j03o0L03P12M06r9j52k66
$$ 240 576 843 587 -95 -256 -782 -679 -464 459 625 667 661 155 -559 -662 -722 -419 293 699 600 448 182
6537A82r45k31J20M29N94M64M79l98p20n23m04L59J45P22M55J61p8o82q23j56
$$ 182 -763 -994 -874 -445 149 613 1092 694 -26 -549 -953 -594 -449 273 728 889 811 129 -694 -850
6557h50M14M4N95P19k26m50m02m57l43k1O28P21M48kl83n03n56j46J38M42M93
$$ -850 -436 -392 203 922 696 246 -156 -613 -956 -977 -349 372 820 818 435 -68 -624 -770 -632 -190 303
6578C03M02o2l87p2o94l10L11M03L36N25R1l54q90j79k29J0O92M87M30J86k17
$$ 303 705 643 256 184 -510 -820 -509 -106 230 755 846 492 -398 -577 -806 -796 -104 383 813 999 782
6599G82j079o87J77M6K85O68N19j99q6m86o44k64M21J71O83L54K93o40m40l53
$$ 782 -297 -984 -807 -761 -476 192 711 512 426 -60 -704 -968 -547 -376 307 661 954 314 -126 -479
6619d79l33K0P44N20J74K30l46q73m27K16j4K32M03P68k17k35j91p16j44J66N57
$$ -479 -812 -792 -48 472 646 876 530 -343 -770 -554 -568 -336 67 835 618 383 192 -524 -668 -502 55
6640E5N8O81K18p05n80l26J02m43P58R84j18m1k87o24n93K23K10L44N43L27p5
$$ 55 113 794 1012 307 -273 -599 -497 -940 -182 802 684 643 356 -268 -861 -638 -428 -84 459 786 711
6661G11l49l55n33k81N8Q57M74K18r3l29o31m97K71L3M79L92J62J10k93o14m93
$$ 711 362 7 -526 -807 -749 108 582 800 707 378 -253 -750 -479 -446 33 425 587 697 404 -210 -703
6682g03P2K20J93O63M39P0p13m31n80n0K16L35O06J86L65n95p06l59J65K9O98
$$ -703 -631 -411 -218 445 884 954 241 -190 -770 -820 -604 -269 337 523 888 293 -413 -772 -607 -578 120
6703A20N68j03Ok08o64m09J12L8N19L87M51k84r0p79m25J8L72M28K65L42k3j06
$$ 120 688 585 591 383 -281 -690 -578 -540 -21 366 817 533 443 -336 -761 -743 -371 57 322 664 641 535
6725E35q75l36r3K51L41O01K26K17p06j94l73m90O69L39K78J83K11l86q56j41
$$ 535 -340 -676 -769 -518 -177 424 650 867 161 -33 -406 -896 -227 112 390 573 784 398 -458 -599
6745e99rJ03O40K60K76j05o10k05l74k38K79O24K70M43j37j90k76p79%K6O51L13
$$ -599 -608 -505 135 395 671 566 -44 -249 -623 -861 -582 42 312 755 618 428 152 -627 -627 -601 50 363
6767C63N28l60j83o12q02N33r3P72K13N45l90k67n59n11O3J19Q33M60R7j76m28
$$ 363 891 531 348 -264 -1066 -533 -626 146 359 904 514 247 -312 -823 -760 -641 192 652 749 573 145
6788A45m51k62q0L48O20L63%j51j91o63m84K60K11M99N16j65n0n21j87m90l1K90
$$ 145 -306 -568 -648 -300 320 683 683 532 341 -322 -806 -546 -335 164 680 515 465 -56 -243 -733 -764 -474
6810d74Q77J20O0J01o23m61k33J25J31M51M34J50j17j89n09p44J43L65O97L49
$$ -474 403 523 583 684 61 -400 -633 -508 -377 74 508 658 541 352 -157 -901 -758 -393 304 653
6830F53K50k87q44j37k60m8M13P50J33J12r5o85m67j08J43M3P40M35k24q6l86
$$ 653 903 616 -228 -365 -625 -673 -260 490 623 735 640 -45 -512 -620 -477 -434 306 741 517 431 45
6851D5l33m47N7N56K13K34M15j62m16k89l83k80P34L14L78l3K47p87o83j8QK72
$$ 45 -288 -735 -678 -122 91 325 740 578 162 -127 -510 -790 -56 258 636 603 850 63 -620 -638 -630 -358
6873c58M29N24J00n67L6m26m02K80K02M00J44Q23p24o53k54k93L25j2Q76J93N7
$$ -358 71 595 695 128 164 -262 -664 -384 -182 218 362 1185 461 -192 -446 -739 -414 -426 450 643 700
6894G00k81l44m32m87K65L52M05L38J36k19m61m34j08q6M40P53J30P7k23p67n27
$$ 700 419 75 -357 -844 -579 -227 178 516 652 433 -28 -462 -570 -656 -216 537 667 744 521 -246 -773
6915g73J65k9K96O97K12n9o2m08o76k60M88J94N57J77J84j80l92m76j27k37M98
$$ -773 -608 -637 -341 356 568 509 447 39 -637 -897 -409 -215 342 519 703 523 131 -345 -472 -709 -211
6936b11N29Q7pnm15o59l5J63M77L78N07m01r0j12o27l52L33N54J10Q7M99n50k97
$$ -211 318 405 398 393 -22 -681 -716 -553 -76 302 809 408 318 206 -421 -773 -440 114 224 311 810 260 -37
6959c7m59j39kL65O03K75J74l08m96l08k63k0L80L37O53j99j53o63k74j51J13
$$ -37 -496 -635 -637 -272 331 606 780 472 -24 -332 -595 -615 -235 102 755 556 403 -260 -534 -685 -572
6980e72P00K57M26k43l49k29m31l56K49L80L55K32J70j11q51o8k31K20K13P09
$$ -572 128 385 811 568 219 -10 -441 -797 -548 -168 187 419 589 478 -373 -441 -672 -452 -239 470
7000D70N1o7j00n53l79k34L67J37O28K75k0l99n69k18J23q2M62M08K70q8k12o51
$$ 470 521 454 354 -199 -578 -812 -445 -308 320 595 575 176 -393 -611 -488 -570 -108 300 570 482 270 -381
7022c81p2k57K47M39L74L36p9l03l82k37k49L08K60N90Q5q1n83k33j59l27K63
$$ -381 -453 -710 -463 -24 350 686 607 304 -78 -315 -564 -256 4 594 679 598 15 -218 -377 -704 -441
7043d41M22J37M02J90p82J21n60L5R1M34M24r5L87m24o57j42j15M01J12L10M76
$$ -441 -19 118 520 710 -72 49 -511 -476 -385 49 473 378 765 341 -316 -458 -573 -172 -60 250 726
7064G26j36m40l33j73k17J9O07M08M09l10m8q82j80p7K75L80M59J19j55r4p30
$$ 726 590 150 -183 -356 -573 -554 53 461 870 560 512 -370 -550 -627 -352 28 487 606 451 357 -373
7085c73n43L89L40K75M53L29l4r24J86l98k44K48N89K24J85j38k61p48k00J82
$$ -373 -916 -527 -187 88 541 870 836 -88 98 -300 -544 -296 293 517 702 564 303 -445 -645 -463
7105d63n4O24M96k48k6O1p81l09O2L17M87K64J94Op36r7l36j9J75N62l3M09J85
$$ -463 -517 107 603 355 329 390 -391 -700 -638 -321 166 430 624 630 -106 -203 -539 -558 -383 179 146 555 740
7128G40l56q44k72N42l32N11N94j66l9j44m51n00J15N52M22j07N53n45l26k68
$$ 740 384 -460 -732 -190 -522 -11 583 417 378 234 -217 -717 -602 -50 372 265 818 273 -53 -321
7148c21q7J8j13R87l3J8j71j53l41m33R7M27M65L67J23n31l34l42j53N0L04N34
$$ -321 -408 -390 -503 484 451 469 298 145 -196 -629 -532 -105 360 727 850 319 -15 -357 -510 -460 -156 378
7170C78K1R7l3l55k34l37j50L24L19N66R8o1n05n60j25J66q9M18Q27j62k79j62
$$ 378 399 496 463 108 -126 -463 -613 -289 30 596 694 633 128 -432 -557 -391 -480 -62 765 603 324 162
7192A62l51l57m2L27L82J74J43N7l77m89j02R1J43M22L83j14O7m53p09L3R5M69
$$ 162 -189 -546 -588 -261 121 295 438 495 118 -371 -473 -382 -239 183 566 452 519 66 -643 -610 -515 -46
7214d6J19N96J79n04l62l94m06L35L24K60L44J62k93m14r3l20j81K99P80K4J19
$$ -46 73 669 848 344 -18 -412 -818 -483 -159 101 445 607 314 -100 -193 -513 -694 -395 385 409 528
7235E28j39m80l97J45k29K16N30J76K93l40l71l16n22K35P48K30K40k65m3k62
$$ 528 389 -91 -488 -343 -572 -356 174 350 643 303 -68 -384 -906 -671 77 307 547 282 239 -23
7255b3o0n35P7N78K02L11q5m21l16k60J62j32J01Q41o6mj58k81m08j02J17K87
$$ -23 -83 -618 -541 37 239 550 465 44 -272 -532 -370 -502 -401 440 374 370 212 -69 -477 -579 -462 -175
7277a75K40M98j05J2o56k55M08m89M68L01J87J70m45l84o5m09M60J67O24K01l48
$$ -175 65 563 458 470 -186 -441 -33 -522 -54 247 434 604 159 -225 -290 -699 -239 -72 552 753 405
7298D05k39m82j20j92K95L26L12M1R3k76j13j94m56n5P24M77MJ70n54m82k45j20
$$ 405 166 -316 -436 -628 -333 -7 305 346 439 163 50 -144 -600 -655 69 546 550 720 166 -316 -561 -681
7320f81K33K13M95M36j12r2m97p75K74J56K84P16j15N2l71l29j27j94j18N82K39
$$ -681 -448 -235 260 696 584 492 -5 -780 -506 -350 -66 650 535 587 216 -113 -240 -434 -552 30 269
7341B69K63j34j21o30r1l4J97l4O52J72j07k85j86n83L23k73M75K17L99L51o50
$$ 269 532 398 277 -353 -444 -478 -281 -315 337 509 402 117 -69 -652 -329 -602 -127 90 489 840 190
7362A90j95l11k10R0M68M16l01J07L3m23l05P3M3l9P70L06k77m42Q3l70n23P52
$$ 190 -5 -316 -526 -436 32 448 147 254 287 -136 -441 -368 -325 -364 406 712 435 -7 76 -294 -817 -65
7384f5L1Q0M50Mo72q9l43L03J9K62K58L18j15k11n64k01M4M12N6M42K06l46j95
$$ -65 -34 46 496 500 -172 -261 -604 -301 -282 -20 238 556 441 230 -334 -535 -491 -79 -23 419 625 279 84
7407H4k52jm53K54L96K47M31r7l82o14k3R8j74O00K64K9j54l4n15j83n0L54K07
$$ 84 -168 -169 -622 -368 28 275 706 609 227 -387 -410 -312 -486 114 378 407 253 219 -296 -479 -529 -175 32
7430C2L83KP4J9o08l93MR8L36L46K52j28l05k38k85jJ48K05L21J41P9l33m73j03
$$ 32 415 417 491 510 -98 -491 -487 -389 -53 293 545 417 112 -126 -411 -412 -264 -59 262 403 482 149 -324 -427
7454d27M5m7L26N09K67k97l64j82j72j16J56K54R1N43q2n83j35Q6k11lN48l2L52
$$ -427 -382 -429 -103 406 673 376 12 -170 -342 -458 -302 -48 43 586 504 -79 -214 -128 -339 -342 206 174 526
7477E26j35l63m31J86j24L05O1N64k5j30l70l28l46J07J33L69K89J25J56o43K4
$$ 526 391 28 -403 -217 -341 -36 25 589 564 434 64 -264 -610 -503 -370 -1 288 413 569 -74 -50
7498e0m71m4K70M57J02K88m98n8l28k33J58L85L00K64L2r1m84m67j37p9N90K1
$$ -50 -521 -565 -295 162 264 552 54 -4 -332 -565 -407 -22 278 542 574 483 -1 -468 -605 -684 -94 -73
7520g3M99J7l39k4k28n19K72K06M05Q6J94k19p1m48k42J90R8L92J93j28J24l70
$$ -73 426 443 104 80 -148 -667 -395 -189 216 302 496 277 206 -242 -484 -294 -196 196 389 261 385 15
7542A5m16M2J44R2l7O14n6L6m17l74o0k3J70L60K83l9k80p3l09k40K04P0M61L36
$$ 15 -401 -359 -215 -123 -160 454 398 434 17 -357 -417 -440 -270 90 373 334 54 -19 -328 -568 -364 -294 167 503
7566E03p1j2m96k97O2m1J57L71J89K28k85n03r4j06q3L66K71L11j42j69R6l42
$$ 503 432 420 -76 -373 -311 -352 -195 176 365 593 308 -195 -289 -395 -478 -112 159 470 328 159 255 -87
7588h7m19M29j27L41K36M35n66k9k38m54M4K12N07L3K62l23m56j09J5j23K68J74
$$ -87 -506 -77 -204 137 373 808 242 213 -25 -479 -435 -223 284 317 579 256 -200 -309 -294 -417 -149 25
7610B5N41k5m09k60l15L0k1K79K55L99j14l35j75Q6l08k36M86K89K17j61L2l33
$$ 25 566 541 132 -128 -443 -413 -434 -155 100 499 385 50 -125 -39 -347 -583 -97 192 409 248 280 -53
7632e3k88J9m0N94j28L17m5j02k68m86K3K68L63J81J12J70o16j08k62j75J01K99
$$ -53 -341 -322 -362 232 104 421 376 274 6 -480 -457 -189 174 355 467 637 21 -87 -349 -524 -423 -124
7654a24M09q0L52n15j07k30J62J58k45K82M15j1m57o7m83J39J48K38O2N04j95
$$ -124 285 205 557 42 -65 -295 -133 25 -220 62 477 466 9 -58 -541 -402 -254 -16 46 550 355
7675C55j53n42M5j69P6L43N26J67j62m48k53j61J51J1L0N57K61l81o2l79k90L1
$$ 355 202 -340 -295 -464 -388 -45 481 648 486 38 -215 -376 -225 -214 -184 373 634 253 191 -188 -478 -447
7697d47J03L73M2M15p4l63l51J8j4j66M39K08K82k80j65j39k35J90N2N5M12k4
$$ -447 -344 29 71 486 412 49 -302 -284 -298 -464 -25 183 465 185 20 -119 -354 -164 -112 -57 355 331
7719C31k86K58n26k43J11M96k9oM23j87k33j73k16n1PL13J71J39K18l39m49Qj60
$$ 331 45 303 -223 -466 -355 141 112 106 529 342 109 -64 -280 -331 -324 -11 160 299 517 178 -271 -263 -423
7742d23K35K60K05L89m44m04N9M3l68M13K17l9K67J65l98m59L8j26K7L79J29K33
$$ -423 -188 72 277 666 222 -182 -123 -80 -448 -35 182 143 410 575 177 -282 -244 -370 -343 36 165 398
7764C98p5l96j04j80k64R7P34P2P3K63m80r5k79Q7n2N35J16p3K6k69M3j77n15
$$ 398 323 -73 -177 -357 -621 -524 210 282 355 618 138 43 -236 -149 -201 334 450 377 403 134 177 0 -515
7787e15K56M49J65k27K01k86k78K9j16J76K23J21K77m6m82k78r6N3K27J53K92
$$ -515 -259 190 355 128 329 43 -235 -206 -322 -146 77 198 475 429 -53 -331 -427 -374 -147 6 298
7808B98J32k44m8n59K37k61J14O07k0O2o1k91m91K06o0K16P4K78J12k86K39o83
$$ 298 430 186 138 -421 -184 -445 -331 276 256 318 257 -34 -525 -319 -379 -163 -89 189 301 15 254 -429
7830d29J0L7K95M70k54L32k62m55Qm7n8J95K07N27l64N5r3o93k0L21j46L33M08
$$ -429 -419 -382 -87 383 129 461 199 -256 -248 -295 -353 -158 49 576 212 267 174 -519 -539 -218 -364 -31 377
7853C77L6l63J30k81l42K27K13L34r0K97k43k23n3r7nJ22K99R0k36J15j96j60
$$ 377 413 50 180 -101 -443 -216 -3 331 241 538 295 72 19 -78 -83 39 338 428 192 307 111 -49
7875d9J05l28M3M00K62k47J75m62n0j09q7L73R7N0M9j3k07k08k23J21K51J35J95
$$ -49 56 -272 -229 171 433 186 361 -101 -151 -260 -347 26 123 173 222 209 2 -206 -429 -308 -57 78 273
7898B73Q7k53m95J11k10K95L00j58L25j57q2k38J5l2j07L18J52M56l61l26m8q5
$$ 273 360 107 -388 -277 -487 -192 108 -50 275 118 36 -202 -187 -219 -326 -8 144 600 239 -87 -135 -220
7920b20j61k12O32J43K16q0j26j56l39m5l3L81j5N01J15m19k06m03j92L13J96
$$ -220 -381 -593 39 182 398 318 192 36 -303 -348 -381 0 -15 486 601 182 -24 -427 -619 -306 -110
7941a10K48n2J78k64j20l23l1K93J6J75N77l12m0j99m15K57l25L21L56J7J05j94
$$ -110 138 86 264 0 -120 -443 -474 -181 -165 10 587 275 235 36 -379 -122 -447 -126 230 247 352 158
7963A58m85K33n31L73K56L13o1k9j4m91l5J97n9K36l6K69o8Jl87M5l8l59M25K83
$$ 158 -327 -94 -625 -252 4 317 256 227 213 -278 -313 -116 -175 61 25 294 226 227 -160 -115 -153 -512 -87 196
7987A96L2J0r2l37k9o8K40r2L87J91P2j95n52j78K15R7M69l91M90k23k48n4M7
$$ 196 228 238 146 -191 -220 -288 -48 -140 247 438 510 315 -237 -415 -200 -103 366 -25 465 242 -6 -60 -13
8010a3l62K33K66q5L18k51O6n37o2L14P6J44k8J54J50l97q2j26k98M31J67J51
$$ -13 -375 -142 124 39 357 106 172 -365 -427 -113 -37 107 79 233 383 -14 -96 -222 -520 -89 78 229
8032B29R5j11n7l28M5p1j09M04J1K52L4l80j11k30k47K80L31K6M28l36J17l48
$$ 229 324 213 156 -172 -127 -198 -307 97 108 360 394 14 -97 -327 -574 -294 37 63 491 155 272 -76
8054g6m0j97o4M11K42J7N2j13m35j47o9L97M4J4L41j22j20k11p2k85L06m5N33
$$ -76 -116 -313 -377 34 276 293 345 232 -203 -350 -419 -22 22 36 377 255 135 -76 -148 -433 -127 -172 361
8077C61rj01l5l10J9k10k9M47p0L59j53l17J95n49Q0J89J05L61J58m27j54p3q3
$$ 361 352 251 216 -94 -75 -285 -314 133 63 422 269 -48 147 -402 -322 -133 -28 333 491 64 -90 -163 -246
8100b46j9J83K17o7J57oj47l22o9Q5L00r1M78k17j7k90Pm00L2L50J51L80j27j44
$$ -246 -265 -82 135 68 225 219 72 -250 -319 -234 66 -25 453 236 219 -71 -64 -464 -432 -82 69 449 322 178
8124A78l42R6l76J15J65K82k03L72M3m89l81q7L18o2K42M68k0p2k67j84P8o6J79
$$ 178 -164 -68 -444 -329 -164 118 -85 287 330 -159 -540 -627 -309 -371 -129 339 319 247 -20 -204 -126 -192 -13
8147a3J65J46J48l04j55j2j28k07OP48k10J86l43l10K43k06J15P7J15K86k38o0
$$ -13 152 298 446 142 -13 -25 -153 -360 -354 394 184 370 27 -283 -40 -246 -131 -54 61 347 109 49
8169D9n3k14J82j99O2K36L37j46O6o08J89J19rJ7O6K10p6K35l60l41n6m6
$$ 49 -4 -218 -36 -235 -173 63 400 254 320 -288 -99 20 11 28 94 304 228 463 103 -238 -294 -340
8191c40
$$ Imaginary data points
##PAGE= N=2
##DATA TABLE= (X++(I..I)), XYDATA
0@%%%%%%%%%%%%%%%%Qj6J6j6J6j6J9k7L2l2M0m8N1o0O8p8R3j01J10j26J43j61
$$ 0 0 0 0 0 0 0 0 0 0 0 0 0 0 0 0 0 8 -8 8 -8 8 -8 11 -16 16 -16 24 -24 27 -33 35 -43 50 -51 59 -67 76 -85
38h5J80k03K26k50K78l07L40l76M14m57N03n53O10o73P42q16R03j004J112j238
$$ -85 95 -108 118 -132 146 -161 179 -197 217 -240 263 -290 320 -353 389 -427 476 -528 584 -654
58f54J388j564J777k036K366k800L393m267N679q326J4966o3752j32217M6371
$$ -654 734 -830 947 -1089 1277 -1523 1870 -2397 3282 -5044 9922 -53830 -186047 -139676
72a39676M1227O7709J40471Q6163o6779r0071o9682j06974n6682J02113J16609
$$ -139676 -98449 -30740 109731 195894 129115 39044 -30638 -137612 -194294 -92181 24428
83B4428N7111P2863J5553j24973j24412m2162k1645J8997J26290J26356J3177
$$ 24428 81539 154402 169955 44982 -79430 -121592 -143237 -124240 2050 128406 141583
94A41583k6486m1972j26669j04319J9389N9556O5597J08347P2249m5668r3936
$$ 141583 115097 73125 -53544 -157863 -138474 -78918 -13321 95026 167275 121607 27671
105B7671o8100p8494m4231P7595J10598N7997M9429N112r6054j11901m5757q060
$$ 27671 -40429 -118923 -163154 -85559 25039 83036 132465 137577 41523 -70378 -116135 -124195
117a24195K6000J00738J09417J7000k8998m5624j03790q7484J2372N7897O4058
$$ -124195 -98195 2543 111960 128960 99962 54338 -49452 -136936 -124564 -66667 -2609
128b609Q7380N9655l5631q6938o5762o1434l3179O3832R9255N6886L6467k430
$$ -2609 84771 144426 108795 21857 -43905 -105339 -138518 -74686 24569 81455 117922 115492
140A15492p8905r9158m6259K85K9974Q3329R4428K0763l1726m9121q4956p2600
$$ 115492 36587 -62571 -108830 -108545 -78571 4758 99186 119949 88223 39102 -45854 -118454
152a18454M076N5330O6807P0111M6048k5753p9183o7787m8817k0302N1320Q6943
$$ -118454 -114378 -59048 7759 77870 123918 98165 18982 -48805 -97622 -117924 -66604 20339
164B0339N9853K8139j3398o5796q3991m9104L412L8121P1301P7318K4597k9061
$$ 20339 80192 108331 94933 29137 -54854 -103958 -100546 -62425 8876 86194 110791 81730
176H1730n5185p4320n5173m51M8003P0079O2086L0721k1547o7282o8663m4979
$$ 81730 26545 -47775 -102948 -103399 -55396 14683 76769 107490 85943 18661 -50002 -94981
188i4981o259M6779P1334O0248K7278k4445n9733o8444m7987L11M4828O7488O0567
$$ -94981 -101240 -54461 16873 77121 104399 79954 20221 -48223 -96210 -95899 -51071 16417 76984
201G6984K3119k1819n9468p0714l9951N07L8475P0704O0394J7378k2719n5062
$$ 76984 100103 78284 18816 -51898 -91849 -91342 -52867 17837 78231 95609 72890 17828
213A7828o6444m6406M244M7927N7720N6629K9486l0785o0999n4876m2273m543
$$ 17828 -48616 -95022 -90778 -42851 14869 71498 100984 70199 9200 -45676 -87949 -92492
225i2492M8062O8737M7379J6545j3743n9390p2727k7819O418L0069O6878O2128
$$ -92492 -44430 24307 71686 88231 74488 15098 -57629 -85448 -79030 -48961 17917 80045
237H0045R563k9255m5454o0084m9100R793N3487M7264M9444L2782l3395o4950
$$ 80045 89608 60353 14899 -45185 -94285 -84492 -31005 16259 65703 98485 65090 140
249A40m5703l3286q834M6349P2434L9468P391r228n5023p4450k2509J5022K5565
$$ 140 -45563 -78849 -87683 -41334 31100 70568 77959 68731 13708 -60742 -83251 -68229 -42664
262d2664N9683O2869O661l6504m0269n1431m9735J0502N8463M2548L9570L3305
$$ -42664 17019 79888 86549 50045 9776 -41655 -91390 -80888 -22425 20123 59693 92998
274I2998l1032o8845m1896k2373r982M0914P5103L6657k357q077m7643p4995k1357
$$ 92998 61966 -6879 -48775 -71148 -81130 -40216 34887 71544 69187 61110 13467 -61528 -82885
287h2885K3097K4867M9970O2729P777m3495l8464m0546m9439P274O2584M2392
$$ -82885 -59788 -34921 15049 77778 85555 42060 3596 -36950 -86389 -79115 -16531 25861
299B5861K8380L1098k4240p0246m3214j2415p207L2811P3685L8699r857j0962
$$ 25861 54241 85339 61099 -9147 -52361 -64776 -71983 -39172 34513 73212 63355 52393
311E2393l9071p1453k4126K7798K8103M0862N7434J2111m5534m2254l1911m2826
$$ 52393 13322 -58131 -82257 -54459 -26356 14506 71940 84051 38517 -3737 -35648 -78474
323g8474K311O1211M5064K2651K3463j8580o6109m6474p505o33K7053O8433M0525
$$ -78474 -76163 -14952 30112 52763 76226 57646 -8463 -54937 -62442 -63075 -36022 32411 72936
336G2936j2353j6356l3944o3766k6956K8271L2839L5437M9314J5366m3962m5958
$$ 72936 60583 44227 10283 -53483 -80439 -52168 -19329 16108 65422 80788 36826 -9132
348i132k6988l4883j72N7065M8257J9038J5040j5486o0115m8456n467O639K3805
$$ -9132 -36120 -71003 -71175 -14110 34147 53185 68225 52739 -7376 -55832 -61299 -54660 -30855
361c0855O1052M1462j2079k2708l1402n4741k7547K5007L8052L3841L9672J5348
$$ -30855 30197 71659 59580 36872 5470 -49271 -76818 -51811 -13759 20082 59754 75102
373G5102l8805m8391k6946k6055P50M9471M9022K0569P282j6787n1516m7553q119
$$ 75102 36297 -12094 -39040 -65095 -64345 -14874 34148 54717 61999 45212 -6304 -53857 -61976
386f1976J2621K5308N1799L9455p860k6517l3179m5825k4741J9981M0024L5249
$$ -61976 -49355 -24047 27752 67207 59347 32830 -349 -46174 -70915 -50934 -10910 24339
398B4339L2061J1693l3460m7646k8830j9631M562M3343M6672K3393J599j9812
$$ 24339 56400 68093 34633 -13013 -41843 -61474 -56912 -13569 33103 56496 58095 38283
410C8283m4890m4113j0984J5435K8793M5550L4766m651k7634l6835l8994j9740
$$ 38283 -6607 -50720 -61704 -46269 -17476 28074 62840 58189 30555 -6280 -45274 -65014
422f5014J6216L9182L7642K7218O361k9386m4784l2135j5236J0874L7672M2435
$$ -65014 -48798 -9616 28026 55244 61605 32219 -12565 -44700 -59936 -49062 -11390 31045
434C1045K5974q72k5343m0243l8355j2874J6147L3619M1181K7092j941k5942m0803
$$ 31045 57019 56147 30804 -9439 -47794 -60668 -44521 -10902 30279 57371 55430 29488 -11315
447a1315l5437j2027J3420L5699M1129K4691j448k6992l9197l4228j4786J7845
$$ -11315 -46752 -58779 -45359 -9660 31469 56160 54712 27720 -11477 -45705 -60491 -42646
459d2646L6164L5442K6820j07l0042l8919l1242j2849J3287L7141M0567J9453
$$ -42646 -6482 28960 55780 55673 25631 -13288 -44530 -57379 -44092 -6951 33616 53069
471E3069j917k1908m2998l5239m911J4191L0353M1063K5359o789k8279l2435l3820
$$ 53069 51152 29244 -13754 -48993 -53904 -39713 -9360 31703 57062 50273 21994 -10441 -44261
484d4261j6213K1626L7275K9325K4773K900l2924m0189k4818j0380R326L8865
$$ -44261 -60474 -38848 -1573 27752 52525 55425 22501 -17688 -42506 -52886 -43560 -4695
496d695M1700J3184m351j7495m2641l6667j58J7187K5483L9097K7630j0859l1122
$$ -4695 37005 50189 45838 28343 -14298 -50965 -51123 -33936 -8453 30644 58274 47415 16293
509A6293k7246l0740j8563K4260L9652K3629K1305N311l3539m2362j9479o067
$$ 16293 -10953 -41693 -60256 -35996 3656 27285 48590 53901 20362 -22000 -41479 -47546
521d7546O281L6742M4530R210r281j3912l9552l8936K607K1750K1973L4697K9287
$$ -47546 -41265 -4523 40007 49217 39936 26024 -13528 -52464 -49857 -28107 -6134 28563 57850
534E7850j1883l5283k3539k5264j9971K2995M3052K1495J4845N997l0057m5069
$$ 57850 45967 10684 -12855 -38119 -58090 -35095 7957 29452 44297 50294 20237 -24832
546b4832j7912j03N218L2902M5695Q579j4584j3326l4097l8682J164K5943K2251
$$ -24832 -42744 -42847 -37629 -4727 40968 49547 34963 21637 -12460 -51142 -49978 -24035 -1784
559a784K8185K8949r960l8153k3472j9470j8723K0175M3930K2026R502M618k6138
$$ -1784 26401 55350 45390 7237 -16235 -35705 -54428 -34253 9677 31703 41205 45823 19685
572A9685m5184j8779N096O620K8372M4158J0157j8002j5626k9044l6129j127K8872
$$ 19685 -25499 -44278 -39182 -32562 -4190 39968 50125 32123 16497 -12547 -48676 -49803 -20931
585b0931K3407K3140K5870p016l8718k5537j4724j5013J6836M2644K4064N765
$$ -20931 2476 25616 51486 44470 5752 -19785 -34509 -49522 -32686 9958 34022 39787
597C9787P04k2308m2446k1244P600J0726K4539M0247J2015j8617j9276k5647l1309
$$ 39787 40491 18183 -24263 -45507 -37907 -27181 -2642 37605 49620 31003 11727 -13920 -45229
610d5229l080K8135K6565K0053K0998n443l6866k7843j2216j0111J5417L9555
$$ -45229 -48309 -20174 6391 26444 47442 41999 5133 -22710 -34926 -45037 -29620 9935
622I935K5527M003l831k0757l8512k1602Q356J4128K2858L5499J2452j7980k2244
$$ 9935 35462 39465 35634 14877 -23635 -45237 -36881 -22753 105 35604 48056 30076 7832
635G832k4050k6130l471K6345K8972J8538J5867n349l3695k8626j2529m530J5134
$$ 7832 -16218 -42348 -45819 -19474 9498 28036 43903 38554 4859 -23767 -36296 -40826 -25692
648b5692L4781K6634M141q077k0525l3878k1271O946J7614K3236K9722J1477j5343
$$ -25692 9089 35723 39864 31787 11262 -22616 -43887 -36941 -19327 3909 33631 45108 29765
661B9765k4819k3927k0680k073K2523K9625J9891J0965p173k9386k8168j4027
$$ 29765 4946 -18981 -39661 -41734 -19211 10414 30305 41270 34097 4711 -23457 -37484
673c7484o38J6950K9918K5106O255j0932k2283k8360j9659M510J9016K5015K5139
$$ -37484 -38122 -21172 8746 33852 40107 29175 6892 -21468 -41127 -36617 -17601 7414 32553
686C2553Q499j1756k4687k6583j6116Q96J9147K8263K1395Q218j0651k5330k6105
$$ 32553 41052 29296 4609 -21974 -38090 -37194 -18047 10216 31611 39829 29178 3848 -22257
699b2257j6040J407K0349K6146K1958Q386j2109k5110k5070j5299K518J7886K8058
$$ -22257 -38297 -36890 -16541 9605 31563 39949 27840 2730 -22340 -37639 -35121 -17235 10823
712A0823K2225M225r895k3015k8020j4217M630J7729K4883K3117O660j4313k3593
$$ 10823 33048 37273 27378 4363 -23657 -37874 -33244 -15515 9368 32485 39145 24832 1239
725A239k1807j6929J773K3206K4531J7268Q591j0783k7132k4037j0152J872J5597
$$ 1239 -20568 -37497 -35724 -12518 12013 29281 37872 27089 -43 -24080 -34232 -32360 -16763
738a6763K9550K1281j78j0188j9506k8504j4161Q676J7804K0980K2601P765j7694
$$ -16763 12787 34068 33890 23702 4196 -24308 -38469 -29793 -11989 8991 31592 39357 21663
751B1663k3645j7368j6154L23K4867K4737J3159P624q712k7874k4995n862L211
$$ 21663 -1982 -19350 -35504 -35181 -10314 14423 27582 35206 26494 -1380 -26375 -32237 -29026
764b9026J2751K9552K1737l571j1042j6534k7553j4829J1158J8904J7269K1096
$$ -29026 -16275 13277 35014 31443 20401 3867 -23686 -38515 -27357 -8453 8816 29912
776B9912Q544j8711k5041j3674j4152j222K5598K5667R745N112o284k7575k5915
$$ 29912 38456 19745 -5296 -18970 -33122 -34344 -8746 16921 26666 31778 25494 -2081 -27996
789b7996l057N904R908K8276K2657n662j3395j4073k5132j5945J2545K0938J4986
$$ -27996 -31053 -25149 -15241 13035 35692 30030 16635 2562 -22570 -38515 -25970 -5032 9954
802I954J7556J0397j9471k6612j1305j0767k341K4512K7207Q100Q32m876k5031
$$ 9954 27510 37907 18436 -8176 -19481 -30248 -32589 -8077 19130 27230 28062 23186 -1845
815a845k7264j775R483Q927K4667K2973n636j6112j3330k1132j5911J1344K3332
$$ -1845 -29109 -30884 -21401 -12474 12193 35166 29530 13418 88 -21044 -36955 -25611 -2279
828b279J4525J3700R287j7340k7738j1542o392j594K1511K7550Q596k527n890
$$ -2279 12246 25946 35233 17893 -9845 -21387 -27779 -29373 -7862 19688 28284 25757 19867
841A9867k1883k6584k775J2020J0254K1302K1636m806j7786j4520j7058j4426
$$ 19867 -2016 -28600 -31375 -19355 -9101 12201 33837 29031 11245 -3275 -20333 -34759
853c4759R647K4447J4903J0627P796j5668k7411j2333l683M38J9071K6520R454
$$ -34759 -25112 -665 14238 24865 32661 16993 -10418 -22751 -26434 -25996 -6925 19595 29049
866B9049m787p990j8841k4708l861J3074J2148J8666J8847k785j8751j5698j4945
$$ 29049 24262 16272 -2569 -27277 -31138 -18064 -5916 12750 31597 28812 10061 -5637 -20582
879b0582j1171P622K3960J6232Q250M801j3532k5526j3679k499L654J6994K4044
$$ -20582 -31753 -24131 -171 16061 24311 29112 15580 -9946 -23625 -26124 -22470 -5476 18568
892A8568J0792n751j0713j7211k1610m357J2935J4337J7053J5310j776j7521j8033
$$ 18568 29360 23609 12896 -4315 -25925 -30282 -17347 -3010 14043 29353 27577 10056 -7977
905g977j3044q246O953K2351J7331P551J542j3204k2991j4473j961O613J6249
$$ -7977 -21021 -29267 -22314 37 17368 24919 26461 13257 -9734 -24207 -26168 -19555 -3306
918c306K0651J1225n500j2186j7057j8362m039J1393J5870J7040J1422k109j5206
$$ -3306 17345 28570 23070 10884 -6173 -24535 -28574 -17181 -1311 15729 27151 25042 9836
931I836j8870j3266m832P960J8859J7709Q179j442j3878j9592j4016l297R448
$$ 9836 -9034 -22300 -27132 -19172 -313 17396 25575 24133 10255 -9337 -23353 -26650 -17202
944a7202J6844J7067J0350l905j3975j7817j4826k577R282J6343J8095Q280l671
$$ -17202 -358 16709 27059 23154 9179 -8638 -23464 -26041 -16759 -416 17679 25959 22288
957B2288j3038j8471j3755k616R217J6540J6848R285l352j5495j7032j2261m645
$$ 22288 9250 -9221 -22976 -25592 -16375 165 17013 26298 22946 7451 -9581 -21842 -26487
970b6487J0171J8309J4768Q082k539j4035j8719j2719l64P524J5914J9004O716
$$ -26487 -16316 1993 16761 24843 22304 8269 -10450 -23169 -23533 -16009 -95 18909 25625
983B5625o365j1190j7196j5188o41J1760J4983J3918J0295l860j7576j4830j0217
$$ 25625 19260 8070 -9126 -24314 -24955 -13195 1788 15706 26001 22141 4565 -10265 -20482
996b0482m971R832J9963J3448M884j703j2551k0446j1784K661P098J4044J9817
$$ -20482 -25453 -15621 4342 17790 22674 20971 8420 -12026 -23810 -21149 -14051 -7 19810
1009A9810N695q563j0710j4520j5242j456J3993J4572J1007J0472l350j9444j4475
$$ 19810 25505 16942 6232 -8288 -23530 -24986 -10993 3579 14586 25058 21708 2264 -12211
1022a2211o710m812Q585K0729J3259K089k371j0952k0613j0908M907P092J1952
$$ -12211 -18921 -23733 -15148 5581 18840 20929 18558 7606 -13007 -23915 -19008 -11916 36
1035C6J9322O500j0864j1447j1586j4724k186J5708J4916Q326R624k518j9618
$$ 36 19358 25858 14994 3547 -8039 -22763 -24949 -9241 5675 14001 23625 21107 1489
1048A489j5110m530l540O836K0934J4243n35l582q930j9906j2031O787Q844R887
$$ 1489 -13621 -18151 -21691 -14855 6079 20322 19787 16205 7275 -12631 -24662 -17875 -9031 856
1062H56J7619P144j1303j3174j0009j2224l102J5676J6365O594O762j273j8794
$$ 856 18475 25619 14316 1142 -8867 -21091 -24193 -8517 7848 14442 21204 19931 1137
1075A137j6367l014o26N646J9049J5220j342o191p727j8162j2441P148J0732R152
$$ 1137 -15230 -18244 -18870 -13224 5825 21045 19703 13512 5785 -12377 -24818 -17670 -6938 2214
1089B214J5231P286j1097j4524r133r738k835J4292J7351O435M358j507j7239
$$ 2214 17445 24731 13634 -890 -10023 -19761 -22596 -8304 9047 15482 19840 18333 1094
1102A094j6523l105J191O238J6774J5157j144q009q000j5647j1734O173J2294
$$ 1094 -15429 -18534 -17343 -11105 5669 20826 19682 11673 3673 -11974 -23708 -17535 -5241
1115e241R388J2613O510r900j5179r587p171k231J3069J7250O204K546k134j5436
$$ -5241 4147 16760 23270 13370 -1809 -11396 -18567 -20798 -7729 9521 15725 18271 16137 701
1129G01j6061l790L413O855J4566J4221k68r053q713j3624j0331N092J2188J0380
$$ 701 -15360 -19150 -15737 -8882 5684 19905 19637 10584 1871 -11753 -22084 -16992 -4804 5576
1143E576J0467N330q713j5079r873n384j028J1597J6549P351O33l857j3565j4816
$$ 5576 16043 21373 12660 -2419 -12292 -17676 -18704 -7107 9442 16793 17426 13569 4 -14812
1157a4812m540M236Q351J3101J2372L29r134j0156j1845q719M496J1978J1626
$$ -14812 -19352 -15116 -6765 6336 18708 19037 9903 -253 -12098 -20817 -16321 -4343 7283
1170G283Q960L162p460j4245j1119m330J411J0826J4643P883N73o194j2759j2550
$$ 7283 16243 19405 11945 -2300 -13419 -17749 -16338 -5512 9131 17014 17587 11393 -1366 -13916
1184a3916m938M199R988J2043J0053P56q637j1416j1321n694M111J0724J2293
$$ -13916 -18854 -14655 -4667 7376 17429 18185 9548 -1868 -13189 -18883 -14772 -4048 8245
1197H245Q666P90p386j2728j1350m164L584J0621J2374Q171Q01q127j2468j0295
$$ 8245 16911 17701 10315 -2413 -13763 -17927 -14343 -3722 8652 16823 17624 9497 -2971 -13266
1211a3266m779L654J1033J2374P839k26p294j2161j1501l141M420R288J2440Q857
$$ -13266 -18045 -14391 -3358 9016 16855 16629 9335 -2826 -14327 -17468 -13048 -3760 8680 17537
1225A7537j647p725j0817j0588m755M914J1433J0348P201J229q691j3285q013
$$ 17537 15890 8165 -2652 -13240 -17995 -13081 -1648 8700 15901 17130 8439 -4846 -12859
1238a2859l621K411J1672J2399N978j043o240j1664j2228j621N786P758J1879
$$ -12859 -16480 -14069 -2397 10002 15980 14937 8697 -2967 -15195 -16816 -11030 -3272 8607
1251H607R173k414r033r470r411n682N694J2791Q743N488K287r195j3746o658
$$ 8607 17780 15366 6333 -3137 -12548 -18230 -12536 255 8998 14486 16773 7578 -6168 -12826
1265a2826k091J735J0873J3791M488l024m963j1032j2388j252P415P075J0202
$$ -12826 -14917 -13182 -2309 11482 15970 12946 7983 -3049 -15437 -16689 -9274 -2199 8003
1278H003R796k660j0873q325p581n967N588J3575Q015L722K294p715j5140o217
$$ 8003 17799 15139 4266 -4059 -11640 -17607 -12019 1556 9571 13293 15587 7872 -7268 -13485
1292a3485q6K127R241J4135M554n172m893r189j2541j461R250O652Q929R026k057
$$ -13485 -13571 -11444 -2203 11932 16486 11314 6421 -2768 -15309 -16770 -7520 -868 8061 17087 15030
1307A5030j1731q751n790n189M617J3949Q558J602J821p088j4760o573J622K526
$$ 15030 3299 -5452 -11242 -16431 -11814 2135 10693 12295 14116 7028 -7732 -14305 -12683 -10157
1321a0157Q096J3542M996o030n905p604j1532j938R584P999O744P838j149j1643
$$ -10157 -2061 11481 16477 10447 4542 -3062 -14594 -16532 -6948 1051 7795 15633 14484 2841
1335B841r528m180m036L618J3994Q372R70O69o341j3712p310K065M488O987J2123
$$ 2841 -6687 -10867 -14903 -11285 2709 11081 12051 12720 6379 -7333 -14643 -12578 -8090 -1103 11020
1350A1020N686o389p123o886j0279j930R367Q531O192O515j008j1044j0311l493
$$ 11020 16706 10317 3194 -3692 -13971 -15901 -6534 1997 8189 14704 13696 2652 -7659 -11152
1364a1152k438L275J3029R115N44j038n971j2436p512K451N294O795J0809N131
$$ -11152 -13590 -10315 2714 11829 12373 11335 5364 -7072 -14584 -12133 -6839 -44 10765 15896
1378A5896o049p839o485q838j607Q373R634N957M477j011j0099j0504l706r49
$$ 15896 9847 2008 -4477 -13315 -14922 -6549 3085 9042 13519 12508 2409 -8095 -11801 -12750
1392a2750L892J1612R098P82k554o403j0587p271J848O547P135Q911M827n531
$$ -12750 -8858 2754 11852 12634 10080 3677 -6910 -14181 -12333 -5786 1349 10260 15087 9556
1406I556q314p116o947j104P672R870O439K829k041q580j0503l959O58M184J0409
$$ 9556 1242 -5874 -12821 -13925 -6253 3617 10056 12885 10844 2264 -8239 -12198 -11540 -7356 3053
1421C053Q361J556l695p226r039o254J237O681P895P788L339m491q540p518n640
$$ 3053 11414 12970 9275 2049 -6990 -13244 -12007 -5326 2569 10357 13696 9205 665 -6853 -12493
1436a2493K84O680R256O510K440l296q028r086m481R65N945Q634P532K067l999
$$ -12493 -12209 -5529 3727 10237 12677 9381 1353 -7733 -12214 -11249 -5304 3330 10862 12929 8930
1451H930q293q146m894R22O588Q425P223J897m229p691q374m737J639O134P843
$$ 8930 637 -7509 -12403 -11481 -4893 3532 10755 12652 8423 732 -7642 -12379 -10740 -4606 3237
1466C237P509J968m568q027p624m783R17O994Q702N744K174l271r222q000l269
$$ 3237 10746 12714 8146 119 -7505 -12288 -11371 -4377 4325 10069 12243 8972 -250 -8250 -11519
1481a1519P35O048R072O631P75m735o044q673m905K856O104P158P077J917n430
$$ -11519 -10784 -4736 4336 10967 11742 7007 963 -7710 -12615 -9759 -3655 3503 10580 12497 7067
1496G067q021o279m252L72P724Q602M429J659k941r273p999k053J529M857R161
$$ 7067 -954 -7233 -11485 -11113 -3389 5213 9642 11301 8360 -913 -8912 -10965 -9436 -4579 4582
1511D582P041o59n085n136q508n012L976O676N781O373K244n934q387m848l539
$$ 4582 11623 10964 5879 743 -7765 -12777 -8801 -2125 3656 10029 12273 6339 -2048 -6896 -10435
1526a0435k40P655R306L015P33k245q927q464j204K568M198Q429P187j156n673
$$ -10435 -10675 -3020 6286 9301 10034 7789 -1138 -9602 -10806 -8238 -4040 4389 11576 10420 4747
1541D747m797p243n788M673P413N137N280K727o055q990m378k171p58P530R566
$$ 4747 -50 -7293 -13081 -8408 -995 4142 9422 12149 6094 -2896 -7274 -9445 -10203 -2673 6893
1556F893K353j37k251p525q900j031L553M078O947P705j461o653m269o347n313
$$ 6893 9246 9109 6858 -667 -9567 -10598 -7045 -2967 3980 11685 10224 3571 -698 -7045 -12358
1571a2358L842Q090N093L970K267m934r729m059q94k85O459R901K338j539k453
$$ -12358 -8516 -426 4667 8637 10904 5970 -3759 -7818 -8712 -8997 -2538 7363 9701 8162 5709
1586E709o824q583r45M692M157N934P034j062p110m768n013m768L620Q143N559
$$ 5709 -1115 -9698 -10643 -5951 -1794 4140 11174 10112 3002 -1766 -6779 -11547 -7927 216 5775
1601E775K555J935m740r555m329j97Q88N833Q927K705k010l017o066p897j217
$$ 5775 8330 10265 5525 -4030 -8359 -8556 -7668 -1835 7092 9797 7787 4770 -1296 -9193 -10410
1616a0410N062M434N461O040q17p256n235m304l295K849Q066N643K019O01l862
$$ -10410 -5348 -914 4547 10587 9770 2514 -2721 -7025 -10320 -7471 595 6238 8257 8858 4996
1631D996q699n056M12J544N226Q360L139k536l788n551o914j252M721N186N133
$$ 4996 -3703 -8759 -8347 -6803 -1577 6783 9922 7386 3598 -1953 -8867 -10119 -5398 -212 4921
1646D921N005p91o560n980l691k433K622P724N701J701l47l931p752m816J70K626
$$ 4921 9926 9135 2575 -3405 -7096 -9529 -6907 817 6518 8219 7872 3941 -3811 -8627 -8457 -5831
1662e831N323O931K918k121m518n380n442j383M466N590M799L839j250n660o074
$$ -5831 -508 6423 9341 7220 2702 -2678 -8120 -9503 -5037 553 5352 9191 7941 2281 -3793
1677c793l701j411L277O662N319K305j550m102o589m475k74L198N507N849K620
$$ -3793 -7494 -8905 -5628 1034 6353 8658 7108 3006 -3583 -8058 -8332 -5134 373 6222 8842
1692H842j758m715o005l849j041L831N494N057K924j745m790n793m404k18L465
$$ 8842 7084 2369 -3636 -7485 -8526 -4695 799 5856 8780 7035 2245 -3548 -7952 -8170 -4705
1707d705N364N234K531j686m725n708m054l22L253O317M835J886j585m687n985
$$ -4705 659 5893 8424 6738 2013 -3695 -7749 -8071 -4818 1499 6334 8220 6635 1948 -4037
1722d037l746P3L126N790N150K062k319m402n339m233k88M518N041M453K524j811
$$ -4037 -7783 -7710 -4584 1206 6356 8418 6099 1697 -3642 -7875 -8163 -3645 1396 5849 8373 6562
1738F562n539n197k834p61L304O522M101J077p99m884o327l302J281L130M821
$$ 6562 1023 -4174 -7008 -7769 -4465 2057 6158 7235 6436 1552 -4775 -8077 -6796 -3666 1155
1753A155N301J971l343m497m166m258j28M823N110L716K210j289o100n207j928
$$ 1155 6456 8427 5084 587 -3579 -7837 -7965 -3142 1968 5684 7894 6605 505 -4702 -6630
1768f630m83K828O446M868k01j364l972o190l443K044L492L372N725J807l900
$$ -6630 -7113 -4285 2161 7029 6828 5464 1492 -4698 -8141 -6097 -2605 767 6492 8299 4399
1783D399m203l593m118j54N095N347K541K024j134o362n245r58j45K589O523M553
$$ 4399 196 -3397 -7515 -7669 -2574 2773 5314 7338 6204 -158 -5403 -6361 -6506 -3917 2606 7159
1799G159p81j759l370o016l328K298L791L198M949K308m196m837k896l495l55
$$ 7159 6378 4619 1249 -4767 -8095 -5797 -2006 1192 6141 8449 4253 -584 -3480 -6975 -7330
1814g330N068N255K309J453r68n715n820j38L55J909O233M477q60k365l070n209
$$ -7330 -2262 2993 5302 6755 5787 72 -5748 -5886 -5531 -3622 2611 7088 6228 3863 793 -4416
1830d416l615K494M321K579M373K293m068m968k935k447p18N238N550J809M89
$$ -4416 -8031 -5537 -1216 1363 5736 8029 3961 -1007 -3942 -6389 -7107 -1869 3681 5490 5979
1845E979q03n389n847lJ197J988N485M430j109k783l121m104l564K117M577L201
$$ 5979 5176 -213 -6060 -6063 -4866 -2878 2607 7037 5928 3145 24 -4080 -7644 -5527 -950 2251
1861B251L340J870l845n099k842j504k04M119N874J615o5j342m723n172n97J924
$$ 2251 5591 7461 3616 -1483 -4325 -5829 -6033 -1914 3960 5575 5510 4168 -555 -5727 -6324 -4400
1877d400K360M587M314p42l715k798l636l009J701N230K755K699J250l002n395
$$ -4400 -2040 2547 6861 6119 2404 -394 -4030 -7039 -5338 -108 2647 5346 6596 3594 -1801
1892a801k696j241O30L649N225K113p23j415m664m757n27K081K934M291L212m67
$$ -1801 -4497 -5738 -5108 -1459 3766 5879 5156 3741 -923 -5680 -6207 -4126 -1192 3099 6311 5844
1908E844l640l538k903k094J726M500L414K245M84l050m835l081o12Q83L583M700
$$ 5844 2204 -1334 -4237 -6331 -4605 -105 3309 5554 6038 2988 -1847 -4928 -5540 -4657 -1074 3626
1924C626K293j051k222l732m083o47J716L465L896K609m60l277l703k869j710
$$ 3626 5919 4868 2646 -1086 -5169 -5816 -4100 -635 3261 5870 5410 2133 -1570 -4439 -6149
1939f149K187L879L468K289m57k890m110l261o46J883L458M148J994o01l155l778
$$ -6149 -3962 -83 3385 5674 5217 2327 -1783 -5044 -5690 -3807 -349 3799 5793 5192 2037 -1741
1955a741l308n92J835L533L915J837m18k942m249k836n93K001L391L773J802n00
$$ -1741 -5049 -5641 -3806 -273 3642 5479 5061 2119 -2130 -4966 -5559 -3558 -167 3606 5408 4908
1971D908l144l564k816j315K492L650L147K088p06l129l921k661k46J580L694
$$ 4908 1764 -1800 -4616 -5931 -3439 211 3358 5446 4740 1611 -2310 -4971 -5217 -3637 57
1986E7L977J177o91k795m165k633k59K566L124K935K463j025l764k927k608j068
$$ 57 4034 5211 4520 1725 -2440 -5073 -5332 -2766 358 3293 5756 4731 967 -1960 -4568 -5636
2002e636K375M348K711R62k69l167m235j881K90J134L613L941R69j457k168l625
$$ -5636 -3261 1087 3798 4760 4491 1324 -2911 -4792 -4502 -3368 245 4186 5155 3698 1530 -2095
2018b095l203K95K940K363K909K464j426m021k298k220j160K487M191K640P81
$$ -2095 -5298 -5003 -2063 300 3209 5673 4247 226 -2072 -4292 -5452 -2965 1226 3866 4647
2033D647o29k565m481j731N23J457L014M148Q76k011k271l224k948J70L522K559
$$ 4647 4018 1453 -3028 -4759 -4236 -2779 235 4383 5259 3248 977 -2247 -5195 -5025 -1503 1056
2049A056K156K354j319m018k742j611p08K009M847K252j41m30k379m720j783J559
$$ 1056 3212 5566 4247 229 -2513 -4124 -4832 -2823 2024 4276 4135 3705 1326 -3394 -5177 -3618
2065c618J248K846L978N59k264k332k446l284L63L658K799J646J858j212m424
$$ -3618 -2370 476 4454 5013 2749 417 -2029 -5313 -4950 -1292 1507 3153 5011 3799 -625
2080f25k601o56l68J737M415K626o26l61k425m251k082J763J626K461L797N95
$$ -625 -3226 -3882 -4250 -2513 1902 4528 3902 3541 1116 -3135 -5217 -3454 -1828 633 4430 5025
2096E025k453k698j992k388k27L675L081J215J453j109l879l133n59J07J637M099
$$ 5025 2572 -126 -2118 -4506 -4733 -1058 2023 3238 4691 3582 -297 -3430 -3989 -3882 -2245 1854
2112A854K697p80j184j868l987j826J736K016K563K989R55k699l043j946j824
$$ 1854 4551 3771 2587 719 -3268 -5094 -3358 -1342 1221 4210 5165 2466 -577 -2523 -4347
2127d347l14L591L120J331R30j022m020k737o21N29J659M029K298n16j658k178
$$ -4347 -4661 -1070 2050 3381 4311 3289 -731 -3468 -4089 -3560 -1901 2128 4426 3910 2252 74
2143G4k978k125J870K157K619K180J089k516l297j820j106k24L341L167J346J75
$$ 74 -2904 -5029 -3159 -1002 1617 3797 4886 2370 -927 -2747 -3853 -4077 -736 2431 3777 3952
2159C952j172l382k990o31R56J965L038K466k18j771k864k542j221J283K217K600
$$ 3952 2780 -602 -3592 -4223 -3267 -1302 1736 4202 3984 2213 -651 -3193 -4414 -3131 -914 1686
2175A686K025N11j915l463k044j183P61K811L010J758Jj739l018k665n98Q34K758
$$ 1686 3711 4222 2307 -1156 -3200 -4383 -3622 -811 2199 3957 3958 2219 -799 -3464 -4062 -3228 -470
2192d70K502K039r8k167k476k582p44Q41K509L046J387o7j755l127k218p87J101
$$ -470 2032 4071 3973 1806 -670 -3252 -3996 -3155 -646 2400 3787 3720 1965 -1162 -3380 -4167 -3066
2209c066K624K831J509K13k269k613k392r73J322K547K806J660n91j816k851k505
$$ -3066 -442 2389 3898 4111 1842 -771 -3163 -4136 -2814 -267 2539 4199 3608 1792 -1059 -3564
2225c564p7J142J928L034J524o62j776k385k269j078J618K482K208J734r9k468
$$ -3564 -3641 -2499 -571 2463 3987 3325 1549 -836 -3105 -4183 -2565 -83 2125 3859 3760 1292
2241A292k724j603p31R44K734K844R80n28j629k891k263J54R52K196K871J601
$$ 1292 -1432 -3035 -3766 -2822 -88 2756 3736 3208 1579 -1312 -3575 -3421 -2469 -273 2598 4199
2257D199j006k316j918k190j203K293K553J687J530J0k513k823j437m43R24K752
$$ 4199 3193 877 -1041 -3231 -4434 -2141 412 2099 3629 3639 1126 -1697 -3134 -3577 -2653 99
2273I9K876M15n68j102l183k291L7J817J918K843J283j393k136j815j741r48J951
$$ 99 2975 3390 2822 1720 -1463 -3754 -3717 -1900 18 2861 4144 2751 615 -1200 -2941 -3889 -1938
2290a938K674J482J358J09k860k832j229r1Q63K772K876K55j091j028k821k541
$$ -1938 736 2218 3576 3685 825 -2007 -3236 -3327 -2464 308 3184 3439 2348 1320 -1501 -4042
2306d042N25K185J389K534J674j569k289j995j570r01J875L329J162Q25K41k618
$$ -4042 -3517 -1332 57 2591 4265 2696 407 -1588 -3158 -4059 -2184 1145 2307 3132 3373 755
2322G55k987j234N48O40K631K816J96j205j163k449k530N67K226J784J865J647
$$ 755 -2232 -3466 -2918 -2278 353 3169 3365 2160 997 -1452 -3982 -3415 -1189 595 2460 4107
2338D107j130l089j667j005q44J798L189J215K88J82k115l409r63O79P02K376
$$ 4107 2977 -112 -1779 -2784 -3628 -1830 1359 2574 2862 3044 929 -2480 -3443 -2764 -2062 314
2354C14K925L19j636j341k184j979M97K119J779J710J096j054k966j620o21p18
$$ 314 3239 3558 1922 581 -1603 -3582 -3085 -966 813 2523 3619 2565 -401 -2021 -2642 -3360
2370c360J831L025J276K74n25j620l295q82O73J137J958K474L45j377j582j996
$$ -3360 -1529 1496 2772 3046 2521 901 -2394 -3276 -2603 -1466 492 2966 3311 1934 352 -1644
2386a644j981K53K588K030J152J032q22l025j858m09j56J342L144J293Q5o45k293
$$ -1644 -3625 -3372 -784 1246 2398 3430 2608 -417 -2275 -2684 -2840 -1498 1646 2939 3024 2379 86
2403H6k595r54R48J392K027K276K41j824j688j491j519K02K275J910J335O02j099
$$ 86 -2509 -3463 -2515 -1123 904 3180 3421 1597 -91 -1582 -3101 -2899 -624 1286 2621 3223 2124
2420B124k589j866l02j19J688K482J534j03j156j653k213j175R37J823J799J939
$$ 2124 -465 -2331 -2633 -2752 -1064 1418 2952 2849 1693 40 -2173 -3348 -2411 -588 1211 3150
2436C150K36j925j644j883j056L76K167K027J142K58j128k229j846o32M89K109
$$ 3150 3386 1461 -183 -2066 -3122 -2746 -579 1448 2590 2848 1720 -509 -2355 -2987 -2498 -389
2452c89J811J697k02j043k457j853m81N74J850J998J404k15j303j883j943n25
$$ -389 1422 3119 2917 1874 -583 -2436 -2917 -2343 -493 1505 2909 2694 1391 -492 -2435 -2960
2468b960O37J909K116J017J52j280k231j481q25P51J912J741J137j8r42k414j643
$$ -2960 -2323 -414 1702 2719 2871 1591 -640 -2121 -2946 -2195 -283 1458 2595 2577 1635 -779 -2422
2485b422k87L62J920K184J144j75j218j816j937o76R97J540J773J361J04j809
$$ -2422 -2709 -2347 -427 1757 2901 2726 1508 -308 -2245 -2921 -1924 -384 1389 2750 2854 1045
2501A045j736j548p03P95K066J767R32l3j086k439j266k13L79J516K025J163l57
$$ 1045 -691 -2239 -2942 -2147 -81 1686 2618 2585 1499 -940 -2206 -2419 -2040 -524 1501 2664 2307
2518B307j010j579k035o66J296J654J344J640k08j968j743j053o90N36K226J866
$$ 2307 1297 -282 -2317 -2983 -1687 -33 1311 2951 2743 775 -968 -2021 -2711 -2175 51 1917
2534A917K65K45j276k047j637L22N71J314K294R94j096j259r71k201k70J147J590
$$ 1917 2182 2427 1151 -896 -2533 -2211 -1640 -326 1968 2962 1866 607 -364 -2565 -2835 -1688 -98
2551i8J204J534qj807k048p94o16O10K124J774M47m07m08k521j587K71Q34J113
$$ -98 1106 2640 2632 825 -1223 -2017 -2633 -2023 101 1875 2322 1915 1507 -1014 -2601 -2330 -1496 -383
2569c83K147J282j136j315j020k128k56J450J782P86J155J16k069j895n41m37
$$ -383 1764 3046 1910 595 -425 -2553 -2809 -1359 423 1209 2364 2480 411 -1484 -2025 -2462
2585b462N47K388J709K58m73r45j985j692L89J008R87J920J267j181j553r63j271
$$ -2462 -1915 473 2182 2440 1967 1022 -963 -2655 -2266 -1258 -271 1649 2916 1735 182 -781 -2052
2602b052n90J300K195Q06L41K18j839k005p11R1N59J914J961J85p42o80k191j234
$$ -2052 -2642 -1342 853 1659 2000 2218 379 -1626 -2337 -2246 -1687 227 2188 2373 1631 951 -1240 -2474
2620b474K78J132J262J435R51q69j772r22p92r89J413J981J118M57k06j345k113
$$ -2474 -2196 -1064 198 1633 2584 1715 -57 -979 -1771 -2760 -1347 634 1752 2209 2003 658 -1455
2637a455r15M85L47J870J936J6p97j009j741j169J68J505R79J348J187j003j658
$$ -1455 -2370 -1885 -1538 332 2268 2284 1487 478 -1263 -2432 -2264 -759 220 1568 2755 1752 94
2654I4j271q12l84J204J833J156L82m03j249j907o92L43P25J541J311N42r94j184
$$ 94 -1177 -1989 -2373 -1169 664 1820 2202 1799 550 -1357 -2049 -1706 -981 560 1871 2413 1419 235
2672B35j266j164K51J365J022J117P26o84j574j421o53R1J203J491J157O3k51
$$ 235 -1031 -2195 -1944 -579 443 1560 2286 1602 28 -1393 -2046 -1955 -752 739 1896 1959 1708
2689A708j608j420j047O23O98J404J507L51p36j320j386q58J49J111J341J185
$$ 1708 100 -1320 -2367 -1744 -1046 358 1865 2216 1480 160 -1226 -2084 -1935 -824 517 1702
2705A702L56p23j239j538n08K05Q34J438J122M31o28j319j614m51R0J137J244
$$ 1702 2058 1335 96 -1442 -1950 -1745 -911 527 1649 2080 1452 133 -1481 -1932 -1842 -705 539
2722E39J081J80l54j419j666l99J17J249J264J472j27q03r76j598o73L53J351
$$ 539 1620 1800 1446 27 -1639 -2038 -1921 -672 592 2064 1937 1134 158 -1440 -2113 -1760 -409
2739d09J137Q56L27q93j320q40n94J30R10J427J011L3l55j643j423m70Q05P64
$$ -409 728 1584 1911 1018 -302 -1142 -1736 -1606 -696 731 1742 1775 1420 -223 -1646 -2116 -1311 -547
2757e47J115J508k97p41j014j109j077O43J256J141O70L32o16j794q74j56k50
$$ -547 568 2076 1779 1038 24 -1085 -2162 -1519 -263 878 1548 1880 1264 -530 -1404 -1560 -1810
2774a810J214J600P26j17l26j416j517l34O48Q83R07J230J72r67j235j125r02
$$ -1810 -596 1004 1730 1613 1287 -129 -1646 -1980 -1332 -449 458 1688 1860 893 -342 -1467 -2369
2791b369Q12J298J352L27P30r67j459j163j26j93J259J947K97j39p16j255j270
$$ -2369 -1557 -259 1093 1420 2150 1183 -276 -1439 -1565 -1758 -499 1448 1745 1606 890 -365 -1635
2808a635j60N73P57J041J589m07j122p86p78r80O18J225J017K81P47p15k076p35
$$ -1635 -1795 -1222 -465 576 2165 1758 636 -150 -928 -1908 -1290 -65 952 1233 1980 1265 -811 -1546
2826a546J36j75J389J379P39o53k33j270j241n43J000O50R74J361l81j141j128
$$ -1546 -1410 -1585 -196 1183 1922 1269 1036 -234 -1475 -2018 -1018 -368 606 1967 1586 445 -683
2843f83o49o67L94J693J057M9L07n70j785o57J35K57N76J700R64r16o33j065o21
$$ -683 -1332 -1999 -1605 88 1145 1194 1501 931 -854 -1511 -1376 -1119 -543 1157 2121 1205 572 -493 -1114
2862a114r14Q99J172R43P43L24j628j077n90k54J81J522J137K16k52l80j583r39
$$ -1114 -2028 -1129 43 986 1729 2053 425 -652 -1242 -1496 -1315 207 1344 1560 1308 928 -655 -1594
2880a594K38L33Q65R65J205q21o39j027j123l02J026J049O43P35N4j189r67p31
$$ -1594 -1356 -1023 -158 807 2012 1191 552 -475 -1598 -1900 -874 175 818 1553 1607 418 -549 -1280
2898a280m37M88J563R54j05K08r73j203r01J46N41J113J007P83o74q21j029r03
$$ -1280 -1717 -1229 334 1288 1183 1391 418 -785 -1686 -1540 -999 114 1121 1904 1230 409 -620 -1523
2916a523j04O11J256N84Q95k33j209j132n04l2N93J016Q46L55l30p01r26o84Q1
$$ -1523 -1627 -1016 240 824 1719 1486 277 -855 -1359 -1391 -798 218 1064 1419 1089 388 -538 -1222 -1141
2935a141K76J028Q66N15l29q17j104n17j80L68J129J025M26k99r42j017m50j24
$$ -1141 -865 163 1029 1544 1215 398 -706 -1223 -1403 -1035 94 1119 1545 1246 304 -713 -1163 -1287
2953a287N72J063N23P29n21o85j217n98K0R33O96R35M41m41r35o56j030NR18Q21
$$ -1287 -715 348 871 1600 1079 394 -823 -1421 -1401 -468 228 1163 1604 1163 228 -428 -1458 -1453 -535 286
2973B86R87K47o69p49r94n76J77O93J109O26L79m50r19q85o07J78M99J157P21
$$ 286 1273 1520 851 102 -892 -1468 -1291 -598 511 1137 1516 1066 147 -738 -1345 -1167 -668 489 1210
2992A210N7m44p44q18p55L64O99P94P71M10p40p66q38k71n7N14Q98P39R7j89j200
$$ 1210 1267 823 79 -739 -1494 -1130 -431 363 1134 1544 804 38 -800 -1071 -1128 -614 284 1023 1120 931 -269
3013b69o70k15J8M30R47Q68n7k67o74r95n73K91P70P22N25O32o64j067l27q36
$$ -269 -939 -1154 -1136 -706 241 1109 1052 785 111 -884 -1457 -1166 -396 326 851 1483 819 -248 -575 -1411
3033a411J94Q45J152J66R7K76j313j559M13R1N93J138N56j36m06m01r89r75Q32
$$ -1411 -1217 -372 780 946 1043 1319 6 -1553 -1140 -1049 -456 682 1238 1102 696 295 -694 -1669 -837
3052h37Q61K00N98O08r88n95n02l83q4N88J298K24r6k30l94j229k02K88P19O87
$$ -837 24 224 822 1430 442 -153 -655 -1038 -1122 -534 764 988 892 662 268 -961 -1163 -875 -156 531
3072E31Q99l11q88j41j090l23K35Q16N10O70L66o87r48m58l3r7M86R80N86n1j50
$$ 531 1430 1119 231 90 -1000 -1323 -1088 -272 238 908 1274 587 -361 -819 -852 -949 -463 517 1103 1052 902
3093I02j081p68k19M29M85N90R83j25q57o64j11q39M66Q07N86L47K58m90j110
$$ 902 -179 -947 -1166 -737 -252 338 1321 1196 339 -325 -436 -1275 -809 -2 584 931 1189 699 -411
3112d11n72P2J67M57J040L30j28l01o52q70j38L03M97Q15M74j34p83m23l96m83
$$ -411 -983 -911 -744 -287 753 1083 955 654 2 -868 -1006 -703 -206 609 1083 949 166 -257 -653 -1136
3132a136L18Q40M80K71M98r87n98n27r9K08M32J007M50l19m40l93j100J73M33
$$ -1136 -818 22 502 773 1271 284 -314 -841 -940 -732 -300 707 1157 838 398 5 -1095 -922 -489
3151d89N27M56L53K13q19q49k42j39L48O19N57Q1J88m06o97p38K35K25N34P08
$$ -489 38 494 847 1060 241 -608 -850 -989 -641 -22 535 616 804 398 -299 -1037 -802 -577 -43 665
3171F65M67j67n21n84q22k47N29Q63L96L61L2o14q96k6l98N50P70L70n5J79l90
$$ 665 1132 965 444 -140 -962 -1209 -680 183 579 940 972 358 -538 -564 -962 -412 358 728 673 852 462
3192D62p58l20j56J16P26P05J44k62k48j015P1o05N95O11O21J85k21m01n98m61
$$ 462 -296 -616 -772 -656 70 775 919 657 409 -606 -535 -1140 -545 66 687 872 651 250 -348 -809
3212h09j18N85K07P60K58p7q34m06l78o8K80M41P46K57m1n97n81m50l0M03N79
$$ -809 -927 -342 -135 625 883 806 -28 -434 -812 -880 -600 -159 587 844 803 206 -375 -825 -855 -452 127
3233A27P59j74j01m52n64l91pL48Q35J95L87k75m92n16k61j06J39M81O92K38j20
$$ 127 886 712 611 159 -405 -796 -803 -455 380 575 962 687 195 -321 -582 -688 -549 -68 624 862 742
3254G42n50n17m18J13J47M79O44K85k72m62l36q68JQ67K57L05L82k1q41o04J86
$$ 742 192 -325 -743 -630 -483 -4 640 925 653 191 -145 -1013 -1012 -145 112 417 799 778 -63 -667 -481
3275d81J5l1O98J74L05J17o93n78l48K95K18M71M17J83l31l75l53k83k71N02L70
$$ -481 -466 -497 201 375 680 797 104 -474 -822 -527 -309 162 579 762 431 56 -297 -580 -851 -349 21
3296B1M44L08k43j99j063K60j52K00P49K59L2p3m79o16j39K34K9L60N71K52k90
$$ 21 465 773 530 331 -732 -472 -624 -424 325 584 616 543 64 -552 -691 -457 -428 -68 503 755 465
3317D65p13l6l65j07O72L43J81K48k07o22j02k48l18N16O95K85l0j04n41m49l01
$$ 465 -248 -284 -649 -756 -84 259 440 688 481 -141 -243 -491 -809 -293 402 687 657 553 12 -437 -738
3338g38M21Q4K19O54j0k66l16m22k4j01M76L60M9K31k1n65n35j88Q2L97L24L54
$$ -738 -317 -233 -14 640 630 364 48 -374 -398 -499 -23 337 386 617 596 31 -504 -692 -610 -213 111 465
3360D65L04m88j32l68k89L07M5M56K12M5j85o00J53j47m43M29N82L84l47J5k87
$$ 465 769 281 149 -219 -508 -201 -156 300 512 557 372 -228 -75 -222 -665 -236 346 730 383 398 111
3381A11n44J85j64J44M32K73J62k12m80k46m19K16M19N30J4J98k83m96l72r1N0
$$ 111 -433 -248 -412 -268 164 437 599 387 -93 -339 -758 -542 -123 407 421 619 336 -160 -532 -623 -573
3402e73M53L35j44K38J58k69o99J36k4K88L09K36L82n84l12l11lm2J17M73J64
$$ -573 -120 215 71 309 467 198 -501 -365 -389 -101 208 444 826 242 -70 -381 -384 -426 -309 164 328
3423C28J98m12l73n3l17o8N99L60L6J2J81k80q29k12L50K92M97J40P5o10Lk25
$$ 328 526 114 -259 -312 -629 -697 -98 262 298 310 491 211 -618 -830 -480 -188 309 449 524 -86 -83 -308
3445c08J2q7K95N23j78K03q3o72k33K73K4K9K10L49J4j64m24l22J48J96nL91K95
$$ -308 -296 -383 -88 435 257 460 377 -295 -528 -255 -231 -202 8 357 371 207 -217 -539 -391 -195 -200 191 486
3468D86o7k02k17l86J9J22K47K5K79m9j49k44m72N0L70j97O10M7L8j47m1j56m08
$$ 486 419 217 0 -386 -367 -245 2 27 306 257 108 -136 -608 -558 -188 -385 225 272 310 163 122 -34 -442
3491d42K77R0K80K56j33j52j42m75n2J55K56L36M5J65q8n17k20p9K85J02K64K01
$$ -442 -165 -75 205 461 328 176 34 -441 -493 -338 -82 254 299 464 376 -141 -361 -440 -155 -53 211 412
3513D12j9k97j78q6q8L9J60K81N0J96j10o54k4o9K37J53K09N59o19K0j20k55N3
$$ 412 393 96 -82 -168 -256 -217 -57 224 274 470 360 -294 -318 -387 -150 3 212 771 152 172 52 -203 -150
3536a50q8L59L5M0J97m59m4j08J30j97J17O31pl3l15k01Mk76J89N0K10L66k74
$$ -150 -238 121 156 196 393 -66 -110 -218 -88 -285 -168 463 456 423 108 -93 -89 -365 -176 -126 84 450 176
3559A76j17qk9l24L01K24M3j53M3K09o10M0Rj01J89K94N0j23l96K66r6j63K70
$$ 176 59 51 22 -302 -1 223 266 113 156 365 -245 -205 -196 -297 -108 186 236 113 -283 -17 -113 -276 -6
3582fk93M68J61J6l19m4j27j39J49K92q3J72r9j21j79k8J01j52O9K92L5Pn8j14
$$ -6 -299 169 330 346 27 -17 -144 -283 -134 158 75 247 148 27 -152 -180 -79 -231 -162 130 165 172 114 0
3606@k11k78K59J74K45K80k05k84o4N5r9L4J64J60L2j41J02r2l97K15k90K56J77
$$ 0 -211 -489 -230 -56 189 469 264 -20 -84 -29 -128 -94 70 230 262 121 223 131 -266 -51 -341 -85 92
3629I2J8Kk67j80L00l41K13J37J1J14J54r1j87j69j87K88J44j5PK29q5j90Pk42
$$ 92 110 112 -155 -335 -35 -376 -163 -26 -15 99 253 162 -25 -194 -381 -93 51 36 43 272 187 -3 4 -238
3653b38rK44J67N2j35k03j50J76j64L10Q1r3J36l21K89k42R4P9r7P2k0N6k36K5
$$ -238 -247 -3 164 216 81 -122 -272 -96 -260 50 131 38 174 -147 142 -100 -6 73 -24 48 28 84 -152 -127
3677a27J63l62L7L12o0J18J31p5k03J24j55r9R4J06L7m2l0J42m35J14o4P4J64
$$ -127 36 -326 -289 23 -37 81 212 137 -66 58 -97 -196 -102 4 41 -1 -31 111 -324 -210 -274 -200 -36
3700c6O1K2K23k44k01j72K87j2PR8J8k18J65j11j8k47L93o3q1M08k99O1j99m1
$$ -36 25 47 270 26 -175 -347 -60 -72 -65 33 51 -167 -2 -113 -131 -378 15 -48 -129 279 -20 41 -158 -199
3724a99K14k35J04K09J6J64j02m06J82j22J78l4K59j78J07j46j8k8k11m8J96K31
$$ -199 15 -220 -116 93 109 273 171 -235 -53 -175 3 -31 228 50 157 11 -7 -35 -246 -294 -98 133
3746A33j33K9j03K6lj76R7J88l52J97K42j8k60Q5r8K26l6k19M21k00o0K73o31
$$ 133 0 29 -74 -48 -51 -227 -130 58 -294 -97 145 127 -133 -48 -146 80 44 -175 246 46 -14 259 -372
3769c72J77M8o7J41J22R7K33l15j36l0K12k44J59o3K28k72K08J56m19J51r4J6
$$ -372 -195 -147 -214 -73 49 146 379 64 -72 -102 110 -134 25 -38 190 -82 126 282 -137 14 -80 -64
3791f4k29K50N0j39L4J58k79L48k22J97P6k45m8MK04j00qN4j0N2J40O8l86k6M6
$$ -64 -293 -43 7 -132 -98 60 -219 129 -93 104 180 -65 -113 -109 95 -5 -13 41 31 83 223 291 -95 -121 -75
3816g5j95K16M4J99m24K03o0J8J20j64r6K33J52J3n8o1J85n46mL84k04J94j03
$$ -75 -270 -54 -10 189 -235 -32 -92 -74 46 -118 -214 19 171 184 126 65 250 -296 -300 84 -120 74 -29
3839b9L06k00m4n4k4K35l97L66k43K08J10l32J7K2j0q1N7K87l18j09K83p9j67
$$ -29 277 77 33 -21 -45 190 -207 159 -84 124 234 -98 -81 -59 -69 -150 -93 194 -124 -233 50 -29 -196
3862a96P7K34k6j18K40l64J22j0m58L52r0K75p2j04J11J22k86p4K34N2l7K62J8
$$ -196 -119 115 89 -29 211 -153 -31 -41 -499 -147 -237 38 -34 -138 -27 95 -191 -265 -31 21 -16 246 264
3885B64k26J56j87k31j71N23l15K65P5q5j61N2j77R0R8j95K37J64j36k20P5k16
$$ 264 38 194 7 -224 -395 128 -187 78 153 68 -93 -41 -218 -128 -30 -225 12 176 40 -180 -105 -321
3907c21J26K10j04K78n1j02p0r3o8NK23j73N22l90K9j40j51MP0R7J91kq7L50m18
$$ -321 -195 15 -89 189 138 36 -34 -127 -195 -190 33 -140 382 -8 21 -119 -270 -266 -196 -99 92 90 3 353 -65
3932f5n9o0J72J35K3J57jj28q1l57k7J80j17M58K6J60l22j50j30k6J22o8L41N2
$$ -65 -124 -184 -12 123 146 303 302 174 93 -264 -291 -111 -228 230 256 416 94 -56 -186 -212 -90 -158 183 235
3956B35j5l5j09j51k86K89J40J93j5j45R8r0q8k97o2J29J19K93K50l53J20p05
$$ 235 220 185 76 -75 -361 -72 68 261 246 101 199 109 21 -276 -338 -209 -90 203 453 100 220 -485
3978d85M65k41J70n9K78K95l77k20J82j83j80K36J07O4J66j60K7j12k24m4R5J02
$$ -485 -20 -261 -91 -150 128 423 46 -174 8 -175 -355 -119 -12 52 218 58 85 -27 -251 -295 -200 -98
4000i8L21J65k80j79j24l99L22K91O7K74k86K36n69K91l19J79j04J65J77J26k53
$$ -98 223 388 108 -71 -195 -594 -272 19 86 360 74 310 -259 32 -287 -108 -212 -47 130 256 3
4021Cj24k12J68l29O20j8M3j12Oo2k84RJ25L2K7M30L98m29l21o16O54k49J86L82
$$ 3 -121 -333 -165 -494 126 108 151 39 45 -17 -301 -292 -167 -135 -108 322 720 291 -30 -646 8 -241 -55 327
4045C27l81K93L2l16m72K76k39M50K19M09k49j81j53k27J96j27r8L28J57p8L03
$$ 327 -54 239 271 -45 -517 -241 -480 -30 189 598 349 168 15 -212 -16 -143 -241 87 244 166 469
4066D69m74k2l48K35j13O28J74o62L88k63j57j24k2M41K2K71j18j81k06m13K42
$$ 469 -5 -27 -375 -140 -253 375 549 -113 275 12 -145 -269 -291 150 172 443 325 144 -62 -475 -233
4087b33M5J35J51m9J30P2k60l62K2K97J52J97R6j11L4m40k23j64M90o3K72J68
$$ -233 -188 -53 98 49 179 251 -9 -371 -349 -52 100 297 393 282 316 -124 -347 -511 -21 -84 188 356
4109C56N5l46j99j46j88K80l9M78J5J46j55m12l6Rk49J94N24Q9j43J59m30q3j70
$$ 356 411 65 -134 -280 -468 -188 -227 251 266 412 257 -155 -191 -182 -431 -237 287 376 233 392 -38 -121 -291
4132b91P6Q8L74PK57n87p9k36J21J10o4M94j65L11m37O6m49J05K37KK44N57m39
$$ -291 -215 -127 247 254 511 -76 -155 -391 -270 -160 -224 270 105 416 -21 45 -404 -299 -62 -60 184 741 302
4155C02l66J52l28k80J90M12K46o1K41n41l83K20l97N28J3J86L25j48j14m00k89
$$ 302 -64 88 -240 -520 -330 82 328 267 508 -33 -416 -196 -593 -65 -52 134 459 311 197 -203 -492
4176d92J10J16rM86j4K95m30k72k64j24J49L31J06L26J19k90k80N5m63J43K36
$$ -492 -382 -266 -275 211 197 492 62 -210 -474 -598 -449 -118 -12 314 433 143 -137 -82 -545 -402 -166
4197a66N33L1j11R4o09j35j61M73Q1J61J89j9j82m96l43P7N65k8J24K53pk54l8
$$ -166 367 398 287 381 -228 -363 -524 -51 30 191 380 361 179 -317 -660 -583 -18 -46 78 331 324 70 32
4220C2l79J23j4L64K49q1j08n8k61j50o0j12N15K76J13j08l58l80R3PK66nL70
$$ 32 -347 -224 -238 126 375 294 186 128 -133 -283 -343 -455 60 336 449 341 -17 -397 -304 -297 -31 -36 334
4243C34J74k38%l72l13J97r6K89K71J91j15l74k56l5M0j41O20N0L19J9o22k87
$$ 334 508 270 270 -102 -415 -218 -314 -25 246 437 322 -52 -308 -343 -303 -444 176 226 545 564 -58 -345
4265c45R0j68J05L11K85M38n20j30j68k43j65L77N66O8j40l7k75j40l25%L24J41
$$ -345 -255 -423 -318 -7 278 716 196 66 -102 -345 -510 -133 433 501 361 324 49 -91 -416 -416 -92 49
4287D9K58N5k02r2j42j71l20M27L20L70M2m22j79j99j08k12K57N21J15j29R1l89
$$ 49 307 362 160 68 -74 -245 -565 -138 182 552 594 172 -7 -206 -314 -526 -269 252 367 238 329 -60
4309f0l24k31M25k75P30Q8K10n59n5j65j54JJ70K53K82J53k36l01l44J81j88K94
$$ -60 -384 -615 -190 -465 265 353 563 4 -51 -216 -370 -369 -199 54 336 489 253 -48 -392 -211 -399 -105
4331a05L51K12J46j21o90m3R8j32n9P95kR9k01l94k80p0k03N82L16j20K53j95
$$ -105 246 458 604 483 -207 -250 -152 -284 -343 452 450 549 348 -46 -326 -396 -599 -17 299 179 432 237
4353B37m05j17n1j40Q6O55J97%l19K0n54k45L20N19k5L09k09j66J52o29r9k1L52
$$ 237 -168 -285 -336 -476 -390 265 462 462 143 163 -391 -636 -316 203 178 487 278 112 264 -365 -464 -485 -133
4376a33M35K14k36j86k58j74R1j90M5Q92j71K19l51p4n15rJ19L3L62M06N9l71
$$ -133 302 516 280 94 -164 -338 -247 -437 -392 500 329 548 197 123 -392 -401 -282 -249 113 519 578 207
4398B07k4p05Q0K14L25JK29K21k15m16j77n3j03J82M15K44O8L5p72k84nL40K34
$$ 207 183 -522 -442 -228 97 98 327 548 333 -83 -260 -313 -416 -234 181 425 493 528 -244 -528 -533 -193 41
4421D1K74J42J78k93l51m06j54L33L70K88q1l1l6l92l44q2O1J82O69M47n26l1
$$ 41 315 457 635 342 -9 -415 -569 -236 134 422 341 310 274 -118 -462 -544 -483 -301 368 815 289 258
4443B58o44k07K57JL23J0M70R2j30n04m97J15N8K73N83k2K40n68k24k71j00j08
$$ 258 -386 -593 -336 -335 -12 -2 468 560 430 -74 -571 -456 -398 -125 458 436 676 108 -116 -387 -487 -595
4465e95N80L20K20L5k00m99k83j56J45L46M46M28l47m65o3m69J03M5J61O39Q4
$$ -595 -15 305 525 560 360 -139 -422 -578 -433 -87 359 787 440 -25 -88 -557 -454 -409 -248 391 475
4486D75M0k26j55p43p7L22L05N47o8M40q08j89l88j55N30N8M54K73O5n11m00l19
$$ 475 515 289 134 -609 -686 -364 -59 488 420 860 52 -137 -525 -680 -150 -92 362 635 700 189 -211 -530
4508e30K4J21N75K98J74j25m31m52j68J4K4M38N15j26Q5q6k69o01j94N14J45N77
$$ -530 -506 -385 190 488 662 537 106 -346 -514 -500 -476 -38 477 351 436 350 81 -520 -714 -200 -55 522
4530E22p0k3Ln92k58N7J48K60L61N1R7j36r17k40M7J00O64N57q0k08j87n48j23
$$ 522 452 429 432 -160 -418 -361 -213 47 408 459 556 420 -497 -737 -690 -590 74 631 551 343 156 -392 -515
4553e15N2L53K16J72N18o17l24o7k29j85L02O30R3J87l36l22o9l31Lp9N72L89
$$ -515 -463 -110 106 278 796 179 -145 -212 -441 -626 -324 306 399 586 250 -72 -141 -472 -469 -548 24 413
4575D13J92j97l85m7o47M73J4J00O23K81m73j98o60J65k65K76N51R7L5J02l62
$$ 413 605 408 23 -24 -671 -198 -184 -84 539 820 347 149 -511 -346 -611 -335 216 313 348 450 88
4596H8o50J46j13J07N61K50K3Nl27k73n48L46M00o4J85O33l04m23k36l62k49P48
$$ 88 -562 -416 -529 -422 139 389 412 417 90 -183 -731 -385 15 -49 136 769 465 42 -194 -556 -805 -57
4618e7O44j82K37m11j59l87m97K87M69J57M96l9j38k68n24k36q7O25M13k17O94
$$ -57 587 405 642 231 72 -315 -812 -525 -56 101 597 558 420 152 -372 -608 -695 -70 343 126 820
4639H20m62m82l39R0k14L20M36L11K74k48n65n92m0L06M18J20M26K27n41m34j75
$$ 820 358 -124 -463 -373 -587 -267 169 480 754 506 -59 -651 -691 -385 33 153 579 806 265 -169 -344
4660c44k56l00P42N51J16m2k64j43l72m27L21K73O54J47j44k3o22l84k86L70L9
$$ -344 -600 -900 -158 393 509 467 203 60 -312 -739 -418 -145 509 656 512 489 -133 -517 -803 -433 -394
4681c94N66N55j71k12l60o13m3J78L92N89R2k85P8m06p16J68j58M13P82L17k20
$$ -394 172 727 556 344 -16 -629 -672 -494 -102 487 579 294 372 -34 -750 -582 -740 -327 455 772 552
4702E52J71p65o28k0M15N2M79L41L86n06o89m32m1J53J17N93M28J63l83p42l37
$$ 552 723 -42 -670 -690 -275 -223 256 597 983 477 -212 -644 -685 -532 -415 178 606 769 386 -356 -693
4723f93M1J2O27J35M01J40m41m21q3n66J95O61O04k40R3q5m39p17o7M84M41J37
$$ -693 -652 -640 -13 122 523 663 222 -199 -282 -848 -653 8 612 372 465 380 -59 -776 -843 -359 82 219
4745B19M18j28j49m39m37k23L20M03M42K22R2l89o61l30J06j53L39R10J72j33
$$ 219 637 509 360 -79 -516 -739 -419 -16 426 648 740 351 -310 -640 -534 -687 -348 562 734 601
4765F01l12m05n69k02M16M08N95K37j20m15p28L8m08O80J75L72J67J82j58p68
$$ 601 289 -116 -685 -887 -471 -63 532 769 649 234 -494 -456 -864 -184 -9 363 530 712 554 -214
$$ [...]
8191A31
##END NTUPLES=NMR FID
##END=
