##TITLE=1H_PR195_rm
 CDCl3,8 sc, 
 6.04.2021
##JCAMPDX= 6.0         $$ Bruker NMR JCAMP-DX V2.0
##DATA TYPE= NMR FID
##DATA CLASS= NTUPLES
##ORIGIN= UXNMR, Bruker Analytische Messtechnik GmbH
##OWNER= root
$$ XWIN-NMR		Version 3.5
$$ Tue Apr  6 12:39:20 2021 Russian Standard Time (UT+4h)  she@DPX200
##.OBSERVE FREQUENCY= 200.131506
##.OBSERVE NUCLEUS= ^1H
##.DELAY= (6, 6)
##.ACQUISITION MODE= SIMULTANEOUS
##.ACQUISITION SCHEME= undefined
##.AVERAGES= 8
##.DIGITISER RES= 18
##SPECTROMETER/DATA SYSTEM= spect
##.PULSE SEQUENCE= zg30
##.SOLVENT NAME= CDCl3
##.SHIFT REFERENCE= (INTERNAL, CDCl3, 0, 15.7039)
##AUDIT TRAIL= $$ (NUMBER, WHEN, WHO, WHERE, WHAT)
$$ ##TITLE= Audit trail, XWIN-NMR		Version 3.5
$$ ##JCAMPDX= 5.01
$$ ##ORIGIN= Bruker BioSpin GmbH
$$ ##OWNER= she
$$ F:/spectra/data/she/nmr/H-F/1/audita.txt
$$ ##AUDIT TRAIL=  $$ (NUMBER, WHEN, WHO, WHERE, WHAT)
(   1,<2021-04-06 12:38:06.56 +0400>,<she>,<DPX200>,
      <created by zg, POWCHK disabled, PULCHK disabled
       configuration hash MD5:
       00 E9 B6 7A A2 85 ED C7 34 08 36 98 17 FE 4E 26
       data hash MD5: 16K
       FD 30 7C C3 4E E0 B0 B9 1C F3 6C A1 83 24 07 4F>)
$$ ##END=
$$ 
$$ hash MD5
$$ 38 BB 84 FA 71 6D 0A 44 82 B5 15 7D F6 52 A4 04
##$RELAX= 
##$RELAX= 
##$RELAX= 
##$RELAX= 
##$RELAX= 
##$RELAX= 
$$ Bruker specific parameters
$$ --------------------------
##$DU= <F:/spectra>
##$EXPNO= 1
##$NAME= <H-F>
##$PROCNO= 1
##$TYPE= <nmr>
##$USER= <she>
##$AMP= (0..31)
100 100 100 100 100 100 100 100 100 100 100 100 100 100 100 100 100 100 
100 100 100 100 100 100 100 100 100 100 100 100 100 100 
##$AQSEQ= 0
##$AQ_mod= 1
##$AUNM= <au_zg>
##$AUTOPOS= <>
##$BF1= 200.13
##$BF2= 200.13
##$BF3= 200.13
##$BF4= 200.13
##$BF5= 200.13
##$BF6= 200.13
##$BF7= 200.13
##$BF8= 200.13
##$BYTORDA= 1
##$CFDGTYP= 0
##$CFRGTYP= 5
##$CHEMSTR= <none>
##$CNST= (0..31)
1 1 145 1 1 1 1 1 1 1 1 1 1 1 1 1 1 1 1 1 1 1 1 1 1 1 1 1 1 1 1 1 
##$CPDPRG= <>
##$CPDPRG1= <>
##$CPDPRG2= <>
##$CPDPRG3= <>
##$CPDPRG4= <mlev>
##$CPDPRG5= <mlev>
##$CPDPRG6= <mlev>
##$CPDPRG7= <mlev>
##$CPDPRG8= <mlev>
##$CPDPRGB= <>
##$CPDPRGT= <>
##$D= (0..31)
0 1.2 0 0 0 0 0 0 0 0.06 0 0.03 0 0 0 0 0.0002 0 0 0 0 0 0 0 0 0 0 0 0 
0 0 0 
##$DATE= 1617698286
##$DBL= (0..7)
120 120 120 120 120 120 120 120 
##$DBP= (0..7)
150 150 150 150 150 150 150 150 
##$DBP07= 0
##$DBPNAM0= <>
##$DBPNAM1= <>
##$DBPNAM2= <>
##$DBPNAM3= <>
##$DBPNAM4= <>
##$DBPNAM5= <>
##$DBPNAM6= <>
##$DBPNAM7= <>
##$DBPOAL= (0..7)
0.5 0.5 0.5 0.5 0.5 0.5 0.5 0.5 
##$DBPOFFS= (0..7)
0 0 0 0 0 0 0 0 
##$DE= 6
##$DECBNUC= <off>
##$DECIM= 32
##$DECNUC= <off>
##$DECSTAT= 4
##$DIGMOD= 1
##$DIGTYP= 9
##$DL= (0..7)
0 120 120 120 120 120 120 120 
##$DP= (0..7)
150 150 150 150 150 150 150 150 
##$DP07= 0
##$DPNAME0= <>
##$DPNAME1= <>
##$DPNAME2= <>
##$DPNAME3= <>
##$DPNAME4= <>
##$DPNAME5= <>
##$DPNAME6= <>
##$DPNAME7= <>
##$DPOAL= (0..7)
0.5 0.5 0.5 0.5 0.5 0.5 0.5 0.5 
##$DPOFFS= (0..7)
0 0 0 0 0 0 0 0 
##$DQDMODE= 0
##$DR= 18
##$DS= 0
##$DSLIST= <SSSSSSSSSSSSSSS>
$$ [...]
##$SUBNAM2= <"">
##$SUBNAM3= <"">
##$SUBNAM4= <"">
##$SUBNAM5= <"">
##$SUBNAM6= <"">
##$SUBNAM7= <"">
##$SUBNAM8= <"">
##$SUBNAM9= <"">
##$SW= 16.9725357007746
##$SWIBOX= (0..15)
0 0 2 0 0 0 0 0 0 0 0 0 0 0 0 0 
##$SW_h= 3396.73913043478
##$TD= 16384
##$TD0= 1
##$TE= 0
##$TE2= 300
##$TE3= 300
##$TEG= 300
##$TL= (0..7)
0 120 120 120 120 120 120 120 
##$TP= (0..7)
150 150 150 150 150 150 150 150 
##$TP07= 0
##$TPNAME0= <>
##$TPNAME1= <>
##$TPNAME2= <>
##$TPNAME3= <>
##$TPNAME4= <>
##$TPNAME5= <>
##$TPNAME6= <>
##$TPNAME7= <>
##$TPOAL= (0..7)
0.5 0.5 0.5 0.5 0.5 0.5 0.5 0.5 
##$TPOFFS= (0..7)
0 0 0 0 0 0 0 0 
##$TUNHIN= 0
##$TUNHOUT= 0
##$TUNXOUT= 0
##$USERA1= <user>
##$USERA2= <user>
##$USERA3= <user>
##$USERA4= <user>
##$USERA5= <user>
##$V9= 5
##$VALIST= <valist>
##$VCLIST= <CCCCCCCCCCCCCCC>
##$VD= 0
##$VDLIST= <DDDDDDDDDDDDDDD>
##$VPLIST= <PPPPPPPPPPPPPPP>
##$VTLIST= <TTTTTTTTTTTTTTT>
##$WBST= 1024
##$WBSW= 4
##$XGAIN= (0..3)
0 0 0 0 
##$XL= 0
##$YL= 0
##$YMAX_a= 43655
##$YMIN_a= -30519
##$ZGOPTNS= <>
##$ZL1= 120
##$ZL2= 120
##$ZL3= 120
##$ZL4= 120
##$ABSF1= 10
##$ABSF2= 0
##$ABSG= 5
##$ABSL= 3
##$ALPHA= 0
##$AQORDER= 0
##$ASSFAC= 0
##$ASSFACI= 0
##$ASSFACX= 0
##$ASSWID= 0
##$AUNMP= <proc_1d>
##$AZFE= 0.1
##$AZFW= 0.1
##$BCFW= 1
##$BC_mod= 2
##$BYTORDP= 1
##$COROFFS= 0
##$CY= 11.3945322036743
##$DATMOD= 1
##$DC= 2
##$DFILT= <>
##$DTYPP= 0
##$F1P= 15.9154993809931
##$F2P= -4.1035820241983
##$FCOR= 0.5
##$FTSIZE= 0
##$FT_mod= 4
##$GAMMA= 1
##$GB= 0.15
##$INTBC= 1
##$INTSCL= 1
##$ISEN= 128
##$LB= 0.24
##$LEV0= 0
##$LPBIN= 0
##$MAXI= 10000
##$MC2= 0
##$MEAN= 0
##$ME_mod= 0
##$MI= 1.114404
##$NCOEF= 0
##$NC_proc= 0
##$NLEV= 6
##$NOISF1= 3.799351
##$NOISF2= 2.8
##$NSP= 1
##$NTH_PI= 0
##$NZP= 0
##$OFFSET= 15.70392
##$PC= 1
##$PHC0= -11120.57
##$PHC1= 14.60092
##$PH_mod= 1
##$PKNL= yes
##$PPARMOD= 0
##$PSCAL= 0
##$PSIGN= 0
##$REVERSE= no
##$SF= 200.130013532006
##$SI= 16384
##$SIGF1= 3
##$SIGF2= 2
##$SINO= 400
##$SIOLD= 16384
##$SREGLST= <1H.CDCl3>
##$SSB= 0
##$STSI= 0
##$STSR= 0
##$SW_p= 3612.71676300578
##$SYMM= 0
##$S_DEV= 0
##$TDeff= 0
##$TDoff= 0
##$TI= <>
##$TILT= no
##$TM1= 0
##$TM2= 0
##$TOPLEV= 0
##$USERP1= <user>
##$USERP2= <user>
##$USERP3= <user>
##$USERP4= <user>
##$USERP5= <user>
##$WDW= 1
##$XDIM= 8192
##$YMAX_p= 0
##$YMIN_p= 0
$$ End of Bruker specific parameters
$$ ---------------------------------
##NTUPLES= NMR FID
##VAR_NAME=  TIME,          FID/REAL,        FID/IMAG
##SYMBOL=    X,             R,               I
##VAR_TYPE=  INDEPENDENT,   DEPENDENT,       DEPENDENT
##VAR_FORM=  AFFN,          ASDF,            ASDF
##VAR_DIM=   8192,          8192,            8192
##UNITS=     SECONDS,       ARBITRARY UNITS, ARBITRARY UNITS
##FACTOR=    0.0002944,     1,               1
##FIRST=     0,             0,               0
##LAST=      2.4114304,     0,               0
##MIN=       0,             -30519,          0
##MAX=       2.4114304,     43655,           0
$$ Real data points
##PAGE= N=1
##DATA TABLE= (X++(R..R)), XYDATA
$$ [...]
1787C07Ll75J02k83M40l49K90k05O8J22k55J08k40K94L6j17J83j84P6J28o5k76
1809a92Q3K47l39pj11R2K18j42j00j68K48k1J12o7r8l7L0R6j6K06k43r8nL06k44
1834b50K38j2m57L58k10J13K82p5l4o1m8j91K67l3j60K56l04L79k49j42K47J72
1856H6k97K91J44n77R2L26k03J50k13J07k43J33p9L00o3J65j04Rk13K46NrR4q0
1880F7j18K53j84j44L95j96K46l85K98m6K5k42K68k09J16K18q6K36m62L0K04r6
1902A88J03l8K34N3m09k38K31K58j64J57j10k8N0K4N2k64M9J61q9J9J27j58o1
1925A47k05m2j1L73k31r1J5l04L59j66N3j57r9J05N0j68J16jk25J53J06k6M1l10
1949e18L8o4L68l18L59k87J58j55q1R6k1J51L5P8l40J86K1LK49l2on6J59l36J66
$$ y = [307, 310, -65, 37, -246, 194, -155, 135, -70, -2, 120, -135, -27, -267, 27, 63, -54, 129, -55, 21, 149, 84, -192, -109, 138, -201, -208, -319, -227, -9, -151, -251, -419, -171, -192, -80, -147, -245, -282, -252, -156, -172, 34, -209, -307, -312, -6, -250, -12, -24, -481, -123, -333, -220, 62, -13, -47, -108, -156, -347, -80, -113, -273, -17, -321, 58, -191, -333, -86, 86, -211, 80, 224, -353, -261, 65, -138, 12, -201, -94, -337, -204, -283, 17, -46, 119, 15, 24, -189, 57, 62, 53, 147, 67, -51, 202, 18, -126, 269, 73, 319, -66, 232, 186, 211, -31, 237, 28, 144, 362, 276, 512, 50, 80, 284, 188, 291, 253, 487, 540, 131, -107, 124, 382, 218, 375, 265, 237, 287, 311, 363, 99, 148, 309, 220, 239, 366, 208, 147, -58, -100, -111, 262, 31, -60, -45, -349, 10, -156, -103, -260, -359, -254, -204, -372, -256, -257, -482, -329, -223, -249, -208, -518, -480, -544, -176, -494, -135, -422, -264, -419, -500, -404, -425, -274, -239, -161, -501, -315, -294, -291, -42, -74, -80, -136, 23, -313, -147]
1974a47MM8J25k1N8J41k8k6k27J71j37M57q7l49KJ23j1M2J52P0j16K2J25l20K73
1999C44l49M02k33LK31j72p2r3L43l17P8M5Q1k06J25j32j8R2K62k58k3k1J3n8
2023F7n7K02J8m2j56M7q9L6J8J28k23J25l3p0K18k50j90K38L8K50k27n8k46J86
2047g0J03o5j17L12O1j64j06J78j49J4l8q9P9P3k20L60j72R0k07j90L36r0J41
2070G0k15q0J07j13N1j52L06L8j46L1J62j11k38K02j16o5qQ5J16K2J32j55j58
2093b35j11K83j07pL7k37K25m0R9J10l25L15o1j03k1Q8J47j48K30k44J31LM3N7
2117A29l7J8k27Q9J68j53j21K52L9j14K42J1k0j56J17n7q9Q1K39k19j11J29J36
2140C46j5k94J36O5j3Ok2p5J07j50l9k0K03P5l44L59n46L68L8J88l56k81M76k35
$$ y = [-147, -143, -95, 30, 9, 67, 208, 180, 154, -73, 98, -39, 418, 331, -18, -16, 107, 96, 138, 290, 360, 244, 266, 391, 71, 344, -5, 397, 164, 167, 398, 226, 154, 61, 404, 87, 165, 210, 291, 85, 210, 78, 60, 152, 414, 156, 133, 112, 125, 67, 10, 212, 230, 188, 32, 79, -10, 26, 44, 172, -51, 74, 41, -29, 189, -61, -251, -13, 25, 275, 48, -10, -256, -70, 33, -32, -149, 163, 224, 60, -46, 132, -17, -3, -41, -130, -51, 22, -198, 162, -10, 80, -127, -317, 19, -71, 70, -145, -225, -118, -231, -180, -332, -26, 12, -134, -103, 59, -52, -290, -88, -204, -269, -277, -192, -76, -54, 78, -77, -235, -346, -63, -170, -177, -140, -377, -152, -192, -93, 17, -308, 7, -54, -157, -178, -90, 57, -91, 139, -105, 26, 29, 72, 129, 92, 110, -117, -28, 140, -13, -134, 118, 157, 43, 285, 296, 276, 120, 237, 180, 91, 172, 411, 192, 81, 210, 346, 331, 37, 173, 238, 225, 231, 209, 134, 241, 91, 52, 32, 235, 310, -34, 325, -221, 147, 185, 373, 17, -264, 212, -23]
2164b3j51M97m38K97j41k9l45L74j06L9n8k6KQ2J55l32MJ50j82j24K16J31j92
2187b00L0l44L25K0l03L98J2J8j72j1N6L60m79k2J11M0L82k67L9o8J55j70J50
2210F0K69o02P2K16M9M9l06K27J9j05L84j11j40j25M9q2K55m0O7k0j25K40j92
2233A08N0Q4K7l64J28N9L2m6K3j9r2R4l9j61j69K54K58j35j16K96j86q7j2m0J85
2258A32m0j62J59P1k1k15N8Q6J8p0p0N9N0K73k25J58n9k8j44M4o2qj44J24J63
2283A47j73L06k79oL17k30n0L25m82J19k18L34k46l7k8M65p6j10l8p4lj89L0K04
2307Hj96J57q2k36L94j04m4R3K7j77J56o1K2k14L79o1m66J83j77L05L1K7j01m7
2331a84K19q7o8r9o4l5J50J57Q3k25n7M8K11l93L42J04mj07o4M6J08jj37J38J27
$$ y = [-23, -174, 323, -115, 182, 41, 12, -333, 41, -65, -26, -84, -110, -108, -26, 129, -203, -199, -49, -231, -355, -139, -8, -200, -170, -514, -189, -169, -472, -74, -62, -44, -216, -227, -171, 189, -290, -312, -201, -161, 221, -46, -7, -75, 80, -90, 60, 329, -273, -201, 15, 64, 113, -193, 34, 53, -52, 332, 221, 81, -44, 5, -77, 178, 138, 205, 185, 60, 300, 108, 158, 242, 269, -95, 33, 92, 124, 78, 101, 82, -10, 84, 45, -116, -285, -31, 227, 92, -24, 272, 86, -1, -13, -53, 132, 92, -70, 89, 160, 139, -76, -18, 68, 86, 16, -54, 5, 55, 328, 103, 261, 202, 174, 30, 74, 12, 4, -140, -16, 147, -26, 280, 1, -5, 312, 82, 32, 357, -125, -6, -224, 110, -136, -173, -201, 264, 188, 78, 40, -34, -37, -226, -196, 8, -188, -31, -113, -349, 45, -59, -103, -10, 17, -160, -4, -65, -43, -257, 122, 61, -405, -222, -399, -94, -63, -36, -137, -184, 35, -52, -120, -219, -283, -318, -168, -11, 72, -153, -210, -162, 49, -344, -2, 102, 98, -9, -73, -27, 81, 80, -57, 81, 208]
2356B08l00J39J53n7j23J69j23m6J56K23j26l7j49R8J01k61J10L7k5j38K64l5
2378B38q1j04J58l2j54J9K57l96q5K26J73j53M3L0n5J48l90J85L8k23K74j94J88
2401A10j56j61J08j1M6o6J2M2Qj84J8O6K10M0l56J50M1k21J23M0K2j26n7K08J48
2426E4q4j37K90l42K08o5J74k00o3M26k15j8p8L81m96R6j2K38j01j83K41k82R1
2449g7K7J63M2j69r3k2J60j03J17k05K00j09K94p8k37J00k53K28n5K53j3P5l99
2472a54K98k2k16J87k26K65k53O38m95o1m7K38k24N1J68r5J39k62J02J55m2Q9
2494B33l11K34Jl31K06k81L43o2nK82k00j16K06o4N6j56R3k20J43q5m2J35l59
2517c00M0M84j07K1k23J82P2k10k6j08J57j6P7p7j75qJ13j79K81p0jl8J41j18
$$ y = [208, -92, 47, 200, 143, 20, 189, 66, 20, 176, 399, 273, 236, 87, 185, 286, 25, 135, 172, 147, 9, 273, 238, 157, 53, 211, 179, 25, 44, 301, -95, -180, 46, 219, 66, 109, 139, 84, 232, -158, 27, 65, -158, 116, -78, 110, -46, -207, -99, -110, -64, -130, -118, -76, -68, -252, -234, -168, 42, 82, -274, -124, -83, -304, -181, -141, -119, -245, -302, -94, 54, -30, -167, 123, -219, -11, -76, 98, -102, -165, 261, 46, 28, -50, 331, -165, -69, -81, 157, 56, -127, 114, -168, -77, -50, 113, 155, -14, -107, -129, 31, -72, 45, -160, 40, -69, 225, 147, -90, 10, -243, -15, -70, 183, 170, 245, -154, 144, 122, -94, 93, -133, 132, -121, 517, 22, -39, -86, 152, -72, -21, 147, 52, 191, -71, 31, 186, 144, 233, -78, 156, 157, -174, 32, -249, 94, 32, 27, 309, 109, -7, 199, 135, 191, 35, 128, -92, 51, -34, -76, 59, -300, -260, 224, 117, 138, -85, 97, 169, -41, -67, -175, -18, -34, 43, -34, -209, -217, -104, -283, -2, -72, -73, -111, 30, -88]
2541h8R9Ok92j2j32M43k02n0n5K6K64j74L02k60mK27k83L2l3Q6J59l05L17k93
2565b22R0K11o1j92J72m8J63k04Q8j76J11n2L8j7K9J5q6P7K12J1m9k6J87j57J99
2590C13j55k24P8j04J70n2L8J6M1J79m9n95N27J1j19R6J24n01J38K60r3j51P8
2613B6P2j47J41k68J83O1l2M5j57j10L24l59K33K4J67j78k43P4q3Q6K54j51j9
2636e7J63j10Q3k05j63K28m6K48k08j32J60l3J59l31J13K7j12P6K17k30J13k5
2658f5O0J32K0k01J05Rj96J9J12Q5j97K51rJk37P2O8r2J43k15RN21j85q4l76K39
2684a1nj03rn3K60l56K48pJ94l55P2N2J73k47K72R4k26K28k75J69q8n3K48j32
2708I0k81N23m25k6J30K16J65k16k32J12K4P5j24j49L42P1l12M4K17j30j3j93
$$ y = [-88, 11, 17, -275, -287, -419, 24, -178, -228, -283, -257, 7, -167, 135, -125, -129, 98, -185, -153, -186, -100, 59, -246, 71, -222, -132, 79, 18, -174, -2, -50, 113, -91, -3, -179, -68, -120, -82, -99, -70, -55, -141, -64, 148, 159, 110, 84, 271, 114, 313, 158, -66, 12, -92, 78, 26, 64, 80, 121, 300, 251, -344, 183, 194, 75, 171, 295, -206, -68, 192, 99, -52, 26, 98, -49, 92, -176, 7, 68, 36, 81, -76, -186, 138, -221, 12, 36, 203, 25, -218, -144, -227, -141, 113, -38, -57, 106, -4, 79, -126, -289, -61, -107, 141, -67, -199, -39, -72, 87, -244, -131, -104, -216, -140, 77, -153, -40, -65, -5, 127, 147, -54, 51, 60, -136, -117, -5, 80, -117, 134, 125, 126, -111, -39, 29, -63, 80, -135, -126, 395, 210, 126, -250, -11, -16, -119, -128, -181, 79, -277, -29, -36, 158, -197, -125, -73, 100, -147, 125, 219, -7, 221, -54, 115, 27, -26, 222, 90, -191, 332, -93, -119, 11, 227, 392, 176, -56, 56, 80, 155, 31, -118, 224, 295, -17, 27, 244, 114, 101, -92]
2730i2K15J23l34o0K97k31K51k15J67P4J75k28k05J44J70j16k12j94K76P4n7j69
2752a47M42k43j56O4J79J33k63P7k18K7J12k0j30l2J81o2O5k82L01l58R2j37L38
2775c7l3l8l7j15M48k35O2j1j08j05Q5p9L9k8J87J5j57J41l1j74M85k49j03J82
2799A04l02K70J24j14j15P8j89J44Q1o2o1O8M6j05K45q3j65l0J90J31M4l77J19
2822D1RM21n48J92K6L2j76o5L89j87o6O8j24k1K31j73N9Q7N9j56l50L24J8N0j31
2847Ik82J66J10k10L80j52J06j78J80J51m01j61J52J48L07j95r0L0k70Q2PJ61
2869E0J75l13n7J4j5R9o8L51l58L07j21j29j22M16l03k31K35R0N5p2J17q0J83
2892B23l40K12j47J32l50L52j30R4j56K4j56J24L08j73O3m58L94NrK4p4J86j65
$$ y = [-92, 123, 246, -88, -148, 149, -82, 169, -46, 121, 195, 370, 142, -63, 81, 251, 135, -77, -271, 5, 79, 22, -147, 295, 52, -104, -40, 139, 272, 9, 86, -132, -105, 7, -13, -143, -175, 6, -56, 9, -273, 28, -330, -238, -375, -37, -70, -108, -145, -260, 188, -47, 15, 4, -104, -209, -124, -203, -164, -192, -5, 10, -147, -6, -37, -211, 274, 25, -78, 104, -198, 72, 196, 82, -33, 45, -144, 0, 81, 19, -42, 26, 72, -33, 212, 129, -36, -66, 124, 255, 299, -78, 41, 50, 471, -77, 115, 141, 173, -3, -68, 321, 134, 68, 136, 12, -9, 222, 49, 108, 195, 254, 98, -252, 72, 90, 140, 9, -273, -107, 3, -207, 173, 21, 127, -51, 129, 280, -121, -282, -130, 18, 325, 130, 40, 70, -200, -118, -111, 50, 225, -88, -145, -131, -146, -47, -115, 236, -122, 185, 64, -65, -187, 229, -74, -305, -70, 20, 75, 3, 120, 40, 223, -117, 95, -52, 80, -270, 82, -48, 46, -110, -86, -242, -118, 190, 17, 80, -378, 16, 21, 12, 36, -38, 148, -17]
2915a7O4j8q0j26j15J80Q7m8J45k37J93N9n44L41j3o7K33q7j4K3j73K61j0j85
2939a48K04j53J78L1OJ25j90Q0r1K84k17k8L2J14k41K09k29J44k87K37k95K89
2961E4R7k33J09O0K34k89j5r9K59j04J79l30K32K36m83N0J42Q5j12J05O9k51l7
2984d2J41J05p5L6j22k88L47j54N8j36K10j3j88K5J71M9j93m6j05J51j11k7r7
3007c04K90k46K54j15k20K10o5n7R4P7J18n3j24K39k30J16R7J43l43K47l43L02
3029H7P7j56r5P3n5J32R1j48J90j30k0k12MJ52j6P8J49q5J9P5n26K63L16k52J42
3054A53r5Jj20M1k01L51k6p5Rj82L54l57Q8K21m5J16k84l4J05J35l75K49l1j7
3078a9J59k00j2J80q4r6P3r6N6P8j0L2o0j06NJ10J14o9l3l39M43J04n28M07j38
$$ y = [-17, 47, 29, -51, -177, -292, -112, -25, -73, 72, -165, 28, 87, -457, -116, -129, -196, 37, -50, -64, -41, -214, 47, 37, -148, 56, -97, 81, 112, 118, 243, 53, 133, 42, 326, 109, 81, 113, 227, -14, 195, -34, 110, -177, 60, -235, 54, 151, -82, 27, 87, 321, 32, 17, -82, 177, 73, 252, -78, 154, 390, -93, -43, 99, 184, 72, 177, 246, -5, -42, 99, 204, 129, 165, 43, -245, 102, -52, 6, -130, 80, 67, -121, -96, 75, 124, -69, -115, -220, -69, -180, -207, -304, -14, -260, -6, -121, -341, -131, -196, -253, -159, -82, 36, -17, -141, 98, -132, -16, 81, 224, -119, 128, -215, 87, 164, 8, -87, -14, -69, 63, 154, 6, 196, 66, 46, -166, -162, -10, -26, 52, 201, 116, 135, 210, -316, -53, 263, 11, 153, 58, 59, -61, -20, -221, 130, 104, 29, 38, -144, 210, -147, -59, 162, 117, 233, -51, -85, 20, 155, -220, 29, -2, -19, 140, -60, -72, 108, 24, -72, 1, -95, -39, 39, 29, 61, 1, -105, -100, 10, 124, 55, 22, -317, 126, 230, -298, 109, -29]
3103b9j37J22N0Q6J57j97J05j67O9J81J34l66r0J7J75j13j77L15p6M0J34k00j35
3126a02m7N3M14k91jP4J07l04J42O0l2J29l40L46m47k5L24R0j05l02N3J8K48j5
3150D7O3k52k8J48l1J33j93J69k87J54K69l22JQ0j2r5m7M30m30R6J62n7R0j48
3174f0k0q5n3L08Oo8O0j9L0p1JJ73l88K24l9j16J43j9J35L0P4j12ok06N2K68q3
3201A59q1L93o59L54j1j0k5j08p2O5K2j10K91M2k08J32k90N6K31ol57L45M3l30
3225a34Q4L29j91k70K9J92j6l10K69J67l19K13k75J79mj68J27j24L65k35J02j30
3247a20j27M15rj59J44J9j54m7j48P0J68j55K2J29m7M0P3l18O6q0K19K06l35K22
3271I4l07J00J07k75L52J86m90J59P2L8RP1J22l41M2L09m18P3n3J96P9q9j19R0
$$ y = [-29, -166, -44, 6, 92, 249, 52, 157, -10, 59, 240, 374, 8, -82, -65, 110, -3, -180, 135, 59, 99, 233, 33, -102, -149, -96, 318, 27, 26, 100, 207, -97, 45, 105, 73, 202, -138, 208, -239, -264, 60, 150, 45, -257, -204, -186, 62, 47, 110, -142, -170, -22, -53, 80, -113, 56, -231, -77, 192, -130, -129, -49, -61, -156, -203, 227, -203, -107, 55, -2, 88, -60, -80, -165, -218, 90, 96, 28, 88, 69, 99, 28, 29, 202, -186, 38, -1, -117, 26, 7, 142, 172, 246, 134, 128, -78, -26, 242, 159, 78, 471, -188, 166, 155, 145, 120, 12, -60, 5, 27, -83, 208, 250, 42, 174, -116, -60, 171, 165, -192, 153, 196, -134, -50, 279, 88, -182, -153, 39, 23, -287, -18, 149, -170, 43, -232, -53, -57, -225, -98, -222, 143, -92, 10, -120, -247, 168, 159, 0, 144, 163, 9, -38, -186, -116, 52, -103, -81, 48, 1, 41, 114, -204, -138, -218, 1, 207, -128, 94, -213, -113, -6, -281, 71, 257, -233, -74, -2, 36, 45, 116, 238, -103, -61, 248, -170, -97, -150, 46, 125, 36, -83, 7]
3295Gj8k2O3R9m9j67L82n19J61K35j27j14q0P1J6R6MR1L5q9j99J04J52l6K01k50
3321D7j78P7P4j43o2K59k77J40j25R9J38j79J90k12J08J01P9j36j05j11K89k5
3343D8JJ22l17L20j84O6p3L6J07p3j59K30l18L09j62j09K18n8J4J53k01J80r1
3366E9j57L29p7o1q0O3k37J72o3J79j00j35J36l3j16L06l18N2K%JJ23k87R7J26
3391a9j76P9L8p5J0O1m8N7n7rK14k21J29j28J16j97J24pm0K7P6L58l41O8j91J43
3417ij95K14K42p3m8j96K1J46j95K4J11L4j47J82k44M4l1K53n4j78L68k32L40
3440C77j17m90J86P1J59Q2j4l52J27N5j13P9K9n3j98J70J91k70J1O2n3L21q6K9
3464B03m7k47J46l11L72q3J33j01L6r2j80K02K72n39Q7j9J90j84j00M66j60k38
$$ y = [7, -11, -33, 30, 129, 80, -87, 295, -224, -63, 172, 45, -69, -149, -78, -62, 34, 38, 129, 164, 75, -124, -20, 132, 96, 297, 47, -131, -54, 20, -123, -185, 74, -203, -63, -188, -89, 49, -130, 60, -152, -44, 57, 136, 0, -105, -216, 73, 48, 49, 171, -146, 174, -10, 56, -17, 19, 126, 53, -106, 124, -194, 115, -47, -156, 62, 4, 18, 171, -30, 150, 59, -98, 231, 154, 93, 13, 76, -161, 11, -52, 127, 27, -108, 28, -5, -121, 185, -133, -81, -79, -79, -78, 45, -242, -145, -19, -195, -116, -78, -153, -143, -82, -130, -73, -130, -139, 75, -146, -17, -145, -29, -226, -102, -109, -149, -122, -46, 312, -29, 39, -152, -9, -204, 10, 252, 179, 131, -65, -44, 102, -93, -69, 42, 76, -71, 111, -133, -89, -120, 133, 79, -99, 269, 37, 377, 260, -230, -44, 27, 186, 268, 254, -98, 29, 84, -29, 50, 79, 26, -172, -2, 189, -81, -70, -8, -61, 260, 174, 203, 156, -91, 55, -256, 116, 33, 166, 65, 101, 9, -171, 31, 303, -236, -149, -168, 22, -162, -262, 204, 44, -194]
3486a94J08L40m57J25j8J62l50l8L23J00J38k7k77j92L50j03L9n7M4Q0O1p2n03
3509d18M67J11j53m0k72J85K83n7k49K63r8j27j08R1K83l19J45p7J26K42l21P2
3531B9r6J70o9J6l6k12J86R1N2j25j07K1J43k6p8k14j5K62p7J87j07O9k5j64K89
3556A64j36J17j63K4L6R3l62M01p3p3k52L4K12nj55P1P3j05L52k36J93j08N9k95
3580a34L06k62J96l0K5O5l46K06k3J87j3J06l31j3N0J89k36K46j46q7O4j86M6
3603a21J81j27J63mj39j23j13L48o8O4j52J08J43J40j99k3k5J8k15m2pK50l43
3626b86L80l6k5Q8l46P7L79j58j51O0J88k2j96K1q9k6J59n6j6J7J8k2j02J06J34
3651I6N0r2p7k40K62qJ37p6l9N4p8j30K69l44J27L30j56P5k17K0J60J1J91m5l08
$$ y = [-194, -86, 254, -203, -78, -96, 66, -284, -322, 1, 101, 239, 212, -65, -257, 93, -10, 29, -28, 16, 96, 157, 85, -418, 49, 160, 7, -33, -305, -120, 163, 106, -143, 120, 22, -105, -213, -122, 161, -158, -13, -90, 36, 278, -43, 29, -67, 103, 34, 50, 14, -198, -12, 79, 131, 6, -101, -80, 63, 37, -41, -255, -270, -8, -85, 102, -5, 64, 39, -125, 164, 28, 145, -18, 6, 42, 135, -227, 174, 101, 28, -224, -190, 22, 17, -138, -67, 6, -99, 253, 17, 210, 102, 161, -134, 172, -90, 106, 76, 101, 166, -180, 26, 3, 190, 177, 283, -48, -61, -11, 178, -58, 188, 42, -45, 19, -167, -121, 60, -67, 96, 92, -47, -170, -283, 65, -3, 61, -91, 17, 160, 300, 101, 78, 53, 71, -144, -186, -193, 57, -286, 94, 58, 33, 121, -225, -148, 231, 73, -78, -18, 170, 148, -48, -27, -116, -142, 17, -39, -55, -38, -20, -42, -144, -38, 96, 146, 54, -23, -263, -1, -9, 128, 52, 13, 67, -11, -141, 128, -216, -89, 241, 85, 160, -57, -37, 123, 134, 325, 280, -28]
3676b8L3K3jm3n0J10J21j9p4Q0l38K57j63J8J3j0J6J1j05J71J86j14k71N6L98
3701B77m43J90M4R8l39p7K05j7J82j29J7K89j63o5k1k37J23R3p0J24j36J94kJ09
3725B46k74L01l71K14l14K19K6Q7J2k00L50m62J61J37j53J33k25N5l0K14J4r2
3747D8M4l1K19m08K50j85K15l40J35J87L1k56k15J92J84l06M15k31k59L29j77
3768a59K72k57J43p9Q4k95L64n5j67M3J86j15lKK12j10m7K1q5o3K1L0NJ86K5k60
3794a01K30N1k0j02j01L90m05K24j11o8O0j49m2K8K37R9j35n4L3j03K64m45J84
3817c6O9O3R3k6j21j01j0o5O7m4K75k43N7J66j87R7K75l16J30m61N63m57M6J90
3841B4J74K1o4n2k78k5K27j08J77j78oJ82j22M4o6j10J48Oj38jJ13K27k04j9J49
$$ y = [-28, 5, 28, 27, -16, -66, 44, 165, 146, 72, 152, -186, 71, -92, -74, -61, -71, -55, -44, -149, 22, 208, 94, -177, -121, 277, -166, 24, 68, 166, -173, -250, -45, -62, 120, -9, 8, 297, 134, 69, 48, -189, -66, 27, -43, 81, -55, 139, 137, 246, -28, 273, -98, 116, -198, 21, 47, 134, 146, -54, 296, -166, -5, 132, -21, 112, -113, -58, -88, 126, 140, 48, 92, 61, 280, -128, 122, -63, 152, -188, -53, 134, 165, -91, -306, -114, 70, -236, 179, -52, -311, 18, -159, 113, -144, -1, -80, 4, -291, 73, 18, -149, -106, 80, -35, -38, -36, 176, 66, 19, 40, -45, -108, -87, -57, -52, 134, 159, -101, 129, 180, 160, 58, -43, 347, -58, 166, 55, -13, 47, -102, -144, -116, 121, 220, 85, 31, 64, -39, 225, -220, -36, 33, 96, 189, 163, 42, -59, -69, -134, -67, -111, 164, -79, -22, 144, -43, 54, 329, 13, 143, -318, 245, -212, -166, 24, 198, 219, 155, 103, -175, -200, 27, -81, 96, -82, -88, 94, -28, 16, -50, -160, -12, -6, -144, -145, -32, 195, -9, -28, 121]
3866A21k41J85J59k10r2j63M02j36k35R9K59q0j45L60k48j05J09j8Q2k82J81N8
3888F0rr2Oj23N2Q1r6L12K8j78j5n3Q7r5prJ20r0K2Q4k80L40j52L13k90J95j72
3915C9l9K17l17pK61N8k11J49l38L76p7m52M26j00L8L6l7K11k69J22k13J78n9
3938hj2J63k70Pj05K11j0j20L90j30o7p6L34j87j4l57K63J89j50Lk5j5l2M5j43
3963a16P9K55j2K6k58K07j30r9P8j60M24j29k64J35j12j06o8L20j52LJ93m05J74
3986a17J12j13Q5nN7j52j1%O8J66j8j76J09r4j14J25J46l37K31K43r9oj07P6j81
4011a12j8L75r7j19R0j70N0m0qj80K83K9n1n5j06J25R5k07K07m9j5r4K72j13O2
4036A54l25K80r2J42l45J61j2J08K48l29J13k7j04J70r6j64J05j40K67R3k25k03
$$ y = [121, -120, 65, 224, 14, -78, -241, 161, 25, -210, -111, 148, 68, -77, 283, 35, -70, 39, 21, 103, -179, 2, 60, 51, -41, -35, -158, -106, -25, -121, 191, 219, 41, 26, -27, 60, -35, -42, -51, 69, -21, 1, 85, -195, 145, -7, 306, 16, 211, 39, 0, 217, -100, -107, 154, 212, 1, 150, -188, 188, 111, -341, 85, -15, 23, 59, 22, 233, -36, 86, -127, 51, -8, -20, 143, -127, -120, -225, -14, -24, -144, 246, 116, 49, -27, 307, 120, 106, -251, 12, 201, 51, 54, 29, 14, -18, 27, -116, -37, 218, 206, 232, -26, 181, 51, -48, 30, -130, 294, 165, -99, 36, -76, -182, -250, 70, -82, -79, 114, -291, -117, -5, -118, -33, -38, 19, -133, -144, -144, -76, 90, 72, -104, 5, -89, -203, -78, 68, -269, -38, 205, 106, 100, -7, 69, -112, -130, 245, 148, 29, 119, -51, -1, -41, -49, -229, 54, 83, 32, -23, -129, -4, 91, -116, 91, 42, 27, -67, 205, 92, 154, -171, 109, 17, 159, -186, -25, -37, 71, 319, -10, 103, 76, -28, 142, 46, -118, -13, -153, 114, 207, -18, -221]
4058b21K87J00k41k4O6J17j36p1K95j61R7j44j09J54L1J8L9j53K50j61p4M7J09
4081A15o9R3m8p3j07K27m77K17P7k2j12M37l14j36J91l49L89P2j93J04J69m6j86
4104d1MQj68K18L8j50J01r1J40l5j33J76p5MM9o9m0K04k58n9J26J36j93J1K2L0
4130d5J31j29j52J86J21j02k60L73q1R8k45J41K12nk67j39J13K46l01j9J47J3
4152C6k7k41L75k06J21j61N8l4OJ42k24L16k29P2O2J06j07r7j14J61J21M7k41
4175e8J62l82K12o2J53j21K16j63J67j24j16Q9J2K22k25K75m72L36l34N28k57
4196E8J0j81N9j13L41p5j05q2J65j43R9J71l21j79K89L9J9R5K9l03J05K10k09
4219b2k9K40l68J34QK87k28j07j50K25P9k22J31J2mJ08jj49j19K82j89o1K74l9
$$ y = [-221, 66, 166, -75, -99, -33, 84, -52, -123, 172, 11, 108, -36, -145, 9, 40, 58, 97, -56, 194, 33, -41, 6, 115, 46, 139, 91, 18, -89, 138, -339, -122, -45, -67, -179, 258, -56, -192, -1, -350, 39, 111, -82, 22, 191, 145, -41, -37, -29, -197, 21, 59, -91, 10, -81, 59, 24, -109, 67, -8, -4, 45, -24, -64, 140, -118, -177, -51, 85, -108, -97, -75, -45, 86, -43, -195, -9, 112, 10, -250, 123, 42, 140, -105, 36, 248, 243, -24, -163, -50, 196, -105, -124, 23, 36, 9, -232, 143, -63, 58, -103, -45, -79, -73, 69, -155, 161, -68, 4, 66, 172, 65, -32, -146, 15, 136, 183, -58, 104, -278, -66, -128, 25, -96, 120, -43, 124, 0, -116, -27, -15, 207, -18, 257, -215, 121, -213, 315, 58, 68, -113, -54, -167, 174, 99, -6, -88, 77, -66, 33, 204, -117, -296, -7, 32, 51, 146, 175, -128, -23, 187, -22, -51, 189, -179, -45, -37, 250, 22, -85, -235, -10, 69, -153, -22, -10, -14, 94, 93, -56, -175, 107, -82, -143, 131, 92]
4243I2j00r3N0J46l21K28K1l30L88K7l8K9j88j35K72r6J08j12K29k88L14l7k59
4266i3k18M78j73J39k23K56p0J05p7m1j34K7M9L1j67Q3P7L4M3l14P0j25L26j38
4290e5J13j05p2K47k22K72q4l25J01K45k00K30r0J23j18j8J79j65P8l39J53L31
4312B79k52J62j70k80K88j36j17K13J75q7Q6k99J82P1k72n5J25J86j05o3N8K9
4334A8pP7r6K6K1l6K41j79K21m13M01j89J33m51M00j44L0j43M2J31J1%J59Kk44
4359A1k32J43j06J37o3j20L05k77K81k5J9n5j14J18O6nk28R9J83J4j26l18K80
4382a3q6O1R4%p2N7Q6p2k22L15l06J76m4j91K75m0m5k15L27l9j7p4M5J1J0m9J61
4409A33k17K54r4k8j5J7K3M2N6l5L5k36L9k5O1k16L08k26J09j38o7K16J54k64
$$ y = [92, -8, -101, -51, 95, -226, 2, 23, -307, 81, 108, 70, 99, -89, -224, 48, -48, 60, -52, 177, -111, 203, 166, -93, -311, 167, -6, 133, -90, 166, 96, 201, 124, 83, -51, -24, 25, 56, -111, -28, 49, 83, 126, -188, -118, -243, 83, -55, 58, -47, -119, 128, -94, 178, 94, -231, -130, 115, -85, 145, 55, 178, 60, 42, 221, 56, 134, -205, -52, 279, 27, 189, 19, -261, 27, -109, -226, -13, 162, 75, 161, -138, 44, 115, -157, -212, -87, 99, -6, -69, -11, 18, 11, 88, -8, 18, 39, 3, 244, 65, 286, -127, 274, 85, 218, -233, 167, 23, 53, -90, -48, 83, 94, 94, 253, 255, 11, -221, -78, -184, -47, -110, -230, 75, -202, 79, 54, 73, 18, -96, 22, 88, 83, -145, -46, 137, 151, 25, -293, -13, -99, -38, 56, 56, -16, 41, 127, 55, -167, 148, -158, 18, -26, -217, 58, 18, -27, -242, 85, 46, 29, -45, 0, 11, 21, -28, 133, -84, 170, 76, 48, 33, 50, 73, 115, 171, 136, 171, -65, -26, -51, 10, -206, 102, -124, -15, -153, -220, -4, 150, -114]
4433a14J51J45k78J04o5K33j39Q1l72L62l2j44J06J4k57L3J17N0j72K43o0j66
4455a60J51j5mP1k96L73j75q4J42r7j45J02K18l37L63j99J54J05j78O8j62l3J57
4478A9j71N6J54q7J3j87Q3J70k5j85M82l70QR4Lj54K23J68l77N6J43k31M9K98
4502B32l64K37q4j1n9p3o3J39R0j59J60n7k71L80L3k13M0R1Q6l30j64L31J46m29
4526c12L70k23%P6J57o8R0k10J72k30J20K90m26J48j47K00O2j33K8o9M0K86l90
4549a69O0K4Q1j21R0p3Q5j28K51j7j84J45LPJ7j55K35l06R5K41k23K53rj59l7
4574Fo3kJ78j36k49L78k23l6K12J44j68j56r9L62q4j24J50j94L16m01L29k72j13
4597b45K40L8j5K48m55K29j19R7N4j64K08j92J81j16P7k8Q5m10L11k89L73k35
$$ y = [-114, 37, 182, -96, 8, -57, 176, 37, 118, -254, 108, 76, -68, 38, 52, -205, -172, -55, -5, -177, 66, 6, -160, -9, -24, -28, 43, -253, 120, -55, -139, 3, -94, -239, -137, 81, -256, 107, -92, 62, 167, -11, 57, -105, -138, 19, -152, -96, 58, -29, -16, -203, -120, 50, 25, -160, 322, -48, -40, 54, 57, -97, 126, 294, -83, -27, 116, -115, -66, 232, -132, 105, 21, 10, -49, -122, -185, -46, 44, -115, 45, -12, -283, 97, 130, -83, -43, 48, 134, -196, -360, -29, 117, -312, 58, -165, -165, -89, 68, 0, 90, -120, 52, -178, -58, 232, -194, -46, -193, 7, 69, -64, -36, -105, -65, 221, -169, -109, -85, -4, -125, -35, -108, -23, -151, 100, 83, -101, 44, 47, 54, 71, -84, 151, -155, -60, 181, -42, 211, 202, 43, 6, -57, -59, 119, -17, -266, 112, -111, -147, 65, 209, 41, -115, -214, 148, 64, -60, 90, -104, 212, -189, 140, -132, -245, -5, 33, 18, 266, -189, 40, -79, 18, 72, -92, 116, -76, 105, -11, 66, 38, 123, -287, 24, -265, 108, -127]
4619a27J47j13l1K25k81M88n57J34J4K49K19l51k4J30p9jJ70qm12J28Q5o3n3J01
4643a0P7p8J1q3K39j28oL19k15L9j17O9j54j4J86k14J06j18K37O0r8j42l3n3o7
4668a87K18J05k42L97l01J98k60oR8M1j65K92l80Q1K15j57R5J44Rj46j22L4K70
4691B31l04n1J21P4n3n0j7J37k94J02M32k43k47K66k26J63j45M9J65j58j34K10
4713B8p8k51M64j43k51oJ49J93j16L0J30k18N9J01j43K38j70j18mK32J9m4j06
4736eo4qJ86j59M5n5J42l21K21n4P8j05J13j60J06K34k52J51j49J99k18K47j01
4759G1k57O9K87k19Or2J10j25J62Q1r5o5J1l4R0k73K39k4j21K2L18l59L31q9m4
4784@K54k49M34n85L9J55j31L24k27J49j20r5N9N4L13m27k1J71K7P1k59J02m8
$$ y = [-127, 20, -93, -124, 101, -180, 308, -249, -115, -101, 148, 367, 16, -8, 122, 43, 42, 212, 204, -208, -80, 5, -58, -111, -10, 67, -11, 0, -83, 156, 28, 22, 341, 126, 165, 48, 117, -37, -51, 135, -79, 27, -91, 146, 206, 108, -34, -67, -120, -187, 31, 136, -106, 291, -10, 188, -72, -78, 20, 61, -104, 188, -192, -111, 104, -53, 42, 186, 195, 49, -73, -39, 231, -73, -124, -3, 71, 18, -32, -49, 88, -206, -104, 328, 85, -162, 104, -122, 41, -104, -55, 110, -48, -182, 28, -50, -301, 163, 20, -231, -237, -88, 105, -11, 19, 149, -69, -10, 91, -52, 186, 16, -102, -106, 126, 145, 101, -5, -69, -77, 109, -50, -5, -60, 82, -239, -18, -72, 6, -99, 14, -146, -40, 194, -58, 93, -56, 143, -75, 172, 71, -186, -117, 170, -49, -43, -135, -25, -150, 12, 93, -2, -67, -56, -90, 0, -273, -34, -58, -179, -157, 161, -198, 133, 44, 0, 254, 5, 439, -146, -107, 48, -83, 241, 14, 163, 43, -52, 7, 61, 374, -53, -74, 97, 124, 195, -64, 38, -10]
4807a0j48o3M44k58Nn8p9L20o6l3l9K73n72L30j53J22l4l9J76k41J63k16M25r9
4831A50J53m64J40P9j4L1q9j11K70j45J00l36J63K23K0l78J53j66J6J40oj8K93
4854B04k48K15k30J7J17j4r9J01m4J8Q6j52J51m8n1j8O3j90M2QJ84m08M25O1k23
4879c3P9k7j04P4J57j77m2m3J64O3r8j53J53pK8q4L75l37Q0M3k9k24J60k88J54
4904a16J76j5j20J36O5j15J09N7l35J98O0M2q5O0k8j79Q5j74J83j1l64L00K04
4927A33qk23K28J6l81L67k55K67j56P7j40k8K68k70n9K37l4j53j43L37QK6j98
4950h4k27K83L05l70J69j77K4r9R9K3J92k16j08O7O9PJ3%j81M96k80l32L01Lk5
4975d8l6Q7K64k69j08L46m14O5J78k37K01j32J3K01n2m4n4l62M41K4p9KOj12M6
$$ y = [-10, -158, -221, 223, -35, -30, -88, -167, 153, 87, 54, 15, 288, -284, 46, -107, 15, -19, -58, 118, -123, 40, -176, 249, 150, 303, -161, -21, 58, 44, 75, -14, -125, 145, 0, 100, -236, -73, 150, 170, -208, -55, -221, -205, -65, -71, -89, 204, -44, 171, -59, -42, 75, 61, -38, 63, 19, 37, 123, -29, 122, 74, 23, 5, 68, -122, -80, -72, 112, -296, 129, 190, -33, 46, 19, -85, -11, 146, -31, -73, -116, 48, 111, 13, -140, 13, 6, 34, -50, 325, -12, 68, 111, 82, -142, 18, -270, -116, 60, 45, -75, 61, 126, 11, 120, 177, -158, 40, 100, 142, 57, 117, 89, -90, -5, -179, 4, -7, -371, -71, 133, 125, -98, 130, 146, -235, 132, -123, 144, -12, 65, -75, -103, 165, -105, -164, 73, 39, -114, -257, 80, 88, 114, -84, -311, -28, 277, -93, 76, -101, -77, -176, -77, -54, 138, -78, -186, -119, -50, -43, -30, -30, -211, 285, 5, -327, -26, -23, -48, -84, 3, 267, -2, -110, 236, -178, -113, 65, -172, 29, -103, -90, 111, 59, 15, -39, -401, 40, 64, -15, -13, -7, -119, -73]
5000g3l07K79P0M9r3j0m5MK5J11j7J5K69p1j49k10P9J59r3P1j5N2Q0Np7J42l04
5027e4J88k23nJ09r3P5J07k06K99j93K1P1j83N1J8J08j92O5J39J38l28l2J80j43
5051h3N3N0l9K76k73L0j43J24l2K6J77j68q2L10l06j54L74l92J9L36o8k37J40
5074f2k1J08j08L71l55J7O3j19K42Q5j89j62L7J23l4Rj6J32O7l33L17Pj38K3j92
5099a28KJ19L33n02M50k71l81N50k24R2L3j95J02R8m4j70L87k90q0j9J8R6l4J01
5123D3k31J39J61j42q6Q7j17J49K5O2J20j80P6j33Q5j16j09K12k38K60j28m6k6
5146a33R7J45p2r0K94k38Pm5kJ72p7q9r0P4J5K06j72K33l90J05RN5K53k12j27
5171g2k45O4J16R7O4j02K8K2r5K11Kl88L29j16R4p6L89l40J55k74K21J57l05J07
$$ y = [-73, -380, -101, -31, 18, -75, -85, -130, -126, -101, 10, -7, 8, 277, 206, 57, -153, -74, 85, -8, 63, 48, 100, 180, 185, 108, 250, -54, 134, -89, -94, 15, -78, -3, 104, -102, 197, 4, 25, 96, -87, -36, -18, 90, -102, -37, 102, 240, -88, -120, 60, -83, -30, 20, -19, 257, -16, 14, -129, -5, -37, -11, 166, -2, -84, 226, -80, -234, 140, -252, -233, 103, 35, -202, -62, -83, 25, -83, 288, -67, -50, 13, -106, 136, 221, 32, -130, -93, 30, -4, 5, -11, 121, 188, -145, 172, 179, 41, 64, -128, -126, -7, 326, -176, 274, 3, -378, 172, -52, 40, 73, -122, -20, 78, 34, -136, 251, -39, -119, -138, -120, -24, -58, 43, -188, -49, 112, -30, -116, -29, -146, 3, 28, 90, 210, 30, 106, -27, 58, -58, -167, 45, -193, 67, -61, -107, -133, -36, 109, 37, -53, 241, 3, 10, -35, -37, 135, 58, -31, -121, -47, -32, 174, 2, 235, -155, -50, -41, 14, 267, 55, -72, -317, -253, -137, -40, 24, -78, -50, -28, -123, 88, 90, -298, 31, -85, 9, -67, 322, -18, 137, -137, 84, 241, -64, 43]
5195D3k26O7K8K3O7J78j24j24J14mr5j64M2K3J03N0k25J49j24L03j58K71l15K40
5219A42l93K59j37J79K2J98J34j93J01k09j60m31N34r4J12R3j29J33j39k56J63
5240g1j2J6J28j75K0J47Q4j80J14k75J51M8No6K39j2k06J07j12p6K50j50J23m33
5264c36L69j96L26o9j63M0j82R8J1L21k81J37J77k60J9K55k44k00P7J70l99K94
5286c6k7K61k92jR4L2n4J96k40o3P2k78J55P8L90k56l4J8J75k13L2K9j41P4J05
5311G6j59k2p1K79p4j36J99k62K6K70q1j61K23jq1J86k68Q0k37K65j28j4O0J36
5335A05rj70J55l09M48o7Rk13o9J99m1J53j63J40O4j98l25L86j60P5J65k51Q4
5358Hp2j75K94k44J79J50j2J22j08j30l7K27j97k2Pp8J94j48P2J8j08J40m3r4
$$ y = [43, -183, -116, -88, -65, 2, 180, 56, -68, 46, 42, -53, -217, -175, -152, -49, 1, -224, -75, -199, 104, -54, 217, -98, 142, -251, 8, -129, 50, 72, 270, 404, 211, 312, 103, -57, -488, 46, -48, 64, 157, 28, 161, 22, -234, -71, -83, -67, 61, -114, -94, 53, 137, -43, 71, -204, -53, -5, 0, -66, 173, 161, -45, 62, -50, -126, 124, -26, 97, -336, 33, -163, 163, 94, -69, -29, -211, -113, -102, 219, -62, 75, 252, -8, 11, 266, 22, -178, -101, 69, -330, -36, -63, 198, -94, -95, -1, 31, -23, 173, -67, -130, -58, -336, -181, -103, 287, 31, -3, 15, 190, -23, 9, 38, -103, -29, 76, -83, -105, -176, 103, 29, -107, 92, -170, -144, 126, 45, -116, 107, 106, 25, 211, -57, 23, -214, 51, -77, -91, -31, 105, 96, -74, 81, -228, 220, 153, 162, -51, -120, 79, 38, 191, 28, 168, 232, 34, -291, 95, -65, 10, 175, -76, 8, -64, -239, 55, -189, -10, 140, 128, 250, 142, 12, -25, 202, 5, -17, -10, -88, 106, -42, 30, 48, -60, 80, 37, -57]
5382e7q5J78J26k0L4k7j66j01O5J10k1J42j97K48j03k55J22q7K13j50l2O5k28
5405b26J26J21P4o8J1k04K19k6P0k39J5K30j70N9Lk3P8p0n0j08J0K09J1q3j1L4
5431hQ5j52L1q1J19J59j51N0R0j72j03O4j05J95k12J51J41j65R2l5NJ3j64J35
5455a8N7n2r0J20o3n2K03p5lJ49l2j81J13p2p0Jk6L48l56J21k59J44K17k33m4
5480a53J26m5JK09O5j48j44J29Ko5R4J4k03J72k02J23M5l0m7J21k01L18J72m33
5504h0K1K68m9K6j32j5M8J8o3n9K76l20o0m6p9J03L5n0J08Jl2j80K84k07M00j74
5530D2Q9k77RK01j71J44J11k74K21J40j33R1K5k10j24J76J17l78L82j35q1nJ74
5553A34k73K70j49k2K04jl12M7L58l31qK00J46k5l03j1o6J1J89j93J51J79p6k00
$$ y = [-57, -142, 36, 162, 142, 176, 149, -17, -118, -53, 57, 36, 178, -19, 229, 126, -129, -7, -94, 119, -31, -63, 2, -226, -100, 21, 95, 27, 38, -166, 53, 27, 97, -142, -127, 103, -67, -8, -5, -28, 50, -20, -70, -178, -168, 41, 52, -31, -42, -8, 77, -75, -44, -125, -6, 153, 2, 52, 142, -30, -133, -69, -174, 21, -191, -40, 101, -64, 28, -7, -2, 11, -153, -18, 39, -13, -103, 17, -46, -98, 105, 30, 27, 176, 144, -37, 76, 4, -66, -65, -91, 257, -99, 22, -237, -93, 124, -109, -153, -27, -72, -71, 138, 203, 55, -89, 40, 42, -23, 71, 85, -118, 54, -148, -25, 20, -10, -57, 64, -137, 181, 353, -80, -59, 209, 160, 186, 54, 39, 87, 105, 42, -17, 259, -61, -121, -167, -246, -143, -108, -158, -50, -49, -81, -261, 23, -184, 216, 42, 131, -146, -137, 64, -107, 37, 148, -126, 95, 235, 102, 193, 218, 8, -116, 60, 177, -201, 181, 46, -35, -40, 134, -139, 131, -18, -40, 164, 163, -149, -102, 256, -75, -83, 117, 263, 238, -65, -76, -142, -131, 58, -135, 16, 195, 119, -81]
5577h1j3J10K0l4J32J59l68o6q4L70j84j4J61k04J62m8J35l21K63j52K27k46O
5600g0o6j42J08Q7M5j5L40k42j34Q6J99m2o4k73L4J54J37j9L1J4M4l18J3L70k40
5625C7m5J99p6Oo4j18OK18o9m11L66J75k79R4j42l2Q2k6k7J40K9j21J3K0K14k79
5651i0Q9n4Q7p7j56J83l52M32p9L13n91L83J78l8k03J02n3k10J32m1J14l0j31
5674i2l5P8J04l21L18oj17K2o4R1O9J24j59P4k5J31N1j52M2k11j18J90K30k45
5698b1J69r4j87L61j97o3j67K65j07r7J32n4j5j36J80K16l30K1R1jQ5k64J34K07
5722A28oq5K79k86J33l27J61J4j42K42J4j64j69L66k07l29M47rk06M81m04r5J47
5745a7j88M18j66q6J71k27k20L50j03O3k4j49K67k69J43n1o8J43J17m5J47p6Q9
$$ y = [-81, -94, 16, 36, 2, 134, 293, -75, -141, -225, 145, -39, -53, 108, -96, 66, 18, 153, -168, 95, -57, 170, -76, -70, -136, -278, -170, -83, -38, -53, 287, 45, -89, -3, 196, 154, 90, -183, -149, 5, 142, 123, 154, 168, 212, -106, -93, 277, 37, -8, 191, 115, 121, 57, -61, -55, 163, 94, -317, 49, 224, -55, 39, -103, -135, -53, -79, -106, 34, 63, -58, -45, -25, 189, -90, -1, -55, 32, -45, -201, -18, -370, 62, -17, 296, -295, 88, 266, 228, 25, 127, 74, -136, -4, -45, 69, 39, -92, -127, -49, 55, -266, 52, 46, -71, -49, -113, -22, 47, 171, 12, 86, 61, 192, 243, 91, 133, -78, -196, -6, 224, -21, 148, 54, -133, 228, 31, -32, -199, 66, -41, -138, -6, -60, -75, -211, -31, 185, -145, -124, -33, -34, 51, -213, -79, 128, 122, 37, 316, 30, 163, -164, -3, 11, -131, 111, 125, -39, -208, 158, -49, -378, 69, 60, -146, 335, -69, -164, -17, -205, 213, 47, -39, 132, -95, -315, 35, -68, -5, -29, -178, 89, -180, -37, -88, -156, -13, 104, 59, 206, 130, 219]
5768B19k71J25k69J98lKm1jL01k86J86j73N2P7k66O1l9K33J4O1j20m8O9j15R3
5793E9K2Q7j80K70m43J94K5P1j43J11r0J18l2j41L20k76Q2P8j07J9O9j76J12k25
5817a76R4n2O4J93r7J39k99J50j56J26M5pL0m4J04j50j37K45j76J56j86J18j49
5840a65N9J66k88N78l33j69L08k50j55K75Q0j79J8J00o5J98j23j79P6Q0k03L48
5862A77j01j76J52j86J13k16K0N44l62NQ9j31J39q1J76k62J61k08O4j00O4K54
5884A35j91P7j27J34%o3J49N4p0o9k27L14l8k38N4O4n8K64l8j44J30j97K12Ol58
5909b25L39m6J29P4m87M91j61%k48J12o1J65q8n2QJ74j54P5m6j43J03J84j15j60
5933a32J87J04K8o5j97PJ75l56M03j79J43K1L0j14J3p1L4k0l50L59j41j5J28m1
$$ y = [219, -52, 73, -196, 2, -1, 1, -40, -41, 260, -26, 160, -13, 39, 116, -150, -89, -128, 105, 119, 180, 60, 12, 81, -34, 59, 81, 168, -12, 258, -185, 9, 34, 105, -38, 73, -17, 101, 69, -72, 248, -28, 54, 132, 25, 44, 113, -63, 49, -176, -82, -134, -70, 123, 26, 165, -134, 16, -140, -14, 31, 24, 54, 10, 114, -36, -173, 72, -104, 52, -134, -16, -165, -106, 60, -228, 350, 17, -152, 156, -94, -249, 26, 106, -73, -55, 45, -20, 178, 55, -124, -48, 32, -171, 177, 76, -100, 52, -134, -21, -237, -217, 327, -35, -30, 59, -72, 67, -14, 162, -100, 61, -147, -83, -183, -119, 135, -56, 21, -106, 28, 28, -35, 114, 168, 98, 29, -198, 116, 78, -160, -106, -42, -100, 164, 126, -18, 112, -85, 127, 133, -225, 114, 68, 197, 271, -216, 275, 114, 114, -134, -22, -83, 82, -6, -58, -50, 124, -30, 45, -1, -144, -41, 143, 28, -132, 55, 159, 187, 122, -75, -68, 107, -249, 154, -25, 118, 139, 169, 55, 68, -3, 31, 11, -339, 20, -121, -136, -8, -49]
5957d9L3J42l20L53P7k68K41q6k34J94k90K0L11j3j20o8pLJ37n8J76j50r9K37
5981A62l71L18k37l4j8K23j9k18J82J3l5j77J14o7K36k94J57J59LQl04J73j39
6004a65K31j72K46O9k77J12P4j66N8J61l30J81J84j99j90K95k79J81K00q4p1q1
6026b2j73K31q7J43m8J28j65j13K02l6r4L86l98L52k54p2o9M4K01k01J45k66J75
6049Ij5Kj9O3q7J56j30n7J54Q3j66Q2j52J95j06o5L2l4J41j20r3R8K11o3j69N3
6075CO9%r4m9K31j30Q7l88M34l40J25o6L58k27K56k12K4j57j92M10k18q3m2K51
6099E0r2j2r2K12j77P6nP9P0o8J42j97L0P3k07R1J05j43k3K44n5M8j10q0r2J54
6125B1J60k14n8J89j4j0j89r9J76J79l82K81J10k85K86j95Q0O5o8J01p8l4OJ26
$$ y = [-49, -16, 126, -194, 159, 236, -32, 209, 123, -111, 83, -207, -187, 124, 111, -9, -77, -84, -81, 56, -2, 174, 24, -75, 162, -209, 109, -128, -162, -180, 43, 24, -194, -12, 1, -34, -211, -97, -164, 72, -222, -65, 94, 97, 105, -199, -26, -165, 66, -106, 140, 209, -68, 44, 118, -48, 10, 171, -159, 22, 206, 7, -183, 112, -167, 14, 214, 130, 59, -22, -195, 36, -51, 92, 44, 172, 7, -106, 96, 60, -34, 352, -46, 306, 52, -20, -89, -45, 156, -45, 100, -166, 9, -6, -4, -23, 40, -47, 109, -21, -78, 76, 159, -7, 75, -77, 118, 12, -53, -21, -55, 86, -34, -127, -29, 182, 119, -50, 3, 72, 72, -22, -71, 160, 30, 117, -271, 163, -177, -52, -118, 240, 13, 269, 57, 81, -76, -268, 142, -76, -159, -201, 50, -42, -54, -146, 66, -111, -35, -40, 39, 109, 41, 183, -14, 16, 89, -118, -27, 78, -65, -88, 156, 101, 149, 39, -41, -133, 21, 181, -33, -91, 98, 84, 74, -115, -214, -38, 141, -241, 40, 150, -135, 151, -44, 36, 101, 33, 134, 56, 22, 28, 154]
6149A54j31r2P7j94j08L31n9J76k82O2RJ06j01J28k7L8Q5l60L58k46K54Q2j82
6172G8j20L9J26j24j94O1K92j11j24m2M3N5J4K16J0k51L0J50m1L3L0q6k50K34
6196F8J17l1k66J22J76l01K36q5l3m8O1j36Q9Q0j0J30k75LP4J99j3K22l64K5K9
6221F9nj47N1J12O9j72n2J74j14rl7j51J40K26l31K09q8j25L53j37R1n9r2k0K27
6246A82j72m5N5O0K3K14j99r8j05M59l50Q0k45J38l6K24j82k19J38R0J19k73N0
6269i2M7kqP7J69k3j1m45J69K06j1K2l36J92j51K00j22j6J48Q8Q3j43R0j46m4
6294e9Q6J07j29K9p7K24q7J12k48j86M27l80m0L17J57j85J3Oj99k0P6K98l23J63
6318H2O5o1m1j18O9j3J4or9J38J40M3r9N0l46O4KJ17N6m32N45j18J15L47n24J15
$$ y = [154, 23, -69, 8, -186, -294, 37, -22, 154, -128, -66, -57, 49, -52, 76, 49, 87, 172, -188, 170, -76, 178, 260, 78, -42, -3, 123, -1, -195, -134, 158, 47, -77, -119, -76, -21, -7, 209, 219, -32, -2, 148, 107, 140, 170, 84, -166, 68, 185, 154, -112, 10, 186, -115, 121, 36, 3, -45, 16, -120, -31, 49, 39, 169, -106, -103, -29, 170, 157, 379, 15, 40, 69, 64, -83, -32, 80, 149, -23, -75, 99, -15, -24, -61, -212, -72, 154, -177, 32, -56, -181, 172, 35, 126, 67, -25, -45, 182, 10, -35, 20, 80, 103, 317, 118, 20, -85, 374, 24, 104, -141, -3, -39, 185, 3, -216, -78, 12, 131, -142, -92, -45, -47, -55, 22, 191, 168, 157, -288, -119, 87, 76, 98, -238, -46, -197, 3, -119, -135, 13, 101, 184, 41, 131, -15, -59, 27, 134, 5, 34, -43, 181, 94, 206, -42, -228, 199, -181, -221, 96, 253, 68, 81, 87, -112, -132, -56, 242, -81, 82, 147, 86, 45, -73, -4, -17, -3, -9, -108, 30, 170, 213, 114, 164, -182, -118, -116, 1, 57, -375, 170, 52, 167, 514, -10, 105]
6344A05j43m5J71L8K17l92J7k9L3N8O2m0J04Oj24k73L01K25m61P9l7m3J73j86
6368a84K35m4j48r2P0J54j34R6J2N0j18M23m27J14q9l5l8K19k21J12P0l5L5l7
6392a2J18nr1o9j4K86j80k53J76K7J21p3l9J50k77J07J38j86J85j24p0K35k18
6415f8R5r1r3P9J45m5K5P6j41Q1l14M16j42k4j29L08j73q6K1K99j58P3q2n0K13
6440B35K6m55K74n8r1J25O9M0q4o0P6j57J14r5o5K22j52Q4l6J16j22P6j43J19
6464E8nO6o2j00p3K36j3j73lP1K40j73L33l51Jj78K92j53l5K31k52J89k47l2O7
6489f6J46J01j13J46j72j89J93j14K18j66j10K02M0J1k62K66L04m74p9J87J19
6510A88j45M2r2l6J66j26j34R6J57j92K19k49J3Q5r5J92k57L44m5j76l6J06q8
$$ y = [105, -38, -83, 88, 126, 343, -49, -32, -61, -28, 30, 92, 52, 156, 162, 38, -235, 66, 291, -170, -91, -128, -171, 2, -184, 51, 7, -141, -233, -163, -9, -143, -47, -35, 15, -103, 320, -107, 7, -82, -117, -155, 64, -157, -45, 25, -10, 25, -12, 106, 101, 10, -59, -73, 213, 33, -220, -44, -17, 104, 31, -8, 142, -135, -28, 110, -76, 109, -15, -85, 150, -68, 27, -64, -157, -78, 67, 22, 47, 123, -18, 63, -251, 165, 23, -1, -130, 178, 5, -81, -60, 239, 81, 154, 72, 22, 235, 261, -194, 80, 22, -69, 56, 125, 165, 81, 21, 97, -60, 54, -41, -106, 116, -36, 48, 12, 128, 6, 82, -61, 58, 53, 119, 57, -43, -116, 120, 107, -66, -69, 2, 242, 69, 402, 51, 52, -126, 166, 13, -22, 209, -43, 146, -101, -133, -66, 80, 181, 68, 214, 42, -147, 46, -68, 150, -16, -126, 76, 116, 127, -135, 131, 435, -39, -118, 69, 188, 43, 85, -7, -43, 123, -3, -137, -41, 116, -76, 143, -106, -93, -8, -103, 89, -168, 176, 131, -45, -81, 25, -63]
6533f3J13r8q6K36p5O5L8j36J41P8J2l9j99K5j21K90m21J71k43L39k8j4l7J25
6557G3k7P5k80N2J38Q5k20j02J31Q1R9r4q7Q3k3l4J87k54J46j05K02o1n7j68M9
6582a11rK18j95M7J3o2o7%J9K4M2Q5L1k16L30l85K50J12r3J28k44J19q5j11J19
6607d1J77m4k18J60j25L3M1k9j5J62j62J3M8J06k02J46M3j15Q7R1k93L26j31j73
6631a15K39Rj28k5L43k31L2p9J6k34M02m29L31l4l55R5rK02j76j42L63L2j09J0
6655HK25p3k65J50o3m0J97k2k15J10K3n7J39O4r5J0j9k44P4Q1J18o5j84Q6L16
6680B59k92J47m8L1j71J46PL0j59M2o4n1n3J77R6j24J96k48K21j17P6Rn3J59k23
6705gJ09J01j74J29j05o2l0L45m53J40k2p2Q2j42L51k76J23j82j34M98k19oL6
$$ y = [-63, 50, -48, -134, 102, 27, 92, 130, -6, 135, 213, 225, 186, -13, 12, -109, 181, -240, -69, -312, 27, -1, -15, -52, 73, 46, 121, -159, -107, 31, 116, -104, -206, -75, 6, 105, 11, -76, 7, -16, -50, 137, -117, 29, -76, 126, 65, 8, -160, -111, -120, 98, -97, -50, -37, -99, -166, -166, -147, -123, -81, 4, 35, -181, 149, -236, 14, 126, 33, 161, -83, 36, -49, -160, -41, 136, 92, -126, 34, -91, -58, -17, -46, -61, 101, -61, -48, 0, 106, -96, 50, 93, -22, 65, 156, -137, 189, 58, -115, 124, 133, 5, -20, 323, 92, 124, 45, 61, -173, 229, -200, 131, 97, -258, -163, -172, 30, -146, -288, 75, 107, -2, 8, 233, 160, -105, 45, -18, -58, 139, 117, -98, 12, 35, -22, 117, 181, 86, 96, 77, -167, -93, -12, 106, 41, -143, -57, 259, -33, 114, 66, 97, -74, 72, 79, 109, -50, -8, -72, -123, -176, 1, 97, -27, 169, -79, 142, 25, 101, 110, 57, 216, -7, 102, 203, 29, 158, 53, -9, -39, 306, -147, -7, -29, -101, -19, -161, 190, -86, 37, -145, -279, 219, 0, -6, 30]
6728C0J3j47j86O2M37j43j74K71k7l37J43O5J52j01j51qR4R1q8l1J40m7l97L41
6752Bo4R0j40%r9J2M12r1n0k38J89K20p2k12R9q3J5mj59K18k57J44P7J3p8k1R6
6779A9J29j2m48L23N2j83K53k4k28p8N10j92O7n9j96k4J55Mj6j47r9K83k78O4
6803a25m8J59K6j6R8j75J9O7j60J75j26J11K32j81k7k71J36k1K34L2Q1r8j88O1
6827ej61K54k61J52j39L93l06K13R1r2n4j21K20j10K49k41j0M2j97N3k37M06p4
6850F5r2MP8q8OK02j97J2P1J97j58K62m13n7J23o2O6k67N4N7K46L0K1oM2m57J27
6877a34r1L17P6j13j12K02l02J28M3Q5Nj8J18l59J35k39J54R0P1J42m44N68l18
6900Dl6r2O40l56j56O5k6r6P2k09L44pr6L7k32J49j59R3J25q8q7K5o0L28k38p9
$$ y = [30, 43, -104, -290, -228, 209, 66, -108, 163, 136, -201, -58, 7, 159, 58, -93, -101, -7, 84, -4, -35, 105, 58, -339, 2, -62, 28, -112, -112, -211, -199, 213, 122, 72, -166, 23, 243, 171, -41, 58, -25, -10, -14, -173, 45, -212, -68, 9, 22, -56, -77, 19, 148, 136, -312, 11, 63, -120, 133, 109, -119, -197, 313, 121, 188, 129, -67, -91, 64, 68, 52, -95, -194, 89, -189, -125, -173, -14, 12, -4, 94, -81, -62, 5, -155, 20, -106, 5, 237, 56, 29, -242, -106, -127, 107, 139, 220, 122, -66, -5, -166, 88, -173, -21, -160, 233, -73, 140, 231, 139, 85, -36, 184, 74, 323, 82, 72, 114, -83, -30, -267, 139, 65, -27, -23, 55, -33, -27, 175, -22, -10, 61, 258, 100, 362, -51, -108, 15, -47, 19, -248, -194, -137, 109, 139, 160, 154, 196, -261, -134, -225, 92, 168, 55, -57, 145, -157, -29, 14, 99, 104, 86, 204, -155, -20, -259, -105, -15, 56, 198, -246, 322, 4, -32, -124, 516, 160, 4, 69, 43, -53, 19, -190, 154, 147, 51, 88, -144, 5, -154, -61, 64, -24, -111, -86, -146, 182, -56, -135]
6926a35K20J8N0n3j40R0l05J96P6Q8j81k1K07J19k19m1J64n1j10O7J06j49K42
6949B38j39L2J32l91K35j3j18KJ44LOO0k1n8j17J28l2R4l19qJ67k19K73k77J89
6974in1K34k06j12m9P9j34M41j92j06j24J36K87k18j7j62P6P1J52j52k2K40m05
6997b43R4K21o6M0k7j16J24j56O0J24N9k33j6K99l26K93k13R1N0j93L17J4j55
7020D2J73j01j78K4J03K40j39j95kj42K13L24l39j25j1NM2l7R9q8j04K58MJ12
7044A78l27K76j82j26O9p4K59j87L46l70L35j24k66K05%j35J37k90J82o3L17k71
7066a11M3K60m41R1J75j14J3n5J75J73l28M8lJ85l55J25R5j57K84j74K3nQ2k1
7090HK4Qo6j19K0K72j7Q7k88O3P7j07j43K91p5q3J79l7r4J7k9R1k0R9j78JNq5
$$ y = [-135, 85, 103, 153, 100, -40, 50, -255, -59, 17, 105, -76, -97, 110, 229, 10, -31, 133, 82, -28, 39, 145, -4, 238, 99, 131, 263, -128, 107, 94, -24, -22, 122, 125, 131, 191, 170, 112, -5, 123, 91, 185, -134, -142, 25, -194, 79, -198, -9, -60, 174, -32, -144, -193, -114, -248, 193, 1, -105, -229, -93, 194, -24, -41, -203, -127, -56, 96, -56, -78, 162, -243, -149, 72, 6, 46, 19, -97, 27, -129, -69, 55, 114, -119, -135, 164, -162, 131, -82, 9, 59, -134, 183, 197, 42, 215, 114, -64, -40, 63, 303, 164, -31, -33, -175, 38, 362, 23, -102, -113, -108, -66, -103, -4, -92, -196, 62, 66, 178, -149, 127, -55, -181, -112, -186, 73, -114, 232, -138, 197, 73, -193, 12, 12, -123, 14, -276, -94, -157, 160, -111, -68, 192, -249, -158, 17, -97, -84, -139, 36, 209, -119, -71, -74, 111, -244, -119, -24, -181, 103, -71, -48, -53, 29, 8, 32, 40, -26, -145, -125, 147, 130, 217, -71, -8, 69, -38, -181, 110, 35, -48, 131, 94, 0, 17, -12, 79, 59, 158, -20, -19, -14, -99]
7118i9n1K56K3kl2j59O6NQ0N2mj12R8j36Q9k13J42Q2j5l9K5J24q4pM4oo2K6o4
7147B7J67l97K07j01Q6K15j21k25j1J81J61j62KK60k74q4J70j66j79L38k25K03
7169G2p1Q8k58R7K39j93j07L52j28j19LL5p3k18J89J09j46L36j12q3k2m1j84N82
7193C47l90J63k9n2j06j18J57qJ0j30Q2J14n3J11k97K36K86l04j25Rn1Q9n6K7
7217h8J30O3k11P8J83j34N5j55O9j3J85o9j77J35K51l95m8J35J39j39O1k6j36
7240a07p6J32J09q0J27k65N4J02p7J27J9n2j47J79P6r4j22J97k67J06J28N5j5
7263A09K1j98J28J73k62k12L04k32J33P8Q5l15L58k16J21J89j81l1J21k74K17
7284A16j15n8R9r2j8L97l77L04j78L3j01o0L4j43K32k75K37K24k56N8J84l84K07
$$ y = [-99, -150, 106, 129, 127, 95, -64, 2, 7, 87, 139, 135, 23, 121, -15, 74, -139, 3, 85, 70, 31, 56, 180, 96, 89, 133, 127, 65, 91, 27, 194, -203, 4, -97, -11, 204, 83, -142, -153, 28, 189, 27, 29, 289, 15, -69, 101, -65, -244, 94, -131, 72, 1, 89, -169, -72, 167, -26, -133, 219, 91, -28, -25, 10, -63, -281, -92, 17, -129, 207, 95, 12, -10, -51, -235, 347, -43, 120, 91, 39, -67, -185, -28, -36, -26, -156, -74, 40, -13, 98, -199, 37, 323, 19, -106, -97, -148, -59, -115, -88, 42, 105, -106, -28, 155, 21, 76, -79, -10, -23, 162, 93, -84, 51, 302, -93, -141, -6, 133, -6, 55, 29, -107, -183, -51, 58, -22, 105, -160, -106, -4, -81, 46, 65, 13, -134, 45, 121, 27, -95, 102, -165, -59, 69, 124, 109, 130, -68, 60, 233, -29, -241, 63, -169, -36, 42, 127, -188, 170, -46, 75, 264, 83, 52, 173, -101, 116, 1, -57, 42, -50, -68, 329, -48, 256, 78, 111, 10, -50, -16, -159, 73, -202, 35, 259, 3, 61, 245, -139, 68]
7307F8J6k22L47k46N0J37k15J16j91M25l88J73L8k21J09k4R1L5j0j53k4MJ41k27
7331a71K38n1O1j04j4k43N8J46K11j57L3QK0p9K0Rj06J45K49m42lJ40J9J80l06
7356a39K44M8j68l07L36k19m3L44l5k04K03J73m08K45nr6o3j39J00K24Jn7k0j47
7380a32K1J92N8j96M3K35j18k17K10L08k18p8p4K3N6j55J81k63K36J77m52o1L50
7403A26Q8k90j5j6J03o0l1K77l53K50j89K77j50LJ6N9Or9K17m6q8k00J59n6O6
7428E4J9M5K08j37j87r5K14k14R7OJ9j94L24r4p0J48q4L7k13J42p7k6J33K16l85
7453a14L99m48K56j3m4m3J87p1k53P8k0j04q4J84K08J4k69OO6P8P4pM5j39j56
7478a70K62j37P2O5j38p2J81j47L6O9k89L73j53m8K35k88Q6j3J82N4q3n3j45j28
$$ y = [68, 84, -138, 209, -37, 13, 150, -65, 51, -140, 285, -103, 70, 108, -113, -4, -28, 63, 98, 88, -65, -89, -85, 56, -171, 67, 16, 77, -27, -41, -284, -226, -80, 131, -26, 7, 15, 35, -44, -24, -15, -121, 24, 273, -169, -172, -32, -13, 167, -139, 105, 153, -15, -322, 14, -205, -248, 96, 61, -143, 60, 233, -175, 70, 65, -31, -94, -233, -133, 91, 92, 35, 15, -132, -111, 81, 139, -57, -14, 221, 103, -114, 96, 404, 186, 108, 34, 57, 113, -42, 139, -124, 112, 289, -163, -224, 126, 214, -76, -91, -107, -4, -64, -95, 182, -171, 79, -110, 167, 17, 20, 36, 95, 101, 2, 219, 173, 85, -115, 44, -12, 54, 73, 118, 326, 189, 2, -93, 121, -93, 4, 10, 29, -165, 159, 65, -5, 143, 59, 96, -117, 25, -52, -78, 55, 271, -114, 285, -163, 93, 80, 36, -7, 180, 109, -144, -66, -86, -190, -274, -90, 118, 132, -137, -131, -65, 13, 87, 80, 125, -14, -170, 92, -45, 27, 92, -46, -118, 63, -84, -48, 21, -268, 105, -48, -96, 139, -149, -63, -76, 106, 160, 77, 24, -121, -249]
7502b49qL47j81J47N2j93Q0J10m22L78K0r1K82m38K11q2j8k41N18l80R0J25k1
7525C6J06k9K09l95K0l15M29k11J72J00n7k31j44L52n8%M9l0R7J35k82ll8J12
7549B4j75R4JL5n6r1M44j78q4J58k78l1jJ00K61k60j46o3J87J67Qj0k45K85k09
7574f3K2k9N3J18Q6k29J60M2m82L22L0O2O0N0j91J2k25R4N2J49J50j84n4M4j35
7599h6L8N0K0j22K4K51k91K25n7p4j61J53J72O7l64N3O4J46k12K00k60J78j49
7622a35J71J40N4l78M1p3J93n9k3k1K24N5l09K6K28l33L40k03K07k01M6O5M3L8
7646A36k54K63k07k1k3J22K2k36J54J05n1pQ5k4o6j42J94K64m90J51j09L54N7
7669B77o7m89M5L17p8J54k24l5J32k36L46M4k63L8J28N9m47M87k96M0rj48L18
$$ y = [-249, -257, 90, -91, 56, 108, -85, -5, 105, -317, 61, 81, -10, 272, -166, 45, -37, -55, -296, 222, -158, -68, 57, 36, 142, 113, 322, -73, -53, -368, 61, -150, 22, 122, 65, -166, -310, 42, -16, -16, 33, 3, 100, 235, -47, -50, -88, 24, -151, -57, -56, -21, -77, -168, 276, 98, 14, 172, -106, -137, -138, -38, 223, -37, -183, -246, -59, 108, 116, 106, -139, 146, -63, -41, -70, -17, 101, 187, -42, 118, 160, -322, 0, 30, 92, 152, 202, 11, 23, -202, -108, -56, 93, 243, 59, 5, 49, -86, -48, 2, 22, -100, -76, 175, -116, 109, 52, -22, -183, -30, 142, 209, -155, -102, -38, 108, -104, 96, -164, 14, -135, 36, 176, 230, -148, -107, -180, 13, -46, -69, -90, 134, 189, -120, -94, 134, -199, 141, -62, 145, -56, -10, 55, 98, 136, -118, 145, -62, -83, -106, 16, 38, -198, -44, 61, 10, 3, 88, 64, -2, -144, 50, 314, -176, -25, -134, 220, 277, 210, -279, -234, 83, 5, 159, -65, -100, 32, -204, 142, 186, -77, -39, 89, 148, -299, 188, -108, -68, -77, -225, 93]
7692I3j48lK6J43j38k1K62q4j65o6K8J64l68L17p0J80k08J04N4O3k61R5J33o6
7716F4j6P4k12J69j32O0L3l8j4R8j14J38j03J43o2j36k0R3j44J63j6k66J37J45
7740D4r9j16J61j7K21q9j74J99j22J11l36J64J7J32k5k25J85k29J75K05l68J77
7762iQ3k31J0J34j09L6Q5o7J82k1p0j90K81r9L5q2n3J19O2K01k27k0j36J64q9
7787a1o7q1K35j80K08k06J31M7o5P9r3M0k2m4j36J24k72L57j08j3J72l9p9K16
7811A93m2l9j53K24r6n9J26k90K2M1J66j52n3K05op7l4N4M2l16J83L35l96K26
7835A04o2Mo4m0O9K9j48J3N4K37p5r3Q5J17j73j34K44j69LJ24j18k26M12Q5j78
7860A00L6k6j1j50m1O8l4L9K3R2q4l2L19l85R3P4r6l47K6L15pp3O2q9K81j28J34
$$ y = [93, -55, -58, -32, 111, -27, -48, 214, 130, -35, -101, -73, 91, -277, 40, -30, 150, -58, 46, 100, 163, -98, -3, 130, 64, 48, 122, -90, 79, -53, 7, 40, 2, -12, 86, -28, 110, 7, 150, 88, -48, -68, 25, -119, 44, 28, -238, -101, 44, -55, -171, -10, -27, 194, 105, -69, 130, 8, 119, -217, -53, -36, 96, 71, -154, 31, -198, -23, 182, -186, -9, 74, -157, -147, -13, -122, -86, -1, -68, 114, 93, 23, -167, 114, 15, 50, -32, -85, 34, 96, 297, 70, 50, -86, 78, -11, -78, -159, 76, -104, 104, -102, 29, 76, 11, 90, -3, 37, 15, -29, -165, -41, -313, 44, -64, -77, 95, 56, -23, 193, 151, 112, -41, 183, 87, 28, 154, -136, -114, -73, 93, -59, -112, 93, 87, 10, -24, 30, 72, -244, -61, 274, -122, 104, 42, 46, -18, -58, 11, 40, -108, -95, -41, 196, 121, 28, 113, 230, 57, -77, 167, -2, 1, 125, 7, -219, 193, 278, 100, 136, 110, 99, -51, -92, -24, -58, -19, 4, 96, 12, -20, 299, -86, 7, 81, -15, -362, -336, -21, -28, -101, -39, -128, 153, 25, 159]
7887A59l4j12q9J03O5l09J24%Q0j26L62j27K00m73n1M31j31O4K4l13K28N2n6j07
7911c6J33L9l7j23k84K43m5J11J11k55P0K58O8j86p1l9O0M0j51M2j71L85k04J96
7935A54l80K98j71K72l21J55O4k76O7O6K55l7j02qj97Q7K47l0j30r1n3P5K6k45
7959b75M75m8M7m18j3K55l5P1l57L15o5R8J21k07J04m3j43J03j44j1J23J87k67
7982a27K38k36K37l1K05l74K05n0k26K62j53J09j52n9K2J13o8K61q2j61J37O4
8004A34n7Q9k39J4K52l40J2M10l52J69Qk96J50K04q3J52j75QK29k94k2l08L56
8027B1K01l37o0L69k57q8K26R4l28J22rO4J8p5R9m8j47J44L6J51k70K23l62L05
8051I2Jk00RL36j93j4j15n7K79k08M3J76o0J53l71J75l5R3l4K8Qj7q1l9j53jR6
$$ y = [159, 125, 13, -76, 27, 92, -217, -93, -93, -13, -139, 223, 96, 296, -177, -228, 203, 72, 136, 160, -153, 75, 127, 71, -36, 97, 136, 99, -24, -308, -65, -110, 1, 112, -143, -73, 185, 253, 67, -4, -43, 17, 57, -94, -52, -223, 162, -42, 154, -226, 72, -99, 173, -148, 7, 71, -205, -138, -72, 183, 146, 44, 36, -161, -74, 173, 143, 13, -78, -131, -56, -30, -275, 200, 152, 199, -219, -232, 23, -12, 59, -298, 17, -48, 50, 171, -36, 68, 25, -118, -15, -159, -170, -47, 140, -127, 111, -125, 112, 81, 286, -88, 117, 67, -159, 103, -50, 59, -93, -152, -130, -17, -85, 176, 94, -67, 70, 134, 77, 166, -73, -59, 193, -147, -135, 275, -77, 92, 100, -196, -46, 158, 75, 227, 52, 60, 289, -5, -27, -335, 21, 222, -115, -175, 194, -63, -151, 75, 169, -159, -37, -46, 18, 36, -39, 60, 12, -135, 9, 45, 196, -74, 149, -213, 92, 93, -107, -98, 238, 45, 31, -84, -141, 138, -70, -27, 149, 89, 242, -129, 46, 11, 104, 70, 98, 106, 89, 8, -31, -184, -185, -89]
8078h9j75J59J67j51j22L34k71J73j59J24n0J90k20K97k58M0n8L2J0j79K30j03
8100g9K0J19Q2l5j75L30j84Qj28Q9K9k06N1K68j29o8jj55K09j31J36j89P3j3J65
8125H6J28l03K37l30J69j88J45Jj38K69R8j77j44J97k71K72m3j44K29k88J17K86
8147B08k21J15nk44R6JJ77j8k12J20K13l54K02R8J62n14O7O2J83j96J92p2j19
8170e9M22l79J17mm82L02j9l2K33j43J59j16k4P4m0P1M1K9q1J17m9
$$ y = [-89, -264, -105, 62, -89, -211, 123, -148, 25, -134, -10, -60, 130, -90, 207, -51, -11, -69, -37, -27, -206, 24, -79, -59, 60, 142, 107, -68, 262, 78, 86, -42, 47, 76, -130, -79, 189, 60, -8, -9, -164, 45, -86, 50, -139, -66, -79, 86, 214, -89, 148, -182, -13, -201, -56, -55, -193, 76, 174, -3, -147, 50, -221, 51, 8, -136, 93, -195, -78, 208, -13, 102, 97, -147, -51, -50, 127, 109, -103, 17, 230, -124, 78, 176, 338, -176, -109, -47, 136, -60, 132, 60, -59, 363, -16, 101, 97, -385, -83, -102, -134, 99, -44, 115, -1, -25, 49, 9, 80, 121, 150, 69, 186, 137]
8191A37
$$ Imaginary data points
##PAGE= N=2
##DATA TABLE= (X++(I..I)), XYDATA
0@%%%%%%%%%%%%%%%%%%mJ2j6J6j6J6j8K6l2L2l9M7n2O0o8P7q8R9j11J24j38J55
40H2j73J93k14K37k64K90l18L51l89M30m73N22n74O32o97P71q56R49j058J186
60F27j336J517j738K020k394K914l692N017p933L1678j6133m683L411j5619L0420
75B4076M81p084K636j5393j6350J5702m235R703P604j6751j364n523o442J0482
89b458M061l778P77p952j1692J1357j681L731O628j2588n429n6l799N597J2137
104e145n056m101j858j4359N703Q958n0P609m33j4267k07P49m124J7598K40n527
120a4270M540j3430O3R801k122P543M907j2675K273L96n542J5382n16m174N436
135b388r108j409R482j443L955O645j1226OK765m988J1764L338m876K809n567
$$ y = [0, 0, 0, 0, 0, 0, 0, 0, 0, 0, 0, 0, 0, 0, 0, 0, 0, 0, 0, -4, 8, -8, 8, -8, 8, -10, 16, -16, 16, -23, 24, -28, 32, -36, 41, -47, 52, -59, 65, -73, 82, -91, 102, -112, 125, -139, 151, -167, 184, -205, 225, -248, 274, -300, 332, -365, 406, -450, 499, -559, 627, -709, 808, -930, 1090, -1304, 1610, -2082, 2935, -4998, 26680, 10547, 5864, 9275, -6344, 24076, 24557, 17473, 20109, 4716, -11634, 4068, -167, 9536, 17140, 389, -975, -6498, -12940, -2458, 1603, -2175, -1398, -9350, -21042, -9685, -11366, -7635, -1007, -13595, -19024, -19080, -22879, -17282, -5145, -10201, -14302, -16160, -30519, -24816, -15858, -15908, -8299, -8732, -22999, -23206, -22457, -26581, -8983, -8743, -14270, -9730, -23160, -23097, -13296, -15418, -7875, -2968, -15643, -13370, -12974, -18516, -3134, -3650, -7824, -2388, -11496, -12905, -3423, -4866, -911, 5734, -5492, -5486, -2721, -7709, 4055, 7393, 2517, 5326, -241]
150b41m665P716K020K454O041p549l208J249k210O329N212j767j443j773n826
165B339L416N146n79N273l212o469J790p16R55P223r28m041J278o723L77P351
181A2480j779L451k76q079L75P73j338P222Q56n594J670o390j972P132r21K080
197I690J640q127j311P78k597O668K170n313Q04n424l174N542N4J824J239n922
213a459l162L31j444L945L597l593o11m117l696L002K454J306Q89l106m744p4
229a0482k91K432M315j494k437k350l060P63L980J310R24p29n200n69J086N81
245a1221N179R51l171j011k426q35N362J428J134J167n354p95J363O16N384J685
261e44k395k54k781r29M856J654K055J480m441q90M94Q17M585K176q08j362k176
$$ y = [-241, -4906, 2810, 4830, 7284, 13325, 5776, 2568, 3817, 1607, 7936, 13148, 11381, 9938, 8165, 2339, 5755, 10901, 10322, 15595, 12383, 5914, 7704, 6988, 7943, 15166, 14238, 10197, 11475, 4752, 5129, 12480, 10701, 14152, 13876, 5797, 6172, 6945, 5607, 12829, 13685, 8091, 9761, 3371, 1399, 8531, 7610, 9690, 11330, 3203, 1892, 2670, 73, 6741, 8911, 3598, 4402, -1022, -4196, 1346, 1400, 3224, 4463, -1459, -4621, -4290, -5734, -1789, 1808, -1785, -2396, -6513, -10209, -7207, -4753, -3447, -2558, -5664, -10408, -10482, -10773, -8341, -4026, -5520, -7957, -10307, -13367, -12604, -8624, -7314, -6390, -7119, -12319, -12888, -11802, -11221, -6042, -5091, -8262, -9273, -11699, -12534, -7172, -5744, -4610, -3443, -8797, -9592, -8229, -7613, -2229, -544, -2939, -3193, -5974, -6903, -2047, -393, 1662, 3142, -1299, -2189, -1695, -878, 3707, 5883, 5075, 3713, 1537]
278A537j194L214K673K022R48l157j518j010J495L307K092Rk037k088j399J291
294F185K552K266K19j873k666j861J153K186K057P99k786k485j644j83K618K052
310H589K45j459l320k276P06J070K335Q31k430j932k522p54K424J491L97p18l389
327g12j795k58N55K455J238j711j885k772p71J951J483J856j297k712j524j087
343f986J184K436J105n01j391l188l72J379J610K455j012j703j576j606J423K466
359d277J208J92q80l098K62N19J571K528n00j003j549j269P27K230J694O87p32
376a690k437n89K71J966K557R6n29k069j124L47J830K420K44J56k416j184L82
393a769J579J931J123k68k426Pj250K146K686k12O65k178j399L77J404Q16K556
$$ y = [1537, 343, 3557, 6230, 8252, 9200, 6043, 4525, 3515, 5010, 8317, 10409, 10418, 8381, 6293, 4894, 6185, 8737, 11003, 11222, 9349, 6683, 4822, 5975, 8161, 10218, 11017, 8231, 5746, 4102, 3919, 6537, 8589, 8834, 7375, 4055, 1779, 2485, 3555, 5890, 6721, 4291, 2359, -163, -917, 1507, 2998, 3395, 2677, -712, -2507, -2765, -2210, 245, 1483, -228, -2113, -4885, -5656, -3705, -2222, -366, -1663, -4375, -5899, -6986, -5802, -3366, -2261, -2762, -4153, -7341, -7713, -6334, -4724, -2269, -3281, -4984, -6560, -8166, -6743, -4277, -3069, -2877, -3757, -6855, -6593, -6074, -4503, -1975, -2475, -3478, -5027, -6296, -5569, -3339, -1645, -958, -1690, -4127, -4716, -4445, -2479, 78, 174, -355, -2424, -3548, -3201, -1371, 1049, 1293, 1449, -967, -2151, -1769, -190, 1741, 2864, 2596, 170, 177, -1073, 1073, 3759, 3547, 4212, 2034, 635, 1012, 2416, 3232, 5788]
410E788n24k264J72k308K380K297l13O17j094k145j99J238O34K560o48k227J37
427D101k230J512J817K50P39j204k242q56J099K72K260n00j565p76j926O71R28
444B350J213k05p32j613j975J210l8J630M93j668j647j094l94P35K169j356J84
461g38j462k494J369k53J305J008j227j781j50j556J052K283r84M36j310k444
477f946J289M0P47K089r02j575N6j312P29K673n22P96r21j781O20N57P42J713
495a908L09j752k0q77O87K628L4O12m02j235l94R61J215J052J183j485l81n31
513c04k27K469O40K91l54n46j374J612Q05L55K080j970r69N7p08J666J631p03
531D451j73l87k293J343N86M38J978k076r60k22q50J092J841q04k58j58k664O15
$$ y = [5788, 5264, 3000, 3172, 864, 3244, 5541, 5228, 5845, 4751, 2606, 2407, 3645, 4279, 6839, 6191, 3964, 4101, 1871, 3383, 5200, 5450, 6189, 4985, 2743, 1887, 2986, 3258, 5518, 5018, 3453, 2677, 751, 1422, 2350, 3563, 3358, 2626, 1013, -962, 248, 210, 1840, 2333, 665, -982, -2076, -2470, -1735, 434, -922, -738, -2200, -4694, -3325, -3578, -2273, -1265, -2492, -4273, -4423, -5979, -4927, -2644, -3628, -3192, -4502, -6946, -5657, -5617, -4870, -2781, -3683, -5258, -5202, -6514, -5785, -3112, -3634, -2838, -3759, -5540, -4920, -4363, -3621, -1908, -1599, -3351, -3371, -4248, -3561, -933, -899, -287, -689, -1924, -2318, -1357, -142, 910, 2093, 608, 227, -304, -531, 1938, 2578, 2869, 2515, 1969, 595, 2207, 3012, 3367, 5447, 3477, 2508, 2565, 1857, 3523, 5154, 4451, 4278, 3891, 1598, 2941, 3527, 3965, 5943, 3867, 2907, 2685, 1835, 2927, 4768, 3964, 3706, 3548, 884, 1499]
549A499J068j24J692j147j512k82p42O6J876j27m02l00k575L28R51L7J385l03
567A388j561j184M8m29J680R34q78R8k212l26M71P33Q02N71j246j676M48r82J641
586a680J417p39j93j379r93O31J006J9J303p79j926N91r27J159J624p06J66r64
604b370j204J15J362lJ476n59k080P10j137J076J617J40k78o79j320K65J028J09
622a732J570L1j608j39m70P98J057N36k08k07r03o03J343O64R43K85r07n74l11
641d35K82J022J108l17j04o03q74J140O54R37N04p99j068J76j77M80J883o12o2
660C135o45j125J076M96K33M64j23j537J99j17L28J416m72j88o28j190N23M09
678B254K75N34o59j159n5o89K43J248n08j80n48j095lL17K92K47K1j245o28k05
$$ y = [1499, 2567, 2443, 4135, 2988, 1476, 1194, 452, 518, 2394, 2267, 1865, 1565, -1010, -682, 269, 306, 1691, 1388, -173, -1357, -1309, -1738, -58, 876, -2, 96, -2116, -2442, -1971, -1238, -436, 135, -1111, -2787, -2339, -3321, -1680, -263, -1002, -1195, -2574, -3567, -2936, -1930, -1911, -608, -1387, -3313, -2722, -3649, -2490, -866, -1572, -1406, -2370, -3574, -3459, -2097, -2100, -624, -1183, -3263, -2553, -3690, -2614, -997, -857, -1135, -1814, -3134, -2869, -1841, -1732, -162, -131, -1739, -1878, -2348, -1550, -493, 43, -165, -372, -1275, -1878, -535, 129, 1072, 1357, 450, -124, -435, -153, 869, 1977, 1660, 1556, 953, 79, 1219, 1873, 2810, 3314, 2515, 1447, 1623, 1446, 1926, 3809, 3197, 3135, 2490, 1365, 2441, 2937, 3170, 3634, 3511, 1974, 2173, 2056, 2384, 3800, 3328, 3140, 2512, 1322, 1845, 2254, 2529, 3063, 2404, 1245, 1190, 501, 744, 1992, 1484, 1304, 756, -339, -342, -25, 267, 514, 535, -710, -1338, -1543]
698a543J27O83J22j92o42n29o26J09P94R6K50p82r27j19P7O99N16J23p76l95n12
719c447N16L79L04P18o48p90J25lM85J039l52n4j91r39M46R30L49M69j56p93J75
740a438j09N60J130L28k44p57m23J14J227j20P13j08p29q7k17R06N90K18k46k87
760A021m13k62Q58M43L04On81l78k45M61N54O25n38l37k91o31P66N03J02m68K00
781A699r04J26L59j7P12n11k42j61m38q8P36M24j55k22r33j70L77O1J078m44l59
802I28p63l73M00M94M82j87l4r22r8k56L07O85k59K29p92n83K01K44M85o3J17
823B42r15j10m60N65O51l87K67p83k97k25L45L88j25M41r68j60l63M4Q08m2N21
844e63r93q9o89L46P13K75K6n08n07J22j1L94O06l9m41k66n47O55K82J74M15o08
$$ y = [-1543, -1416, -733, -611, -803, -1445, -1974, -2600, -2491, -1697, -1601, -1351, -2133, -3060, -3179, -3102, -2403, -1887, -1764, -2540, -2935, -3447, -2931, -2552, -2248, -1530, -2178, -2968, -2843, -2846, -2361, -1322, -1674, -1728, -1919, -2858, -2412, -1482, -1133, -664, -820, -1613, -1438, -1547, -987, 143, 471, 227, -530, -953, -839, 388, 268, 981, 873, 144, 57, -160, 746, 1336, 1554, 1308, 1021, 608, 346, 1204, 1647, 1951, 1957, 1376, 998, 753, 1214, 1768, 2393, 1855, 1518, 1227, 596, 1362, 1865, 1967, 1499, 1699, 795, 921, 1280, 1263, 1975, 1464, 1222, 1061, 623, 535, 1271, 1695, 1540, 1318, 385, 215, 592, 653, 1731, 1287, 928, 165, -208, 192, 686, 1168, 981, 947, 25, -73, -329, -22, 663, 404, 633, -159, -742, -541, -297, 188, 125, 242, -673, -783, -1243, -678, -27, -414, -147, -930, -1227, -1452, -1107, -719, -844, -403, -1371, -1531, -1894, -1850, -1042, -1084, -563, -1556, -1645, -2334, -1988, -1275, -1000, -974, -1482, -1989, -1867, -1878, -1484, -878, -917, -1358, -1624, -2171, -1516, -1234, -1060, -645, -1253]
866a253K4k15K52L96M37L24k50j00l98M00K73N33L30l50j60k62K51L01N02L98
886A433j61j79n49M91J18O06K43m64J43n69K72K73M66K9K4m26n58L02j97Q02K83
907B382o16j26j26k28L8O76k16m3m49o62N12k53M79k97K2o1r74M04l59L02L63
928G68k59j59p17j67J60K67j62K26n95k38L4k80N45P0j99j58m83j58Q3L89J67
949h66L8m09j65k34k07P69J7J50q7n87J21k64L65L60N89n38k38k73k94J180l32
970i05N92k46j18j23j16M0L74L98Qj66l03J30J64O4L91K32k61n66Q0M96JM32k65
993C33j86K3k89R8L17N17l31N6o51K53O9J26N07j11l5l89o1j23O85K8J62j23n44
1016C31K09k54M99K61k6k45l41K30m85M74N11k72L13l65j53j60L80PJ06L61p97
$$ y = [-1253, -1229, -1444, -1192, -796, -359, -35, -285, -385, -783, -383, -110, 423, 753, 403, 243, -19, 232, 533, 1035, 1433, 1272, 1093, 544, 1035, 1153, 1759, 2002, 1538, 1681, 1112, 1384, 1657, 2123, 2152, 2176, 1750, 1192, 1494, 1297, 2099, 2382, 1766, 1640, 1514, 1286, 1324, 2000, 1784, 1741, 1292, 630, 1142, 889, 1368, 1071, 1093, 1032, 58, 462, 103, 405, 768, 509, 350, -367, -534, -374, -107, -269, -43, -638, -876, -842, -1122, -577, -507, -706, -864, -1347, -1505, -1422, -1033, -866, -828, -1237, -1402, -1636, -1843, -1074, -1057, -907, -994, -1581, -1460, -1724, -1359, -999, -410, -948, -1186, -1459, -1753, -573, -905, -313, -559, -677, -800, -916, -876, -502, -104, -96, -262, -565, -435, -271, -207, 184, 416, 155, -411, -331, 165, 166, 598, 333, 147, 170, -119, -21, 296, 813, 482, 538, -113, 140, 209, 335, 842, 731, 696, 307, 246, 123, 808, 836, 998, 875, 331, 540, 286, 785, 1046, 1020, 775, 434, 664, 179, 653, 1164, 892, 1205, 840, 687, 527, 907, 914, 1020, 1381, 584]
1037E84N5j76L56J59j13J30l31p1l22L14j28N48j63n97J41l05K51J74n3K4m56
1058B1p7k71K70J80L95l93m28r8l61K58M21j82O5k35k55l31J76N3K35K2l65k28
1080a128m55L62M72j79J27k91r3m01n9L48J50M93m82r6Q8j09J77K42o7J2N2m38
1102a275J47K57L16K17m10L14j69j93J70N90J11J01l40j16J11K74L00J13L81l00
1122E99o7j27K96K39J74m39J84l66M64k86K12M20j73J62l78l56J83L76r2O5J87
1143A277m85lj2K40J9P3k52k21lq2K64j84jnr8m37J84k8O7M41n49l60K40l66K46
1168c5N2Q9k08j85K8m19N35l01M40m29l72J95o6K40j8L49k8l15k51k66K89N4M33
1191a89k09k19p3j83L38L8K81j68k1k49j48J97J10j90N92l35Q6l26K09M9j12N22
$$ y = [584, 639, 463, 819, 978, 865, 995, 664, 593, 271, 585, 457, 1005, 842, 245, 386, 81, 332, 506, 453, 477, 21, -56, -327, -57, 123, 518, 125, -303, -401, -762, -504, -83, -265, -200, -435, -690, -1021, -845, -792, -557, -535, -900, -1128, -1583, -1221, -749, -928, -801, -1092, -1185, -1586, -1645, -1297, -1147, -654, -1136, -1232, -1144, -1253, -1076, -834, -901, -889, -837, -1275, -1128, -871, -555, -338, -748, -434, -603, -796, -626, -36, 75, 176, -164, -280, -169, 105, 405, 518, 899, 599, 532, 405, 701, 940, 1114, 675, 859, 493, 957, 671, 883, 1303, 1130, 1292, 914, 558, 741, 1117, 1025, 1090, 1277, 792, 789, 777, 1017, 1036, 1109, 857, 636, 633, 551, 815, 631, 630, 625, 527, 90, 274, 246, 313, 754, 205, -155, 85, -281, -35, 17, 106, -102, -287, -259, -678, -143, -444, -4, -433, -805, -610, -676, -436, -454, -105, -133, -448, -699, -965, -676, -622, -189, -398, -617, -690, -873, -535, -497, -216, -384, -405, -654, -802, -605, -495, -685, -93, -428, -342, -668, -459, -410, -522, 0]
1213@m43n8L0O9M0K50q5M5k75O7J64P1jM2K7k20RR7o0K48j12j49P7l73L13j13
1239c40L77j2R4p3j11ql8L22J43J34j94o7j7q2L28K40l68J74j22O2J11L15l14
1262E54M05m00l8J73j38L90j4m2k19L8Q7J3j23L44k92N7k10L00l82L32j5L3j70
1285F83o2k83Q5K21k12K80j76j94o8l28L07j37R3k0k96j98NO2jJ78n17K02j99
1308e75J7j35J10L70n66O9l5K18O3l12J07j77K01k69J14Jk29L01k84K32m79M05
1330h53P2k31M02l9ok21O1j25L83K36p8M1j39j6J66J44k1L61j97k49K87j73M34
1353B39N2j80K76k31j47J94R9J72j00Kj52J58j82L54j60J90L0j52K14k08N1L67
1375H86l93oJ42k3j52O2L2j6J01j33O9m01K95n2o2k42L44k01j00L31k98J65j2
$$ y = [0, -443, -501, -471, -402, -362, -112, -197, -152, -427, -360, -196, -125, -126, -84, -57, -277, -268, -171, -231, 17, -95, -244, -167, -540, -227, -340, 37, 25, 119, 46, -65, -73, -111, 211, 354, 488, 294, 227, 210, 128, 456, 696, 328, 502, 380, 442, 553, 868, 554, 959, 559, 521, 694, 556, 946, 932, 890, 671, 709, 796, 809, 686, 1030, 738, 795, 585, 885, 503, 835, 820, 853, 683, 621, 338, 423, 644, 432, 712, 536, 342, 274, -54, 253, 116, 209, 189, -107, -305, -300, -238, -239, -61, -578, -376, -575, -558, -693, -583, -213, -779, -710, -745, -527, -464, -776, -669, -846, -645, -914, -800, -799, -1028, -727, -1011, -779, -1258, -853, -781, -1012, -610, -649, -655, -876, -815, -940, -557, -321, -399, -358, -497, -513, -347, -203, -224, 137, -60, -309, -22, -195, 239, 291, 111, 387, 156, 9, 203, 302, 474, 374, 376, 224, 382, 200, 554, 394, 584, 614, 462, 676, 468, 519, 886, 493, 487, 629, 606, 454, 516, 548, 532, 633, 500, 569, 168, 463, 411, 349, 107, 451, 250, 150, 481, 183, 348, 336]
1398C36k0l47M2Q6K73K6j07j66j85p1J87RJ52j5k20P9j12J0J12j14R7k13R7K1
1422d3J10m58J57K01J36l39p2J93j18L29j79j32R6j41K02m0R8l68K53k45J11j95
1444d44n8K91m1J16j36m08K72J0R1n4n3j0k7R0j65N9k20J16K51m39N04o0q2l2
1468d29j03Q9q1m0P5L38j54J32l49J04J25p5K54k4R9mJ78k02P8j3L68j26l42M90
1492C88l49J49J55J27J47n6O8j42K17l86K49P3m2J15l17K38J09j64J08m3l5J01
1514G10k5j71K12Q3l10L31o18M75l09m4K53l99K79r1j51J78P4l23M22n46J58j43
1536D5j98l8O2j81L11j11Rj56j58K59k66J22l4j67N2k7J33o7Jl92L20j5lo5J08
1561d56J8K19m37K58N1j85j1J01j32L16J06j34l9j64M1R1K82l57K08OJ76O3l99
$$ y = [336, 316, -31, 11, 97, 370, 396, 289, 123, -62, -133, 54, 63, 215, 200, -20, 59, -53, -43, 69, -45, 52, -161, -64, -43, 67, -391, -234, -33, 103, -236, -308, -115, -233, 96, -83, -215, -119, -260, -58, -98, 0, -368, -115, -360, -249, -444, -502, -211, -252, -136, -272, -680, -408, -398, -307, -361, -414, -424, -451, -361, -526, -467, -687, -571, -320, -759, -255, -315, -397, -429, -532, -443, -524, -564, -489, -151, -305, -173, -522, -418, -293, -368, -114, -138, -39, -43, 135, -67, 11, -2, 366, 240, -102, 388, 39, 188, 343, 470, 617, 561, 629, 487, 704, 318, 567, 640, 598, 713, 396, 634, 743, 579, 687, 644, 609, 710, 685, 514, 726, 809, 499, 830, 212, 687, 378, 334, 587, 188, 467, 376, 225, 403, 477, 154, 576, 30, 188, 45, -153, -191, -129, -310, 1, -110, -101, -257, -415, -156, -422, -300, -334, -501, -449, -476, -343, -410, -409, -801, -481, -496, -499, -564, -456, -438, -219, -656, -398, -347, -532, -543, -442, -574, -258, -152, -286, -325, -489, -448, -357, -75, -432, -224, -218, -42, 21, -378]
1584c78L76k74K06J4n2J58j3R6r6K1O2J6L43n84O6K66j45M9J46qj03K24m8k54
1608H8M8M0O8m7J21lJ57m38K89oK1Q8l12mK19Oo5K4NN2j12q2j36N3J63J55j83
1635B09Mk09K98j12l6nk36J98kK76m7k67J92j91J07M6k7J05l07J31J44n9j72J89
1659B29l11J66k5P7j4k87K72J36n61L64o2j54J56l5n7j0r7k31R1O4J57j48n4J01
1683b33k77K10j80j51L10L52l41m5j76J36j67J16L9K59l54J40j74r2K43k7Q3j91
1705e20J96N1M2q4N1J0P2NJ9j98K56j1R0n2K07k47L06O0j60j79J7K86k50K11j69
1730IK17J18Rj6K23L7l32J36r7M3R1R9j12N25l98P9l8j76P8L7l44J72J94q4k46
1755B24J13k5k6J82j01j36j31mK94l81L02l30m8j15K32r9O7n5L6k84J15J45k02
$$ y = [-378, -2, -276, -70, -56, -108, 50, 37, 133, 37, 58, 120, 136, 479, -105, -39, 227, 82, 131, 277, 269, 166, 390, 342, 88, 136, 176, 244, 197, 318, 315, 472, 34, 323, 317, 338, 426, 114, 110, 329, 335, 270, 294, 299, 351, 239, 157, 21, 74, 237, 392, 209, 213, 4, 302, 190, 154, 149, -87, 111, 109, 385, 338, 71, 263, 72, 179, 225, 198, 303, -4, 127, 271, 212, 40, 229, -82, 84, 59, 136, 122, -165, 107, 243, -318, 46, -16, -170, -14, -49, -106, -116, -213, -444, -353, -289, -132, -280, -334, -233, -510, -300, -480, -631, -321, 31, -310, -355, -531, -395, -562, -446, -407, -148, -502, -362, -536, -628, -385, -412, -329, -520, -324, -273, -231, -315, -264, -254, -182, -177, -158, -356, -100, -111, -21, -73, 134, -113, 193, 253, 93, -86, -69, 217, -33, 178, 9, 226, 344, 353, 337, 560, 597, 265, 401, 304, 347, 438, 537, 425, 950, 552, 631, 593, 417, 495, 532, 188, 360, 554, 470, 224, 337, 312, 286, 468, 367, 231, 100, 96, 390, 9, 311, -19, -67, -182, 50, -49, 18, -37, -1, -285, -170, -25, -227]
1778b27L7J33m9O2k93LR5r5J51j21K05l41J54J65j49j1k01M36l14r8K67q2j86
1801d59J84R2l68K06M06o6m8j66R9j9l31K18OJ71J0L1k41L33l46L88k11J09l9
1824d1n6N5RJ50r0o1k6j73J89J61Ok96R2k1K0M2J4K35j66j43M12m54R2J27N4j87
1850e6J51L6j67K52m29L25j9J03k84J98m0J49L03l13J97l60Q8M1J33P2q8P8j00
1873B70j87O3J7K30j20j18K2p7L27k29K27l59J22J27K06l20L1J26j87K20m90J38
1895C9K74m89K92k90J97L89m67K43l81L98k17J87j09j38j01k22L94l47J16L7j49
1916c44J76j19m8K51l17P9K54l33j10M40n41M67k31K4K00l48r9K05K20j87J18
1937b43j17K77o7j55l9L4Q2o3L02q7L3o3k2R9j48j51M02l4j31n8L0J25J88J2j02
$$ y = [-227, -190, -57, -106, -44, -337, -334, -239, -334, -183, -304, -99, -440, -286, -121, -270, -281, -482, -46, -360, -458, -191, -273, -459, -275, -183, -551, -345, 61, -5, -53, -219, -120, -139, -470, -252, -246, -75, -65, -34, -275, 58, -288, 100, -111, -2, -41, -97, -42, -33, 117, 27, -34, -60, -233, -44, 117, 123, -173, -81, -102, -82, -40, -26, 209, 43, -100, 312, -142, -50, 77, 131, -56, 95, 131, -36, 216, -213, 112, 93, 196, -88, 110, 70, 219, 522, 209, 406, 46, 134, 175, 308, 380, 292, 370, 270, 83, 146, 163, 393, 273, 155, 177, 100, 427, 198, 425, 66, 188, 315, 521, 201, 232, 358, 171, 391, -99, 39, 313, -176, 116, -174, 23, 412, -55, 188, -193, 205, -12, 175, 66, -72, -173, -395, -1, -348, -232, -195, -344, -168, -287, -335, -84, -401, -322, -68, -401, -511, -71, -612, -145, -376, -352, -152, -500, -599, -394, -174, -361, -243, -360, -83, -150, -305, -344, -310, -228, -291, 11, -76, -43, -106, -128, -29, -177, -328, 74, 40, -91, -149, -119, 6, 194, 206, 104]
1962A04j05M13j50r0o1O8Q4N4j99K45Q7j35k2l39L30K03j56M4J0k65P2J96M3l37
1986I4K97j53n6J0J15m2o8j60K78k92M5j65R8K04j22Mr2KQ9m7J5k9m4J13j95K53
2012A52k29o9l2l9K37j42j23P0j05J15L65m72M9J25o4M8N0N1j97K37j30P8k58
2035b83l6L74j76P2Q7m9j87j94L36K8O0k69J47O1M5m8k14J73J55k65J29k44J73
2058a25J01j92J99k09L9N6P0K6j2j66Q3L17j40j34p2J10J50k04L13l11o6K69j98
2081i6J10K06k46J58j96J15J4N3o4MK68n36J21K00N4j06J34O1N1p1j77J72m7j0
2105A72N9l72L31J42q6J46q5k79L00q5j41J56J58k81J17n7L5j06o5J42J21k5k92
2128EK17o4r5O7o1Q5j04j62K34p6O5j22l75L30k92J53PK1o4J36o7QJ4j45J9J49
$$ y = [104, -1, 412, 262, 172, 111, 179, 263, 317, 118, 363, 450, 315, 293, -46, 284, 487, 331, 375, 385, 120, 192, 388, 431, 94, 391, 238, 182, 192, 307, 265, 197, 37, 315, 23, 68, -97, 1, 205, 83, 87, -5, -3, 86, 39, 54, 25, -19, 94, -101, 152, -77, -146, -178, -217, 20, -122, -245, -175, -280, -165, 200, -272, -223, -98, -162, -114, -64, -13, -210, 27, -103, -25, -283, -319, 55, -121, -49, 38, -11, -198, -392, -56, -28, 32, -237, -90, -29, 16, -32, -246, -73, 82, -183, -54, -298, -125, -24, -216, -17, -226, -187, -131, -61, -35, -47, -213, -130, 187, 47, -87, -159, -49, 101, -103, 210, -101, -167, 102, -96, 14, 220, -26, 132, -64, 51, 65, 118, 54, 58, 326, -210, -89, 111, 165, 59, 193, 254, 305, 234, 57, 229, 182, 172, 231, -141, 190, 332, 246, 392, 307, 28, 328, 243, 102, 258, 416, 135, 252, 195, 230, 124, 59, 201, 322, 297, 5, 222, 158, 63, 130, 69, 154, 50, -112, 122, 46, 111, -11, -386, -56, -348, -195, -188, -167, -231, -95, -162, -154, -140, -285, -266, -117]
2154a17j15K95k2o46M60qJ72m52K73J2j54j33L22N1l54L1O8J03q2J87k72K22L5
2177a24J09j78m6J41N5j13L31k05J31l40O05m87K08J58m0j12mK28l26J47k9N7
2199A66j23J40J31k66J44k97j5J54J29J68j21j76j3R5J02O0J21m03J63p8O4o4
2221H1j2m5J23N3j08Q1l44K29K10l34L6j85Q0J39l8J0K67j21k23K4J5K32r2k15
2245a37K17p3J06j32l7j54J7J92p6O3k67K92p3m1R0N4J19m28L58J81k56l3J09
2268I1k4O6k00J7Q4j06K82j96O3j20O5o8j97L44n2k96L27k19Q9k38J02K60j21
2291d7j4j03q3K46k2j65L48j15j3L7l09R1L54m92K85M3p3L4K21k84J13j2j1J63
2315A92m07L79j46q4N6l8J68o7K44k96j2j24J52K85k14j63P6r8p0J10Q8J64Q5
$$ y = [-117, -232, 63, 41, -605, -145, -153, 19, -433, -160, -148, -302, -435, -113, -62, -416, -385, -317, -214, -296, -109, -381, -159, -124, -15, -193, -239, -98, -43, -156, 175, -30, 101, -239, 366, -121, 87, 245, 205, 93, 89, 317, -9, 138, 109, 166, 43, 183, 314, 48, 192, -105, -120, 34, 163, 331, 210, 34, 21, 116, 218, 278, 399, -4, 159, 81, 145, 81, 69, 24, 147, 200, 92, 173, -171, 58, 268, -66, -30, -215, -135, 4, -34, -24, 243, 122, -101, -77, -62, 170, 78, -137, 80, 7, 113, -19, -56, -210, -193, -1, -77, -14, -281, 11, -62, -103, -13, 41, 160, -268, 90, 271, 15, -18, 91, 67, 133, -67, -50, 34, -72, 210, 14, 77, -43, 22, -46, -243, 101, 49, -247, 80, -139, -50, -288, -186, 74, -47, -61, -164, -247, -1, -23, -188, 160, 45, 32, 69, -240, -149, 205, -287, -2, 41, -32, 2, 223, -61, 52, 40, 29, 192, -215, 164, 18, -66, -10, -48, 120, 53, 297, 1, -11, -135, 17, 302, 88, -75, 1, -97, -167, -57, 31, 195, 280]
2338B80j52k0l6P2K07k90j8Q3R5j12o6J01Q8j62K73p8j11j4j39P6p3QL14q0j37
2363A09l7j41L00k20J55N9k46j14L03j36k7n0qn8q2q5mJ61M1j51P0p4Q8j32N1
2388b28k44L97j14j2JK68m89K94o3J78k7l59K78J42j17m22N29l9l4Q8k68j7K66
2411Ho9Q2J26j49M7q8m4J47p5P9k74J81N4J20j82R9J17j78J24j38J46J51Q8m18
2435d6k6o7M37l03r3J34r4J1L53k05J24Mk36J39K7r9o5J80j2J73k91j36J88j18
2459b1m4J10j5k65K90n2n0j76J67K09l3k42J19R2j58m5j47K33Q0k80J18K58j96
2482d8p8J49J4J3j19q0K7J31q9K36l64K83j60M5K61k02O2q0k2m4J27M6P0p8j97
2507i7Q4L06o0j4j44q9j1L8nJ83j43qj25n8j8j11K23J48k55J20J15j59m9K13k35
$$ y = [280, 128, 108, 72, 144, 351, 61, 43, 126, 221, 109, 43, 144, 232, 70, 343, 265, 154, 140, 1, 77, 4, 12, 326, 246, 109, 72, -69, 231, 11, 166, 225, -21, -135, 168, 32, 5, -45, -53, -111, -193, -278, -282, -121, -80, -231, -161, -235, -147, -279, -228, -472, -75, -189, -201, -200, 68, -421, -127, -190, -12, -39, -398, -120, 22, -95, -517, 12, -27, -61, 27, -241, -258, 8, -61, 21, 147, -2, 45, -43, -87, 60, -15, 64, -210, -29, 25, 145, -37, 62, 179, 1, 125, -13, 133, 284, 372, -46, -72, -139, 298, -5, -98, 36, -58, -47, 306, 101, 225, 229, -7, 132, 159, 60, -5, 175, 163, 336, 45, -91, 97, -21, -65, 45, 30, -235, 55, 3, -47, -223, -56, 153, 120, -122, -3, 89, -69, -114, -261, -28, 52, -228, -110, 148, -48, -126, 23, 37, 50, -69, -149, -122, 9, -80, 156, -208, 75, -85, -40, 221, 19, 81, 1, -21, -65, 62, 108, 178, 100, -97, -13, 293, 233, 219, 75, -14, -25, 13, 8, 191, 48, 40, -85, -143, -161, -272, -49, 99, -156, -36, 79, -80, -129, 84, -151]
2532a51m4M5q3J84J03l14Q8J07p3J22J30l1k52p8J79J68q6j90L18j6n7m7k71L58
2556A09k2q7J50j77j39J91J33j43J14M9p5P1j44O9M6k54j04L27k5o1K75l26j68
2579a91L46L9m4M2k08J39J00k19J8Kj53K19l7J49l72J11K66n1P5l05P0M3m0l03
2603c04M29k39mN3q7O8M5k22J31J81k67R0J18O8Ok00J39Oj34J47P3l56M40q3j59
2628f1OQ6K43l43K21j6j82KK7j82J69n4K6O4o1J68r9O8M3r3L7o5N1L0Oj11k66
2655b86J98p3J28p2O5J1q5J52k98L98l9o0j77K67qJ07k13j64M24o34N54j84J46
2678A57j42K0qj67K39K5j4r1P4j28n7K3j1L9J84k11J83o8p9K0J53j82K02k94J31
2703bNM2P7J17m0j47k1K08k08O3n3J52j19k44K15J08j89lQ9R4k85J05J04J11m0
$$ y = [-151, -195, -150, -233, -49, 54, -260, -172, -65, -138, -16, 114, 83, -169, -247, -68, 100, 14, -176, 142, 126, 69, 22, -249, 109, 87, 0, 150, -27, -166, 25, 158, 15, 129, 178, 103, 174, 30, 99, 145, -109, -213, 114, 89, 28, 303, -23, -191, 155, 194, 150, 192, -16, 123, 223, 4, 22, 24, -129, 90, 53, 202, -170, -59, 207, 156, 231, -74, -4, 39, -1, -304, 125, -114, -118, -65, -152, -84, -39, -261, -130, 51, -216, -126, -8, 60, 66, -134, 5, 11, -123, 24, 97, -259, 181, 98, -61, -55, 31, 274, -69, 152, 136, -46, -44, -17, -199, -30, -84, -58, 6, -55, 113, 14, 82, 125, 32, 69, 4, 55, 85, 91, -20, -286, -88, -161, -33, -105, -40, -29, -114, 38, -260, 138, 99, 39, -138, 129, 121, 228, 15, -149, 275, -359, 195, 11, 157, 15, 35, 27, -140, 99, 124, 110, 19, 93, -35, -92, -69, -80, -41, 143, -68, 115, 47, -32, -12, 141, -41, 161, -133, -2, 3, 45, 122, 239, 199, 52, 31, 239, 31, 94, 41, 193, 74, -170, 45, 153, -36, -39, 50, 144, -141, -36, 68, 179, 139]
2728A39j05j06P3J01k3j64l3J17N9J5pj12J34j25Q7M3j81K06k63n5J52O8k14M6
2752a48k1pQ0kK63r8k05L4nJ62k9j12N7j60J45k09J83M5Oq2K3K32k47l7J80L4
2778H2n6k35L05k88M3k9K1j5qr4J20J47J96k59P6J32j39j29K18nqk26K41R9k12
2803b3R6j17L1J35k4J41k3j84Q4p7J2k1J57j29k41J77k4J7K47j37k16L36J74o67
2827b76L91J5P5l50K61J06j66j99J0j37K19M0j7J01m2j7k37J02k5q5M01J74m04
2850f0n4q9QK79k09K67j73Q4o6k17K29J3J2qj16l4l0L48k37j39J83N5j32Q8q3
2875h1m1K23k0n8J57j64j25J6p6K10j53L31j11j41j3n3M3K3O7Op0K2j93K18q4
2900f7j00J13n5L8K61k46J08n9L0o0N9l23L26K38k52o9J51j0Q9j15k02J73J44
$$ y = [139, 34, -72, 1, 102, 79, -85, -118, -1, 58, 73, 66, -46, 88, -37, 50, 93, -88, 118, -145, -200, -48, 20, -194, -148, -169, -176, -96, -98, 165, 67, -138, -104, -109, 53, 24, -88, -31, -191, -46, -255, -72, -27, -21, -103, -80, 152, -95, -132, 48, 82, 26, -209, 96, -192, -149, -178, -157, -172, -180, -274, -154, -7, 189, -70, 6, 138, -1, -130, 88, 83, 75, -151, 90, 189, -23, 73, -44, -13, 122, 98, 239, 216, 32, 116, 39, 51, 30, 187, 58, -183, -6, -30, -13, 234, 97, -119, 217, 391, -276, 115, 130, 205, -145, 116, 222, 56, -143, -133, -270, -51, -11, -28, 73, 31, 14, -223, -121, -146, -231, 170, 344, -60, -114, -203, -195, 84, -125, 142, -31, 53, -13, -230, -1, 12, 24, 16, -100, -134, -164, 184, -53, -192, -9, 46, -86, 2, -81, -122, 101, 81, 23, 180, 16, -109, -93, -169, 41, -112, 219, 108, -33, -46, -99, -56, -33, 34, 40, -30, -8, -201, 17, -67, -167, -54, -109, -71, 190, -56, 52, -7, 23, -37, 22, -301, 25, 263, 11, -58, 93, 83, 172, 57, -145, 28, 172]
2923A72p6k90L59L9k42M8J0L50m16J31j89L36k37o0J67k92L55l4j47R3P2k1N0
2946A78l2N3K52l40O1N2J30n38K50j02J38J03j34R4j14J8NQ0k51J13J01j44R5
2969F8j40J32j26J7J22k54K45l19K18N2j25q5Q1oN5n7n0K25j33J26Q2m42L64l29
2993b79N8L72j04J75j04k04p9J79k3j94J3J97j89K07j88Q8j17K49m1j50K70j36
3015@k8j19K47o5k45M14J24m82J77K75l09M9j80L09o7MR1k77J85J63l32K07q4
3038E7K21j87p4J21j51N9J6N2j01j13j6M10l30J57k47L3J48J54l05J2J77m17L32
3061Hk9q4L13l80P6K41J35k13R8k87J04k9j06K18j90kJ13k18r0L78o1J7l28M66
3085A50k19P1K5K55m05J86r7K18k16j33K78l6m3Q0j69oR3L8k6j04p4R9J66j56
$$ y = [172, 96, -194, 165, 204, -38, 10, 20, 370, -46, 85, -104, 232, -5, -65, 102, -190, 165, 131, -16, 77, 149, 128, 178, 146, 199, 451, 111, 172, 224, 354, -184, 66, -36, 102, 205, 71, 165, 51, 69, 74, 154, -97, 16, 117, -27, 68, -72, 60, -66, -49, 73, -181, 64, -255, -37, 15, -110, -195, -114, -120, -65, -122, -172, 53, -80, 46, 128, -314, 50, -279, -221, 151, 47, 222, 118, -86, -165, 14, -9, -203, -190, 7, -182, 25, -163, -75, -192, 57, 16, -134, 136, 0, -28, -147, 100, 35, -210, 204, 328, -154, 23, 298, -11, 38, -142, 167, 100, 104, 195, -82, 103, 266, -66, 141, 57, 278, 91, 17, 138, -13, 46, 62, 114, 13, -100, -116, 294, -36, 121, -126, -93, 55, 209, -96, -84, 93, -324, 8, -21, -105, 208, -172, -96, 145, 280, 67, 165, -122, -18, -47, -153, 65, -125, -127, -14, -232, -322, 56, -5, 12, -316, 150, -69, 2, 27, 282, -123, 63, -34, 184, -32, -165, 113, 77, 34, 114, -55, -61, 32, 70, 44, -60, -134, -35, 131, -25]
3109b5J5k2j7J49l26R0J15L84p34N38k51K15j40j99L01n7J3j51k3j5L3j99K98
3132hP0N2n5qq6j02o1K49j72j2J94K1J30k29q7N8Kj97L38J66n30K30lJ46j03r7
3158i4J98j59L8J5M2L3J96k65j7k8O8j0k35K71j55L19K0k03rJ89j50K4j98L02
3182A92j35r0J18L58k42j00L3k62K43l7R7j1j65Q6R1k88N9M3J31r7l4N6j45J36
3206C7O6j26J53j74n8P9j43L1p0L47j84m0j94L01j15j07K44j93R6n4j8o7K13j84
3230a60l5J54K74m84K48J52k10%J3Lm6J87l21K73j94J97j84k46M21j78J75K16
3252B55k31j58R8j12J19j40J88M5k64K96k84K70K14k03r3R0rM3k32%p9L0K45P6
3276A64j54K74q1k95j90l8K99j89O1K72K74l30j23M6J9m2J77j74K66j11l25K3
$$ y = [-25, -10, -32, -49, 100, -226, -136, -21, 363, -371, 167, -84, 131, -9, -208, 93, 36, 49, -102, -125, -140, -107, -306, -8, 62, 114, 59, 51, -35, -137, -198, 51, -121, -133, 61, 82, 212, -17, -104, -46, -44, -241, 97, 263, -267, -37, -40, 106, 3, -94, 104, -55, -17, -2, 40, 73, 269, 4, -13, -41, 27, 17, -218, 53, -102, 217, 237, 34, 25, 214, 64, 88, -110, 192, 57, -33, 85, 443, 201, 101, 134, -128, 115, 78, 175, 164, -1, 85, 176, -112, -53, -10, 121, 24, -10, 46, -99, 37, 103, -23, 130, -44, -102, -23, -166, -135, -205, 142, -42, -82, -276, 25, -90, -197, 47, -146, -50, -104, -122, -189, 24, -160, -195, -41, 233, -251, -3, 149, -61, -61, -48, -45, -91, 96, -225, 48, -146, 51, -133, -379, 42, -136, 39, 255, 24, -134, -36, -148, -29, -169, 19, 64, -200, 96, -188, 82, 296, 93, 0, 90, 81, 124, -108, -108, -187, -157, 88, 164, 10, 284, 203, -92, -282, -320, -21, -210, -149, 123, 397, 67, -56, -10, 9, -33, 144, -30, 236, 125, -200, -177]
3298a77j24J83qJ54j14r2L93k01k24K98J11j3n6j5j34Lp0L88m61K33k8k5K48j37
3322A32j79L75k35J98m77K92j08j23J57k1L7o2K13j6j20O6k28j92L56J6J92l95
3344a22j7n7J70K63k59J4p6L0J41m2Q5l31J51J15p0J84m08J91r1k1L9l9J22j65
3368a93R3o5O8r4Jq5L32k18M5K03j76L22j94K05n58J6J92j72J78L1J1N8k4l9K
3393f1N7J24r2J85m42M75r5l1NR2Mj30K20j64m9P3k67L05j58L6q8J18J26k39Q9
3418I3n7J10k23L35m85K96j1j24k7j42K47l1J42J77l21J71l7rj11M7j65l1N4k4
3442a26K5p4kK47j63j04K71k52m1Q2J42l6j8k75K33J48k76P7P3k2l5l1O6K38m5
3467A02j10k39K61j99J55k51Q8M6J63M5j08J53%L7N8k03p3j9O8J94k28K80r3l03
$$ y = [-177, -301, -118, -126, 28, -86, -178, 215, 14, -210, 88, 199, 186, 130, 115, -19, -16, -86, 302, -159, 74, 46, 21, 269, 132, -47, 328, 93, 291, -186, 106, -2, -125, 32, 11, 48, -14, 199, 183, 63, 129, -99, -291, 65, 81, 273, -122, -139, -196, -26, 237, -22, -8, -84, -54, 87, 45, 130, -201, -50, 65, -5, 179, -229, -38, -129, -150, -111, -150, -28, -193, -100, -165, -97, -191, -190, -275, 57, -161, -116, 87, -89, 233, 39, 244, -314, -298, -106, -278, -100, -69, -58, 0, -24, -63, -61, -4, 120, 28, 213, -229, 246, 151, 120, 125, 217, 221, 91, 311, 147, 98, 171, -96, 209, 51, 87, -1, 117, 243, 4, 93, 36, 146, -77, 258, -227, 69, 58, -66, -93, -235, 12, -19, 123, 300, -21, 150, 113, 104, -7, 40, -125, -156, -102, -126, -101, -175, -177, 70, -93, -197, 74, -178, -219, -137, 5, -31, -49, -324, -91, 57, -219, -142, -69, -91, -126, -157, -91, 147, 102, -8, -247, 14, -185, -30, -281, -193, -147, 16, 61, -47, 106, 106, 143, 201, -2, -75, -94, -26, 168, -60, 220, 127, -176]
3491a76M17l26O1K78k04l43L05q0L1R1n7k35K30j17Q1j80K41j59M6q3Q0J90l45
3514b54L19j10rj70J81KJ3p8k8J58R1j42J50k36J58n0p7K98k85K39l4J88k61J80
3538B43k45J28O9l80L19j39m5J2P9K5Rk81l0J5M20k8j29J7M8mK5K92j22j91N3
3563A60J86m97L72j6k02R2j50Rp3L24k65O5k61L85k41P3J5n2o1J67k1N9k73J79
3587b6n5K80k24k22K59j27Q1Q9J12l04K34q5p2m7N7j36j9K17M8l07J34q2q0L36
3611F1J6j43N3P9J48l20L79l34p1O0J80k29J04J99k28j11J94P9r6p9K58j99%J17
3635A17j11L5J22j15j57j01K63m5K3Rj03K9J20L7j30J46q2p7K25k89L37j74l34
3658b55K60J27j06q8J05j86L6k1Q3j8j70M79m31J54N4O8j11Q3k40J78o4m5K16
$$ y = [-176, 241, -85, -24, 254, 50, -293, 12, -68, -37, 54, -3, -238, -8, -125, -44, -224, 17, -142, -96, -179, -99, 91, -254, 65, -45, -54, -224, -43, -41, -28, -106, -134, 24, 115, -27, 123, -113, 45, -5, -82, 216, -69, 170, 136, 324, 63, 243, -2, 126, 195, -185, 134, -5, -50, -38, 41, 66, 75, -206, -236, -221, 199, 171, 42, 59, 107, 103, 128, 420, 298, 107, 160, 346, -151, 221, 205, 3, 95, -55, -46, -119, 205, -60, 5, -256, 129, -112, -39, -24, -76, -137, 30, 9, 68, -205, -26, -81, 199, -25, -247, 12, -115, -34, 55, 167, -137, 97, 12, -60, -107, -50, -186, -205, 12, 60, -247, -113, -195, -275, 61, 77, -66, -13, 66, 214, -106, 273, -61, -132, -72, 108, -121, -17, 182, -46, -157, 37, 116, 20, -59, 199, 0, 0, 117, 6, 41, 163, 48, -109, -210, 53, 8, 31, 40, -63, -34, 86, 123, -7, 139, 57, -20, 205, -84, 253, 79, -255, 5, 132, 26, -62, 43, -143, -107, -128, -45, -63, -233, 246, -185, -31, 23, 91, -20, 63, -177, 1, -63, -108, 108]
3681A08r3L16l73K45k99K1K86Jk67J15O2j05j5j62J22O1o5R7j46P9j75MK58R7
3705A72k0m8j34l1K79M4m27O8J69nj04J67j26J27k32K39J0j78J56j02O6M1k43
3728a12K0O0J14j1k54K24N1m4p3j25K55n6k44J56J02k12K49J56l49R1j7J4j04
3751a09J31J04j37P2j33P0J50j27Q1r6K68j42k11q7O1K15l65K08J3N0K7r1j26
3774a74K07Q9J3N7k03j28r3M43j27O3k17N7K07j56n1jP1K2OO7K02j25k97j35K99
3799I6O2m13M09j32k5J56o5j27L42k56j59J56l0o4L3J4j27J65N2j24J0o4k8N1
3823f8K14o7M0j32lQ2j96l8J20j06K1R8l4Nj27K68O9m2r2L3j09K38k65O2k06N54
3849C19l44J49j74J06l8P2k04J45o7m5P6J13l3J93J0m03Q2N7J26n1k93J97J64
$$ y = [108, 15, 331, -42, 203, -96, -75, 211, 212, -55, 60, 122, 17, 2, -160, -38, 23, -42, 55, -91, -12, -187, -183, 75, 172, 152, 104, -30, -61, 218, 262, -165, -97, 72, 67, -37, 130, 4, 131, -101, 138, 148, -30, 126, 24, 90, 131, -112, -92, -32, 82, 71, -183, 41, 92, 48, -25, -150, 105, 49, -195, -39, 63, -149, 100, 256, -93, -2, -19, -5, -109, 22, 126, -11, 61, -72, -2, 148, 21, 102, 6, 274, 132, -79, -166, -105, 110, -255, -47, -34, 16, 43, -48, -174, 33, 122, 135, 192, -11, -139, -232, 211, 84, 147, -70, -13, 194, 38, -13, -14, 57, 79, 85, 152, 354, 229, -68, -203, 96, 158, -255, 154, 22, -3, 153, 88, -39, 303, 47, -112, 44, 14, -50, -17, -3, -130, 35, 87, -37, -27, -91, -119, -68, 146, 79, 119, -13, -16, 66, -130, -168, -48, -154, -133, -35, -69, -64, -191, 77, 146, 104, 12, 45, -64, 174, -91, -29, -235, 319, -25, 124, -50, 56, 18, 90, -114, 31, -36, -81, -5, 108, 75, 268, 278, -125, -43, 14, 140, 89, -204, -7, 157]
3872A57k06L07k93K05oj63j00K64j98J97R4l26r5L85l0P8k92l1K78k78l35N85
3894A97k9p2l4q4J74k93K55J22l75J37K65k18Ql2l2l3q4J67R1k39l5J48N6R4l5
3919A19k0j47J29L5l42L12j78K16M8j34K1J43j96L5k34L78j95K1j26J15k3o0j7
3942a00LJ44k33K31j18K13k03J31Q5q9J44m04L49O8j46k41K89k44J1K21j77K3
3964d3K52j84o0po1K0k01N7K84o2o4P4j22o7J48n2J33j93O0q6J23J84l04J41k53
3989b83L71j83K30J45l96O9J37P9r3j36M5R3k06P3J2K81k92k42J73J12j01J5O5
4012c2L6m8R2K0n4K07j90q6p0R3J45M8j25J27l8j07J46r1j28j8J16l4k40J18K87
4037A74r3J37O6j32m4M8l88K50Pk08N34k3m09k00N82j61l7j70Mp7o9L42k69J99
$$ y = [157, -49, 258, -35, 170, 164, 1, -99, 165, -33, 164, 258, -68, -163, 222, 192, 270, -22, -53, 225, -53, -388, 197, 168, 96, 62, -22, 152, -141, 114, 236, -139, -2, 263, 45, 53, 21, -11, -44, -128, 39, 130, -109, -144, 4, 60, 154, 119, 99, -48, 81, 116, -226, 86, -92, 124, 172, 38, 59, 202, 6, 41, -193, 185, -10, 11, -115, 0, -23, -83, -100, -97, 47, -186, 45, -73, 140, -63, 68, 153, 64, 208, -196, 153, 221, 75, -166, 123, -121, -110, 111, -66, -43, 209, 25, -35, -42, -103, -83, -284, -227, 57, -5, -69, 5, -117, -184, -36, -88, 45, -148, -88, -174, -51, 133, -171, -30, -283, 88, -95, 135, 280, -116, -47, 90, 169, 76, -60, -15, 78, -128, -55, -43, 238, -54, -296, -123, -11, -112, -97, -32, 4, -44, 48, 68, 14, 221, 31, -55, -125, -32, 113, 161, 36, 163, 125, 18, 164, 73, -55, -73, 43, 9, -231, -113, 174, 81, 218, 284, 152, 108, 156, -232, 18, 25, -183, 351, 328, -81, -281, 301, 140, 103, -67, -63, -140, -209, 133, -136, 63]
4061F3j09J29Q6m5Q6j65j62K23j55j23J34p7J56j17J58m9R1m4j17m7j30N6P5J29
4085D6j21L35l57P1N2n1k1O0R6r7L3n2J31j71l7R0k03L07k10J89J5M5l18K16K9
4110G7l0L0q8N0j31K28l12J05j22N01k38r4j02Q6q0J07j14K35p3k54K17l2R6K23
4134B85m69J03K2K7l5j9K14o1m0k32J23K3k1Jl4K37r9J92k59J13K47k72J3Or4
4159b9P3Q2k51L15m07K26M4J67j26K08k54j66Q5J37o9k47L07p2Pj14J15j75P6
4182f8L0J07p1L7k4p9J83k72J56M2K07k77J35m0L0j21j82J97p6p5L4N3q6L16l49
4207a93Q6M8M0n9j5J10q9J0K3Q7n8jR1r2j43J0p0L05j02P3j67K04j81K58m69K25
4233f9K86j5k49J60o1m7k4j2M6m54N92n04J85K00p6K52k66J51l87NP3j05L41K2
$$ y = [63, -46, 83, 169, 124, 210, 45, -117, 106, -49, -172, -38, -115, 41, -76, 82, 33, 124, 80, -37, -84, -214, -158, -83, 46, -75, 260, -97, -26, 26, -25, -46, 14, 110, 13, 46, -6, 125, -46, -83, 7, -196, 111, -99, 90, 105, 150, -168, 48, 77, 47, 77, -11, 39, -92, 136, -176, -71, -193, 308, 70, -24, -126, -40, -120, -13, -127, 108, 35, -219, -2, -34, 62, 285, -184, -81, -59, -32, -67, -86, 128, 67, 27, -205, -82, -59, -80, -79, -113, 124, 25, 217, -42, 71, 318, 46, 59, 65, -29, 44, 126, -125, 190, -217, 9, 53, 220, 94, 302, 48, -118, -33, 104, 35, -212, 95, 23, 30, -84, 31, -144, -68, -38, 69, -2, 35, 11, -68, 115, -157, -1, 41, 248, -29, 106, 66, 96, -25, -207, -10, -86, -161, -127, -74, -160, 156, -193, -107, -59, -19, -78, -93, 17, -72, -62, -39, 48, -10, -11, 80, -12, -155, -145, -215, 90, -12, 61, -106, 98, -83, 175, -294, -69, 217, 202, -47, 113, 52, 5, -19, -31, 15, -439, 153, -351, -166, 34, -42, 210, -56, 95, -292, -287, -214, -319, 22, 44]
4257D4j66K42k3Qj08j66J05k3K34l24K59r6K13j99k86L42lK63l49K72r0l5r7P
4281B4J5j34P3j00Q3j33K52o0L2J03j70O1j4q7J22RJ93l64j63J95J8L78l16k4
4305gP4j1k14J85j72J85J51k80O4k7j10J37K9J11J5j56J50q8l05J99M5K14l83
4328a94K19k9j11J72j18J35k26L89k90K34q7j26Nk36K45O2N6k20M8N6j05J30r1
4351h2K8L5p7J58j9j59N4K05J8k59J20r8L01k43QK4l7J37k52j04J49K59k41K78
4375B03n62J00M08P0K4l26m6R8m6K94k9j88l9P1N7k34J90k11K80O6j66o5l4J59
4399G4J70j60Q2k50J03M1k39L00L0k46J51k31O9K20M3m1k57K01k68J28p0l7L22
4422A35l80L56j22m4l0K62j30j71k9K56m7j55o0N6K32m41L60j13K07q2K78m36
$$ y = [44, -122, 120, 97, 105, -3, -169, -64, -87, 147, -177, 82, -14, 199, 0, -286, 56, 53, 316, -33, 239, 149, 114, 17, 24, 39, -95, -22, -122, -39, -172, 80, 20, 52, 155, -15, 46, 32, -55, 67, 76, 269, -95, -258, -63, -45, 333, 17, -7, 67, 56, -158, 27, -145, 40, 191, -89, -25, -52, -162, -25, 4, 115, 130, -26, 124, 36, -269, -70, -25, 189, -194, 25, -4, -115, 57, -61, 74, -152, 237, -53, 181, 94, -32, -27, -263, -18, 44, 100, -120, -72, -16, -121, 9, -82, -54, -19, -96, 62, 43, -116, -62, 143, 161, -98, 22, -76, 225, -18, -10, 14, -23, 114, -138, -242, -93, 166, -75, 203, -359, -259, 149, 219, 243, -83, -129, -31, -77, 217, 188, 0, -39, 32, 89, -145, 45, -166, 114, 180, 14, -51, -85, 74, 244, 84, 166, -84, 19, 60, -179, 121, 151, -95, 56, -175, -106, 114, 157, 116, -141, 60, -208, -80, -150, -187, 135, -245, 111, -11, -55, -85, 177, 47, -124, -153, 103, 56, -99, -159, -103, 129, -312, 48, -65, 142, 60, 338, -98]
4444i8J68k60R1J9m5N3K25l14RK15j26m4J51p7P5m9j64L12n8n2J3k9j24L72k91
4469b8N6J7jJ92n1k32J79m32J46Q3K17J5k66O1J86N9k19M4j49J0L02j14RP5k35
4494g6K44k51J96j69oj36J34N6R6p4J92k12P1k49j2N3L34m52K69n1K6K7j42P1
4518f1J25k20J85J56j77N7j61m4J51J19Oj7j08J59k76J05j84j0K7J01pl1L60j08
4542A47k47O7O5k11O0n2J54l0j08J8J00k6L14j26n2p9j17Q9K5l2k8rJ26m8j74
4567a74J07k5J09r4R5k4j52J45R3k39J64j33J21j8Q7O2j02M4j1k30L57k32j91
4590b41J09L0M7P4P2O9k39J38m16N27k74J47N4n9L3j67L1q2J54r0N0R7j08J49
4614A05j4l9n6r4q0J97k45L34Po0NJ3K1j37J45j54J25k88K91r4J92j36k16M5K85
$$ y = [-98, 70, -190, -99, -80, -125, -72, 153, -161, -152, 63, -63, -107, 44, -33, 42, -7, -171, 141, 83, 31, 44, 15, -109, 263, -28, 28, 45, 44, 236, 185, -47, 132, -300, -154, -71, 146, 161, -105, -44, 142, 201, -18, 26, -123, -113, 189, 75, 84, 159, -76, 168, -83, 113, -56, -62, -198, -64, -8, 88, 14, 206, -6, 65, -184, -196, -143, 191, -261, 8, -43, -17, 10, -132, -61, 64, -156, 29, 185, 8, 65, -96, -140, 11, 130, 136, 119, 11, 170, -106, -1, -185, -195, -168, -67, -74, -105, 255, 147, -100, -33, 32, -179, -119, -171, -17, -47, -155, -137, -37, -63, 251, 125, 73, -6, -123, -34, -9, -41, -69, -78, 48, 0, -174, -67, -92, 17, -77, 18, -6, -158, -13, 80, -159, 5, -128, -7, -25, 62, 124, 22, 66, 55, -175, 182, -50, -241, -132, -102, -55, 19, 91, 160, -79, 59, -357, 170, -104, 43, 97, 38, 71, -96, -65, -147, 7, -83, -33, 64, -44, 105, 91, 52, -4, -98, -178, 19, -226, 108, 115, 55, 60, 73, 94, -43, 102, -52, 73, -215, 76, -18, 174, 38, -178, -133, 152]
4639A52q2K91j34k41K2Q2O6k03j13K34Q0j14N9q5j84R8k98L54kJ00j09J10j62
4662g9L6j0J96K0j53L4k93L41n4M4o3o1p9J69j16K5P9k24K23l7J13p7J00k21O3
4687b4m2J73P1j57K78j77j40Q8l40J66K74j29J29J00j16j49J68l1L5jl11j2K7
4710a20J33N6L7j31K27j67m1Q5M1J7N4j12j06J57q8j59j22K82O1m7j89O9nM5o9
4735i2J33P4p9k23r5K48O4M3k01J91k36J13P0j09N6J23%j64J73p6k4l9J93r1l22
4760b70M44j22R1K8l40M24l16K00l60L23k29oO7o7J05J77K5r4Q8j90N7K0K6K26
4784C07m77K1J26K70l42J38L5J36j30l16K97j88K57K7j34j04qk7L25k44j27M4
4806a14K09J42j36j33j1J72j73k24L59p0r6K7k35M40%o1l06P1m5J13q5K08o3J6
$$ y = [152, 70, 361, 227, -14, 8, 90, 156, -47, -160, 74, 154, 40, 99, 14, -170, -72, -370, -16, -18, 82, -27, 83, -79, -43, -53, 143, 163, 10, 44, -249, 92, 38, 82, 19, -42, -121, 48, -68, -43, 36, -188, 35, -2, 111, 34, 134, -87, -24, -66, 107, 178, 21, 299, 122, -18, 70, -270, -104, 170, 41, 170, 270, 154, 5, 173, 142, 177, 176, -135, -147, -120, 13, 69, 106, -25, 202, 35, -6, 79, 120, 137, 191, 79, -27, 130, 42, -117, -239, 43, 104, 57, -132, -63, -68, -23, -92, 41, 115, 36, -187, -282, -34, 30, 73, -128, 63, -173, -60, 10, -99, -43, 80, 80, -84, 89, 13, -11, -50, 143, 52, -270, 174, 52, 143, 171, -169, 255, -61, 139, -221, 102, -127, -133, -66, -133, -28, 149, 174, 80, 168, -22, 35, 55, 81, 307, -170, -149, -23, 247, -95, 43, 78, 214, 84, -232, 65, -123, 134, 161, 27, -77, -85, -112, 213, -31, -158, -114, 95, 237, 101, -32, -43, 129, -44, -268, 91, 21, -75, -48, -283, 157, 157, 96, -210, -139, -184, -71, -156, 52, -11, 5]
4830EJ62o2M2j75J17j38N2o9k2L45m14K76j76j27J01j13Q9J11j07J90m1ML2j81
4854i9lK81j78q7L92l78K30j43K38m08J14k02R3J50L1M6n3rn9J32kR2j58l5Jj33
4880a47n1O01m55K96j47j80L04l91K16m9J36Rj16m8M1m6Jj31J7L57k00n2J82L9
4904A86N8l64K5J86J0l52M37j3j45K8q7J61l8k1O0O4k40J99k37J08N9m0P8m80
4928c58K47J82p4J6k9j07K20N4j46r2j49K44Q3k51K12l08L13m9P0j14j01LK98
4951A64j77L82m49kJ22l5r6J26K7l09M57N1k23j7q3J32j76L5J29j3N7j14n1Q4
4975B1j16P6K23m1P3k71J63j88j63K45j04L8J67l3R9k84Q6J34j49P3j08J74j56
4998d1R2J1k70O8k8K04J43j37j25L7k3O0k78M04q9K02nj78K4J27k35o5K01o6j45
$$ y = [5, 167, 105, 147, -28, 89, -49, 3, -66, -88, 257, -157, 119, -57, -184, -83, -196, -107, 4, -103, 87, 46, 50, 82, -99, -102, 179, 1, -86, 306, -72, 158, 15, 253, -155, -41, -243, -150, 0, 31, 77, 24, 15, -44, 88, 86, 178, 20, -15, -14, -147, -198, 403, -52, 244, 97, -83, 221, -170, 46, -3, 133, 142, 26, -22, 19, -27, -26, -157, -140, 217, 17, -35, 147, 186, 244, -120, -95, 91, 101, -251, 186, 173, 28, 56, -31, 130, 92, 71, 131, 195, -45, 154, -83, 25, 84, 44, 122, -358, -111, 71, -3, 13, -16, -123, 97, 151, 5, -87, -236, 8, 91, -160, 52, -256, 57, 8, 78, -36, -137, -134, 164, -13, 369, -80, -82, 40, 5, -91, 35, 62, -247, 210, 261, 38, 21, -62, 70, -106, -71, 58, 45, 102, -12, -63, 21, -95, -19, 204, 163, 236, -35, 128, -60, -223, 22, -82, -44, 123, 90, 189, -95, -9, 125, -24, 49, -59, 115, -41, 51, 62, -208, -140, -168, 36, 179, 42, -83, -46, -69, -9, -287, 117, 28, 230, 225, 47, 71, 198, -37, -102, 99, 33, -112]
5023a12j12L65r8Rj83p7K07J88k34l4j76J72LO8Q7R3n8l0J73k64q4J44n1pL4K11
5049B34l35J41o0m0J55j84j8N7pJ5rJ63%k63M08j20k35R8j46J85l0k6K15j17M
5074H5OJ38m8l04K04j93j59M84q7P6j48k76J84J16j53J42p0k7O5J68j76L9K34
5097C00m08j15L06r4L8mO0j79j08J69Q0r9o0J00J01r8p7n0K98l34L24k36q4R4
5121g6r3K9M3J85k51j21K37L3r3J9N9J97j94q9K5J05N7q3O8O8J34k42K5m5qO5
5147E4K1l74K06J56j60K89k40m4K83J3l24J2r4M82k65l7j30P1KK14Q7o5kn4j42
5172d1J58K6O1r3k33K45j63j73K61j62J71n1j01J06N5K20L9m80J87j27r4O7o4
5195a86R9J16j37K26j67j36l6J4Q6m5M85k03q1N8j67K11l32N3J63j87J25j27K10
$$ y = [-112, -224, 141, 43, 52, -131, -208, -1, 187, -47, -81, -257, -85, -82, -14, 73, 166, 108, 78, 251, -13, -97, 47, -4, -11, 23, 234, -101, 40, -20, -60, 95, -89, -107, -50, -57, -42, -51, 112, 112, -151, 257, 137, -98, 0, -146, 39, 9, -17, 198, 81, 85, 91, 229, 181, -123, 81, -112, -271, 213, 126, 202, 54, -222, -38, 78, -75, 67, -3, -30, 35, 203, 27, 66, 300, -108, -223, 83, -11, 27, 23, 83, -96, -204, -35, 45, -54, -114, -14, 87, -11, -88, -138, 160, -174, 150, -86, -170, -76, -169, -140, -97, 88, -163, -284, -47, -14, -107, -88, -29, 168, -26, -115, -90, 15, 72, -11, 57, 125, 259, 17, 42, -3, -11, 54, 75, -299, -93, 63, -97, 192, -48, -92, 191, 204, -120, -108, -202, 280, 15, -22, -152, -81, -79, 135, 222, 157, 155, 101, -41, 117, 143, 204, 111, -122, 123, -40, -213, 48, -114, 57, 6, -95, 11, 66, 286, 325, -155, 32, -95, -189, -122, -186, -87, 29, -108, 118, -49, -185, -221, -207, -121, -166, 319, 116, 35, 93, -74, 137, -195, -142, 21, -166, -41, -168, 42]
5218D2J0l55L83o7R1k74J15k10K49k4m3J07L02r5j94R6k99L79l79O3Q0q8K21J94
5242C04j37q5K6k92q6N49j08l32K46j33M0j51K23k27J56L5j14J35r1J83j08K74
5264C07k27PMO2rp3p1j56L8J1J60J10K7l84M9O1J88r3J87j28k5l8q9p8K15J31
5290A86k01m4o7K03j02j64J32KJ3L10j84j76L6j14R0o7J17J35j28q7o6L79j85
5313A8l2k15M01k68M8P6L4j95j1R2J16r3L8j20O1j3p8l8L34l09j5K62o4k3m9J29
5339H6j02Q8o7J18l10J14J24j75J32K42m88J47K82m12J58J35j69O1o5j07K50P4
5361A16m8l13J27J37O9l59L6J18r1L79l1Ll59K5K97k29Q7L71l25j28o9M08j39
5384H2r4o1J28k30J67K80k15M0j26K02n0l82K27J31k2j14m6p0L26j83J1j34N3
$$ y = [42, 52, -303, 80, 13, 104, -170, -55, -265, -16, -40, -83, 24, 326, 231, 37, 133, -166, 213, -166, -103, -23, -111, 110, 304, 167, 82, 108, -184, -270, 279, 171, -161, 85, -48, -8, -159, 64, -163, -7, 28, -86, 49, -42, 141, 33, 307, 80, 87, 91, 153, 144, 71, 0, -156, -118, -107, 53, 163, 190, -194, -145, -84, 104, 11, 198, 70, 45, 7, -82, -160, 55, 186, -15, -59, -126, 77, -25, -189, -57, -55, -42, 268, 84, -92, -56, -170, -80, -147, -30, 105, -23, -110, -176, 203, 18, -14, -229, 172, -96, -48, 28, 62, -133, -144, -52, 64, -29, 9, -111, -50, -63, -141, -179, 155, -154, -169, 93, 29, 6, -43, 86, -16, 72, 5, 123, -187, -73, 51, -124, 8, 250, -238, -91, 191, -221, -63, 72, -97, -36, -101, -208, 42, 116, 68, -245, -118, 19, 88, -271, -235, -117, -208, 171, 140, 143, -216, -191, 106, -123, -36, 335, 10, -118, -187, 221, 82, -12, -73, 55, -175, -8, 272, 57, 97, -29, 173, 123, -259, -32, 99, 77, -37, -83, -153, 173, -10, 1, -133, -80]
5407h0N0lM0j83L20j3k68O0K8J87l21L6MK2n9J29J23j40nK10k47j28L17K22k84
5432A7k21J15J51k06j03M29r3k56K82l52L18j41j62K04j98J7J45R5J65l25j56
5453b75L56J68n7l25P2n4M8M1j51J35n3K78k44J05jP0L2k23j60K88K17l74K26
5476A19l33R2J24j35K49k7l1J58j60r7j31P7J51l92K36m4K16j18r8K55j81J64
5498I4m9R2P9j18k37K51j26N1o7Pk27N0K03K18J01k28p1K62l24LK07RJp8Ln3M8
5525A01k93J55n7P1P9j89j38J82j43L50l6J71m9K5k00j3n1K45l65L37l91N1L86
5548B28j47j02o1J5J13j52j32J85J11r6O0j6J0K10k83J58j62k6P9k27J32J05Q4
5571H6l5j34L8J72qk69M5J76k73L12j2k12K77k18Kj46r1N26k04M5j23N9K4K74
$$ y = [-80, -30, -33, 7, -176, 144, 131, -137, -77, -49, 138, -183, -147, -143, -121, -180, -51, 72, -68, -73, 137, -110, -238, 79, 301, 17, -204, -89, 62, -144, -247, 182, 89, -167, 115, -237, 81, -60, -222, -18, -216, -199, -54, 41, 206, -119, -275, 81, 249, 192, -133, -61, -115, -67, -26, -177, -42, -95, 183, -61, 44, 43, 113, 145, -78, -238, 50, 267, -107, 119, -214, -122, 2, -133, 116, 89, 58, 216, 56, -41, -172, -95, 56, -336, -100, -144, 72, -46, -144, 111, -70, 94, 45, 137, 216, 98, -139, 112, -14, 37, -30, -23, -250, -200, 3, 221, 322, 94, 23, 285, -39, -36, 171, 180, 181, 103, 106, 53, 101, -192, -37, -94, -23, 56, -133, -271, -89, -232, 118, 82, 253, 204, 229, 29, 16, -35, 210, -155, 182, -209, -158, 228, 81, -21, -82, -67, 46, -106, -238, -53, 58, -38, 22, 6, 16, 226, -57, 101, -61, -87, -8, -235, -103, 2, 86, 51, -83, -45, 127, 119, -150, -105, 71, -202, 110, 98, -114, 163, -55, -53, -199, -290, 236, 32, 77, -46, 13, 37, 311]
5595C11m43L3L9K24l98K0J63J00p7j58K58k12J08L55l55l5r5J19J4mJ52j60K34
5618A93q8q5o5P0N6p6q6j52M09n88N46k16R6Kl4n6M70m25L4j6k22J98N2n8J42
5643A01j96J80j07O0J42k97J11j9r0J95N6j69J3j38K78JKok77p5K80O8l03J23
5667f7L8OR4j05j22J57L7O7j55l1L23l15m2Q5j29J8j2K16K3K6q7j53J35q7K8K7
5693b5r0N8J9J48P3q4L9k0N0n3J1n2J86k64j9N7J08j11k61J14k9j32L72j9kL3
5719A07j48O3m6L52l08J26o4k36R7r5Q7L08j50%j84J95k48OK50k42K69p3n7k5
5743a6N4j62M7lO7O5K8m3J41r7j38O0o4J14j03m3K61L2j36%K3l6j50J79n2n4N2
5770B6J20k96J57k29J28J89l9%k01J67j25K00Q2p5k20J43P4po4j96j02L80j30
$$ y = [311, -132, -99, -60, 164, -234, -214, -51, 49, -28, -186, 72, -140, -32, 323, -32, -67, -162, -43, -29, -33, 119, -41, 193, 105, 20, -45, 25, 81, 5, -81, -233, 176, -412, 134, -82, 14, 16, -18, -74, 396, -29, 5, -11, -233, -35, 17, -41, 101, -95, 85, -22, 38, 180, -117, -6, -25, -115, 80, 136, -33, -20, -158, 120, 121, 123, 117, -160, -235, 45, 113, -190, -67, -29, -23, 71, -34, -156, 1, 38, 105, -50, -81, 242, -73, -115, -30, -159, -141, -153, 63, 86, 112, 25, -128, 7, -80, -52, -25, -115, -57, -38, 110, 183, 99, 138, 118, 168, 115, 126, 74, 260, -4, -23, 34, 142, 31, -230, -116, -145, -277, 95, 76, 74, 107, -41, 22, -24, 328, 20, 146, 82, -154, -57, -152, -65, 243, 93, 93, -91, 104, -144, -138, 112, -130, 139, 66, 9, -16, 38, -124, -77, -80, -13, 52, 80, 37, 178, 81, -57, 3, -61, 53, -50, -93, 168, 200, 64, 64, 87, 51, -99, 80, 28, -26, 26, 146, -150, 7, -222, -94, 95, 56, 56, -145, 22, -103, 97, 179, 104, -116, 27, 101, 94, 30, -166, -268, 112, -18]
5793a8J67l90J05J76o4l3J65l31M00k73MN0N0q2R2n1o7R4r9P2k8K53l26K03n7
5818A2k40J53K73k87K9J44J23l48K1j67L09p9J02p7p3Q4J17j65k6Q8q8M66n43
5841a72l1K11l4R6r3l53M34j71K66k98K61k39J62J58j46j02j89K50j48p1K91j46
5863f4Q5L4m3j65N1K71o4j66Q9o6K8j0M9j33J40j77L78k08p4jj22J50J34l83J72
5888i5J32j73J98j97K00j41p5J50r5J46j42j39O7J45r1J37j7j85K47N1j69o8K62
5911A48jl33OM0K40k05L20j58q1j65j0L11r2M8j77K13j75K90r6j06m1r5K4M3j32
5936a84K37J65l35R9k1m2L72l5J56l98j04K04k01K79P3k77n4R9jj26J48l60R5
5959b11o1L12n3J12o5j59K63q4J53k22O7j89L12j68r5J5P8Q9l08J82K47k07M4
$$ y = [-18, 149, -241, -136, 40, -24, -57, 108, -223, 177, -96, -92, -42, 8, -74, 18, -33, -100, -6, -105, -33, -61, 192, -134, 69, 12, -228, -75, 198, -89, -60, 84, 207, -141, -120, -287, 22, -57, 45, -32, -105, -21, 96, -69, -95, -7, -95, 371, -172, -203, 8, -26, 70, -23, -376, 58, -113, 153, -145, 116, -123, 39, 197, 51, -51, -240, 10, -138, -209, 82, -64, 21, 55, 12, -153, -102, 169, 105, -61, 28, -38, -10, -20, 29, -104, 36, -141, 237, 29, -45, -46, -168, -18, 116, -267, -95, 37, -136, 62, -135, 65, -76, -151, -1, -96, 50, -92, -231, -164, -19, -110, 27, 10, -175, 72, 123, -46, -114, 148, 147, -186, -180, -140, 100, -105, 215, 57, -24, -189, -199, 112, 20, 68, -109, 104, -71, 219, 123, 17, -24, -119, -95, -52, -184, 53, 218, -117, -18, -39, -81, 291, 256, 412, 14, -90, 114, -87, 192, 265, -12, -66, 33, 32, -94, 54, -306, -211, -272, 40, -13, 99, 34, -125, 138, 54, 207, -15, 52, -137, 175, 7, -88, -73, 5, 94, -214, -32, 215, 8, 52]
5982E2o5n3QJ35j18K37l10J67j69Q2j58M57k29n3k5K16k27P4L0k17J44j30R9j11
6006a64K81J36k22q0J77k13J38o6P9l47M27q5j37j34J75j20K25Qj52J61m1M6k09
6029a17j2K10n1k81J89j52M21j40j82nJ33j69M7J31k4k23N6L33l29N34l78J66
6051A57L8j84p2J21p5J46j96J69r6K38j84J83k11k25M79q8m2N7j13j58j43J13
6073h6J44n3j02j16L69l68j2J45P9L3q4J42j27m2J14k10K00k4J88j88r2J01L7
6096D8J43j56Q1k39P5J44K3k73K20J90k52j36J27K61n54L07Q3Np9kk42K34J5J17
6120A40j30J37k21LJ30n4j85K06p6j4J36j36K3J28k17LJ88l63K61L3J36k55L03
6143A76k88M64m23K76m55L61k33M29k31o5K30k09J41j22n9j04J58mOP9R5j77j85
$$ y = [52, -13, -66, -58, 77, -41, 196, -114, 53, -116, -34, -192, 265, 36, -17, -42, 174, -53, 21, 51, -166, -22, -152, -53, -164, 117, 253, 31, -49, 128, -85, 53, -13, 66, -281, 146, 61, -76, -210, -35, -155, 70, 78, -74, 87, 46, 92, -117, -129, 81, 30, -251, -62, -214, 207, 67, -115, -120, 13, -156, -109, 22, -2, -225, -169, 164, -165, 369, -9, 157, 195, 11, -61, 60, -15, 131, -65, 104, 8, 246, 62, 245, 34, -191, 288, 200, 158, 215, 102, -56, -199, -86, 58, 5, -97, -213, 156, -212, -224, -79, 0, 33, -51, 91, -36, -78, 36, -174, 26, 2, 190, 2, -90, 11, 48, 191, 35, 116, -123, -48, 96, 119, -154, 66, 256, 4, -132, -5, 256, -298, 9, 92, 97, 18, 16, -226, 8, 23, 140, 10, 147, -74, -71, 59, 5, -180, 26, -50, -64, 72, -64, -41, 87, -130, -127, 61, -302, -41, -8, 128, -127, 176, -112, 352, -71, 205, -250, 111, -122, 307, 76, 11, 241, 32, 173, 51, -8, -112, 46, 42, 48, 127, 222, 45, -140]
6166a40L44l62K31J7k68p2L71k63n5J33L83l65K17k79K31P4l65j49J78J31p6j5
6188i9k28L66J02j85L9K13J28l02k70L23o0K5Q5N9l33R4J24l07K85P6j38oK57
6211B48k09j05K72k91q7M1L81m33J74M1O8o1j58J19RJ14j53N9k75M43k93K72l00
6234a24J41J19k84J00K7n0J24j35P5J37k01J84k51K36J05j29J55m38K46Q5l23
6255b01M88l54J39m2k0RJ43k08P4j22j85K98M3J77j54l1j18J08k8Q4j29K41k62
6278e0m4O9o9PmP5qj6J90k95n8J39J5k62M94k43j23N6K20L7j89N3K01k17j6K15
6304A77k53P5j57J91J91k94P5J58k39O2J43l68L85j73o1K61l28K90j29j03L02
6325B05l00K47k07K4m6J4J65o03L72J28K11j00j05j50J43j59J92L5k08J30j84
$$ y = [-140, 204, -158, 73, 90, -178, -250, 121, -142, -197, -64, 319, -46, 171, -108, 123, 197, -168, -317, -139, -8, -84, -99, -327, 39, 141, -44, -5, 208, 336, 34, -236, 87, 27, 52, 137, 196, -137, -43, 81, -226, 59, 135, -3, -9, 248, 39, -66, 206, -85, -172, -131, 250, -183, -9, 32, 100, 39, -119, 0, 9, 123, -30, 29, -246, 197, -96, 176, -124, 17, 136, -148, -48, -21, -71, 53, -82, -7, 130, -71, 113, -138, 98, 203, 74, 229, -209, 37, 122, -201, 287, -67, 72, 30, 10, 19, 162, -46, 28, -94, -279, 19, 62, 239, 85, 54, -64, 44, 16, 100, -29, 212, -50, -94, -25, -94, -87, -91, -16, -24, -40, 150, -145, -203, -64, -49, -311, 183, -60, -183, -127, 93, 130, -59, -6, 195, -22, -38, 177, -76, -1, -158, 33, 224, -70, 5, 163, -76, -14, 129, -239, 146, -27, -88, 173, -155, 135, 6, -97, 205, -95, 152, -55, -31, -77, -63, 102, -501, -129, -1, 210, 110, 5, -145, -2, -161, 31, 66, -142, -12, -196]
6346a96J04J49q5q6J43j08R0J11l71L44j99J08J86o1rj43K82k97J10Kn8J33p0
$$ y = [-196, -92, 57, -28, -114, 29, -79, 11, 122, -249, 95, -104, 4, 190, 129, 120, -23, 259, -38, 72, 74, 16, 149, 79]
$$ [...]
8191i6
##END NTUPLES=NMR FID
##END=
