##TITLE=1H_PR195_k
 DMSO, 8 sc, 
 7.04.2021
##JCAMPDX= 6.0         $$ Bruker NMR JCAMP-DX V2.0
##DATA TYPE= NMR FID
##DATA CLASS= NTUPLES
##ORIGIN= UXNMR, Bruker Analytische Messtechnik GmbH
##OWNER= root
$$ XWIN-NMR		Version 3.5
$$ Wed Apr  7 16:01:56 2021 Russian Standard Time (UT+4h)  she@DPX200
##.OBSERVE FREQUENCY= 200.131506
##.OBSERVE NUCLEUS= ^1H
##.DELAY= (6, 6)
##.ACQUISITION MODE= SIMULTANEOUS
##.ACQUISITION SCHEME= undefined
##.AVERAGES= 8
##.DIGITISER RES= 18
##SPECTROMETER/DATA SYSTEM= spect
##.PULSE SEQUENCE= zg30
##.SOLVENT NAME= DMSO
##.SHIFT REFERENCE= (INTERNAL, DMSO, 0, 15.7039)
##AUDIT TRAIL= $$ (NUMBER, WHEN, WHO, WHERE, WHAT)
$$ ##TITLE= Audit trail, XWIN-NMR		Version 3.5
$$ ##JCAMPDX= 5.01
$$ ##ORIGIN= Bruker BioSpin GmbH
$$ ##OWNER= she
$$ F:/spectra/data/she/nmr/H-F/1/audita.txt
$$ ##AUDIT TRAIL=  $$ (NUMBER, WHEN, WHO, WHERE, WHAT)
(   1,<2021-04-07 16:00:55.60 +0400>,<she>,<DPX200>,
      <created by zg, POWCHK disabled, PULCHK disabled
       configuration hash MD5:
       00 E9 B6 7A A2 85 ED C7 34 08 36 98 17 FE 4E 26
       data hash MD5: 16K
       D6 BB B9 70 12 59 58 55 64 17 AB 1C A9 7D 57 CB>)
$$ ##END=
$$ 
$$ hash MD5
$$ D5 EC 97 BD 86 EC 20 F5 39 52 98 DA 5C 1B 7E 7B
##$RELAX= 
##$RELAX= 
##$RELAX= 
##$RELAX= 
##$RELAX= 
##$RELAX= 
$$ Bruker specific parameters
$$ --------------------------
##$DU= <F:/spectra>
##$EXPNO= 1
##$NAME= <H-F>
##$PROCNO= 1
##$TYPE= <nmr>
##$USER= <she>
##$AMP= (0..31)
100 100 100 100 100 100 100 100 100 100 100 100 100 100 100 100 100 100 
100 100 100 100 100 100 100 100 100 100 100 100 100 100 
##$AQSEQ= 0
##$AQ_mod= 1
##$AUNM= <au_zg>
##$AUTOPOS= <>
##$BF1= 200.13
##$BF2= 200.13
##$BF3= 200.13
##$BF4= 200.13
##$BF5= 200.13
##$BF6= 200.13
##$BF7= 200.13
##$BF8= 200.13
##$BYTORDA= 1
##$CFDGTYP= 0
##$CFRGTYP= 5
##$CHEMSTR= <none>
##$CNST= (0..31)
1 1 145 1 1 1 1 1 1 1 1 1 1 1 1 1 1 1 1 1 1 1 1 1 1 1 1 1 1 1 1 1 
##$CPDPRG= <>
##$CPDPRG1= <>
##$CPDPRG2= <>
##$CPDPRG3= <>
##$CPDPRG4= <mlev>
##$CPDPRG5= <mlev>
##$CPDPRG6= <mlev>
##$CPDPRG7= <mlev>
##$CPDPRG8= <mlev>
##$CPDPRGB= <>
##$CPDPRGT= <>
##$D= (0..31)
0 1.2 0 0 0 0 0 0 0 0.06 0 0.03 0 0 0 0 0.0002 0 0 0 0 0 0 0 0 0 0 0 0 
0 0 0 
##$DATE= 1617796855
##$DBL= (0..7)
120 120 120 120 120 120 120 120 
##$DBP= (0..7)
150 150 150 150 150 150 150 150 
##$DBP07= 0
##$DBPNAM0= <>
##$DBPNAM1= <>
##$DBPNAM2= <>
##$DBPNAM3= <>
##$DBPNAM4= <>
##$DBPNAM5= <>
##$DBPNAM6= <>
##$DBPNAM7= <>
##$DBPOAL= (0..7)
0.5 0.5 0.5 0.5 0.5 0.5 0.5 0.5 
##$DBPOFFS= (0..7)
0 0 0 0 0 0 0 0 
##$DE= 6
##$DECBNUC= <off>
##$DECIM= 32
##$DECNUC= <off>
##$DECSTAT= 4
##$DIGMOD= 1
##$DIGTYP= 9
##$DL= (0..7)
0 120 120 120 120 120 120 120 
##$DP= (0..7)
150 150 150 150 150 150 150 150 
##$DP07= 0
##$DPNAME0= <>
##$DPNAME1= <>
##$DPNAME2= <>
##$DPNAME3= <>
##$DPNAME4= <>
##$DPNAME5= <>
##$DPNAME6= <>
##$DPNAME7= <>
##$DPOAL= (0..7)
0.5 0.5 0.5 0.5 0.5 0.5 0.5 0.5 
##$DPOFFS= (0..7)
0 0 0 0 0 0 0 0 
##$DQDMODE= 0
##$DR= 18
##$DS= 0
##$DSLIST= <SSSSSSSSSSSSSSS>
$$ [...]
##$SUBNAM2= <"">
##$SUBNAM3= <"">
##$SUBNAM4= <"">
##$SUBNAM5= <"">
##$SUBNAM6= <"">
##$SUBNAM7= <"">
##$SUBNAM8= <"">
##$SUBNAM9= <"">
##$SW= 16.9725357007746
##$SWIBOX= (0..15)
0 0 2 0 0 0 0 0 0 0 0 0 0 0 0 0 
##$SW_h= 3396.73913043478
##$TD= 16384
##$TD0= 1
##$TE= 0
##$TE2= 300
##$TE3= 300
##$TEG= 300
##$TL= (0..7)
0 120 120 120 120 120 120 120 
##$TP= (0..7)
150 150 150 150 150 150 150 150 
##$TP07= 0
##$TPNAME0= <>
##$TPNAME1= <>
##$TPNAME2= <>
##$TPNAME3= <>
##$TPNAME4= <>
##$TPNAME5= <>
##$TPNAME6= <>
##$TPNAME7= <>
##$TPOAL= (0..7)
0.5 0.5 0.5 0.5 0.5 0.5 0.5 0.5 
##$TPOFFS= (0..7)
0 0 0 0 0 0 0 0 
##$TUNHIN= 0
##$TUNHOUT= 0
##$TUNXOUT= 0
##$USERA1= <user>
##$USERA2= <user>
##$USERA3= <user>
##$USERA4= <user>
##$USERA5= <user>
##$V9= 5
##$VALIST= <valist>
##$VCLIST= <CCCCCCCCCCCCCCC>
##$VD= 0
##$VDLIST= <DDDDDDDDDDDDDDD>
##$VPLIST= <PPPPPPPPPPPPPPP>
##$VTLIST= <TTTTTTTTTTTTTTT>
##$WBST= 1024
##$WBSW= 4
##$XGAIN= (0..3)
0 0 0 0 
##$XL= 0
##$YL= 0
##$YMAX_a= 41994
##$YMIN_a= -23831
##$ZGOPTNS= <>
##$ZL1= 120
##$ZL2= 120
##$ZL3= 120
##$ZL4= 120
##$ABSF1= 10
##$ABSF2= 0
##$ABSG= 5
##$ABSL= 3
##$ALPHA= 0
##$AQORDER= 0
##$ASSFAC= 0
##$ASSFACI= 0
##$ASSFACX= 0
##$ASSWID= 0
##$AUNMP= <proc_1d>
##$AZFE= 0.1
##$AZFW= 0.1
##$BCFW= 1
##$BC_mod= 2
##$BYTORDP= 1
##$COROFFS= 0
##$CY= 11.3945322036743
##$DATMOD= 1
##$DC= 2
##$DFILT= <>
##$DTYPP= 0
##$F1P= 15.9154993809931
##$F2P= -4.1035820241983
##$FCOR= 0.5
##$FTSIZE= 0
##$FT_mod= 4
##$GAMMA= 1
##$GB= 0.15
##$INTBC= 1
##$INTSCL= 1
##$ISEN= 128
##$LB= 0.24
##$LEV0= 0
##$LPBIN= 0
##$MAXI= 10000
##$MC2= 0
##$MEAN= 0
##$ME_mod= 0
##$MI= 1.114404
##$NCOEF= 0
##$NC_proc= 0
##$NLEV= 6
##$NOISF1= 3.799351
##$NOISF2= 2.8
##$NSP= 1
##$NTH_PI= 0
##$NZP= 0
##$OFFSET= 15.70392
##$PC= 1
##$PHC0= -11125.53
##$PHC1= 14.40092
##$PH_mod= 1
##$PKNL= yes
##$PPARMOD= 0
##$PSCAL= 0
##$PSIGN= 0
##$REVERSE= no
##$SF= 200.130013532006
##$SI= 16384
##$SIGF1= 3
##$SIGF2= 2
##$SINO= 400
##$SIOLD= 16384
##$SREGLST= <1H.CDCl3>
##$SSB= 0
##$STSI= 0
##$STSR= 0
##$SW_p= 3612.71676300578
##$SYMM= 0
##$S_DEV= 0
##$TDeff= 0
##$TDoff= 0
##$TI= <>
##$TILT= no
##$TM1= 0
##$TM2= 0
##$TOPLEV= 0
##$USERP1= <user>
##$USERP2= <user>
##$USERP3= <user>
##$USERP4= <user>
##$USERP5= <user>
##$WDW= 1
##$XDIM= 8192
##$YMAX_p= 0
##$YMIN_p= 0
$$ End of Bruker specific parameters
$$ ---------------------------------
##NTUPLES= NMR FID
##VAR_NAME=  TIME,          FID/REAL,        FID/IMAG
##SYMBOL=    X,             R,               I
##VAR_TYPE=  INDEPENDENT,   DEPENDENT,       DEPENDENT
##VAR_FORM=  AFFN,          ASDF,            ASDF
##VAR_DIM=   8192,          8192,            8192
##UNITS=     SECONDS,       ARBITRARY UNITS, ARBITRARY UNITS
##FACTOR=    0.0002944,     1,               1
##FIRST=     0,             0,               0
##LAST=      2.4114304,     0,               0
##MIN=       0,             -23831,          0
##MAX=       2.4114304,     41994,           0
$$ Real data points
##PAGE= N=1
##DATA TABLE= (X++(R..R)), XYDATA
$$ [...]
1784C01l30j18K70M4m81O19J3k36n7L72m01j72L23k10l7j34N34m75N2J95K01m97
1806b24J52N6l70M36K88k49l13J97%O5J7Jj75K8J26J8k80M15m5j46j64K97j49
1829a9k69M99j35l01J72M84l35j77K12k52M9K82m8k69J16J08o6j81L28k81j09
1850a92R8K91l72J89P1j48q2K35L07o48K16K06j66n8K04J28m92O9K60j14L1K2
1872E5K23l53J28R1n8J54J7k90j24J71J75J5QM9k57l3L94j87j35J00j61J79m65
1895c04N96l15j46J91R9k66q7L38K1j96k05M38P1m01K02k1l5K03K7l68J58k3P4
1918E1J37M1q4m43K10N2J0LL5j41J11J75k58o7L86j76j96J12K00K8m43N15m09
1941a51K72j00n3m1p0J27M7k00J15O7j03J17K0p9j48R4K94k44L6K87k44l06K50
$$ y = [301, -29, -147, 123, 167, -314, 305, 318, 82, 25, 397, -4, -176, 147, -63, -100, -234, 300, -175, -123, 72, 273, -224, -72, -16, -386, 50, 338, 89, -224, -27, -27, 38, 55, 56, -119, -91, 35, 53, -227, 188, 143, -3, -167, 130, -19, -288, 211, 76, -225, -53, 431, 96, -81, 131, -121, -72, 210, 162, -107, 9, 117, 51, -130, 198, -83, -192, -94, 197, -175, 14, 85, -63, -145, 90, 397, -251, -35, 171, 5, -53, 151, 279, -213, -144, 116, 2, 33, 55, 278, -75, 53, 144, 86, 240, 257, -33, -157, 14, 189, 204, 212, 261, 4, -29, 365, 178, 43, 143, -18, 161, -304, 292, -23, -169, 22, 121, -145, -232, 106, 127, -69, -274, 164, 235, -166, 36, 15, -20, 183, 210, -158, 0, -23, 51, 188, 229, 145, -298, -88, -36, -26, -23, 12, -129, -18, 157, -101, -168, 218, 42, -154, -42, 158, 186, -257, 258, -151, 121, 21, -32, -73, -143, -16, 31, -169, -54, 13, -90, 27, 47, -32, -180, -86, 208, -36, 0, 287, 43, -263, -13]
1964a3k05P5J22N5k82K11J28R3j90Q1J19l24L7L57m55J17K40j00M4j8m2l96M70
1987A24j67j31K92j10J14J38l34K55k9n2k08Q3o9K2l1L3k2K97k74J95J60l71J55
2010G0j80K58o8l06N8K93j73P3l02L56j42O0j29N3J11j40J63j64K07r3j94J91
2032Bk1PN2j67K2J66o1j18J65J10k91M4L15k83P8k9J2k2m9K20MJ01j55j61K31
2057A72k95L23n02M09l05M51k13o9J48j68K09n8k3j80L04j31k91K95j75j31K16
2078a4N7k13q3L51j41n7MJ57p0q0N06l71m6J80k22j40J78P0N5Qk96L52j46O9L
2103A11r7j26J15J88j25J02j04k32K56M7Q2m02L30j65RJ77Lo3j48Q6J14j71R7
2126H4j29l3J22k21L03j40L0J06k66K4P0R1p4pJ33l39K02K03k99R1L12m07J80
$$ y = [-13, -218, -143, -21, 34, -248, -37, 91, 184, -6, 75, 194, -130, -93, 264, -191, -74, 166, 66, 110, 92, 50, -346, 124, -43, -174, 118, 8, 122, 260, -74, 181, 152, 100, -108, -25, -94, -72, -103, -70, -92, 205, -69, 126, 286, -85, 70, -110, 148, 80, -226, -168, 125, -48, 25, -277, 79, -63, -3, -132, -79, 32, -108, 55, -109, 98, 5, -189, 2, -19, -12, 40, -127, -105, 61, 0, -118, 47, 157, -134, -90, 225, -58, 20, -9, 3, -19, -68, 152, 156, 257, 102, -59, 172, -123, 200, -302, 107, -198, 253, 40, -29, 119, -49, 160, 102, 79, -101, 203, 72, -219, 76, -99, -230, -14, 43, -170, -253, 98, -43, -100, -96, 61, -9, -89, 417, 46, 0, 180, -42, -182, -4, 66, 121, 129, -167, 185, 39, 108, 111, 14, -112, 3, 191, 66, 168, 64, -168, 88, 135, 217, -185, 145, -20, -11, 166, 169, 106, -42, 44, 158, -13, 84, -45, -78, 44, -177, 126, -14, 16, 122, -144, -120, -50, 41, -33, -40, 93, -246, -44, 159, -140, -49, 263, -144, 36]
2149C6L4k2j35j22m4Q9J69J06k8j27R5P6j22j17K7J83j88J23M8j84K3O7k77L60
2173G0j85O0k12L07O4k13L00n1k87j90L47J86l48J39K17k61K13l21R6O5J01o6
2195C1R8k43J53j65J26j0J0q4M5K47l63J98k15J35j28k9J40J1L3o6j60L50j77
2218f3K07k9R5j21k26J56m9J04j43L2J21k73l8L49m0r7M8J76k41L0J10k32K12
2241H8M8k47K15j64J49J61l05J82N2J9j2Jk54J10j35O4k7J21J96k67lo4n3p7R7
2266a05K31j23K69n4k64m32M62k5j5j5m9j10K66K45k26j07j9K42o9j43l0R6R7
2289A22j77J39r6NJ32k16K42j54Q0p3p4o8J05j43J61K4M5O3j07j91J68j29J69
2312B7J9Q8k21o0o6M32j56JK2J99k67J83j43j3P3nj00m8j7K5Q7K1K47m65J00K4
$$ y = [36, 70, 48, -87, -209, -253, -164, 5, 111, 83, -44, 51, 127, 5, -112, -85, 98, -90, 33, 81, -103, -80, -13, -290, 70, -115, -55, -267, 40, 104, -109, 191, 140, -147, -337, 10, 196, -152, -13, 204, -57, 156, -165, -69, -4, 97, 31, 129, -114, 39, -126, 0, -10, 0, -84, -39, 208, -155, 43, -172, -37, -165, -194, -54, -43, -10, -76, -236, 114, -63, 144, 115, 210, 89, -137, 19, -30, 74, -69, -37, 84, -189, -227, 122, 82, -15, 33, 209, -32, -2, 108, -124, 88, 136, -111, 104, -60, 89, 250, -55, 127, 179, 198, 186, 187, -67, 43, -92, -28, -55, 66, 262, -5, -8, -72, -125, -202, -105, 126, 3, 272, 218, -46, -478, -16, -41, -56, -71, -120, -230, 36, 281, 55, -52, -71, 171, 102, -41, -71, 25, 122, -55, 84, -12, -7, 125, -91, 151, -3, 77, 4, -70, -138, -33, -176, -15, 9, 54, 117, 10, -181, -13, -142, 27, 46, 134, -87, -147, -213, 219, 63, 64, 86, 285, 18, 201, 58, 45, 118, 113, 13, -35, -52, -27, 60, 81, 328, -137, -37, -13]
2338a3o6q6J79n1N8p8K57l12K66r5P4m43J3M38j15N0n4j89K81k8n4j58o3L38n7
2363I2k27J28L2j09J19j39l7O1P0K07m14J88J39p8p2j49J19J02N4N0l24K49j96
2386a35O8O8K2L6o8q9L42k31k5k7j95J99L04m03K82k91K09M6j92Kj20L13j60j1
2410e6J37N3k67K47k71L06j95Lr8J33R7j36j43K23J01J90k99l1k62K02j6J00m8
2433c0J1N4k39K69k75L90k54J10L79n39K28K57n27K43jp3n9J98j09J06j67R5K85
2456C52k65Q5j90O0q1K84m44L10J29l25J44K01l60k92M88J19k90OJ85M8l50J39
2478d7j25K67j21l7J36j10k4j4J98m86L44J71j39pL5j50J04J13k1r8j3n6J57k19
2502a42J9N7L0J48m9j35o3R6K9K01j33j54J7J54k48J74k3K45l96K78J62j74J87
$$ y = [-13, -79, -165, 14, -37, 21, -57, 200, -112, 154, 59, 133, -310, -297, 141, 26, 76, 22, -167, 114, 86, 32, -126, -189, 149, 92, -135, -7, 25, -84, 35, -104, -141, -80, -10, 197, -217, -29, 110, 32, -40, -189, -70, 32, 86, 136, -188, 61, -135, -67, 1, 23, 59, -9, -98, 244, 13, -12, -39, -234, -35, 269, -134, 148, -143, 66, 112, -80, -78, -198, 115, -45, -56, 81, 134, -133, 114, -157, 149, -46, -43, -141, -8, 89, -47, -190, 33, 134, 324, 25, -6, -268, -66, -82, 18, -30, -19, 35, -204, 65, -210, 180, -74, 36, 415, -124, 104, 361, -166, 77, 76, 3, -56, 142, 33, 139, -28, 67, 352, 87, 172, -18, 42, -39, 245, -199, 111, 240, -85, 59, 260, -100, -392, 96, 215, -75, -69, 116, 164, -186, -47, -172, 95, -26, -63, 73, -37, -61, -75, 123, -363, -19, 152, 13, 6, 41, -109, -5, 108, 87, -11, -24, -80, 77, -142, -123, -66, -36, 112, 63, -72, -135, -39, -10, 191, 58, -96, -79, 75, -173, 1, -22, 223, -173, 105, 267, 93, 280]
2525B80k70k8K65l35K75k03J96M8j37Pp1J71L3m14K81j06M4L0k20k1L01pl5k08
2549a24K71k12K30j34J8m4M3q9k15K31j14o4Q1Q3j08N4Q7k13Q4K13k77J52J95
2572A48j96n6Mk0K0J13o1p2o2J47NJ4j2K00l66K1J86k57K07J53m97J68K43Q7j28
2597a1Q9p3Mn2P9r8L11l02m5L1j7J95k89O7J21O5j65J3J32l3q9O5j31J69j6o3
2623d3M0O3l6J50l21N06l30j68j11K47J80k99J79j12J38%m6j01J1K88m00K54l5
2646E4K5k87R3j51J18J44Q8j26N7K62j10k52j22J84l20L59Q4l11P2L83o1j39l32
2669b88M72k67j47J84o6Q7p2k58L68K27j99o2R5Q2P1m10J79j37K92k53j62L31
2691F7Q0k37Q7J51L0j41j75K13L0r3PK37k5k26J94j04J25k17M5Q4k35J82j07J24
$$ y = [280, 10, -18, 247, -88, 187, -16, 180, 228, 91, 98, 27, 198, 231, -183, 98, -8, 36, 66, -154, -175, 126, 119, 84, -124, 147, -65, 165, 31, 49, 5, 48, -41, -256, -25, -139, -203, -122, -39, -147, -93, -6, -219, -135, 78, -199, -47, 148, -48, -104, -100, -120, -100, 13, -48, -120, -182, -35, -30, -16, -28, 172, -194, -173, 13, -244, -37, 116, -381, -213, 30, 117, -11, 78, 5, 9, -43, 36, -62, 249, -53, -98, -67, -84, 111, -178, -111, 10, 75, -90, -77, 55, 22, -67, -2, -133, 36, 20, -43, -3, 60, 24, 174, -147, 359, 29, -139, -250, -3, 177, -122, 57, -55, 83, 83, 37, -64, -53, 235, -165, 89, 54, 79, -208, -115, -266, -148, -4, 84, -42, 15, 277, 167, -85, -207, -23, -343, 16, 100, -211, -139, 244, 183, 44, -288, 184, -83, -230, -46, -112, -25, -97, -355, 13, 240, 41, -21, 74, 156, 227, -183, -4, -141, 151, -102, -264, 67, 147, -90, -3, 148, 178, 37, -138, 75, 105, 12, 19, 256, 231, 5, 199, 95, 220, 3, 48, 132, -103, 79, -28, 96]
2715I6j19K45p2l48J27N1K97J14k12j67NLO7j59m2O4J32j57lK02r4j14l2K2P9
2740a5j57L00R9k50ln4J28l22L14l04K88%j72K32J06j84M6N6q0R6rj45J77k82
2764a35J27J52n4m8j61Rk2P6J51J08l51K25j70j80M32j82J19k35J76J52j82p0
2786f3J56j16J86m28K90oj4j42K60j58J61j18k90N06n66K69j00J79j2P4j11L9
2808dM1p1J23p9P4p4J11k31L22l45J53N3j3n1L4j85J24o8j28J03o7J79j47P8r7
2833a65K63j24j17K18p9j24l3K81r7j76k8J34J27j24K7j79K13k7K31m47K18J29
2855A21m21K78p1J04k89K93m1J17m9M8R3l72K97k0J24l83J86Rn9Q0M6J25k30O0
2879D6m2L0j02oJ25j24K83R6j91q2j30J07J40Nj51k2J57k05J48k02olJ15J29k2
$$ y = [96, -23, 222, 150, -198, -71, -20, 277, 391, 179, 12, 17, 20, 87, -72, -114, -50, 82, -75, -78, 124, 30, -84, -116, -94, -15, -172, 128, 227, -23, -26, -80, 48, -274, 40, -264, 24, 24, -148, 84, 190, 6, 52, 108, 28, 124, 115, -30, 147, -135, -8, 144, 90, 42, -119, -110, -132, -56, 95, 203, -148, 77, -93, -273, 159, -23, 96, -139, 37, 189, 7, -63, 93, -23, 163, -265, 25, 19, 5, -137, 123, -35, 126, 8, -282, 224, -342, -73, -173, 6, -6, 68, -43, -4, 37, -34, 89, 10, 84, 10, 121, -110, 212, -133, 20, 73, 60, 9, 43, -142, -18, -86, -214, -111, -178, 1, -146, -68, -165, 98, -26, -143, 75, -4, -128, -161, 120, 23, -153, -181, -47, 80, -44, -17, -196, 17, -10, 221, -226, -8, 121, -300, -22, -93, 11, -278, 15, -26, 91, 42, 90, 183, -189, 108, 88, 212, -171, 15, 24, -35, 45, 91, 216, -14, 46, 4, 34, -68, -74, 51, -73, 210, 306, 115, 33, -97, 10, 150, 155, 4, -18, 139, -66, 82, -120, -126, -129, -14, 115, 93]
2904I3j77K77j83k3J31k6M5k32P5K8K8j35J01p5O7P7n1m5r2p1j71L25Q0j87L47
2929B06l62J60Kj78M15l54K22l08J88j07QJ05n8J5n6J07j22Q3j32J22K09k25j23
2952a83N9K19Kk66K85J63m40N4K85R8l27P7k80lK34lO1M9j06o1R7N9j23J51j58
2977e7o7K23k36pO1m6M91l95L0J33j34L7L7j03K10k76J98j8j19l28O43j32j75
3000c0J94k08j5J66p8M4k1J67Nk40j34P0K06l37L40k92J38n27O15k09J37l9m6
3023i4q0o6J76j4K02j85K03j21n3J22j39J79q6j23N4j62L75l69L56N6l65l9M17
3046B44j03k36J48o9J25l40L98k8j21J65m0l45J12J52j30K19q3pn2M1P5k24J64
3069F5q8n0n1K71j28J89k81K18p0j01J37j45o6K95j7q9K94m57P0L1L5J78j47j27
$$ y = [93, -84, 193, 10, -13, 118, 92, 137, -95, -20, 8, 36, -99, 2, -73, -6, 71, 20, -25, -117, -188, -359, -34, 46, -141, 206, -156, 4, 6, -172, 243, -111, 111, -197, -9, -116, -108, -3, -61, -46, -102, 5, -117, -34, -166, -44, 165, -60, -183, -124, 95, 97, -169, 116, 279, -161, -107, 178, 276, -51, 26, -254, -257, -23, -26, 35, 84, -22, -83, 14, 73, -50, 101, -57, -124, 99, -137, -144, -83, -129, 362, -33, -3, 130, -4, 33, 70, -33, 177, -99, 99, 81, -38, -366, 277, 145, -30, 164, -44, -59, 107, 29, 73, 52, 219, 224, -16, -150, -80, 126, -211, 129, -163, -25, -552, 63, -146, -9, -48, -94, -174, -240, -64, -78, 124, -61, 142, 21, -32, 90, -49, 130, 44, -79, -25, -187, 188, -181, 175, 231, -134, -173, 244, 141, -95, 53, -16, 109, -231, 167, 139, 18, 183, 143, -202, -90, 62, -68, 151, 68, 61, 9, 50, 125, -99, 65, -23, -73, -124, 147, 19, 208, -73, 145, 75, -26, 111, -34, -100, 195, 178, 89, 383, -74, -4, 27, 62, 240, 93, -34]
3093c4J06j23m5J86J70m78L08l26J55K88j04J3k14J55k22O7J92l09J06K91j79
3114Cm3j11J94k22K30q9K6J41k20M3ll9j02N93J32m95j40J3j29j6L84k67P7J01
3138F1R8L7j59j8k95L39J10m5l46rQ6K9K50j56k1J12k23J36J8R8Nk06k3R4P8m
3164D6P7J96k58nK24n16L72q5k42K7J69j77O9Q8K58j20j26mP2j89K78j31q2j21
3188a80L12K6m03M53k25J46l33K36J01k20K18L6j80pK41m8L3m10J11R3l49L62
3210A3k68J95m4J69r0p6n6P1J69j04M5j39J64k96K25q9J09Pr3P7L01l26L75k37
3234A02k51L42k70L42o14L98n9Kp1L72l98J73J21l90L73j40K87k79j81J03J05
3255F7k54J99QR1J25j83k63J43l8K05n2R0Ok32K18K1m8r6k9K07m57K49r6j11K68
$$ y = [-34, 72, -51, -96, 90, 260, -218, 90, -236, -81, 207, 103, 116, -98, 57, -165, -98, 94, -215, -109, 182, 3, -40, -151, 43, -179, 51, -38, -12, 129, -91, -48, -51, -90, -192, 401, 533, 38, -102, -89, -218, -234, 150, -117, -40, 61, 159, 196, 37, 19, -276, 63, 173, 128, -218, -227, -141, -112, 138, -18, -39, 73, -150, -14, 4, 102, 107, -99, -122, -28, 50, 46, 123, 319, 61, 56, 280, -236, 136, 51, -191, -164, 5, -172, -103, -15, 243, 123, -3, -7, 65, -124, 154, 23, -59, -180, 132, 158, -245, 208, -17, 129, -204, 32, 133, -87, 131, 167, -13, -20, 221, 173, 206, -204, -93, 0, -349, 13, -255, -60, -104, 65, -25, -101, -157, -86, 83, -21, 24, -115, 49, -247, -22, -111, -2, 5, -88, -11, 290, -36, 339, 102, -149, 193, -77, 265, -349, 49, -10, -8, -79, 293, -105, 68, 189, -201, 172, 32, 319, 40, -141, -38, 67, -187, 12, 20, 111, 236, 53, -210, -67, -105, 100, 48, 138, 144, -88, 130, 151, 103, 7, -22, 185, -272, -23, -119, -230, 38]
3280C8oM5j93k11L76K2j17m4L72l17n1O8L0k36L5J37n2Q1O4n1k13O8K49k72J72
3305fN1L2k77M57j70L2l8p7r6J03o2K89r1j26M0Q3j69J70l84L22J6j17j9l2P4
3330Ej75j2N13l64p9P3J34k46K25k93m1L18o2Kj46R2O3K7k98L82j8r8P1m1O5j27
3356c0K80m07K54R3j22nj50K70k54L80j38j88J21l9l9J80l71K28j59L4J55k47
3378a54k7j77O13l62K27N7j5q2K7R2j25j64J07m4K3JJ11L2j65j43J95j87K23J5
3402G8r9k1J33Qj85L6L15m47J99j27J92k37L25l46K44rj52L9K63J0l90J60Q3N1
3426A23j44K25k70k79L44j45lL4k0K07j39j07J78O2R6l7l16j1k3L36k63N0K2K64
3450A84l53L84k05j7j43J77m8J76k79K14n0j41K45k94J53j19LL07k10J72k36J76
$$ y = [38, 32, 77, -116, -327, 49, 71, -46, -90, 282, -35, -86, -18, 12, -224, -189, -52, -104, -23, 41, -10, -223, -155, 94, -178, -6, 45, 77, -200, 257, 87, 119, 81, 4, -92, 11, -51, 238, 147, 21, 61, 144, -25, 145, -239, 83, 99, -18, -37, -69, 5, -170, -182, 331, -33, -112, -39, 95, -151, 74, -219, -260, 58, -4, -2, -148, -56, 7, 34, -264, 118, 100, 2, 73, 32, 97, -30, 250, -157, 97, 190, 68, 63, -87, 183, -71, 309, 171, -17, 104, 65, 26, 206, -165, 63, -96, -62, 93, -154, -181, -358, 255, -107, 120, 177, 162, 80, 107, 199, 74, -90, 17, -27, -4, -3, 108, 140, -25, -168, 27, -160, 63, 78, -21, -42, 91, 99, -86, -50, 265, -182, 17, -110, 82, -155, 170, -176, 68, 59, -93, -54, 209, 219, -171, -11, 72, 123, -21, 204, -66, -345, -1, -146, -149, -115, -135, 72, -67, -174, 4, 66, 162, 125, -191, -202, -225, 111, -152, -102, -80, 184, -169, 215, 10, -7, -150, 27, -21, 155, -124, 90, 40, -101, 144, -150, 3, -116, -113, 194, -16, 156, -80, 96]
3472I6k8J86k48m6K47k03K1l6q8L0O4l19J19J44K02kj10o5K65l23l1K66n1k59
3496a69L28k3j69r4K06j97J41K02l33J93J74l81J29j65J67k86K19K43j71l93L87
3517Hn8K21k31J56mk74K90k9k79K06J04m00J01J18J32m57L79m3p2J11m5R6k03
3540a73J27Q8j36J30p6J90k21J88j55n0K54k16p4L3K89j16j69J07K32j30l56M45
3562B11q4l40M17k29J71k25K30k52K14P1m9j21J93Q5m05J72o1Oj48L06j54k1j02
3585a15J10j45p2K56N3j73R3j25K77K0P1j13j58J66m6j66n9M04m84K06J10J29
3607B39k41m6Q6P7J41k25k8j58K56k58J84n4P1NJ9k91J08m4J97l46M54j82J76
3630A40j97k8Q7k84L36j83K49n6Q5k75R7J14J32k86K24j81J97l11M14l73M3K61
$$ y = [96, 68, 254, 6, -40, 207, 4, 25, -11, -99, -69, -5, -324, -205, -61, 141, 139, 29, -36, 229, -94, -125, 141, 90, -169, 159, 136, -33, -127, 79, -118, 23, 225, -108, 85, 259, -122, 7, -158, 9, -277, -58, 185, 14, -379, 8, -50, 171, -60, 96, 92, -182, 108, 79, -200, 6, 110, -290, -189, -71, 61, -396, -17, -60, -132, -21, -66, 30, -173, -46, 42, -94, 36, -40, 150, -71, 117, -38, -88, 166, -50, -124, -91, 198, 82, -87, 20, 252, 122, -234, 211, 127, -213, 204, -25, 146, -79, 151, -101, 113, 184, 135, 14, 207, 292, -113, 59, -2, 4, -144, 162, 8, -13, -115, -5, -150, -222, 34, 87, -86, 7, -118, 159, 179, 250, 137, -21, 145, 99, -67, -126, 278, -206, 0, 110, 239, -2, -48, 38, 115, 256, 31, 3, -155, 101, -157, 27, -27, 44, 49, 68, -223, -115, -159, 38, -308, 146, -36, 140, -57, -85, 2, -282, 54, -129, 120, 64, 149, -126, -29, 85, 217, -69, 155, -26, 171, -140, 274, -99, -56, 205]
3652B05k62J10j08K3k1P3o3j5J67j3j77J43L6j52K1L14k48K45l01j6R7j75J90
3675G3M1l23K33J9j4O1k80J85R5j16p4%K82j04j06K1M2l6L8j46J32K9N3k26o9
3700a90K41k52P5p2M31K2l13J82j15Rk8J38k86K75K50l02j8K11m63J61M3M9N9
3723A07N3q8p6o3k0K92m50J09m1L44l04o0K64j29J63l7k75J25l5J37KR2l52K27
3747a5Lm8l3K21n7j25K04j79K8p6j29K65K77k64k35J0pM54m54J60k9J9J55l2r6
3772A7O3l4N1k5o3j45J45j51J74L0j51j76K15n0r6O6L0K2J17q5J17j26l7j25M9
3797a68L90k02m6M9l7K99k38m1J77j97J25J2L6j30O9j2J46j17p2o5o3N0j23L33
3821A75l19j58O00m20m3L05Oj37M9j27Q2k80L17j56R0J71m20M14k81K08j30N1
$$ y = [205, -57, 53, -55, -32, -53, 20, -43, -58, 109, 96, -81, 62, 98, -54, -33, 281, 33, 278, -23, -39, 58, -117, 73, 114, -209, 24, 43, 29, 90, -190, -5, 90, -26, -100, -100, 182, 78, -28, -7, 35, -1, 37, -109, 23, 52, 105, -121, -190, 51, -201, -126, -198, 233, 255, -58, 124, 9, 18, -10, 128, -158, 117, 367, 65, 47, 258, -205, -44, -1, 48, 107, 160, 72, -4, -67, -87, 205, -245, -136, -177, 167, -137, -197, 67, -62, 101, 64, -211, -86, -121, 16, 18, 110, -242, -15, -12, -60, -93, 128, 71, -54, 150, -29, -1, -77, -206, 59, 336, 72, -163, -153, -160, 294, -160, 0, -29, -10, 145, 113, 17, 80, 46, 97, 72, 9, -136, 9, -142, 32, 62, -89, -265, -50, -100, -196, -130, -100, -78, 39, -46, 71, -55, -92, -217, -168, 222, 20, -26, 23, -14, 285, 47, 6, 183, -14, 111, 123, 159, 29, 98, 86, 232, 115, 43, -22, -85, -35, -158, 175, -144, -302, 298, -122, -165, 140, 146, 9, 58, -69, 13, -267, 50, -106, -16, 155, -265, 149, -132, 76, -54, -3]
3843cK0r1N8N1j13k9j8J87n0P2J02m74K56j3l3K0o6N2J31R3j57j45L47k16J26
3868A07j80l6Q8O6P2J8j06Q5j18j89r4K19no2O7J19R5k57j3J10k21J74L19m54
3892a96Q8J61k13L88L5j37Pm50M65j50J00j61k50L56LL41n52J54QN4j49L3n9K06
3916H2Mm2lQq2O6JO0j94Pj2J09J14jj21J5n8k0J50k06J12j91j0K72Q0j12k12K00
3944A6q6N3Q1l9o3J07j13P1O2k31L03q2r6O3K4k3Nk03M9L3J87L9j15P8j26M8r4
3971e2R3Q5j18k4J44k38l34L24P4J67j79J92k39j5K85m1j15Q5j36J64j34J18p7
3994B9r7J92m31K23J42Q4k13K11j95j5L66j20k37K2K35k84p9K29L0k23j17L52
4016A04k53J73p4K97j77j3k00J63m5j21J36q6P4r8K61r6m5J1j07K4J38J02k49
$$ y = [-3, 17, -74, -16, 35, -78, -107, -125, 62, 12, 84, 186, -288, -32, -45, -78, -58, -124, -72, 59, 152, -5, -150, 197, -19, 107, -73, -109, -21, 45, 117, 135, 29, 114, -4, -193, -287, -68, -73, -135, -68, 51, 146, -111, -124, -14, -235, -61, 258, -196, -108, 53, -160, 228, 263, 126, 133, -317, 148, -2, 98, -63, -313, 43, 46, 387, -165, -11, -3, 51, -98, -65, -124, 82, 86, 44, 41, 49, -33, 33, 34, 94, -100, -93, -105, 4, 118, 117, -4, 11, -47, -67, 83, -123, -11, -202, -212, 60, 140, 28, -184, 16, -70, -17, 64, 25, -38, 69, -44, 27, 89, -142, 161, 79, -17, 46, 70, 47, 52, -151, -102, -69, 118, 157, 42, 120, -6, 42, -52, 41, 126, 8, -16, 128, -110, -444, -120, -46, 121, -58, 134, -105, -120, 165, 124, 9, 94, -42, 122, -12, 106, 29, -68, 124, -307, -84, 58, 142, -71, 140, -55, -70, 296, 176, -61, -39, 196, -88, -167, 62, 92, -131, -248, 104, -149, 24, -50, 247, 70, 57, -143, 20, -25, -146, -10, -96, -22, -120, 141, 45, 0, 11, -96, -72, 66, 168, -81]
4039h1k3K71j67l4K27M5k40P8k3q5R6R1r7Pl6pR2j12o4J86k71K30J08l24m8J99
4065A8J8J77k83J12l01N35j59k06K62k23J75j62J56r7q3m1L49k53J79k66J04J41
4087A52o9k50J63l4J48l30k47M45j07K43m39K28m8K97j13J02j90k8j13J80M3p
4109B6j6j02J15k3J89N1O7l02J75k74L14k33k8N7j98K94l38J38j21K08j65J36
4131c0m3J57j08J18j14Q8j92J53N2k69J11J89j50p1J95K68o08L14J3P0o1r2r3
4154a03J5PJ18j52J88l3J31k93K98j27k57K90m72L77n5J75M5m5k17K20k04J12
4176A8j7l3o7O3J44j30j10J81p1O8N8k11L5J23j78M6J49p8j5q9K53j94L56l17
4200a6J2j7m10K98Q1J04l24L82l1j02RM6j3J29K4q7k73J34O1J37r0l44J98j33
$$ y = [-81, -104, 167, 0, -34, 193, 238, -2, 76, 53, -32, 64, 155, 58, 65, 29, 22, 114, 2, -62, 124, -147, 83, 191, -133, -181, 18, 36, 213, -70, 42, -259, 276, 117, -89, 173, -50, 125, -37, 119, 22, -61, -102, 247, -6, 173, -93, 11, 152, 83, -167, -4, -38, 110, -220, -467, -22, -129, 114, -325, -97, -145, 152, 39, 141, -49, -77, -190, -10, 33, 26, 10, -92, 23, 0, 189, 240, 307, 5, 180, -94, 220, -13, -41, 16, -182, 112, -226, -88, -209, -1, -166, -30, -73, 84, -24, 94, -20, 68, -124, 29, 81, -188, -77, 112, -38, -109, 86, 354, -254, 60, 73, 143, 82, -10, -103, -88, -81, 37, -115, 73, 40, 171, -122, 176, 49, -208, 82, -390, -13, -68, 107, 152, 107, -110, 110, -94, 18, 1, -32, -99, -36, 108, -22, -132, 49, -22, 46, 104, -107, -72, 51, -127, -81, 68, -10, -25, -114, 139, -55, 301, -16, -4, -21, -431, -133, -52, 52, -272, 110, 79, -23, -14, 32, 19, 148, 172, 85, -188, -54, 7, 144, 54, -290, -92, -225]
4224b25K03J16q7K39j68k78LNm4J52qN6q2R6J63j77p8K8m9j3P7j21L22p0Kj13
4250e1m7o6j1K98q0j12P8PJ33l8o1Lk30K34P3m9j54q2L33k16k4l7J97k9j57k45
4276c33K70K49j30K2J54o7n1j1MJ7L4j78J05P9L4k09k43K45K20k63J09q0L1j3
4300em0m5kJ38q0q6P0K77n06K92r9O5M0J0o8M4K8L9k34J38O9J9o2J46k49J58k32
4327a75R7J04p8L25l38N6M6%J1l4J92j28j99K02L0L2J18k21j92J2O6J77r8O2J11
4352A78j65l65K67l8n7K6J83K3k44K83n5Nj14J13P4j98PR1r6j72J56L73m28M67
4376C14l61K77k70j90N2K82r9K46n04L08m14K50J41k06K4n3K1J14J99r0J86l10
4398h3K3j74K27o3O4J89l99J39O8n6L2J40l0J91l9l17n4J15Q7m5K86l53J74j86
$$ y = [-225, -22, 94, 7, 246, 78, -200, -197, -192, -236, -84, -92, -36, -118, -22, 141, -36, -114, -86, -135, -148, -71, -192, 130, 60, 62, -51, -98, -164, -175, 123, 43, -69, 9, 16, 149, 111, 50, 53, -177, 57, 130, 81, -73, -155, 178, -38, -62, -99, 98, 69, -88, -333, -63, 186, 56, 78, 232, 165, 114, 103, 107, 124, 158, -20, 85, 164, 198, -11, -254, -9, 211, -52, 57, -23, 8, -5, -45, -90, -92, 46, -34, -120, -50, 227, -279, 13, -86, -21, 19, 29, -39, 5, 33, 72, -162, -24, 45, 64, 2, 148, -101, 57, -175, -78, 26, -52, 273, -65, -9, 37, 37, 48, 14, 206, 78, -121, 81, 111, 143, 261, 40, -152, -140, -74, 103, 5, 67, 178, 13, -352, -85, -123, -180, -154, 29, 52, -192, 91, 36, 41, -73, 40, 114, -84, -77, 14, -82, -254, -98, 275, -153, 314, -47, 230, -40, -230, -178, 104, 5, 251, -253, 55, -359, -109, 32, -174, -150, -203, -182, -68, 131, 41, 227, -83, -60, -234, -7, -70, -6, 183, -216, -77, -9, -65, -33, 107, 77, 268, 229, -88, -142, -27, 60, 15, 301, -52, 122, -64]
4422f4l0L40j82L6k09P1Pj38J99k77K40J68k07K98j67k1O7r1P0o1n7Q0j42j89
4446b59J79J28R5P2k38j77J03K61k82J63j41J79j87M0Q2p9J69k39N5pJ69m6j07
4469f7K37j32j33M17k40m10K85O3r4J43q7K47k22j95LK28o1MP9j54K53j55J16
4492A25j2j02j78J45R7j5j31K27k44P2N7r5K68j33j75J37oj64L8J58rj37k32L40
4516C1K7K9j97J77p0j07j1J58L0l10K86n3j16K61j5Ql23J52O0NQ9k14K00K4j61
4541d0J1O9k13J89J71j02j8j33J95k52J70j47J82j84J25M9L4nr5J71k31J41l10
4564b23L07K49m83K36k9k04j36M25j83N3j72K92p1j13m8j0J50O5k28L13k42L62
4586C10l20j33K73r4l04J76L88k93o2K29o7k78J6O3L01k79J12q8m5o5K49l4o4
$$ y = [-64, -94, 246, 64, 100, -109, -38, -31, -169, 30, -247, -7, 161, -46, 252, 85, 64, 131, 40, 110, 49, -8, 72, -70, -259, -80, 48, 143, 215, -23, -200, -97, 164, -118, 45, -96, 83, -104, -64, 18, -61, 108, -131, -76, -83, 86, 40, -67, 170, 38, -95, 322, 82, -328, -43, 20, -74, 69, -18, 229, 7, -188, -185, 43, -18, -14, 65, -89, 164, 9, 125, 113, 11, -167, -22, 75, 60, -71, 156, -88, -16, 41, -54, 214, 81, -94, 43, 37, -127, -89, 69, 60, -77, -309, 31, 58, 87, -110, 67, -3, -110, -121, 37, 67, -243, 43, -10, -126, 135, 120, 128, -195, -43, 17, 22, 111, -103, 97, 121, -40, -29, 40, -173, 16, 187, 85, 67, -66, 129, -123, 47, -100, 82, -102, 23, 72, 106, 101, 6, 177, -54, 87, -223, 84, 333, -150, 86, 57, -147, -283, 142, -41, 12, -160, 132, 61, -52, -100, -110, 40, 105, -123, 190, -52, 310, -10, -143, 130, 36, -268, -92, 296, 3, -59, 170, 103, -175, -159, -96, 205, -74, 38, -50, -95, -160, 89, 55, -9]
4609iP3P2n8K2l13J32J18n8O9k5j96K41j09pk8K48j92J43l7l39K27M8mm3R2l47
4635b80N35k29j27K41l1p3k26J60J68l40L87m28J12L56n5k79P2J38k50K25q7o5
4657g6m6j57L32j21K24j75J93k10N7N3l23K14OQ7Nk34J69N9K8m20M44p5j48j81
4681b95L01kJ6K1OR4m2j51j5%J19l1m7J69k05J38l3Nj78L59j40qk24P7J25r3J66
4708A32p2J02j66K2j01J00K42m32M13j08j09O9p9J12n7j16J40M5j76N1J76l18
4730a30J40j2q8J02J31l9k56Q3R5j6j85L53l13J78lJ16Q5k06k23M15k38M0J83
4753B12k04j82J29K41m58K57Q6j26P2lM6k36L16k08J2Q4j53K26J1n2J0n9r6n5
4777a30M22j83j1k98J68J49j6nm1p4J83j69k2J05j82M14m82K42q1j06OJ42K16
$$ y = [-9, 64, 136, 78, 100, -213, -81, 37, -21, 48, 23, -173, 68, -41, -48, -76, 172, -20, 123, 86, -253, -26, 22, 18, -25, 67, -280, 255, 26, -101, 140, 109, 36, -190, -30, 138, -202, 185, -243, -131, 225, 170, -109, -37, 101, -149, 76, -11, -76, -122, -279, 53, -68, 156, -19, 174, -36, 21, 74, -249, -35, -29, 58, 63, -171, -2, 57, 85, -335, 109, 34, -114, -295, 6, 4, 20, 41, 47, 141, 99, -52, -67, -67, 52, 21, -26, 143, -62, 76, 43, 48, -130, 229, 89, 81, -143, -66, 59, -34, 132, 60, 162, -4, 18, -83, 17, 259, -173, 240, 132, 23, 92, 13, 125, 68, -48, 92, 137, -39, 12, 188, -130, 10, -2, -90, 12, 143, 104, -152, -69, 26, 10, -175, 178, -135, 43, 40, 156, 241, 35, -188, 227, -11, 29, 212, 8, -174, -45, 196, -262, -5, 81, -45, 27, 24, 70, -166, 150, -58, -46, 38, -115, 111, 122, 70, 80, 21, -75, -130, 292, 109, 98, -200, -32, 117, 101, 96, 55, -19, 164, -5, -27, 78, -104, 310, -172, 70, -11, -117, -111, 31, 247]
4800B47m30L94k27q1Q5j55M45j29n0N6k37l3J70L2j01K10j17q4J8j7K11k40K10
4823A77jq7K1k39m2P1J42j02J01Q8j12k75K84n1k2m0M7P5J37N5k14J84j35p0L5
4848B7j94K90j36j11K48p7n6j26J01kJ86j11m1q2j8J24j87L33j67l2O2k6L9L4
4872G8j25r5p1J52J89k87J33K70k79J14j47p7K2J50PJ21k11j48M98m53l6J52J02
4895E9%k43J07J5l7J09j17J91k11L43j50k8q6M3L1l10K82n9L92k20l6r1M4j41
4919a13K80J04m01m3M1M32m58K80q6l15J88O3j01L7k7L29k9l05k3L28k44l7J16
4942A6j47N0J21o9J55k62K61j94L07k80J05l0Q3l54L05q5r0n7J69K83j06q3j80
4965h2L61j79k04r3K33j21K16j99J64j02r3j85J15K05J7R1J7j89K0j42L47k10
$$ y = [247, -183, 211, -16, -97, -12, -167, 278, 149, 99, 155, -82, -115, 55, 87, -14, 196, 79, -5, 13, -4, 207, -33, 177, 176, 89, 110, -129, -171, -100, 42, -60, 41, 129, 17, -258, 26, -25, -47, -87, -40, 35, 172, 227, 13, 197, 62, -8, 27, -167, 123, -13, -124, 124, 47, -9, -135, -34, -36, 150, 39, -2, -84, -102, 22, -165, 168, 1, -31, 31, 5, 44, 78, -47, -142, -213, -61, 128, -159, -26, 244, -35, 79, -68, -145, -123, 27, 34, 155, -56, -204, 294, -159, -195, -43, 59, 59, -184, -77, -62, -99, 10, -107, 84, -127, 216, 66, 38, -48, -5, 26, -284, -2, -61, 331, 111, 75, -16, 28, -113, 167, 271, -130, -173, -132, 300, -158, 122, 36, -279, -91, -28, -129, -92, -119, 210, 181, -124, -147, 181, -63, -100, 16, -131, -81, 40, -29, 126, -136, 125, -69, 238, -42, 63, 33, 116, -238, 67, -18, -108, -165, 4, 287, 181, 98, -82, 279, 100, -104, -197, 36, -85, 131, -68, 96, -6, -99, -284, -169, 36, 53, 144, 161, -28, -8, -150, 197, -13]
4987a3j6q8M29q3k69j3K6R2j31K29j12K35k42J19j96j47oL02k49J62q9k3N7j36
5011a62J51K3j47L21j70j36L19k25P1m0%P7o0l5R7j60L22k67N8j80J80j13P4k16
5035b18M58j34k31K92p8j17j4K38N4j34k58o2J22j10J41n5J19L5J16j91j29N6
5057a00jK3J44PJ85l98j6K28J4k93L52J21j29p0O1j86m9K07j43Q0J43j50Q5k28
5081a13N9J11J55m0k98L5M7Q1l7O5j41J53lOk10k62K15K42q5J97m27L95J03l29
5105h1K41j48l9K6J32j39K41r4j89m5N4j8O4L9M3k88K48n2l9K1j02kJ37O8N9j00
5131C7q0R0j70L86m30N3Rj4K84l16M12l15J93nj05k04J28J17j47L1M6J13k11J77
5155G9m63L55jk1k3K13n5l00K32M4j31j48M02j55j29K74k67R9O8q9j09K76j77
$$ y = [-13, -29, -117, 312, 229, -40, -53, -27, 65, -66, 163, 51, 286, 44, 163, -33, -180, -186, 116, -133, 29, -60, -83, -26, -162, -11, 12, -135, 186, 16, -120, 199, -26, 45, 5, 5, 82, 22, -13, 84, -76, 246, -21, 37, -143, 37, -76, -2, -218, 240, 106, -125, 167, 89, -28, -42, 196, 250, 116, -142, -204, -82, -192, -51, -106, 13, 48, 164, -27, -156, -100, -101, -78, 66, 73, 258, -140, -156, 72, 86, -207, 145, 266, 137, 67, 128, -58, -107, 100, -43, 37, 180, 30, 115, -113, -54, 57, 212, 172, -126, -91, -44, 37, 0, 65, -76, 77, 74, 80, -130, -392, -177, 65, -20, 177, -250, 145, 248, -81, 160, 12, -27, -1, 131, -8, 233, 139, -50, -95, -41, -59, 5, 44, 87, -201, 47, -5, -44, -23, -125, -127, 10, 78, 137, 37, -43, 47, -123, 263, -167, -114, -105, -119, 165, -151, 261, -54, 139, 134, 29, -175, -47, 70, -77, -46, 0, 113, -98, 79, -384, -29, -30, -51, -74, 139, 84, -216, 16, 60, -71, -219, 183, 28, -101, 173, -94, 5, 73, -16, -125, 151, -26]
5178b6l9R9K1M9p5j14J61k04j83L98r7j57J8K10m9N7l6j09N0k02J37J21j12L7
5202d5o2J78l6j16R3p3O6k35J02M0J31j5K5Q7j98j20J39j24N3J22n7O1j09J63
5226G0m4K58l18J22l37J23J22j81K62l2p1K17k06J99m80L16J13m6k21J49l1O5
5248D9K16j32j89R5j25L13k72O6Mo7J96j61J30J9j87N2O8j74j11J87K6Q1m8l8
5272bK48l15J59n6P8m5L3O1Mj6r4K9K3j72J77j02q6j24J56l7O7J77r0J07j99K0
5298Ak17K19M6J19k14K02k23j9J19p3M7K0J5N6o0m7Q0k08M3R8K16l08Q0r1J35
5323C6j66K99m48M51j63k7J55k13L25k45J06r2m57L52J76K9m12K40L8j1O9K50
5345B92j27j19k98P8O0K96l20J03J21j00J07j40L32l42L3q4J06P2p9O0n2K46k65
$$ y = [-26, -65, 34, 55, 104, 29, -85, 76, -128, -311, 87, -10, -167, -149, 61, 12, 69, 33, -76, -26, -228, -91, 30, -82, -45, -107, 71, 35, -81, 12, -61, 5, -230, -128, -88, 43, 28, 53, 140, -58, -178, -39, -163, -110, 12, -45, 16, -93, 70, 26, 284, -34, 88, -249, -126, -4, -185, 77, 45, -26, 191, -15, 184, -296, 20, 133, 87, -134, 15, -16, 49, 265, 133, -56, 39, -86, 227, -45, 21, 25, -42, 154, -7, 123, 142, -45, 7, 75, -99, -210, -23, 3, 84, 36, -2, 246, -69, 90, 34, 112, 67, 100, 161, 165, 149, 55, 84, 107, -65, 112, 10, -76, -200, -44, -81, -14, 163, 73, 180, -19, 1, -216, 3, 49, 168, -46, 156, -67, -86, 33, -40, 7, 27, 42, 98, 38, -9, 71, -137, -94, 4, 220, -88, -8, -99, 36, -130, 169, -279, 172, 9, -18, 137, -76, 249, 4, 110, 18, -439, -87, 89, 118, -294, -54, -16, -27, 42, 292, 165, 46, -252, -174, -114, 182, -138, -35, 86, -14, 93, -47, 285, -57, -24, -108, -2, 70, -9, 51, -1, 245, -20]
5368b0j00K24k06J03K59k54Lj2j37J87K2k38P2J6Q0L3Q9k62J86j16K1p8J5R9N5
5393D1l04J78R9J16q8K33k71N5R0Q5m75K34n8J91j04j2K6J3L3l27J85N5N8j23
5417g0R3k31K39j44J18K44m47l0P1J38N9N8j43J23j06K08j05j94J22J00k51L0
5439a18J24O1n8N6j91J91k46K71J83l21m2K09j95R9k1J26k11J37ll90K82J99j69
5462b7J15M4l6m0j35J01j18r6J99l9K1p4O4J20J51k60j21J1J46m7K96l93L6jK18
5487A35j83j67L31p7J23j94m3K16l44P1J0O1l7Q9L0j46L84j64k5L9k65L09j11
5510D2j52L9J32j90L5J46j59j18K81k41M02l08K9j83K29o2R5K07j71m01L13%J60
5533A25j42j3l4J41K8j73K09k26p8J26J9j01O5J59j15J25r1m9J36J4p5J25k91
$$ y = [-20, -120, 104, -102, 1, 260, 6, 9, -3, -140, 47, 69, -169, -97, -81, -1, 32, 121, -141, 45, -71, -50, -128, -113, -14, 41, -263, -85, 14, 130, 42, 275, 4, 59, 149, 234, -241, -7, -65, 126, 22, 10, 36, 49, 82, -245, -60, -5, 53, -70, 23, -208, 31, -113, 5, 249, -198, -228, -157, -19, 40, 98, -45, 78, -28, 180, 75, -119, 3, 103, -148, -118, 6, 67, 9, 65, -126, 65, -181, 90, 273, -48, -90, 119, -76, 23, 2, 128, -83, 54, 51, -339, -57, 142, -27, 88, 132, 96, 56, -79, 22, -96, -192, 7, -32, -11, -85, -21, 99, 250, -10, -131, -120, 26, -21, 275, -118, -82, -83, 135, -48, -215, 116, 39, 162, -32, -75, 141, -203, -132, -122, -61, -98, -9, 21, -125, 259, 95, 70, 109, -156, 153, 42, -110, -71, 61, -129, -94, 52, -107, -225, 56, -185, 217, -91, -62, -245, -16, -78, 17, 224, 53, -348, -35, -35, 125, -17, -30, -64, 77, 105, -68, 141, -85, -163, -37, -18, -119, -54, 105, -10, 115, 24, -25, 111, 125, 50, 175, -116]
5556a16K83j44J01l04j0Q0r2K25L4J24k58J61k4m0k3K7r2J13j75K56N8l40J49
5579gm3J55K43m43K71k16M2Q0R1l16p2P7J73J8j85J90k74J19L8l7J98l95L34K63
5603C04j66j85m4oJ56J69l08M4k1K45j10n9P8K74j97k76J5K30J5j57j30J91O8
5626A30m8r2j87J73n2J99k52K57J41k93q7R5j4J1K10k00Q5O7p1N4j37Q9r4j87
5650b03k1K85q4k9j09O5K69j95k7j3j35J60J11NLJ45k81j38K04J80l10Q0n3K07
5674A16j54J10J25l00O1J80q5L8K9j13J7j01K42q6j20J80R7l14K79l25Q4Q0K6
5697F6k73J43o5M0K32k51lJ56k36M17l17J11j94J79J19o5j02J29L4k81K66j81
5719g6J62R7k10J31k08r0P9p2K36n8m1M7M7k7q0K03k69K9R8Q2K3n0j22K52k01
$$ y = [-116, 167, 23, 124, -180, -190, -110, -202, 23, 57, 181, -77, 84, 60, 20, -3, 24, -68, 45, -130, 126, 184, -156, -7, -50, 105, 348, -95, 176, -40, 2, 82, 173, -143, -215, -138, 35, 53, -132, 58, -216, -97, -59, -96, 102, -293, 41, 304, 138, -47, -91, -97, 59, 228, -80, -36, -57, 188, 78, 19, 97, 371, 174, -102, -87, 143, 158, 1, -129, 62, 130, 82, -10, -197, -24, -76, 123, -129, 128, 269, -24, -111, -16, -30, -19, 191, -9, 76, 143, 72, 126, -11, 78, -16, -203, -224, 61, -23, -52, -161, -96, 173, -22, -49, -62, -197, -37, 74, 79, 82, 227, -54, -192, 12, 192, -118, -38, -91, 116, -38, 72, 197, -103, -42, 138, 53, 91, 120, 7, 24, -77, 165, 79, -41, 139, 236, -78, 201, -124, -40, 40, 66, -207, -64, -129, -89, 143, -108, -111, 45, -191, 226, -91, 20, -174, 5, 124, 59, -43, 86, 120, -161, 105, -76, 86, 183, -27, 104, -104, -194, -115, -187, 49, -9, -50, -3, 44, 17, -63, 140, -129, -100, -2, 80, 103, 53, -69, 183, -18]
5744a8k1j43J77R6%M3j22k13M5K02Q7k9o3l7J8J6q2J37P9j36J03j30j54J68q9
5769f6J07o9J00m9p7J55j34P0J1L9o9j07nK78k21k8M8J6K9j62K01m7K06k29P4
5794G1p4J09l29J27M40j30m01pK68m69N42j57J71j31k45J63j70J07J52n9j23Q3
5816f2K1J3m3J26O5m6j69N8P8Ql42K60K41l48M3R9k1p3J9RN7j77L05k15NJ57j4
5843E4K5q5J01n0R3l09J00J41n3p4k38M00k27K0MJ54N4k59OL77k55M3j41J64j02
5868e7L48m43L44nk17L59l00k4J13J39j55k28K30k92j34K50J78l38oqP2JN1k4
5892a46L10p3m7j54K29l56J94p4K19l5M9j40L2o3j09J57J97l59l11O16k66KJ22
5915fm3J38q1J83k10n7J89o6N0j81J90%m1l13N15m79M56j58rQ3m20J22M7P4J1
$$ y = [-18, -39, -182, -5, 91, 91, 134, 12, -201, -156, 46, 133, 104, 41, 4, 22, 38, -44, 93, 172, 36, 139, 9, -145, 23, -66, 41, -28, 72, 23, -54, 101, -33, 37, 48, 87, 18, -89, -94, 184, -37, -65, -17, -1, 28, -134, 67, 20, 226, -3, 71, -3, 106, -223, -96, 344, 214, -187, -194, 74, -395, 147, -10, 161, 30, -215, -52, -222, -115, 37, -22, -145, -62, -41, -28, -71, 55, 120, 74, -95, -37, 41, 49, -293, -33, 208, -140, -97, 2, -19, -92, -73, -64, -7, -184, 121, -94, -89, 68, 54, 79, -6, 95, 45, 138, -171, -71, 70, 17, -57, -295, 105, -122, -102, -98, 56, 110, -149, -143, 234, -21, 22, -119, 45, -57, 291, -152, 192, 187, -30, 329, 29, 5, 118, 257, 102, -126, 104, -188, -322, -72, 106, -232, -238, -246, -174, -173, -122, -146, 164, 91, 44, -110, 119, -237, -43, -117, 102, 67, 116, -24, 8, -55, -164, -7, 190, -169, -480, 136, -130, -128, -6, -49, 89, 8, 191, -19, -76, 113, 47, 97, -84, 106, 106, 65, -248, 267, -212, 244, 86, 77, 160, -260, -138, -91, -17, -6]
5940fj3j38J8L98j47o9q7L6p3K03l20K12L1l17M21j52O0q3j57J13K4J67r2j21
5964i2k7P9N5r1j58J90K4n6K54k40N0J03L8j16q3K01k28P7M1N5O8K9j84l19K51
5989g9N7O6j15K67m08J70R8J38j34j15R7O9j59K00n9N6j39K1k79K22M5l04J55
6012a30K5J29j3Mk0Q5mp0j18Q4l00L62q0L7N0J49j98m2J17k43L26k97N5J34j04
6037f2k4k6O0M8J62j76k67K68J67k27N2J09m3j6j17K06k30J0J68k10J84J94k16
6060A4q4L19j84j35K69k56J02j92qQ8j58K70J41o0l67J29Q5o2J78L11l28j50j09
6083a87J05j60O9R3N1J1J11J9j74oR3j09M5j58M42k95j62L18l55M66m41L65j36
6106EJ88j83j56P0J39k34J50K8J58j86J84j31j02RJ35o5j7O3n1r8n7J79n6l5k6
$$ y = [-6, -19, -157, -139, 259, 112, 43, -44, -8, -81, 122, -198, 14, 45, -272, 149, -3, 57, -26, -183, -70, -46, 121, 29, -92, -119, -40, 15, -76, -234, -44, -20, -76, 178, -62, -12, 91, 129, 13, -70, 131, -97, -20, 21, 76, 144, 173, -11, -330, -79, -22, 44, -71, 196, -212, -42, 56, 194, 60, -55, 42, 111, -48, 152, 93, 149, 10, 31, -248, -26, 19, -285, -130, -105, 24, 11, 15, -5, 80, 76, 6, -112, -28, -328, 34, -46, -9, 41, 190, -8, -50, 67, -176, 150, -147, -92, 42, -62, -86, -112, -52, -4, 158, -18, -285, -17, 150, -77, -25, 84, 41, 25, -92, 114, -116, -106, 62, -148, 36, 230, 14, -70, 249, 65, -70, 199, -57, 45, -147, -155, -67, -225, 45, 186, 126, -241, -112, -27, -89, 89, 400, 72, -78, -187, -82, -242, -173, -80, -29, -18, 93, 112, -62, -68, 25, -84, -39, -197, 245, -50, -212, 106, -249, 217, -224, 141, 5, 193, 10, -146, -76, 63, -171, -21, 7, 165, -21, 163, 32, -70, -61, 74, 9, -8, 55, 4, -94, -151, 28, -28, -63, -89]
6131h9J17k28l7K18L1J2K4Pm8P5j50l7L11p6m68K28J04P8P4k10J03J73j71K5j36
6156g0j58J46L3j30lK49k34J07j34M72k45mO1J05m66L34J71m31J57j07K39j7j33
6179e8k10M10mN7k38L9J7j96K73j3q8j6%j26k0J53M5j53R6J17l99N43k62L1j09
6204a11j5L07k11k31L60j70Q2j78M03l17J3J5P1n9k0L52l93K60J29j3j72j73j9
6227i0M8J12K7n4J33k68J06j94K80r0n9j49L46k00R1n5K7k27K22k68J60J55k74
6250b21L42k59J70l8n3jR5j22mp0K12l3R1r1L5M5J77k81N0q1J25j71L11M6k80
6275foP4j93J82l18K82j20K24k38J92L3k49M1J01j88K11o3Rj45j57M99k14j48
6298a97J02K22k39k6m2J80m7j41j6K84k1R1k04pK36k65J04J31k06m7K4j99K81
$$ y = [-89, 28, -200, -237, -19, 12, 24, 48, 55, 7, 82, -68, -105, 206, 130, -338, -110, -6, 72, 146, -64, 39, 212, 41, 66, -70, -228, -82, -49, -179, -182, 67, -167, -60, -194, 278, 33, 29, 90, 195, -271, 63, 234, -197, -40, -147, 92, 75, -58, -268, 142, 138, 195, -43, -4, 13, -183, 90, 77, -11, -27, -27, -153, -173, -20, 25, -128, -32, 85, -314, 229, -33, -2, -111, -126, 181, -30, -261, 99, -71, 11, -167, 236, -81, -68, -53, 18, -41, -61, 291, -102, 158, 287, 274, 102, -71, -90, -42, 70, 97, 43, 176, -92, 14, -180, 100, 10, -49, -198, 148, -52, 39, -16, 11, -216, 6, -262, -102, 53, -221, 121, -138, 32, -6, -59, -60, 35, -87, -91, -161, 51, 18, 109, 18, 53, 98, 275, -6, 44, -37, 88, -83, 228, 274, -6, -12, 62, -131, 51, -267, 15, -105, 119, -119, 73, 106, -143, -102, -1, -189, 22, -41, -32, -177, -334, 165, -49, -197, -95, 127, -112, -138, -180, 0, -47, -188, -204, 80, 59, 150, -54, -61, 175, -90, 14, 145, -61, -108, -84, -283, -2]
6321bj22j18L36J7l68R8Q0K48k06R3p1k37J43q4J08O6m5M9J60m63N33j36O2j51
6345a0P5J41k09r5J82R4k11J98L3o8j23J23k28lL75l57O1J97k11K45o0K7k99K9
6369i4MJ31k9l55L28o3n9K41k28J94k48J13l8Q4P1j66M4J23l00J51j9r9K22k1
6393a3k4J45l6j43K73O7l30R1n5o3K19k05J16r2jj88K17L5P7m9j10L7m5L7j48
6418a88J86j34K07P4K2r5n2K2q8J29o5m8J42k10J48k31K98o3J22L9k99K51j69
6441bL0Q9L2k20J22j48j18L0q5L37K04j99j38Pm1l1L77k53K7J02k11J32j72K01
6465G2j68J33N1j50j48J42k6L0j4J81k19jk00J73K72k71j59L62m5O7lP5j25j55
6489a26q8m8jK85N7p1j63K65qk21qJ42j2K23l40k38M31j10J13q7k39M13K5k58
$$ y = [-2, -124, -242, 94, 111, -257, -159, -79, 169, -37, 56, -15, -252, -109, -193, -85, -19, -64, -15, 145, -318, 215, 79, 141, -10, 65, 206, -3, -98, 84, 178, -33, 165, 198, 130, 7, 130, -98, -101, 274, -83, -22, 175, -36, 209, 149, 176, -123, -94, -90, 41, 12, -343, -15, -78, -137, 104, -124, 70, -178, -65, -103, -19, 52, -114, -70, 53, -247, -96, -115, -214, 8, -13, -37, 108, 72, -71, 202, 269, -61, 30, -25, -88, 131, -74, 42, -50, -51, -239, -22, 13, 90, 41, -69, -32, -77, -40, -188, -2, -136, 71, 145, 167, 72, 20, 42, -46, 83, 18, -30, 112, -98, 50, -181, 117, 54, 176, 215, -84, 167, -2, 28, 117, 149, -71, 51, -97, -215, -185, -270, 67, 271, 72, -66, -59, -100, -131, 246, -7, 20, 122, -89, 43, -129, 72, -96, 37, 88, -62, -210, -68, -94, -64, -78, 103, -116, -117, -317, -144, 128, -143, -302, 60, 15, 82, 79, 154, 29, -126, -214, -262, -263, 22, 79, 8, -155, 110, 102, -119, -127, 15, 3, 226, -114, -352, 79, -31, 82, -5, -244, 169, 194, -64]
6513f4l2R4r6K74j91K5q7K31j79o7J46j81L22l55MK39J8K6l8q0p7l7QR6j94K94
6539I9Lk74K23k32J3K75j78J60J03r8J05k57J8j05J99j63j19Q4K51k6j35J51M0
6562A37k28J73j97J27PJ1r6Q3K46j96j70L21k3L09n98N0K97k26j74J59J36K4j60
6585A2j49J50R8n3r4L98n16K94m14J47L44k77J19j70Q7N4k22J04m9K19l08O6L38
6608A78l8k86J84P9j53m9o4J25J93j18k41M06l43J52J95j93j9R4J15l48Q8j37
6630a80L47l44K46j67J85J72k68j52J65k19J95j31K13m0R7j12M5k76L31j98J60
6651F9J63l15J51N9j08l3J21Qj52K4j94J0M72k83J45k07J01j38O0J05l51K26K0
6674d7MP6J51l76M1J00kJ42p6km2J35j38J33k00L7J53k0J05m4k10MR7K4o9p3k49
$$ y = [-64, -96, -2, -98, 176, -15, 10, -77, 154, -25, -92, 54, -127, 195, -160, -156, 83, 101, 127, 89, 9, -68, -105, -97, -1, -195, 99, 102, -172, 51, -181, -168, 107, -71, 89, 192, 94, 199, -58, -40, -145, 54, -109, -228, -144, 107, 81, -54, 97, 137, -91, 82, -115, 12, 19, 30, -66, 17, 263, 67, -103, 218, 195, 504, -94, -44, 253, 27, -147, 12, 148, 172, 12, -137, 13, 111, 58, -36, 362, -154, 140, -274, -127, 217, -60, 59, -111, -24, 30, -192, -88, -137, 82, -226, -160, 178, 140, -146, 38, 117, -36, -85, -149, -24, 169, 51, -190, 216, -127, 25, 220, 27, 8, 102, 217, -131, -43, -180, 167, -177, 69, -98, 87, 259, -9, -161, 4, -215, -20, -151, 62, 22, 119, 7, 52, -224, 107, -91, 69, 232, -83, 68, 127, 19, -14, 107, 115, -37, -13, -207, -197, 275, -8, 137, -70, 31, -107, -47, 58, -293, -67, -47, -43, 33, 184, -192, -151, -51, -53, 89, 13, 11, -31, 104, -34, 99, -101, -64, 89, 69, 174, 130, -80, -76, 21, 45, -24, -97, -346]
6701c46K35P1L7q7L77k34k92K99Ql5j35J75J05k18Jl37K63J93O9l10N4J76L6k78
6725a73P0J45l5j67O0K72j75m2K5j19J53j14J2P3m0O9K42k71J96K26l28J46k70
6748d5J36l83K48J98k5j26m8K65l09J03k3J02j02k06J64k20J24L20l39M21l44
6769h9J76l26M34k40j66M32m55j27L46p3K72q0k93M42l57J00P2L4j32mLK33l11
6792a09K75k52M3J70j58k29J17K28o3o2l8j06K63l22K38J57l09K76p0K1P3l47
6814b04K19J86k03pK4J11k15L35m88N18j57Jk20P4J66j86P1J39j28J7j03J25l12
6837b37K88r8k26k6J86J50J05J75k28l08K38K6k56p7L66k37K67k0J46o6j46j93
6859a71K93K64j78l54K00m6j33J50K02j03k4J77k83J89m34L19k37J66r3L5J66
$$ y = [-346, -111, -40, -3, -90, 287, 53, -239, 60, 68, 33, -102, 73, 178, -40, -39, -376, -113, 80, 149, -161, -107, 69, 105, -173, -103, 42, 7, -160, -100, 172, -3, -45, -20, -139, 14, -100, -88, -15, -55, 14, 256, -15, 181, 407, 79, 225, -45, 91, -292, -44, 154, 129, 3, -45, 220, -89, 14, -9, 93, -9, -215, -51, -271, -147, 173, -166, 255, -89, 87, -239, 195, -45, -211, 221, -234, -361, -15, -88, 184, 104, -189, 253, -104, -4, 68, 102, -30, -34, -31, 202, -109, 166, -86, -43, 127, -31, -260, -143, 85, 22, -40, -78, -184, 79, -243, -5, 152, -157, 119, 49, 70, 143, -204, 15, 201, -2, -9, 15, 126, -89, 246, -242, 276, 119, 120, -100, -26, 140, -46, 25, 164, 36, 53, -50, 75, -237, 51, -47, -273, -299, -113, 37, 142, 317, 89, -219, 19, 45, -211, -288, 78, -159, 108, 88, 234, 168, 22, -171, 122, 386, 208, -146, 54, 8, -125, 25, 227, 124, 100, 277, -6, 183, -251, 68, -169, -3, -96, -61, 105]
6880A05j93o0O7n1J83k90QJ19j21K44Q5o7N0j03o0K25j0m5o7L47m86K69j66N6
6904C9k0O0j19Q1Q2k79M57l17L9m9P5j82N08j58l56K40k72j19L00k64L8K56j23
6927h3J89l6m0K0j5l4j27K03m8R6l40N6J79L5l2J19J26m35L65l03R3P8j11K32
6951A87j19l69K02%j09R1R0j33J54J05Qk8j06P9R2j77J14j86K39l1Lj38P6K69
6975C13k81k0J01k10lJ15o7JJ73j32N9J59k70O0j24J18K6J30j69k74P8K3N3K99
6999A58J53k94p4L27l80K63k59J82M7rk26J40q6J4N0k07Q1J3M6Q6J28l20K87O5
7023A85l18J23k71J92Q6m2J84k34l4R2l9O0mr3K48q6KJ11l07J72Ml27L28Pl6M9
7049E2KRj39L5M53m63m5k8j4J05L36m71P4p3O7J58m6j50J52M7J51j27M4j16j29
$$ y = [105, -88, -148, -81, -132, 51, -239, -231, -112, -233, 11, 96, 29, 79, -24, -84, 141, 131, 86, 19, 366, -120, 149, -17, 39, 19, 79, -40, 41, 123, -156, 301, -16, 23, -26, 49, -133, 375, 217, -139, 101, -171, -290, 10, -254, -216, 40, -83, 106, 70, 30, 50, 35, 1, -126, 77, 29, 125, -215, -159, 20, 55, 23, 142, 268, -167, 198, -105, -12, 66, -45, 187, 68, -301, -99, -99, -208, -117, -27, -160, -6, 99, 107, 79, -27, 52, 144, -33, 81, -105, 134, 103, 106, -32, 44, 313, 32, 12, 113, -97, -100, 15, -52, -51, 122, -10, 49, 208, -62, -2, -126, -8, 18, 148, -21, -295, -217, -194, -141, 158, 311, 17, -57, 270, -110, 153, -106, 76, 123, 114, -112, 28, -58, -44, 6, -201, -120, -107, -61, 25, 153, -167, 120, 185, -133, -10, -281, -89, -3, -45, 139, -95, -129, -37, -76, -16, -20, -113, 135, 49, 51, 162, -145, 27, 31, -296, 32, 39, 3, 52, 54, 63, -76, -41, 412, -51, -96, -124, -138, -33, 303, -168, -94, -167, -100, 58, 12, -138, 14, 61, 212, 85, 129, 13, -116]
7074a16M4q7K54O4j4j90J80KN9j21j44K01j23j33n8L1m4M83j93k25J74j62k01
7097c19M08o2J36j41jp1j01K8J55J44k60qL08l07R8j41K31j74K45k65J5K45k3
7120A40J12k72J45p2j25M0j51n0M3K51k15J48jLm9R4M6j36OP3K10k60k46M82q4
7145A32J3Q7l42J57j19M6K49j90r8M78o41J44J78j82k8p7L43m21L89j78J14j78
7167a24k6K29k34J27R0j07R2N1j91M45l17k03J37P1k17q2J43N6R3k89K4K11j76
7190a97L16J7k0Mj98M5M8j6J58l04K3q2J48J87k86K05JJ76k85K04J00o1l65J77
7214ek4R6K03l22OJ19p7l5K1j85L28L13n49j10R1k6P0R6j61K92r6J10j8k57M8
7239g2n9J47m7k2N1q4J04%n8J71j99L2J58o1j32j00L85m06J29J0k13M87k25J44
$$ y = [-116, -72, -159, 95, 159, 145, -45, 135, 137, 196, 75, -69, 132, 9, -124, -182, -151, -195, 288, 95, -130, 44, -118, -319, 89, 27, 163, 22, 21, -50, -151, -123, 32, 176, -84, -92, 216, -91, 7, -134, 97, -77, 168, -97, -82, 163, 140, 252, -20, 125, 53, -72, -32, -183, -233, -190, 61, -154, -6, -7, -4, -53, 41, 87, -49, -43, 30, 240, -20, -266, 216, 132, 145, 232, -110, 47, -72, -26, 223, 33, -65, 413, -228, -84, 94, -88, -116, -193, 150, -271, 118, -60, 54, -124, -150, 79, -155, -28, 62, -45, 47, 98, -93, 352, 35, -168, -31, 40, -177, -259, -116, -60, 33, -256, -232, -21, -197, 119, 136, 116, 120, -78, -33, 15, -1, 157, -147, -124, -206, -58, 129, -157, 48, 49, 225, -60, 144, 244, 183, -182, -5, -29, 67, 270, -52, -46, 73, -4, -39, -18, -203, 125, 438, -111, -221, -130, -156, -86, 10, -151, 141, 45, 155, 137, -120, -72, -131, 16, -31, -53, -2, -86, 18, 18, -40, 131, -68, -36, 122, 61, -71, -171, 214, -192, -63, -53, -266, 221, -4, 140]
7263A40j2k29M6J39k15J99Q5k00Q0j1o4J1j82K37j85Q1J20qj09J57m6j08J0R9
7287C5Q0M3j57l4j17K76m1k73J5J17J77k59N7j05K52j05K76r5m5j47Q8J49j36
7310E1p5J03k46K78j95L49j94l56M62M9k11j25K42k18q0L0J12rp9M09n11K64m0
7333A0J98j49j9P0n0kk99J70J25N7J99l03q9K52k70P9o2Q0J27j67K0Qj69J04J07
7358B7J04l00K04o3N5J10n44N72p6j74K03L3k68J51j88M42k22k2j33l4K19J0j27
7381b1M9J38j46J27j57J1O5J64j68Q1k13q4L10j80j71R8K75k33KL20k46R0j77
7404f6J52j00O0k70L52j53j6J38j01N0J55K1k53j41J85j6l3l1N6Q6j18n8k21J35
7428a87J98l4J29P6j12k12j55L18o7rJ0OO9j01K43k43J39j28QO2L5R7j47k0J93
$$ y = [140, 128, -101, -55, 84, -131, 68, 153, -47, 33, 22, -42, -31, -213, 24, -161, -80, 40, 32, -77, 80, 34, -74, -64, 35, 115, 158, 1, -33, -150, 126, 85, -188, -173, -56, 121, -138, -81, -186, 66, -39, 237, 142, 97, -50, 38, 187, 51, -24, 79, -167, 111, -84, 265, 71, -285, 177, 226, 15, -110, 132, -86, -166, -136, -24, -33, -112, 297, -214, 50, 10, 208, 59, 40, 110, 60, 58, -241, -71, 54, 111, 310, 7, -82, 170, -100, -21, -83, -3, 124, -43, -23, -15, -184, -80, 27, 131, -169, 35, -28, 27, 137, -407, 165, 89, -85, 118, 151, -117, 34, -154, 288, 66, 44, -89, -123, 96, 106, -21, 28, 166, 20, 147, -10, 1, 66, 230, 62, 143, -70, -154, 156, -24, -195, -97, 178, -55, -53, 267, 21, 111, -66, 86, -14, 46, -224, 128, -25, -41, 97, -4, 46, 201, 222, -31, -172, 13, -3, -36, -67, -11, 75, -43, -101, -322, -187, 11, -23, 106, 182, 70, -142, -297, 21, -46, -55, -45, -39, 30, -71, 172, -71, 68, -60, -52, 10, 45, 142, -5, -25, 168]
7453A68p8K88l45r7N1m3J09J10O6k69n8k12M81N2k66J49k93K68j59j14K73N5k45
7476a09J3j5J94q8o3K65k39l40N36k28Q2J0L8l9k23J54N9M8R1J51j80l90K83R0
7500A00k01M8p4J40j32J79P1k81J53r9J8M6J67j65k31K11J28m3n9J60pP2m40J96
7524d3K4K26j62J23l37J66j66J21j4jK78k14j82J08j1J42j5kJ93k39l5K01j88
7547b7p1j05K19J1K32Mn00J89j33K12K0%m0J50k16J35M7j51n7J75j05O7j22k2
7571h8J57K8M9l74J04K62O4j17j97K08j32R7P6K6l7J31k19k69L43j91j58L77n3
7594H7j04J38Mk11L52k36J00k79j30N80n04K40k02L53r8L32l35r0k0j90k5K63
7616B5p9K49j09k14J10J28k28K51k16K15J11j31k81L06k11J33l9l2j5j9%L3k8
$$ y = [168, 90, 378, 33, -64, -13, -56, 53, 163, 229, -40, -98, -310, 171, 223, -43, 106, -187, 81, -78, -192, 81, 136, -109, -96, -111, 83, -5, -68, 197, -42, -382, 154, -74, 8, 18, 56, 17, -206, -52, 7, 55, 146, 297, 117, -273, 10, 100, -101, -53, -127, 13, -119, 60, 131, -150, 3, -96, -78, -32, 135, -30, -261, -50, 78, 35, -24, 136, 129, 201, -239, -43, -19, 207, 45, 168, -169, -3, -169, -48, -62, -63, 215, 1, -181, -73, -84, 58, 43, 41, 234, -5, -40, 161, -27, -98, -203, 16, 27, 259, 263, -237, -48, -181, 31, 51, 51, 11, 161, -55, 80, 127, -24, -81, 94, -11, 56, -66, -88, 69, 97, 146, -228, -124, 138, 202, 85, -112, 96, -36, 61, 137, 163, 126, 257, 38, -231, 112, -79, -237, 140, 87, -17, 121, 125, -86, 266, 30, 130, -149, -279, 301, -203, 37, -165, 188, 90, 422, 87, -3, -23, -213, -238, 25, -54, 195, 86, -128, -18, 110, -118, 133, -83, 132, 243, 112, -169, 137, -74, 59, 20, -12, -27, -46, -46, -13, -41]
7639d1pj71K8J92mk7k16L72j9J3j25N2j83J4K24j52K45k20J10j56K3j9m9J57n
7664C6Q0o7k90K01j14J67j40J85k99L42j10J1o5J19m5p1L5On1L18n32K50K23l80
7688a91J86J91j09K41k71j29P2K83k63K18j80k3j09K49l32K09J78l43K35l7k47
7709a72k5K18J45k72R8k23L14j07j19Q5pp5r1L21l09K46p6J45j21J96m2k21R1
7732ak5J01k48L24j12rJ18k66K75j06l81L04J30j65J88m7j69J13J02k21J48Q1
7754A34j28K2jJ17k52K56j60j63K46PL6J8k21O1R5j51J17Pp3K42n2j31P7L4j8
7779A19j55M9j33K19m0p4m1Q5j10L58l78J17r4K25n1r0J34k93K21P3j99J84j59
7802c3J14j33j78M48n69K59J76j49L18k40P5j34P9j54J67j24K8J94p5k40M7J18
$$ y = [-41, -48, -219, -191, 1, -3, -30, -246, 126, 107, 120, -5, 47, -136, -122, 102, -50, 195, -25, 85, -71, -48, -67, -116, 41, 36, 116, 49, -241, -40, -154, 13, -127, 58, -241, 101, -9, 2, -63, 56, 11, -60, -25, -19, -70, 248, -284, -34, 189, -191, -5, 186, 77, 318, 47, -82, -10, 273, 10, 228, 48, 25, -84, 165, -167, 42, 220, -123, 112, 75, -172, -197, 21, 166, -106, -8, -231, 83, -24, -143, -58, -65, -140, -231, 90, -219, 27, -49, 96, -25, 171, 129, -92, -1, -26, 75, -173, 151, 39, 30, 148, -118, 157, 51, -330, -26, 104, -61, 127, 80, -89, 24, 126, -95, 53, 134, 6, 28, 27, 144, -108, 148, -12, -175, 71, 78, 114, 132, -89, -28, 67, -84, 33, 40, -33, 209, 157, 26, 103, 137, 119, -36, 13, -120, 99, 59, -15, -56, 29, -81, 277, -101, 16, -78, 147, 96, 6, 140, -153, 68, 141, -58, 126, -33, 81, -52, -230, 218, -351, -92, 84, -65, 253, 13, 88, -46, 33, -121, 46, -78, -50, 144, 69, -171, -124, -6]
7824fQ6R3j24M8j95J5K33J32k82j54O7K3j31K49J39Lj76r2J9j49L1M25k30j27
7848a03K42l64L09j65K37k0j54j02L14l01K17l23L91k61J20k2L8j90j27M39q2
7869I3j6l34J04J90j04p3R4o2J28j41J49J06n6j99knqL02R3j93j78j64J62R6k5
7894d3R5j01N2P4k32J45k18K06J63k19p8J5K51Q1k52q3L02p0k74K12J72k60oK2
7918d6K7j08m0N7r4K42L8J33m39J18K73K8j10j81J84MJ48m5r0k48K3J67P8oj35
7943b2p3N1j29J77k7M9j59K09n1p0J15j58r4l2K77m01J80L28rj21k61J32N0L85
7967C46m16j8m8L47l99L76j44j1j96R7k10L85k5N9k14J67Nk75K88k91Q9k20M97
7990A89l05J19J0O3q7p2N9j0J51l4q1o3L85j0l07K1k34K76j62J91q5R9n0j14K31
$$ y = [-6, 80, 173, 49, 97, -98, -83, 150, 282, 0, -154, -87, -64, -195, 54, 193, 196, 20, -72, -53, -202, -171, 254, 24, -103, 139, -225, 84, -81, 156, 136, -18, -120, 194, -107, 110, -213, 178, -83, 37, 15, 53, -137, -264, 175, 93, 77, -257, -153, 37, -67, -140, -46, -108, 20, -121, 28, 134, 78, -121, -123, -128, -136, 166, 259, 66, -112, -276, -114, -18, -43, 52, -49, 3, 77, -155, -10, -228, -22, 141, -78, -156, -141, 110, 191, -61, -144, 158, 88, -186, 26, 198, -62, -68, -46, -19, -127, -167, -110, -204, 38, 76, 209, -230, -112, 161, 189, 79, -102, 82, 86, 234, 189, 99, -149, -126, 41, 119, 113, -22, -95, -44, -173, 4, -23, 26, -133, 76, 25, -45, 70, -88, -182, -214, 63, -338, -158, 170, 161, 40, -221, -89, -39, 346, -70, -88, -136, 211, -188, 188, 44, 33, -163, -66, -276, 109, 84, 143, -71, 96, 101, -174, 114, -177, -88, -308, 189, -116, 3, 13, 76, -11, -83, -24, -34, 117, 83, 2, -61, 324, 314, 7, 28, -206, 70, -92, 99, 14, 113, 63, -51, 180]
8015A80k54Q9M9r8r1K44j76J35k10N0j42K21j24J62L0k6J23q7j90K3L2N5j20O4
8039f1p4J36k12L79o0J64m1m41J00j72J71J02K65k17n6P2o5R0j98K45J63j86j97
8062i3P7l6M8k07J69K30k22j3j85K56J21j30M5p2N0LL54n49J86j7J10m8j5JJ47
8087B10j43pO1k45J50K3j73J69j44J26k74R3j22J78r5O9M7p4J88J03j41jJ05j82
8111g9K38j73M3n6j6J50j71j22L30L0k93K10j78J96k6qJ22k02q6J15mj60J92J19
8135A71K24k59k26KN0J26r9J67k02J17j62K29j89J20M9kK09m40R1J02l0P6k80
8158a56K37j50L04k42M5r7N1N6j62P3L16l46j8j5j4N4j46L81r2o5l1L0m7j62L79
8183A83K9l40L94l75J31k22K02K8
$$ y = [180, -74, 15, 64, -34, -125, 119, -57, 78, -132, -82, -224, -3, -127, 35, 65, 39, 162, 75, -115, -92, -60, -5, -125, -61, -135, 1, -211, 168, 108, 272, 231, -210, -110, -282, -111, -9, 256, 39, -17, 55, -10, 80, -118, 127, 290, 104, -93, -16, -52, -4, -211, -42, 188, -34, -47, -232, 24, 145, 15, 60, -12, 38, 41, 395, -154, 32, 15, 125, 77, 62, 63, 210, 67, 60, 121, -124, 26, 49, -124, 45, -99, 27, -247, -154, -276, -98, -193, -124, -77, -151, 37, 140, -1, -2, 103, -79, 159, -14, 29, -27, -43, 107, -64, -186, 144, 174, -119, 91, -87, 109, 83, 75, 197, -5, -91, 24, 20, -140, 52, 171, 395, 136, -90, -88, -38, 88, -11, 156, -46, 71, -91, 138, -51, 69, 118, 116, 325, -115, -24, 78, 48, 124, -156, 81, -69, 235, -7, 38, -59, -8, 48, -114, -41, 275, -71, -89, -104, -118, -64, -210, 171, 79, 14, -17, 13, -34, -196, 183, 212, -128, 266, -109, 22, -200, 2, 30]
8191C0
$$ Imaginary data points
##PAGE= N=2
##DATA TABLE= (X++(I..I)), XYDATA
0@%%%%%%%%%%%%%%%%%%jRj6J6j6J6j7K1k8L2l6M4m9N3o1P0q1R3j02J14j30J46
40G7j62J79j99K21k45K72l00L30l64M03m45M89n37N92o53P22q01Q90r92J111j252
61f64J420j628J893k241K724l443M646p188K6597l6531r29M6411k8082j2052K3179
76A4112M524k6601O411J3607j8744J174L1519k6063k1362L2956j931k9936J8591
89a743K2324k4381j7194K5429P66k5478J8677J7427l1398J007K2709j7173j0025
102a9053K4936Q30k6255P095K1065k0564q717L0926p785k6309J9196R358k1265
115a6542N149K0906j2708j7200J9606N813k3908J3013K0241k4864n792K3808q414
128h92j4571J7602R146k1074j416K1570j1074j3419K4351L29k4585J2665J2816
$$ y = [0, 0, 0, 0, 0, 0, 0, 0, 0, 0, 0, 0, 0, 0, 0, 0, 0, 0, 0, -1, 8, -8, 8, -8, 8, -9, 12, -16, 16, -20, 24, -25, 28, -33, 37, -44, 49, -53, 61, -69, 77, -85, 94, -105, 116, -129, 143, -157, 173, -191, 212, -233, 256, -281, 311, -342, 380, -421, 469, -523, 588, -664, 756, -872, 1021, -1220, 1504, -1939, 2707, -4481, 22116, -14415, -15344, 31067, 2985, -9067, 14112, 18636, -7965, -1554, 12053, -6691, -5517, 26002, -61, -21423, 11533, 9602, -20334, -1743, 20581, -3800, -20994, 4435, 5201, -20277, -1600, 15827, -15571, -14564, 8145, -9028, -19053, 5883, 6713, -19542, -12447, 8618, -11946, -20663, 10263, 2478, -23831, -4635, 4723, -16542, -11393, 9513, -3195, -20395, -789, 5024, -18884, -5871, 14370, -10494, -16286, 7522, -892, -15463, 2139, 11285, -9789, -11205, 10365, -709, -14128, 10223, 10552, -14033, -1368, 11448]
141A1448j6561m51J8795n909j7828J2595J1286j9624M262K1018j6814j1534J9606
154A0289j926j4321J1247J1322j6454o727J8729m699j5396J8176N949k2142M809
167a144J3942j1749m913J5874r07j7614O286J2957j5396j737J9348j0117j4456
180i626J4368K874j3521N545J2182j1174j0126J4250J74j4776J1763R006j7239
193f300r61J3211p456p276J1925L459j5098J310J2828j0181n514J6101l652j4829
207a2433R637N917j1640J859J2400o876j1089J0677L800j2925O886J1261j3376
220e902m133J2366l764q304R516N790j2251j352J1926o315p026J3463M41j3372
234h917O020P191q713r49J1061k749j0536P439N383j0667L180J1134q582o185
$$ y = [11448, -5113, -5564, 13231, 7322, -10506, 2089, 13375, -6249, -1987, 19031, 2217, -9317, 10289, 8363, -5958, 5289, 16611, 157, -6570, 12159, 7460, -7936, 10240, 16189, -5953, -1144, 12798, 1049, -3864, 12010, 11103, -6511, -225, 12732, -2664, -4401, 14947, 4830, -9626, 4742, 7616, -5905, -360, 11822, 648, -9478, 4772, 4946, -9830, 1933, 10939, -6300, -7261, 5950, -1506, -8782, 3143, 6602, -8496, -7186, 5642, -4539, -10053, 6048, 2396, -12433, -2796, 3121, -8519, -6660, 5740, -1136, -12225, -1548, 2252, -10673, -3787, 7474, -5902, -10035, 2331, -1433, -9737, -221, 5569, -6682, -8034, 3892, -2423, -9449, 4014, 4455, -8917, -2897, 4294, -4419, -5368, 5693, 2944, -7592, -153, 5230, -5437, -2257, 8877, 295, -5890]
248e890R779o13p820O602O576r207l669J0147l133p046R874K751j1122K205P573
263G007o414k633R586p82j0109M479O080q267M2J0085n373p274P065J861p469
278b116L388P177p012m855P752q18p323O732M272r186l79O652l883m388P626J478
294E117q888J855N736o397j212Q309k557p196M576K608o180J397O981m572n796
309f219O037O79o392M455N221p221j921O263k128m765O118K500p558L50N887m327
325c021k405P316n86o887L096L368n072P09O473k939n204M334J540n071K371N911
341C933m841l369N215p48m171M696L175o112o32N170k472k580N578R83o146J504
357h17L943l865q74O184j661n160L478J913m059J123M863k903l930M211L56m450
$$ y = [-5890, 3889, 3276, -4544, 2058, 8634, -573, -4242, 5905, 2772, -4274, 5600, 8351, -2771, -566, 7007, 593, -2040, 7546, 6764, -3345, 1134, 7214, -1053, -1011, 9074, 3701, -3573, 3492, 5353, -2116, 1272, 8449, 1437, -3418, 4334, 3516, -3807, 2925, 7197, -1989, -2368, 4284, 401, -3987, 3639, 5117, -3771, -1916, 3820, -2577, -3789, 4520, 1963, -5233, -657, 1951, -4229, -2832, 4149, -423, -6219, -182, 497, -5895, -1440, 3781, -3440, -5361, 902, -1226, -5991, 127, 2627, -4931, -4581, 1306, -3021, -5426, 1890, 1304, -5583, -2487, 881, -4191, -3482, 2991, 52, -5152, -818, 722, -4349, -1978, 3933, -908, -4277, 938, 190, -3981, 715, 3890, -2222, -2854, 2316, -156, -2736, 2842, 3825, -2321, -817, 3126, -739, -1613, 4571, 2910, -2250, 1228, 3141, -918, 205, 5068, 2165, -1765, 2446, 2802, -1648]
373a648L049M121m973j558L989j418k977M110K310n139n86M160l017j731N230
388C922m84m966J981J997l171M30L809j434m596L176J347l903J570M193m138k195
404b462L602p74l444L079K798m122j431M070k112k741M672N83m588J066K163k229
420a870q58L702k25l995J626K193l779Q37M056k360k803K865J0k302J364L469
436A930k593k531L408m75k767K966J916l909P2K303j383q85K984Q40l739M78K842
453A457k870L5L665j207k807J969P94j766N8L483j326l335K883P20l041K386K159
470C257l131n84J905n60j326J734K041l050q52K688j553j213L486o48k581Q42
486D55J003j021m76K451J9l504J596J425l025J470K239j990j258R74J35r35O43
$$ y = [-1648, 1401, 5522, 549, -1009, 2980, 1562, -1415, 2695, 5005, -134, -720, 3440, 423, -1308, 3922, 3438, -1528, 453, 2450, -721, -291, 3518, 2084, -2512, 664, 2011, -1892, -322, 3871, -267, -2462, 1140, 366, -3078, 1, 2799, -1323, -2754, 1316, -796, -3537, 1135, 1718, -2870, -1804, 359, -1870, -2728, 974, 749, -3246, -1620, 573, -3206, -2369, 1687, -673, -3476, -611, -601, -2903, -1539, 1930, -663, -3194, 214, -261, -3028, -62, 1854, -2055, -1983, 320, -1063, -1948, 1036, 1876, -1863, -1385, 1457, -1413, -1378, 2287, 1080, -1727, 242, 1036, -730, -672, 2811, 1485, -1850, 1033, 1753, -1288, 1098, 3257, 126, -458, 1447, 887, -439, 1295, 3336, 286, -566, 2122, 569, -644, 2842, 2194, -387, 455, 1458, 437, -39, 2412, 2431, -1073, 523, 1948, -1077, 393, 2632, 642, -616, 358, 493, -442, 201]
503B01K055k144j727K399q03j658K714K40k002k85J192o64r00J648J185l301L40
520a510K026k257N35K277r79j596M60M97n28O6J839r27k153J739J25j826K158
537e4M89j426m41N00K74q86R09J481k088n71J935j190m26K135p50q17jP44k69
556d52n52J714M8j568O46M71j049J098O35n73m76j13N50k81p9J757j125j210J412
575H53p89J8R60K09o97l08l4N79n69R96P27j844J24P66r38Q79L77l35m27n91R26
596H82k47l40J396r13j067R37l30j90Q69k05Jq84l29R28m22J14J009j322p01O08
616b06j10N1N86r2k57r62O19K61o49R57Mj308N27k13Q9L90Q3K21n68r44J455l48
638d14r28J288m57o70L54r7N28k41J67O70j433j07J329p49M41O91r87k51K20L78
$$ y = [201, 2256, 112, -1615, 784, -19, -1677, 1037, 1277, -725, -1010, 182, -482, -1382, 266, 1451, -1850, -1510, 516, -1741, -1206, 1071, 92, -1504, -1044, -547, -1075, -1009, 830, -97, -2250, -511, -386, -2212, -54, 435, -991, -1432, -932, -658, -1544, -635, 846, -1242, -1813, 122, -1068, -1494, 641, -109, -926, -927, -183, -452, -1004, 710, 758, -810, -164, 307, -742, 356, 991, 418, -58, -171, 379, 98, 19, 1776, 651, -559, 853, 64, 82, 1042, 1251, 554, 246, 212, 791, 222, 1218, 1945, 101, 225, 991, 53, 932, 1309, 974, 547, -44, 882, 635, 295, 1691, 778, -289, 648, 318, 128, 997, 792, 793, -91, -420, 508, 86, 200, 1209, -113, -814, -206, -316, -265, 321, 229, -28, -990, -371, -110, -759, 198, 202, -1106, -579, -792, -703, -313, -230, -9, -577, -1521, -66, -414, -1342, -54, -511, -1181, -827, -924, -396, -637, -470, 200, -1233, -1340, -11, -760, -319, 372, -615, -866, -646, -268]
658b68J49m5N45o30j013J182K34n93P65N6o64j4J94L79j27K72N48j216m23J157
678D88k84m8P67m78m15J21J31N54m31L78J13p97j6P03k26P3L37m80k56j83O29
699F80j2m67Q92p73m37O10r7K06R3l09m0n88K74O59n87O0O03j302K04M95KM8K5
722B39m50K1m72L23N32o39N76j33r46M03O48n04J44j24q8m15l8R51l25m34N95
743a36m89m25O13R0j22O1j74J76m45M36K57n79L77L5m71o0M00R6L6J00l1m42j39
766h36P63j4m14P51j39p15L47M69pk44J88M5p54M81Q02k28l97J84j38l22P7O65
788E64j9l28J89j65l84O17K55j87n3Kk43k7K01L25l37j31L65p06J30N59J68l34
810D61J08j65l73R5N63m4m93K13j98l27O2O21K3m84j08J28k09J99L99m30mJ12
$$ y = [-268, -119, -164, 381, -249, -1262, -80, 154, -439, 326, 382, -282, -296, -102, 277, 150, 422, 970, -246, -669, 488, 204, 156, 923, 445, 30, 151, 282, 836, 405, 783, 896, 99, 83, 786, 560, 633, 970, 490, 234, 51, 680, 668, 201, 1093, 320, -117, 493, 396, 602, 695, 386, 346, -242, 32, 691, 104, 164, 767, -535, -331, 164, 166, 214, 239, -211, -190, -662, -339, 193, -446, 130, -3, -949, -546, 102, -402, -258, -382, -470, -885, -923, 28, -297, -731, -136, -625, -1050, -437, -347, -469, -408, -582, -406, -851, -415, -158, -737, -360, -325, -796, -856, -456, -360, -324, -224, -255, -697, -836, -73, -87, -501, 250, 111, -604, -257, 212, 205, -39, 149, 194, -560, -79, 723, 495, 98, 282, 144, -178, -101, 564, 545, 217, 406, 241, -143, 474, 729, 542, 489, 491, 248, 221, 422, 747, 410, 279, 644, -62, 68, 627, 795, 461, 569, 404, 31, 126, 689, 645, 152, 365, 167, -160, -98, 523, 546, 62, -46, 82, -127, 72, 471, 41, 37, 149]
832A49l90k12M13K5o8j49J0k39q9J72M33k72k72K26m24J49N38j6m41M2K10m22
854f27J11O29k81k22K74m7n27mR54o51k36L80m1l13M68K82k56l98L37L06p66M63
876a65O83m89l46M55l29l54R61r2l34o8L16k97j46O09M5n74K00Q5l32J89N36r3
898D60n60J79L29n58M38O64o08l63N41k46k66L98L12j94m83L29R4n96P49K40o71
919A88r0K27j90KK43K09l37l66K75j38%L68l9o25N1L78n76N91J95k6o73L68l4
942Am57K26P69q17k0K45j37k11J99L70m15j65N44k61p52Q76q0o11J92L17l30q
964e25L84J32l55j29O96o44n5P76n25l32N16j86j59K10N11k67n86M08K66o07M75
985DK14l87r6J61J39j88L22L84m87l56O36k48k51M43jk43J21K22j42k25L00K28
$$ y = [149, -241, -453, -40, -15, -83, -232, -222, -461, -550, -378, 55, -217, -489, -263, -687, -538, 0, -16, -457, -415, -205, -627, -516, 113, -168, -390, -116, -163, -690, -694, 260, -391, -627, -247, -288, -601, -133, 149, -107, -505, -168, 138, -628, -165, 518, 29, -317, 138, -191, -545, 416, 324, -10, -78, 238, -59, -205, 404, 449, -125, 75, 160, -172, 17, 553, 460, -100, 79, 408, -150, 288, 952, 344, -19, 522, 276, 10, 408, 720, 526, 43, 372, 466, -130, 619, 859, 188, 98, 325, 135, 137, 380, 589, 252, -114, 161, 23, 23, 391, 352, -273, -222, 156, -420, 171, 366, 340, -333, 35, 1, -456, -230, 539, -278, -298, -53, -190, -401, -202, 168, -247, -412, 132, -129, -881, -5, -85, -696, -504, -187, -517, -525, -141, -9, -364, -493, 203, -441, -496, 280, -245, -577, -61, -247, -406, -196, 315, 48, -538, -130, 136, -471, 4, 218, -169, -265, -104, 35, -153, 169, 553, 66, -290, 346, 98, -153, 290, 289, 46, 167, 389, 247, 22, 322, 550]
1007E50l71m8M49n01L6O79m05l19J86Q4j03K5K87k69l64L61j94j11N29mk24j28
1029A45J01k08j04K76L64n71k26M78j01k13L94k53l66N17l26J03j55J2K20o86
1049e99N75J82m66L36J6k94N6j31J54j40N9K39n3m30N79l89O1K43l24J24k83k23
1071g08M63j33m8M85l70Q5K20m03L59o3O4k47J17L1n9K18M7k11j06R3J0q9K94
1094D9J95k45k88N1K97o0Q2J16k84R0K68j17N2m0K86l57j41J39K28k98R6K05k78
1117D6M8j02L9L33Qj4k40j98M66k2L7K6j21k47M9j10J36n0oJ55m16K55J67l06
1141f7K88P0l18k5P6J42L9j85J29j65j44n9K22k66K64L9o6j28K02l3k14J15P9
1164ek97N4M23l17j15M12k64J23j17L5O6m66M20m3l99O9L45q9K8M8k82J45m0J
$$ y = [550, 179, 131, 580, 79, 115, 794, 389, 70, 256, 340, 237, 262, 549, 280, -84, 277, 83, -28, 501, 497, 273, 145, 246, 38, -66, 210, 574, 3, -223, 255, 154, -59, 335, 82, -284, 233, -93, 10, -145, -133, 87, -599, -24, 158, -308, 28, 44, -250, -194, -325, -171, -311, -252, -13, -66, -496, 83, -306, -245, -2, -326, -202, -485, -708, -245, -378, -426, 59, -311, -226, -6, -409, -50, -113, -49, -296, -179, -148, -207, 11, 58, -153, -259, -166, -156, -245, 49, 244, -1, -289, -238, 59, -1, 81, 197, -87, 3, 271, 154, 206, 166, 452, 95, -46, 93, 321, 23, 119, 324, 46, 94, -8, 31, 364, 372, 358, 118, -80, 386, 364, 401, 427, 306, 59, 108, -2, 134, 84, 78, 233, -183, 72, 239, -67, 221, 291, -27, -52, 24, 166, 205, 20, 149, -16, -160, -219, 3, -263, 1, 40, -26, -154, 48, 15, -199, -84, -5, -302, -248, 175, -142, -257, 155, -109, 14, -103, -68, -2, -468, -48, -91, -490, -421, -76, -165, -137, -89, -371, -226, -266, -265]
1188b65K29P0L0Jm91L95J5l93L81K6j00k15K91L63n38N4L31j74k29L10M8j88K38
1211A89j51J20k7L2M0l0o2L22l12J8J18l80Q4J73K58m54M1L75qk85K49l9l16j0
1235e5K73N3j62K40l23j89L91Lj85pK56k36q5p4M95l53n4J55j26K54q3k6k13J33
1259H2n7q0P9j03pJ8j02L54o00Q1J49K05l32J50K40n03O37k61k7rN5k83K39k08
1283b83L45j32l3O0j79J67K6n6j34K21M9k81J25J90k45R4J6o1J08k26O3M5J89
1306F8O6l5j66J1K04N9k11J1K3j6j34L65j95j32K66l6j86K4K07k91L18Q6j39l13
1330a46L38n4j21q3K66m9j62QJ79l40J61L02k43j14K18j19j46J53K7p3j90M84
1352B96m47l6J00kk2J74J97l31K9K63o7k17J05m2j35J85L5l31O3K57n2j54R1M4
$$ y = [-265, -36, 34, 64, 65, -426, -31, -16, -409, -28, -2, -102, -317, -26, 337, -201, -147, 184, 10, -219, 91, 139, -49, 189, 38, 158, 131, 163, 203, 173, 111, 433, 121, 139, 257, -123, -39, 134, 392, -62, -21, 354, 346, 61, 310, 271, -45, -55, 218, 271, 109, 349, 26, -163, 228, 231, 46, 39, 295, 59, -26, -100, 395, 42, -12, 143, 17, 271, 188, 162, -51, 82, 25, -55, 24, -79, -86, -68, -170, 184, -416, -335, -186, 19, -313, -163, 77, -426, 211, -50, -77, -86, -31, -314, -75, -283, 62, -70, -103, -43, -222, -55, -29, -85, -219, 2, 51, -230, -105, 85, -160, -66, -50, -111, -3, -229, -166, -121, 68, 134, 99, -67, -56, 148, 207, -4, 7, 30, 14, -120, 245, 50, -82, 184, 148, -38, -14, 193, -98, 220, 306, 167, -146, 192, 138, 17, -66, 200, 151, -11, -3, 176, -164, -3, 299, 56, -58, 160, 41, -105, 48, 75, 2, -188, 296, -151, -187, -87, -89, -111, 63, 260, -71, -42, 221, 154, -63, 42, 0, -135, 50, 85, -246, -183, 74, 22, -132, -41, 3]
1376CJ3n9K13k08m02L60j04J52k1K70l64l8Q0R3k4j67K88j41r2K44k46l3R6J34
1400D7k57l8K47q1j09J50O8k05L3K70j49l52N07k3j70j29L20M4jm8J1O8J50k81
1424G2r4P2M6K9k10K58j21j1j10J78r6%J93q2k70L00K84m92L53j62p0l33O38l25
1448D7l30L25M40m04o7K94l50j03K51N2k96J91Q5l0k36K69j9k86J82R9k4o3P6
1471A03R9l16M74m91m5J84L4k58K6J68P5m0j6r6k21L47R7j05j37J76J2k68L5J17
1495d6j75j15K26j2j61N05k12l43M00q1k55J82K25r2k90J36K34k18QK14k85J37
1517a8o6j37K18j50J76K4kJ65n11K95L5L3j81K43p0Lq2j60J94Q8k44K31J22l39
1541a33L50ol17j09J48j97K02J46R6k48M1Q8l7P8j78J89k40K22Qk24N15l37j01
$$ y = [3, 16, -43, 170, -38, -440, -80, -184, -32, -53, 217, -147, -185, -105, -12, -36, -203, 85, -56, -148, 96, -150, -183, -87, 47, -210, -248, -1, -82, -191, -41, 27, -178, -145, 125, -24, -376, 131, 108, -62, -191, 129, 173, 172, 124, 135, 203, 353, 72, -22, 50, 96, 125, -85, 173, 52, 41, -69, 109, 13, 13, 206, 124, -146, 154, 438, -54, 299, 137, 67, -266, 372, 47, -283, 42, 482, 78, 11, 305, -45, -148, 103, 155, -141, 50, 135, 105, -131, 138, 119, -167, 15, 114, 90, 27, 103, 202, -114, 360, -131, -176, 8, 42, -216, -190, -22, 53, 13, -3, -99, -320, 27, 124, 19, -118, 58, 70, -198, -163, -46, -221, -336, -110, -122, -283, 222, 10, -333, 67, -14, -269, -87, 138, 46, -244, -108, 126, -92, -84, 130, -155, -18, -84, -221, -3, -153, 23, 47, 45, 210, -301, -6, 29, 62, -119, 124, 54, 57, -25, -185, 9, 97, -147, 84, 206, -133, 217, 211, -106, -215, -67, -264, -62, 84, 180, -68, -27, 61, 24, 102, -76, 113, -127, 95, 103, -121, 394, 57, -44]
1564d4N2K71l07k45L78K6k95J67K23n10M86l8j46p2J36J08l94L78j91K8j1n7K07
1587A50j24j1K90j48k75J85k24J17J94r0k31J32N8k0N9r9j34M7J22Pk00K64k64
1610a95N7J14J17j28j62L05k00J27k00J36p4K19O9j66l43K04K31j81L5L6Oj43
1632a36J68l9j47L0K26k92K07J39j12n3K35l3j90j13J79OJ4l7L0k2M0J31L0l28
1656f7K79q8j3J4j1k01M1Oj05P1L35l76J90n3m5j1j82L67J83n48L00Q5k62J09
1680A8J86m16K32M1L9r5k8rj45M1K62j53l6M1J67k56j30L77l67K01J71k00j00
1703a59N0K23l24r6M30l61n7M08j70K46k99K48k17k11L84J2k93J39K34k73j17
1724b03K12q5q9K4L53n93n4O41n93L05o3K30j66j04M80l90m3Q7MK4o8QJ1R8K05
$$ y = [-44, 8, 279, -28, -273, 105, 131, -164, 3, 226, -284, 202, 164, 18, -54, 82, 190, -204, 174, -17, 11, 0, -57, 150, 26, 15, 305, 157, -118, 67, -157, -40, 154, 64, -167, -35, 23, 3, 62, -37, -171, -124, -2, 5, -195, 69, -195, -138, -24, 93, -35, -197, 108, -92, 35, -165, -29, -103, 116, 185, 19, -324, -120, 111, -70, -35, 1, 7, -136, 32, -7, -154, -124, 102, -190, 17, 156, 44, -9, 226, 193, 3, -110, 69, 75, 89, 52, 82, 60, 100, 231, 261, -67, 212, 124, 111, 125, 114, -87, -46, -40, -145, -74, 261, -115, 75, 22, -23, -34, -216, 151, 334, -214, 86, 171, -91, 18, 204, -212, 20, 61, 100, 5, -23, -32, -177, -136, 126, -27, -63, -22, 145, -111, -241, 136, -231, -30, 141, -59, -159, -109, 114, -210, -306, 124, -237, -294, 114, -56, 190, -109, 139, -78, -289, 95, 107, -186, -47, 187, -86, -203, 9, -76, -165, -141, 212, -381, -435, 206, -387, -82, -145, 85, -81, -185, 295, -95, -138, -51, -47, -23, -91, -83, -72, 26, 231]
1749B31j28l04N6M03l71l7J98j92R3K30j69j58K92K1r9k64K39j24k47M51j31q8
1771i8J4M51l22J0K62l28k1K2K05k70j41L23k07j37J16L01k76J04K55j81k49M52
1793B85O3m86J21J81l09J92L2k65j37L15L46k62j87J91l34J76j06K07l25M82j20
1814F0r0j76N59j85l16L19m5n60L22K08Nl06L24j5k2k01L25k91J77mj33J03k72
1837b14N41n51M81K4l15J64m9L2p30M79K87k26l2K80k74j06L76q2j49P0rj21K
1860a22L41o6j96P6J49l45M6J88p3q3J46J90k80Oj8lJ92j85K27j32j71L05l50
1883a58K88m9M3k15L44j38j80j67M39m86J59P3J66o9O0j07l36K30L75l16L2J27
1905A15M8Nm08J69J28q7O4k3j29L60j18j40j85L48l16J59Q4q6m2J86J93k28n8
$$ y = [231, 103, -201, -145, 258, -113, -150, 48, -144, -51, 179, 10, -148, 144, 165, 66, -198, 41, -83, -330, 121, -10, -98, -84, 367, 45, 55, 317, -11, -32, -10, 195, -75, -216, 107, -100, -237, -121, 180, -96, 8, 263, 82, -167, 285, 348, -138, -17, 164, -145, 47, 79, -186, -323, -8, 338, 76, -111, 80, -254, -78, -184, 23, -302, 180, 60, -30, -206, 353, 168, -148, 171, 126, -434, -112, 96, 101, -205, 119, 104, 82, -119, 206, -85, 92, 88, -45, 58, -214, 327, -224, 257, 281, -34, 130, 81, 113, -617, -138, 149, -77, -109, 171, -103, -209, 167, 85, -64, 6, -3, -124, -122, 219, 153, -43, 33, 182, -163, -117, 71, -2, -85, 61, 251, -29, -23, -41, -44, 148, -37, 190, 58, -113, 192, -158, 130, 81, 124, -91, 253, 115, -65, -232, 207, -279, -120, -47, 119, 50, 110, 3, -333, -103, 272, -44, -12, 115, 163, 168, -240, -71, 57, -30, 34, 11, -118, 242, 124, -16, -201, 147, -169, -10, 74, -12, -54, 132, 325, 97, 39]
1928C9qj7r2J64O9j55j09L20j81l3O1k1Q9j56k73L57j42J54J47m20K68p0j10O9
1952e0K34k90n9N89l31j92PM1j3J54J51N1l33J2J70k44J33Q7j48J30R0j81k02
1975a94J52LK33j85J46q0j87J14M1j79J81K8r6K7k36L09k50J56L45o50M36m3N1
1998A22k06J17K9l5j55L02k12j39K26p0P3j3J38j73J45Q2l26J33J74n3l40J29
2020e2Q5k44J04J65j12K9n4Q4l5j27K16k33K67k29o0J57J55j93M5J35o7N8j75
2043h1k4J97ML7mJ95l31j04J47l5J50j66K2OjM1m7M7O8j77N3q0n0L47j77k9j96
2070a88K64j29r6N2L52j47k45L27l48K57n7J1j47J24Q4J71n03K29j01R7q1J31
2092E7j4r0J61k42K28q3k3k2NO3k11M8J04J4N8J06k97L74j27j05J62m24J19K95
$$ y = [39, 31, 14, -78, 86, 155, 0, -109, 211, 30, -3, 58, 37, 126, -30, -303, 54, -88, 66, 213, -207, 61, -9, -119, -50, 184, -106, -165, 424, 93, -99, -92, -51, -64, 90, 241, 292, -41, -29, 141, -103, 30, 117, -31, 99, 189, 8, -194, -42, -39, 194, 9, 155, 75, -112, 2, 43, -136, 45, 73, -23, 4, -232, 77, -173, -17, 328, -322, 114, 71, 122, -84, 33, 62, 27, -128, 174, -38, -177, 49, -21, 52, 39, 177, 4, 149, 231, -95, 38, 212, 159, -181, -52, 33, -211, -107, 58, -54, -25, -79, 5, -30, -157, 59, -174, 93, -136, -196, -39, 116, -77, -32, 103, 36, 94, -81, -105, 92, 96, 133, 129, 324, -7, -111, 36, 1, 151, -15, 7, 13, 12, 53, 6, 53, 121, -56, -3, -83, -133, 214, 37, 8, -188, 76, -53, -149, -97, 255, 108, -137, 190, -158, 99, 42, 53, -94, 30, 114, 285, -218, 11, -90, 7, -74, 57, 43, -47, 114, -128, 100, 17, -6, -28, -23, 40, -171, -123, -19, -5, 53, 159, -138, 236, 109, 4, 166, -258, -139, 156]
2116A56l11Q4r2P0j67J18K40J34o37L37K62m17M7k6J08j8O1p6K00M6j78j6M3l1
2140f3M7l7K7o3J26J52j00k94J34J37j07J6j29J48j10MK23j82n2k6J01k2k5L37
2164B42k61J09Q9k69m1J5K54j12j2O9j60J56j47k4j55J07L06k98K80k81K65p8
2186E4m5J36m23J92J49j09nJ74k08l6N4M7k9n0L83j63k93R2L91l88P4K44l84K10
2210F7K25m23L09l2j22J47l23J44o2L09r9k90L24j1k96P3QJ08j10j18R9M07l47
2233a3k01M85j46l22J64m3j28K40J7J5j61J28L1J0J80k85j07J76J22j64n6k9O6
2256b1J44P2Kn72M25l6Q6l84K67k17N5NM43l64P1k9K18j29J43O0j14k40J20no7
2281f7M8K75l41q1L55k05q5j4J18k32L00J21k15J8R7j5L8m0Oo5j30K26j48J86
$$ y = [156, -155, -71, -163, -93, -260, -142, 98, 232, -405, -68, 194, -223, -176, -202, -94, -112, -51, -127, 73, 119, -59, -75, -32, -63, -16, -53, -26, -89, 37, 189, 89, -205, -71, 66, -41, -25, -154, -6, -116, -112, 111, -71, -123, -149, -48, -70, -95, 242, -19, 90, 179, -90, -131, -116, 138, 26, 14, 83, -77, 79, -68, -92, -247, -140, 166, -132, 148, -133, 132, 54, 9, 145, -278, -86, 63, -46, -51, 123, -85, -121, -67, -20, -49, -99, 284, 121, -172, -80, 311, -77, -3, 241, -143, 67, 292, -131, 178, 146, 24, 171, -152, -8, -70, 239, 140, -150, 174, 163, -133, -60, -52, 56, -54, -172, -73, 334, -13, -214, 271, 125, -197, -33, -76, -204, 36, 53, 68, -93, 35, 66, 76, 256, -29, -136, 40, 162, -2, -58, -87, -21, 123, 195, 197, -375, 50, 14, 100, -284, -17, -234, -179, -174, 269, -95, -24, -53, 165, 36, 179, 239, 125, -115, 5, 0, -67, -19, 256, -85, -166, 189, -16, -101, -115, 3, -229, 71, 192, -23, -5, 92, 77, 115, 75, 81, 16, -114, 112, -36, 150]
2305A50j67J52j67R3J25j55L8p3N8l29L04K9j17J90qk30Om9L73k14j61J61J6J16
2329A41l31K18j5K51k53q9J8J5j2J4n5L13Ok21J1p6J2l1j8L2l8q6R0Q9k3l9j4
2356i1K12k13J70j30k2P5j07J47P9j69K3r3K3Om5L36k84K68j75K50j80J83O7l16
2380A4R6J2j52K7M8R9l40L49j6j19k79L42k55J79J04k74Q0L86l79J74k28J89j18
2403f1R9o1j37J95o1R2L5P0k6J36m30Q9J12n2j41L54M6j53k3rj14J70j46K1p9
2428g4O3K06m75K44k37K65n1J39j36j06L37j12q6J0J08j94P0j2J7r%J17l88J64
2452a40Q8L34k74j28K81k24k08K85Oj80L12m34M84l50J28o2L26j14o0jo0j1P6
2475G4j96J85j20L5K51l05l0pj70K27J4R7M9r4j10o7K84k92R2J61m6k83O1K61
$$ y = [150, -17, 135, -32, 61, 186, 31, 69, -4, 54, -275, 29, 58, -59, 131, 123, -107, -101, -150, 223, 9, -152, 9, 25, 141, -190, 28, 13, 264, 11, -78, -60, -45, -57, -43, -98, 215, 221, 0, 11, -65, -53, -84, -102, -70, -108, -194, -104, -15, -38, -77, -91, 121, -92, 78, -52, -74, 1, -106, 41, 120, -49, -26, -119, -96, -90, -135, 201, -83, 185, 10, 260, 80, 263, 330, 14, 110, 122, -30, -3, 45, 144, -196, 153, 137, 18, -261, 81, -174, 5, 109, -165, -85, 301, -78, 96, -132, 57, -61, 38, -23, -160, 35, -26, 66, 101, 171, 145, 281, -149, -60, 52, 0, -141, 213, 259, 106, 83, 74, -40, 130, -16, 5, -74, -11, 195, -280, -36, -273, -8, -59, 80, -56, -162, 175, 63, -23, -13, 95, -99, -29, -41, -24, -33, -33, 84, -304, -140, -52, 282, 8, -120, 161, -63, -271, 14, 20, -160, 152, -282, 202, -148, -20, -82, 244, 130, 70, 69, 9, -2, 74, -122, 63, -57, -22, 229, -76, -106, -113, -283, -56, -42, 55, 104, 10, -100, -167, 117, -175, -83, 78, 32, -251, -190, 71]
2499G1j18j5J06n9J5J13k65o3K10m6J31p5J11j83R8j31L05j77l34M22l62K21M3
2522A8k24J76j9J32Qr1n9L23l40J81k1R3l17L97j51R0r4K4k7K8N2m5k24J09k05
2547a86j29L48N2j07kj16j01j9L86j02m7P0J3j47r6J94K6j53k7K16j87J14k29
2570b29K72j35K9K9J43l02J74%L69l72ok40M76j33j31L04J8m09J54O4k06J61m4
2593a4J29k8J20R5l79M3M7j95L26k65L83m88L11Lj06jJ1j16O3l7J01L4l4l6J67
2618A34q4j72K7K00k62J80J9k8j79M4K16j14J34l48J52j5l6O8J54M5mk26j81K07
2642f9J10k53K00J2n0J63n0j72k01L79j36M12k55Pk05J02n1j21K10Q5n6q3N4m7
2666a5K22m02J23r8J58l5j22N2J57P2N0j28r0K16k74K74k48m1K83l2J70m36M3
$$ y = [71, -47, -62, 44, -15, 0, 113, -152, -215, -5, -51, 80, 5, 116, -67, 31, -100, 205, 28, -306, 116, -246, -25, 18, -206, -30, -49, 83, 91, 0, -59, 264, -76, 105, 84, 177, -140, 257, 106, 196, 102, 126, 99, 127, 179, 134, -90, 19, -186, -315, 33, 85, -22, -24, -140, -241, -260, 126, 24, -23, 47, 60, -87, -183, 11, 37, -116, -143, 73, -114, 0, -229, 43, -92, -63, -34, 109, -193, -19, -19, 350, -22, -28, -268, 208, 75, -56, 248, 266, -143, 11, 75, -131, 30, -14, 115, 87, 207, 302, -77, -34, 13, -182, 144, -121, 262, -226, 85, 88, -18, -19, -8, -124, -61, -98, 3, 37, 3, -33, 134, 50, -122, -95, 105, -157, 23, 42, 14, -165, -121, 95, -19, 115, -233, -81, -96, -132, -64, 90, 135, 131, -95, -276, -69, 41, -212, -12, 0, -50, 113, 63, -109, -310, 69, -67, 345, 90, 97, -108, -6, -57, -178, 32, 117, 61, -22, 32, -15, 207, -195, -72, -170, -12, -47, -169, -117, 40, 112, 162, 34, -56, 160, -114, 160, -88, -129, 154, 122, 292, -144, -101]
2689a01J75k12J35O8m13K73q2J33K1k5j21n2K27J04k90P4L44k68k47N9J13P1N8
2712D4j51K78q9j42k4K5J87Q7k07q4K25k19%QM2J82l76M17k26P7K21m57J04J61
2736H3j71o0M7K5%o5j4J09K96k83O5j26j88K32K02j31o8M2k31K76k22J34J62M5
2760A59jKk88k0J64q9J23J28l56J78O2N2jk15M4K46r2q6k5r7K78j44%q5RK7J08
2787H1l00M4J95j81j26L79j02J19j82J30j7ll26N38m36K54N7k16K4K8J65k41M05
2810B89m16K0K19Ll79K23Q3J47l6j48J7k44L23o7j01J20j53J58J7j66K16j42k3
2833d0j7l1J80l03N3M0J94l01K23LK9q0o7J14k82N40l47L71k57J48J04k73k04
2856b03J59j23J14JJ16j42N1J60J26k04J08Q5k82Q1m2J15l04J91j21J26m4J38
$$ y = [-101, 74, -138, -3, 65, -348, -75, -157, -24, -3, -28, -149, -201, 26, 130, -160, -86, 258, -10, -257, -198, -85, -14, 44, -107, 171, 82, -60, -84, -59, 128, 215, 8, -76, 149, -70, -70, -62, -20, 162, -214, 203, -23, 54, 275, -182, -78, 83, -88, -148, -101, -76, -76, -141, -155, -46, 250, -33, 32, -94, -282, -50, 152, 21, -47, -5, -236, 40, -182, -48, 114, 159, 158, 160, -128, -148, 16, -73, 50, 178, -178, 0, 62, 114, 113, -102, -58, 188, 96, 10, -15, -112, 166, 22, 22, -63, -54, -27, 81, -219, -175, 20, -161, -287, 92, -10, 109, -73, 57, 40, 37, -289, 249, -187, 67, 124, -92, -68, -40, 125, -116, 289, -127, -107, 112, 115, -264, -41, 42, 189, 153, 5, 22, -222, 101, 34, -67, 53, -100, 58, 75, -91, 125, -17, -40, -57, -88, 92, -211, -158, -118, 76, -225, -2, 1, 30, -50, -117, -3, -285, 255, -92, 279, 22, 170, 274, 1, -203, -44, -167, -53, -52, 64, -78, -27, 133, 259, 55, 163, 248, -34, 47, 5, 120, -184, 7, -114, 12, -32, 106]
2878A06m7l2J00j99r5R8K24k28L4R3n5Q5n3j63p1J96K37k77j14J12k24L27j75
2901a21K4Q5J50k70K60l94J99K35l63Q7O5K32j06J32k07j16L7J76Ll18J62J47
2923I9Q4k40j30k1M75l07K55k36K73j14l24O2K55k49o2K50k1n4R4j42K52k69K76
2946B06m9m28L12M6m8j8L9M8k51J20q6N0J95j43J48j1k01m3J43j01l5J58Q6k05
2970f8n5K07j13k5J55Q6k59q7K38j84M6M9o5K4J3O2R9j77K83l00K5P3k6J7Q8l8
2996F8l0oj54L42l42K32l36k4L97K1l07L89l34K5L68k78k0l6M9p8N6K36k96J04
3020D6M7K21l4q3q7k07j29L58j11k3Q3k23K20k49K36j32O5n8P0K13j34km34K39
3044a08J39k0j1j7R9k17K26Nj77J73M7j59K75k94M8j50mL98j92r0K0j92K95j95
$$ y = [106, 59, 27, 127, -72, -167, -69, 155, -73, -39, 54, -1, 84, 31, -132, -203, -7, 230, -47, -161, -49, -273, 54, -121, -97, -12, 138, -132, 128, -266, -67, 168, -195, -108, -43, 189, 83, 215, 8, -108, -71, 105, 108, -210, -48, 99, 183, -57, -187, -208, 267, -40, 215, -21, 252, 138, -186, -124, 131, -118, -180, 70, 49, -5, 89, -53, 199, -70, 206, 157, -271, 41, 87, 39, 21, 60, 108, -143, -23, -109, -59, 136, -7, 141, 130, -71, -114, 29, -72, -107, 51, 137, -68, -123, 84, -29, -54, 101, 187, -72, -159, 79, -105, -59, -10, -75, -51, -38, 24, 123, -54, 229, -71, -46, 27, 1, 18, 106, 68, 38, 32, -122, 220, -122, 110, -226, -250, 147, 168, -139, 250, -84, -59, 309, 31, 11, -25, 24, -54, 2, 238, -58, 46, 93, 314, 280, 197, 110, -97, -226, 132, 21, -2, 81, -142, 78, -171, 65, -67, -2, -60, 10, 223, 89, 87, -347, -108, 31, 11, 0, -17, 82, -135, 91, 96, -81, 92, 139, -20, 255, -39, 9, -141, -145, 253, 61, -29, -9, -201, 94, -101]
3068a01K98k45q3K18l4l05J67j03M36j92K4J43j98J62j32j66K34j17k5K1K4N3
3090G9j06r1J93k01J36j6r9K18n1J97o14N36j77j45J59Q9Ok09J55M1j12R9j51
3113f4J82m8j20l4K08m59M47lk09J20J23l81J49K00k21P8O3p1m8n0o1J88r1K17
3137A15k35j3J19O0j75J73m1k87J30L12k93r1M59k62J11k3kl1j83J37M1o8J07
3160F0j14m6k4K26k14J61j86J81P5k13J24K34k62L5Q7M2l52J90J81l87L33m02
3182b71J36J25K1J49l59L53J18n01K77L9R3j43O1j98J9O3M2O3l77M4M62l34O6
3205e2K75m63K05K76k10j38J00j18J13O4j79L02l11K92j20k8j40k3L90k75r7J95
3227E8J42l2j30J28q5j02J75j24n3p8K8K0J45K29k64M4J02l54J83O1k99L11J00
$$ y = [-101, 197, -48, -131, 87, 53, -252, -85, -188, 248, 56, 80, 223, 25, 187, 55, -111, 123, 6, -19, 2, 26, 79, -27, -118, 75, -126, 10, -6, -105, 113, 62, 259, -355, 181, 4, -141, 18, 107, 113, -96, 59, 100, -12, 87, -64, 118, 70, -50, -84, 124, -335, 112, 109, -100, 20, 143, -238, -89, 111, -110, -32, 31, -40, -88, -138, -199, -11, -102, 115, -120, -133, -14, 46, -129, 44, 3, -284, -154, 158, -135, -226, 233, -29, 82, 59, 57, 26, -157, -20, 21, -47, 60, -54, -100, -124, 102, -112, 49, -137, 44, 119, -94, 30, 264, 2, 37, 124, 166, -186, 4, 185, -202, 131, -271, -135, -10, 11, 160, -199, 154, 272, -229, 48, 87, 180, 37, 98, -100, -81, -18, 24, 87, -290, -246, 216, -118, -52, 223, -240, -35, 241, 31, -107, -7, -125, -12, 52, -127, 175, -136, 156, 36, 8, -132, -155, 235, -40, -137, 58, 200, 168, 38, 166, 81, -21, 154, 30, -23, -101, -73, -53, 92, 321, 57, 101, 203, -151, 32, 93, -206, 105, 205]
3250B05k89L7j40J67J69j54j36N4L1j51mL10Q3q6j96K49R5q5l35J40p2K03k35
3273a40K5M11j21j85lq7K15j73J24j00J36O8n75N94j52k2Jq4K99l34Q7K7K55j30
3297A36Pk01pLJ33j86K7J42J76l46j8J98o8r3K94r2R9j28J30k36K2j4j85M10j92
3322A1p4k4J17p4K04j33O6k22N1Q2Mj46lL01j11l30J94J26q0N6p7J42j04j14R5
3347d3M3J53K0j79Lj42o6K92K8L4M4l32R0Q7j42J12N7j16R8K5J20j95j64J16j16
3372a73j44K35N2j02K12n35K71K00j26L5M2K01M7k58L3K11j32j06J51j52J33k13
3394a18qj40K90m2J3j74K67p3O3k34Mo2O5m2L0J24J7L4k56R2K29j5O1k56JP6j8
3421g2J82r7q3M0j27N7o0L48l16J74K35j96k6K0r3j45M8L86k30k44L98l65Q0L40
$$ y = [205, -84, -47, -187, -20, 149, -5, -141, -87, -56, -207, -211, 99, 182, 96, -100, 149, 244, 159, -176, -36, -108, 95, -140, -115, 296, 175, -10, -13, -100, 115, -58, 66, -34, 102, 170, -405, 189, 37, 15, 16, -68, 231, -103, -16, 11, 266, 136, 143, -58, -65, -62, 71, -115, -88, 54, 230, -116, -134, 64, -4, -97, 197, 105, 204, 76, 206, -30, -8, -22, -207, 203, 11, -63, -87, 30, -44, 160, 27, 93, -129, -78, 4, 8, -138, -141, 160, 49, -281, -87, 39, -41, 15, -62, 80, -24, -138, -43, 0, 153, 173, -6, -3, -145, -211, 81, 109, 143, 187, -145, -55, 32, -110, 2, 59, -57, 41, 66, 186, -9, -173, -57, -173, -317, -82, -30, -132, 80, -455, -184, 16, -110, -75, -33, 168, 215, -43, -10, 201, 69, -37, 114, -38, 95, -118, -126, -266, 24, -18, -5, -179, 88, 15, 78, -156, -152, -214, -149, -191, -161, -37, -20, 14, -242, -150, 79, 64, 125, -131, -130, -54, -72, 110, 13, -70, -30, -157, -100, -160, 188, -128, 46, 281, 85, 59, 79, -14, -159, -111, 275, 45, -199, 199, -166, -86, 254]
3445B54k87J27j10q5M5q7P4j17J15O3K23j54ppJ7k39O26n2n68L78j61m21L33J27
3469H7rn4q0K53k71j80J79J44j55J49J37k1k23J86j89o1Q7J61l48L34j14j08J32
3492C6J08q7r1j6K21J13k61J26j61J3K26j26k54L78k2j36j53K39k90Q5o1J43k8
3515BK8pk29L02n2Mj36M2O4j46q1K26j77M7J25M4j67K07j44%J43p7m8j7m9K48
3541A52l21K19l5j7N0K71j58j60J52m8o8k37K50k41QM04nj68mj39K29j43l1K25
3565A85j34j32J09r5k3J12O1l41J86j9p8L4L00k39K3J69M4m7j29l9PJ66M4j16
3589D8j02J43O1j54J92J94l31r1Q1k9m4J07P8l3j89J54j48j60K79j57K17J77l90
3612i7K66l64K14K07k97J49m3J48k11k07L37l5o3n0l4m4L38m4Q4l40J25m3J74
$$ y = [254, -33, 94, -16, -101, -56, -143, -69, -186, -71, -8, 215, 61, 54, 47, 64, -175, 451, 399, -169, 209, 48, -373, -40, 87, 78, 24, -56, 197, -74, -254, -75, 69, -86, 63, 200, 179, -44, 142, -47, -108, -21, 140, -208, 126, 12, -96, 36, 144, 57, -34, -50, 171, 284, 23, 149, -12, 1, 227, 101, -153, 225, 203, 67, -86, 153, -137, -52, -113, 30, 2, 30, 23, -206, 96, 44, 48, -88, -46, 18, -128, -209, 17, -160, -113, 12, 56, -111, 96, -48, -48, 95, 18, -30, -47, -96, 152, -169, 50, 15, -2, 48, 319, 161, 1, 153, 105, 37, -200, 50, -191, -183, 221, 216, 48, 44, -95, 134, -9, -40, 185, 51, -81, 28, -67, -90, 22, 83, -258, -72, -91, -169, -135, 165, -74, -51, 118, 162, 115, -14, -53, -46, 120, 164, 48, -54, 89, 150, -4, 188, 382, 51, -40, 41, 12, -32, 75, 153, 120, -69, 85, -63, -223, 56, -101, 116, 293, -97, 169, -195, 19, 226, -71, 78, 35, 183, -28, -235, 102, 67, 4, -46, -80, -124, 214, 170, 254, -86, 39, -4, 170]
3635A70j4L2k61R0K8K5r2J51k89k8J30j6j90K20o0m6K16P8L1j25j49K26J49l96
3659a20NJ46j18Q8j8R0J87k34j48N37l40j78K94j83K01k05n5J54k07L31o9o0j8
3682H0K42n32O3K49J5j46j88K43l36N53r1O6l58q3L32N3j75k8n1J50k1J6j90L6
3706a01R3n0P5k84K18o7RJ12Q4k12j4K26k62j55J99M85l94N3m5J10l6k31K54k29
3730a62j7M6J42J51q3Q9o8k18J66L3k07K30j38k5q1mJ87n3J17l7J22k35J56rk37
3755a35J00J40j49m5LL67k97r0k12J75J67Pk13K92k81K94j78J58J20k74M3p7K33
3778A48l58J80J70k02P9k3n4J20k1j38K65k55K01kj27o5K14l6l7J42k16J62j62
3801a5J47j27j7N1k81M4J06o7m8Q6Q4L1K07K1p0j90K16k52K05Q2l00K21j78n0
$$ y = [170, 156, 188, -73, 17, 45, 70, -22, 129, -160, -188, -58, -74, -264, -44, -104, -150, 66, 144, 175, 50, -99, 127, 276, -120, -115, 31, -87, 1, -17, 73, 260, 26, -122, 415, 75, -103, 191, 8, 209, 4, -51, 103, -104, 227, 158, 98, 80, 322, -210, -147, 102, 117, -29, -217, 26, -310, 243, 152, 218, -140, -223, 109, 162, -13, -41, -92, 58, 37, 53, -137, -101, -8, -58, 17, -267, -49, -116, -107, 5, 89, -123, -137, 89, -173, -328, -129, 356, -38, 15, -30, 80, 44, -187, 67, -162, -179, -133, 9, 160, 77, 166, 98, -120, 46, 79, -128, 102, -36, -61, -142, -146, 41, -12, 105, 68, 190, -45, 111, 102, -135, -35, 105, -44, -89, -86, 281, -16, -106, -318, -143, 24, 31, -182, 110, -171, 123, -55, 103, 223, -51, -8, -85, 148, -210, -30, 140, -62, 17, -6, -60, 60, 39, -99, 166, -89, 112, 110, -17, -82, 132, 96, 59, 201, -15, 147, -15, 132, 5, -12, 39, -242, -198, -92, -159, -207, -121, -37, -6, 201, 222, 152, -38, 178, -74, 131, 213, -87, 134, -44, -94]
3825i4J12k20K54P9l68L95j47J2j67J73%q1J87O9k32Q0Q5k43JK47k02j60R2J50
3849B2j4j99L44j70j75J91Nj53K12J83k08N5R7l66J47N1M1nK85n42J15J38K9K0
3873A03j10J58p3j81j57K64J60k32M8N4j46K31j20k8k0p5K94pj59r1K7K54Om07
3897b07K24k0P6k42L40k00M8mm8P7pK24k80J12N2j7j02j28R5%q6l1J04N8mO2k3
3924G3m6P6m9q3J38j61r2K14o6J87j82k58M51j72j33L16r2j08oK56n83M55n9J05
3948A81k59J9K59k31K1M8J2kj23K40j86P0j02R4n9K2N4M4j15K5k78L18L1m4N5
3973I4n7j16k0j27J16L18k16mj97J38K17L0k94J41m8J84k5j79K05n17L70k2m4
3996e3J21R8o7k59L52jj77n5j34L04n4k86L07k86K03J4m1J22J73k02o9K1M0j77
$$ y = [-94, 18, -202, 52, 131, -237, 158, 11, 23, -144, 29, 29, -52, 135, 204, -28, 52, 137, -106, -105, 142, -60, -220, -128, 22, 8, -191, 153, -17, -192, -1, 4, -149, 63, 246, 38, 93, 190, -176, -29, 22, 63, 58, 343, -199, -84, 54, 83, 103, -7, 151, 78, -103, -260, 4, 164, -68, -20, 34, -112, 119, -1, -29, -49, -124, 170, 163, 4, -87, -60, 194, 200, -207, 17, -3, 73, -169, 171, -29, 19, 15, -33, 44, 37, 261, -19, 93, 145, 128, 26, -102, -7, -7, -93, -124, -20, 38, 34, 96, 73, 27, 103, 54, -29, 109, -52, -144, 70, 4, 191, 9, -249, 202, 30, -103, 213, 121, 13, 7, 263, -320, 135, 76, 181, -78, -59, 200, -31, -10, 38, 50, 48, -75, 165, -21, 49, -53, 41, -18, 4, 58, 102, -13, 12, -266, 52, 83, 39, 94, 37, -79, -99, -226, -110, 208, -8, -12, -209, -71, 146, 176, -118, 23, -25, 159, 134, -45, 160, -357, 13, -9, -53, 68, 166, 99, -160, 192, 191, 14, -41, -175, 129, 75, -211, 96, -190, 13, 27, -14, 108, 281, 79, 10, 31, 71, -106]
4020a06J60J24j42j02J10J26j80n9q4J56K0M3J10kj37j5J32k85J40k54l4K26O7
4043A4q7k3L44j39j05K46l24j06J04p6L45o14N73l37J49o8J47M1m8j08Lj95K48
4066a6J5k08K89M0j87M4m5K65j38j82L80l06q6l7J7J14j29K81k20o4L66n7j42
4089fl6K2o6O7J61r2k63J25L02m90K92j11K55j06l88M51l4k7M2j09k0J47k94K03
4113B5K38k83N2k23K16J59j00l09J41K12qj34K3j04l7J28j08o3J82P1k63J47J9
4136a9n6O4M6Lk16J54j85L81q7J2RJ9N4j69k68K58J18p1R4N6o1k87Q2J42j75J29
4162B7J56k61J56j26j67L31J06j0l10NN7J69mj23J12o3N5J50k33j04L33l01m2
4185h7J06Nj83J38K05n2k53L75k86J54Q4l88K35m2l7J99j41J80K6p3K7k82j04
$$ y = [-106, 54, 178, 36, -66, 44, 170, -10, -69, -153, 3, 23, 66, 176, 174, 37, 22, 154, -131, 9, -245, -279, -53, 14, -73, -96, 248, 109, 4, 250, -74, -180, -76, -152, 193, -421, 152, -185, -36, -104, 43, 84, 36, -72, -69, -264, -16, -1, -209, 80, 120, -67, -23, -68, 197, 59, -123, 257, -49, -135, -172, -155, -41, -170, 111, -109, -173, 193, 136, -6, -42, -20, -86, -19, 142, 50, -213, -88, 214, -276, 16, -95, 160, 54, -334, 117, 83, 56, 98, -11, -31, 116, -178, 25, 263, -20, 32, -191, 25, 184, 84, -225, -84, 128, 120, -14, 9, -95, -132, -4, -112, -175, 7, 78, -185, -38, -19, -75, -11, 35, 38, -178, -24, -209, 172, 85, 97, 106, 125, 179, 10, -258, 0, 118, 47, 141, 197, 136, -151, -69, 73, -102, 27, 183, -78, 78, -48, -215, 116, 222, 212, -98, -93, -36, 133, 129, 6, 118, 55, 110, 260, 27, -77, 256, -45, -87, 19, 24, -159, -21, 184, 132, -121, 254, -32, 122, 206, -182, 53, 11, -26, 173, 32, 212, 238, 165, 192, -90, -194]
4208a94p2M73k37k6N0K53k43J97k00K74k37L1q6J70l50O8OJ74j08k00M01k44Q1
4231a9j14K77j95M22k77n1pK31l84K47q4j13K0n5R4j27J42%J76m3l18L53k77J49
4255D7pj10j8L4O3j21l3N5J07j18K39k57j5KP4j29J89pO5N5j75L0JJ66j76Mj01
4282a36L71j84k82L36k95M94l43QqN0k3q0Q9J07r5j47L17o0l97R2J63M2K0j18
4306g9M3oPJ85p1k54M24J4l10j09O0N4j64K42k94O7J91J61k23J04l11K78qJ31
4330A32J2p1k13m1K04o4K4q0k4R3J9L5k36J67K11L9Jj15j9o6j29J06p8jJ64j17
4356d7jj2J62k9p9M5okk22J37L15j49j98K60k16m7J77j41mP7j28O4o5M3N4n6J70
4383A02J20l34J95o7M0j19K1j76K61j7K8k40J25J1J22r4p1K1k3j45L38J34j70
$$ y = [-194, -266, 207, -30, -56, -6, 247, 4, 201, 1, 275, 38, 69, -17, 153, -197, -129, -123, 51, -57, -257, 144, -100, -19, -133, 144, -51, 371, 94, 43, 36, 267, -117, 130, 46, -67, -47, -102, -8, -135, 7, 7, 183, 140, -178, 175, -102, 47, 40, -70, -88, -54, 9, -112, -145, -90, 17, -101, 138, -119, -134, -132, -58, -187, 2, -5, 60, 115, -60, -30, -29, 137, -39, -35, -136, 235, 51, -231, 105, -190, 304, -39, -31, -39, 11, -12, -92, -3, 104, 9, -138, 179, 119, -278, -186, -23, 19, 39, -79, -36, -42, -35, 150, 79, -175, 249, 263, -47, -156, -96, -42, -206, 36, -258, -191, 0, 161, -62, 42, -269, 9, 1, 132, 144, 73, -140, -181, 23, -41, -17, -97, -121, -28, -9, 26, -210, -43, 168, 207, 208, 93, 74, 8, -121, -15, -93, -94, 70, -47, -48, -60, 102, 73, -6, 39, 33, 31, -191, -54, 261, 112, -86, 174, -42, -89, 88, -53, -57, 20, -108, -44, -109, -66, -12, -68, 102, 222, -112, 83, 16, 56, -63, -42, -218, 43, 26, 54, -186, -61, -50, 72, -22, -93, -72, -95, -240, 98, 232, 62]
4406F2K1N0j55n5K77P8j81r4J3J5M6K15k56l6NJ14O5j81p4K12l76L80j83rK90
4431B43m75K74j83N4q4r3K24j36K20or3J85l69K14L9j95J11K74k73R6k7k65L20
4454E5L2j64k38J35K22P0m1j02K1K66k32J8j49J01jM5j09J24o1K39l40N6K87k78
4478d4q6n2K14l34L50K63l57m9J87o6J6J17N9j81N4L9r7p6Nj93L59r8Q0j75K05
4503A40j26l4P7j33oO5J2j07j6K83j77j74K48m4k42M33k64m18M78jM6m85N93k22
4527g4J09N8p2r4K73k22R9m4qj74L75k44q2P5k44M30R6k59O0k02O4K09k50K87
4551A66J05l26QJ04n8n1J91j01J23m4j56p0K04j30k5j82R8J57J95j68j40o1L3
4574a28J87j26R8m7L8k02L26j7k40k5P1J16j34J63o2j71J20M3K05l35l1K19j88
$$ y = [62, 83, 133, -22, -77, 200, 278, 97, 3, 16, 31, 77, 292, 36, 0, 5, 119, 184, 3, -71, 141, -235, 145, -38, -47, 243, -232, 42, -141, -87, -171, -264, -40, -176, 44, 38, -55, 130, -239, -25, 14, -181, -70, 204, -69, 27, 0, -265, 55, 87, -77, -315, -180, 42, 112, 71, -31, -10, 256, 24, 42, -107, -6, -7, 38, -71, 53, -8, 231, -109, -53, 234, -44, -130, -182, 32, -302, 48, 311, -46, -95, 92, 26, 42, 159, 218, 37, 91, 130, 33, -43, -38, -231, 128, 30, 110, -65, 140, 14, -20, 57, -76, -82, -17, -5, -112, -128, 155, -22, -196, 52, 8, -234, 199, -65, -483, -5, -6, 40, -445, 148, -74, 35, 93, 21, -73, 200, -22, 77, 33, 25, -149, 226, -18, -100, -25, -269, 161, 257, -2, 58, -144, -80, 129, -121, 166, 271, -55, -47, 57, -1, -52, 139, 38, 161, 117, -39, -109, 95, -35, -60, -242, -144, 13, 208, 40, -100, -161, -128, 59, -67, 31, -16, 22, -180, 146, 129, -111, -136, -65, 51, -83, 80, 18, -153, -33, 10, 215, -120, -151, 68, -120]
4597a20K39j14L6J3j3k23k9J98m2lJ75N6o2k33J9Q7J22L3o6j41K01k16JO6K9j18
4623a05m4K31p4k5j77P6N7M03j88r5O4j07n4j51K95j50P9r0K98l59P1P2N3q8j92
4648b00R6j59M49l15N8K87k60J61l13J6O9r8O5J15j96J31L72r6K8j35j01l05O03
4671B72l16Q7oj10j48j23L96j16o2K08j85K48j08j4j74K26R2k36R0P0L4k07J20
4694C8l06K56J57k63l6J03o6J46J23j23l17k4Q7J80k02L33q5j14O8J01o4k45L17
4717F4m2j6K7l1J6Q7j28j70K45m2n5k8r7J22K8K05mk62J51j01r9K75k09R3j8L00
4743C11l80K19j70J50rj70K9M1J10k87M0J67q1Mp3O6J8o9K27j64R1j25pJ84l2
4768I0j29k2R7k98K61k32j0O67m22LL8j43j90J22M31k78%j12J11j47M0j27L17
$$ y = [-120, 119, 5, 41, 54, 41, -182, -211, -13, -55, -58, 117, 173, 111, -122, -103, -16, 106, 139, 73, -68, 133, -83, -82, -16, 13, -105, -149, 82, 8, -17, -194, -118, -61, 342, 154, 59, 123, 16, -38, -189, 106, -44, 35, -55, 243, -116, -45, 27, 80, -8, -200, -104, -263, 186, -129, -71, 216, -44, 117, -196, -180, -111, -209, -144, -29, -225, -94, 278, 182, 210, 75, -26, -331, 272, -44, 43, 37, -73, -221, -344, 52, -64, -126, 82, -103, 145, 37, 23, -151, 75, 167, -69, 21, 91, 125, -82, 38, -268, -12, 145, -118, -154, -51, -117, 29, 152, 29, -288, -312, -225, -45, -247, 86, 1, -113, -45, 56, -8, -253, 64, 22, 6, 33, 2, 18, 105, -23, -193, 52, 10, -45, -73, -170, -48, -20, 185, 181, -81, 70, -31, -130, 145, -64, 29, 11, 311, -69, 150, -20, 130, 121, -49, -20, 21, 131, -156, -116, 51, -30, -26, -99, -33, -15, -84, 143, -21, 70, -55, -62, 122, 90, -39, -61, 36, -262, -1, -233, -243, 424, 2, 5, 43, -100, -290, -168, 263, -15, -15, -127, -16, -163, -123, -250, 67]
4791F7L9j93J39%P4j3l2k93N2J8J85j08J2J51k34j5O8j36L83j79nK00l32J92J69
4816B09k73J40J3m64J97K74j32lJ21M4k76K32k01R4k77K15p8J22j6j47k8K60n2
4839b6J89k67J24J9j5K4k91K42r2K26r1L24l49K79m52L09k7j93j03L70k5j00k00
4862a25J73j8j81K15N5j44j73J23K7j23M29m42R4J80j85J43J3J03l61K73k76L31
4884A31j05J73j94o4L0J28j44N8L20l19m3p6K34j46J25j5N1k06M9m4M5J4J6j21
4908a03L50j74l1kL%lQ3k58p7L9O2K47J5k55r1N2J28K9o6J42l01N2L95l80Q3J13
4935E2K35j49j42N2r1K99l43N4O6p2j24O4%L21k79M0j85QK63j43N9m8K54l47J8
4960a38L8N5K34k64J28J74m27L13j52J44L0k18J6M2J92j13j57N7L67l86LQ4j8
$$ y = [67, 106, -87, 52, 52, 126, 113, 81, -212, -160, -142, 43, -65, -53, 98, -136, -151, -83, -219, 164, -15, -20, 180, -152, 40, 209, -64, 76, 89, -375, -178, 96, -36, -39, 82, 126, -150, 82, -119, -25, -302, -87, -165, -43, -59, -206, -234, 26, -26, 163, -104, 20, 39, 24, 48, -243, -1, -93, 133, 42, 366, 17, 296, -156, 153, 126, -67, -170, 200, 175, 75, -125, 48, 30, -151, 64, 119, -25, -198, -75, -48, -171, 258, -184, -90, 90, -95, 48, 61, 164, -197, 76, -200, 131, 26, 199, 5, -59, -29, 99, -45, 13, 333, 14, -29, -105, 129, -17, 108, 93, 144, -62, -13, -57, -12, 2, 18, -103, 247, 73, 42, 40, 43, 43, 40, 123, -135, -212, -173, -111, 136, 151, -104, -195, -143, -15, 14, -52, 90, -211, -159, 236, -144, -61, 52, 287, 138, -4, 48, -43, 256, -87, -33, 33, -39, -163, -99, -99, 222, -57, -17, -202, -194, 69, -74, -15, -63, 191, -156, -138, -100, -45, 189, -75, 53, 227, -200, 113, -39, 105, 135, -83, -67, -25, 167, 54, -103, -46, 321, -65, -62, 22, 4]
4983DK3kj47MJ40K17j27k11J9J86J11l53J68k76J92l5J03L95l46Q5k45n9k2L2
5007a44J38K9j79K41k34K1J29J03j95J01j91j48J50Q3L00k6k33LJ70j16k10J28
5029h0L5l7Q9n4m1o9L01Q2l19J06K76n5m48K00J45k20J18L5j23j52J99l7k8L28
5053B51j47n9p7O2j87K1L51q3k09l5o1K11j13L13l79J6L35k17K7O5ml71K96J0
5077A6j64J41j98K91j19J56m9p8j81R0J11K26j76N7m5p6r5K13j71R2p0K38l14
5100a05o4K33k03J77k54L39P7k31K0J55k14Q4j38K69j27p3L44r9%Q5m5k79Q9J00
5124A40m8J2j56L8o7l2q5K02k2J39j38m9J34k42L57k02R2Mr9k5k4n4J44J90n37
5149c28K72K78k97nl8J24R9j93k5K93k06O9j69n5K24o1J47%M9j19K23l09m2M85
$$ y = [4, 27, 25, -122, -118, 22, 239, 112, -99, -80, 106, 217, -136, 32, -244, -52, -87, 16, 411, 65, 150, -95, -154, -176, -144, -6, 23, -156, 85, -149, -128, 1, 104, -91, 10, -181, -329, -179, -96, 204, 178, -55, -52, 118, 2, -208, -80, -45, -82, 7, -47, -88, -157, 144, 226, -93, 13, 289, 234, -214, -14, 131, -89, 29, 64, -59, -211, -12, -49, -77, 251, 104, 45, -32, 30, -157, -136, 215, 132, -77, -112, -173, 38, -75, 238, -141, -125, 210, -7, 20, 85, 81, -290, 6, 16, -148, -7, -205, 86, -33, 123, 74, -4, -185, -95, 16, 242, 66, 123, 78, 2, -93, 120, -51, 41, -29, 209, -105, -169, 64, -139, 38, -216, 123, 200, -31, -11, 144, -70, 14, -124, 145, 18, -55, 289, 190, 190, 275, 230, -49, 40, 140, 92, 104, -52, -14, -81, -113, -198, 4, -18, 121, -17, -66, 68, -174, 183, -19, 73, 77, -22, -47, -71, -125, 19, 209, -328, -56, 222, -75, -80, -118, 6, 105, -88, -113, 180, -26, 43, -126, -181, 43, -18, 129, 129, 178, 59, 282, -27, -69, 416]
5173D16m64L43k37j95j16P9L47M8q2j71J08K49k47qk29N2j10K85k84K02K90n50
5195b74J97J20%q4N0Q0k7j5q7J17J40l08K3K72k23j10K73m8M5j87M3J57k52J03
5219EJ9j1J02p5OK03k50ok24J44J14J47K2j94Kj3j11J62L3j62Pj31K20J29j21
5244A7Q9j04j30l6L00q3J19l72J80L33k78M6J12j10j44N4k9L6q2K67j39Q3k36
5267a07K05k18J07K4o3J34j34j5jK9J49k45K30J2k39J5M8O5q1K51j23n3ql5J45
5292I2j79R0O2j74PJ71r5o5J22k48J29J65j67MJ37j58Q9J0L6R6j19J65l9p6k60
5317b05L40N6p4k85J28N4nR9k25K75n0m6k22J6K61K9j91J7P5j44K50r4p3Kom4
5343f2J17j28K1K66l43J99j56K60j35R9p4p4L85m86L08m06K49L27p20L33Q3N2
$$ y = [416, -48, 295, 58, -137, -253, -174, 173, 221, 139, -32, 76, 325, 78, 70, -159, -107, -217, 68, -216, -14, 276, -274, -77, 43, 43, -41, 9, 89, 62, 47, -40, 77, 217, -91, -68, 204, -19, -129, 144, 96, 141, -46, -3, 154, -98, 5, 24, 13, 115, 40, 46, 249, -1, -7, -231, -87, 27, 174, 196, 2, 4, -9, -120, 42, 75, -87, -80, -211, 9, 138, 17, 106, 2, -128, -164, 136, 53, 172, -200, -20, 313, 35, 81, 193, 83, -61, -7, -36, 0, -82, 185, 46, 129, -107, 98, -120, -13, 11, -52, 82, -52, -67, -68, -39, 110, -135, 95, 107, -132, -117, -69, -4, -85, 166, 43, -10, -18, -53, 92, -87, 3, 65, -109, -102, 69, -26, -91, 31, -217, -88, 77, -90, -86, 51, -107, -18, -8, 28, 124, 5, 170, 131, 55, -205, 135, 191, 117, -168, -40, 14, 9, 108, -117, 158, 108, 62, -160, -144, 117, 146, -45, -28, 47, -97, 153, 59, -14, -12, -18, -62, 55, -73, -52, 214, -129, 70, -86, 174, 39, 138, 64, -10, 375, -111, 197, -209, 40, 367, -353, -20, 63, 115]
5365A15R9j27j53J7q8Q4J78j94MJ51j3N5k60J66j27R5R4O9j57q6N5m9q7qL88j96
5391B5M1J25m10K81j06L9n5J56k62l4L63j06J54k19N1j70N5J1q5J0MJ40j75J75
5415HJ99q5l35J33L2N4j18q7R9j75J66K40j34N3j8j42Q1K03M5k48K41k73L0N0
5439A9j25J88j00k97J66j0M3o3J83p0J17j07q5j7J13L34q3k25j44K05r9J43j85
5462i9K55rk82K42l1k39J22J03j4k26K97o6j8n4J66j72J53j23J30Q6m23K10J68
5485A76j05j71P3JK23k79J14L0l4l5p1K22n7K84j57j89p6k6J48o9K61l37j1L72
5509B87l08J24l53J16L59r9j18o4J38m4j76K87j76J97l06JL35j75J7q6O9j83K19
5532F1J69j98n9j11L28j25q5J12J42k22j98K09k9J65k12P0j4o4j02K54l39L81
$$ y = [115, 214, 87, -66, -49, -137, -53, 125, -69, -65, 86, 73, 128, -132, 34, -93, 2, 96, 165, 8, -78, -23, -72, -159, -167, 221, 25, 66, 191, -219, 62, -44, -5, -60, 96, -166, -200, 163, 57, 211, -8, 43, -127, -72, -61, -146, -136, -132, 8, -167, 8, 207, 122, -213, -80, -48, 6, -112, -199, -100, -275, -109, 131, -3, 50, 32, -110, -29, 174, 219, -29, 212, -61, -31, 19, -106, 82, -18, -315, -149, -159, -116, -179, 4, -66, 51, -56, -141, -158, -45, 289, 206, -19, -163, 42, -57, 86, -99, 156, 147, -135, 107, 76, -163, -41, 62, 48, -178, 119, 53, 35, -19, 147, -25, 128, 5, 135, 221, -202, 8, 176, 71, -100, -27, -26, 197, -82, 32, 62, 28, -7, -78, 144, 87, 371, 214, 25, -51, -77, 71, 2, 263, -74, -85, 287, -21, 103, -250, -134, 225, 126, 8, -56, 82, 38, -138, 149, -27, 170, -136, -135, 200, 25, 42, -44, 25, -158, 61, 230, 32, -27, -138, 190, 65, -20, 92, 234, 12, -186, 23, -6, 159, -53, 17, 3, -61, -163, 91, -248, 133]
5554A33k13Q1j8Q5Mk27Q6O8q2j7m3K60m3l04K53p0K6P4k3k79M06l59M69k74j53
5579a60L19l79K08J23j74K67j38o0k48L16k67L8K08J44k64N6L6k11J11j34O3K58
5601A12j62r2N2J69N7m75K93n5P7J28k44P4N3q3K44j51k1L5p0J52j09n2l0J8p0
5626a50J24Q6m5j24K51k19Q0n1J60j28P4l09J44J72J17k59L82l43j90L97j44L0
5648E5J41k04o4K12j36Mk05l9L86J0O5k53o6m1O1P0P1q6K21r0m1m1j43O7J81j13
5674B2k18J38K18l3m5p2p2L2L5Q7O3k73N4k33M35k87K88q7q4N1k19L01m5p3M0
5699B3j43J92m0j66J61P5m9j72K17n6J7k90K64J01l25O8J61j43K15J02r9j29o8
5722h4L46m54K32k93L09J72k26K22Mj55j5k43N88m23J3K25k78K3J12j14k18K75
$$ y = [133, -80, 1, -17, 68, 72, -155, -69, -1, -83, -100, -143, 117, 74, -230, 23, -47, -21, 53, 30, -249, 157, -202, 267, -7, -160, 159, -220, -12, 111, -63, 204, 66, 6, -242, 74, -193, -155, 53, 197, -67, -11, 25, -186, -75, -209, -146, 112, -50, -142, -90, 79, 136, -339, -46, -101, -24, 104, -140, -66, -13, -96, 148, -3, -24, 11, -59, 93, -16, -68, -98, -80, -150, -26, 60, 15, -109, 142, -77, 3, -48, 112, -16, 58, -251, -107, 65, 182, -77, 305, -38, -228, 169, 25, 55, 196, -8, -72, 140, 4, 8, -197, -236, 150, 160, 225, -28, -94, -135, -74, -4, 67, -19, 202, 112, 71, 30, -113, -46, 135, 22, -196, -58, 160, 127, 82, 10, -62, -30, 5, 92, 155, -118, -64, -297, 138, -149, 139, 52, -32, 19, -200, 101, 56, -17, 23, -120, 72, 32, -134, 27, 102, 53, -119, 98, 42, 59, -231, 33, 134, -191, -123, 38, -105, 110, 212, 113, -16, -84, 262, -192, 40, -253, 56, 228, 2, 224, 228, 73, 58, -185, 403, -20, -7, 218, -60, -37, 75, -39, -257, 18]
5744A8J86k99M0K1K7L00l51j37J17mO9n7j86K18q5J02J18k0j1O3j33j23J60j77
5768a44J89r0j51K62k8n0PJ11j5j80J01k07J36J72j86R5P8l0n8m8n1K07o8l28
5792b76R4K75n0j31J43P9j92l4K2J09j62K68R4m24K79j45l0k15O64m24K2pJ96
5815A55l88L05k3j09J04Q0j70J79j22Rnk24J59N2Jj35J44J23J03j62j18k9J88
5838A17j53R5j49jk3K49k20N3K31m5l79K54k47O5K25j60K42k19L5K08j76L7l25
5861b86J87Q2p4K73p2j51J51j9Nr7k03K2J64J23j20j73J70K2M0L1J88j78m2j19
5885g6J94K4l12R5q2K32m67L73k46L63k01K03m2j38ML49j97j16J8O1k22J05J54
5908G6k76O5J97k34L6K53l44N18k40j12J14n2j51K21L9N4o2o8q1K29j49J57k73
$$ y = [18, 204, -95, -55, -34, -7, 293, -58, -195, -78, -82, -13, -70, -256, -38, -123, -21, 97, 77, 66, 129, -4, -127, 33, -144, 45, -45, -196, 66, 38, -12, -5, 106, 91, -89, 12, -195, -59, 113, -73, 22, 100, 70, 12, -36, -87, 120, 52, -276, -182, 93, 43, -88, 55, 134, -58, -92, -70, 39, -123, 145, 239, -185, 94, -51, -81, -296, 368, -56, -34, -41, 155, -233, 72, 49, -60, 44, 124, -46, 133, 11, 20, 15, -209, -50, 2, 3, -132, 12, 135, 238, 76, -42, -71, 117, -36, 59, -90, -91, -114, 135, -85, -32, 199, 154, -225, 29, -218, -153, 72, -88, 154, -65, -30, 178, 2, 39, -286, -99, -17, -91, 182, 110, -41, 110, 91, 96, -1, -204, -182, -18, 105, -15, -188, -18, 4, 44, 75, 263, 85, 43, -76, 118, 142, -170, -75, -157, 75, -392, -19, -265, 98, -103, 100, 58, -80, -76, 273, 76, -40, -22, 39, -183, -78, 76, -200, -135, 62, -172, -136, 117, -227, 291, 51, -61, 53, 1, -150, 71, 110, 164, 102, 34, -47, 182, 33, 190, -83]
5931h3L3O1J86j90K35l43Q3n6N0k51J95m7J28j39K37j95Q2K80k83j00l7K14m8
5954A2M5j7k54J29L30j20O8k50J62j59o0L78l21J87k19kK16r5o1k5J72j72j01
5977a57J01m8k52M40K3L1j10j17J68j43n6K11n0p3Mm3O9P6rj32j42M1K06M4n3
6002B9n4J84k20J9J21k36K04p1J06j16O6J49l41PK8L04j90j4rk75K36J68n9j47
6026a11O5k0j0J02o3K2q7J81k83K95J79k88J17j44J79n5L7j38R9J7pmo6l52K11
6051a24K60j1j3k59L5K33j63J18P6k28K4o4M9J75P9J2m9O4m25J90L4o1R7M1J20
6076B10m17J58%K0L50j60k35M24l49r9J72r5J40l6J80j65j45n7J88%k1M2k67K03
6100D1j2o5J80L5O3l10n9J27m6L3J32M8j58M5Nll0l3r6N4J46j39J53o0J7l9p1
$$ y = [-83, -50, 11, 197, 7, 242, -101, -18, -74, -24, -275, -80, -127, 1, -138, 99, -96, -14, 266, -17, -117, -154, 60, 12, 57, 40, -214, -85, 245, 125, 193, -57, 105, -54, -114, 264, -57, 130, -89, -91, 125, 30, -31, -56, 116, -56, -157, -56, -104, -356, 84, 107, 138, 28, -89, 79, -64, -120, 91, 41, -32, -28, -71, -2, 74, 65, -67, -209, -168, 38, 82, 29, -25, 159, -61, -42, 79, -157, 47, -24, 82, -34, 32, 181, -160, -153, -125, 179, -11, -25, -34, -309, -73, 95, 36, -111, -46, -66, -76, 26, -37, -15, -102, 79, -204, 91, 270, -18, 99, -45, 134, 79, 116, -22, 77, 94, 87, 83, 17, -335, -124, 136, 125, 112, -147, -112, 121, -42, 76, 152, -76, -52, -116, -67, 108, 187, 199, 150, 214, -211, -21, 13, -48, 49, 90, 210, -207, -49, -49, -29, 321, 161, -74, 350, 1, -98, 74, -21, 119, 83, 263, 98, -47, -104, 84, 84, 63, 105, -162, 41, 29, -36, 144, 179, 242, -68, -127, 0, -46, -13, 119, 167, 9, 54, 59, 56, 26, -7, -103, -49, 97, -42, 111, 51, 68, 29, -42]
6127d2P9j95L39j90l1J37j92N2K47J3N6L8k47k84rJ79K3R9k09N3N4j89K28R7k64
6152a58J49J02p0q2k7J79l22J06K14J5q5J07j35K62m81K15j32m5O6R1L57l41j75
6175a90R1K53r4K9K35k81O5k01K29l85L51Kq6J30k24j24K50l3K6K4p0j81K04O5
6199H5j07J72k90J20j37L67j36J88k79K03j55P3j42J21l15R1M24m37Q5O3J47k25
6221h4R9o2q9J24L5K4j5R4M2j27q4K7K9M9n8j25J43op9J2k58K63M2R8o8J32J4
6248A72j06j78M7k1J9j3qK04q1j56P9k67J30J73pj44L10m8j59J73j69o1k13J47
6272a77J66k12L10k06J72r2m1J33J23k55K05k91J92j06N9j15k1Q3M2q3K35j53
6294c2K54p4k57%K54k44L35p2k88j13K90j25K29l38J02j58Q2R5p3J10K63k62J35
$$ y = [-42, 37, -158, 181, -9, -40, 97, -95, -43, 204, 217, 273, 311, 64, -220, -229, -50, -27, 72, -137, -84, -30, -219, 9, 106, -158, -9, 93, 23, -59, -86, 93, -229, -123, 91, 106, 21, 128, -7, 255, -226, -11, -143, -188, -122, -31, 326, -15, -190, -99, 154, 60, 89, 324, 43, 108, -93, 136, -249, 102, 104, 18, 148, -76, -200, 50, 17, 43, 67, -3, -184, 20, 85, -22, 150, -140, -20, -157, 210, 74, 262, -17, 186, 31, 104, -38, 83, -232, -141, 283, -154, -69, -6, 141, -84, 15, -47, -136, -12, 23, 47, 32, 126, 168, 41, -43, -16, 13, 62, 4, -121, 22, 16, -63, -51, -309, -46, -4, 94, 26, 158, 172, 66, -112, -65, -86, -67, -80, -88, 116, 35, -121, -42, -309, -179, -6, -13, -157, 153, 105, -54, 119, -50, -111, -324, -177, -11, -223, 87, -119, 53, -39, -80, 53, 176, -79, 126, -165, 27, -79, -20, -135, -156, -73, -31, -114, 121, -32, 222, 148, -109, -109, 145, -99, 236, 164, -124, -237, 53, -72, 157, -181, -79, -237, -155, -60, -133, -23, 240, -22, 113]
6317A13kJ26j65k00J75j22J19j79J92l45J16L5J51j33o0MJ50J40O1k00J74k62
6339a12q3K03k53K53r2J0M7O1R1k79LQ1k37L66j68K37k29j55K62j92K33K7o1J4
6363B7j42J8m7K65k35j8J22m7n9J26oj24J71j28R9Q2j3q8n3J61j88J27J06j24
6387C2k14P0%K13o9l12K57N6P6k88L16k41K13m6r7L2J24p9O5k15M6o4J77L0p9
6412Co6j22J94q7L10l89N6K00k39J95j34J0J2K42j33k05N31m29Q5j04j74K84k4
6435A6k0o4J54j14J78Jl50J14J09k41J06j19J98J56k30n7J75r7J32O8n7k43P6
6458a09l9M6J51mj75O5O9Nj94j16K18J42j14O0P1m1J28k81l1R1J23l51J65K36
$$ y = [113, 111, 237, 72, -128, 47, -75, 44, -135, 57, -288, -172, -137, 14, -119, -179, -175, -25, 115, 176, -24, 150, -112, -195, 8, -245, 8, -84, -74, -27, 34, 125, -154, -151, -70, -307, 59, -109, 128, -101, -256, 6, -186, 47, 74, 13, 27, -115, -97, -144, 121, -114, -132, -10, -57, -116, 10, 4, -120, 51, -77, 22, 104, 91, 3, -50, 111, -77, 50, 156, 32, -182, -112, -112, 101, 32, -280, -23, 33, 109, -179, 137, -104, 109, 63, -34, -2, 122, 43, 108, -107, -61, -125, 52, 82, 3, -63, -185, 9, -78, 232, -157, -101, 99, -140, 55, -79, -69, -57, 185, 52, -153, 378, -51, 34, -70, -244, 40, 16, -4, -68, 86, -28, 150, 151, -199, -85, 24, -217, -111, -230, -32, 124, -106, -163, 12, -85, 47, 115, 58, -185, -109, -148, -102, 49, 45, -130, -65, 4, 9, -185, -301, -83, 59, -55, 5, 76, 35, 163, -118, -149, -58, 65, -286, -121, 115]
$$ [...]
8191A08
##END NTUPLES=NMR FID
##END=
