##TITLE=1H_PR194_D
 DMSO+D2O, 8 sc, 
 30.8.2021
##JCAMPDX= 6.0         $$ Bruker NMR JCAMP-DX V2.0
##DATA TYPE= NMR FID
##DATA CLASS= NTUPLES
##ORIGIN= UXNMR, Bruker Analytische Messtechnik GmbH
##OWNER= root
$$ XWIN-NMR		Version 3.5
$$ Mon Aug 30 12:37:10 2021 Russian Standard Time (UT+4h)  she@DPX200
##.OBSERVE FREQUENCY= 200.131506
##.OBSERVE NUCLEUS= ^1H
##.DELAY= (6, 6)
##.ACQUISITION MODE= SIMULTANEOUS
##.ACQUISITION SCHEME= undefined
##.AVERAGES= 8
##.DIGITISER RES= 18
##SPECTROMETER/DATA SYSTEM= spect
##.PULSE SEQUENCE= zg30
##.SOLVENT NAME= D2O
##.SHIFT REFERENCE= (INTERNAL, D2O, 0, 15.7039)
##AUDIT TRAIL= $$ (NUMBER, WHEN, WHO, WHERE, WHAT)
$$ ##TITLE= Audit trail, XWIN-NMR		Version 3.5
$$ ##JCAMPDX= 5.01
$$ ##ORIGIN= Bruker BioSpin GmbH
$$ ##OWNER= she
$$ F:/spectra/data/she/nmr/H-F/1/audita.txt
$$ ##AUDIT TRAIL=  $$ (NUMBER, WHEN, WHO, WHERE, WHAT)
(   1,<2021-08-30 12:36:03.23 +0400>,<she>,<DPX200>,
      <created by zg, POWCHK disabled, PULCHK disabled
       configuration hash MD5:
       00 E9 B6 7A A2 85 ED C7 34 08 36 98 17 FE 4E 26
       data hash MD5: 16K
       07 61 F3 2A 34 16 5B B0 F0 FB CD A6 9C 60 AA B3>)
$$ ##END=
$$ 
$$ hash MD5
$$ EF 5E 36 C7 FE 80 DA BF A0 FD 63 12 70 02 9E 7D
##$RELAX= 
##$RELAX= 
##$RELAX= 
##$RELAX= 
##$RELAX= 
##$RELAX= 
$$ Bruker specific parameters
$$ --------------------------
##$DU= <F:/spectra>
##$EXPNO= 1
##$NAME= <H-F>
##$PROCNO= 1
##$TYPE= <nmr>
##$USER= <she>
##$AMP= (0..31)
100 100 100 100 100 100 100 100 100 100 100 100 100 100 100 100 100 100 
100 100 100 100 100 100 100 100 100 100 100 100 100 100 
##$AQSEQ= 0
##$AQ_mod= 1
##$AUNM= <au_zg>
##$AUTOPOS= <>
##$BF1= 200.13
##$BF2= 200.13
##$BF3= 200.13
##$BF4= 200.13
##$BF5= 200.13
##$BF6= 200.13
##$BF7= 200.13
##$BF8= 200.13
##$BYTORDA= 1
##$CFDGTYP= 0
##$CFRGTYP= 5
##$CHEMSTR= <none>
##$CNST= (0..31)
1 1 145 1 1 1 1 1 1 1 1 1 1 1 1 1 1 1 1 1 1 1 1 1 1 1 1 1 1 1 1 1 
##$CPDPRG= <>
##$CPDPRG1= <>
##$CPDPRG2= <>
##$CPDPRG3= <>
##$CPDPRG4= <mlev>
##$CPDPRG5= <mlev>
##$CPDPRG6= <mlev>
##$CPDPRG7= <mlev>
##$CPDPRG8= <mlev>
##$CPDPRGB= <>
##$CPDPRGT= <>
##$D= (0..31)
0 1.2 0 0 0 0 0 0 0 0.06 0 0.03 0 0 0 0 0.0002 0 0 0 0 0 0 0 0 0 0 0 0 
0 0 0 
##$DATE= 1630312562
##$DBL= (0..7)
120 120 120 120 120 120 120 120 
##$DBP= (0..7)
150 150 150 150 150 150 150 150 
##$DBP07= 0
##$DBPNAM0= <>
##$DBPNAM1= <>
##$DBPNAM2= <>
##$DBPNAM3= <>
##$DBPNAM4= <>
##$DBPNAM5= <>
##$DBPNAM6= <>
##$DBPNAM7= <>
##$DBPOAL= (0..7)
0.5 0.5 0.5 0.5 0.5 0.5 0.5 0.5 
##$DBPOFFS= (0..7)
0 0 0 0 0 0 0 0 
##$DE= 6
##$DECBNUC= <off>
##$DECIM= 32
##$DECNUC= <off>
##$DECSTAT= 4
##$DIGMOD= 1
##$DIGTYP= 9
##$DL= (0..7)
0 120 120 120 120 120 120 120 
##$DP= (0..7)
150 150 150 150 150 150 150 150 
##$DP07= 0
##$DPNAME0= <>
##$DPNAME1= <>
##$DPNAME2= <>
##$DPNAME3= <>
##$DPNAME4= <>
##$DPNAME5= <>
##$DPNAME6= <>
##$DPNAME7= <>
##$DPOAL= (0..7)
0.5 0.5 0.5 0.5 0.5 0.5 0.5 0.5 
##$DPOFFS= (0..7)
0 0 0 0 0 0 0 0 
##$DQDMODE= 0
##$DR= 18
##$DS= 0
##$DSLIST= <SSSSSSSSSSSSSSS>
$$ [...]
##$SUBNAM2= <"">
##$SUBNAM3= <"">
##$SUBNAM4= <"">
##$SUBNAM5= <"">
##$SUBNAM6= <"">
##$SUBNAM7= <"">
##$SUBNAM8= <"">
##$SUBNAM9= <"">
##$SW= 20.0188882624521
##$SWIBOX= (0..15)
0 0 2 0 0 0 0 0 0 0 0 0 0 0 0 0 
##$SW_h= 4006.41025641026
##$TD= 16384
##$TD0= 1
##$TE= 0
##$TE2= 300
##$TE3= 300
##$TEG= 300
##$TL= (0..7)
0 120 120 120 120 120 120 120 
##$TP= (0..7)
150 150 150 150 150 150 150 150 
##$TP07= 0
##$TPNAME0= <>
##$TPNAME1= <>
##$TPNAME2= <>
##$TPNAME3= <>
##$TPNAME4= <>
##$TPNAME5= <>
##$TPNAME6= <>
##$TPNAME7= <>
##$TPOAL= (0..7)
0.5 0.5 0.5 0.5 0.5 0.5 0.5 0.5 
##$TPOFFS= (0..7)
0 0 0 0 0 0 0 0 
##$TUNHIN= 0
##$TUNHOUT= 0
##$TUNXOUT= 0
##$USERA1= <user>
##$USERA2= <user>
##$USERA3= <user>
##$USERA4= <user>
##$USERA5= <user>
##$V9= 5
##$VALIST= <valist>
##$VCLIST= <CCCCCCCCCCCCCCC>
##$VD= 0
##$VDLIST= <DDDDDDDDDDDDDDD>
##$VPLIST= <PPPPPPPPPPPPPPP>
##$VTLIST= <TTTTTTTTTTTTTTT>
##$WBST= 1024
##$WBSW= 4
##$XGAIN= (0..3)
0 0 0 0 
##$XL= 0
##$YL= 0
##$YMAX_a= 189558
##$YMIN_a= -232056
##$ZGOPTNS= <>
##$ZL1= 120
##$ZL2= 120
##$ZL3= 120
##$ZL4= 120
##$ABSF1= 10
##$ABSF2= 0
##$ABSG= 5
##$ABSL= 3
##$ALPHA= 0
##$AQORDER= 0
##$ASSFAC= 0
##$ASSFACI= 0
##$ASSFACX= 0
##$ASSWID= 0
##$AUNMP= <proc_1d>
##$AZFE= 0.1
##$AZFW= 0.1
##$BCFW= 1
##$BC_mod= 2
##$BYTORDP= 1
##$COROFFS= 0
##$CY= 11.3945322036743
##$DATMOD= 1
##$DC= 2
##$DFILT= <>
##$DTYPP= 0
##$F1P= 2.36226072786647
##$F2P= -0.459571619588291
##$FCOR= 0.5
##$FTSIZE= 0
##$FT_mod= 4
##$GAMMA= 1
##$GB= 0.15
##$INTBC= 1
##$INTSCL= 1
##$ISEN= 128
##$LB= 0.24
##$LEV0= 0
##$LPBIN= 0
##$MAXI= 10000
##$MC2= 0
##$MEAN= 0
##$ME_mod= 0
##$MI= 1.114404
##$NCOEF= 0
##$NC_proc= 0
##$NLEV= 6
##$NOISF1= 3.799351
##$NOISF2= 2.8
##$NSP= 1
##$NTH_PI= 0
##$NZP= 0
##$OFFSET= 15.70392
##$PC= 1
##$PHC0= -13373.94
##$PHC1= 30.20099
##$PH_mod= 1
##$PKNL= yes
##$PPARMOD= 0
##$PSCAL= 0
##$PSIGN= 0
##$REVERSE= no
##$SF= 200.130013532006
##$SI= 16384
##$SIGF1= 3
##$SIGF2= 2
##$SINO= 400
##$SIOLD= 16384
##$SREGLST= <1H.CDCl3>
##$SSB= 0
##$STSI= 0
##$STSR= 0
##$SW_p= 3612.71676300578
##$SYMM= 0
##$S_DEV= 0
##$TDeff= 0
##$TDoff= 0
##$TI= <>
##$TILT= no
##$TM1= 0
##$TM2= 0
##$TOPLEV= 0
##$USERP1= <user>
##$USERP2= <user>
##$USERP3= <user>
##$USERP4= <user>
##$USERP5= <user>
##$WDW= 1
##$XDIM= 8192
##$YMAX_p= 0
##$YMIN_p= 0
$$ End of Bruker specific parameters
$$ ---------------------------------
##NTUPLES= NMR FID
##VAR_NAME=  TIME,          FID/REAL,        FID/IMAG
##SYMBOL=    X,             R,               I
##VAR_TYPE=  INDEPENDENT,   DEPENDENT,       DEPENDENT
##VAR_FORM=  AFFN,          ASDF,            ASDF
##VAR_DIM=   8192,          8192,            8192
##UNITS=     SECONDS,       ARBITRARY UNITS, ARBITRARY UNITS
##FACTOR=    0.0002496,     1,               1
##FIRST=     0,             0,               0
##LAST=      2.0444736,     0,               0
##MIN=       0,             -232056,         0
##MAX=       2.0444736,     189558,          0
$$ Real data points
##PAGE= N=1
##DATA TABLE= (X++(R..R)), XYDATA
$$ [...]
1846D5O3l11J35J43j91K08LO6l5l23K31p3P2j04k41L11J35k45KJ41J80k50j2n2
1870a02J23j68K2L08J29j72j98o9J82k33N7q8K72J2Kj74P9J08JO8q2L37l44J64
1894B34m15J4K42J73k66J0P0k86K92j70K05J37l33J96n2Q2k85L76k23J86k2j71
1916fj09lR8j90J66m4M84n16J90k16J58K5l04J56J83J11k11j7J38k89j12K40k22
1939b90J08J98r3M3K98j60l08KL34J46k71q2M2k7N1l9n0K29kn52K84K45J46l35
1963h3j37K61J64m75K28L03q1l95K3Q3J99o9k01J05K16q1j42P7M0Mk65J25qL97
1987B88n20K66j33K15j73jk9K84k1k67J19M7J89n18N68k59P7n0l79K05J25l18
2009b85K35P5J33j73j33M8J27k11K65N6m44M67k42K7j49K21K72k62k73K55J62
$$ y = [45, 108, -203, -68, 75, -116, 92, 95, 161, 126, -197, 34, -39, 33, -71, -312, -1, 134, -111, -109, 32, 212, -38, -50, -102, 21, -147, -125, 183, 312, 140, -58, -127, 55, -178, -121, -209, 63, 75, 77, -97, -18, 90, 91, 159, 77, 414, 70, 234, -181, -167, 75, 248, -18, -8, 62, -224, 68, -102, 103, 240, -93, 103, 51, 133, -152, 224, 1, 187, 165, -6, -115, -118, -20, -210, -44, -88, 396, -120, 70, -146, 12, 37, -267, -111, 72, 183, -28, -45, 93, -196, -308, -68, -290, -182, 16, -77, -34, 264, 104, -204, -202, 132, 278, 7, -75, -33, -60, -9, -48, -98, 131, 129, -423, -139, 106, 252, -83, -220, 41, 205, -270, -42, 261, 180, -215, -192, -109, 90, 21, -180, -75, 141, 60, -82, -5, 35, 39, -226, -101, -109, 288, -232, 34, -99, 116, -57, -58, -87, 197, 176, -91, 28, 75, 264, -254, 314, 55, 132, 82, -297, -92, 33, -285, -50, 25, 158, -15, -148, -100, 27, -184, 81, 137, -307, 160, -82, -55, -204, 17, 289, 27, -246, 9, 171]
2030A71j94J24K6j89L79m54m8P9N22n89j49J31Q1K08j4j1J71l24j89K59M3Jj30
2053i6L87k73k3n9L13j14J27l99R1o7J60K78m30J97O8j09N6k24N07l60Qj21K02
2076A19J58l53K42k39O3R0l38K66K63j99k6O8k11J98j77M4M4l0J09p2RJ38k68
2099a02K44k02J39j62J26k42P1O3J39k09J80K89q4l17J30p6J87k52j06J04K10
2120A30l05J22K07Mj96k15L13J36l09J97o4o2n4J27j28K25j8k22l9K81KJ84m25
2143a09j43M43j71j69o6L57j07k51K41M7O4m26K52N4M7p0k21J39K99j37k8k08
2165a63l4M25j3l5j90K38m53p9K06J20j77J49j08K87mr7N1r6P0J96m49K65r8j02
2189i1M2Q5m9q2n6J71j0Q7J15k15n1nm9R5J35j24k7M6m01M20R3m16M53l56j8M02
$$ y = [171, -23, 101, 127, -62, 317, -137, -185, -106, 416, -173, -322, -191, -110, 98, 84, 73, 244, -80, -269, -10, 33, 34, -96, 291, 18, -5, -64, 249, 135, 262, -137, -46, -113, 47, 325, -105, 92, 160, 51, 107, -117, 390, 30, 38, -83, 119, 277, -76, 166, -73, -10, 80, -258, 8, 271, 72, 46, 114, -97, 101, -76, -32, 12, -18, 91, 19, 28, 166, -102, 142, -60, 79, -83, 43, -199, -128, -65, 74, -135, 45, 334, 250, -67, 63, -13, 174, -78, -184, -80, 130, -175, -53, 154, 158, -38, -253, 60, 196, -113, 84, 20, -42, -96, 31, -97, 128, 110, -112, -151, 130, 132, 316, -109, -252, 191, 20, -149, -215, 142, 35, -216, 25, 72, 136, -290, -38, 16, 63, -7, -228, -89, 210, 73, 45, -163, -197, 228, 215, 180, -10, 228, -225, -304, -98, 22, -155, -6, -114, 173, 169, 72, 123, 27, 97, 293, -156, 109, 11, -91, -49, 36, -13, -95, -151, 20, 10, 97, 212, -3, -54, -59, -108, -13, 122, -2, -29, 17, -384, 36, 129, -287, 166, -190, -208, 194]
2215A94M3m57J27o9L23k11K57q8k75m7L62rj35R8k44L11Q0l70K38k63K93j15j22
2238g9J16K05j85k80j8K42j54J55l70L96m6j26J42J19n9q4K74k54km1Ro5K00r0
2262Er5K28p4m1R1k31J3L1J53k56K77j0J89n07K9K57J01k41j32J04k5OK04q6P6
2287F6j05o2J18j11o3K61k2k92J96J1N3J69j72j67J68j14J98M5l5j33K22j63j53
2310h5J16K11j46J30k22l12M44m8l18j80L40J19Jj43j05L73r9k32J75Ml9K1R6
2333A01p2K80k33R9q4j66K82k79n6M48m38J24k09K66l81M75l18J85j16K04J7p4
2355E5p8k19K60J06l57J26L6j98R4K7K82o9R8m8m5j13j8L1J17j10R3l16L69l34
2379b11L12n66L32M9KJ83M1j82k48L64J62k62K2K72k41K00l42K60J4r6J59k73
$$ y = [194, 237, -220, -93, -162, 161, -50, 207, 119, -156, -203, 159, 150, 15, 113, -131, 180, 260, -110, 128, -135, 158, 43, -79, 37, 242, 57, -223, -241, 1, -153, 2, -368, 28, -18, -144, -2, 117, 58, -26, 248, -6, -8, -49, -40, -105, 95, 5, -90, 138, 64, 23, 114, -117, -104, -73, 80, -176, 101, 91, 280, -227, -198, 59, 160, -81, -213, -109, -134, -128, 76, -10, 66, -39, -101, 17, -94, -157, 104, 82, -210, -14, -3, 50, 219, 47, -120, 48, -66, 132, 177, 142, 9, 231, 68, -85, 31, 242, 96, 226, 4, -308, 136, 88, -230, -410, -70, 49, 50, -93, -198, 175, 76, -156, 19, 23, -16, 5, 101, 29, 309, 76, 175, 91, -75, 207, -72, -128, 320, -118, 6, -203, 63, -318, 157, -161, 24, -92, 112, 129, 55, -23, -242, 18, 124, -233, -107, -71, -269, -175, -148, 134, 65, 163, 115, 70, -43, -61, -30, 87, -23, 70, -246, 123, -211, 101, -465, -133, -84, -82, 101, 142, -40, -288, 76, 238, -24, -2, 270, 29, 229, -113, 147, 161, 65, 224, -49]
2401d9n4J44n1L08k77k6p2P6m7L16j70J22k17K8m0j46J41J96q9j41K54j47o3K41
2425B37l12r2K18J02l13o8L12j56J92j63J34p4O4j76KJ91j29j57O3K23n4J73l17
2448a00j73L47o9k21M9K47k75J56K7p0o7K12p5m3L71l62L6r1J5J65k20J48j71
2471a64K67q3j21K78J02m05J72j82L92l40J81j88K46k39p0qR3L7M95k91l42N7
2493a13J33k17J04K88k62L9n6J39m0q9J28j75P4k88K16J97q9Q4j33N9qj57J29
2516c7k4l5N2r7J09M55m92K68k26j35K38N5j94j2Q8M5j80p4M06j01o6n0M9M5o
2541H1k54J63j6L4k5L0O6p0j11L25l15J39o9j09j23M39Oj35k10L36r8k43M54m40
2565a45Q3P4J7K06k07p1o0%j75M82j77o5J58k14O7P6j36j16Ql1K30J27O8l24J4
$$ y = [-49, -103, 41, -10, 298, 21, -5, -77, -1, -48, 268, 98, 220, 3, 31, -9, -155, -14, 182, 93, -48, 206, 59, -4, 237, -75, -167, 51, 153, -160, -228, 84, -72, 120, -43, 91, 17, 81, -95, -93, 98, -31, -188, -125, 98, 44, 217, -100, -273, 74, 5, -216, -167, 80, -195, -39, -12, -82, -149, 63, -12, -55, 316, -46, -10, -101, -86, 79, -141, 7, -164, 103, 20, -101, 177, 279, -126, 46, -136, 256, -84, 97, -91, 155, -84, -154, -162, -69, -32, 463, 172, -170, -113, 20, -197, -93, 195, -67, -28, -84, 55, 15, -74, 54, -121, -47, -335, -119, 78, -11, 73, -60, -1, -9, -166, -37, -61, -96, -44, -141, -32, 423, -69, 199, -27, -162, 76, 131, -63, -75, 13, 58, -122, -196, 210, 109, 43, -7, 42, 87, 81, -173, -10, -26, 8, -17, 13, 79, 9, -102, 223, -92, 47, -22, -131, -254, 185, 191, 56, -154, 182, 84, -159, 295, -145, -62, 12, 29, 235, 28, -43, -103, -103, -278, 204, 27, -38, 120, -94, -27, 49, -87, -203, -195, -226, 4, 131, 199, -125, -111]
2590a11J36J00kk89J68o8R1j38J64j29m1K46k00J06L0K65l02R8j03k2j83J40J36
2613I2j9k99J30J45j78J46m1J88j62J0p3J47O1r9k9K29l4n13K11R3j43K22l34
2636b50L20M6j40K3p1q1L84n49K69j08K62N0r5o9J37l35Q5J03j24J66J14j93K3
2659c3k91O32k37j03m8j2OJ23n3k57J93m1L22j6k36q1J03q5K10o0p1kJ50l18L26
2684A21K28l13o7K1k3R5k44J38k9P0R8P0j45K01j96j16J64j59M2N2j01l8k9L09
2708A49p0j2n1j92J05O9j13k11M02Q4rl94R7K74p3k8j56J64Kl2K9pM0p5M9M3m6
2735C8q4J61k61P5J02m8K42k39O1k02R0J52p7j09K01j51J62J9l27K29j5p0J76
2758A25r7j15K32M0Kk36k1j65O3J65l39K05K37k94L86ln03M85J05k70k43L00n4
$$ y = [-111, 25, 125, 123, -166, 2, -66, 25, -113, 51, -78, -119, 127, -73, 33, 63, 328, 26, 124, 21, -1, -184, -44, 92, 73, -226, -96, 49, -129, 17, -24, 164, 2, 12, -61, 86, 147, 48, 19, 248, 214, -299, -88, 5, -138, 84, -250, 70, 116, -24, -1, -72, -153, 231, -318, -49, -157, 105, 155, 60, -9, 128, -207, -122, -19, -143, 23, 137, -56, -33, -324, 308, 71, -32, -80, -92, -86, 37, -16, -273, -80, -121, 201, 185, -51, -132, -29, -114, 96, 36, -35, -37, 113, -205, 121, 349, 36, -31, -10, -33, 62, -182, -44, -73, -3, 95, 165, 20, 221, 25, -91, 73, -86, -44, 8, -93, -131, -160, 149, 79, 67, 16, -176, -71, -2, -115, -326, 76, 160, 151, -243, -146, 128, 55, 27, -129, 35, 37, 5, 34, 27, 67, -8, 41, 84, 38, -46, 115, -146, -71, 31, -17, 225, -14, 47, -155, -65, 87, 10, -99, 102, -49, 113, 132, -195, 34, 19, -51, 125, 28, -87, 145, 185, 187, -49, -70, -235, -172, -7, -346, -141, 96, -198, 188, 185, -318, 167, 272, 2, -241, 59, 5]
2781Em2L58j29l12R8J88r3k79J04O9j68K90p4J9j68L2N5j57K40j79J41L4J28n6
2805A04k93M04j08m9j04n0J42j73K59j29L1J26m01J59K0N1K02j45j65O9m1o3J78
2828B4m4J20j1k78K10j15L03m32J78J07J4k35K04P1J60l9k39J27k67L00m69L12
2850AP0J11l35K34j76K56n2j86J58O9p7k47K32P7N2j44R7n4p5J3K1j00O2Qj31
2875a16Q6j9m2K07L5k42K0j25L46l71O0K47N4l36L30k15j04K50r2Q2J94l88J09
2898c0o4J64L6j15l7M16j58m69R7J06J75j2k18j29K91j6J44l2j9p7m5j80K99j49
2922b2R8J7J72l43J2J09j60J19P4K14m14O4j20j1O8K39o2J82j91K60k57j50M41
2945C39m15J36L1q5j3Q3O1m88j7K67j08J97l16J08K34O7n2P6n4j56k9L59m16J60
$$ y = [5, -37, 321, 192, -120, -22, 166, 73, -206, -102, -33, -201, 89, 15, 34, -134, -102, -47, -204, 36, -143, -2, 32, 160, 104, -189, 215, 107, 58, -46, -96, 46, -127, 132, 3, 34, 160, -241, -82, -62, -11, 191, 46, -119, -50, -91, -154, 24, -20, 100, 89, -189, 21, -94, 209, -223, -45, 62, 76, -159, 45, 116, 276, 237, -2, 125, -142, 158, -311, 1, 71, 182, -153, 81, -95, 161, 109, -77, 81, 150, 73, -174, 58, 135, 187, 43, 140, 86, 11, 24, 45, -55, 7, 15, -116, -30, -49, -91, 116, 151, -91, -71, -196, 150, -221, -161, 86, 140, -196, 134, -81, -185, 65, -27, 55, 249, -139, -30, -94, 70, 106, -9, -46, 370, 212, -257, -160, -54, 121, 109, -109, -238, 53, 37, 181, 149, 130, 53, 8, -172, 127, -22, 76, 93, 265, -78, -66, 43, -117, 2, 76, 290, -124, -60, -180, -191, -123, 116, 54, 236, 45, 305, 48, -102, 339, -76, 60, 91, 6, -7, 76, 137, -351, -368, -101, -209, -12, -328, -220, 14, 81, 29, 105, 51, -105, -134, 225, -191, -31]
2969c1J72k75K11k71J70o2N0M11n06m5Q5L25j20j18j09J86q9j75K21j24o4L5R9
2992b4j19R6R2J53k42Q6j48M7J2j9j48J63J04k82L77k13P7q3L8M8Q7j07p8J52
3016F9r1M3k4j25L6k65L41J80l01k3J33N2k67K19m1O6N5k4j0j40K63k2m9j34L
3041e6k4K39j47p5l7M4P2j54j04M35k13Q9k66K68j45J41k96J49K69J00m10J72
3063E1j02KM51m84K2j09N7K28L8j12M0j09K5j8r8R1j1J04k05J71R8k64j2J52O7
3088G3j87N2J49O2L8m41N9L22j75P9O0j12k55K26p3J26K6K3j27J51j11j67L19
3111A17p9N2j98J65j8M7K22j69l62J36n7K47J56k82Q3l9mJ71l30l2Q9M5k0P2k59
3136b47L19J5o2n8M5o2R9M0K39j31j75M6j27J31k59K75n1m4Q0J01r2q1r6J26L62
$$ y = [-31, 141, -134, 77, -194, -24, -86, -36, 375, -131, -176, -91, 234, 114, -4, -113, 73, -16, -191, 30, -94, -158, -123, -24, -143, -47, 45, 198, -44, 42, -106, -59, -47, -66, -214, -51, 53, -229, 148, -65, 12, -71, -33, 15, 102, -5, -83, 69, -22, 21, -3, -128, -92, -357, -16, 164, -137, -160, -27, 25, -242, -23, -64, 2, 57, 33, 23, -117, 146, 124, 75, -59, -56, -80, 159, 12, -63, -100, -56, 16, -138, -242, 193, -20, 69, -197, 71, -74, 67, -229, -80, 189, 289, -121, 51, -51, -49, 402, -82, -60, -169, -112, 116, 154, 42, 82, -27, -2, -20, -118, -27, -38, 66, -139, 32, 130, -134, -146, 6, 73, -114, -62, 87, 149, 187, -254, -195, 127, -48, 31, 91, -21, -276, -50, -123, 3, 29, 52, -75, 76, -35, -202, 117, 38, 90, -108, 57, 39, 86, 308, 139, -223, -87, -144, 103, 259, -23, 60, 21, 17, 188, -142, -174, -85, -40, -60, 12, -247, 72, 87, 25, -33, 12, -50, 49, 89, 328, 197, 22, 68, -59, 72, -187, 88, 37, -7, 73, 174, 82, 1, -95, 31, 393]
3161C93o14K90j0J40k2k01q9L3l8J32J64J36k52r6j67L69N0l25M10j87k82L95
3183B29M7m36j02JO48n21J21L3k00L52m5J14k31j28k15K26J22O4k29K9J58j65
3205a28K09P7k41L7j65J16J63K9j60o8K84j11l5k40L50k5q0j35L13J6k35P8J74
3228B23q2k69J5K41l50J57J87R7l07j38L30j55j30J82k15M99l88K72j39j12J76
3249I4k02J64j87M32k88J40j51r3L66l74K74j63l30L09M1j70QJ84k93L48j15k84
3271b90K38q6P5K62j60r7m6K01K41l74r0K82k1m33M68q4j66N6k09J80oL9k99K44
3295g5K08j14r7L5L37k95L5k08P5O2K1k55K33L94l03l72M90k49L25n88L59J06
3317A24j22k2R7l60L69j55J10m14O07k12l0n8K08j09j70jN1J89j77K1j12J34l0
$$ y = [393, -221, 69, 59, 199, 177, -24, -113, -80, -118, 14, 178, 314, 62, -34, -201, 168, 218, -107, 303, 116, -166, 229, 276, -160, -262, -261, 387, -134, -13, 20, -180, 172, 127, 241, 10, -118, -333, -107, 15, 79, -150, -121, 37, -128, 81, 158, -83, -46, -211, -95, 68, 97, -63, -131, 153, 42, 7, -233, 117, 92, 12, -123, 190, 206, -29, 49, 223, 141, -128, -113, 128, -222, -65, 122, 219, -88, -226, 104, -51, -181, 1, -214, 285, -103, 169, 30, -82, 94, -108, 56, -131, 301, 13, 153, 2, -91, 275, -99, 175, 12, -318, -9, 32, -138, -130, 54, -239, 109, -6, -290, -52, -138, -63, 199, 39, -58, -104, 97, 338, -36, -126, 156, 135, -298, 170, 86, -80, -24, -233, -53, -59, -20, -319, -75, 133, 19, -78, -43, 294, -1, 34, -174, -99, -37, -16, -271, -38, 356, 53, -319, 171, -78, 247, -341, 18, 124, 2, -20, 77, -283, 86, -69, 41, -373, 234, 22, -8, -66, 142, 33, -137, -138, -87, 102, -75, -54, -166, -32, -62]
3340f2J8P2R2k17J41j09r0J97n4J50p3Lj9O2k66l9K11l4P5J10n2m5p9K68j39l17
3366a96K71j18M10j86j35J71k18J18l51J26R5Q9m1K6k12J28M2j48L87m04L54M5
3388B53k04j5n3k4o2K00k31Q0K00l21K65k60l4L68N9k03j55J61l32N43k23Q2k60
3411a66J51Q0k12R6k3J71P0k32K15j50j2O9j43O7J25j98J98J12q4rj44p7K79k93
3435a10j9J67k62k2J90Op0K73J57n24M58j72M5j99K64m39K04J99j47K04q1j25
3457ck13K65p5n0k4O2j07K61n5Rj79J84j31j6K43k72J21O1J62k03o8k62M35k46
3481a01J76j05q2L56r9q3l5J4j79L22j92K2N4k46O69n01r6Q0J5Q5l40N08k58J02
3505H6r3O5Q4j24K8j11j99L59k79K01J0P7j13J06k37R2R8k50MJ11K53m06L28k43
$$ y = [-62, -44, 28, 120, -97, 44, -65, -155, 42, -12, 138, 65, 68, 49, 111, -155, -194, 17, -17, 58, 168, 116, 71, -8, 260, 121, -196, 75, -43, 367, 181, 46, 217, -1, 117, -234, -108, -13, 76, 35, 61, -151, -23, 19, -129, 258, -146, 208, 253, 49, 34, -19, -43, -105, 95, -136, -56, 144, -177, 88, -172, -206, 162, 221, 18, -137, 24, -308, 235, 12, 94, -166, -15, 65, -147, -51, -74, 97, 167, -65, 150, 0, -12, 57, -86, -19, 106, -92, 106, 218, 134, 125, -19, -96, 183, -110, -129, 38, -224, -246, -56, -50, -120, 153, 310, -214, 244, 72, 117, -82, 182, -257, -53, 146, -1, 203, 122, -3, -216, 49, -26, -76, -100, -38, -145, 116, 61, 70, -109, 75, -56, -72, 171, -101, 20, 81, 243, 40, -28, -290, 145, -101, 75, -30, -112, 244, 145, 62, 27, 41, -138, 184, -8, 14, 68, -178, 491, -10, -106, -26, -11, 74, -266, 242, -16, 86, -7, 58, 142, 18, 46, -65, -264, 95, -184, 17, 27, 104, -9, 97, -140, -48, 50, -200, -196, -85, 168, -238, 90, -153]
3529a53n3J85jj13K30k07J20J37j16j7k41J06K20q2N1l93M70o4j64p8M45k35K09
3552B56r7R1j55L3J9%j8j77K57j41M3j15K05j76J8m1j16K40l07L33q6j53K97k02
3576HJ5J7j15J14j89L3M3K49j36M7k48K74k28J79j03J49o0J77r6l67L6O5K21J9
3600A04j83R9J51k93j63J52J71K2k79k84M78J44k15K53j61Q4j27M1K02O6n17P6
3622a79K59p2Jj86j54Q5K56J35j61l29L91mJ8k1l1j12J47M6j95K94k39K45k79
3645h5K24k47R0jm8J5r7N12l99m8K36j68P5nr0l4J31P2j34J37o4Q2l77K77J00
3670A54J2p7k23J16r0J9J53J52m56L49j40j00J84j50L9j40J75J43k38R0k40M55
3692A87m14L67J1k04J9K03j89L04R3k08o2j26K15n17L17J78j77J77k42K9on0k10
$$ y = [-153, -206, -21, -22, -135, 95, -112, 8, 145, 29, 12, -229, -123, 97, 15, 66, -327, 143, 79, -85, -163, 282, 47, 256, 159, 250, 95, 128, 147, 147, 129, -48, 209, 68, 111, -4, 201, 25, 43, 2, -114, 126, -181, 152, 66, -87, 210, 8, 23, 40, -75, 39, -150, -117, -74, 175, 39, 86, -162, 112, -116, 63, -40, 109, 49, 226, 130, -237, -201, -136, 85, 104, -79, 20, 171, -122, -285, -133, 38, 60, -219, -503, -25, 119, -96, 157, -4, 80, -47, -6, 196, 262, -255, -179, 80, 8, 9, -177, -331, -246, 10, 145, -16, -345, 46, 42, 60, 39, 8, -104, 43, 89, -106, 188, -51, 194, -85, 139, -108, -18, -19, -67, -52, -149, 363, -36, -84, 152, -16, 59, 54, -36, -70, 61, 133, -1, 136, 72, 154, -223, 54, 154, 166, 89, -134, -18, -108, -89, 64, 216, -240, 109, -31, -131, 53, -97, -58, -198, -23, 120, -118, -28, -268, 187, -227, 140, 151, -53, -34, 169, -20, 284, 377, 169, 107, -19, 196, -321, -4, 174, -3, 174, -68, -39, -45, -95, -305]
3715c05M30j09K99m99K71J84j45j67n3L09O0k92K2J62j31K3k79L51j62Q0J17j51
3737A5pJ8L6K6k1k83K14J28j72j06L82l02r2J92J9MM3k74K13L3o7mL2rj64r8L87
3764A43j2l29J80r0L23k84L1L3K14j49K66l02j60M48j87k29L55l53QK46N9l74
3786a63J95J03j09J12O5k76K35q2R2J03n17K34l06J73Rl7k4K59j8k2Q3q9P4j42
3810d8o2J80K47p9l72m6K61j41Kk5K32k37j66J12L25j77Q9j32L30l39j11M11m72
3833b18K43O7k71K6N0J64j40J79k88J97r5K20j45j10J54q2K02k39OJ67O3j43J30
3856A37l27J86J07k50J41j08P6N8n6j33L97k96o5J98j09Q9p7j04o7L74j44q6J64
3879A05p7km9j23J42J57r3K74m6l27o4K9j27J53O7j68J57k05J39l09L57n6k04
$$ y = [-305, 125, 16, 315, -184, 87, 271, 126, -41, -94, 215, 275, -17, 5, 167, 36, 59, -220, 131, -31, 49, 166, 15, 8, 26, 62, 88, 67, -216, -2, 126, -46, -152, 230, -72, -164, 28, 47, 51, 94, -180, 33, 66, -1, -5, 27, 18, -146, -244, 143, 131, -198, -18, -108, 215, -69, -38, -5, 209, 60, 326, 24, -136, 312, 125, -104, 251, -102, -94, 152, 211, -163, 32, 135, 26, 138, 203, -73, 162, 80, 172, 275, -242, -8, -314, -141, -132, -169, -193, 66, 48, 26, 109, 20, 94, -48, -110, 70, 317, 238, -134, -180, 81, -60, -58, -83, 149, -88, -254, -142, 183, 6, 95, -37, 293, -46, -157, 254, -218, 25, 92, -179, -153, -103, 61, -79, 100, -188, 9, -86, 134, -11, -121, 33, -49, 153, -86, -80, 87, 150, 7, 137, -190, -4, 103, -147, -6, -114, -38, 20, -36, -169, 228, -68, -133, 65, -44, 45, -32, -136, -203, 171, 27, -59, 105, 28, 26, -23, -146, -4, 153, 60, 334, 288, -39, -103, -74, -201, -48, 19, -149, 8, -197, -58, -367, -10, -66, -270]
3902b70K27k21K69K61k55j43p2J24M3N9Q0k74j5J34J86j22J40k62L51l58r6K43
3924B9K04l02M5Q8K35l54j73L50q0k25L70j03j4k78K45P8J89m10K9K97l73L39
3946A86n10M56k32P3n5p8J60n7j08K2J5K49k58OJ26P0j00j24K98q3k04R7j41J23
3970f9N6j16J08j46K11k13J68J47k91J73l19K87j23K47J41j31j06m04L78q0M8
3991c4j17K69j62N7r5J18J5j55J82L65m14j04l23M01J41j9Kk82M1j39L96k84J55
4014A4J38l52K13K10k88R0J26nk23R0J25j18J3J2j60J70m6J83l84J05J89k8j11
4037c7M5k84M55k38j15K8K86k57P1l8J84K2J26k48K32Jk87J90j47j10L29k59J39
4060H8l9J12k42J6K88k69R7l32K23J87k59OM03j32j95m6r0L54k26K88q4L1n06
$$ y = [-270, -43, -264, 5, 266, 11, -132, -204, -80, -37, 22, 102, -172, -187, -53, 133, 11, 151, -111, 240, -118, -214, 29, 233, -69, -24, 64, 299, -55, -228, 122, 42, -183, 187, 84, 70, -208, 37, 115, 304, -106, -77, 220, -153, 186, -324, 132, -100, -27, -82, -160, 0, -57, -165, -143, -128, 121, -137, -131, -5, 65, -35, -159, 139, 56, -148, -51, -192, -69, -13, -129, -21, -167, 44, -169, -1, 146, -145, 28, -291, -4, -127, 120, 261, 130, 24, -380, -2, -82, -34, -151, 118, -44, 13, -82, 36, 51, -104, 78, 443, 29, -75, -398, 3, 144, 125, 127, -155, -114, -253, 143, -141, 14, 152, -200, 13, 223, -65, 25, 151, 146, -77, 13, 138, 20, 33, 45, -115, 55, 9, 192, -192, -87, 102, 74, -37, 8, -276, 179, -59, -174, -146, 140, -117, -46, -84, 100, 122, 248, 0, 232, 233, -54, 136, -11, -121, 208, -51, 88, 49, 161, -81, -65, 223, -46, 51, -281, -58, 129, -130, -124, 279, 147, -48, -94, -184, 170, -56, 232, 148, 179, -327]
4083c27M04O4m42N19j37k40J82l7LQ0k57K31Ol25M04j08M1l4M9l6k16N38k98J27
4107A91J51k15k91j28K90L6J57J3j82J43j87k04M91m48K8J78M0j09Q7K16k48J50
4129A59j75j99n9O82n50R7O5o2k6K6K11l50J97J54k31J32j47K06k6j76n6K38m71
4152c61M21k7j9j31M5M08k33k35K91j48l18K54n3J42r4l9K0N7M9k40K87K2J65
4175B63l58J22j24o6j62L44j20K54j38jN0j31K06k34K50j13J28q5n9K6K88l99
4197e9O2k6J35K5j90P6j40K44j0j95j85N42m15N1k26L52K1J32k3l4k51L43j79
4220E0m7k4k31K70Qn6R0RJ19l42k2J51J6k2k96L26q2J35L9J28m21M1P5J34N3R6
4246A97q6o5J5L0j71Q2L50p47L50R9j17j21K91m1j60j08K33J49j13j66N2j50K82
$$ y = [-327, 77, 141, -301, 218, 81, -159, 23, -14, -11, 69, -188, 43, 49, -276, 128, 20, 61, 27, 76, 40, -176, 362, 64, 191, 342, 127, -164, -292, -2, 34, 191, 204, 22, 165, -22, -226, 265, -183, -155, 23, 63, -46, 41, 257, 9, 159, -16, -215, -274, 408, -142, -45, 20, -42, -68, -42, 169, -181, 16, 170, -61, 71, -76, 130, 104, -72, -128, 110, -361, 60, 33, 14, -117, -72, 336, 103, -132, 159, 11, -307, -53, -106, 36, -58, -97, -77, -20, 29, -211, 76, 98, 263, -95, 27, -97, -163, -325, 19, -101, 153, 15, 14, 64, -67, 139, -95, 155, 42, 170, 85, 26, 52, 340, -59, 3, -23, 112, 137, -53, 23, -117, 127, 117, -78, -263, 279, -136, -85, -311, 41, 62, 194, 171, 137, -114, 229, 50, 3, -21, -252, 18, 26, -30, 60, 69, 188, -154, -176, -25, -9, -31, -327, -1, -83, 52, 91, 219, -202, -161, -86, 48, 101, 197, 111, 46, 61, 91, -80, 2, 352, -395, -45, 54, -63, -184, 107, 66, -94, -202, 31, 180, 67, -99, -47, -197, 85]
4269H5k32O0m3K93k23L00m41J58J18k3L1j23J91l17L00k23j22K33k06L54j00M1
4291A11r4k34M31k68k28Q8K19N4m7J5l52K94J91J15l03J86P5k12k44l4L06p3J17
4314A13j44N3l37K90l8mK33j37J73q8r2k34K33L0K9l8j08K37j68M7P1k66L06n4
4338A07L2L4l09J31L2NJ23j42P3j75K10j08J06l7K41k11j45j55l3L08kj30k04
4361b49L25P7M5k18n1L80j96j58K57k13j95J94r7J4l2J30k38R6L73j94k83J30
4383a03J1P3q1p9L58j78j60M30r3l7j60K71j22j0J52k30K07l54n9l3K77j8m7K91
4407C06k76n5m9K11o0j27K69k44K22k14j08Q7J51l9k76K5K16j86L8N3k27L03n1
4430c1O6j20K39o1n6J9K0J23m76P9L95m16M39l24K25j54r2L27m1L2j16k09j30
$$ y = [85, -147, -87, -130, 163, -60, 240, -201, -43, 75, 52, 83, -40, 151, -166, 134, -89, -211, 22, -184, 170, 70, 111, 17, -217, 214, -54, -282, -194, 25, 79, 32, 47, -305, -11, 180, 295, -8, 178, 253, 41, -203, -237, 69, -4, 113, -31, 22, -315, -25, -63, -67, 166, 29, 202, 114, 22, -212, 21, 51, 80, 42, -66, 171, 3, 50, 121, -145, 161, 107, 139, 173, -136, -5, 27, 32, 155, 13, 86, -89, 121, 13, 119, 82, 323, 112, -33, -188, -221, 87, 85, -45, -249, 76, 153, 198, -20, -71, 309, 113, -45, 212, -1, -196, -2, -99, -85, -117, 13, -225, -129, 244, 50, -233, -103, -92, -19, -100, -179, 179, 1, -159, 271, 178, 141, -19, 252, 130, 120, 272, 42, 249, -105, -164, -197, 80, 62, 15, 306, 30, -25, -74, 137, 77, -50, 219, -25, 197, -17, -125, -38, 113, 74, -202, -177, 39, -147, -109, -56, -283, 20, -31, 35, -85, 154, 93, 37, 56, 76, 199, -277, -198, 197, -219, 220, -104, 121, -33, -125, 202, 161, 193, 77, -132, -262]
4453b62QL15j38L15l17rL76l06K7K69l39J60Mj52j7jrM3l6nJ47j77K20k74R3o5
4479a30J95j18r5K16M4j5K6o7Ml8j73N9n9J27Q4J74j8j14j25j2j09J26m8P6o7
4504e7L23l53P6j76J04N0J73j75J86j23k09J85OK26k34R3k10L5l8L53k64p8j34
4527b41J21L05l02O2K1k2J19j19K4J50j30j42M9M5p3L34l71L04q6K4j84j02L69
4550A55k45N3r3l5J81m4r8L13l01p5L13j16j1J42p3J25J52l56J91k09k22K93K5
4573F5j74K80j08Q2j52J94m83J85J52k77J34K11q0j41K45J85j33k43K14l41L53
4594A68m63K94j04k3rJ85j67M06k65K89j68l0j13J1Kr0K09m9j68j38K00Q5k66
4617b04K82o2L4l3J41l4j78m5J54j87M47l82J61j72k6M48m74K7J88k6q7j19M9
$$ y = [-262, -254, 61, -77, 238, -79, -88, 288, -18, 9, 278, -61, 99, 103, -49, -66, -67, -76, -33, -69, -74, 73, -104, 116, -158, -65, -130, 65, -53, -148, 68, 112, 97, 123, 56, 60, 22, -151, -92, -151, -24, 60, 234, 216, 102, -23, -35, -144, -18, -66, 10, -57, 266, -87, -11, -187, -83, -33, 140, -35, 151, 28, -181, 4, 10, 236, 2, 95, -115, -80, -118, 235, -29, -107, -241, -120, 185, -117, -55, -34, -56, 63, -56, -32, 118, -12, -154, -105, -60, -133, 201, -170, 134, 48, 72, -112, -214, 155, -90, -37, -130, -165, 16, -28, -126, 187, -114, -189, 124, 8, -3, 139, 66, 191, 343, -13, 178, -31, -253, 40, 65, -109, 171, 63, 145, -7, 187, -296, -111, 41, -236, -102, 109, 29, -112, 133, 318, 185, -58, 156, -185, 168, -295, -1, -105, -128, -137, 48, -119, 287, 22, 311, 143, 113, 0, 11, 13, -77, 132, 83, -85, -223, -23, 62, -204, 78, 16, 50, 17, 158, 124, -54, -99, 55, -132, 315, -67, 94, -78, -104, 344, -130, -103, 85, 59, -28, -147, -98]
4640i8J40K0l5m8j24Q7J25k85K44oK32k67k38M64L4k19j67K00L6kM1j83J06k4
4664C3j69J2j74L37k31M33k26r7J30j12r0Q7J38M2r3j4n1L60j57j79N7o6j46P5
4688a01Q0J60N0m1m4j03J25m10K52p4N7L08l72J40K28k80k8N5k61M10o4j06o4
4711h3q5L17k82L49Q2o8j90Q2q3J59k11m8J87j95J14l5k9j17J4L68j81l5n4k3
4735d7K97m66L36pj83K92k20K00l18O8j95L36j10K47j59O0J8j40k9k29M27l35
4757a57r0K3K92k40M1K19N7k39J10n5j17K2J82N2r6M9O0j54j27MK09k94K05J61
4781A17n3j13j4J93k92J61l1L3L6k07M5M1K55r8l49K77j18j39J80J10N8q4n2k0
4805f4K28r0k27K92l2l09K65l11K30K0j64K87J26j54j80K65j43j7K24k88j15J76
$$ y = [-98, 42, 62, 27, -21, -145, -58, 67, -218, 26, 20, 252, -15, -253, 211, 245, 26, -141, 59, 95, 93, 134, -49, 57, 33, -136, -124, -298, 39, -192, 241, 15, -82, 48, -64, -154, -67, 71, 113, 20, 6, -45, 315, 158, -21, 36, -30, -176, -101, -21, 139, 189, 148, 104, 1, 126, -284, -32, -106, -49, 259, -113, 27, 255, -25, -53, 2, -259, 151, 87, -19, -83, -168, 149, -133, 216, 298, 230, 40, 122, 39, 198, -13, -61, 126, -69, 45, 10, -19, -136, -122, 246, 65, 30, -24, -47, 250, -216, 120, 113, -70, 222, 2, 202, -116, -48, -243, 93, -17, 230, 71, 131, 149, 9, -20, -249, 178, -157, -247, -224, 68, -172, -131, 88, 145, -94, 16, -39, -156, -134, 48, 100, 4, 53, 113, -41, -168, -164, 45, -249, -44, 117, 64, -49, -63, 130, -162, -1, -32, 1, 37, -170, -125, -84, 171, 73, -276, 1, -117, -256, -76, 34, 92, 8, -44, -64, 164, 74, -153, 139, 107, -202, 63, -248, -18, 2, -162, 125, 251, 97, -83, 182, 39, 22, 246, -42, -157, 19]
4827A9q2J68j32J76j65l6P8NK32j47k82n7K64q3M3j33J25l5p4j91K68m6J10M9
4851G4j24Q7j32K14l73K34K9M7j3P5o8l17K31O4QJ22L3m9j30J18k03K65k99Q3
4875b4N3L1J3kO8N9k15j47J95k80O44n04R4J77k33L52r7l34J47O4j57J3M3j34
4899a74p6K94K03k54j43K74k29k4L56l56J95k12J08J13o8N6lJ14k74k7J29k85
4921b83K87L6J81k60n6N3j73K97k35qP9J54k41L00r7k8J27j14M9k09Q4j52J96
4944a3k5k77K84N6k6k53K58K99k55J25r3j50J04R4q0J17j50q5Q4j25K97j55o9
4967c8j11J66n5J42J77l74J71J30k18J90k05Q3r3P0j72L44j56L1j6J27j55K45
4989B83j76j6m3K01m9k99K55j65J4k6K08j49l2L5n3J40j39kQ5l3n8k8J54m9K1
$$ y = [19, -63, 105, -27, 149, -16, -52, 26, 31, 263, 116, -166, -223, 41, -42, 1, -132, -7, -42, -116, -307, -39, -85, 25, 74, -50, 37, -95, 119, -254, -20, 9, 56, 43, 118, 50, -267, -36, 28, 36, 158, 191, 142, 12, 130, -73, 192, -107, -24, 29, 60, 73, 71, 139, 198, -17, -164, 31, -249, 395, -109, -15, 162, -71, 281, 184, -150, -3, 61, -96, -83, -40, -174, -250, 44, 247, -7, -150, 124, -105, -129, 227, -129, 66, -146, -38, 75, 7, 63, 60, 174, -100, -127, 2, -283, 4, 40, 221, -39, -95, -42, -215, 82, -153, -161, -82, 72, -169, 131, 34, 6, 133, 19, 68, -141, -57, -209, -13, -38, -315, -31, 25, -1, -254, 4, 303, 48, 173, 80, -70, 34, 128, 48, 165, 15, -70, 14, -111, 186, 31, -38, -149, 17, -38, 104, 281, -93, 78, 208, -10, 180, -25, 58, -35, 35, -137, 207, 51, 82, 66, 193, 38, 283, 107, 91, 48, 249, 200, -99, 156, -9, 5, -21, 187, 38, 6, 41, -12, 128, -11, -13, 72, 39, -19, -47, 107, 58, 79]
5014G9j03M4N6j56n2rj88M6L91jj67K95l89oK81q7J8q6j02P4j65J98m2p3J32M5
5040C3k77K14J43J12l25Q6n4OL7J40m35L42l8L1Q3J82l68R6j54j6K27PK23l07
5064a2k5J05M5j94j2p9l7J43j14r4O78m69p2oK02k84L5J58N2Nj35K19k45J96j18
5089e8oj33L8L14j16k33J64K66q0j85pMJ44j75j1M15l56l0J20j06J20j48P0J09
5113A20r2q8jp7P6l6K49j55M9k7p5P5J4M4j6p6R0J98m28L07k12J61n1K28l96N6
5139f3L1J49k5j69j27q0O00l97K77l38L21K2j30o8J29J3l26J89n4k51J37K87r
5162A18l65N34l04L0r0R8m8k51L63L5j22j64J80j34J29j4J36k06j9O9P8j87k2
5185a56K71j44M4r4m6m2L17j61J14R8j54k6K24l41J48j68O0Q6L8j82PK72j52j64
$$ y = [79, -24, 20, 76, -80, -132, -141, -329, -283, 108, 107, -60, 235, -154, -160, 121, 34, 52, -34, -136, -62, -227, -29, -71, -144, -12, 33, -244, -30, 113, 225, -100, -14, -68, -62, -25, 115, -320, 22, -16, 15, 98, 280, -88, 8, -146, -162, 65, 72, 295, -12, -37, 68, 113, -81, -93, -172, -209, -66, -180, -274, 404, -65, -137, -143, 59, -225, -190, -32, 20, 25, -110, 109, -136, 60, -58, -64, -197, -159, 155, 39, -194, -30, 236, 156, -29, -36, -32, 112, -63, -74, 341, -15, -45, 75, -31, 89, -59, 11, 120, 28, -60, -61, -138, -62, -98, 151, -4, 45, 18, -57, 18, 32, 76, 60, -16, 74, 272, -156, 151, -61, 100, 49, 277, -119, -63, -32, 117, 92, -77, -204, -284, 316, -81, 196, -142, 179, 201, 71, 3, 132, 145, -181, 8, -46, -297, -160, 127, 118, -247, 287, -17, 13, -77, 21, -27, -278, 85, 120, -2, -166, 14, -120, 9, -5, 131, -75, -94, -25, 53, -134, -156, 115, -29, 15, -79, -125, -167, 150, -11, 103, 201, 47, 21, 245, -96, 52, -116, -56, 30, 68, -114, -107, 165, 13, -151]
5209a51L46k19L7j08K52j06J23l13K28j28J15p7L3mj80L13nj80M6m3k4%K05m6
5233A14o1j57L27l04q7L52Knq0j31j8L04j07l47K7NJ62M7o5Q4m8Q5r8j0Qj16J22
5260EK44k00k15K88j22m9M4J38k23J18Q3j62K24j06Q6l34L96n00M50j14l6j01
5282h6K9l7J54J86j32k23L5o1R2j33L27l68J34J56PO2j91K29k75O9j64K52p9k06
5306b23K35j15o1J03j26O3Q5J7k96J84K87j85J85k18Q2j83J82m8m9j50K5J29k3
5329a00O2R4K1q6k4J03l0Q7J43j94k89J46j57K29L1j35n0J05K12m8J21n27K77
5352iJ29o5O1j37Q3j76j32J83J08k83m2J0M4M98j40l73M73k26o8q4K64l7p0Q9
5376A00k63J31N8q6q2J14J58k75L22j07J3J98k95k18O1J94j11l00M35KP1p2J71
$$ y = [-151, 195, -24, 13, -95, 157, 51, 174, -139, 89, -39, 76, -1, 32, 28, -152, 161, 156, -24, 22, -21, -45, -45, 160, 114, 53, -104, 223, -81, -168, 184, 186, 181, 101, -30, -48, 256, 149, -198, -171, -166, -4, 43, -22, 62, 14, 99, 1, -9, -1, -117, 5, 249, 49, -166, 122, 0, -49, -5, 133, -90, 28, 111, -51, 173, 67, 153, -181, 215, -285, 165, 51, 15, -86, -57, -94, 60, 246, 114, -109, -74, -135, -43, -176, 151, -217, -83, 73, 80, 142, -49, 180, -95, -26, -190, 62, -17, -223, 12, -103, -164, -61, -187, -124, -39, -22, -318, -134, 153, -32, 153, -65, 17, -166, 16, -32, -81, -231, -206, -77, -100, -38, 56, 77, -9, -33, 70, 40, 127, 270, 76, -213, -67, -224, 5, 36, -99, -149, -44, 168, 120, 241, -286, -9, 120, 55, 116, -21, 62, -114, -246, -63, 45, -238, -280, -270, -226, 272, 132, -241, 232, 6, -62, -146, 118, 81, 11, 100, -163, -32, 26, -60, -142, -28, 130, -145, 177, 70, 83, 281, -14, -232, -171, 23, -88, -388, 47, 49, 120, 48, 219]
5399B19k83J9j38J95j22K50k36r9N09m98LJ54J4J98oJ0j36j94K7N7J50j89j6r4
5423b06L49k68l5L12l67M62k2k89K72j35k54J70OL9J47m2k40J08l04K88l7nR6
5446D5Kj48N8n1J52k18K37m5Q2j63M5j35K95r6k14J54J58n1k77K76j10n8j24J95
5470IJ06j17m6n4k9J28K8K02r6k8p7r9J66j60J71k61J78O5m8r6p7Q5N1j31J57
5495B7j17K1r3K51l07j59M05l36K92K13k81kJ81k29J36N4n0R6j42QL04k33J92
5518B31j97L0k47K78Mj18k54M17k47m8L13k46J98m5q1k7OJ96o8l19j30M87K2j40
5542A5L91o10L21n17N78k38q3J20K04n8l86J81N8M1L3q5oN0q5N3L38n14K84ml47
5567b66m6N21l26K91j07j0Q8q4q3K09m04N05k61j98N7M13l93N4K08k9O0j52m5
$$ y = [219, -64, -45, -183, 12, -110, 140, -96, -195, 314, -184, -181, -27, -13, 185, 179, 189, 53, -141, -114, -57, 93, -96, -112, -206, 143, -125, -160, 152, -215, 247, 225, -64, 208, 73, -181, -11, -5, 34, 181, 139, -101, 7, -297, -9, -46, -51, 45, 47, -101, -43, -94, 58, -160, 77, 32, 114, -49, -4, -139, 156, 60, -154, 0, 158, 107, -170, 106, -4, -62, -186, 9, 115, -2, -48, -102, -131, -3, 25, 227, 131, 103, 26, -73, 93, -67, 104, -157, 21, 86, 38, -58, -135, -50, 1, -130, 27, -90, -69, -162, 89, -218, -377, 28, -308, -16, 197, -84, -86, 95, -134, 2, 56, 6, 102, -40, -32, 272, 39, 231, 34, 64, -183, 95, 99, -19, -273, 144, -103, -151, 162, -84, 114, 69, -12, -39, -33, 163, 95, -224, -354, 133, 155, 15, 406, -204, 117, -400, 178, -60, -143, -23, 181, 123, -263, -82, -24, 17, 50, -35, -41, 9, -76, -23, 315, -199, 85, 81, -266, -312, 209, -117, 174, 67, 57, 145, 61, -22, 187, -217, 288, 27, -171, -114, 299, -94, -40, 168, 139, 199, 47, 2]
5590BK5O7k6Q1k08r7J08K30l73K16j80K4J48j31J08p4O0p8K63l75J81Q4m8K81
5614B88m72L06j6k58J02l5M0j52K37Q1l13Q2n7K45j64J46o7L2P6l1k57K0J65O9
5638F7j06j5P2P1l8l7Q5k7k54J54J26O0K7m35L01QJ18j42j15K06o4N7n1j0K00
5663B58l30rl8L95k84l1j08J11j20K60J5q9j62l0K53j55K20k57N1Kj5j7n6K12
5687G6n5J4j17J14M9q9k96K20N6L72l78lm0J41k00k8j45N30m4l54O8NQ6o3j02
5712a83K76J1n8k2m7k23K61p6r4J78J12j63J0j24J89O5l48J75Q5k30K35j18O0
5735b9P0J22r5k67R1j6J1m5JK98j72K34l32oR6k7j88K11p4J59l2n1K54k0k9l71
5761b07L12J2p1j8K25k08k84L77j75M6K0N6r8P5J3l43J53K42Rr3k10K34k64J70
$$ y = [2, 27, 94, 68, 149, -59, -156, -48, 182, -191, 25, -155, -131, 17, -114, -6, -80, -20, -98, 165, -210, -29, 55, 7, 288, -184, 122, 106, -152, -50, -85, -45, -197, 40, 121, -192, -110, -167, 78, -86, 60, -7, 25, 101, 70, -187, -167, -2, 67, -39, -54, 18, 89, 51, 14, 99, 72, -182, -28, 98, 158, 185, -250, 51, 59, 177, 35, -80, 126, 62, 119, 68, 58, 258, -72, -81, -119, 276, -8, -39, -147, -36, -156, 104, 119, 30, -132, -162, 91, -64, 156, -101, -50, -48, -63, -80, -136, 76, 21, 35, -82, 32, 81, -8, -304, -84, -28, 344, -34, -37, -77, 64, -136, -164, -309, 221, 177, -177, -109, -104, -18, -81, -183, 93, 104, 46, 24, -23, -246, 15, -61, -155, 23, 135, -28, -18, -142, 47, 112, -236, -61, 24, -206, 29, -89, -29, 41, 163, 68, -199, -108, -124, -113, -158, -157, 141, -31, 203, -129, -135, -39, -66, -254, -43, -117, 42, 10, -41, 213, 193, 164, -207, 105, 117, 46, 28, 253, 45, -239, 138, -37, 9, 29, 85, -13, 62, 75, -268, -115, 127, 136, 43, -167, 67, -197, -27]
5785b7j77L01l15k2L28l3k8q7J83m78K91J56j16J28p0O0Q2q5r3j30M27j28j01
5808F6j06J99O0m94J48J30k78L15K7N0j99J91j15k4j27R5j16K63J62l92K27J52
5830B34m26J97Q2j67R3k6k43K02q0j97L32R5P3j32K33r7k03p6q5J61M7J04J44
5853B65l56LJ33j23L0J01l21L22P8j16J89k36P4j14J46RJ33R2j93j96j5J5r6K02
5877B6j95J88O5k85K31MP6k19Q7q7L52l06L32ol59J17j4k29J93J41l23L11J4J2
5901A26j54P3k24r2M60j74jPR4m0j09q4j17M28M8j62j80Q4Q3J40l60J60J6J76
5925A98n5k23K94l65O5M5n3J7P2N0Q8j3Q8K0j16j14K6j73N1J46j4o8k20rJ45K98
5951A80j45L5j11j76M21j31j2k99J03R4L8L3j21J07K79k54K62o42K71p8j21N5
$$ y = [-27, -204, 97, -218, -240, 88, 55, 27, -60, 123, -355, -64, 92, -24, 104, 34, 94, 176, 91, -2, -132, 295, 167, 66, -40, 159, 219, -275, -127, 3, -275, 40, 67, 117, -82, 109, -6, -30, -157, -62, -178, 85, 247, -145, 82, 234, -192, 5, 87, -80, 13, -13, -256, -54, -134, -331, 1, 96, 169, 37, 270, 173, -30, -106, -191, -30, 17, 121, 265, -91, -88, 45, -78, -48, 53, -268, 54, 132, 16, 205, -31, 43, -71, 75, 84, 217, 309, 116, -80, -95, -80, -176, 26, -169, 19, 84, -201, 30, 34, 110, -109, -22, -109, 243, -63, 269, 263, -96, 21, 7, -222, -29, 112, -211, 100, 114, 126, -28, 45, -179, -271, 189, 15, 14, 21, 115, 75, -34, -118, -235, 193, 241, 79, -101, -17, 66, 206, -154, 6, 22, 198, 143, -80, 214, -151, -86, -41, -94, -77, -5, 45, 133, 120, 208, 228, 112, -2, 24, -149, -98, 48, 34, -34, -254, -263, -118, 180, 35, 70, -41, -217, 204, 73, 61, -238, -135, -41, -3, 30, -91, 16, 295, 41, 303, -339, -68, -146, -267, -212]
5973b12L54l88M55j95j03L09k98lM39l53j44m9L0J51K84l23O9l28N11l26J52J78
5995B10k54R2p5JJ99k18K3K6L50j24l34J76j8r8K1Q9k29J70j99J41l4O8j47K13
6019D9M1J3p1J29l0k85M5N2K5J34j42j00J84q7p6Q1j15L78l50K08M9J2j55K65
6043B54j94j00O3J35R4k02J82j24j3%J5k26n1J63J29k15M74l04J8q7M8m0j3J01
6067A07m0r7l7L29m26K08jl02N36l60j15K26l8k07K62j46J67N4r7j7k2L6j17K84
6091A87m24K86r4K6P7l16K23r2L5K42j34N6j84Q9p6J20lj74K62k23J02k25M2J91
6115gj37L4K78k97K92p9L16k62q2j28j26L23j38J30j71P2O3l9j41J10j52K47k50
6138a44P3J75L5j13l31J29J06K8P9k9R2qL6k41K9J25J8p2J20J43n76J81O0k4J74
$$ y = [-212, 142, -246, 209, 14, -89, 220, -78, -81, 358, 5, -139, -188, -158, -7, 277, -46, 23, -305, 206, -120, 32, 210, -44, 48, -27, -26, 173, -45, -22, 4, 354, 230, -104, 72, 54, -44, -23, 66, -163, 7, -192, -51, -85, -17, -164, 49, 90, 103, 32, 161, 131, -154, -109, -57, -32, 102, -40, -140, 44, -43, -119, -38, -153, 225, -125, 83, 132, 144, -11, 254, 60, -40, 23, 158, 252, 50, 232, 108, 95, 95, 110, -116, -167, -4, 125, -90, 384, 80, 98, 11, 59, 19, 6, 107, 67, -30, -67, 262, -164, 44, 43, -259, 277, -83, -198, 28, -10, -217, 45, -101, 66, 120, 23, 6, -16, 20, -97, 187, -237, 49, -45, -19, 58, -258, -35, -127, -92, 150, 16, 72, -112, -23, -99, 21, 18, -156, 106, -117, -15, -240, -198, -7, -144, -110, 168, -129, 163, 84, 400, 138, 56, -72, -198, 125, -13, 117, -54, 18, 81, 42, -99, 11, -141, 106, -144, -71, 104, 139, 26, -305, -176, -70, -42, 37, 8, 100, 92, 128, -113, -84, 41, 59, -13, 107, 250, -326, -145, -85, -109, 65]
6163F5k4P5j00m0J45J36j59k62L08j87jKk15K47J43j71K08k46K60j23k00M1K58
6186A60m7K01j60n6j93j2M05m18N0J59j66J99l79J48J01J10l36J6L44j94K10j5
6208A27k25m6K34k06K91k95K16k48J86J47j53k06J58J26p7J49n0k0k9L9j83J2
6230e3L4L7J66j54j8k10J51j21J02P5k09J85j99L91l16J1J38J20l01P7J03J17
6252A26P1J33j68j46K21pj75Ql03K93k06J98j5l3K35l78K29P0j64k03J68J05j11
6275e2k8K79l32P2J27K1k39K7K39J46k60J48j11R8l6r9J14p5k58J30J98j96J52
6298F5l7p6k8K10j89J19k8J53L4j54l50K83r6O8j44K69J13j60j93K6L1K10l05
6321a79K18j67O1j0P9P7k06L38j32k22j97N63j88M4l6O6K3j16m2k21K48J64J9
$$ y = [65, 41, 116, 16, -24, 121, 257, 98, -164, 144, -43, -44, -42, -257, -10, 133, -38, 170, -76, 184, 61, -139, -98, 160, 113, 314, 154, 98, -95, -107, 298, -120, -70, 89, -77, 122, -257, -109, -8, 102, -234, -218, 126, -68, 142, 127, -98, -144, 90, -116, 175, -120, 96, -152, 34, 181, 28, -178, -20, 106, 29, 178, 128, 108, 79, 118, -65, -53, -19, 18, 184, 30, 12, -198, -47, -168, -66, 9, -200, -15, -214, 177, -139, -128, 10, 130, -171, -94, 9, 126, 197, 330, 162, 16, 237, 230, 55, 63, -240, 53, -153, 45, 30, -3, 232, -146, 83, 153, -11, -214, -46, 59, -52, -80, 199, -133, -61, 66, 87, -152, -125, 114, 260, 0, 148, 37, 135, 99, 0, 114, 39, -219, -89, 109, -87, 65, 28, -48, -76, 134, -55, 64, 36, 189, 223, 69, -281, 2, -94, -26, -170, 99, 212, 52, -141, -115, -84, 126, -179, 39, -128, -67, -77, 2, 79, -127, 211, 79, -143, -340, 223, 35, 79, 43, 109, 132, 16, -26, -247, 1, 165, 184]
6344A84r6p3k22K28Q8j03j24j15j7Q9K41oj93K10m11J17o5K17k0n0K77n2k48j7
6368a61K90k75J06O9M5M9lj65k75K99qK92k85J36n80M21K00L6rj26j21J26j67
6391a06J70J1l52M01j7j41k2K08j87k20L5N11k66k52K07j28o9K36n9Q2j56J26
6413A2r1L8rK69j77n0K6l32K93J01j09O0Q1m1k42M37j62r1j16J91Rk05K13p5J12
6438A42J6l3k27j59K53J60m1j69L2J6M9N4j94j67L29k80J77l3j42J13K9N3nk89
6462c16K92j8L37o09L00j59r6J35J8K88j03L7j63P2j16Q8J66j25m7J18J3j6k37
6485a41o1K65p7l1j33J30p2o3K96k00j26K07j02K37k2j66K31k02k64K35j11J08
6507f2Q6j82K65j69J43k08O9R3l50M60l3l58K32j4j26J01R9j4j53p9K24k6p4K27
$$ y = [184, 88, 15, -207, 21, 109, 6, -118, -233, -250, -161, 80, 74, -119, 91, -320, -203, -268, -51, -71, -121, 156, 104, -144, -161, 129, -146, -40, 29, 74, 123, 120, -45, -320, -21, -29, 263, -22, 114, -466, -45, 155, 191, 182, 56, -65, 61, -106, 64, 75, -277, 124, 107, -34, -56, 152, -35, -255, -220, 291, 25, -227, -20, -148, -217, 19, -40, 42, -114, 12, -79, -41, -50, 219, 42, -8, 18, -314, -21, 80, -29, 31, 112, 71, -171, 266, 104, 13, -103, 88, 97, -108, 105, 30, 142, 158, 125, -102, -261, -8, 152, 111, -58, -26, -10, 39, 93, -101, -268, 61, -219, -42, -75, -217, -104, -75, -22, -27, -316, -24, -42, 295, -314, -14, -173, -269, -134, -116, 172, 69, 106, -57, 15, -101, -13, 153, 28, -19, 99, 112, 96, -141, -202, 63, -14, -45, -178, -48, -120, -183, 113, -87, -213, -6, -108, 129, 107, -59, 172, -30, -294, -59, -170, -62, 24, -158, 107, -62, 81, -127, -58, 35, -315, 145, 112, -246, -14, -28, -154, -53, 46, 32, -121, -200, 24, -2, -76, 151]
6531A51k88J22L17k66r8L5J34r9o2J17j1j1o7k11K97n3J23j35k30J76K43j92k4
6554c2j04L96l57J12P2J76m11J92j84K04k5K2P6m17N56m64K28J96l85J19L3J38
6576A41j64K7j74J77J09l36J76K76r1j12j88K21r0K47k33j25J35J38j22LL27n56
6598b14L91j99O2K52q0j81L6j07O7R8L1k23p2J61J09k3j67L4M5j56K81J07k71
6621a9K25j17n1k35M0Q7K7Q9j34Q4J12n1n9J73rj94mJ15n8r1L8J56p6K01j55j51
6647e7j13K21k38K20J11J21k41j88J4J72r9J67j81k5P9j54k8J09Q9Mo8K20l41
6670b06J86J30k76L2m3J71k11M63j11k49K25M4j00k31j9Q3j12J6K13rj26J96j53
6693h7J10k05J38K53k16j49j44M02j61Nj4pK2p1J8K92m14J69J72l92L54k50K78
$$ y = [151, -137, -15, 302, 36, -62, -27, 107, 8, -54, 63, 52, 41, -26, -237, 60, 7, 130, -5, -235, -59, 184, -8, -32, -136, 260, -97, 15, 87, 263, -148, 44, -140, 64, 39, 61, 137, -280, 276, -188, 40, 236, -149, -30, 3, 141, -23, 4, -170, 7, 116, -220, -44, 232, 141, 29, -159, 62, -28, 219, -14, -139, -4, 134, 12, 15, 342, -214, 177, -22, 40, 292, 212, 31, 67, -40, 27, 125, 156, -67, -139, 22, 131, 108, -59, -25, 20, -136, 145, 252, -19, 206, 89, 38, -197, -157, -70, -43, 46, -88, -4, 108, 57, -2, 171, 162, -32, -36, 79, 21, -70, -32, 124, 48, 249, 94, -57, -170, 51, -187, 33, 144, 265, 24, -164, -150, 22, -77, 90, -91, -116, -37, -191, -219, -110, -21, -17, -85, 135, -206, -20, 110, -166, -134, -177, -6, -217, 246, 135, -114, 111, 155, 55, -176, -195, -112, -224, -208, 5, -4, -130, 66, -87, 23, -182, -44, 209, -7, -156, -300, 102, -59, -54, -68, -75, -53, -124, -106, 186, -228, -59, 113, -279, 75, -175, 103]
6716A03k6j58J11r6K10k26N9k34L07n1k19J23j37K40L1q4M6J96q3k56M18l17J00
6739E7m67J29K55j13O9j05R1L4P1j98R6N1K09k60J60k1j18j76L17J89k20Q4l7
6762I7m36L11k41K8L5K40J01k22j6K43k54R6J99m42L92l04R5P9J16l85M61l29
6784a36J85k14J2J26J72k14J0l1M6j43K74O7J7m9rj42K24j32j57K75k45K4o7K64
6808A57j46K0j04O0J22o0ro6Q0k12J2J07j32L26m74K59L51m44K8R8P2j24k17J96
6832a00N4Q5J69k32j61J96K46k53j12j72K33J89l41K82K51k97o6L1k75R9M58j58
6854A26l02k7J90K5N4Pl51J78J46n0m6l8K17k38J39p9j53J57J28Qm1J7J84l21
6878g0L8j08O8O9J16k79L01j77o5o8L40k02K10k17J28j21J08q6k42L13J04R1m39
$$ y = [103, 77, -81, 30, -66, 144, -82, -23, -257, 50, -1, -220, -97, -234, 6, 37, -47, -1, 195, 112, -144, 274, -43, 57, -410, -281, -26, -139, -70, -175, -84, -50, 21, -177, -81, -30, 179, -81, 79, 58, -60, -236, 81, 270, 50, 134, 97, -339, -28, -269, -241, -206, 34, 135, -87, -103, 140, -114, -18, 181, -261, 131, -173, -78, 1, 117, -268, 193, -136, 49, -165, -153, -27, 145, -69, -59, -90, -44, -187, 87, 154, 171, 122, 113, -29, 195, 63, -94, 181, -64, -40, -107, 157, 11, 31, -73, -13, 109, 49, 40, -26, 54, -158, -146, -39, -171, 155, -319, -60, 291, -153, -125, -27, 45, -79, -296, -100, -46, 39, 208, -24, -185, 11, 257, 4, -108, -280, -47, 142, -199, 83, 334, 37, -29, 2, -273, -174, 284, 126, -176, -203, -13, 12, 66, 73, -278, -100, 46, -4, -50, -88, 129, -109, 30, -49, -202, -45, 83, 91, 50, 67, 251, -70, -32, -140, -72, -3, 113, -166, 135, -42, -107, -175, 165, -37, 173, -44, 84, -37, 71, -15, -257, 56, 160, 251, -188]
6901a88J42J1J47Q7J6k30j45Q9J7J31j27r6K73k41p8Q2n3R3O1J47k78L26Oj67
6925B5P8k05L66l04J21pk14J87j76R3J01ll27K28L16j23j9Q2k53P9K1j43M3oj47
6950a87K63L8r2K75j83j06J1K14k11j16q9K82j54P3m5lj95j5K72k30J80l4j03
6973a55K51P9k34J77m13L43j55Q2N1k34K98j64L03j52j10O4j65P3j77K52qO7j64
6996i1K25k52k28L00P2P7k5RKJ67k09o6J4J67l61K57j51L56l96J41K2N3k26J31
7020a2j15K4j40J43Q5j81m9L4K32J49j26J31j17j75k0K00j73m5k5L35j07j31L6
7043d7j72K88j87J36N8j93J33q7K60K6r8J05k87l1K17j09Q7j76L22j45j16M6L69
7066C99j35j32k12O9J60j39j88J79L11l82r1J20M5m4J73j34k52K82O4K53m27j20
$$ y = [-188, -46, -35, 112, 199, 215, -15, -160, -71, -54, 77, -50, -146, 127, -114, -192, -110, -163, -70, -9, 138, -140, 186, 192, 25, 103, -102, 264, -40, 81, 74, -140, 47, -129, -36, 65, 62, -265, -37, 279, 156, 137, 219, -34, 45, 66, -77, -34, -40, -187, 76, 114, 22, 297, 114, 8, 19, 233, 22, -94, -183, 99, -55, 18, -27, -30, -225, -240, 32, -198, -18, -52, -155, 96, 175, -59, 118, -295, 48, -107, -25, 26, -208, 90, -74, 229, 77, -33, 31, -134, -61, -238, 14, 6, 73, -91, 134, -118, -346, -46, 26, 103, 78, 87, 89, 256, 47, -19, -5, 162, -199, 58, -93, 263, -133, 8, 30, 83, -143, -12, -127, -103, -243, -100, -15, -196, -245, -211, 21, 170, 44, 175, 58, -117, -137, 63, -110, -155, -180, 155, 48, -83, -47, -219, 69, -118, 18, 76, -117, 16, -71, 189, 215, 117, 222, -65, -96, 121, 12, 99, -77, 245, 100, -16, 30, 399, 264, 132, -80, -11, 149, 10, -178, 1, 312, -70, -161, -41, 4, -40, 133, -1, -253, 29, 93, 346, -81, -201]
7088b01O3J21j05K68r5j96q4R5J51J47r8k72k2q7M26j71o9J53j09L29k38k17K44
7111C3k05M06l35M7L78l78Oo3J25j31j60J37M12l71J49j52P6o2k16J47j2O5L3
7134g1J56l29K64k61M7J04K77j45K12k10k62L31K5m20K51j33j45L18j52J95J74
7155B26N0m85Q4K28k66K65k60j04K43j98m8M11J0j19l3M7j67o6Q1N4o9Q5n4j74
7179b59K34K08l17K6J13j92M3K52k83Q8P6j85L89l23J28p1P9J15kj82k9J97p9
7202B6kq8K78j82K24j62k2J11j62q0Q5J37k82K96j44R9M6l56K11r4K08j48J7P2
7226H8j42J45J77r3j65O7p0M8k73J42J31J34k68J61j42Q6J78j91N2j36L3j07J64
7249A9j05J30p2n8k00K82k68L26j90m1J33j51K35k35K61l07J30K22j81J33j86
$$ y = [-201, -138, -17, -122, 146, 51, -145, -229, -134, 17, 164, 66, -206, -228, -315, 111, -60, -129, 24, -85, 244, 6, -211, 33, -172, 234, -101, -54, 324, -54, -48, -111, 14, -117, -277, -140, 272, -99, 50, -102, -26, -88, -304, -157, -169, -104, -71, 85, -244, 20, -241, -194, -90, 187, 42, 254, 44, -218, 113, 138, -282, -31, -164, -309, 9, -143, 52, 226, 276, -209, -125, 103, -163, 102, -158, -262, -19, -217, -265, 146, 156, 37, 4, 51, -116, -182, -101, -47, -116, -31, -85, -259, -25, 183, -134, -108, 5, -187, -144, 108, -175, -87, -11, -196, 193, -130, -2, -73, 6, 121, 119, -63, -92, 105, 26, 24, -64, 214, 32, 256, 94, 72, 183, 21, -59, 26, 163, -119, 177, 33, 132, 178, -178, 33, -61, 147, -1, 16, 88, -54, 91, 268, 175, 10, 77, 7, 55, -218, -76, 55, 189, -79, 82, -60, 26, 204, 13, 65, -71, -38, -145, 19, -86, 44, -28, -86, -286, -4, -272, 54, -136, -177, -44, -195, 40, -195, 66, -241, -111, 111, -70, 63, -123]
7270a23J85p3K3J7j12j31Q4J15K49j40k66K50K14k94j0n9j88K17oQ4l9j60K70
7293A07j31K9K54k60j89L82n22rL63r7Q2R8j98K73k29J18l03J00K55l14J81m0
7315e0n1K20j6qJ37j06m41L76M8l00K6L61j11N4l48p1L25r5k95L98Rj11o8J08
7339iRj20l3mR7j34L01n7J65l39k6K29j01J31j53P2r2L32j32j93K60J7R4k00l3
7364H1j80K36N2l97J89kN7Q5q1j78K05Om7J2J8K0j16R0p6J80k2q6k72K80l8j39
7390a23M3kK1J97q7J43m2k0o2K0J05r1L7l14J86j12L16r8k20Q2j70K80n2p4Kl8
7416g3l1K9L41q1Mj55j0m8M5p8J72q1j26j08N06o5j41k01j74K61l2R1k01K47m7
7441D4q0r7L12l92O3J29J27l12K89j64J3L60l79m2L8j0J27k44N39k15k46L39k54
$$ y = [-123, 62, -11, 12, 29, -83, -214, -130, -15, 234, 94, -172, 78, 292, -2, -12, -71, -259, -42, -48, 36, -3, -163, 107, -24, 5, 259, -1, -190, 192, -330, -339, 24, -73, 9, 107, -91, 182, -47, 71, -232, -132, 123, -191, -10, -50, -101, 119, 103, 95, 232, 126, -315, 61, 109, -191, -165, 196, 85, 139, -209, -280, 45, -50, -345, 53, 62, -49, -117, -9, 0, -120, -153, -157, -60, -194, 107, 50, 215, -124, -150, 79, -22, 109, -44, 28, -64, 268, 136, -57, 203, 220, 314, 114, 81, -99, 137, 189, -208, -19, -21, 36, 121, 40, -138, 67, 73, 26, 38, 56, 76, -40, 50, -26, 154, 132, 46, -226, 54, 16, -123, -80, -82, -61, 136, 49, 192, 150, 130, 68, 88, 193, 102, 139, -175, 11, -101, 215, 117, -103, -21, -191, 89, 37, -37, -35, -73, -104, -75, 266, 185, 189, 34, 24, -24, 21, -57, 115, 34, -92, -200, 306, 241, 100, -101, -275, -14, -46, 45, -156, 91, 44, -36, -133, 179, -213, -150, -21, 106, -206, 83, -81, -68, 292, -87, -129, -91, -101, 26, -218, 321, 106, -140, 199, -55]
7464e5k71M71l00j38J26k6M5K48j10j70m8L60j95K22l41L34j76j18J82k6k83O5
7486b04K90K6n6J59k60l9P5j43J98k1J03L9o3l30M5J13Q5J20j33R9q3J10J30k50
7510A0l7k60M16k35j29J61j1J30K05j26j52J5Q0M2q2n32N07j26J21l6j6L04m4
7533B05m09M2K07K36m02J78l81M19J9l53L09j84J37L7o3j22J59nj71J36K05m72
7555b73M65k52L63l13j82J04L28k56l13K05O4j45J07j07K07L4N6j16K6N1m1J03
7577A15o1k5j77N7J48l2O0o9J58r7l75K96j84K84j4K20k42k65K06j37J52J25j09
7600C4K7j68J59j47l7K88k26J78j51k06K33j99K44m0j31K16M0p4N9r6k20K89M8
7623A20m10M21n5o1L2J01j38J32O0L6j15j74J79k86J80j54L39m83J03K93%l27
$$ y = [-55, -326, 145, -155, -293, -167, -193, -148, 100, -10, -180, -228, 132, -63, 159, -182, 152, -24, -142, 40, 14, -269, -204, 86, 112, 56, 215, -45, -84, -9, -152, 46, 25, 128, 167, 104, -226, -181, -68, 17, 137, 4, 103, 20, 130, 260, 10, -27, -287, 129, -106, -235, -74, -85, 45, 250, 124, -28, -13, 67, 109, 27, -505, 2, -124, -3, -39, -55, 249, 205, -204, -162, 45, 281, -121, 57, -324, 95, 114, -239, 70, -114, 23, 60, -3, -125, 34, 29, -142, -6, 199, -273, 192, -60, 303, -10, -192, -88, 240, -16, -329, -124, -60, -205, -98, -205, 2, 36, 92, -24, 2, 53, 12, 115, 54, 29, -148, -91, 57, 25, 85, 16, 174, 77, -298, -2, -186, 98, 84, 304, 62, -203, 3, -134, 18, 143, 34, 61, -107, 52, -95, -132, 156, -70, 108, -43, -249, -16, -215, 29, -11, -142, 74, 114, 40, 99, 3, -217, 72, 120, -290, 131, 76, 15, 47, 148, 10, 142, 202, 238, 123, -51, 128, -158, 22, -132, 207, -276, -173, 120, 120, -207]
7645b07j8n7L99J40l86J35N2r7r1M11k27R2ll22J45L5J45k25L25n4j68j04J67
7668H7j0P1j06k34K22R7l12R8L07j07k02%qJ47j7j09P6l6j41L64l20J66r4J43
7692H2k37J60O8l1l8K93j38N1j08Ol1l74K47J26J33j92J35m05L82j00J5J57j59
7715D2O8j30m2rJ55j06J22N3j78j59L13j14j1k14k0K10k45L65l3J4l8k19L84k77
7739f9oL8N2J98m66J68K5j45L62k46K23L9k38Q3j32K21k44j74M01l4r0p2k29M53
7763A18J4rl61K40j17M9p9M3j10J73J0J17O3j06p9N9m9k07K19n1M2J68j99J4j50
7788a88J87N7j33r7J96k5j53J57L5j60K26k5j41R0k79L63j34j16L03k48N1K02
7810A68j3o0k3j59K05k4j42r5M76m02J36r2L30m29o4J69p1N7J40K1j03j52N7J3
$$ y = [-207, -225, -282, 117, 257, -129, 6, 58, -39, -130, 281, 54, 146, 143, -179, -34, 1, 146, -79, 246, 192, 24, -80, 87, 77, 148, 42, -192, 30, 127, -185, -87, 220, 113, -89, -89, -97, 50, 33, -76, 0, -36, -177, 187, -133, 33, -61, 82, -155, 5, 73, 42, 4, 297, 159, 210, 102, 108, 77, -297, -50, 76, 209, 17, 152, -253, 129, 29, 44, 201, 42, 110, -20, -62, -71, 84, -22, 100, 153, -25, -184, 129, 15, 4, -210, -230, -20, -265, 100, 67, 81, 43, -176, 208, -69, -75, -37, 15, 213, -253, -85, -60, -205, 157, -89, 134, 173, -65, 18, -114, 107, -137, -311, 90, 56, -34, -106, -335, 118, 132, 123, -238, 2, -115, -66, -145, -102, -212, -39, -29, 88, 151, 45, -34, 25, -24, -231, -12, -63, -21, 147, -52, -38, -188, -1, 56, -77, -174, 22, -3, -156, 1, 36, -124, 102, 77, -64, 26, -253, 110, -24, -140, 163, -85, -34, 168, 155, 95, 72, -87, 118, 94, -48, -143, 333, -69, 67, -25, 305, -124, -188, -19, -90, -33, 107, 128, 25, -127, -70, -57]
7834e7l3J23k5j0J1L1j88PJ26J67j65Q3j41K40k65q5K00r2K26j47R6J57m74J23
7858i2N7J1J14J88N0m00NJ78n5j58l1m02N50J8j34L95l76J1J8L00k98J17m4k21
7882a99j47L87j63O8p5m8n1M98k44j23k2N0Q7R4j61KJ80k25M7J14j26l9L08l49
7906a37K93l65K14n0m30J83L33q5o2K23j74J81l30J62k81P0Q3P0R5k9K52m74K14
7929d4J60l1l53L79M3n35M18om5J37p4p4k6k0R4K22m84M70k56J27O1j58K83l19
7953c1l0Q2O1j05K25k36p7M42m79L31j95J96j39o8K03P3j19j60K68l70J64j29
7975i3L55j97j4J36k46J84j41j97J12l2K3K38j88lj05K57k13N4J87m62L46N8j12
7998e3j87K40Q8r7l3J4J34k22K92j22j76M48j78r8m1k03J14J16qo9L8k12J83L1
$$ y = [-57, -90, 33, 8, -2, 9, 40, -148, -141, -15, 152, -13, 70, -71, 169, -96, -181, 19, -73, 153, 6, 102, 259, -215, -92, -35, -24, 90, 278, 328, -72, -67, 111, 56, -102, -133, -535, 15, 33, -101, 294, -82, -71, -53, 247, -51, 66, 22, -199, -346, 41, -122, -54, -129, -177, -228, 270, 26, -97, -119, -69, 18, 112, -49, -47, 133, -92, -45, 69, -57, -96, 212, -137, 156, -209, 5, -45, -475, -292, 41, -44, -106, 117, -57, 124, -206, -44, -325, -255, -172, -102, -7, -36, 216, -258, -44, 116, 85, -268, 111, 154, -381, 37, 31, -14, 123, 49, -25, -51, -71, 23, 245, -239, 231, -25, 102, 163, 5, 288, -31, -61, 21, 82, -23, 202, -34, -111, 331, -148, 183, -12, 184, 45, -23, 180, 253, 134, -26, 242, -128, 36, -93, 262, 65, 51, 187, -59, 125, -16, -213, -101, -133, -110, 128, -60, -63, -168, 89, -124, -70, 117, -345, 1, 59, -53, -240, 0, 88, -9, -42, -28, 106, -116, 176, 54, -122, 326, 148, 50, 9, -194, -80, 36, 28, -41, -3, -215, -32, -1]
8022aJ9J9o6m6L28l40K97l29J0j5O4k25J76J66j19N0pKJ26O7k97J98j93J19k77
8047b74K82j83K76j7N4l7j60l3J54%l20J11j24L90j59p2L90j24j40l6j10J02L4
8070DM6O5k9kr7j64J75J16q8P5K6j09k10J92k42K80P1j67J23j95J99l08N7R1R5
8095DJ1k08Q0R7k17J96K16j18l8q5oK7k6j94M78l24j15R6j1J31K11l98K06j11
8119i8K64j19r1j25K51L1j97K66l5q8l45L43L54n35K04k80K74J30j84K81j50k40
8141h9J85m2k09J41r6l1K32m90M99j08j46K55j74K6J48m5k03L5K68k62K28l21
8163a99kK13m0m1pP1K14k04J52K34q03M03r8j41L54o0M9k27J82j36J16j15K58
8186A73j87j5q5R9K09
$$ y = [-1, 18, 37, -29, -75, 253, -87, 210, -119, -109, -124, -60, -285, -109, 57, -62, -12, -19, -17, 109, 176, -121, 77, -116, 3, -274, 8, -175, 101, 84, 138, 101, -59, -92, 62, 62, -258, -147, -271, 119, -40, -112, 278, 154, 14, -22, -132, -30, 4, 50, 115, 86, 84, -13, -177, -2, 114, 26, 101, 127, 18, -192, 0, -242, 38, 109, -58, 65, -130, 69, -239, -182, -91, 4, 15, -193, -113, -16, -233, -37, 179, 61, 23, -62, -68, -41, -67, -261, 217, -107, -222, -126, -137, -6, 205, -193, 13, -98, 166, 47, -44, -169, 82, 113, -84, 182, 147, 59, -286, 57, 411, -124, 80, -200, 74, 204, 20, 301, 151, -89, 96, 54, -155, -14, -110, -141, 91, -399, 100, -8, -154, 101, -73, -47, 101, 56, -147, -112, 156, -106, 122, -199, -201, 12, -28, -69, -76, -5, 209, 5, 157, 391, -412, -9, -107, -248, 106, 46, 95, -132, 50, -86, 30, -85, 173, -14, -29, -114, -15, 194]
8191A94
$$ Imaginary data points
##PAGE= N=2
##DATA TABLE= (X++(I..I)), XYDATA
0@%%%%%%%%%%%%%%Qj6J6j6J6j9K7l2M0m8N1o1P4q3R4j10J26j43J64j88K09k34
36a25K66k99L32l70M13m57N07n62O21o87P58q36R23j016J118j233J360j501J658
55H70j834K037k269K540k862L246l716M311n091O159p716J0201j4801K6080j03438
70h6283j45773K33209J15668r7549m1298R6030k2254j29218n2536Q9139J24976
81H4111N0860j02953j23915L2353R1234n7598n4164J43061J13271j62851j79369
92a65960Q1823J48565k3935n8000M9872L6925p4042q8160M473J00268R6266l0963
104G7132j19832k0599P8151j3215q0413O6004J43351m2837j72109k3489J14708
115F852L6476m8381O987N0701j3099p9606n1833M9887J06900K4573r0489n3177
$$ y = [0, 0, 0, 0, 0, 0, 0, 0, 0, 0, 0, 0, 0, 0, 0, 8, -8, 8, -8, 8, -11, 16, -16, 24, -24, 27, -34, 40, -43, 51, -59, 67, -76, 88, -100, 109, -125, 141, -158, 174, -196, 217, -240, 267, -295, 326, -361, 397, -439, 484, -532, 586, -647, 713, -788, 870, -964, 1073, -1196, 1344, -1518, 1728, -1988, 2323, -2768, 3391, -4325, 5876, -8925, 17155, -86283, -232056, 1153, 116821, 19272, -22026, 74004, 51750, -77468, -130004, -40865, 84111, 134971, 32018, -91897, -59544, 31690, -25908, -80072, 62989, 176260, 13409, -165960, -84137, 64428, 40493, -17507, 32365, 69290, -4752, -92912, -88439, 11829, 108095, 77132, -42700, -63299, 14852, 1637, -78776, -12772, 130579, 87742, -84367, -107856, 6852, 43328, -5053, 1934, 52635, 39536, -40070, -91903, -42016, 64884, 89457, -1032, -54209]
127e4209N4980J7574p4805K318J22907L8949j17537q1544N6593O2444j8804j9629
139a0763L5466K6619m3584p2840m974Q4692O2830m5980o6121K1968L5769m8693
151b5611l9361P5314P9891m8576r3558r05N6444J0714k3775J1075L8377l713o2786
164b6470m4473M4487P7037k446o1125o762L9647j9290n6322K5221Q4949R966p4900
177a0481l9128L3659K8221j5428q442L1116K5105l4928o1713J486O7924L2351
189D9742m2495k7396L0943O823n1139j5220O4431M5364l9402n3648N279K9992
201C274l47j6173J3461L4763l031n3911l1940M0698M9612j4114l5609J3465K2629
214B2777l1662l7933L0366N7472j900m7443j9101K0907J1318j4094k679K9694
$$ y = [-54209, 771, 18345, -56460, -54142, 68765, 107714, -9823, -91367, -34774, 27670, 8866, -10763, 24703, 51322, 7738, -65102, -70076, 14616, 77446, 31466, -34655, -12687, 23082, -25611, -64972, 10342, 90233, 41657, -51901, -52806, 3638, 14352, -9423, 1652, 40029, 36316, -26470, -70943, -26456, 50581, 48135, -12990, -19752, 19895, 605, -55717, -30496, 54453, 64419, -10481, -49609, -15950, 12271, -3157, -11599, 19517, 44622, 9694, -52019, -50533, 17391, 49742, 7247, -20149, 10794, 17617, -33522, -48742, 15689, 61053, 21651, -31997, -26718, 3274, 2927, -13246, 215, 34978, 31947, -21964, -53904, -13206, 36406, 22292, -13317, 148, 22777, -8885, -46818, -16452, 41020, 39120, -8323, -27424, -6517, 4801, -9293, -11972, 17722]
226A7722K0325l1891m7600Q692M9544J1034l1544l487K7016r732m3052r94M9336
239A5369K5162k9170l0445N987J6560o493j3015J6475L1229o747m5944j7275L5719
252b588K6951j9154j4667K0844Q402l3811k2161K8907L6963o246k9577q308J3569
265h76K227j4279K250K8596J3273l0835l2743J5153L1856l397j8228R646J7705
278B0348j8084l0506O757L5090J2480k0554j6875O423Q357j0335r071J8969K4955
291B7954j1688l5395n152K7137R810j5895n91J9238j846k8549j0976K3165K3109
304B0321o462j8575k237R487l319j3653N634K6184O219k7365j9137J6052J6363
317I512q331p589J4368R061j8667j9841Q032K3044O385j3083q985O147K761j1630
$$ y = [17722, 38047, 6156, -41444, -32752, 16792, 27826, -3718, -7205, 19811, 10079, -32973, -33967, 15369, 40531, 11361, -19084, -13097, 3463, -3030, -16045, 430, 31659, 24912, -21032, -38307, -2588, 24363, 5209, -9458, 11386, 19788, -14023, -36184, -7277, 29686, 23440, -6137, -14445, -876, 1351, -12928, -10678, 17918, 31191, 356, -32387, -17234, 14622, 11225, -7003, 2643, 20348, 2264, -28242, -21485, 13605, 26085, 5531, -11344, -4921, 3436, -6899, -15970, 2999, 27954, 16266, -19129, -24281, 2856, 12666, -3229, -3820, 15418, 13572, -14977, -25953, -2788, 20321, 13859, -4716, -6953, 2534, -785, -14438, -8804, 17380, 23599, -3766, -22903, -6851, 9512, 1181, -6408, 7960, 17021, -1646, -21487, -13455, 9589, 15974, 2891, -6094, 53, 2814, -8816]
331h816n153J8874J7655j3833k3872K304J7033j11r751O529J3962o999k0554m775
345a7507J6772J3507n036j0346O85O030o682j1732R163K1102j76k1582q274J2798
359a278N593q254L89J3052K890j5611j2155O964J4639L634q871l590N945j439
373A908j2177r53J7992J0085j3471j3874N265P913m278l845R222P939p246j4050
387i570j873J0961Q357l810n691L029K778q601p871J0119J5005l566j4004k033
401f770P230m00n178M197R592K3j1444p793M876J0006J108n852l3N234m192j0466
417i862J975J4280M466j0182o551M436K244m401k17P830N003n942r816j377P645
432d69N513l422k402M335J25r139m115R693Q691m042p504K92K798k391k441M292
$$ y = [-8816, -13969, 4905, 22560, 8727, -15145, -12841, 4192, 4081, -5670, 859, 14821, 7822, -12732, -17507, -735, 12772, 7736, -2610, -1925, 4105, -2577, -14309, -5146, 15956, 15780, -5802, -14076, -1278, 4315, -3939, -3550, 9502, 12392, -3219, -15374, -8410, 6229, 9863, 992, -2598, 3347, 1908, -10269, -11222, 6770, 16855, 3384, -10490, -5225, 2688, -1590, -5435, 3787, 11726, 4480, -9570, -11443, -482, 7875, 4065, -1626, 1403, 4181, -4420, -12291, -2172, 12833, 9267, -4737, -6770, 460, 60, -5118, -921, 8671, 8694, -2750, -10543, -5667, 4339, 5447, -405, -438, 4796, 604, -9862, -7887, 6393, 10859, 677, -5874, -1438, 806, -3595, -3812, 4018, 9021, 3079, -6737, -8114, -469, 5044, 1622, -780, 3555, 3680, -5459, -9574, 119, 8810, 4768, -2736, -2444, 354, -2037, -4478, -186]
448a86O682j21q131n409L375O707n70k898K413K951n765p310L803R566J060n868
464B99k214K048q39l020J239N937K940m330o693r52N855K094k381N99L744j887
480B439p939j027P519M308k929l209N64M22k861q95L817N181j107n615l460K866
496a926L209q01q61L190J156n803m280L873N503M0k710m47Jj565k129J630M731
513B811K014l121n049L86L056J60r35K179K564l114n123J56M442K487j718r63
529B32K08p96k328k98L244L557q03m148j830J927J242p58P71K822l79m475k062
546c874K805K889L1j065l96j68j474j393J278L316J832k662l120M74J524m87j13
563f03K470J400k952l146M65K600J048n7k10m46o11k075J5K322K646o35k951p78
$$ y = [-186, 6496, 6375, -1756, -7165, -3790, 2917, 2347, -551, 1862, 4813, -952, -8262, -4459, 5107, 6167, 299, -1915, 133, -706, -3726, -2487, 3450, 6390, 2060, -4633, -5585, 270, 2364, -17, 582, 4326, 2439, -5500, -6527, 992, 5300, 2371, -838, -274, 148, -2713, -3608, 209, 5390, 4283, -1332, -4792, -1926, 1283, 482, -379, 2811, 3967, -1836, -6116, -2243, 3260, 3300, 590, 143, 144, -1421, -3550, -1920, 2811, 4825, 1704, -3345, -2959, 97, 257, -678, 1501, 4065, 951, -4172, -4016, 426, 2913, 1195, 232, 440, -356, -2684, -2982, 262, 3819, 3016, -1132, -2962, -1035, 207, -551, 220, 3042, 2663, -1812, -3874, -1069, 1820, 1851, 786, 390, 222, -1252, -2645, -1367, 1949, 3781, 1119, -2001, -1527, -3, -490, -603, 1867, 3267, 315, -2831, -2366, 234, 1282, 1225, 1015, 569, -42, -2117, -2102, 220, 2866, 2231, -720, -1498]
581a498Q59j70k37J634K068j000k874j332J427J664L40q9K26m87j920q27J338
598h78K445J093k027j505J92Q9o90J163J617O42j871k041J69J333Q07L89L9l27
616F39j103j211m4K058J563r59r75o28n5l83K79J616R79p47k020n08M88J164N03
635F56M5L82p41j535p08J054J886L20r77p16k52m53k15R95J778l94j156j057o7
654a155N78N36O81L70r2j100j337K52J399R30j34p92l76l43m72M08J171Q89p45
673F68j016q17L08O44M15O74J33q14j184k13M96J266L91k90m66o36m85J25N61
692b40J258r0o45o22l74P0M69P09L39j67q41o06J03O38J17N76k54l63o95n7K56
713d19N61P47j60r38m49J45o0Q91L63K2o14p29l42L66R56j1M78n35p51M2k67O66
$$ y = [-1498, -639, -809, -1046, 588, 2656, 1656, -1218, -2550, -1123, 541, 881, 792, 1018, 531, -1389, -2216, -878, 1567, 2660, 633, -872, -680, -591, -1281, -118, 1499, 2141, 270, -1771, -1602, -269, 538, 927, 966, 639, -464, -1675, -1719, 339, 1902, 943, -32, -660, -715, -1098, -819, 797, 1776, 1029, -991, -1499, -1011, 153, 656, 701, 1083, 342, -1193, -1901, -847, 1039, 1359, 382, -334, -586, -1039, -1254, -259, 1519, 1125, -31, -1088, -1155, -577, -41, 640, 1010, 918, -182, -1519, -1267, 132, 1062, 928, 136, -240, -583, -1055, -647, 524, 1413, 668, -348, -1165, -857, -213, 202, 876, 1009, 195, -989, -1202, -706, 560, 951, 661, 195, -441, -926, -801, -240, 1018, 928, 283, -339, -713, -643, -174, 535, 874, 707, -134, -740, -637, 1, 118, 694, 440, 77, -618, -675, -419, 142, 889, 729, -209, -658, -513, -573, 318, 681, 703, 89, -640, -982, -616, 340, 329, 807, 272, -479, -437, -704, -38]
735c8L79K47l99j97m33J19QO28M10l22q56j38m9K95N84N59j85m97n64L4J62O87
757D34J51j40m37j35o84M96L07O09J8m95m36j71o4M54O30oN8m76o56l35N27R50
779E99j5l43n00K9j40L64J51L72j35l21l27j53M02nN21J21o45l30l54M21M58M53
801F23l68k16l53k06J06K69O12J35n44P0n07J40L04L59R5k59j51k54k94K31L93
822A85K12j02k06o27J0N94O6M52j55j60p53R5R4M05K03j05k68l60k6J54L85J39
844B32K50j07m16n38J63O65K9K35j65j84n25m1L99K73M2j78J18n02j53M37Q9K26
866C49k66j21k75K28j10K58J91P6j75l33j05K47J04J37r3K44o48m0J18K22K6N21
888E55m17k41l61K40L29j23M55k19N1p34L45k19L49N4K25l38k18J91j14M6L35
$$ y = [-38, 341, 588, 189, -8, -441, -322, -314, 314, 724, 402, -454, -592, -641, -346, 238, 797, 612, 115, -449, -415, -253, 434, 585, 445, 8, -127, -811, -315, -8, 601, 619, 124, -312, -483, -547, -93, 537, 531, 589, 113, -543, -878, -351, 599, 584, 241, -259, -230, -370, -6, 145, 517, 382, 61, -266, -419, -17, -22, 499, 620, -25, -355, -709, -288, 170, 623, 255, 39, -314, -520, -414, -145, 467, 602, 58, 128, -379, -239, 65, 424, 519, 260, 109, -145, -439, -208, 185, 397, 295, 89, -538, -528, 66, 132, 584, 429, 269, -484, -389, -295, 110, 313, 208, -60, -420, -446, -292, 93, 232, 482, 375, -41, -579, -416, 249, 278, 513, 348, 164, -361, -402, -3, 270, 312, 134, 252, -250, -403, 34, 123, 349, 83, -38, -313, -85, -195, 63, 254, 330, 155, -178, -283, -36, 68, 205, 112, 356, -292, -332, -214, 8, 34, 555, 138, -103, -464, -224, 105, -18, 437, 218, 269, -465, -120, -339, 10, 64, 289, -49, -267, -76, -190, -144, 191]
909A91K39l39m02J67J09L4K96l81K24m15l9o7L03J98K56k82j91J02j26J16J44
930A37k12P7k13j2k32L57K82l0J5k13m5k6j85M42L82m49j04N9j92k66L20O49m02
953A39K3o52M01l07K36N09j12k52j7L88l51o9K5J99j22j12NJ45j72L01j06j72
975g3j98L28j56J81P9J16Ll80L18k97q6J81K27n0qj27Jm09N46m20M70m76K65j37
999a02k64L12M36l83K8J77l81k34K91L1N1j12J73n9O5j8K02j08P7J87k28l54n9
1022b72M54O9j88k65J63N7j13J57K04J9k66p1m24M15J06r6K27k55Q5r3j40L67
1044A40L9k7l61K36j53J86k28K78q9R1j18j83Q4j3j9k14P51l32j70k93M02n5J16
1067F8q1K06n06J53Q7o8K86j16j43p5N8M9j07k7J36K08l79j6K93j8J47k23K68
$$ y = [191, 430, 91, -311, -144, -35, -1, 295, -86, 138, -277, -316, -383, -80, 118, 374, 92, -99, 3, -123, -7, 137, -75, 2, -211, -223, -455, -98, 184, 154, 169, -44, -89, -115, -300, 142, 524, 75, -29, 30, -162, -428, -108, 541, 139, 162, -490, -89, -396, -160, 349, 237, -15, -32, 356, 5, -64, -39, 160, 38, -74, -69, 76, -96, 205, 99, -73, -271, 57, -99, 82, 161, 277, 280, -100, 218, -79, -165, 16, 243, 193, 185, 58, 59, -350, 196, -224, 246, -230, 35, -102, -366, -54, 382, -1, 27, 204, -177, -411, -120, -89, -38, -150, 23, -36, 29, 11, 213, 105, 182, 369, 141, -213, -272, 182, 251, 63, -202, -39, 18, -95, 62, 266, 285, 19, -52, -476, -61, 45, -51, 176, -79, 6, -87, -227, 140, 179, 152, -209, 27, -126, 60, -168, 110, 21, 112, -6, -189, -105, -118, -137, -351, 400, 68, -102, -395, 7, -48, 68, -13, 193, -313, -160, -73, -141, 145, 29, -114, -189, -131, -82, -189, -216, -80, 128, -251, -267, 26, 8, 155, -68, 200]
1090B00J17l33r3K05j93j72L86k19j4J36P4J8l83K72J25k3k04n6Q9R7p6J17k99
1113b29L50j38J99J95n59K82r6j59L29l09j42L41p4J38k30N0L1j56J55R3P6o0
1135H7JJ09l35L06J60k97k4J57p1J98l65L65k21l38J55K11j56J08J92j41j27o9
1157i5j09K1M5M84k37j1j35j88MJ5L31j46J58l49K37J7J76r0j20j56k7K50j65
1180i0K26km08M36k57N0j9j59K61J80j86r0OP0k8n7M1j20J12j83J91Qo2K8P1o1
1206d2L3P0j57L97j19m40N55q0m1l60L57l25J28K59m52L41j54m8L3m2o5L79j58
1229F9m02P12m26J34l8k23K34k84K30J44l2n8k39K18l08K93k9k7O5k26Q4j09L33
1252A15R6O9k78Ll8P1k17J79j47L51j30l2l7P9j33J36R0k46j94K04j74K95J9n
$$ y = [200, 317, -16, -109, 96, -97, -269, 117, -102, -116, 20, 94, 112, -271, 1, 126, 103, -101, -157, -68, 29, -47, 70, -229, 121, -17, 182, 377, -182, 100, 4, -155, 174, -135, -277, 64, -10, 128, -102, -52, -21, -177, -22, 71, 147, 87, 88, 197, -138, 168, 328, 31, 7, 164, 93, 291, -74, 291, 70, -268, -113, 98, -58, 50, 242, 101, -26, -95, -204, -183, -138, 346, 109, 98, -37, -225, -221, -206, 125, -21, 137, -212, 25, 42, 218, 128, 8, -148, -175, 75, -90, 136, 134, -274, 162, -95, -45, -64, -223, 38, 218, 32, -58, -52, 18, -10, -67, -26, -146, -34, -217, -26, -18, -80, -52, 19, -42, -9, 61, -96, 301, 182, -258, 297, 217, 176, -184, 173, -152, -24, 235, -217, 124, -30, -78, -45, -87, -152, 227, 69, -333, 379, -47, 87, 49, -174, 60, -224, 6, 150, 118, 60, -179, 39, -269, 24, -5, -32, 33, -193, -109, -218, 115, 211, 280, 2, 5, -33, 38, -179, 0, -147, 204, 74, 42, 5, 84, -49, 87, 177, -69, -263, -59, -233, 62, 81, 76]
1276G6j53J13KK4J25j54k6j75K29j32J33j65L26l48n7Q5l7L06j69j88L13p3J67
1299B22k85j1J9P3p1N6k65K66m2J48j46Q4L8j49J84J6L6o4j77j76J20J21Ql67
1323c62L77M5n4n8%L9r6LK93j13J2J1k3j83j9J96m0Qj20J68j55J88j40R4l29L02
1349D4j23k49L06l8K7OJ52j57j48N6p0L10O0l17K04j91J67k58M3J18J67nQ9K1
1373B14N6k19J34j26l10K70j38P1k95L56r3J60l43K98m7K14j70K1m2N4j52n4J10
1396c1j38K17N1QM6k15K09j27o2N0j04OJ19k49PL79k06O8K26l61L23l28M01l86
1420i7r2J58o4Q4j70j60L09M93l47k00J37K28j53k45L38k50K2J2J59j26j21K23
1442A38k06l12O43k81K06k39O2j43N03m57J11q8j9K00oj96n3K13k28K09k28J66
$$ y = [76, -77, 36, 38, 62, 187, 33, 7, -168, 61, -71, 62, -103, 223, -125, -182, -97, -134, 172, 3, -185, 128, 55, 222, -63, -74, -55, 18, -53, 3, -262, 4, -38, 110, -36, 48, 86, -63, 121, 137, 173, 109, -68, -244, -124, -3, 5, -362, 15, 60, 6, -52, -52, -13, -109, -106, 187, 74, 86, 97, 74, -109, -128, 68, 28, 36, -84, 84, -71, 117, -23, 71, -258, 44, -79, -328, -22, -60, -33, -27, 125, -32, -180, -124, -194, 116, 176, -141, 63, -128, 39, -219, -176, -58, 109, 104, 193, 214, 270, 51, 185, 59, -251, 19, -119, -48, -343, 13, -80, 80, -263, 35, -12, 202, 32, 53, 11, 65, -87, -141, -31, -169, 48, 99, 107, 153, -62, 147, 20, -42, 8, -96, -90, 29, -220, -213, 166, -40, 28, 254, -107, 216, -112, 289, -97, -189, -31, -95, -11, -181, -341, -32, 461, 114, -86, 51, 279, 126, -119, 219, -31, -9, 3, 162, 36, -85, 138, -68, -380, 263, -18, 188, -51, 11, -132, 371, -86, 25, -63, -82, 118, 112, -84, -137, 76, -152, 57, -171, -5]
1464ej37L30k75M0J11j65Q6k45J99K11r5PO8l10J51k71J18J08j0K38l20L70k86
1487h2J04p8L17n03K64J09k63L15M5j82o0J63k57ql1L17L3nn9k56J10J3j73J08
1511e9J33k00J97k47J62k5O3K5j79K77k12K3L5K28j85p3p8J08J58r0o4q5J39j4
1535C7j44K71j23r5M5K81n57J4L68j06N5Rj41N3M6l8J52l62K18J66J05L2l23L9
1559Bp1K24j14N6Nl09M8K50J53k67j12q2K12r8j42J71J41j68J12j67K18j86K96
1582A72l92L88J5k22K15j55O1j18j36K41j18R7R4m9m38M92j8j54j37L5L17k95
1604a05L30M0j20k47o2j4Q3J60j54L61l42P5n8R5k81L78j36l6p0L11n05N02l15
1627a10K35K2m6j88j8K57l60L77k33p2l2K05j00o0L17k98J05J27j46lK33k61o7
$$ y = [-5, -142, 188, -87, -47, 64, -101, -15, -260, -61, 150, 55, 62, 130, -180, -29, -300, -182, -74, -84, 154, -166, 204, -82, 22, -56, 261, -242, 22, 131, -132, 183, 228, 46, -14, 149, -108, -116, -147, 170, 203, 198, 139, -117, -7, 6, -167, -59, 74, -126, 71, -176, -14, -39, 24, 49, -130, 147, -65, -42, -7, 221, 36, -37, -115, -7, 151, 61, -3, -88, 51, 37, -107, 164, 41, -54, -9, 272, -285, -271, 97, -9, 46, 55, -86, -33, 13, -25, 127, -235, -17, 149, 254, 286, -37, 2, -69, 155, 41, 97, 102, -207, -159, 91, 244, -23, -135, -217, -5, -103, -245, -74, 67, -101, 11, -156, 62, -124, 172, -220, 168, 183, -39, 176, 21, 82, -36, -172, 69, -49, 48, 142, 93, -345, 147, 129, -25, -162, -127, 190, -105, 225, 265, 145, -102, -164, -178, -95, 65, -89, 272, -70, 5, -53, 42, -239, 139, 3, -33, -103, 208, -297, 205, -110, 125, 147, 101, -87, -105, 152, -208, 169, -64, -136, -168, 37, -63, -123, 194, -104, 1, 128, -18, -21, 212, -49, -116]
1650a16L04j91K1m5J34o8K9k95M07p1k4k68J8L76p0L5k31J53K4j40j39K72k96
1673a81L8L67j65P8q6oK76k85M9o9J01n3k59J57J53q9k35L09n3nJ12Q9k14J83
1697B12j73p0k42J39J52N7k1k89J42J42Jl6k60J44J29j75Q2m5P3Q8k95K32J15
1720A02j51J00q2k9K44J02n54L22K29j73j4j53J10N6j04k01L06J9k39O5k02J49
1742i8l4m0L7k5N0k57K81J55j87K89j25l09K92j88K68j92j25J85k88M72j84J56
1764A33J63m32J87K19m58K64m01L90J9j44J60L9l15L26j49N5k00ko7L61J8k15
1786d9J12J3m9j19L8k09K20M4J02k04L92j96J83k24mJ17k40N0K7j0r0M38k49j6
1810G7J19n38M13L4kj39k03J90N4Q7q4J5O9n5n9r9j4J67J8J47j96j16R3j14j73
$$ y = [-116, 188, -3, 18, -27, 107, 39, 68, -227, 180, 109, 85, -183, -165, 211, 141, 176, -55, 98, 122, -18, -157, 115, -181, -143, 224, 59, 137, 51, 45, 321, 36, 85, 16, 117, 64, -195, -38, 115, 26, -209, 100, 47, 42, 154, 243, 29, 212, 39, -31, -273, -134, 18, 75, 54, -235, -93, 49, 50, 14, -246, -102, 27, -148, -66, -111, -38, 50, -245, -13, 102, -49, 51, -31, -60, 184, 286, -268, 54, 283, 110, 96, -57, 53, 109, 5, -196, 110, 129, -110, -45, -247, -98, -132, -172, -135, -160, -110, -367, -86, 69, -118, 171, 46, -263, 29, -159, 109, -83, -208, -23, -311, 161, -23, 133, 296, -136, 51, 270, -188, 76, -325, 65, 84, -60, 100, 139, -176, 150, 1, 56, -144, -146, -213, 148, 166, -49, 63, 76, 27, -92, -54, -263, -43, 1, 103, -101, 291, 95, 278, 54, 50, 167, -73, -23, 4, -6, -96, 342, 93, 77, 196, -342, 71, 105, 103, -36, -239, -49, 5, 92, 8, 23, 92, 37, -22, -121, -135, 32, 50, 197, 1, -115, -22, -136, -309]
1835c09M30k83R1J03J49l98O0N1J11RO0L3k47K44J71m21K67j12Q6j21J70k51K10
1858A03k65m0J20n1j34L40k84M86k44j54O0L0J23j53J50l3j62K61k35q4L87k41
1880b0j76K80m1k22j69K44J58K02k06J16J41l88j4q6J36q2O5j28K62Q5j9J04m33
1903a91K90l2j22J09J10j71R9j21J23J48Pk73n8J16k95J40J10n9M71l75j83L79
1925B22j84k08K14l02L49J60o17M66l35K03J4rJ64lJ33p0k63j01K08m1J67k2J06
1948B51n17L56k22K68K51m80K96J66m43m10M16K42r1j53P2K20l96J9M9J80j01
1969b7J2PQ3k20J01P3L4j10P4j4j83K6K77q9j6oK06l50m6J88j19l8M10m35L04
1994A42m0m08K14n%K78j35k38Q2Q4j92K64j30J74k40l7J11J98j54Ko3m0L20j60
$$ y = [-309, 121, -162, -71, 32, 181, -217, -157, -106, 5, 14, 74, 107, -140, 104, 275, -146, 121, 9, 95, -26, 144, -107, 103, -162, -202, -82, -133, -267, 73, -211, 275, 31, -123, -63, -33, 90, -63, 87, 54, -108, 153, -82, -166, 221, -20, -196, 84, 43, -179, -348, -104, 54, 256, 50, 166, 307, -81, -95, -181, -45, -127, -62, -190, 72, 157, 138, 242, -191, 99, 67, -55, 54, 164, -7, 92, -29, 94, 242, 249, -24, -82, 34, -261, -121, -11, -70, 401, 26, -157, 222, 38, -170, 44, -258, 91, 251, -366, 100, -235, -32, -18, -27, 137, 134, 267, 197, -66, -167, 41, 0, 167, 145, 251, -266, 90, -132, 136, 387, -93, 203, 369, -74, -484, -68, 174, 83, -70, 2, 222, -174, -155, -106, 74, -27, -15, -8, 75, -145, -44, 29, 63, -47, 27, 13, -170, -144, 133, 44, 28, 22, 228, -122, -168, 20, -99, -137, 273, -162, 142, 102, -306, -92, -97, -97, 181, 46, -192, -110, -26, -218, 46, -84, 90, -150, -187, -76, 122, -32, -30, -93, -133, 187, 27]
2018B7O2j73PN6K11n5k07k22K01O0K45m32K18l1m5Q5J18m62M95k07l78K66J10
2041e1J69k69O3L1q0N0r0K79p5M4j55L11j93Q3j34K18l00k8M9L3J86j41K84k16
2065F8l39J54K88n29N66j14n51L15j47M09j00O1n9Q3j51J39k38K65m3k3l3k72
2087b51L09q6NJ29Q5P7k61L2J51j82j9l18L46O3j8N6j08J27K7k26j18K6K30p2
2111Dr7J1K81n0m4l00J31jk80L12J31R0j56p6J30L2l4J1j60N6P9j82J82j01m0
2136g1k00K70j33K14l1j52K41l53K66m8m5J83k84k35K47M05l74K22j04m5J25J47
2158B45k16J32o2m3Q7k30mO7L44m45O9j45K11N9r1o5NR2o3m7n0L15k32L8N8k33
2184b04J27K23O8o4k96N8j2Q4j00J41q0J8M4j50L87n5j59j84K01J65j84k55J08
$$ y = [27, 89, -84, -77, -21, 190, 135, -72, -294, -93, -33, 212, -220, -2, -33, -78, 7, 125, -337, 158, -49, -427, -161, -51, 118, -151, -88, -57, -137, -87, -177, 102, 27, 71, -84, 227, 34, 117, -17, 201, -99, -127, -78, -45, 141, 0, 284, 68, -271, -117, 171, -358, 208, 94, -457, -142, -289, 120, 20, 81, 22, 105, -46, 93, -145, 120, 77, 54, 21, -251, 58, -28, -23, 106, 191, 268, 7, 39, 190, 8, -11, -329, 17, 80, 62, 118, 10, 137, 164, -62, -180, -154, 76, 4, -93, -82, 199, 149, 105, -195, -64, -65, -345, -33, 98, 188, 32, -44, 86, 118, 84, 95, -65, -9, 70, -112, 70, -31, -71, -271, -1, -134, 80, 49, -103, 138, -215, 51, 3, -42, 141, -143, -378, -131, 274, -100, 122, 18, -27, 98, 245, 29, 161, 99, 56, 143, -87, -91, -24, 320, -125, -56, -201, 10, 69, -22, -87, -82, 10, -53, -100, -150, 165, -67, -29, 29, -204, -77, 146, 214, 150, -146, -88, -100, -16, -116, 25, -55, -37, 7, -143, 244, 189, 30, -154, 47, 212, 28, -227, -119]
2207a19K62j19M5K0k1K48n18o3K60j49l3L1j92M75j02j47J73N1J48m57mJ17J39
2230D5j40o1r9J90J83k93K95q0M6M9l29J88J93m15m9K26p5J27m8J45m4j41n5l
2254a45M31l35j94K26M9k8k5k11L71rJ72m67k25M14k05K16l7j22K41j1l24J01
2276a17J62K8j7J45j71j24nq8L43J25j91k8q3Nj34K20j51J74r3j9q7P1l1L4J06
2301G4k79K52Kr8Q3p2P3J34p4l1k06l5J16P3j56kK36k15K14j07J70l19J49k5L20
2326B77k44J22n23M06n7n6j2J05o1l4O4J8M6m94M63p8J65J04j22R8k78J02J00
2349A11j40n5M1k04M76j31o4k75P1J94J65k23J14l31J72K77m25L45k66K66j1j0
2371I7pk67K31p9q2l5K05K00K3j68l69L92K18k80K32l06Q6l87J40K6j4J30L7J27
$$ y = [-119, 143, 24, 69, 89, 68, 316, -202, -265, -5, -154, -187, -156, -348, 127, 25, -122, 51, 102, 250, -207, -211, -94, 45, -95, -156, -255, -65, 118, -175, 120, 40, 86, 135, -194, -6, 187, -228, -277, -51, -126, 1, -47, 98, 54, -87, -142, -145, 286, -49, -243, -17, 32, 4, -21, -232, 139, 130, 302, -165, -390, 24, -181, 35, -2, -124, 117, 106, -218, -117, 45, 73, 56, 201, 30, -94, -99, -187, 156, 281, 90, 62, -21, -16, -150, 70, -81, 93, 0, -19, -106, -35, -66, -32, 74, -205, 47, 49, -49, 34, -38, 35, 169, 95, 64, -142, -177, -61, 12, -144, -146, 90, -125, 89, -18, 152, -167, -18, -43, 277, 33, 155, -368, 38, -19, -75, -87, 18, -43, -77, -13, 5, 51, -443, 20, -58, 107, 211, 89, 187, -91, 11, 111, -29, -84, -43, -247, 229, 98, 34, -241, -170, 24, 189, -34, 80, -251, -79, 198, -227, 118, -148, 118, 107, 97, 90, -177, 54, -25, -107, -142, 63, 263, 286, 118, -251, 141, 359, 79, 311, 5, 91, -296, -156, -130, -144, -14, 23, 150]
2395A50j29J41j21l06L39j14j50J79Nj7k65K85q9P5K16k32J25l09K44j64J44K13
2417B20k1k26J48j86P0K66j23j14K4j67J0N5K84l91K47k3l37K38k73K60k77J50
2439a66P6m5P8P5Q9j93j12K87l16L39k20r5K76q2K53l43j64K08J49J16k83K12
2461A39k07J72L22n10K97K2k25lj58J71J05r7J43n9l78J64J66l40L44J29q7j35
2483b5j08K46m5J22k37j35M00j50j32K1J75r9K10l23j1R2PJ07k38K00k87pK18
2506Am8j45M16k7k49j22J37k35K67p1J04k73M87l09Q5M7j21K53J2j24o7j52L1
2529a03O9R2k16J55K28k97NK35q6k09K08j0J06r7j69K23j03j13q3K58RM9J12k88
2553b5j69J65M07l76k24M08J18k69J62k02p4L59m88o4J88K81m7j26J71j57j58
$$ y = [150, 21, 162, 41, -265, 74, -40, -190, -11, -6, -23, -288, -3, -92, -17, 199, -33, 92, -217, 27, -137, 7, 220, 199, -27, 121, -65, 5, 271, 148, 34, 58, -109, -99, -44, 240, -151, 96, 73, -264, -26, -299, -39, -316, -166, -90, -135, -57, 18, 107, -86, -198, 89, -227, 112, -108, -203, 73, -9, 244, -99, -263, -55, 94, 210, -73, 139, -68, 104, 426, -84, 213, 235, 10, 7, -151, 20, 125, 28, 171, 112, -266, -102, 64, -276, 68, 197, 110, -25, -133, 113, 68, 190, -47, -182, 218, 68, -64, -43, 132, 33, 243, -80, -91, 1, 8, 115, -123, 77, -210, -217, 1, -47, -192, 224, 197, -52, -174, -37, -272, -5, -76, 28, -245, 242, -67, 18, 65, -56, 197, 209, 85, 18, -134, -103, -34, 58, -158, -3, 225, -72, -67, 168, 82, -127, 81, 71, 177, 80, -89, 134, 31, -82, -165, 93, 102, 151, 263, -25, -194, -29, 378, 2, -222, 186, 304, 35, 197, -5, -79, 280, -208, -272, -84, 197, 150, 24, 195, 38, -120]
2574a20J55J60k83J56Q9K0j63j04L7k77K50r8K38K1l72M01j42p5L12k0J29j75
2596A39j62K48j64j1j29j50K16O9j36NL04o5l05K32j24J12K9j9m8j63L29J42o15
2619b66L96l36J37L68j68k46j2K31j86K20j75L15k98j1j92L22J03l01j30K68J63
2640B02m37J63R3k33K04J7J07Pk6J26k79o2K31j86r8M84j99l8Qk97L64k35R7m0
2664b7J52j28Oj91p0K60rm5J07kL55k42j9J67m67J84qm3q3k8LJ11r2l5Q2J06j16
2691g2J72l17M5L66l95o8J54NK10k83J8n8L13r2J28k44M19l86J29J5k53P7K42
2714A25J40l69J87r6J7k16L33j56j06J91r7k8j56J80o1k4J5K71j48o6R1l7L5P8
2738A03j52J0J07o2l55J95m9K32k62K44j32L4o0Q7k10L28q0k7J28M5n5K1J13j04
$$ y = [-120, 35, 195, -88, 68, 157, 177, 14, -90, -53, -330, -80, -178, 60, 81, -291, 110, -32, -107, 205, 185, 314, 139, -23, 225, 61, 50, -79, -229, -13, 56, -80, -75, 229, 164, -141, 91, -33, 79, 108, 89, 41, -122, 207, 349, -266, 130, -206, -69, 299, 131, -115, -127, 104, -82, 138, -37, 278, -20, -31, -223, 99, 202, -99, -229, 39, 202, -235, -72, 21, -212, -8, 9, 116, 123, 97, 223, -56, -118, 113, -73, -171, 313, 114, 76, 84, -213, 151, -84, 13, -27, 125, -3, 3, -188, -258, 2, -7, -52, 55, 53, 408, 166, 147, 314, -153, 31, 23, -20, -103, -131, -128, -17, -109, -144, -62, 44, -72, 100, -217, -172, 194, -201, -269, -115, -110, 100, -183, -165, -223, 90, -2, 126, -118, 301, -85, 44, 59, -194, -117, 125, 265, -104, 83, -13, 4, -212, 121, -35, -141, 50, -47, -75, -231, -51, -112, -136, -121, 150, 2, -64, 27, -10, 25, 103, -49, -39, 68, 6, -349, -154, -203, 29, -233, 11, -121, -87, -147, -60, -270, 58, -22, -49, 79, 124, 69, 90, 203, 99]
2762I9j09j13m8J07L85j89k7k33K38k28nK87k07J09j86Q3J13Rk56J75R1j89j69
2785b63N88lk56j32J62L4K2j72j17L79n94L97J09j93K0K12m23M08q2Lj71Oq9J60
2809EQj71K95j38j16K93n4R7j98K66l08k24K76J22q7Q7k17J47k99J9N7L15m22
2832b47M0L68j51l7K16l82J08J88k73m3N13j72N1k14K94k34N5Mk23J79L00k61
2854G9Q3k31K56k32j40K83j48J42j45J53k40l9M50k47M0JN5k42J12P8r2P4j56
2877a06J30r1L42l37J54nj45K12l30J48n9J96k92K01j84lO5m8qQ5l3j56K99j44
2901a09J85k00N0N8R2R3j15j5N6k78J73j49J91j35K96j61K58m89J02L66k13k8
2923B8K8k67K94j22j82K3L16j10L19k72KJ43J33k86J22o7j47J31k06j44R7K74
$$ y = [99, -10, -123, -171, -64, 321, 132, 105, -128, 110, -118, -123, 164, -43, 66, -120, -37, 76, 85, -171, 4, 95, -94, -263, 325, 322, 66, -66, 96, 130, 152, -20, -137, 242, -352, 45, 154, -39, -19, 193, -230, 178, 96, 99, -72, -66, -155, 5, 13, -158, 137, -1, -117, 176, 122, 219, 21, 287, -21, -245, 31, 153, 66, 153, -64, 83, -216, -197, -140, 175, -247, -207, 161, 10, -27, 189, -193, -85, 103, -170, -213, 300, 128, 179, -35, 259, 25, 80, 84, -139, 40, 340, 79, 162, -69, 187, -45, -185, 98, -50, 92, -53, 100, -140, -179, 271, 24, 64, 65, 120, -122, -10, 68, -24, 50, -106, 24, -67, 275, -62, 92, 87, -58, 154, -176, -28, -87, 109, -183, 18, -166, -169, -104, -152, -160, -75, -108, -264, 35, -109, 76, -124, -74, -16, 76, 169, 54, 39, 95, -183, -10, -159, 32, -103, 193, 32, 290, -199, -97, 269, 56, 28, 56, -211, 83, -39, -221, -198, 118, 8, 327, 55, 57, 200, 333, 47, 169, 102, -45, 86, -120, -264, -167, 107]
2945A07N9k17R3j52j25N9J25J43j60O0q8L25j17n3j56R6j05k27L73J17m4j95P5
2968gJ9N7n2o1j36K58k03J0K12l3l01K08Q7M7r6J48l52M52k22j67K40n31M51l31
2992c03K73N6J82j36n0k6J70k45J87l28K29m1n6p9J88k44J72K1k5Lj06J38J35
3015A15j66J34k1J18k04r0L16q6l7j14L9l05K09n1kQ0K50j99M2l66P0N21k82M9
3039B0J37j96K90j38Q2j79l3n7J74j90K6l8k19M49r2j8L7l2J30l6j70l9K31k69
3063a30m7J95k38L72j05j17L31l48K59k24L78j89J70m24J77R7j31J9j03Jn0L19
3085B12n4l78K43L6m7k53L87j46j76K78n9j30N1N7o9J69k91L30l20K03j86K54
3107A11j19N0j30J90o8j37K08r7N1j60n9nK01j59J30J41l30RJ37o3K06j56j09
$$ y = [107, 166, -51, 42, -110, -235, -176, -51, 92, -68, -8, -96, 229, 112, 59, -97, -1, -106, -333, 40, 157, 113, -82, -7, 12, 69, 17, -44, -180, 78, -125, -115, 97, 64, -237, -29, 58, 105, 9, 157, -195, 257, 35, -132, 108, -423, 28, -303, -30, 26, 208, 72, 22, -4, 166, -79, 108, -220, 9, -32, -88, -167, 21, -223, -51, -30, -55, -52, -158, -20, 115, -51, 83, 62, 180, -24, -114, 202, 116, 79, -35, 4, -301, -92, -143, -145, -65, 185, -14, 28, -338, -268, 253, -29, 20, 157, -39, 251, 113, 195, 16, -17, -74, 100, -90, -64, -102, -321, 128, 36, 18, 55, 23, 153, 117, -53, -92, 139, -130, -177, 18, -220, 152, 47, -70, 261, -87, 172, -52, 326, 137, 307, -117, 60, 157, 26, 45, -58, -57, -107, 212, 158, -220, 23, 59, 12, -241, 146, 0, -176, 102, 43, -87, -36, 21, -48, 121, -170, 160, -160, 43, -143, 111, -8, 42, -88, 102, 34, -103, 105, 8, 59, -101, -160, -165, 36, -123, 7, 148, -182, -173, -36, -99, 107, -49, -158]
3130a58K07j25j7R5K53j60k46K12k01L45l2k02o5L2L1m4K56j08J25k54P8kJ37
3153A57q1J16l31j39K01O6M6K00m53K76P1k18K2K80o21O72k82Q0k24j87l4L40
3175d3m1j53L13n02M16j5J4k14L93k6j18M3j45J47j18K38j6l37J07qL0o8K08p9
3199B6m2J63K3Rl23J95j88J82Q7j18j13R3j04j87K24j20N10l21J29m09L38j05
3221e1k01N26m84L99l00J85j40N7k06K00m6P7K40q6j67L3k24J11L65o0O9k90J6
3244B3p6N0j91L37k04p0R1L4K39l90J03K8j48K93j54J65K10n43PJ56J56k3R1J58
3268C42k47k99K86j33K1N0K1q6j1J95j92L27k55K40l41j27K03J2k6j44L28j5j43
3291FO2p0L02J4j2n3l74J38p3j77L53q2l3J34L8j32j4l92J22K86n4J32n15K75
$$ y = [-158, 49, -76, -93, 2, 255, 95, -151, 61, -140, 205, 173, -29, -94, -62, -31, -75, 181, 73, 198, -56, 22, 20, 157, 76, 192, -139, -278, -77, -11, 35, 235, -218, 58, 129, -89, -67, 213, -408, 264, -18, 62, -162, -349, -383, -43, -84, -237, 76, -426, -10, -25, -11, -225, 168, 142, 24, 67, -78, 69, -49, 189, 173, -164, -57, -65, -35, -103, 105, 26, -16, 147, 170, 179, -144, 51, -137, 45, 132, 14, -99, -6, -110, -297, -73, -193, 317, -4, 125, -284, 54, -51, -252, 274, -210, 189, -111, 74, -66, -9, -215, -15, -61, 16, 256, 170, 3, 36, -188, -77, 288, 228, 297, 7, 23, -53, -3, -194, 143, -61, -131, -40, -6, 233, -157, -54, -26, -174, 119, -35, 130, 340, -203, -196, -40, 116, 93, 184, 342, 95, -204, 82, -51, -30, 20, 41, -45, -56, 139, -53, 274, 19, 259, -82, -209, -6, 6, -20, -164, 164, 149, 6, 68, -2, 300, 314, 302, 249, -125, 13, -60, -237, 116, 34, 1, 135, 173, 41, 27, -365, -243, 43, -11, 121, -394, -119]
3315a19J95r5r4o6L21k37L12j76O8ok03K75k90j6p2J21P1K6L0l0jj1p1K17n3q
3341H8oJ62k39O9K7qj17K36k04P9k57o8L82k8l3L4P3lj73k7N8N7p2K28l67Q8p2
3368i3J15k47K29j16M8L35k20k4j41L6O3k9oj14J04j51J96Kj49J46J18N2k78M53
3392C29k69n2L19k66k82J13J32j9J78k30j23J51K1N8q5j37J3O2J56j08K7m7J22
3415F3J34m09J68M9j07M15k91j52J49k55O1l9J82J05k08J31r9Oq2l7K71J45j00
3438A00j31J45j54j64J94M03o67J09K77j56k34M23k4l90L68L0Rl2j39k4kK49j41
3461D9l08K33N8O5j05q1j13M02r3Kj53q5K10j85n1R2J48K3l99J16L32l04J16J6
3485a5k86K93M3K31l77r0K89k68r3K88m5J52Rj87k5K11j43J11k09K20Q7l16J97
$$ y = [-119, 76, -19, -113, -179, 142, -95, 217, 41, 109, 103, -100, 175, -115, -131, -203, -82, -11, 15, 45, 15, 14, 3, -68, 149, 96, 88, 82, 244, 5, 74, 101, 93, -24, 212, 8, 87, -170, -238, 144, 116, 83, 117, 190, 187, 14, -13, 45, 102, 30, 258, -109, -21, -93, 22, -225, 4, -112, -64, 271, 51, 27, -114, -78, -15, -44, -50, -164, -60, -211, -15, -13, -162, -16, 102, 154, -124, 329, 60, 8, 327, 61, -221, -108, 24, 5, 183, -47, -170, -19, 2, 60, -25, -162, -149, -87, 69, -39, -12, -59, 63, 197, -212, -44, 5, -102, 313, 22, -130, 19, -236, -175, -214, -32, 73, -135, -4, -103, -97, -179, -216, 55, 200, 100, -31, 114, -40, -204, -10, 393, -274, -165, 112, -44, -278, 145, 121, -269, 99, 129, 138, 106, -33, -57, -59, 190, 49, -259, -26, 32, 97, -8, -89, -202, 200, 107, 109, -44, -129, 81, -104, -155, -63, 85, 108, -291, -175, 157, -147, -31, -15, -301, -8, 35, 266, -111, -201, 88, -180, -273, 15, -30, 122, 131, -56, -81, 130, -13, 98, -111, 109, 196, -120, 77]
3508G7k94K50j40K56J21j91j67l3j8J48r0P9j03J54j76L54j87j50Q6j86P2n6p4
3531b68K23J39j08r4Q6K46k33R0j08O4l19J66P3O4j37J23K6K29k36K27j1k87J96
3554A51j66K36m76K54n5l1J96l48K07Q6o6N7j48r8K58k07L28k55M3k0j28J87J37
3577A42k75L18l45J12j16K16O3k6O1n3j24j52J98m9NJ3p9N3KJ0j11J4j01J29J0
3602h5j01J05k3p7J61k4R8n1j41rL35m50M19P0k79N1r1M2K5Q2K52j22j87J30n5
3627G5Q9j56n0L84l81p9J89k76J42J2j40L93j57k57MK97O9j10l1J11l23K31j35
3650i9J37J5l36K88j84Q9J66j63p9L11l29K50K08r9k78p0K80j46R1L6j48L03k33
3673A0J57j85kR1j45M23n62K83p9l3m8J27n3k0R6j4j95K3M94m64K63J61m01nR
$$ y = [77, -217, 33, -107, 149, 270, 79, -88, -121, -139, 9, -81, -2, -105, 49, -127, 227, 40, -110, -24, -210, -138, -194, -268, -45, 94, -14, -108, -22, 224, -9, 81, -27, 37, -282, -116, -43, 21, -116, 7, 33, 262, 26, 253, 242, -45, 151, -15, 221, -255, -1, -56, -87, 109, -239, -32, 54, -12, 45, -103, -201, 57, -150, 178, -77, -34, -54, -182, 5, 142, -133, 185, -160, -48, -164, 52, 115, 89, 150, 97, -27, -179, 19, -30, -25, -12, -91, -38, -36, -26, -137, -123, -224, -95, -85, -186, -81, -104, -181, -20, -44, 54, 3, -138, -147, 188, -262, 157, 227, -52, -1, -92, -50, -25, 57, 309, 187, 0, 130, 75, 164, 8, -42, 342, -39, -118, 71, -205, -63, -51, -191, 202, 45, -212, -208, 89, 158, 48, 17, 128, -195, 36, -99, 38, 53, -283, 5, -179, -90, 76, -87, -166, 145, -184, 66, 274, 175, -103, -173, 107, -39, 52, 88, -60, 243, 10, 167, -18, -20, 71, -74, 349, -213, 70, -9, -42, -90, 37, -16, -36, 60, 46, -149, -126, 368, -96, 167, 328, -73, -78, -69]
3698f9J21L08l13kl07N16m67K77r9j49m0n3M9L46K20m92J15k55K37Q1O6O9j46
3721A3L42k07l33J27L8l3L05k86J36r7o8J16k62K50J12l37J87p2o4J30Q9j88K11
3744A09k8l08K29J83l02J04J21M7j35k31K05n5o6J81j80K32M5k85K6J93k58J98
3766B5J39k40J16k0J49j22j37J95nj11k58OK11J32j30r2K06j42J82k48J03p2N54
3789D41l85J22l16K27n5Kk10N1K74k81K07r9J32mo8j4j00n1n0k7J9R9p9J83K4
3814D2j37Rp9P8j2J18q3L5J19O0k3l0M6o17M47j32l8K92k97J14n3k7K58q6r1l
3840i0M3J54q4j72K51k34p3K96oJ40l94K07J10k03j58L7L37j40k2J41k49OJJ16
3864A4J49j21j8J14k18L4J20Or0l28L83o4l8K19m8l36J89J29k6j62j75L91l5p2
$$ y = [-69, 52, 360, 47, 45, -262, 254, -213, 64, -35, -184, -224, -277, -228, 118, 338, -154, -39, -294, -57, 24, 90, 159, 13, 355, 148, -185, -58, -20, -53, 252, -34, 102, 5, -63, 53, -209, 41, 153, -184, 3, -69, -133, -3, 86, -102, 109, 81, -227, 2, 185, -117, -13, 108, 155, 20, -211, -6, -61, -127, 54, -126, 106, 151, -134, -108, 85, -173, 25, 164, -76, 40, 20, 169, 47, -90, 105, 100, -11, -269, -263, -52, 80, -50, -142, 64, -78, 104, -144, -41, -113, 441, 56, 178, -138, 89, 34, 36, -174, -123, 151, -130, 77, -22, 110, 106, 38, 24, -76, -127, -177, -204, -185, -86, -165, 18, 42, -95, -86, -165, -87, -99, 19, -64, -29, 90, 150, 127, 97, 143, -474, -27, -159, -197, 95, -202, -88, -141, -168, 90, 4, -87, -90, -47, 107, 23, -149, 102, -132, -205, 91, 85, 225, -169, 38, 148, -55, -213, -176, 161, 21, -1, 140, -109, -103, -102, 14, 163, 42, 24, 138, -80, -46, 74, 80, -10, -338, 45, -19, -57, 162, 114, -222, -33, 96, 70, -92, -267, 124, 89, 17]
3888A7j71L50k53J46k60o3nJ04K81k34o0j5J13P9o0j05N2R6l0j65K47k2m5k2m3
3913f8Lj11K22J2j39J81k60Q6J49J32m1Oj88j31N3K66k11p2O7J34o7p1m6M20k44
3938H2j75r5K54r9J89j98np3K82m76K54K54k90r7J45o9K01MM8k23J15J73k78J87
3962A10m4l14K69n5N6n3L9J82n9r7k80QL05l18L33j40pN5K22n55OL57o5O0l3l0
3988d8K9J64j04k28J19K25j89M4k6qJ09j72J31j11j38M73k07L9j19J32l15R6J60
4011E6o7n2j42K85k42J56j37n8J99r8J60m9J4J2J31l17j80K03m2L12r6J99j92
4034E5K8j34J29J08j15j83n8kJ21M1K40k7k59J76j02J48j15o5j58j9K62m59N03
4057A15Q5l09l4L26k44m1K33r8J70k9L3Qk27m5L14m0l93N51l03k71M21n60J61
$$ y = [17, -154, 196, -57, 89, -171, -234, -239, -135, 146, -88, -148, -163, -50, 29, -31, -136, -84, 12, -18, -183, 64, 42, -3, -25, -68, -65, -176, 46, 58, -81, 100, -160, -74, 75, 207, 166, 172, -16, -147, -94, 172, -39, -111, -44, 90, 23, -48, -94, 326, 82, -93, -188, 66, -33, 156, -42, -47, -120, 162, -314, -60, 194, -96, -193, -48, -117, 84, 88, 136, -87, 28, 201, -77, 110, 66, -248, 21, -34, 22, -31, 8, 190, 131, 34, -246, -238, 67, -251, 82, -58, -65, -10, 212, -343, -337, 20, -45, 15, -18, -48, -19, 145, 41, -187, -68, 157, -32, 12, -14, -22, 87, -85, 46, -65, -203, 270, 63, 102, -17, 115, -200, -104, 56, -11, -63, -205, 80, -162, -6, -143, -201, -2, -100, 60, 11, 25, 37, 168, -149, -329, -126, -168, 144, 48, 247, 55, 83, -51, 78, 186, 71, -112, -170, -172, -51, -10, 230, 203, -56, 120, 18, 166, 51, -14, -172, -191, 71, -388, 115, 200, -109, -143, 183, -61, -102, 131, 33, 203, 174, 207, 215, -12, -57, 257, 217, -176, 375, 72, -199, 222, -338, -177]
4080a77L33k7r9Q7K43l49k1N9n8J2J06r3J14p0j97J72k26K57Q5j26j47K50J28
4103B56j84N9k01K28P4k21K55j09k37q2J48k68M07J24n62L70M7p5Jj18n1R5m2
4126h6O1K78K8j12k37lj57L57L7k44k0j56K16L7OK36j73J73j98m9p5J42r3p2L7
4151f7j45K01n3J06M0j07j6P9p0L1p9q6J08Q6j24J53J7q6j23j16J03K64q5j65
4175a34j48L12M0k66L06k3j63N0j0J59kl83M99r6k51L0kj16L45j69mk18M34j78
4199A2j30J55k18J79j03L05k01J95j08j78K27Q7j76L08k85k29K19J31k34N6%K14
4221B26k06j7q8K66k69K86k95P5J83k75L66o01N58l2l75P0J64o7KJ52k96P9m2
4244a36J91n8J74q1k26J42p8J84k60J6K16k3n3J79J67k91k63K88L9j11j14R9J36
$$ y = [-177, 156, 129, 30, 117, 360, 11, -10, 49, -9, 3, 109, 16, 130, 60, -137, 35, -191, 66, 151, 25, -122, 128, 256, 72, 131, -70, 158, 232, 11, 266, 157, -80, -162, -14, -282, 125, 249, -313, 57, 104, 29, 30, -88, -139, -44, -86, -25, 253, 281, 169, -68, -71, -228, 129, 166, -78, -98, -254, -38, -1, 5, 241, 68, 241, 43, -6, -81, 61, -32, -104, -67, -212, -11, -64, 42, 82, -25, -41, 38, -32, -1, -80, -166, -58, 28, -96, 57, 74, -12, -135, -251, -148, 116, 31, -134, -282, 30, 70, -196, 110, 87, -76, -26, -36, 123, 121, -262, 237, 141, -110, -80, -82, -198, 147, -22, -26, -244, 190, 12, -118, 37, -181, -2, -105, 200, -1, 194, 86, -92, 135, 222, 46, 354, 69, -160, 59, 190, -44, 12, 12, 226, 20, 3, -85, 181, -88, 198, -97, -22, 161, -114, 252, -349, 209, 177, -198, -128, 36, -31, -29, 123, -173, -94, -136, 55, -3, 171, 90, -136, 6, -72, 112, -148, -132, 84, 61, 8, 187, 354, 63, -200, 88, 127, 16, -98, 1, 137]
4267A37M0k11J13o4j15J98jj21P0P6m46L97N3O7l43K53j44j04l9O7J12J5K7K62
4291B99j61j88N6r3JJ99q0k29J17j26L35l16J85j04J17j38L00m1j20R5L2L6n22
4314c46M58k22K0K07j6k84M01j85j03j03qP5L8K64j92J61p2l20K79J0l9K0J0k7
4338B6k15J66R6Ll22r7J30J40K7r5j77N37l48j03K56K88k18k73M28m23K02M7l6
4361C9MJ02P1k17J41j34J1K53k47j8j2L0l30N32k16N6N6o9N4j03J27j18M6o4K11
4386B05k35K0N8O9p9j48J68kj38k8M1l0J62K1m18L64L5jj8k17Q9Q8Q3q4j55J48
4412bk19Q9N8r5L80l37N0q8j54L73J12k5j07K3l00J75K49j47p2P8o4P8k51J11
4436h5q4pJ35L3n6P0l29M60Ok02P1j59L80k40n3J21Kl7J03l20L41k19O9j19K69
$$ y = [137, 177, -34, 79, 15, -100, 98, 97, -24, 46, 122, -324, 73, 126, 193, -150, 103, -41, -145, -184, -117, -5, 10, 37, 299, 138, -50, 6, -87, -86, 113, 33, -196, -79, -205, 130, -186, -1, -105, 12, -126, 174, 133, 13, 108, 140, 176, -346, 112, -110, -90, 117, 101, -183, 218, 33, -70, -173, -181, -106, -68, 196, 4, 165, 93, -227, 52, 62, 23, 43, 53, 26, -189, -23, 73, 76, -246, -343, -213, -73, -46, -141, -318, 219, -129, -232, 24, 312, 94, -179, 249, -174, 28, 75, 39, 43, 145, 216, -1, 140, 6, 17, 270, 23, 5, -7, 23, -307, 225, 9, 65, 121, 52, 106, 3, 130, 12, 58, -6, 205, -30, -10, 48, 117, 38, -110, 58, 56, -82, -110, -69, -99, 63, 84, -334, 30, 65, 64, 46, -171, -82, 6, 89, 5, -150, -2, -221, -132, -74, -169, 211, -126, -76, -164, -318, 55, 167, 142, 35, 58, -242, -67, 182, 35, -37, 41, -23, 55, -196, -85, -169, -176, -41, -8, -64, 6, -323, 137, 143, -59, 12, -147, 233, -7, -60, 61, 63, 26, 129, -191, 150, -69, 0, -119, 150]
4461A50l35K32J91m07L89k99N19p32M51q7n3L9j40O5J16n5K60k06k34J15j09K25
4483I5J4k10m5nj30K01J58N3j35j79J37J66R5j57J3M6l11N20l17k02J75nRl2j37
4508a83l9K46R7j79q7J80P7j73L17l28q3J48OK51k04k2j23L1j7J43m1L7N6j71
4532f1RJ78q4j01K9p4J05j67J77J14k21k1K96k25j18Q7MJ22R1l39J01K09j90K46
4556A67l51K64k83K85n8N3k4l6P3k01L5n6O0K73l30K20j2k33J59Km4j7j35K42
4580E3qM2k26N2K11k06K59m65K82P2K0k4N5Oj43j27J30j30L33k10j81L06J03l38
4604a34P4M4Q6r5r4K23j76J90R0j08l84N82j95k61R4p4j7M24k53j15K38q8J18
4627A69j92j42JP1O9k96K25j14J48K14l58J01O7m1R1k9o6K06j57J01j2j72k0l16
$$ y = [150, -185, 47, 238, -169, 220, -79, 440, -292, 159, 72, 19, 58, -82, -17, 99, 44, 304, 98, -136, -21, -130, 95, 109, -101, -146, -151, -281, -80, 78, 131, -4, -183, -46, 120, 215, 58, 71, 117, -194, 326, 9, -193, -18, -23, -14, -46, -183, -222, 24, 121, -58, -145, 35, 112, -61, 256, -72, -155, -7, -1, 250, 46, 24, -99, -68, -85, 58, 17, 54, 110, -61, -52, 126, 42, -59, -30, -104, 1, -166, 11, 125, -96, -117, 179, -46, -164, -77, -73, 49, 140, -199, -98, 111, -79, 167, -184, 80, -203, 82, 24, 77, 53, 17, 90, -111, -76, -132, -72, 201, -129, 91, 79, -154, 5, 7, -37, -54, -189, 53, 45, 87, -139, -87, 124, -82, 177, -288, -6, 66, 86, 62, 117, 123, -20, -147, -17, -147, 186, -24, -205, 101, 204, -134, -60, -16, 70, -25, -119, 104, -72, 118, 208, 100, -284, 298, 103, -158, -64, -138, -155, 269, 16, -99, 139, 51, 169, -23, -165, -164, -93, -24, -320, -95, -209, -61, 153, -205, -104, -37, -78, 13, -16, -82, 124, -33, 68, 56, -116, -136, -452]
4651d52L77j18K93l41J47K1k4j78N27k73r9J28j0K18l72j09K17J87O7r7k58J76
4673B7k5K85k29j84kK95k27J7n3J61n3J54J61k73L5j15j82R9K36j14kj02j30J68
4697e3J22r4j57L12k75O2K19k44J40K64l24R1P2k37K35q7j28K12k2j18O4j98q
4720a52J57j34J94k0QL3l07M8k1K27j9k58M8j21N42Mj90k29N3K84Q4k78K39j81
4744A1p3K52j89k11L56j77j46P4J38j00j6R3k31PK89j13rK2j24J93k1RK29j55
4768A08j65M05m41L03l13j05K71J45k04nO5K21l67J8K54l28M1J10q5pJ49P8l46
4791a98J7L63l24J46K4j09K37K3j33O4p4J53m3L3k07K7R0j01J14j83L10k21lK58
4815B63o7k99R4k43L43q6J3m0q7J86k23J53J6k29j4J65j13K67r6j05K27k49L1
$$ y = [-452, -75, -193, 100, -241, -94, -73, -97, -275, 252, -21, -120, 8, -2, 216, -156, -265, -48, 139, 206, 109, -149, 27, 2, 287, 58, -126, -128, 167, -60, -43, -96, 65, 12, 166, 327, 54, 89, -26, -208, -109, 127, 13, 11, -91, -221, -53, 69, -25, -182, 130, -145, -83, 136, -108, 32, 296, -28, 63, 135, -102, 133, 46, -82, 130, 108, -10, 54, -144, -152, 5, -129, 65, 45, 53, 86, -221, -173, -194, 33, 14, -244, -196, -317, 225, 229, 39, -190, -137, 147, 231, -47, 192, 11, -62, 190, 1, -210, 146, -31, -177, -103, 35, -65, -81, 12, -219, -212, 77, -36, -45, -23, -147, 46, 25, 34, 263, 108, -57, 348, -93, 210, -103, -208, 63, 208, 4, -1, 64, 285, -82, -64, 190, -138, -97, 13, -72, -79, 70, 148, -198, -181, 182, -142, 4, 28, -81, 156, 179, 46, 110, 36, 189, 146, 179, -28, -1, 89, -12, 102, -81, 229, 8, 5, 263, 196, -103, -9, -252, 91, 5, 18, -22, -109, 77, -146, 7, 23, -206, -220, -55, -168, 99, 3, -102, 125, -124, -93]
4838i3J16n1j6j76L06J75j01L0j57j39J45J21n9j54j39K61J9j8J39m15J44K81
4860B19k12N9J09j69P6l80K87q2J46p0o5n1K06j55m3P6k16J74l3l0J98P4o6P9
4884A31J13l11K08k4j08M1j44M8J50j71K9J08Q8o1N2J7k53R3L0k2J56k9J18m09
4908a50P8QK42j11j87L94l74J4K45l55L14k75J09K0m8K7q7j0L1J16k29J87L42
4931C01n16Q4N3k86K50j1R0J51k56q2M7O1K26l0K53k93k3j12J05Pk12q6L62k19
4955a36j27K36M0j86J72k9K56m25K93j64J81j48N9j71K14N8r7r5j03J65k2K51
4977B22j8n8r2k95J43J49j36L55k88L12m3k83K11l95K39K2l81L30O2P2r7j93J85
5000B3O9k92L19o0j27Oo5K7L79k27J80m00k5K76j80j08j69L14l6o4K67j63M55
$$ y = [-93, 23, -28, -44, -220, 86, 261, 160, 190, 33, -106, 39, 160, 101, -53, -192, 69, 88, 70, 209, -206, -62, 219, 7, 66, 175, 6, 82, -298, -11, -93, 53, -17, -82, -133, 73, -82, -125, -49, -265, -91, -124, -154, 44, 118, 52, 131, 244, -67, 141, 117, 9, 50, -94, -46, 104, -67, -38, 70, 158, 97, 149, 166, -87, 6, 36, 14, 170, 141, 259, -150, -72, -64, 178, 67, -120, 274, -100, -86, 159, -196, 118, -157, -48, -28, -76, -49, -136, -146, -115, 1, -228, -41, 301, -215, -131, -78, -364, -114, -125, -35, 116, -140, -222, -175, -114, 112, 82, 335, 42, 19, -93, 12, 19, -193, -279, 83, -136, -263, -27, 13, -173, -1, -30, 226, -199, 94, -70, 111, -37, 22, -149, 65, 123, 26, -69, -172, -7, -29, 222, 204, 146, 54, -241, -98, 51, -85, 270, -18, 294, 251, -32, 179, -216, 23, 45, -336, -6, 56, 128, 31, -162, 23, 92, -200, 119, 59, -68, -62, -127, -100, 279, 52, 232, -168, -193, 83, -97, -205, -374, -60, -96, -160, 107, -56, 399]
5023C99k85l50L52k79J04K61l54K69k76K91Mn4j52J50M9j52K5j11O2j9K49j05
5045G8J15N9j09k5p3J5J92k07j07P8l3j29J32J66j98l9P0j59L55n6k18K42q3m2
5069B4k3L5k51J29K45Lk15JN7k4K64j01J79l17PJ4p3Q6N9k05M4p7K50k5j09J62
5095A39k48%J89p4J89N3k24J10j66J6Q9j67j46Q2K56k93m4J55K82k06l0k0L3K12
5119A87m99K48j23J82Pj65L56m26n1K66L1k8q0J05l36M39lJ31j71r5M9O8j29J25
5143H8J36j50J2j29K99n2k06j62J37J11K58k60%q9J44l28K46j68J29j4mN3l7O9
5167H3o7Ok76M54j84o5M6M47l35J15j16N6K8Pn25M00j40J51j17Q5M6j73j53K52
5191B5J1j11R4N5n2L1jJ89m46L32J31l76M17l93J40j08k8Q9J4j29M8J71j17j05
$$ y = [399, 114, -236, 116, -163, -59, 202, -152, 117, -159, 132, 136, 82, -70, 80, 129, -23, 2, -109, -47, -66, 183, 78, 193, 252, 143, 118, 45, 60, 252, 45, -62, 16, -17, -146, -14, 152, -46, -85, -15, -174, 181, 125, -93, 149, 66, 24, 1, 36, -215, -86, 159, 162, -53, -52, 5, -19, 245, 144, 323, 6, 13, 27, -46, 40, 99, -106, -62, -139, 111, 86, -23, 139, -109, -109, 80, 6, 195, 248, 24, 134, -32, -16, 73, -94, -240, -158, 98, -195, -239, -84, 198, -8, -38, -58, -25, 187, -312, -64, -187, -5, 2, -163, 193, -233, -284, -18, 13, -15, -95, 10, -326, 113, 110, 241, 70, -25, 24, 92, -37, 88, 224, 74, 86, -43, 256, 204, -2, -164, -27, 84, 342, 82, 82, -7, 137, -191, 55, -113, 16, 2, -2, 51, 14, 83, 16, 22, -254, 200, 16, -49, -3, 444, 109, 224, 108, 164, 192, 199, -326, 74, -66, 85, -32, 53, 99, -74, -227, 25, 36, -75, 19, 74, 22, 53, 52, 241, -205, 127, 258, -118, 299, -94, 46, -62, -90, -1, 13, -116, -68, 103, -14, -119]
5215a19J86M4k34J73J16k46J86l20N00k54q7J73n3r0j39J34J4O8jj22J01J4p9
5238c5J30p3J18q3o6l22K83J79r7r9l20K64N1Q3K28m08R1K57l69J39J59j22KJ41
5262A31j67k40L21j68L50n38N07O9j98r3M2m1j38L64m33K98m14M22Q2j86K42k66
5284e4K80m89J11K42k51J26N4k46K13o0K1K5L88l04J47j73r8p7M06l38J60k66
5306a83J86J83j84j70N34m51O3j31J68N2j80m4J12P8N0l94M42j29j77K25j38J48
5328F0l06L83k57l83O68k86L4j21K23k57J44J26j51L60J8k78q0R8p0Kj42j1N0
5351a76K95j58K61m15J05K45j16N4p6p6O9R6k29K30j7J38k05J5k22K2O0P7J67
5374A44j78P5k47L26J2j59j78L85M1M1j2m30J65l4j37O7K14n0o5j30J68K19l86
$$ y = [-119, 67, 111, -123, 50, 166, -80, 106, -214, 286, 32, -55, 118, 65, -25, -164, -30, -16, 52, 51, -71, 30, 44, -35, 95, 22, 140, 57, -9, -331, -48, 131, 34, -65, -385, -121, -70, 13, 241, -167, -76, 181, -188, -49, 110, -12, -10, 131, -36, -276, 45, -123, 227, -311, 196, 265, 67, -26, 16, -25, -163, 201, -232, 66, -348, 74, 156, -30, 212, -54, 226, -263, -152, 90, -161, -35, 19, -227, -14, -74, -53, -28, 360, 56, 203, 30, -68, -145, 261, -77, 83, -183, 3, 186, 2, -168, 366, -85, -22, -153, 15, 67, -113, -157, -45, 33, 83, -311, 131, 2, -175, 50, -88, 60, -246, 137, -120, -503, 165, -121, -87, -208, 15, -242, -98, 28, -123, 237, 255, -23, -103, -5, -75, -73, -215, -226, -176, 119, -39, 222, -193, -88, 157, 41, 95, 19, -57, 12, 108, -121, 109, 92, 230, 25, 40, -182, -160, -100, -23, 144, -34, 41, -206, 120, 132, -27, -205, 180, 221, 262, 250, -180, -15, -49, -186, -119, 95, 45, -20, -150, 18, 237, -149]
5397a49Q2K15j41K06m11lJ05j3K05j79j66K31q9K8Q5L6j72K98k50O4k04K85j84
5420a21M33j41o5k72L32k53K54j46o8N8o9J68j22k32N18j60Q4j13j17K17j37L7
5442H5k39K80M3j14j02K14J07j7l81J68J3k1J19k56n6K3O7NJ14o1R2k30J48N1
5466E2j27J46l59N51l19L1oJ76j21j13J00m6L4m4r8K2J82j69J61p6P7p3j64J3
5490a70J88J40j09k47P7J30J16k16J34J79j70k15L26k35L91l3m43L39l06L50k30
5511dl1J12j68M9m9J05o8K37J07l48K29Q6j74k07J99k41M7q3j04M03j54J0L78
5534C31l90J35n0j36j15j5K93k48RP9J4L81l37J6J22N1k90M60l53N7j70%m3J47
5558e2j39K28o3J86l48M30j07r7j22j82J91R3o1j7K1J81j85K1J1J82k21K62J22
$$ y = [-149, -67, 148, 7, 213, -198, -201, -96, -109, 96, -83, -249, -18, -107, -79, 6, 42, -130, 168, -82, -18, -222, 63, -121, 312, 171, 106, -166, 166, -87, 167, 21, -47, 11, -58, 110, -12, -244, 274, 114, 198, 85, -32, 185, 48, 85, -154, 126, 169, 55, -47, 167, 274, 257, -124, 44, 57, 36, 155, -101, -157, -134, -67, -62, 52, -9, 83, -147, 1, 52, -75, 71, -288, 263, -56, -25, -31, 145, 24, -89, 11, -35, -1, -45, -143, -121, 61, -108, 53, -23, 54, -19, -183, -170, 18, 158, 49, -198, -121, 9, 125, -91, 43, 222, 52, -163, 163, -72, 319, 286, -157, 182, -124, 226, -4, -35, 77, -91, -42, -91, 14, -54, 183, 290, -58, 171, 257, 83, -124, 75, -166, -119, -202, -306, 97, -57, -47, 331, -59, 76, 26, -110, -225, -240, 53, -195, -186, -107, -93, 288, -49, -33, 89, 140, -150, 310, -43, 14, -156, -156, -199, -52, -191, 37, -26, 160, -188, 242, 135, 38, -84, -266, -75, 18, -43, -60, -39, 142, -43, -22, -11, 171, -50, 212, 334]
5581C34l19j49NJ17J05k38qJ47l7j57j44L46Q1j13K61l75N4j13J50O0j44n4K54
5604F3J6j6M0l1J34k15l0K44j46Rm3J8K53k81q6L6j14J38p5p5L03k03k10N06l54
5629a19J8k05L63O7j13k10J63K4J3p7Q6J94j31ml83R3L00J8m21L96J4j2pJ28L9
5654B34l86k7K04j0r6Rn7o3K84j87K17k39R3j35K23j40P9p6J20R1j29J02k43Q
5678a24J80j74J38j32j01K33n0J49j96L0J05J04n70M63j17K49l47L02m08Q0M03
5699B17k45L0J26k21K66n7j61N5k0R0k3R9j69J17k68O2J0K06K50k46l32J64R9
5722D9q9L31m92l2K91Mq7j42K77j32j34J80q5J21kp1j24P3n8K50j80mq8LP6R3
5748B8j08J04L2j7J28j01P3k56J31Ll13l0L36J44J87m85k30M99nL7l42P8LQ6r9
$$ y = [334, 15, -134, -129, -12, 93, -145, -153, -6, -43, -200, -344, 2, 83, -30, 231, -144, -90, -203, -53, 7, -137, -191, 63, 79, 63, 103, 72, 206, -9, -39, 205, 59, 68, 25, 43, 296, 15, -71, -35, -149, -11, -86, -161, 142, -61, -271, 235, -119, -101, -306, 57, 124, 11, -199, -36, -12, 1, -76, 10, 204, 73, 69, -314, -221, 79, 97, -324, 72, 86, 74, 67, 195, 234, -152, -179, 25, 15, -81, -72, -129, -192, 92, -95, 122, -117, -24, -159, 64, -76, 3, -73, 47, 138, 9, 111, -132, -124, 56, -118, 20, -112, -213, 20, -30, 119, -77, -47, 58, 162, -408, 55, -62, 187, -160, 142, -266, -186, 217, -28, 2, 128, -93, 173, 116, -45, 10, -10, 80, 57, 156, -13, 104, -164, -102, -92, 114, 364, 118, -214, -50, 49, -40, 291, -201, -233, 58, 62, -25, -167, 110, -22, -156, 24, -61, 60, 58, -13, -137, -64, -122, 128, -52, -56, -144, -141, -65, 28, -80, 24, 56, 39, 167, 66, 139, -117, 14, 17, -296, -326, 10, 154, 341, -144, -374, 125, 120, 157, -185, -107, -104, -18, -117]
5773a17M6N5J7r3J51l30L93q5j93L12P8k72j16K02L4j77K1j97J65K83l22P2J42
5796F9j48J57r9J00j96K05l46L19j89l2O4j45K12l1J44l50L93j33l29N07k31N06
5818D47m94K05k42Q7k47j04L84J04J06j91R1m51K41J25J7K13l34L5J2o7o8L71
5840B40m14K86p0J86m24r4M10j2j78J87j46j03O7j40J16K89j21L2k20J4K6j63
5862b32J48K09K00k40j01k8J52p9j77K4n4J36Rj15%L44k32N7J18l4Mk36J32n4
5886d9J93k73K29j74J36k23J93M1k73jJ00K2k3K87j01J05k84K42k24n3L2o5K74
5909A11n5k85P1NL19k80K99k0k06J10J60j1k90J28K6Q4k13k5K5J8J73o7j06K4
5933eJ08j72N0J58j54%K1J10k30K61N2l33j19K39R2L09r8k90P2j98N2n5J14J00
$$ y = [-117, -71, -16, 1, -92, 59, -271, 122, 37, -156, 156, 234, -38, -154, 48, 82, -95, -74, -271, -106, 177, -145, -73, 69, -79, 78, -21, 79, -117, 88, -258, 61, -128, -160, -96, -241, -29, -60, 84, -266, 127, -6, -335, 172, -59, 447, -47, 158, -84, 3, -244, -348, 36, 140, 246, 55, 146, -305, -64, 61, 78, 291, -43, -8, 4, -63, -131, 240, -174, 112, 42, 228, -196, -290, 120, 108, -70, 117, -29, -132, -65, -205, -89, 200, 79, 111, -109, -95, -69, -232, -84, 125, 325, 85, -16, -44, 108, 29, -148, -124, -178, -42, -33, -148, -148, 196, -36, 21, 139, 105, 109, -127, 5, -49, 144, -129, 100, -74, 62, -161, 32, 73, -200, -201, -101, -79, -102, 185, 84, 189, -95, 147, -77, -130, -98, -163, 111, 56, -229, -158, -153, 166, -114, 185, 165, -41, 69, 229, 218, -72, 56, 82, 166, -47, -72, -47, -29, 144, 77, -29, -5, 103, -69, -19, 139, -15, -15, 6, 116, -114, 147, 199, -134, -253, -14, 78, 387, 289, -1, 71, -127, -75, -130, -16, 84]
5957H4k07n6K17K06m61K37n0J24k12K60n41N88k31j48K46k41J99R7k34Q5k16L32
5979G8J05k34J12q2r9K03k68R5J37n2P8K7j12o3K16k32J23k6k31O1L56m60Q2J5
6003a71K3J37J60k33K10J7k06K50k02J08j55M7R1j02Q8j52J0K48j15j52J85R0
6025A76o0J08k13O2j77J43j62O1J64l45J99L12l28N1K78k48K09m07K55j04j37
6046a63J85l4m6K08j70p0K43k39J37j38j4j32M31o5q2J62j04l34K92J74m62J30
6068i1J00j27L42k69K14k58k22K82j65J01J15J60l24J4r0J85J06j16N4m8N7Q4
6090A04P1n3K31j60j37o9J02J9k1k00Q8J62l27J55j03J53J96R8l81k63K88l0J48
6113G1K8k41M9O3Q5p2J2j86q9L21O0j12j37M7J1n1K73r0Ql8P8l8J7k4p6K94k36
$$ y = [84, -123, -179, 38, 244, -217, 20, -30, 94, -118, 142, -399, 189, -42, -190, 56, -185, 14, 111, -123, -38, -254, 78, 183, -51, 61, -21, -120, 83, -185, -90, 47, -5, 73, 100, -12, -75, 141, -91, 32, 6, -225, -164, 192, -268, -186, -171, -148, -11, 149, -84, 126, 143, -63, 187, -15, 93, -62, -15, 76, -26, 62, -90, -80, 168, 53, -99, 86, 176, 116, 224, 11, 73, -104, 39, -123, -62, 102, -243, -44, 268, -60, -9, 269, 21, 230, -177, 78, -26, -163, 22, -12, -58, 150, -20, -90, 153, -86, 51, -87, -101, -233, 198, 133, 51, 213, 109, -225, 67, 241, -221, -91, 9, -118, 224, -45, 169, -89, -311, -29, -194, -93, 22, 182, -142, -128, -218, -33, 73, -43, 11, -37, 20, 104, 175, 122, 353, 193, 56, -13, 89, 108, 87, -113, -25, 137, -190, -35, -138, 15, 211, 309, -72, -335, -47, -77, 71, 99, -142, -93, -30, 55, -17, -5, -191, -280, 41, 101, -11, -148, -101, -90, -141, 132, 42, 50, 12, 90, 52, 69, 45, -31, 263, 27]
6140B7J14k92P0K44l95PN5Q2p0k04K72N1k3R0P2N9l86J57j95j07K67K80j4k12
6164e1J54R3l0k48O2j39Jj10L35lr3O9O7j64J00k85K30j21J92j80K23k5k5kL7
6189H7J5k5j89J39j9j39M0K05q1J69j45o3N4pJ9j89o0L53k60J13m2N0o8K11j00
6214F8j53J57R6n8j09LMK3l6Rj03M6N0r7K88l42j64J73k0J83k92K5P0K21J0o9
6240a7P1k7K8k0Q7k21o9L77j76l09O4M56l15L5o6K04j59K00k2j80q0J57j12J5
6264g9J18L15m89M69n81Q4J67j29J17q1K84l96P3J47J41p4J0p3J01j96PJ5M39
6287C89p30N36l04Ll0J68Q6k02K03j20K78l56rj6J96J04l19N3Q6q2J37J87j28
6310A30l52P9P7o5R3JK5K99k87O5r7J41o5q4r5K41Q3k57J90k20o9L52l5j14J16
$$ y = [27, 141, -151, -81, 163, -232, -225, -170, -88, -158, -362, -90, -39, -62, 28, 100, 159, -227, -70, -265, -372, -105, 175, 161, -51, 103, 196, 166, -82, -20, -159, -158, -268, 67, 64, -29, 40, 107, -57, 43, -242, -12, -133, 59, -121, 102, 77, 52, 50, 87, 102, 77, -112, 27, 8, -131, -91, 114, 33, 202, 57, -6, 48, 41, 60, -129, -189, 164, -96, 17, -25, 25, -43, 168, 68, -85, 72, 168, 110, 1, 4, 8, 31, -5, 4, -99, -53, -3, -100, 188, -154, -318, -145, -165, 18, -274, -249, -179, 42, 52, -17, 54, 27, 55, 35, 122, -99, -168, 209, 33, -276, -212, 244, -71, -36, -102, 102, -57, 143, 121, -59, -139, 18, -94, -79, 39, 354, -135, 334, -247, -163, 4, -125, -8, -89, 195, -201, -128, 19, 160, 86, 96, 23, 124, -72, -65, -50, 389, -341, 195, -109, -106, -136, 32, 118, -84, 119, -1, 277, -79, -88, -104, 92, 196, -123, -70, 16, -66, 71, 258, 130, -222, -143, -66, -131, -38, -37, -12, 287, 0, 65, -32, 109, 44, -40, -135, 106, 189, -68, 122, -98, -167, 185, 150, 36, 152]
$$ [...]
8191A05
##END NTUPLES=NMR FID
##END=
