##TITLE=1H_PR194_11
 D2O
 8 sc, 
 11.11.2021
##JCAMPDX= 6.0         $$ Bruker NMR JCAMP-DX V2.0
##DATA TYPE= NMR FID
##DATA CLASS= NTUPLES
##ORIGIN= UXNMR, Bruker Analytische Messtechnik GmbH
##OWNER= root
$$ XWIN-NMR		Version 3.5
$$ Thu Nov 11 13:17:22 2021 Russian Standard Time (UT+4h)  she@DPX200
##.OBSERVE FREQUENCY= 200.1313468511
##.OBSERVE NUCLEUS= ^1H
##.DELAY= (6, 6)
##.ACQUISITION MODE= SIMULTANEOUS
##.ACQUISITION SCHEME= undefined
##.AVERAGES= 8
##.DIGITISER RES= 18
##SPECTROMETER/DATA SYSTEM= spect
##.PULSE SEQUENCE= zg30
##.SOLVENT NAME= D2O
##.SHIFT REFERENCE= (INTERNAL, D2O, 0, 15.7039)
##AUDIT TRAIL= $$ (NUMBER, WHEN, WHO, WHERE, WHAT)
$$ ##TITLE= Audit trail, XWIN-NMR		Version 3.5
$$ ##JCAMPDX= 5.01
$$ ##ORIGIN= Bruker BioSpin GmbH
$$ ##OWNER= she
$$ F:/spectra/data/she/nmr/H-F/1/audita.txt
$$ ##AUDIT TRAIL=  $$ (NUMBER, WHEN, WHO, WHERE, WHAT)
(   1,<2021-11-11 13:16:02.18 +0400>,<she>,<DPX200>,
      <created by zg, POWCHK disabled, PULCHK disabled
       configuration hash MD5:
       00 E9 B6 7A A2 85 ED C7 34 08 36 98 17 FE 4E 26
       data hash MD5: 16K
       99 97 40 2E 84 D7 95 1E 87 F0 3A CF 73 8F 7E 07>)
$$ ##END=
$$ 
$$ hash MD5
$$ 01 9F CA 17 05 F0 08 1A 28 C0 0F 72 54 BB 3D 58
##$RELAX= 
##$RELAX= 
##$RELAX= 
##$RELAX= 
##$RELAX= 
##$RELAX= 
$$ Bruker specific parameters
$$ --------------------------
##$DU= <F:/spectra>
##$EXPNO= 1
##$NAME= <H-F>
##$PROCNO= 1
##$TYPE= <nmr>
##$USER= <she>
##$AMP= (0..31)
100 100 100 100 100 100 100 100 100 100 100 100 100 100 100 100 100 100 
100 100 100 100 100 100 100 100 100 100 100 100 100 100 
##$AQSEQ= 0
##$AQ_mod= 1
##$AUNM= <au_zg>
##$AUTOPOS= <>
##$BF1= 200.13
##$BF2= 200.13
##$BF3= 200.13
##$BF4= 200.13
##$BF5= 200.13
##$BF6= 200.13
##$BF7= 200.13
##$BF8= 200.13
##$BYTORDA= 1
##$CFDGTYP= 0
##$CFRGTYP= 5
##$CHEMSTR= <none>
##$CNST= (0..31)
1 1 145 1 1 1 1 1 1 1 1 1 1 1 1 1 1 1 1 1 1 1 1 1 1 1 1 1 1 1 1 1 
##$CPDPRG= <>
##$CPDPRG1= <>
##$CPDPRG2= <>
##$CPDPRG3= <>
##$CPDPRG4= <mlev>
##$CPDPRG5= <mlev>
##$CPDPRG6= <mlev>
##$CPDPRG7= <mlev>
##$CPDPRG8= <mlev>
##$CPDPRGB= <>
##$CPDPRGT= <>
##$D= (0..31)
0 1.2 0 0 0 0 0 0 0 0.06 0 0.03 0 0 0 0 0.0002 0 0 0 0 0 0 0 0 0 0 0 0 
0 0 0 
##$DATE= 1636622161
##$DBL= (0..7)
120 120 120 120 120 120 120 120 
##$DBP= (0..7)
150 150 150 150 150 150 150 150 
##$DBP07= 0
##$DBPNAM0= <>
##$DBPNAM1= <>
##$DBPNAM2= <>
##$DBPNAM3= <>
##$DBPNAM4= <>
##$DBPNAM5= <>
##$DBPNAM6= <>
##$DBPNAM7= <>
##$DBPOAL= (0..7)
0.5 0.5 0.5 0.5 0.5 0.5 0.5 0.5 
##$DBPOFFS= (0..7)
0 0 0 0 0 0 0 0 
##$DE= 6
##$DECBNUC= <off>
##$DECIM= 32
##$DECNUC= <off>
##$DECSTAT= 4
##$DIGMOD= 1
##$DIGTYP= 9
##$DL= (0..7)
0 120 120 120 120 120 120 120 
##$DP= (0..7)
150 150 150 150 150 150 150 150 
##$DP07= 0
##$DPNAME0= <>
##$DPNAME1= <>
##$DPNAME2= <>
##$DPNAME3= <>
##$DPNAME4= <>
##$DPNAME5= <>
##$DPNAME6= <>
##$DPNAME7= <>
##$DPOAL= (0..7)
0.5 0.5 0.5 0.5 0.5 0.5 0.5 0.5 
##$DPOFFS= (0..7)
0 0 0 0 0 0 0 0 
##$DQDMODE= 0
##$DR= 18
##$DS= 0
##$DSLIST= <SSSSSSSSSSSSSSS>
$$ [...]
##$SUBNAM2= <"">
##$SUBNAM3= <"">
##$SUBNAM4= <"">
##$SUBNAM5= <"">
##$SUBNAM6= <"">
##$SUBNAM7= <"">
##$SUBNAM8= <"">
##$SUBNAM9= <"">
##$SW= 18.0517286264689
##$SWIBOX= (0..15)
0 0 2 0 0 0 0 0 0 0 0 0 0 0 0 0 
##$SW_h= 3612.71676300578
##$TD= 16384
##$TD0= 1
##$TE= 0
##$TE2= 300
##$TE3= 300
##$TEG= 300
##$TL= (0..7)
0 120 120 120 120 120 120 120 
##$TP= (0..7)
150 150 150 150 150 150 150 150 
##$TP07= 0
##$TPNAME0= <>
##$TPNAME1= <>
##$TPNAME2= <>
##$TPNAME3= <>
##$TPNAME4= <>
##$TPNAME5= <>
##$TPNAME6= <>
##$TPNAME7= <>
##$TPOAL= (0..7)
0.5 0.5 0.5 0.5 0.5 0.5 0.5 0.5 
##$TPOFFS= (0..7)
0 0 0 0 0 0 0 0 
##$TUNHIN= 0
##$TUNHOUT= 0
##$TUNXOUT= 0
##$USERA1= <user>
##$USERA2= <user>
##$USERA3= <user>
##$USERA4= <user>
##$USERA5= <user>
##$V9= 5
##$VALIST= <valist>
##$VCLIST= <CCCCCCCCCCCCCCC>
##$VD= 0
##$VDLIST= <DDDDDDDDDDDDDDD>
##$VPLIST= <PPPPPPPPPPPPPPP>
##$VTLIST= <TTTTTTTTTTTTTTT>
##$WBST= 1024
##$WBSW= 4
##$XGAIN= (0..3)
0 0 0 0 
##$XL= 0
##$YL= 0
##$YMAX_a= 712289
##$YMIN_a= -722147
##$ZGOPTNS= <>
##$ZL1= 120
##$ZL2= 120
##$ZL3= 120
##$ZL4= 120
##$ABSF1= 10
##$ABSF2= 0
##$ABSG= 5
##$ABSL= 3
##$ALPHA= 0
##$AQORDER= 0
##$ASSFAC= 0
##$ASSFACI= 0
##$ASSFACX= 0
##$ASSWID= 0
##$AUNMP= <proc_1d>
##$AZFE= 0.1
##$AZFW= 0.1
##$BCFW= 1
##$BC_mod= 2
##$BYTORDP= 1
##$COROFFS= 0
##$CY= 11.3945322036743
##$DATMOD= 1
##$DC= 2
##$DFILT= <>
##$DTYPP= 0
##$F1P= 2.36226072786647
##$F2P= -0.459571619588291
##$FCOR= 0.5
##$FTSIZE= 0
##$FT_mod= 4
##$GAMMA= 1
##$GB= 0.15
##$INTBC= 1
##$INTSCL= 1
##$ISEN= 128
##$LB= 0.24
##$LEV0= 0
##$LPBIN= 0
##$MAXI= 10000
##$MC2= 0
##$MEAN= 0
##$ME_mod= 0
##$MI= 1.114404
##$NCOEF= 0
##$NC_proc= 0
##$NLEV= 6
##$NOISF1= 3.799351
##$NOISF2= 2.8
##$NSP= 1
##$NTH_PI= 0
##$NZP= 0
##$OFFSET= 15.70392
##$PC= 1
##$PHC0= -15516.31
##$PHC1= 12.20081
##$PH_mod= 1
##$PKNL= yes
##$PPARMOD= 0
##$PSCAL= 0
##$PSIGN= 0
##$REVERSE= no
##$SF= 200.130013532006
##$SI= 16384
##$SIGF1= 3
##$SIGF2= 2
##$SINO= 400
##$SIOLD= 16384
##$SREGLST= <1H.CDCl3>
##$SSB= 0
##$STSI= 0
##$STSR= 0
##$SW_p= 3612.71676300578
##$SYMM= 0
##$S_DEV= 0
##$TDeff= 0
##$TDoff= 0
##$TI= <>
##$TILT= no
##$TM1= 0
##$TM2= 0
##$TOPLEV= 0
##$USERP1= <user>
##$USERP2= <user>
##$USERP3= <user>
##$USERP4= <user>
##$USERP5= <user>
##$WDW= 1
##$XDIM= 8192
##$YMAX_p= 0
##$YMIN_p= 0
$$ End of Bruker specific parameters
$$ ---------------------------------
##NTUPLES= NMR FID
##VAR_NAME=  TIME,          FID/REAL,        FID/IMAG
##SYMBOL=    X,             R,               I
##VAR_TYPE=  INDEPENDENT,   DEPENDENT,       DEPENDENT
##VAR_FORM=  AFFN,          ASDF,            ASDF
##VAR_DIM=   8192,          8192,            8192
##UNITS=     SECONDS,       ARBITRARY UNITS, ARBITRARY UNITS
##FACTOR=    0.0002768,     1,               1
##FIRST=     0,             0,               0
##LAST=      2.2672688,     0,               0
##MIN=       0,             -722147,         0
##MAX=       2.2672688,     712289,          0
$$ Real data points
##PAGE= N=1
##DATA TABLE= (X++(R..R)), XYDATA
$$ [...]
2253i232Q89N058O981M483R20k454o123o524l042Q09L966O488N731J244k598n035
2269A561o174m736N88M260N509N664L047k322n443n318m817j321L839O457M971
2284E765L238o26n119o731m100j194K187N984O280K942o08l538o396n582j216
2299h714K262M578O247M462n01l885n113n756k953K190M980N257M819J352l922
2314E303n654m939l201K37N052O176M140J383j879n765o225k642K62L040O443
2329A731N451J064j596m479o192m263M33L313M974N551K990k063m566n031m871
2344g554j250L456N395M942L246m05m676n776m003j736J873N613N793K714j6l129
2360D487n928n028j617J600M221O206L896k58k862m913n356k959J669M351M995
$$ y = [-9232, -8343, -3285, 3696, 8179, 9099, 6645, 522, -6002, -9044, -8235, -4269, 2219, 7950, 9194, 6596, 1561, -4613, -9349, -8761, -4501, 1008, 6672, 9719, 7397, 1954, -3364, -8181, -9502, -5663, 794, 5765, 9003, 8377, 3258, -3473, -7573, -8767, -6580, -596, 5684, 8626, 8018, 4480, -1916, -7498, -8714, -6452, -1874, 4373, 8835, 8334, 4449, -664, -6420, -9373, -7183, -2203, 3054, 7873, 9225, 5303, -351, -5290, -8491, -8254, -3202, 2974, 7114, 8497, 6618, 853, -5372, -8014, -7752, -4712, 1731, 7182, 8246, 6650, 2171, -4021, -8284, -7851, -4538, 436, 5987, 8977, 6914, 2348, -2683, -7554, -8804, -5348, 47, 4989, 8235, 7830, 3154, -2622, -6625, -8361, -6488, -875, 4918, 7632, 7616, 4487, -1441, -6469, -8086, -6486, -2265, 3941, 7837, 7579, 4717, -196, -5552, -8511, -6842, -2491, 2504]
2375B504M482J186l058n057m674l202L38M289N472L941J920j953n288n258k845
2390g203k91L204N628M715J548j230m212n613l819j85K794M643N458K455j295
2405F597l995m901m522j036K764M628M841L074m39l758n104m180j670J956M722
2420a023M963L117K46l007n311m424k029J341M134N053L598O12k638m668m878
2435d914k514R72L770M977L877J034j998m652m736l068M77L433M836M313J467
2450G274j760l980m969l435j25L047M611M503K116j349l932m687l554r28K672
2465d496M504M530K432m32l848m851l534j324J706M637M767K617j63k736n112
2480a303m226j369J453L755M863L488j17k667m104m547k406J494L630M446L598
$$ y = [2504, 6986, 8172, 5114, 57, -4617, -7819, -7481, -3192, 2280, 6221, 8141, 6188, 900, -4358, -7203, -7494, -4290, 1338, 6053, 7601, 6371, 2159, -3454, -7273, -7458, -4664, -21, 5437, 7892, 6597, 2602, -2299, -6821, -7857, -5093, -465, 4376, 7450, 7011, 3253, -1851, -6031, -7701, -5745, -1023, 3940, 7057, 7303, 4296, -1015, -5439, -7468, -6127, -1993, 3060, 6658, 7270, 4632, -36, -4914, -7428, -6456, -2686, 2291, 6168, 7202, 5204, 552, -4184, -7252, -6775, -3342, 1494, 5807, 7274, 5514, 1534, -3435, -6870, -6995, -3948, 663, 5166, 7282, 5933, 2001, -2686, -6240, -7168, -4496, 8, 4538, 6970, 6538, 2690, -2161, -5695, -7019, -5313, -676, 4091, 6708, 6545, 3809, -1303, -5529, -6898, -5445, -1690, 3173, 6661, 6544, 3877, -227, -4774, -7180, -5686, -2056, 2390, 5988]
2495E988R73k581m273l948k809L55L456M842L387J425j478m440m601k556J6K483
2511c761M941M149J232j179l351n061l287m0K643L596M663K380j529l173m138
2526a915l938j080K588L972L980K967k08l689m169l435j628J297M535M222K240
2541E739L99k397m708m044j158Q03L291M776L529k80k099l438m839k099J086L323
2557b116L758L747J431k641l754l730k831J25L265M308L066J708j183m207m065
2572c119k354o38K286M755L535J388m94l125m854l085k57K033L516M622K091j219
2588E081k631l826l933r81K214L462L540L244j89l238l815l307j932J229M041
2603a041L587K704P60k185m506l571j421N86K852M579L043J62j578l614m225k066
$$ y = [5988, 6961, 4380, 107, -3841, -6650, -6295, -2839, 2003, 5390, 6815, 5337, 897, -3704, -6260, -6244, -3761, 1180, 5329, 6561, 5382, 2031, -3030, -6317, -6357, -3714, -118, 4545, 6925, 5396, 2223, -1915, -5853, -6933, -4345, -373, 3607, 6574, 6366, 2677, -1492, -4927, -6555, -5258, -723, 3499, 5739, 6138, 3741, -967, -5011, -6169, -5366, -2075, 2701, 6230, 5950, 3851, 413, -4426, -6525, -5439, -2116, 1642, 5389, 6820, 4179, 425, -3305, -6136, -6011, -2746, 1562, 4628, 6336, 5153, 946, -3119, -5473, -6111, -3825, 930, 4465, 5853, 5359, 2234, -2620, -5705, -5962, -3929, -413, 4209, 6300, 5081, 2450, -1376, -5309, -6290, -4076, -614, 2926, 6170, 5981, 2743, -1072, -4379, -6311, -5082, -1041, 2546, 5250, 6010, 3825, -681, -4252, -5673, -5087, -2235, 2344, 5387, 5549, 3971, 357, -3868, -5934]
2619e934P90K592L696L849J138j996l181l922k608n1K877L543L287J939j216l540
2635A263l813k421p92K065M133L498J666k99k979m411k783o77J551L485L910K168
2651E564n50k276l801l623r47J390L303L674K770j56k387l554l235k070J202L224
2667a472L755K566P31k035l651l509j936O21K740M021K770Q43j345l677l487k197
2683e262J24K600L770K957J176j040l198l748k420k11K093L703L348J457q61k888
2699A600l664k570p08J848L394L513J850n53k569l624k907j096J651L189L539
2714B893K175r9k369l466k938j443J122L017L545K214L75j729l742l078j409M79
2730d453K520L841K582M95j429l153l730j860O05K317L577K817J109j455k999
$$ y = [-5934, -5144, -2552, 1144, 4993, 6131, 4135, 954, -2968, -5576, -5627, -2750, 793, 4080, 6019, 4803, 1263, -2550, -4971, -5763, -3698, 435, 3933, 5599, 5300, 2321, -2090, -4873, -5550, -3999, -514, 3396, 5564, 5014, 2738, -1063, -4686, -5633, -4243, -940, 2734, 5504, 5348, 2961, -593, -3828, -5898, -4696, -1472, 2283, 4849, 5580, 3545, -106, -3615, -5551, -4930, -2190, 1831, 4601, 5444, 4099, 422, -3065, -5262, -5138, -2538, 1232, 4189, 5365, 4325, 1127, -2621, -5041, -5252, -3159, 544, 3892, 5349, 4488, 1600, -2064, -4634, -5342, -3494, -100, 3413, 5263, 4710, 2141, -1483, -4390, -5486, -3835, -646, 2893, 5068, 4969, 2600, -866, -3804, -5247, -4125, -1108, 2437, 4651, 5026, 3297, -445, -3523, -4932, -4453, -1933, 1908, 4490, 4985, 3556, 403, -3327, -5187, -4582, -2265, 1312, 4129, 5238, 3783, 784]
2745G84l358k515J01K526L292K903J486r51l031l439k326n37J857L632K875J367
2761D666k37k370l889k237o53J210K977L795J611n84j929l149l316j028J624K614
2777h95L096K608R5k481k779k707j980R22K998L064K063R25j828l351k683j393
2793d326j19K710L393K420L73q28k732l733j773N16J669L247L063R82j444k299
2809A119l092k690qK070K927K803J810p44k844l038k174j012J637L466K486J567
2825D283K61k601l512k195o36P77K907L401J652k96j434l127l419p16J260K311
2841a084K850K719o4j949k449k759k096Q98K518K735K379R83j395l196k784j413
2857d107k60K284L360K157R22q32k650l290j556PJ279L218L002O30p16j998l137
$$ y = [784, -2574, -5089, -4988, -2462, 830, 3733, 5219, 4268, 1237, -2202, -4528, -5065, -3208, 424, 3299, 4666, 4429, 2059, -1830, -4067, -4720, -3510, -533, 3262, 4873, 4289, 2360, -789, -4105, -5133, -3509, -895, 2201, 4809, 4904, 2423, -356, -3063, -5043, -4121, -1123, 1941, 4004, 4929, 3101, -250, -2933, -4326, -4445, -1735, 1658, 4078, 4451, 3623, 891, -2842, -4615, -4099, -2430, 817, 3880, 4862, 3418, 1119, -1973, -4663, -4671, -2601, 326, 3129, 4939, 4195, 1351, -1687, -3861, -4873, -3236, 230, 2716, 4283, 4544, 1943, -1569, -3764, -4400, -3623, -716, 2685, 4337, 4041, 2607, -520, -3939, -4655, -3395, -1084, 1766, 4485, 4421, 2472, 23, -2736, -4832, -3934, -1416, 1319, 3698, 4681, 3286, 90, -2694, -4107, -4367, -2083, 1277, 3434, 4356, 3524, 874, -2416, -3972, -3965, -2686, 532, 3534, 4164, 3448, 1450, -1687]
2874a687k445o7J660K451K690K162r79k285k687k343q52J307K701K551J911Q2
2890D170k041l160k171j001O74K687K825J961R9j487k919k675r59M89K072K889
2906A453K468J09j381k313k863j645L52K152K580K304R98j203k510k688j573j14
2922c874J831K752K417J062q80k307k698k122j57J452K655K723J191n76k055k851
2938a437k060n70J291K357K824J427j70j901k560k168j035R29K402K579J868o0
2954C716j512k701k315j197Q78K073K637J886M66j511k458k338j630N63K050K442
2970A049K072P00j035k360k445j595lJ733K776K001Q64o79k122k951j497j9J191
2987b320K562K395R56o34j576k686k188q8J230K228K425J455l95k004k216k049
$$ y = [-1687, -4132, -4199, -2539, -88, 2602, 4764, 3785, 1500, -1187, -3530, -4382, -3075, -374, 2177, 4088, 4170, 2129, -1031, -3202, -4203, -3529, -842, 1983, 3944, 4043, 2556, -363, -3038, -3997, -3508, -1436, 1453, 3921, 4030, 2649, 336, -2527, -4172, -3820, -1668, 912, 3216, 4214, 3011, 501, -2187, -3760, -3874, -2043, 709, 3126, 4188, 3308, 1001, -1697, -3819, -3976, -2524, 131, 2854, 4045, 3469, 1414, -1437, -3497, -4067, -2776, -419, 2405, 3832, 3662, 1761, -799, -2967, -4002, -3073, -671, 1908, 3776, 3716, 2204, -497, -2812, -4009, -3131, -1058, 1579, 3465, 3931, 2420, -38, -2376, -4006, -3443, -1393, 1049, 3121, 3821, 2786, 426, -2019, -3614, -3617, -1884, 892, 2893, 3757, 3078, 956, -1995, -3492, -3511, -2320, 242, 2637, 3593, 2959, 1383, -1303, -3491, -3579, -2349, -121, 2304, 3759, 3364, 1360, -856, -2905]
3003b905j008J245K224K411J441K75j607k733k061q43M22K189K703J529K51j076
3019B457k616k497p69L89J640K554K039K79j132k021k454j506N46J824J843K183
3035B759J206j290k201k057j551m23J745K413J835R49j57k310k624j310j34Q31
3051b319K301K464P80k74j258k790k234p4J233J727K420J527n12j589j978k081
3067b657q72R89J959J917J628N06j512k474j737j225L41K170K354J407M04p51
3083B447k504k199p89O0J547K421J913K92q46j672k488j471M51J366J916J967
3099B411J162j034j898j761j810l88J463K159J614J109j30j772k337j464m45P01
3115b420K176K294Q24Q0j460k381j887k91P13J680K361J405j95j165j864k184
$$ y = [-2905, -3913, -2668, -444, 1967, 3408, 3683, 2076, -657, -2718, -3561, -3139, -950, 1753, 3282, 3533, 2457, -159, -2656, -3425, -3036, -1396, 1158, 3197, 3476, 2344, 323, -2131, -3637, -3091, -1267, 576, 2759, 3965, 2675, 474, -1583, -3134, -3557, -1812, 601, 2436, 3385, 3228, 918, -1706, -3016, -3150, -2319, -18, 2446, 3226, 2952, 1694, -1096, -3330, -3404, -2171, -444, 1976, 3503, 2991, 1402, -576, -2657, -3529, -2540, -581, 1336, 2964, 3470, 1958, -516, -2253, -3478, -3137, -967, 1387, 2794, 3198, 2447, -57, -2256, -3045, -2985, -1438, 983, 2896, 3188, 2342, 670, -1818, -3289, -2838, -1472, 444, 2411, 3573, 2539, 641, -1120, -2930, -3318, -1855, 304, 1918, 3027, 2897, 1125, -1212, -2676, -3121, -2420, -244, 2050, 2874, 2954, 1494, -887, -2774, -3065, -2352, -672, 1689, 3094, 2899, 1734, -130, -2314]
3131b314j015Q72J864J726J569N47j360j929j850j087J38J556K261J554N85j032
3147B085j924k008p89j66J316K074J871M21l75j832k276j309R8J248J861J867
3163B162Q78n49j557j931j657k27J021J937J762J100j86j552j963j567o91R76
3179b044J749J796J231p9j040j903j897o58N88J516J904J469Q9r01j781j995q82
3196b838M14J466J889J631K9q17j633j748j090P8J307K009J702K83o87j462j848
3213a315j330R0J214J674J515R32o24j406j861j291k27R67J781J671Q97k05j613
3230H69j875j073m92N47J791J835Q81q2r78j943j521n57O02J350J986J271r9j044
3248A468j668j545j015N89J542J512J428M96j054j751j440j138J59J397J778J181
$$ y = [-2314, -3329, -2457, -593, 1133, 2702, 3249, 1889, -40, -1890, -2977, -2839, -1283, 978, 2532, 3117, 2085, 161, -1847, -2636, -2802, -1486, 588, 2459, 2880, 2505, 673, -1603, -2912, -2814, -1566, 295, 2162, 3040, 2491, 934, -997, -2654, -2881, -1860, 77, 1839, 2939, 2753, 1201, -762, -2329, -3020, -2044, -295, 1501, 2732, 2653, 1613, -290, -2187, -2845, -2257, -741, 1163, 2632, 2721, 1820, 39, -1956, -2838, -2424, -958, 931, 2562, 2591, 1774, 141, -1607, -2697, -2619, -1312, 697, 2399, 2682, 1995, 533, -1315, -2645, -2555, -1341, 333, 1848, 2780, 2156, 750, -1111, -2402, -2629, -1662, 119, 1790, 2687, 2482, 869, -1006, -2079, -2571, -2024, -233, 1602, 2483, 2401, 1423, -520, -2041, -2598, -1996, -646, 1340, 2611, 2512, 1468, -200, -1745, -2760, -2171, -629, 883, 2311, 2807, 1753, 2, -1438, -2576, -2417, -1020, 758, 1939]
3264A939N22m57j789j689q91j0J061J687J616L05n09j063j890j325J99Q11J479
3281dJ800R56r12r96j540j569k82R51J466J584Q94J53j504j529j213q50O47J610
3299c38J830O44J60p75j975j547l13L02J171J917J210j94n39j268j951o36M43
3316a859J113J269J480O82j197j410j290j122%J406J476J057R05p08j600j446
3332a244o25l66P93J776J442K73j51j099j818j096m5O78J414J643Q36o13r01j323
3350d26j497l79Q51J120J464J078j05j204j210j314p87O39J516J334O43N85q91
3367A417j862j037o37J69R47J968J002O8o20j305j448p94L77P05J482J472L67
3384B271q49j114j401j027p6J319J179J263O82l96j360j349r87l07O59J701J223
$$ y = [1939, 2461, 2004, 215, -1474, -2365, -2375, -1314, 373, 1989, 2294, 1785, 722, -1168, -2493, -2294, -1483, -4, 1796, 2752, 1840, 844, -696, -2265, -2547, -1596, -130, 1454, 2348, 2501, 997, -532, -1745, -2595, -1948, -338, 1492, 2136, 2296, 1521, -454, -2001, -2314, -2012, -841, 1076, 2286, 2092, 1553, 285, -1666, -2302, -1859, -746, 523, 2003, 2685, 1488, 78, -1212, -2334, -2334, -928, 548, 1605, 2510, 1802, 202, -1244, -1869, -2235, -1442, 334, 1776, 2049, 1898, 799, -1019, -2115, -2160, -1482, -68, 1575, 2411, 1798, 897, -426, -1923, -2302, -1451, -331, 1133, 2211, 2106, 902, -308, -1622, -2409, -1770, -254, 1080, 1723, 2308, 1417, -445, -1482, -2119, -1950, -1003, 965, 1967, 2035, 1415, 110, -1338, -2132, -1755, -1050, 432, 1904, 2271, 1422, 308, -1093, -2120, -2196, -877, 302, 1565, 2247, 1851, 491, -858, -1845, -2152, -1493, 208, 1431]
3401A431O24q7j150j578j008j53M36J218J461J011l39q38j547r94n23N67J008
3418d61J432J086n8q40j440j091o27L24J063J329J064J98n66j468j296p45L52
3435a744R21J271J300J78o04j057j402q08J36R72J223J041N92m23j218j285r38
3452a845R5O97J527R04N40r6j125j297j325m5P31J247J144P30k20q91j283j038
3470a550k60M88J116J174R01Mr55j276r47n93L67J145J250Q30K11p10j344j127
3488a276m55J01R12J250J141J5m11j008j480n66L17Q37R81J202M99o74j027j050
3506f92j027q9Q87J101J033O60k39j380r78p21k19N55J347Q85P17j30j038j300
3524f28r71l8M29J130J162P99l61q02j081j201j71N53R09J153Q18O1r90p89j040
$$ y = [1431, 2055, 1968, 818, -760, -1768, -1921, -1485, -267, 1194, 2205, 1866, 1028, -519, -1513, -2036, -1469, -461, 971, 2057, 1999, 1159, -281, -1372, -1999, -1675, -612, 717, 1781, 1979, 1413, -55, -1351, -2096, -1744, -823, 448, 1748, 1926, 1322, 265, -1137, -1945, -1809, -837, 386, 1427, 2019, 1596, 378, -907, -1845, -1750, -1053, 474, 1378, 1918, 1822, 697, -600, -1925, -1970, -1239, 8, 1152, 1882, 1662, 771, -512, -1550, -1810, -1322, -206, 968, 1869, 1873, 918, -358, -1305, -1898, -1531, -386, 864, 1694, 1905, 1195, -149, -1276, -1731, -1630, -718, 532, 1673, 1688, 1277, 269, -1211, -1777, -1460, -623, 358, 1560, 2059, 1385, 358, -692, -1719, -1808, -921, 180, 1213, 1873, 1634, 254, -724, -1445, -1664, -1109, 238, 1123, 1840, 1710, 672, -628, -1599, -1637, -1208, -78, 1084, 1883, 1522, 720, -361, -1562, -1733, -1180, -271, 882, 1700, 1761, 771, -18, -1058]
3543a058q35L15J088J112Q12L63o65j486p98m50pJ003J257Q53rk61j017j537l14
3562a634K10O84R32J286K64n76o94j038j203O7R22Q21R56P59k18j276r91n29m09
3581a667N12J440P01N02J37r02j275q31LK71P63J305N29k28m64r18j264q8M04
3600a070O75R84R56m1o75r87q35o76L10R51Q76O95O21p12j044r39l82j77P19J294
3620E43O66K68j56j069j098n43O4M92J126Q64M64m17o45j195o60j51O01P90R43
3639H87Q41l80q20j000n48o00N44J066P34P54j00p45j132o82l51L89J005P83N95
3658A240J92p30q70q12k98K63O27R33Q21J69p81o99j004m58J39P67R91Q03K18
3677A511m48p95j204l89p2P96R93P42J95j33p91j089n15k12O30Q48R28L80k22
$$ y = [-1058, -1893, -1578, -490, 622, 1434, 1797, 1132, -354, -1152, -1602, -1609, -606, 651, 1504, 1495, 1234, 217, -1320, -1634, -1424, -740, 192, 1478, 1742, 1166, 472, -566, -1769, -1702, -780, 41, 997, 1756, 1538, 262, -729, -1258, -1667, -1155, 285, 986, 1488, 1625, 723, -552, -1383, -1380, -1109, -346, 959, 1488, 1260, 796, -122, -1386, -1474, -1070, -395, 589, 1545, 1504, 829, -158, -993, -1669, -1359, -408, 468, 1163, 1784, 1072, 28, -911, -1293, -1470, -751, 543, 1209, 1477, 1321, 252, -846, -1389, -1325, -833, 293, 1157, 1621, 1204, 559, -636, -1296, -1447, -846, -56, 887, 1728, 1348, 528, -472, -1020, -1620, -1076, -10, 724, 1478, 1378, 633, -499, -1181, -1532, -1143, -138, 645, 1240, 1432, 702, -168, -980, -1278, -1015, -388, 545, 1366, 1535, 754, 55, -949, -1407, -1268, -501, 490, 1293, 1511, 1063, 268, -936, -1325, -1397, -601, 392, 1134, 1329, 1196, 405, -684, -1199, -1411, -781, 67, 995, 1375, 1153]
3696A153q10r68n53r1M64P69R68L98j45n70j078o79r4K74O88J125M84j10m55q04
3716c4j084j97J81P65J015O15L8o56o49r59m80L18O22R84O14K64n00j002p08l79
3736a232j06R26Q89M50L50j31q52j062m94J21M06J035Q61J80n09k73j148o49o5
3755a303N91O94Q20M34j56p02p17o07n28P30Q80P20K46K95r02q39o98j05P8Q83
3775a86Q64M62Lm40p48r97j14J75M81R14O77K07p08l83r58n59L80M76O77P48M47
3796A418n10r76m13o57j73O79J049L12N02r5q67j002k78jK92R03P32J83k38m07
3816D53q13o88j58M80O08Q88M90l29o19m66q77k75L67J010M56N46Jm94q49m71
3836g40l68j2Q65Q68M24Ln3j091o98k03l2O84R12N61j8m56m42j028l59Q5P10N09
$$ y = [1153, 343, -625, -1178, -1269, -805, -36, 932, 1330, 1185, 615, -463, -1142, -1236, -962, -274, 851, 1335, 1225, 770, -34, -1118, -1315, -1134, -369, 646, 1261, 1299, 643, -6, -965, -1445, -1127, -505, 479, 1093, 1357, 857, -145, -853, -1232, -1338, -412, 477, 927, 1277, 1146, 294, -768, -1262, -1141, -735, 300, 1161, 1341, 832, 559, -589, -1238, -1303, -712, -18, 802, 1236, 1080, 378, -339, -946, -1474, -744, 136, 856, 1102, 1397, 495, -344, -1042, -1147, -1069, -186, 678, 1140, 1143, 703, -45, -1042, -1156, -981, -500, 414, 1091, 1298, 590, 207, -751, -1310, -930, -454, 223, 971, 1418, 908, -68, -481, -1138, -1311, -632, 417, 729, 1231, 1136, 269, -733, -1011, -1012, -720, 183, 915, 1098, 860, 453, -360, -1048, -1206, -726, -118, 770, 1260, 931, 312, -154, -1031, -1306, -939, 71, 527, 1073, 1074, 580, -269, -740, -1108, -1120, -255, 613, 1037, 1040, 987, -104, -802, -1005, -1037, -353, 559, 1120, 1102, 646, 204, -824, -1183, -1098, -388, 121]
3858A21O49M96m44p78p00m57m8O51Q56N67Q0j89o79p41k81j39J58R38Q50M8J14
3879A072n69q23q32JM18O10P90L78j24n49m71o62m53M52P01N64O21O0n79p68o06
3900g69j83nN71R02L57J18k73p97p37j72p1M92Q83O34Rk48p96n14n41K98M06N74
3922A38P03K02j88p43n88m88k4M51N31N78N19j51o80o43m95j96M81N51O97K47
3942I02l6m85o80n05k02K39P61M91M64N6n32o87n83j71K04L95Q41L90J97n76m89
3963fo28k83J32K37R61L98K66m87o09o50m90L59M03O23O08J29k60o17o34k70j07
3984i25L45O91N47M00j05p82n84l66k34K84Q74O68M7r2k58q37l74j75L14K71P74
4005D83M13o2l87o42m06m68L16O59N45L61K57m79p35o15p0K3O42N42N05L4l45
$$ y = [121, 770, 1266, 822, 44, -656, -1113, -1161, -510, 346, 913, 993, 804, 125, -616, -897, -1036, -878, 60, 910, 958, 1072, 503, -320, -1152, -1151, -733, -123, 667, 1045, 921, 372, -99, -761, -1214, -762, -61, 503, 1124, 1184, 605, -163, -769, -952, -957, -386, 516, 873, 991, 718, -79, -816, -988, -1059, -567, 316, 950, 959, 711, -85, -599, -1140, -842, -436, 138, 841, 1043, 855, 112, -476, -964, -988, -537, -6, 572, 1091, 940, 260, -383, -878, -1074, -593, -42, 655, 902, 866, 381, -299, -804, -1006, -767, -6, 485, 949, 1005, 473, -214, -797, -968, -764, -369, 472, 862, 1059, 483, -6, -634, -917, -785, -548, 413, 811, 1077, 590, -19, -669, -1159, -800, -397, 226, 834, 963, 703, 86, -548, -818, -925, -580, 111, 658, 1058, 953, 171, -413, -779, -1013, -729, 145, 813, 860, 768, 510, -327, -701, -876, -562, -291, 483, 896, 834, 447, -195, -601, -1069, -753, -94, 451, 812, 1069, 590, -145, -760, -830, -807, -165, 377, 882, 916, 571]
4026E71n52n62k39j66O01N47N32P7j43n32m88n24p1N40N34O13O7l01k74m28n77
4047g75j12J75R39M65J27K6p34o00o8l10J13Q94M28K26k8l23q16m47P1J28M09
4068b12P77K51j20l26l36n76m34K94M73L59P34J07m69n21n11k93n8O55N82J53
4088E29J50Lo55m48j91k63M45M91N61O6j05k44p63k74r8J18N82O59K62j09m62
4109B54m58m77m3J03O07M12N36j71n29l79m27l25K97M61O64J86l6k32o56m64l3
4130g10J71L32O49L43j15j39n19o04o7J40K80M12N99P8m49m99k18p14K94L88M94
4151A46M85J57j14o16l26l84k33L39O50M97l4N4l74o29k92m0L14M21N07R5j0m27
4173A86l13n97j08L39M57K87N31j80k82n67m79j22L09M96M33M14m16J58m83o01
$$ y = [571, 19, -543, -782, -948, -347, 200, 732, 809, 666, 134, -354, -878, -949, -409, 125, 738, 805, 504, 230, -198, -775, -887, -712, 227, 692, 819, 845, 111, -489, -557, -867, -754, 140, 568, 794, 766, 443, -373, -820, -749, -621, -212, 565, 816, 696, 370, 34, -542, -976, -682, -209, 150, 884, 991, 522, 1, -510, -803, -861, -206, 376, 529, 679, 682, 27, -421, -612, -875, -430, 61, 622, 688, 583, 339, -424, -698, -796, -678, -96, 563, 825, 716, 254, -204, -681, -724, -621, -14, 398, 934, 763, 234, -145, -572, -897, -600, -139, 525, 711, 675, 443, -213, -677, -710, -539, -207, 442, 785, 670, 531, 12, -592, -659, -519, -239, 173, 772, 850, 401, -98, -316, -1030, -736, -348, 146, 631, 788, 674, 58, -268, -652, -885, -546, 104, 601, 567, 621, 247, -382, -674, -714, -400, 21, 528, 623, 613, 186, -127, -724, -832, -493, -36, 251, 782, 602, 320, -247, -726, -848, -539, -43, 390, 804, 388, 546, 63, -538]
4193e38k20J90L86N31J87J88k24l96o86j10j0M40L96N11J33k84l74n01k79K06
4213d54J26M68M51LM7n25k83p18J90K90N85L14K06n2m66k62o75n6N09L56K52K62
4235E68J82m67n05k46l66L49L90L34K25J80k26o19j91k10q0K22P21K08Q9q5l04
4256A69n23l51K67K54K62N14O1l67k80l04l75J58K93L14K98L23k3n06m51l58j96
4277h21L87N79M81n2r3k85m63k30M7KM27L83M35m37r0l37n66K4K08K23N95K57
4299F74j23l08l57k31l29K84L00K96M32N2j73o47k35j30lJ2P86K11l9o7k15o12
4321d22j82J09K91K91O27q4l58k84j49l75k26M40M23L69J53r7m17m62k34l9J89
4342d37M89K70L79k63r6n59l04J10j64O85L78q3N4l42k59l00j39J32L76L44L61
$$ y = [-538, -758, -568, -182, 349, 536, 724, 500, 104, -582, -692, -702, -262, 134, 645, 778, 494, 120, -381, -660, -454, -328, 140, 591, 594, 641, 116, -167, -885, -695, -405, 180, 494, 700, 648, 182, -80, -755, -811, -302, 54, 306, 568, 750, 283, -222, -468, -834, -485, -95, 239, 464, 644, 418, -201, -392, -602, -682, -460, 261, 469, 558, 473, 169, -354, -705, -438, -184, 78, 592, 653, 286, 6, -298, -673, -515, -222, 92, 390, 713, 690, 184, -267, -625, -821, -434, 145, 626, 574, 481, 196, -267, -497, -450, -448, -21, 362, 797, 360, 270, -67, -633, -609, -401, -178, 417, 674, 551, 243, -114, -345, -674, -390, -90, 206, 638, 690, 517, -130, -365, -495, -498, -486, 300, 511, 472, 405, 190, -422, -604, -495, -204, 87, 714, 630, 272, -12, -161, -536, -762, -322, 101, 470, 623, 526, 109, -353, -587, -626, -437, 52, 322, 701, 438, 342, -217, -521, -411, -575, 110, 488, 405, 459, 117, -142, -442, -581, -449, -73, 271, 632]
4363F32l8m01o4l76m08L06K84J90L33J23l7n38l91kj54L29L45L33n7M9l37n31
4385d10Qj49K11L77N82p1o0m87k23l48K1M32J10K42K35k6l71n1m71r3P6M27L73
4408C34J56j01k46l15l00P8l4J97M77J89R6j97l83l87k0K45K45J28L52j1k19l18
4430c4k49l10J03M53K23R9J53Lk63n38j47N7L29J13L78M0j06m06l21J0j5J85L24
4453H1L28J24N0m65l48l10J05J42J88N64J1k08M1n18k15j40L88L26K18L1J05k96
4475B02k23l18j14J49K34L19J94J33m13l16j60mj81M63P2K91R9j51l72j07n8j2
4497b73O6J49L64mp0l01j53k34Q6R0J47N13J02L2l06l63j91kK74J87K73J14k26
4520B74m8k86l23N5J31J89Q9L70l8k00k28l68J8J45J44M08l5j08k2k14m54R8O2
$$ y = [632, 594, 193, 129, -247, -655, -349, -65, 125, 458, 581, 544, 6, -385, -387, -541, -212, 133, 466, 409, 458, 121, -410, -402, -551, -340, 37, 619, 548, 488, 1, -222, -570, -549, -117, -7, 235, 470, 444, 73, 22, -449, -542, -466, -39, 334, 490, 389, 143, -172, -472, -394, -428, -231, 246, 435, 531, 334, -49, -436, -456, -211, 34, 162, 514, 503, 284, -34, -283, -593, -490, -37, 186, 285, 438, 441, 178, -360, -507, -450, -121, -8, 370, 410, 304, -102, -423, -413, -428, -243, 81, 409, 533, 583, 118, -230, -540, -435, -293, -105, 459, 470, 262, 303, -215, -430, -570, -182, 144, 362, 393, 498, 202, -21, -339, -453, -304, -70, 249, 443, 576, 163, -153, -313, -317, -498, -35, 37, 328, 427, 276, -96, -203, -261, -273, -207, -58, 306, 302, 232, -69, -222, -456, -370, -280, -133, 380, 482, 514, 208, -155, -346, -348, -74, 113, 386, 500, 274, 226, -60, -383, -328, -197, -8, 81, 451, 413, 213, -15, -383, -365, -220, -76, 332, 297, 189, 167, -47, -501, -403, -341]
4543c41K64L30N4P6n3r0l05k64P7K85o4K40K07k82o9l13q1N9J45K02K84L8l7k24
4567A38m17R8j03j6K37L49K6o6J1n04J3j53J03K54J59J92j08P0l59o6k56J92J33
4590g3K72J65Q0k55l90R5l16J03K35L59M8lj26j22k16j42n3O1M78K41l7j43k2
4613B39o79N5R6J59J27L55n5J1l64q3j81p5K95J09K27J72k17q8j63k70l2k8K81
4636a09M07M6k9j68m10j39J10J3K60K13J07l9j68j26k26j57K15J30J05L57P2l49
4658A15k80j61J7j38M01J64J41M2j34j47j51p3r9J48J72L44R8k37k32j04j76J04
4680a86Q6K46R5J07j75j09l19m0p9O8K85J44J89j5k20j51k88M1J18L82J17r5J07
4703C08K2l47j90j71K69L69j08J96o0j58j77j57j05K50N2J85L2K8p2k62j8k11
$$ y = [-341, -77, 253, 307, 383, 330, 240, -65, -329, -252, 33, -31, 209, 416, 134, 65, -248, -329, -270, -125, 77, 361, 399, 362, 138, -279, -181, -284, -300, -63, 286, 312, 246, 257, -247, -234, -387, -284, -30, 129, 321, 213, 283, -76, -142, -398, -206, -73, 199, 364, 444, 189, -201, -106, -422, -319, -84, 275, 323, 320, 194, 72, -144, -286, -339, -278, 200, 441, 404, 261, 239, -440, -385, -289, -130, -3, 352, 297, 308, -56, -139, -320, -395, -100, 9, 236, 408, 191, 103, -60, -330, -362, -390, -109, 298, 344, 315, 147, -263, -402, -292, -279, -19, 194, 301, 262, 94, -32, -258, -415, -200, -70, 35, 392, 464, 115, -165, -326, -309, -447, -46, 118, 259, 301, 167, 20, -131, -204, -303, -155, 17, 361, 459, 222, -10, -114, -290, -186, -100, 146, 241, 348, 173, 64, -255, -295, -374, -306, -21, 123, 312, 297, 77, -74, -362, -321, -203, 179, 296, 201, 308, 330, -17, -207, -378, -109, 260, 152, 348, 288, 130, -47, -204, -309, -59, -7, 178, 210, 238, 166, -96, -114, -325]
4725c25k3K66J85P9P9j16n2m14J02N4k5K20J63J54j47j00o9j80J8N6K25j07K37
4748B80k8j90n0j97j59K03OM84rk01j10k87n3m0J94J09M9L11p3j74N1l02j32P4
4772b44L42K4J67j09O4m08Q5k54r3M01K36n1M1k19J18k23k8p4J03J89K30o5P7
4795C09l46j03j34MJ75Q5J93J47l03K25j95l57r6K53J14L16N5o8j82j47j70o6
4817b91J44J41J83J9Rk00M2m29Q9J87J64K5J88j77r4O0k76m2J86Rk2L64m9j69
4841F1j5k23k5R1P2J97K6oL0k84j37M8P4M2L4K48m4j13k4j39r3J00J01J27mJ20
4867B64j67l64K71k51QJ58M6K52J35l24M9k03j01R8n8J65K82j8L2j68j52k93J07
4890b32J9J44R3J51k3j83Op5o9L2nK94J00j70j7j02j36r9R4QK53j05K30P9l51
$$ y = [-325, -348, -82, 103, 182, 261, 145, 93, -321, -219, -165, -190, 30, 193, 347, 200, 100, 31, -149, -131, -75, 150, 43, 280, 252, 62, 12, -185, -344, -141, -135, 349, 340, 139, 29, -258, -311, -351, -157, -48, 1, 312, 239, 65, 116, -186, -318, -244, 98, 122, 289, 180, 244, -164, -79, -333, -426, -25, 211, 160, 201, -18, 100, -123, -151, -225, -122, 67, 297, 232, 309, -37, -140, -274, -270, -95, -10, 183, 330, 27, 252, 57, -300, -396, -143, -29, 287, 342, 274, 92, -55, -225, -291, -147, -6, 177, 196, 205, 5, 47, -382, -293, -106, 58, 83, 271, 94, 0, 60, -216, -258, -72, -63, -85, 279, 230, 61, 46, -177, -202, -111, -39, 158, 184, 178, 208, -76, -213, -165, -91, -49, -15, 233, 189, 76, 52, -87, -180, -80, 21, 148, 144, 264, 97, -267, 4, -247, -239, -81, -35, 217, 352, 28, 77, -126, -227, -129, -187, -22, 260, 242, 274, 106, -46, -339, -232, -213, -69, 24, 175, 152, -31, -25, -100, -169, -137, -142, 152, 252, 82, 65, -37, -173, -272, -178, -170, 83, -22, 208, 287, -64]
4915f4K9r1j12J43K03l2J98kj97k10j10J07l0K94P1P0k82Q2j60j02o4K16M8J57
4939A62J23n3j15q9k47j4J22M3J22l5J15k41Nm5J9k6R8J05K33j78j71J5k6p9J25
4964c2k0J85j17J42j06j96P6j49K1MK45J4P6Nj77j19J29m1j9j5J34Q9o9N2j07
4989Ek09J9J11J27J36l9k1k0k11J42j98nL58L6n8j05Nk05q0J23J50j18P5N4J73
5014B45k31l2l01J71p0J63R2K6j0n8j07M7p1o6K40J74o9Rj17kj08m5jMK62o7p3
5041EO0p0j94N0J8J38n9J24j4j31J76l61K0J71L8Ql1K27J1k65j54R0N7l5K72k69
5067a18N1J13j11J02j26J47k85J37R5K06l41K04l15J73o2R4J07Q2k0j09J26j89
5089c9J7l38K35J87Q3j56K58j17k39Q2o8J13l2Q4r5K79j44j01k98K11m3m0QL19
$$ y = [-64, -35, -126, -238, -95, 108, 76, 274, 272, 75, -135, -245, -138, -168, 126, 197, 267, -15, 67, -93, -195, -259, -43, 5, 162, 285, 232, 117, 28, -219, -233, -111, -68, 54, 19, 134, -107, -102, -147, -128, -154, -56, 49, 282, 104, -67, -52, -78, -157, -32, -52, 133, 16, 158, 52, -144, -68, -217, -196, -192, 53, 67, 143, 148, -29, -148, -19, -60, -79, -94, 40, 129, 60, 112, 5, -204, -185, -74, 53, 189, 150, 129, 109, -102, 40, -158, -163, 195, 231, 173, 68, 73, -132, -212, -89, 61, -57, 18, 72, 245, 14, -18, -319, -148, -218, -55, 37, 63, 53, -5, -112, -65, -136, -202, 38, 212, 143, 152, 35, 33, -75, -120, -121, -117, 145, 78, 5, 65, -5, -199, -149, -131, 7, -52, 72, 58, -73, 103, -258, -238, -67, -29, -21, -52, 175, 186, -79, -233, -143, -86, -121, 151, -118, -67, 46, -65, 37, -89, 58, -227, -90, 5, 211, -130, 74, -241, -68, -130, -36, 71, 153, 133, 24, 150, -39, -22, -360, -125, 62, 145, -11, 247, 130, -109, -27, -95, 18, -14, 70, -25, 254, 110, 9, -289, -78, -121, -161, -153, 166]
5113A66qq0J64k10j37l7J21R2O6jP4k87P8m8j05Q8M0K3J35j2K5r3k45KK5J0L23
5140A69q6j29M7q6rj1J51j2K9Q2k7k09k3lJ37j20JJ16J19J70k76m3n4pM8j86J79
5167c3J63mp5o6j18Q7j03J73j1Q9m4JP0r8j26l7O6O0K82j39J5j84L0p5r2J85j1
5194El9K51j49k55J3J80l7J34j68J86OJ16j74J30l27o0J03J05OO5J18r4k9j56
5218g0k6j88K06O6J69k30K24J8j47k50J26J03OJ20n7O5q9q0r5J61n3o5J78j16
5242b4J81p6k13N0m3J42M2p7J58l5r3Q5j60k2M6m5R0L39l89J97p5l04J00J08l4
5267e2J83n3K5j04J03p9q1l2Q9J7R4k35J68p1K4mm6P9p2j9q3K52n0k33O1J59q8
5294d8O8J21l8q9J35k40o8O9K04k28Q7K05J1j57j37M5j17L51k16R8m1K2k0r7q1
$$ y = [166, 158, 78, 242, 32, -105, -142, -21, 71, 137, 136, 210, -77, 1, -47, -152, -64, -24, -1, 134, 122, 147, 54, -191, -189, -164, -154, 169, 83, -46, 1, -85, -94, -105, 46, 34, 63, 145, 118, -91, -114, -117, 20, -100, -99, 17, 136, 306, 30, -13, -67, -74, -26, -212, -33, 130, 126, 51, -15, -133, -46, -149, 24, 13, 102, 58, 59, 129, 31, -95, -132, -66, -6, 276, 137, 152, -32, -2, -77, -169, 16, 5, -34, 217, 68, -187, -174, 6, -31, 103, -65, 121, 127, 243, 69, 199, -128, -188, -85, 20, 26, 91, 209, 115, 86, -70, -96, -284, -78, -12, 157, -73, 151, 169, 22, -228, -102, 1, 7, 127, 70, 135, 46, -34, -129, 32, -21, -86, 92, -24, 157, 81, -132, -82, -125, 17, 59, -18, 140, 105, 12, 97, -63, -85, -39, -84, 6, 345, -44, 153, 78, -226, -126, -18, -52, 131, 78, 103, -1, 102, 23, -58, -90, -1, 16, 110, -125, 43, -28, -4, -8, -54, 25, -47, -66, -149, 103, 53, -180, -119, 40, -48, 20, 141, 103, 14, 149, -91, -159, -90, 114, -114, -27, 178, 189, 32, -105, -60, -177, 174, -42, 56, 15, 37, 17, -80, -161]
5319a61N7p1K12%K9kl5J3j49mR2J14o1K26k01j25Q7k29L3J26J17L9j67J87j91
5344f4j6Q9k4o8QK9K12r7Mj19Q2O1j97J03J48j06n2%Lj65J13K30j54n1r0K17m7
5371D9j15n8K5m4K9K06o1O2j95K33n4k40J02J66K6k6J2J10k44Qj87K64j48R1l8
5396b7K43j29k07O6j73J38J02o0Q3j8q1l8M3Kj18%L36r1j13K4j56J72L3j34Q0
5421b3MR9M2j41J55r0r9J05n0K4Q3m8J9j26o6M6K11j64ol5K07Q9r8m4j00k17K13
5448a0p6O7J47j46J48p7j83L6J02n6q9K09O0l7K2k12K0K23k34J72J11j04j11p6
5472i4m1K6j1k0J07j3K20j66J42l04J06j81J82J14j66J55j3Q4j42r9nL34k71O9
5496A3Q0l6k3j30O7o9o0K04n5K2J01j13l8j39J41lQ1pJ07r1k1N7k7j3j43J56p3
$$ y = [-161, -104, -175, 37, 37, 66, 64, 29, 42, -107, -111, -19, 95, 34, 260, 59, -66, 21, -208, -175, -49, 68, 107, -60, 127, -64, -80, 9, -15, -83, -75, -46, 166, 69, 73, -46, 36, 97, -100, 3, 151, 45, -7, -7, -4, -169, -56, 174, 20, -31, -121, 96, 49, -66, -124, -99, -143, -114, 92, 31, 93, -102, 131, 77, -163, -61, 105, 131, 105, 117, 227, -17, -9, -196, 68, -80, 11, -27, 216, 87, -120, -54, -227, -89, 13, -47, 36, 18, -63, -101, -58, -56, -174, -174, 162, 71, -42, -18, -174, -2, 31, -103, -23, -19, 80, 122, -19, 136, 46, -53, 52, 2, 26, 109, 61, 80, -46, -112, -66, 145, -19, -25, -60, 147, 236, 138, 94, -6, -223, -10, -86, -19, 128, -18, 130, 53, -130, -94, 8, -48, -137, 72, 132, 95, 117, -95, -75, 148, -86, 86, 197, 93, -18, -94, -135, -109, -120, -140, -33, -46, 174, 8, 150, -154, -48, -229, -47, 67, -99, 56, 43, 127, -15, -114, -119, 215, -56, 13, 93, 57, 34, -96, -29, -98, -158, 46, -9, 13, 114, 1, -37, -176, -35, -38, 43, 36, 143, 52, 31, 88, 61, 48, -95, 61, -12]
5523a2J29l6j11K0M1n8j12P0J25J3j11J64j05j58J20LK9k7k3p2K35k14J13j25
5547a02p8J16M1M4L2K1r0L6j12l7L5o4J78pK05j14j61q0n4K3mM5K02j7j12J14
5573F0j44J7r6K68q9M8L6j77K26L5j89j2l6L7J1J38j23k3j41J49p4mlR9n6r6J00
5600c9N5r8NQ6L5k1n7j42K08k21J08p7J22L1k3J87q3O5r5j10j59J98M5J5J20L9
5626A94j71n1L9p1j4K04l9q7m4k9J09q2m9m5K85jk3L2l6n5j62l2J19p9J1Q5O8
5653G6M9o7R2j44k54J92p0K54j44l8J76j40n4j4J44j14j4N2m8J37Lj33N5o3Q5
5678A8O0K6P4j38p7k3K42k18O4j26L1O1J8R9k40K22j45J33j89K70p9p3m1p4P3
5703c2m8R6J32j25J51j89J11Nk09J22j09J32RJ53j01P0k76M2P9j23K41j07o9l6
$$ y = [-12, 117, 81, -30, -10, 31, -27, -139, -69, 56, 69, -42, 122, 17, -141, -21, -18, 11, -16, -39, -111, 124, -90, 23, -102, -180, -64, -23, 21, 53, 74, -16, 20, -92, -129, -94, -158, 20, 13, 218, 104, -57, -137, -191, -168, -172, -127, 75, 58, -54, 60, -84, -67, -163, 105, 16, 64, 100, -77, 149, 184, -5, -17, -53, -16, -5, 133, 10, -13, -154, -5, -79, -83, -86, 13, -43, -139, -39, 16, -82, -77, 9, 44, 23, -34, -176, 32, -189, -81, -158, -36, -5, -28, 159, 76, 141, 46, -64, -223, -25, 20, 35, 155, 194, 23, -28, 11, -60, -74, 130, 91, 4, -40, -69, 40, -42, -91, -136, 149, 148, 125, 157, 121, 66, -96, -128, -9, -88, -77, 8, 76, 125, 58, 150, 6, -248, -56, -126, 128, -16, -54, 122, -18, -72, -86, 58, -56, -70, -18, -66, 71, 74, -59, -4, -67, 18, 78, 104, 178, 40, -37, -60, 182, -36, 28, -98, -67, -6, 12, 111, -129, 93, -52, 81, -108, 162, 83, 10, -31, -105, -32, -80, 16, 148, 23, 174, -15, 96, 101, -108, 14, -95, 37, 46, 199, 98, 168, -108, -66, 13, -110, 131, 24, -45, -81]
5727h1J2oL0K1O2l5P9Q9q7k00M2K10k38J56N6j39L5J14n8o1O0%j94o1J09Q7J39
5754A41j39J00j39J03l6r0J7J02j9J13j85j3K5N5l3r2K50j68N6j19J15Lj10o5
5778a28J20P9j6J2N8m9m6k5M3j42K28j44N7p7R9k27rJ25J84l1p5j30L0J72j02
5803Fm0j93J62J59%km7j89M0RJ44O1j70Q9K6l1Q5k42P4j1PL1J2J17rp5Rk32L81
5832A71k20J48K6j42M8j50J13k09R5K07NJ4p4M8k68K13J04j02J39q3O5Lj08J74
5856B17j49n2O4pk6R5j37k0rK57k50K0O1j93M42l69J31j89O5K1Q4J8l1n1Q9M1
5882A22j53m3J25o4k04J47K44j40O4o9r2L1p6RL3m7J28l6J25m4j53k3J79k6O6
5907A03n9rk7Qj19J23j9J24j92J1J55k09P7O2j75P7N1J12m7J1j08J5J29o7j57
$$ y = [-81, -69, -75, -45, -24, 38, 3, 82, 171, 84, -116, -74, 136, -102, 54, 110, -29, 6, 120, 62, 1, 61, 61, -133, -194, -85, 2, 141, 2, 102, -37, 66, 30, -60, -43, 59, 40, 153, -32, -45, -20, 35, 2, -90, 160, -8, 48, -71, 44, 47, -63, -128, -8, 71, 55, 67, 125, 76, 30, 5, 48, -94, 134, -10, 47, -30, 69, -158, -167, -42, 142, 111, 36, -94, -64, 108, 6, -34, -227, -65, 94, 94, 92, 45, -144, -104, -95, 49, 110, -60, 29, 55, 24, 109, -133, -59, -70, -63, -32, -20, 97, 88, 13, 22, -210, 171, -49, 99, 125, -17, 31, -119, -6, -215, -120, 87, 92, 106, 32, 80, -188, 25, 129, 27, 166, 83, 148, 151, 43, 217, 68, 16, 80, 73, 47, 142, 5, -15, -24, 233, -17, 3, 64, -129, 313, -56, 75, -114, -49, -28, 56, 74, 43, -8, 81, 122, -31, -74, 51, -13, -217, -70, 174, 34, 98, 29, -63, -32, -108, -99, -66, -113, 15, -21, 104, 60, -93, -116, 63, 37, 103, 44, 35, 8, 16, -103, 20, 1, 125, -67, -56, 99, -110, -33, 29, -146, -69, -18, 94, 47, 58, -50, -35, 94, 27, -130]
5932a30Q3J2Q4J67l44Q5J56j43J7j1M6R7J19k08k9j08J12j92K9K1O1R2o4Oj36
5957a78K53j58J32r5P4O6Np7p2M6J1R8l0j49kK37j83r1J93j76J46L6o2o1J22q1
5983Dq9k4M3LN7J08o0k2KM5l2L0l2p2K2J20Ml4j41K5J21j9o8r4O6j5J42j1N9q5
6013E3j91J88j3K4L4j5m2n4j53K63l4n2L1m1Q3k16JN8J76j23M2L4q6Q8l6j51L03
6040A71k06l3J01L8oJ30j12j85Q1j09J53j27K02j67J64n0K4L0j02M0%j9m4M4l9
6065b1R3m0j56J86K5k81J72J23j12k10J90J41j03R0l5j35J34j4p5j1J9k7J7j40
6089a70J05K6l6N3O9o2j9J03m8J57j94J33O0j91N0k9j3nR1l1j01L5J56j28p6K07
6115A42j02l4O4k2m8J16p7l8j21J09n7P4Q4j95K32p7j39k1J56j99K56K8p9j69
$$ y = [-130, -47, -35, 49, 216, -128, -43, 113, -30, -13, -24, 22, 119, 238, 30, 1, -107, 5, -187, -158, -137, -76, 16, -48, -42, -178, 75, -83, 49, -46, 28, 94, 99, 22, -50, -4, 7, 105, 75, -74, -76, 161, -22, -113, 80, -96, 50, 86, 24, -37, 85, 4, -85, -109, -66, -63, -6, 102, 42, 20, 22, 67, 35, 65, 33, -39, -17, 103, 107, 73, -68, -43, 78, 59, -9, -103, -37, -52, 90, 79, 138, 53, -138, 50, 37, 61, 95, 80, 38, -16, -169, 94, 60, 8, 39, -2, 81, -135, -134, -76, 100, -23, 19, 53, -33, 55, 19, -132, 171, -35, -68, 33, 71, 65, 195, 83, -102, -21, -130, 23, -104, 98, -69, 95, 45, 69, 99, -3, 37, 37, 18, -26, 18, -21, 72, 32, -124, 62, 87, -194, -22, 101, -11, -221, -31, 110, 7, 97, 62, -73, 61, 47, -28, -39, -20, -47, -30, -170, -65, -39, -75, -22, 47, -15, -34, 69, 21, 178, -16, 117, 177, -14, 36, 7, -6, -11, 80, 49, -52, -17, 139, 11, -65, 142, 40, 6, 70, 48, 0, 116, 39, 1, -120, -11, -68, 6, 90, -105, 127, 50, -89, -110, 46, -153, 103, 131, 52, -117]
6139a17JK39j23m8o5K37n3m3j58K39j19j11R1O7j9l7pR3n1q4J02j54J25PJ22j11
6165B3n4M5j26J83r6p4j4J20JQ0J9r0j07k7J26j0J25J2ql3n2oJ0j02j92K25J09
6192H7N8k78Q2M4n3J65j34Q5n6P9M8j67nj42J35J03O1j40O6o7%q7O5J21n3j00
6218h3K7J53J9k71J81l3oK3M2j66J55Mq5J53k68J14J5J49j27j60J13P3n2J1r3
6243a12J22R0pq7K7j45j26J24O5J21m9j96M7J56m9K1j39J69kR4r6O8j12J2j66
6268a70J27P9j4J0j0J9r0J3N4Q3k04O1R5j08J60J62j32k16MM5k2J84j75j2K05
6293A48m3k24J25J83q7k91J33L6j3N3R0r1qm8j16J14O2m8J11J9j82J15K4p5J00
6318H7M2Pk7j34l0M0r7L8J46K3j19M3Nj36Q4M4l1Qo1jJ20o2m0R9o6j8K02j54j3
$$ y = [-117, -116, 123, 0, -48, -113, 124, 71, 28, -130, 109, -10, -121, -30, 37, 18, -19, -26, 67, 16, -68, 34, -120, 5, 12, 134, 23, -31, 14, -112, 71, -25, -99, -113, 7, 8, 88, 107, 17, -90, -117, 9, -1, 124, 136, 128, 95, 43, 37, 47, -55, -247, -22, 87, 145, -133, -51, -7, -60, 105, -29, 56, 0, 79, 127, -40, -45, -187, -52, 51, 112, -28, 38, -29, -29, -116, -51, 70, 17, -83, -56, 97, 116, -155, 26, -7, -13, 10, 52, -114, 41, 45, -40, 113, -155, -41, -26, 123, -4, -164, -51, 22, -30, -19, -112, 10, 100, 93, 6, 33, -112, -238, -114, -49, 72, 23, -173, -126, 30, -19, 2, -137, 32, 30, 124, 28, 96, -16, -4, -170, -43, 36, 22, 32, 22, 41, -49, -36, 18, 101, -103, -42, 53, -55, 105, 267, 135, -81, -77, -32, -54, 130, -45, -57, 148, 105, -119, 6, 189, 102, -189, -56, -20, -33, 20, 110, 19, 11, -37, -153, -39, 23, -25, 86, 105, -77, 38, 62, -13, 87, 129, 136, 109, -25, -55, -15, -112, -74, 72, 95, -24, 19, 24, -112, -28, 16, -15, -7, -68, -69, 51, -11, -51, 48, -18, -36, 166, 12, -1]
6347apO6j19J24j21nM8J37Jo4l0r7L9P8j64K6J55R0j39J21j67n7K9m7P3Q2jl0
6375B0k9j4J20p3p8J52%K3J5L0j63N6j23K79k89J65j21P6p0J04j44j13J86J79
6399A88j13j02Q5j46j1J66r6j14J30K43l22MJ90j33m7J29o3j0L4q5J76j8p0j8
6423cm7R3o8p8J87j3m0N2m2l6o2P7j16J89p2j53l8L6P6j01K20j04O4J28k96L2
6449a15K69k06r9J46r3J6L7J39j0N9j69j1N3P9P9j54R6p1m4m9J14j03K73j01j13
6474B2o2q3K20j84k2M3J36l0m5K45k49j18l8r2K29r2K35j66J1k7M8l8J68M6j25
6499C2p3J7j29P7L7k4k5J61k46J24J47Pj79J37l6j30K5J36LO1j09P4j07k4L7L9
6525C2m2M8M6L2j45J79m2k40R3O2l5j59J56J30n0K8J21k87M6O7J2l8J99n8j90
$$ y = [-1, -8, 58, -61, 63, -58, -63, -15, 122, 123, 59, 29, -68, -29, 49, -115, -89, 66, 156, 17, 138, -29, -86, -57, -104, -31, 51, 50, 20, -9, -23, 97, 24, -54, 98, 98, 121, 136, 166, 3, 59, -64, 215, -74, 91, -30, 46, -24, 80, -64, -177, 9, 188, 75, -27, 58, -88, -99, 67, -29, -143, -13, 230, -92, -88, 102, -31, -78, 51, -12, -22, 12, -73, 103, 85, 15, -3, -50, 43, -25, -103, 84, 71, 31, 83, 41, 5, -57, 20, -96, 93, 21, -132, -170, -134, -58, -159, 61, -43, 21, 149, -147, -115, 154, -52, -151, -5, -98, -82, -45, 94, 84, 143, -26, -37, 16, 95, 174, 20, 116, 45, 1, -48, 66, -37, 236, 135, 22, -40, -123, 97, -87, -109, -66, 70, 40, -5, 240, -9, -127, -165, -257, -28, -120, 115, -51, -40, -67, -19, -57, 111, 157, 32, -41, -24, -153, -76, -39, -63, -88, 73, -173, -49, 98, 105, -74, 63, 27, -103, -78, 58, 61, 122, 13, 87, -20, -44, -7, 32, -10, 38, 84, 116, -29, 150, 108, -132, -39, 23, -12, -171, -15, 115, 65, 93, 214, -73, -27, 40, 52, 14, 213, 155, -35]
6550c5J09l1j12J16p4n7K47j13j45J76j63R1j62P5K16n8J43k39p2K26j04K3oJ19
6574A70r9p6J16k35P0j5J00j6P0L2kk6k09J1J05R1j36N3J25n0J37l68OP1J25J
6600E1P0j18K68k88l8j18J02J07j72K18jP2j66R9k14r3K32o2Q6q6N8K8M6Q1k03
6625d1J8K6j25J15J72j61R0j64L0k1M8l8J06J36j44NL8j58J01j16r8J71L0Ll4
6650a1J0P9j74L8R7P4j06Q2r1k3j16J73k03K65l0j91K74j16l4J52j90rJ06k14
6674a58K49j46J13J9k5J67k41j59K40R6L2j82L6l8Kr6j91K84j30O2O2r9M8J37
6698H2j50M3m1P3P5O5j88M5k69K24lr4K43M5j23o4j45J65Mj02l4J70J3M3Q9k69
6724a03j1N0m1P0J2J61k34K34j10j61J98k66K15j33K08m3Q8j77P2O3j55K1m4J87
$$ y = [-35, 74, 43, -69, 47, -27, -84, 163, 50, -95, 81, -82, 9, -153, -78, 138, 80, 223, -16, -88, 138, 34, 57, 51, 170, 71, -5, 111, -124, -54, -69, 31, 15, 85, 117, 115, 89, -120, -109, -4, 87, -49, 4, 129, 79, 216, -152, -146, -75, 50, 51, 121, 3, 271, -17, -55, -173, -71, 36, -136, 82, 81, 153, -13, 86, -128, -221, 11, -51, 35, -51, 7, 35, 81, 162, -41, -23, 3, -122, -7, 165, 4, 94, -70, -40, -61, -13, -51, 55, 191, 47, 52, 90, -68, 33, -83, -181, -10, 20, 23, -11, -1, 78, -96, -58, 39, 113, 7, 89, -2, -25, -141, 32, -171, 94, 64, -127, 147, 31, -3, 149, -41, -50, 56, -158, 91, -55, 58, 77, 52, 219, -22, -181, 59, 155, 187, 5, 41, 3, 5, -91, -282, 2, -128, -66, -4, -103, -55, 82, -68, -25, -66, 7, 82, 147, -41, 4, -265, -41, -44, -138, 105, 150, 27, -37, -182, -17, -13, -115, -149, 21, 34, 77, 166, -103, -114, -64, -105, -35, -23, 138, -96, 138, 28, -133, 65, -201, 14, -119, 89, 46, 134, -43, 29, 92, -63, -42, -86, 101]
6748A01O9Nk42Q1j30J25J24p1K0j08J70r3j2k14J13O7j12J73o7M0l0n1R7q6k9
6773f0k6K04J6j53mo2q7J67j49Q5J24j32K33p4o5j61M0J10j21K27m1J4j65Q9m0
6798c1j8pJ57j45J12L1r6j04R5R4j0q2P5n6R2j68r0R0J39j90J48k2n1J44L1j64
6824b6K4pK2k2o3N3J04o5L1p7J2j02Q3j5n7J16J34j50j14J08L1l5J15P5k28J19
6850F6j83J86j45o9K80j17j46K12m4j63J05m9J44j01L8m3P7O3n7Q0n1j12rl4R7
6875B5k9J78j38r7O0n7K2R4oo5L5Ko0N4j80J35lq7M5J67j99K43r8o1k8K14k05
6902c9J98j42Q9j14M3l7o4k8P8R3N9K2j68L8j45L2Qm0K2j2K30j33O8j33o6J65
6928B4L7j98Q5O8M5j72L0P0p7N6l6J56p2N2k7j88p0R7n2J84n2l5R5J65k25O4p2
$$ y = [101, 170, 175, -67, 14, -116, 9, 133, 62, 82, -26, 144, 51, 39, -175, -62, 5, -107, 66, -1, 39, 9, -42, 55, -31, -60, -86, 118, 134, -19, -23, -85, -172, -5, -154, -69, 55, -77, 156, 82, 17, -144, -104, 6, -115, 112, 71, 85, -80, 9, -31, -49, -56, 101, -44, 68, 99, 3, -101, -6, 88, 78, -4, 71, 15, 107, -61, -151, -61, 78, -112, 36, 14, -37, 107, 138, -26, -2, -9, 13, -9, -72, -19, 85, 20, 51, -26, -14, -116, -33, -48, -105, 11, 145, -5, -119, -11, 20, -15, 100, 175, -53, 66, -117, 69, -76, -145, 135, 18, -128, 84, 40, -123, -18, -67, 77, -24, 14, -29, 48, 111, 54, 134, 83, -29, -38, -72, 25, -4, 174, 36, -61, -1, -58, -36, 58, 52, -13, 22, 24, -36, 18, -162, -27, -30, -117, -72, 95, -104, 139, 41, -20, -48, 166, -39, 159, 17, 106, -8, 35, -2, -66, -94, -16, 77, 136, 158, -10, 28, -117, -85, -77, -117, -95, -107, 123, -10, 58, -75, -141, 24, 61, -137, -52, 16, 61, -111, -81, -11, -88, -32, -68, 88, 16, 68, 41, -147, -217, -120, -172, 12, -40, -75, 20, 185, -40, 24, -48]
6955d8r8K10j06l2n8K18o5pp8NJK46k90R8K5q4M6n8QJ71l3j60J82k9j34J37k24
6982a57J44j54J92M7R0j56o0J2m2M5j43J71n8nQ6lj1M4k26L8J35P5K9J0j00J22
7008A25k45J61o6J23j46K52k54J03j23O3J5J5m9q2%j60L33pj00N9j26K26j88l4
7032a05J23J44k12l6J74j53M1Q8K6l3J7j21N4l5Ro0k9J86oJ46k01r8J17o6j27
7057a57N8K89n6q6j02l4L9n6MJ24L8m2J76r9n6L0j81J23l2K5q1K34r5k04J00j14
7083a55Q0K06j30R0p6Q6l9n9n0K3l9J2J20O8j53J31l77L17j30J13O7q0p5J8O6
7108C4k8j04QJ18r8K10k26J88r8m9L3N1K5j03J97Jj70o6O4N4k65K28r3J29l7J49
7134A52k14J44o7Lj27J31O5j19J44k32J60l7o2jj3R0P8K0K2j75J2k42J73l1O7
$$ y = [-48, -146, 64, -42, -74, -132, 86, 21, 14, -64, -59, -58, 188, -102, -4, 21, -63, -17, -75, -67, 104, 71, -89, 93, 64, -70, 67, -157, -13, -167, 25, 72, 162, 6, -54, -42, -84, -39, -182, -11, -69, -74, 12, 9, -2, 42, -184, -146, -11, 64, 93, 103, 3, 125, -120, 41, -25, 98, -48, 204, -50, 53, -70, -7, 8, 23, -26, -108, -108, -268, 65, 58, -42, 17, -109, 117, -71, -105, 18, 162, -50, -86, 88, -65, -24, 64, 90, 57, 74, -47, 7, -28, -19, -79, -108, 78, 72, 218, 17, -81, 36, -30, -157, -99, 190, 134, 48, -54, -88, -49, -105, -101, 23, 61, 19, 195, 96, 40, 70, -111, 12, -20, 5, -76, 158, 63, -141, -41, -155, -75, 131, 1, 91, 15, 101, 62, 3, -47, -24, -63, -51, 69, 137, -16, 115, -262, 55, -75, 38, 105, 25, -50, -32, 34, 6, -98, -90, 28, -70, 140, -86, 102, 4, -45, -12, 39, 64, -39, 158, 159, -11, -77, -13, 41, -224, 4, -89, 40, 3, 152, -62, 82, 15, 18, -109, 22, 87, -32, 112, -120, 40, 3, -59, -60, -73, 17, 95, 115, 137, -38, -26, -268, -95, -126, -59]
7159e9N7m8J58P7k68r8L6J81j61J36P2JJ24j90N0j66P8O5l1m7O8P6k54N8lQ3J2
7186GJ01p0o9O6r2M7o2j05K89k40N5J77J7j17r2J86r9r9J02j16J73o1j16p8K09
7211A3n2K3q7J70m7J64q8k99K01n6N3j44J05K00j29jj85R6q5L5J15l1J48L9j28
7236C0j02Lr9J86R6j76J90n6k84J23L7j00M4J53l5J3O3p5l6j01j4j06J92R3K9
7261F8p1Q8j2j19N7k07R8kL52r4j78p9R9m2k1N2j58J06qJ29j76J36k03J96o3J65
7287A13j42p1K22J7j57Oj93L48j57R8J33l37J28n9j3L3P5n5oR6O6j49Jkp3J0K64
7314A96lK7j88J11k5j71N5k86K88k9rP1LJ2k13J48L7k19L61j15l2O3r3J20o8o3
7340b2k3oN6k7N5l9J17j44M6r4J8K45j07o3K78k84q2j0N3k1J26q2R9k4p2L8p8
$$ y = [-59, -2, -50, 108, 185, -83, -181, -145, 36, -125, 11, 83, 84, 208, 18, 68, -98, -20, 45, 14, -33, 35, 111, -143, -85, -88, -5, 7, 108, 38, -31, 35, -57, -10, -72, -177, 112, -128, -73, 104, 121, 4, -88, 98, -1, -100, 2, -114, 59, -2, -118, -196, 13, -39, -16, -103, 67, 20, 184, 96, -203, -2, -58, -5, -149, -44, 156, 27, 26, -159, -63, -148, -113, 2, -29, 119, 158, 30, -72, -69, -168, 18, 114, -62, 128, 72, -212, -89, -52, -152, -108, 45, 10, 23, 86, 11, -25, -126, -140, -246, -54, 39, 68, -3, 85, 73, -46, 11, -196, -98, -100, 252, 158, -20, -99, 0, -42, -63, -11, -169, -63, -71, 58, -118, 18, -185, 11, -52, 113, -29, -100, 122, 139, -18, -12, -205, 143, -14, 84, 217, -120, 8, -51, -64, -31, 44, -11, -17, 79, 145, -4, -3, -5, -78, -68, 196, 193, 220, 32, 143, 118, -53, 2, -284, 4, -25, -34, 37, 40, 52, -161, -13, 24, -195, 166, 51, 19, 82, -11, 109, 41, -22, -45, -51, 5, -22, 33, -6, 111, -33, 13, -81, -63, 182, 75, 12, 290, 6, -76, -86, -33, -54, 72, -10, 89, 65, -7, 31, -47]
7367d7K9j18O6J52j0o7r3O3j40J19K2n1L0K97o7k62R3j85K38j80l0P9J53Pj09
7392a1Jn1j6P0J0N2J91j35j0o5k95L46j30J38j8o4O7j49m4%J44n9M7j78R0J34
7418F5jk2j77J82j05k8O1J97o4j18P9m6j46J55j99J24J10l1pj65R1O9j74J36j09
7443a23J73j8J5P3k19M7j7J08m9mj2J02J57l53L1R8RL1J43k54P6J29m2l4j05j0
7469d8O7P8J45j42j59N8k9j36K84k20QK18l2m1k5j65K6L9L8J53J03j06r3k14K10
7494A7n0K0J01j49NQ0r6J43k18J59j99J10l9R0L2j30J93q6Q1k8l4j02J54r4O9
7519B9P2k78R3J21j57K79k27J74K0k36k0N7J35n8Pj37J89j20MJ04l05J34P6N2
7543Hj9J83k47J82k27J28k55L28l0N0j9Km1j10L4j40N5J58q6P8K1k98J25J44Q
$$ y = [-47, -18, -136, -70, 82, 72, 5, -88, -25, -165, -46, -24, -75, -45, 252, 185, -77, 16, -169, 69, -111, -141, -62, 91, 98, -11, -10, -61, -77, -7, 3, 55, 246, 111, 101, 36, -259, 87, -43, 95, 77, 13, 80, -69, -113, -113, 31, -28, 19, -159, -69, 65, 64, 42, -135, 47, -58, -86, -25, 172, 108, -10, 69, 23, -123, 32, -167, -43, 67, 36, 29, -136, -45, 24, -150, -14, -123, 50, 32, 47, 120, -99, -52, -69, 39, -10, -14, -26, 76, 233, -120, -89, 9, 18, 49, 192, -62, 14, 143, 101, 67, -38, -48, 19, 97, 242, 100, -59, -1, -30, -166, 118, -102, -94, 124, 92, 51, 26, -139, -113, -74, -36, 117, 220, 114, 21, -193, 17, -33, -13, 88, -61, -56, 24, -72, 71, -147, 12, -187, -77, -116, -26, 6, -124, 69, -17, 64, 36, 2, -100, 54, -40, 29, 101, -177, -84, 37, -120, 159, -68, 106, 126, -110, -130, -73, 62, 4, 11, -126, 63, -57, -53, 51, -254, -120, -44, 8, -11, 172, -75, 107, -120, 8, -247, 81, 51, 101, 82, 84, 43, -67, -33, -173, -118, 40, -46, 32, 53, -245, -120, 24, 32]
7568C2j02p1M2O4J84n8j36p6J13k3j18RJ04J05Nj18%O6J01q5n6O3O9L1j15Rj40
7595a01q5Q4N6J6M7j1j11j3K19n7p8L8J92q3j08M8j10N5o4R6m7M4J7j4j45N7J28
7622G0J2j88N2J60l7K4J83l82J15M6Nj5LL0J3n3Pk7o3r7J41kJ11p1J37j35J22
7649A61j0k11kl8P6J05r2O9j76K5K15j10j06J49K24m02L7K3M8k20J49P5P6q0R2
7674G7o7N1j35RL9l9n0J39N0Lj28J70l4o8p5N0J01l5N7o2K4o7j04j49K61N4J29
7701B01j32J2j67p1J05lP7K2N3J40k40j02J21k8O0P9j78m3K38j42N4j04k2j4M2
7726d2P4Q1j57Q4j16L4P5j48J39q4J40j80J67j13j1Rj16J28j4m0J10j76K32l3
7750D3j87K04J8k6p8J29r0J43J4k23pJ76j30N6J16q4J79k27j45j2J29O7j08J09
$$ y = [32, -70, -141, -99, -35, 149, 91, -45, -121, -8, -31, -149, -140, -36, 69, 74, -44, -44, 22, 123, 38, -18, 45, 114, 145, 30, 39, -101, -186, -102, -46, -30, 17, 6, -105, -118, 101, 44, -34, 4, 196, 113, 5, 53, -57, -2, -66, 30, -17, 27, 44, 30, -115, -58, 70, 82, -106, -54, 106, 69, 93, 276, -106, 9, 55, 60, 45, 48, 78, 91, 38, 45, 18, -45, -142, -1, -3, 108, 37, 174, 39, 161, 151, -60, -62, -100, -24, 81, -11, 58, -118, -93, 122, 12, -94, 55, 279, -123, -86, -63, -15, -235, -86, -11, 65, -15, 77, 10, 61, -74, -65, -26, -65, -115, 24, 74, 77, -51, 119, 85, 17, -58, -8, 93, 58, 115, 53, 77, 10, -94, -243, 18, 72, 201, 69, 81, -86, -157, -52, -55, 22, 44, 97, 237, -3, -105, 16, -12, 48, 127, -51, -94, 144, 2, 56, -48, -70, -84, -42, 32, 113, -44, 40, -76, -42, 33, -115, 24, -60, 80, -100, 67, -46, -57, -48, -164, -36, -50, -90, 20, -156, 76, 43, -144, 60, 78, 52, -26, 103, 13, 156, 170, -53, -60, 116, -14, 42, 158, 74, 253, 26, -119, -131, -2, 65, -43, 66]
7774F6L4j9j45j01J84K8N0p5q9K95r6j88K13l46K38q7jR5MP8l43K13j63J50QJ8
7800B1Q6mm7l3J04j09j13Q0j35K06M8j9k0p0m0J0m1J99p3j4J14j52l09L37j27
7825a01n8K15p0j04K69n2j34j16J6Qk2J41P2PNO4j59k02J56Q5J10q9J87j84p2
7850b8P3L2j49J03Jp3j1N6nj61J34r7R5Q3K4r4O6P8l59J53K05k63J33m3K24j22
7876E5J0k13N8j03L1Q8K31j86R4O4n4j51l5R0K9K03j51J3Q2j01M4k04N0J4O9n2
7902b5q1K04j08K5j0j57K61n2n2m3J90j72j84L8R7p6K56j67J93Q3p6k21J30j7
7926C6k25J10j8j1P3J30k05m1l0J13J26L7l5q8R0m9J7l8Oj7R1J53k13j25J35n1
7952b9q6P4j09K08l15L69q7J3O4k41K01k44J53J06l4P9j10K2j5k36L22j16N7j38
$$ y = [66, 100, 81, -64, -165, 19, 47, 97, 22, -67, 228, 132, -56, 157, -189, 49, -38, -39, 56, 60, 138, -205, 8, -155, -5, 3, 21, 107, 103, 56, 23, 127, 18, -95, -15, -150, 56, 104, 85, 65, -5, -45, -35, -76, 123, 50, 36, 150, -2, -311, 26, -101, -159, 56, -14, -118, 151, 99, -35, -151, -135, -127, -149, -8, 64, 71, 76, 140, -19, -221, -65, 20, 130, 41, 228, 44, -28, 45, 77, -72, 31, 32, -41, -52, 4, -1, -162, -28, -125, -30, 53, 77, -17, 49, 127, -232, -79, 126, -137, -4, -47, 177, 55, 65, -148, -90, -193, -162, -74, 157, -29, 65, 129, 75, -76, -111, -21, 8, 211, 60, 73, 155, 54, 98, -106, -56, -42, 27, -25, -106, 98, -10, 15, 5, -152, 109, 57, 5, -38, 152, -20, -204, -166, -69, -145, 111, -56, 137, 220, 144, -77, 53, 36, -189, -79, -97, -108, -35, 95, -110, -151, -181, -68, 58, 95, 60, -28, 62, 13, 30, -8, -2, -19, 72, 225, 12, -113, 22, -29, -115, -41, -150, 58, -257, 112, 25, 38, 102, -139, 62, -182, -29, 77, 43, 122, 12, 34, 19, -217, 105, -11, 46, -92]
7976i2J69k8k5l07K90Q5j25M3J9J01j30J04j61J23j30K1K5J13j79N0R9j37P9o4
8000e7M0J22n2m2l1n5J03L5r3p7Q1M4k3lPl8j12J22m9Oo2N8K23r1j95k0K00r0
8028d9J38J4m8Q4k31J14k6p7K3j20J96J69O2j39m7R8k51J53m8l4J26m8Rk09j09
8053b50J65J78j08J02l4j41J43j80J06r1J75k11J66J40Kj83m3J74j83o2L1K30
8075A26j18o5L5o5O6q9O0n5K38j15O5j08L05l62N3j5r1J69j01J48r4lK7l1Ol9
8101e3M8l5k6R7n5o0O7n5J10q9K0K01j12j9j1j44j6J57q3L52l63J89k15L0n5Q4
8127c6n5R7P0r4J6l7J20j24Q8q2P8m5Q9k6P6k12J26J3l00L01k4l6M3k6ok42K48
8154B0L4n5K2k0J40j14p1N9j17l8L04j39q0K0p7Q0jK8j06j9J64n9J06M0K5o9j70
$$ y = [-92, 77, 49, 24, -283, 7, 92, -33, 10, 29, 130, 0, 104, -57, 66, -64, -43, -18, 95, -84, -34, 65, -72, 7, -57, -17, 105, 53, 11, -20, -75, 28, 63, -30, -107, -26, 18, -5, -8, -1, -39, -151, -29, -78, -72, -134, -76, 147, 56, -139, -159, 41, -49, 89, 103, 55, 139, -92, 22, -4, -81, -58, -178, 18, 187, 249, 110, 63, 161, -90, 63, 15, -19, 107, 59, 68, -141, -250, -85, 93, -15, 87, 53, -88, 55, -125, -19, -110, 65, -146, 20, 160, 162, -21, -64, 110, -73, -135, -104, 126, 8, -57, -22, -87, -21, -110, -50, -105, 133, 18, 83, -25, 280, -82, -29, -44, -135, 34, -67, 81, -13, -16, 11, -20, -14, -53, -5, -40, -66, 31, -24, -84, -17, -72, 38, -51, -31, 170, 58, 39, 28, -116, -132, 25, -58, 294, -69, 120, -95, -65, -120, -36, -91, 6, 76, -18, -2, -39, 81, -43, 45, -37, 41, -4, 85, 59, 135, -77, 49, 62, -238, 63, 39, 3, 46, 20, 14, -228, 20, 54, -1, 21, 1, 141, 27, -44, 15, -102, -140, 164, 25, -55, -35, -112, -32, -33, -5, -111, -130, 34, -25, 81, 121, 146, 77, -93]
8181i3r1J13l1J41j78K26k67J33K3n
$$ y = [-93, -184, -71, -102, 39, -139, 87, -180, -47, -24, -29]
8191b9
$$ Imaginary data points
##PAGE= N=2
##DATA TABLE= (X++(I..I)), XYDATA
0@%%%%%%%%%%%qJ0j0J6j6K4l2M0m8N6p2Q0q9J11j31J50j74J99k31K65l02L43l86
34b05M37m91N53o21O91p74Q63r57J064j176J299j436J585j750J926k124K341k576
52a351K842l135L464l838M257m740N303n964O758p728Q953j0550J2728j5898K0951
67A2052l0332N3673k25219m92601J9508K36391M55926M43741K39150j27833l51344
78B33112m57913l70770j00890K48788M17932M23734K64443l5072l46411m42172
88a65219l55011j40793J58570M11330M27017K60936J2393k61995m41082l76110
98d69964j48412J08305L36360M35010K97460K9150k13886l77941l95564j99170
108e98652Q6880K96067L87060L27486Q9458j91332l49339l63123k38365K2075
$$ y = [0, 0, 0, 0, 0, 0, 0, 0, 0, 0, 0, 0, -8, 2, -8, 8, -8, 16, -16, 24, -24, 32, -40, 40, -49, 62, -69, 81, -93, 106, -125, 140, -162, 181, -205, 232, -259, 294, -327, 364, -410, 453, -504, 560, -616, 683, -753, 832, -918, 1008, -1116, 1225, -1351, 1491, -1644, 1820, -2018, 2239, -2501, 2802, -3162, 3596, -4132, 4821, -5729, 6999, -8899, 12052, -18280, 35393, -189826, -682427, -662919, -426528, 29398, 473139, 712289, 584456, 233112, -224801, -595571, -696461, -447673, -29741, 393993, 658436, 623364, 276953, -165219, -520230, -661023, -502453, -91123, 335894, 596830, 609223, 347228, -93854, -469964, -618376, -510071, -173711, 261299, 558759, 587909, 374023, -3918, -399482, -598652, -511772, -215705, 171355, 498841, 588299, 396967, 47628, -315495, -553860, -531785]
118e31785K76275L71339L10900J35022j25986l35705l62064k35349k7282K14344
128c10291L66196L23849J43921p6548k81397l66936k61084m4663J68475L22188
138a6290L39212J80328n4166k42402l35241k86306q8603J44946K92901L20715
148B55094K13938o060k20650l17411k80963j28338R6621K76444L14932K20151
158D23758L6520j75683l07810k87167j44470N3614K37523L14378K37389O0155
168D48207j35871k78042k95604j70752K6252K03480K94905K54397R2442j07315
178C32099k51783k87552j95024r738J76982K78342K57412J22618p0837k29758
188A22761k81290k08587m2767J42951K62628K61904J44400l7696k01553k73206
$$ y = [-531785, -255510, 115829, 426729, 561751, 435765, 100060, -262004, -497353, -524635, -310291, 55905, 379754, 523675, 447127, 165730, -201206, -462290, -506953, -338478, -16290, 322922, 503250, 449084, 206682, -128559, -414865, -503468, -358522, -65621, 255094, 469032, 462972, 242322, -75089, -356052, -484390, -387769, -111325, 203607, 423758, 460278, 284595, -23215, -310382, -454852, -401238, -163715, 150663, 388052, 448207, 312336, 34294, -261310, -432062, -405810, -202330, 92575, 346972, 439414, 332099, 80316, -207236, -402260, -411998, -235016, 43326, 300738, 423356, 352519, 122761, -158529, -367116, -409883, -266932, -4304, 257600, 402000, 364304, 162751, -110455]
198a10455k22035p1013J12671K42226K61308J65379n673j75789k62217k29064
208b94662r7146P9258K22831K60113J79020K3653j43849k50668k37643j15872
218c74965M9561J94422K57459J97288M5265j16445k27529k43777j42029K6987
228c33763J72200K40930K10929P7370r5431k12029k34289j62695q717J55224K33857
239D3586K08678J02181n8754k00353k36380j66102l5661J19109K28901K19368
249B24573J10704l1280j67732k38623j85349m7200R3753K00705K28760J37708
259C26019j8322j46995k16169k01691p9855Q1571J86157K13568J59354J7564j37330
270A83871k09291j92735j05691M4045J80955K14726J56365M5849j00610k09265
$$ y = [-110455, -332490, -403503, -290832, -48606, 212702, 378081, 372408, 196619, -65598, -294662, -391808, -312550, -89719, 170394, 349414, 373067, 229218, -21450, -259093, -374965, -325404, -130982, 126477, 323765, 369030, 252585, 25056, -218721, -360750, -333763, -161563, 79367, 290296, 367666, 272235, 60206, -174083, -336778, -345495, -190271, 43586, 252264, 354445, 295691, 95338, -141042, -307144, -342805, -223696, 5205, 224573, 335277, 303997, 136265, -102358, -287707, -334907, -241154, -40449, 188311, 326019, 307697, 160702, -55467, -257158, -337013, -255442, -69285, 144283, 303637, 321201, 183871, -25420, -218155, -323846, -279801, -98846, 115880, 272245, 318094, 217484, 8219]
280H219k02105j08293J5356J46843K21030J73968N1648p3688j79587k15165j32656
291b94430Q230J24107J96720J93022Q1331o6396j62464j97312j56689k5075J18596
302a80360J86598J81623J09272l1677j60613j94468j51264n5427Q4438J89311
312b2567J86780J08824j112j28760k03214j63638n8677N5932J61376K00979J27942
323B63865L880j03172j80482j83609q2714M9935J41625J83782J52864L1653r9409
334A78218j66300j72440j11186K0503J40154J76898J47482O2226o9985j69295
344C6275j72922j10362j0476J12502J85082J54507O5618m0586j45324j85966j24221
355b35873j5633Q6388J65634J72881Q3668l4758j23437j72188j46338l7305Q1456
$$ y = [8219, -193886, -302179, -286823, -139980, 81050, 255018, 306666, 232978, 53391, -161774, -294430, -286200, -162093, 34627, 227649, 308980, 242584, 80120, -117192, -273881, -298956, -180360, 6238, 187861, 297133, 265456, 104843, -89625, -240889, -296316, -211878, -22567, 164213, 273037, 271925, 143165, -60049, -223687, -282364, -226432, -65056, 135923, 263865, 267745, 164573, -15909, -199518, -282232, -232297, -90672, 93110, 245974, 277627, 178218, 11918, -160522, -271708, -251205, -111051, 65847, 213329, 275555, 205570, 36275, -136647, -247009, -257485, -144983, 40099, 194606, 260224, 219638, 74314, -111652, -235873, -251506, -165118, 516, 173397, 257065, 222307, 98870, -73318, -219656, -256961, -175505]
366a75505J49601J64159J09251j1117j20998j62274j42902o5170N7658J49857
376d7440J61034J11210J7240r8506j66556j46624p0732L0400J30331J70034J20274
387B10665K5478p3869j51306j59980q4578K0856J09719J59908J37739M2906o4832
398A72706j35774j55040j05453J726J02331J49857J38001O5847m5225j31331j50983
409i3338j10391k1794Q4319J48519J40304P4307k2580j15925j54037j17781l3145
420b21542O4189J37326J46831Q5932r897r8660j47527j28095m7666N0881J24852
431d3376J45071R9299O472q6862j39889j31093o3343L4590J15014J42492J07414
442A85789K2816p1453j33066j34207p4636J8030J02209J39612J14571L7320n7057
$$ y = [-175505, -25904, 138255, 247506, 236389, 115391, -46883, -189785, -254955, -197297, -47440, 113594, 224804, 242044, 143538, -23018, -169642, -240374, -209974, -79643, 90391, 210665, 236143, 162274, 10968, -149012, -233590, -212734, -103015, 56893, 194632, 237538, 172706, 36932, -118108, -223561, -221835, -119504, 30353, 168354, 234201, 188976, 57645, -93338, -203729, -225523, -141204, 7315, 147619, 221926, 199346, 83421, -70616, -188397, -221542, -157353, -20027, 126804, 212736, 202839, 104179, -43348, -171443, -219109, -168228, -43376, 101695, 200994, 207466, 120604, -19285, -150378, -213721, -179131, -64117, 78375, 185789, 208605, 137152, 4086, -130121, -204757, -186727, -84518, 55094, 169665, 206985, 149928]
453A49928j23686j34390q6298K221R0369J34343J18639N1592m0688j15196j34138
464h7304r3193j3925P4550J30731J22848O0795k4115j01653j34838j02080k4117
475a92301N9259J19331J28531P3454j3738q8632j27180j12103l9408N0270J09805
486c2712J24104Q6912L197q1950j21457j10866n5764L2650J06451J22956Q8635
497A62156K0861o4831j21946j14179n9307J4352R0914J27521R6043K5939m7446
508A30077j08714j23421p0390R362P5917J17029J09264L9798m3472r6803j15908
519g7261q6909o408P3502J09036J05116N8616k6847r7383j12040q5507k6445N6999
531a15531J12980J05567N9076o244q2040j19486r0432k8477L7405R9884J16771
$$ y = [149928, 26242, -108148, -194446, -192225, -101856, 32487, 151126, 202718, 162030, 46834, -87304, -180497, -194422, -119872, 10859, 133707, 194502, 170387, 68734, -66104, -168184, -192301, -133042, -13711, 114820, 188274, 174536, 85904, -41276, -153379, -192787, -142517, -32712, 91392, 178304, 181501, 99551, -21906, -132772, -188536, -155886, -49435, 73521, 162156, 183017, 118186, -3760, -117939, -177246, -162894, -71980, 55541, 151584, 177523, 130077, 21363, -102058, -172448, -163086, -87169, 29860, 139124, 178922, 135450, 38647, -77261, -164170, -170578, -97076, 11960, 117076, 175692, 148845, 51462, -60578, -146085, -172530, -115531, -2551, 103016, 162092, 155848, 73808, -45678, -136110, -164587, -127182, -27298, 89473]
542H9473O7652l679o4796j09056j05059m0018L5829Q5705J09018Q5496R408o4478
554I5495r8601j00304n9649K1673Q7493J02524Q3249L0328n0232j03135r8058
565h9217n9673L57P4027J10871Q4988L1735k9701r1741j09487o5042j626N5563
577h8946J01520R9589M0136k7966p6109j02832q2308j2013N4869Q9304R5885N9241
589A50370j6530p7232r4510q1332l2385M3676R2538R1922O0288L739o6428j00958
601b6842q0870l5096K4101Q4012J00791O3405P339m8955r4026r2869m0922K0438
613a19494O8581R6623P7708J5346m5871q2236r0960n7352J1356O7060Q8192P8886
625A07839L2622l6637q2462q6732o0374o269N8591R1408P7557L7656j9890p5797
$$ y = [89473, 157125, 153446, 88650, -20406, -125465, -165483, -129654, -43949, 65069, 150565, 159973, 95495, -3106, -103410, -163059, -141386, -53893, 48631, 131880, 162208, 111976, 8841, -89217, -148890, -148533, -74506, 36365, 121353, 153088, 123387, 31646, -77841, -142883, -144509, -88946, 12574, 112163, 152299, 124333, 48224, -54608, -136916, -148929, -94060, -4756, 91129, 150370, 133840, 56608, -37902, -119234, -151619, -107943, -15405, 76517, 136805, 140544, 74116, -26842, -107712, -142808, -118707, -34695, 66096, 129501, 136840, 87885, -6141, -99010, -139932, -119494, -50913, 45710, 123418, 138764, 92893, 10657, -80303, -137655, -126299, -59239, 28953, 107839, 140461, 103824, 21362, -65370, -125744, -132013, -73422, 17986, 95543, 133199, 113309, 37512]
637C7512r2192o2568j2005M3284Q6189Q6165M2069j3609o2486q9584p3205j8745
649a29175L7824P5928Q6014N4416n935n8094q2826p5333l2145K9698P3568Q2456
661E6396N8904P891n0861q2372p5349l8350J6836O7160Q4429O1920J5212l9189
673H2627p7869p9723m3714R005N7455Q2075O8550K2468l1506p0970q0299n1496
685a13397M52N0947P8306P1072L1472k2729o5902p9098n6787q836M2757P5130
697C387P3374L8029j4087n8943p7647o1726j6815L5349O9822P4058M5429n533
709A04697n3245p4630o4533k6019K6967O6496P3476M9478M664m5318p3969o6173
721g8109l1060J6446N9931P5518N3509J0072l5499o9225p0873l6698J1022N1266
$$ y = [37512, -54680, -117248, -129253, -85969, 220, 86385, 128454, 114845, 52359, -37225, -110430, -129175, -91351, -15423, 70591, 125007, 119072, 60978, -21848, -97181, -129326, -99628, -26060, 56396, 115300, 123191, 72330, -10042, -85391, -123741, -106905, -39745, 44684, 106604, 121816, 82627, 4758, -74965, -118679, -109674, -52219, 29856, 98406, 120874, 89368, 18398, -61901, -113397, -112945, -61998, 16308, 87380, 118852, 96123, 30221, -48877, -105664, -114500, -71743, 3387, 76761, 114790, 100703, 41760, -35887, -97613, -114428, -79079, -9257, 64801, 110230, 104697, 51452, -23178, -87711, -113730, -86763, -20267, 53209, 102687, 107351, 62033, -11936, -78109, -109169, -92723, -32792, 42726, 96235, 106307, 70808, 1583, -69290, -105988, -94966, -43700]
733d3700P2239O1193J7291l1230o2188o9732m6218L169M8243O7602O1487K8700
745A06856k3408o1370o7132m8411q859M0807O9400O1329L1338j0896n4899p1622
757c6867n0178j2093K8871O4184O8324L5143p591m4389o7887n9592j7533K6722
769g2886N5203O6324M6441j628m3166o1035n9292k9974K0221N5909O1529M7721
781H5367J1631l7013o3960n6983l2156O923N0601O6993M7114J4351k4057o0012
793H799o4226l3684M274L8649O4355N6771J7444k2596m9441o3397m4873N48L8018
806d9359N5863N7017K9840j7939n0494n6993m6579j2742L4060N8298N3040L2414
818H6426m330m6932o1497m4637j6182K0862N6100N9641L2234j101l4942o0137
$$ y = [-43700, 28539, 89732, 107023, 75793, 13605, -56127, -102345, -99176, -50933, 16669, 78156, 106856, 83448, 22078, -45054, -93465, -102324, -61517, 7883, 69212, 100550, 89654, 34755, -36867, -87045, -99138, -70267, -6083, 62241, 97384, 89793, 45404, -22483, -82075, -99608, -72886, -17683, 48641, 95082, 93454, 50288, -10747, -70039, -100013, -79792, -23883, 37646, 85367, 96998, 59985, -3975, -60958, -93114, -86191, -35590, 31403, 78517, 92868, 68811, 8799, -55427, -89111, -84837, -46188, 18167, 74938, 92382, 69786, 20345, -43052, -87925, -87377, -49359, 6504, 63521, 93361, 75422, 24928, -32065, -78644, -91386, -57326, 972, 54012, 86426, 82096, 35164, -26333, -70970, -87152, -66290, -10190, 49451, 81685, 80584, 45642, -14495]
830a4495n3375j7482J8126M5225O0204M2536Q81l2827n1715n4801k9010J5308
842g1425M5076N2997M5672J3258l0428n3018n0147l2539K843M3069N6430M2601
854F4389J7435j8258n1790n5306l1686j218L1759N6367M9404J8125j4510m1976
866B2735n6432m0049k717K8369M8665N1935K7447j2391m0106n0485m3899j2775
878g9703K6599M8036M8176L2024k455l8477n1552m1702j8029J6894M7073N1060
890C7944L1626L188k9653n1860m6000j9388J1780L9764N2268L7610N102k5365
902D7016m6031m8637k6017R330L6245M8246M1286J2350k2463m4005m6651l0450
914f9781J674L4120M7782M0881J7523j5404m2392m7606l1857l619K7826M7045
$$ y = [-14495, -67870, -85352, -67226, -22001, 38203, 80739, 81620, 48793, -2922, -57723, -86733, -71425, -26349, 26648, 72320, 85578, 55150, 2132, -48015, -80554, -77711, -34642, 21788, 64389, 81824, 63566, 11776, -43530, -75216, -76434, -44675, 11692, 61096, 79221, 64711, 22735, -33697, -73746, -76463, -48094, 571, 52506, 79953, 67562, 27456, -23029, -66928, -79703, -53104, -5068, 43108, 75132, 72677, 34200, -17352, -59054, -77083, -60189, -13116, 37944, 69570, 72758, 43105, -8755, -54755, -74143, -62363, -22599, 29669, 67279, 72381, 47016, 985, -47652, -73669, -64339, -28094, 20152, 61438, 73788, 51325, 7320, -39331, -69781, -68107, -33987, 13795, 54676, 72199, 56795, 14403, -33203, -65060, -68679, -40853, 6192]
926F192M3379K0291j0310l7470m7759l5736p244K3027M3874M4708K4890o027l3572
939B8243m6383l8146j2530J8935M1112M4790K8564q49k9699m4916l9894j6840
951f7613J3949L7788M4975L2085L600k5856m2308m1410k1224R387L4846M3664
963B1883L4461R194k1563m0945m1088k4862L325L1713M3696L5292J3102j5178
975D9030l8766m3189k6660n23K5535M2859L8859J5605j1745l3507m3190l1495
987e7187l634K2890L8431M0043K1975q909l1774l9899l3959j0399K0208L8113
999d101L7682K5119j279k9820m1158l2708j4153J2668L6883M0702K4680K390k2471
1012C4434m1043l6832j4602R181L0150M1498L0570L406k0070l5054l8945k1505
$$ y = [6192, 49571, 69862, 59552, 22082, -25677, -61413, -68657, -45630, -1756, 42952, 67842, 61815, 28243, -18140, -56286, -68816, -49881, -8769, 36021, 64585, 63736, 34037, -10879, -50773, -67613, -53664, -15876, 29099, 61184, 64784, 38928, -3380, -44790, -66014, -56627, -21781, 21883, 56344, 65538, 43975, 3030, -38058, -62920, -59595, -27882, 15814, 51106, 64208, 49030, 10264, -32925, -59585, -60108, -34573, 8286, 47145, 62750, 51005, 17498, -25692, -57187, -60821, -37931, 500, 40543, 62518, 53609, 21835, -18064, -52023, -62422, -42214, -4101, 33581, 58700, 57421, 27601, -13557, -46265, -60418, -47750, -10867, 29835, 54515, 56905, 34434, -6609, -43441, -58043, -48862, -18712, 22786, 53356, 56762, 36692, 1638, -37307, -58812]
1024e8812Q224K8634L6895L3467J0968j9191l4820l5324k5096LK8362L8221L0483
1037D2014J5014j0824l5278l7818k3314m060K0281L9281L4814J3993p175k7779
1049A9149l9877k8803l538J7087L2549L7912K0645p370k5619l4453l2908j0731
1061e5957J7472L1890L3508K4879N20k6350l5126k9393j5517R622L3134L5149
1073B3831K2957N225j8804l7186l2681j4144N302K6271L8071K7178M300j4878
1085C5442l1104l6302j9606N830K3357L3143L1515J0537j5809k9239l2193k4666
1097d9095m14K4250L2576K8613J5511q916l0982l2873k2704n743J8141L4550L0733
1110C3647J4414m345k4911l5970k5676n240J3717K9821L4371J8329m439k1318
$$ y = [-58812, -50588, -21954, 14941, 48408, 59376, 40185, 5365, -29959, -55055, -55052, -26690, 11531, 42014, 57028, 46204, 10926, -26892, -50206, -54266, -33985, 5296, 40110, 54103, 46928, 19149, -20728, -49531, -53069, -35982, -3433, 34479, 55124, 47754, 22135, -12318, -45226, -55957, -38485, -6595, 26913, 51792, 52312, 25962, -9164, -38557, -54074, -44452, -11318, 23831, 46788, 52013, 33209, -3977, -36658, -50802, -45500, -19229, 18842, 46020, 50320, 35442, 4338, -31964, -51570, -45740, -22383, 10760, 42275, 52812, 37003, 7764, -24429, -49095, -49509, -25259, 7317, 35930, 51441, 42525, 11543, -21330, -44034, -49777, -31636, 2914, 33647, 48061, 43716, 18805, -17165, -42841, -48081, -34364, -4543, 29828, 48157, 43718, 22400]
1122B2400l2222k9887r728J3580K7190L1580K3383M67k1674l0790k8052j5259
1134d9012Q813K8041L1297K2595N864j7200l2153k8938j5261L724K3908L3423
1146A5101K4746O404j2741k8715l1907j8144K792K0102L1251K8038J0050j1583
1158C5394k6295l0590k1903j016J9480K9257K7611J4393p768k5650l0317k2433
1170c9837n386J5929K9332K8612J5334l733k2471l0852k4115p460J2359K7219
1182e069K9586J8130j201j9784k9537k6150j0382R687K5237K9623K0211J989j7091
1195B5249k8644k7047j3096O621K3071K9272K2573M699j4188k7078k7832j6060
1207d2460M242K0615K8348K4231Q133j2307k5131k7672j8390K53J9197K7829K4415
$$ y = [22400, -9822, -39709, -49437, -35857, -8667, 22913, 46296, 46763, 25089, -5701, -33753, -49012, -40199, -12158, 19139, 41734, 47598, 30398, -1755, -30693, -45954, -42230, -18322, 15101, 39847, 46251, 33510, 4795, -27112, -45256, -42464, -22362, 8889, 36927, 46977, 35394, 9099, -21491, -43394, -44410, -24930, 4327, 31938, 46331, 38563, 12913, -17404, -39837, -45223, -29294, 38, 28650, 43984, 40251, 17780, -13072, -37187, -44647, -32288, -5069, 24517, 42647, 41446, 21662, -7875, -34025, -44407, -34720, -9483, 20140, 40351, 42340, 25249, -3395, -30442, -43538, -36917, -13846, 15426, 37999, 42698, 28510, 1432, -26400, -42460, -38218, -17603, 10745, 34976, 43109, 30802, 5671, -22001, -40391, -40138, -20941, 6888, 31303]
1220C1303J1176q330k4603k8187j9009l046J5474K7841K5823J2387m973k1411
1232A4445k8924k1316m568J2369K5330K7604J5435l938j8751k6720k4132q166
1244d1332J1629K3597K5814J8744L66j8585k5940k2985j2081P483K3859K6164
1256A6733J8218M439j4485k7031k4323j1776L403J9799K8594K0192M503j0884
1268B7382k3576k7290j4709L684J6593K5507K3939P797j0975k1373k4785j9140
1280c6946m29J7813K3734K2267J2807p059k2757k4558j7567n389J3573K6114K2963
1293B4566J1467k114j8966k7536j9023m538R076K2793K6558J3768k817j5155k4412
1306f333k3531p346R837J9411K4211J8936M75j6341k2162k1840j2825O524K1350
$$ y = [31303, 42479, 34149, 9546, -18641, -37650, -40696, -25222, 2619, 28442, 40829, 35856, 14445, -14479, -35795, -40363, -27994, -2664, 24940, 40375, 36437, 17686, -9034, -33166, -41332, -29703, -6106, 19708, 38452, 38818, 20233, -5707, -28692, -40773, -33290, -9431, 16733, 34951, 39390, 24905, -2126, -26449, -38225, -34822, -15023, 13571, 33763, 38266, 27382, 3806, -23484, -38193, -34509, -17916, 7591, 31530, 39327, 28352, 6979, -17806, -36946, -37375, -19562, 4172, 26439, 39246, 32187, 9430, -15128, -32695, -38084, -24511, 1603, 24566, 36033, 33919, 14953, -12583, -31606, -36144, -27068, -4275, 22283, 36051, 33234, 18079, -6333, -29864, -37210, -27373, -7962, 16249, 35185, 35660, 19319, -2843, -24683, -37508, -30984, -9634]
1319i634K2808J7710N922j3053k4516k1512j1970J374J8077K5801J8203N261p789
1332B6682k2052k5091j3290J578J3935K3813K2392P295q481j8263k3473j8393
1344c3348n82J4712K0878K1633J2404o111j9497k1581j7587o128J2063K2866K0729
1357B0451J2128o67j7267k4344j7391o188P138K0990K3838J2965m02j2894k3082
1370d725k1257p504P133J7263K2974J7327J164j3035k0046k1077j1977N069J7974
1383a0717K0953J7624N753j1174k1073j9937j2716N14J6348K2361J7571O677o927
1396B5257j9694k2119j3413m42J2490K1794J9893Q122n714j6889k1976j6432k143
1409c1266J1758J9630K0337J1344m030j6324k0567j7319n242R707J9404K0080
$$ y = [-9634, 13174, 30884, 36806, 23753, -763, -22275, -34245, -32871, -14794, 11007, 29210, 34471, 26682, 4630, -20461, -33751, -32173, -18238, 5575, 27967, 35262, 26781, 8518, -14955, -33348, -33930, -19218, 1660, 23293, 35697, 29586, 10089, -11492, -29079, -35207, -23144, -278, 20451, 32579, 31912, 14645, -9699, -27090, -33278, -26140, -5150, 18688, 31653, 31251, 18357, -4725, -25982, -33486, -26353, -9090, 13884, 31211, 32375, 19340, -706, -21783, -33760, -28691, -10717, 10236, 27860, 33613, 22439, 1366, -18571, -31287, -30773, -14425, 7936, 25507, 32184, 25257, 5563, -16556, -29969, -30411, -17921, 3873, 23766, 31888, 26174, 9285, -12691, -29123, -31266, -19508, 122, 20459, 31803, 27773, 11449, -9118, -26437, -31679, -21972, -2568, 17512]
1421A7512J2634j015j4592k0860j7763p003O819J8181K0970J3602J364j2244k0577
1434b972j8842q768M815J6425K0898J5428L002j0228j9375j9367j0702K725J4943
1447a2018K0328J6466N203q237j8015j9830j2565P67J3094J9826J7671P329o634
1460B3385j6614j9852j4252j372J1667J8741J8185R537m280j5899j9280j4905
1472b4939m260R798J8603J8334J0375j349j4074k0138j5552n079O576J7400J9702
1485A5397J1573l08j1464j8980j7926o852O194J4790J9199J4481J523j1228j7007
1498f08j7705j0140M070J5147J7866J4721N027r215j8108j6897j0562L26J3701
1511a2377J9398J4371N642n355j6776j9187j0991j56R913J8304J7780O496n361
$$ y = [17512, 30146, 29131, 14539, -6321, -24084, -31087, -24268, -6087, 14883, 28485, 29849, 17605, -2972, -21814, -30582, -25767, -9342, 11556, 26984, 29986, 19758, 383, -18984, -29686, -26961, -12018, 8310, 24776, 29979, 21742, 3727, -16103, -28668, -27901, -14807, 5019, 22690, 30019, 23385, 6771, -13081, -27333, -28705, -17038, 1703, 19888, 29425, 25145, 9246, -10034, -24939, -29199, -19401, -798, 17536, 27911, 26562, 12488, -7650, -23202, -28281, -21705, -4305, 15397, 26970, 26662, 15198, -3782, -21708, -28560, -22366, -7576, 11623, 26104, 27627, 16399, -608, -18313, -28453, -24383, -9236, 8630, 23351, 28378, 19163, 1055, -15842, -26404, -26078, -12377, 7021, 21392, 27034, 21679, 4903, -14284, -25275, -25431, -15518, 2786, 20566, 27062, 21701]
1524B1701j3475j8630j4730r18J0007J5625J7394J0519m065j4428j6215j4883
1536b2098n597R095J6956J5814J0793N78j3330j8337j3880n899M561J6158J8357
1549A3171J0327R42q879j7900j7058o000M269J2495J8267J4208J099q865j4877
1562A199j7012j0419L817J3117J5378J4664N895q552j5764j5072j1214p69J2465
1575a2267J7416J3087O783m034j5623j7375j0046j627Q112J7208J6252O196l440
1588B0642j1427j7903j3491j691P905J3949J6872R906l357j1576j4832j4718n549
1601b5270P720J4475J4709J1197Q27j1592j6076j3028o906L777J4558J6355J0164
1614B0910K138p678j6535j5143o453K346J1268J7070J2782K322p209j3534j6074
$$ y = [21701, 8226, -10404, -25134, -26052, -16045, -420, 16974, 27493, 23428, 9000, -7215, -22098, -27695, -18600, -1644, 14170, 24963, 25541, 12211, -6126, -20006, -25905, -21344, -5186, 13171, 23498, 24440, 15561, -2339, -19397, -25397, -21128, -8633, 9634, 23842, 24941, 16076, 1199, -15813, -26232, -22415, -9298, 6080, 20744, 26639, 18087, 2323, -12749, -23963, -24732, -12267, 5149, 18236, 25019, 20985, 5362, -12013, -22059, -23686, -15574, 1634, 17886, 24082, 20642, 9215, -8688, -22179, -23870, -15965, -2016, 14856, 24762, 21405, 9829, -5003, -19721, -25270, -17550, -3075, 11634, 22831, 23658, 12066, -4010, -17038, -23944, -20167, -5609, 10746, 20910, 23048, 15370, -1165, -16308, -22761, -20415, -9147, 7923, 20705, 23027, 15818, 2284, -13790]
1627a3790r523K291J0754J4678J4152N364o753j3180j4550j1154r48J0589J5015
1640B945J3041O974l309j3519j5461j0525k626P640J5295J4243P264j928j0865
1653I169j6090j2442k652O141J3320J5262R015j426r678j4558j3427n085N457
1666a6994J2593J4423J0503R75r305j4096j3324o738L314J2064J4548J1007K537
1679B1507p053j4236j3706p624J860J0416J4657J1758L896n725j2916j4168r050
1692b0384L76R319J4108J2427N251m259j1946j4126r832j228P862J3468J3029
1705A4065O627k933j0839j3966j0972k447O659J2526J3634P848j702r808j3438
1718d746j1532m691N799J2228J2953R041N16r064j3363j1774n425L299J1665J3835
$$ y = [-13790, -23313, -21022, -10268, 4410, 18562, 23926, 17173, 3993, -10557, -21711, -22659, -12070, 2945, 15986, 22960, 19651, 6132, -9329, -19854, -22480, -14840, 455, 14698, 21962, 20034, 9169, -6921, -19363, -22015, -15874, -2554, 12708, 21723, 20297, 10619, -3939, -17366, -22451, -16994, -4401, 10022, 20525, 21500, 12195, -1901, -15225, -21963, -18649, -6585, 7963, 18970, 21507, 14454, 218, -13488, -21112, -19252, -8836, 5821, 17579, 21475, 15750, 2834, -11334, -20384, -20008, -10689, 3419, 15846, 21097, 16838, 4892, -9234, -19066, -20294, -12432, 1036, 14065, 20692, 17759, 6920, -7046, -18018, -20465, -13806, -1280, 12354, 20202, 18500, 8692, -4746, -16278, -20969, -15170, -2942, 10011, 19052, 19568, 10504, -2859, -14633, -20058, -16759, -5094, 8741]
1732H741Q921J655o473j3549j2759n938K161R761J3706J0911K311o034j1308j3453
1746a1347q101J761Q944J2194J1844M869n654j1220j2130r199j017Q782J2733
1759B459J0926N689k430j1379j3183q481k396O027J3121J2353N545j567q746j3551
1773e613j0559k053M997J0421J3376Q187j792q102j1580j1863m692N238J0351
1786c684J1498R487J241q490j1823j0328o424K336J0997J2083Q426L035n729j2668
1800d3j1648n533Q16Q202J3463J0127K091m217r968j3195p657J328P035J1224
1814B025J1830M639m800r621j0974r643j344Q068J0889J0092O707k157j0401j1358
1828f048q237l396N133J2187J1044N619k95p667j2937r542k515L499R716J2644
$$ y = [8741, 17662, 19317, 12844, -705, -13464, -19402, -17241, -7480, 6226, 17137, 19448, 13414, 2106, -11347, -19448, -17687, -8743, 3451, 15295, 20164, 14510, 3290, -8840, -18039, -19056, -10274, 2459, 13385, 19074, 16644, 5265, -7918, -16399, -18795, -12768, 353, 12706, 18251, 16684, 7938, -5613, -16172, -18225, -13228, -2807, 10569, 18756, 16964, 8862, -2718, -14581, -19273, -14035, -3684, 7814, 17301, 18542, 10052, -1771, -12099, -18523, -16187, -5190, 6893, 15319, 18354, 12625, -43, -11691, -17224, -16408, -8206, 5257, 15384, 17475, 13258, 3290, -9905, -17562, -16234, -9199, 2025, 13855, 18494, 13694, 4073, -6901, -16544, -17888, -9820, 1069, 11161, 17868, 15711, 5310, -6048, -14285, -17681, -12548, -361, 10683, 16302, 16007, 8340, -4597, -14139, -16654, -13155, -3439, 9205]
1842I205P413r74o386j0770j1499m445M147Q824J0719R555J155p003j0300j0025
1856a0384o594J821R529J0927Q239L328m799j1216j0321o055J54P142J2087R154
1870A3012K953k963r287j1941p146J32N871J0505J0871M428l401q026j0689q958
1884a4639j437O215R616J0180O351j673q710j0411q395l528M734J0260J0259O051
1898A4873J83p157j0993q936l501K907R122J0903O964N21n755r842j0269m627
1912a5607K772P623J0460Q419J727n512r292r852n934J295P758R956Q464L229
1926A5506m340r218r922o326j38O780J0037Q949L640k713q628j0021p260r80N782
1941h852R596R246M931k072p739r928q059j929M771R111R538N637p85o818j0077
$$ y = [9205, 16618, 15644, 9258, -1512, -13011, -17456, -13309, -4485, 6234, 15789, 16944, 9941, -359, -10384, -16978, -15157, -5628, 5299, 13538, 16866, 12067, 851, -9470, -15525, -15371, -8229, 3858, 13012, 15965, 13002, 3715, -8226, -15372, -15240, -9369, 1136, 12007, 16435, 13034, 5008, -5681, -14639, -16076, -9861, -245, 9935, 16286, 14613, 5903, -4508, -12903, -16431, -11697, -1437, 8822, 14873, 15056, 7899, -3094, -12030, -15531, -12624, -3502, 7401, 14365, 14886, 9131, -711, -10980, -15607, -12835, -5212, 5248, 13667, 15394, 9882, 590, -9262, -15196, -13901, -6143, 3813, 12277, 15506, 11166, 1948, -7974, -14300, -14438, -7658, 2379, 11328, 14968, 12255, 3627, -6394, -13654, -14634, -8852, 744, 9990, 14921, 12849, 5110, -4818, -12877, -14806, -10035, -924, 8614, 14251, 13466, 6648, -3429]
1956c429q229k829L615Q460R785O418k49n966r179r073l962L082P912R311P228
1971A2895J240n578q830q803n112J597P676R364P168K506m098r060r080n124K08
1986a3031O446R818P618K642k887p728r842o081P4N275Q762Q860M013k961p099
2001C879q620p693j004N287Q362P911N447j243p424q784o836l109L805R099Q219
2016G296N045K85n555r991p220k705K170P404R671N699K59m547q421q894l582
2031a3086K502O174Q682P435J495n311p208q080n601J257O949P857O854L288l498
2046I709q414p902m980p31N474R346O949K750j784p168r175n459k47L704Q163
2061B35Q621L684k428n383q381p500j187M589O787P854N692j305o516p370o794
$$ y = [-3429, -11658, -14487, -10872, -2412, 7373, 13791, 13542, 7576, -1603, -10676, -14638, -11556, -3644, 5667, 12895, 14135, 8557, -273, -9076, -14188, -12591, -4915, 4449, 11617, 14123, 10025, 965, -8115, -13239, -13031, -6585, 3233, 10851, 13493, 10606, 2878, -6964, -13045, -12971, -7696, 1066, 9926, 13939, 10978, 3879, -4741, -12434, -13438, -8151, 211, 8122, 13569, 12326, 4902, -3882, -10718, -13827, -10022, -923, 7296, 12341, 12626, 7071, -2920, -10140, -12845, -10675, -3271, 6400, 12099, 12358, 7811, -610, -9504, -13086, -10584, -4410, 4272, 11707, 13202, 7891, 683, -7397, -12998, -11741, -4792, 3065, 9919, 13207, 9709, 1295, -6607, -11587, -12318, -6844, 2502, 9451, 12201, 10417, 3249, -5926, -11385, -11632, -7928, 235, 8856, 12540, 10112, 4729, -3652, -11152, -12339, -7750, -963, 6891, 12583, 11278, 4762, -2608, -9402]
2076i402l304L269P938P101N259J387n597q702o527l043J155O885Q982N212O64
2091A1277l527p835q280l311J642N176Q349P034J317m004o342p866n463R92N688
2106e153P133O854L481l256p323o955n337j022M994P958O540L377j162o477q523
2121d871m748j168L073P369P830L481j234m710p959o658j620L558N859P477N254
2136A0933o94m975o799o608l398K725O689O835N333J028m616p268o498l455J003
2151i765O241P461N248J553l211o920p562l620Q38M838P481O377J648k509o171
2166A927p363m895L44M294O868O548L121k107o102o806n292j002M188O639O545
2181F907L512j175n440p126n508j526L051O449O957L993m54n108o685o032k167
$$ y = [-9402, -12706, -9437, -1499, 5602, 10861, 12248, 6651, -2051, -8578, -11621, -10466, -3581, 5401, 10613, 11277, 7750, -85, -8365, -11676, -10034, -4858, 3491, 10525, 11842, 7838, 1496, -6370, -11833, -10841, -5153, 1980, 8834, 12315, 9059, 1736, -5219, -10556, -11578, -6584, 1374, 7914, 11291, 10129, 3652, -4871, -9619, -10787, -7714, -345, 7485, 10966, 9732, 5022, -2937, -9595, -11215, -7657, -1798, 5679, 10933, 10239, 5264, -1535, -8143, -11541, -8816, -2127, 4708, 10041, 11069, 6453, -815, -7313, -10768, -9765, -3524, 3937, 9185, 10738, 7527, 607, -6955, -10575, -9737, -4899, 2582, 8959, 10607, 8098, 1927, -5436, -10331, -9987, -5693, 1175, 7723, 10844, 8737, 2635, -4171, -9463, -10465, -6277, 362, 6907, 10419, 9244, 3804, -3322, -8830, -10356, -7305, -856, 6101, 10094, 9640, 4532, -2153, -8185, -10352]
2196a0352K576N854O940M490J79l947o772o278k729J538N507O930N115P86l404
2211F433o389o451l552J181M853O683N785J411l030n763o469m432N78M756O136
2226A730N641K815k349o107o232m246q96L970O688N666K675r04n289o954m612
2241h404r47K775O063O738L101j044m063o557n852j355K689N501O296M421m92
2256H870m239n930n614l017K257N826N728M415J314l989o618n186k761N39N217
2271c188O766M296J114k461n970o585k727P90L572O552N724J033k401m684o470
2286d639m394N20M056N252N707L149k224n502n236m753j123L481O142N184L080
2301H700l49n236o459l886j414K000O103O123K663l73l351o426n277j442K088
$$ y = [-10352, -7776, -1922, 5018, 9508, 9687, 5740, -1032, -7310, -10039, -8501, -2994, 3936, 9051, 9837, 6433, 44, -6407, -9959, -8778, -3925, 2758, 8543, 9954, 6924, 1161, -5308, -9740, -9162, -4406, 1730, 7371, 10186, 7837, 1730, -4502, -8748, -9644, -5674, 1014, 6680, 9355, 8451, 3162, -3792, -8404, -9351, -6576, -513, 6225, 9326, 8282, 4219, -2338, -8190, -9545, -6856, -1355, 4941, 9362, 8870, 4631, -1299, -6913, -9930, -7673, -1847, 3881, 8296, 9610, 5621, -997, -6183, -8944, -8405, -3188, 3578, 7874, 8988, 6527, 557, -6028, -8755, -7965, -4393, 2159, 7883, 8916, 6515, 1831, -4639, -9033, -8513, -4457, 795, 6502, 9651, 7427, 1925, -3311, -8064, -9187, -5706, 436, 5620, 8700, 8351, 3115, -3344, -7230, -8644, -6644, -541, 5582, 8245, 7872, 4521, -1905, -7182, -8624, -6536]
2316f536M424O272M437n92l578m914n554l283K213M935N270M456J475l755n677
2331d07m516l465K24M988N869L944J785j867n656n980k788Q0L337O139N067J371
2347H125j621m216o167m159J96L389M689N446K959j877m206n151m630j261L206
2362e278N264M603L441l55m540n466m026j869J928N362N443K954J38l208n809
2377a418m872j617J572M114N863L900K9k938m625n349k785J665L908N093M390
2392F930J250k973m865m771l292N04L979N280L958J898j920m921n249k873l25
2407g390L208N261M596J896j282m199n435l710l15K648M959N147K365j288l883
2422B578m890m085j225K460M753M663K910l82l427m897m119j943J879M412M979
$$ y = [-6536, -2112, 4160, 8597, 8005, 4427, -487, -6041, -9324, -7111, -2176, 3094, 7550, 9025, 5270, -407, -4923, -8388, -8164, -3176, 2693, 6637, 8422, 6555, 899, -5081, -7869, -7789, -4452, 1687, 6754, 8125, 6504, 2288, -3879, -8038, -7842, -4453, 236, 5682, 8641, 6764, 2558, -2593, -7223, -8484, -5278, -14, 4589, 8030, 7675, 3135, -2331, -6357, -8226, -6298, -936, 4507, 7461, 7599, 4391, -1418, -6290, -7907, -6335, -2221, 3642, 7542, 7571, 4633, 8, -5341, -8126, -6461, -2553, 2540, 6930, 8180, 5207, 342, -4429, -7721, -7217, -3238, 2042, 6000, 7898, 5978, 1057, -4192, -7065, -7390, -4182, 1079, 5675, 7571, 6289, 2090, -3345, -7055, -7370, -4722, 237, 5384, 7749, 6461, 2578, -2312, -6397, -7622, -5162, -409, 4254, 7164, 6782, 3355, -1542, -5661, -7604, -5725, -1313, 3666]
2437C666L206K37k997m921m495j981J123M151M866L577Q61k727m675m543k574
2452g226O26L924M885L975R40j886m746m706k696J14L401M859M149J449j515l764
2468A783n145l395J14K698M525M279K274j112l834m526l807q51K623M453M169
2483D248K542m69l714m529l534j583J760M512M873K493m4k930m748m247j268J292
2499e346L304N183L289j28k425l986m587k243J402L417M085M129P88k502m274
2514A06l907k659N6L831M391L461J358j420m253m767k196j67K392M805M251R53
2530F235r53l304m853l328K35J937L914M524K413j312l445l627l988j229K612
2545d169L807L745K993k14l581m076l239j874J542M223M202K271L69k149m675
$$ y = [3666, 6872, 7109, 4112, -809, -5304, -7285, -6162, -2011, 2855, 6432, 7293, 4566, -109, -4652, -7226, -6600, -2676, 2209, 6184, 7124, 5238, 492, -4214, -6910, -6796, -3395, 1464, 5613, 7062, 5547, 1783, -3362, -6757, -6643, -3945, 580, 4859, 7133, 6021, 2187, -2339, -6146, -6997, -4374, 79, 4248, 6790, 6321, 2607, -1922, -5456, -7039, -5279, -767, 4106, 6599, 6555, 3625, -1123, -5370, -6638, -5346, -2042, 3141, 6430, 6302, 3877, -109, -4696, -6939, -5537, -2120, 1965, 6094, 6882, 4380, 106, -3801, -6460, -6404, -2573, 1818, 5279, 6637, 5217, 964, -3803, -5999, -6166, -3774, 1031, 5282, 6235, 5282, 1978, -2875, -6203, -5968, -4031, -117, 4407, 6820, 5508, 2063, -1564, -5552, -6781, -4169, -362, 3383, 6376, 6162, 2581, -1495, -4734, -6608, -5066, -843, 3359, 5630, 5999, 3850, -825]
2560h25m036j100O08L174N074L090o6j931l684m515k260J388K763L870M047J108
2576F705k616l345l813l016N7L339L802L149K166j089m361l852k310q67K396M405
2592G50L631J391m78l189m769k861r4J511L626M474K182j175k458l855l911r34
2608f159K197L110L848K804j74k809l721l472j823J228L878L730K576O13k197
2623C629m017l686j618L30L199M488K917K43j403l539m184k062N89K478L868L715
2639D947R90j723l188l849k720p1K891L341L286J952j236l392l469k867o00K205
2655c503L743L478J728m24k724m118k865q03J392L628L676K265l92k379l618l522
2671d438j156J361L122L903K597j02k224l624l512j482R24K973L743K705O10j732
$$ y = [-825, -4861, -5961, -5353, -2179, 2895, 5985, 5919, 3988, 304, -4211, -6471, -5083, -2320, 1550, 5597, 6705, 4089, 744, -3069, -6085, -6028, -2689, 1113, 4262, 6428, 5339, 978, -2874, -5184, -6051, -3655, 750, 4381, 5772, 5294, 2105, -2664, -5525, -5619, -4108, -482, 3992, 6174, 4999, 2541, -1314, -5225, -6159, -3962, -852, 2996, 5800, 5626, 2817, -904, -4376, -6199, -4971, -1093, 2637, 5213, 5826, 3629, -388, -4074, -5692, -5362, -2163, 2325, 5242, 5485, 4082, 543, -3641, -5703, -5114, -2636, 1232, 4947, 5937, 4214, 1026, -2823, -5543, -5614, -2723, 618, 3904, 5856, 4620, 1228, -2241, -5108, -5708, -3503, 240, 3718, 5446, 5022, 2298, -1820, -4685, -5488, -4096, -468, 3208, 5473, 5081, 2702, -916, -4438, -5594, -4233, -1111, 2792, 5389, 5287, 3063, -561, -4073, -5555, -4631, -1658, 2085, 4790, 5400, 3668]
2687C668l590l694j880N07K747L718L125P84j472l226l801j953q6K593L557L041
2703D038J388j024l233l690k484k21K063L662L206J438n95k744l893k593n27J641
2719c568L520L348J966p88k371l432l155q55J352L460L154K368K58k745l212l174
2735c874j217P12L287L490K002P14j840l734l145j408M82K454L891K754J46j256
2751C458l106l462j902N75K160L339L190R49j485k875l238k485j7K429L096K561
2767C187K026j073l040k967k373p04J626L668K898J290j27k419l821k379l76R37
2783c647K968L830J526l92j857l083l473q37J589K310L068K659N4k296k561l128
2799c270j737R34K968K861K216J010j828l381k683j561M7K348L616K467M84j041
$$ y = [3668, 78, -3616, -5496, -4989, -2242, 1476, 4601, 5385, 3913, 687, -3114, -5067, -5153, -2560, 997, 4038, 5426, 4402, 1169, -2521, -5005, -5226, -3163, 499, 3705, 5143, 4548, 1804, -2089, -4682, -5209, -3568, -48, 3300, 5266, 4478, 2107, -1325, -4480, -5335, -3983, -523, 2631, 4999, 5257, 2512, -700, -3874, -5091, -4379, -1092, 2398, 4400, 5114, 3274, -460, -3605, -5013, -4531, -2077, 1814, 4568, 4714, 3458, 352, -3110, -5012, -4437, -2277, 1062, 4252, 5201, 3716, 841, -2397, -4882, -4899, -2470, 626, 3187, 5213, 4140, 1100, -1867, -4240, -4944, -3318, 350, 3248, 4538, 4411, 1992, -1829, -4208, -4584, -3647, -679, 3151, 4677, 4285, 2428, -655, -4128, -4965, -3376, -1066, 2002, 4661, 4715, 2419, -142, -3270, -5007, -4073, -1105, 1756, 3972, 4982, 3154, -227, -2910, -4471, -4424, -2076, 1540, 4007, 4491, 3450]
2815C450k761l429j779L40J566L117L365R10j370k137l109k715j4K332K387K703
2831B856K009r25k644k902k164r51J579L280K543J516J43k291l411k213p25O25
2847c675K948L338J584k43j383k875l341q13J005K078L182K586o0j676k650k813
2863b808j894Q14K538K548K354J121j492k990k691j655r2K216L165K249Q54p53
2879C484k628l135j766J12J165K935L142R86r35j790l211k423p2J579K353K820
2895B616J859p34k189k507k565q51J323K630K620J806J46k145k763k318r33N17
2911c488K391L177J729J17j383k922k468j359N90K316K622K437L52j413k329k908
2927b539j443K92K099K567K378Q04j015k530k663j696q2J763K610K448J044o09
$$ y = [3450, 689, -2740, -4519, -4179, -2613, 504, 3869, 4779, 3409, 1272, -1837, -4552, -4566, -2234, 153, 2856, 4865, 3940, 1296, -1606, -3770, -4721, -3142, 138, 2681, 4197, 4340, 2049, -1362, -3575, -4300, -3675, -727, 2611, 4195, 3952, 2569, -306, -3647, -4460, -3455, -1377, 1805, 4391, 4331, 2655, 5, -2808, -4702, -3888, -1350, 1198, 3552, 4673, 3181, 191, -2500, -4155, -4247, -2031, 1134, 3383, 4237, 3484, 856, -2279, -4045, -3933, -2768, 167, 3309, 4295, 3360, 1570, -1641, -4064, -4136, -2557, -204, 2616, 4475, 3741, 1552, -955, -3520, -4371, -3048, -418, 2202, 4008, 4154, 2009, -754, -3072, -4005, -3488, -1097, 2080, 3809, 3926, 2543, -379, -2847, -4206, -3616, -1300, 1322, 3759, 4111, 2698, 369, -2539, -3982, -3690, -1591, 976, 3354, 4158, 3143, 613, -2050, -3746, -3828, -2065, 545, 2993, 4037, 3428]
2943C428k326k690k020l97J746K162K571J474l41k103k752j933r67J241K703K573
2959B369J303M8j838k835k138p88P86K246K897J492J60j438k520k601j076Q51
2975c082J870K860J692M40j315k271k471j476K67K018K414K136P69j091k547k256
2991b043j525k75J903K670K024Q50m68k363k696j416k04J218K396K712R05p49
3007B939j601k506k287k55J327K037K440J634l75j994k097k058j002J066K374
3022c58K150J511L52j681k752j782q70L57K372K436J407K60j055k539k451p77
3038c420N29J551K262K194K77j046j967k229j874M68J735K074K130Q83r80k233
3054C54j824j673l83J706K582J485J135l61j920k689j353k75P30K428K439Q88
$$ y = [3428, 1102, -1588, -3608, -4005, -2259, -97, 2474, 3948, 3607, 1504, -1248, -3181, -4148, -2907, -204, 2369, 3672, 3720, 1882, -953, -3091, -3879, -3093, -847, 2050, 3542, 3702, 2264, -256, -2857, -3933, -3082, -1212, 1648, 3340, 3780, 2465, 194, -2277, -3753, -3486, -1468, 946, 3082, 3851, 2760, 213, -2043, -3568, -3843, -1940, 730, 2754, 3604, 3136, 773, -1923, -3339, -3543, -2325, 71, 2783, 3688, 2939, 1338, -1168, -3455, -3710, -2383, -346, 2094, 3728, 3353, 1359, -738, -2796, -3798, -2732, -358, 1792, 3303, 3655, 1974, -778, -2560, -3430, -3073, -701, 1735, 3142, 3402, 2347, -192, -2643, -3420, -2891, -1340, 922, 3116, 3393, 2347, 380, -1849, -3723, -3255, -1520, 554, 2684, 3567, 2587, 354, -1470, -3143, -3526, -1820, 762, 2247, 3382, 3021, 1101, -1588, -2941, -3216, -2486, -58, 2381, 3269]
3070C269k46j451k594k154j86J116J638K579J530n00j591j844k143r24R38J899
3086f64J945J611N39j534k252j602j401K62K059K336J493L71q00k362k348o47
3102b994J92J200K237K103L20o78j773k275j592N66J003J987K115Q68q72j627
3118G80j824j757n63J591K058J732J126j81j717k333j501n47P19K346J874J117
3134B920j82j246k182j915l81N81J614K401J346n9j277j811j997q96N90J677J767
3151I50J787M50j422j839j754j100K11J686J837J492O93p12k056j946j103k1J267
3168a580K131J607P20n36j556k150j338K5Q94J950J785J131n88j514k222j272
3184b513l96R35J874J869J025j26j427j914j763m36Q49J703J693J331J51j320
$$ y = [3269, 3023, 1572, -1022, -3176, -3362, -2246, -608, 1971, 3501, 3001, 1410, -434, -2577, -3501, -2563, -664, 1281, 2892, 3431, 1897, -355, -1957, -3358, -3096, -1037, 1299, 2792, 3163, 2363, 1, -2347, -2994, -2802, -1602, 635, 2738, 3058, 2380, 607, -1668, -3260, -2694, -1691, 296, 2411, 3279, 2407, 780, -1044, -2801, -3364, -1773, 285, 2017, 3143, 2962, 1245, -1088, -2589, -3136, -2417, -71, 1803, 2920, 2738, 1492, -690, -2605, -2986, -2405, -791, 1610, 2956, 2897, 1620, -191, -2188, -3084, -2494, -817, 950, 2737, 3187, 1765, -74, -1828, -2928, -2717, -1031, 806, 2298, 2991, 2279, 223, -1723, -2826, -2847, -1580, 551, 2158, 2878, 2342, 786, -1364, -2702, -2677, -1783, 167, 1952, 3083, 2495, 981, -1241, -2513, -2909, -1974, -100, 1769, 2794, 2668, 1241, -673, -2436, -2872, -2023, -320, 1373, 2704, 2855, 1535]
3200A535j871j737q29P36J450J916J279K92j255j719j488j023L80J220K122J246
3216B254L90o55j845j691j157J79J366J917J429N28o99j485j714j387K05Q37J861
3233C33J619Q23n81j527j597j366m68J068J829J494J039j53j573j992j040m85
3249b577N86J804J736Q84j07j041j624j734k88N83J058J804J485q8j061j429j755
3266a764r23P02J330J454J422M85j109j559j512r92M0J534J688J037P32n53j581
3283D31j794p65j77P32J973J600J55k81r23k044j146j01P81J522J866P21q63j012
3301F75j259j432m81R49J557J353J016P1j502j692j084m75K84J893J499O79J38
3318B189p87j808j466l91L31J133J856J110Pp33j386j768o97M10J137J366J513
$$ y = [1535, -336, -2073, -2902, -2166, -716, 1200, 2479, 2771, 1516, -203, -1691, -2714, -2334, -1114, 1008, 2254, 2644, 1989, 144, -1547, -2704, -2525, -1159, 758, 2187, 2715, 2016, 531, -1183, -2570, -2365, -1528, 333, 1952, 2775, 2194, 667, -930, -2296, -2764, -1696, 133, 1627, 2666, 2513, 940, -1052, -2092, -2577, -1991, -187, 1549, 2433, 2326, 1285, -339, -2073, -2361, -1778, -720, 1084, 2569, 2481, 1420, -9, -1764, -2687, -1985, -655, 799, 2221, 2706, 1597, 38, -1474, -2466, -2426, -892, 796, 1833, 2565, 2012, 431, -1363, -2128, -2305, -1573, 400, 2000, 2155, 1874, 951, -1093, -2239, -2340, -1559, -37, 1829, 2550, 1687, 675, -584, -2016, -2497, -1548, 9, 1362, 2378, 2449, 947, -745, -1829, -2304, -2020, -127, 1372, 2051, 2189, 1402, -406, -1872, -2263, -1932, -799, 1057, 2167, 2174, 1441, 55, -1713, -2410, -2000, -863, 503, 2016]
3335B016M88r63j182j513j004j45J429J284R51R69m37j705j236q44k69P06J859
3352D04J128O94k49j184j712j101n5N64J351J717P74m94r20j356j697l64J075
3369a425J140J381J258k66j236j161j089q40L74J496J250Q70L92p49j664j333
3385a602l10R3J117J515R43K39n83j312j480o85K75R08J415J179L47n41j183j394
3403a059r94K1J034J320J104N74l73j132j310j056r5P55J219J418O22j88j152
3420G08j425q91m43O33J273J347O70k5r09j363j178n87O60J044J414Q40J92p89
3438A171j642p72o64K62J008J375J059J22o47j263j193q42J69R45J379J282K36
3455A985o85j112j224q24J4J030J252J040N93o92r54j358p99l7N62J395J100N03
$$ y = [2016, 2504, 1541, 359, -1154, -2158, -2303, -874, 410, 1361, 2330, 1893, 188, -1048, -1892, -2161, -1455, 404, 1532, 2226, 1977, 793, -919, -2020, -2075, -1511, -160, 1557, 2331, 1837, 917, -439, -2136, -2500, -1425, -285, 1096, 2354, 2088, 852, -309, -1398, -2238, -1864, -368, 882, 1752, 2144, 1395, -269, -1602, -1912, -1819, -702, 813, 1756, 1995, 1412, 100, -1380, -2065, -1790, -882, 533, 1712, 2059, 1518, 335, -1059, -2053, -2032, -998, 322, 1426, 2000, 1627, 495, -815, -1871, -1966, -1211, 8, 1426, 2048, 1860, 708, -717, -1608, -2051, -1418, -145, 1202, 1872, 1847, 938, -425, -1603, -2190, -1530, -486, 928, 1768, 1960, 1171, -471, -1243, -1907, -1645, -637, 738, 1797, 1919, 1272, 9, -1184, -2026, -1857, -912, 467, 1749, 1985, 1300, 188, -1036, -1860, -1846, -816, 436, 1476, 2069, 1377, 423, -935, -1734, -1771, -1209, 186, 1286, 1789]
3473A789j00j041j357p91l04N02J223J341N57q1j006q57j387l51N13J230J076
3490I56R34j00r04j206j008m20Q3J278J142R08J96q04j284j091n29K26Q20J537
3508G34R84J63o35j226j186o28K16P31J160J129L92o28r47r28r65j60R75P75J164
3527A120P21l26j063j155n95m01O23J429P34L84K38j032j259p14k96K90J105J337
3545A140N83k87n41r91j305m13O08O45J305J029r6r89r41q73q43L44J258R82O75
3564A290M88o63j181r10m45r6R00J190O68L45k79j091j377m67K74O04Q77J245
3582A372L00o83n23j268r20J99O97R00J009O79m88j020p34q49m01O57J170R35
3600A032M86J63r47j253p27k40K05J149J010N07N4o52q78j219j69K83P79J099
$$ y = [1789, 1689, 648, -709, -1500, -1804, -1302, -79, 1262, 1819, 1738, 732, -125, -1512, -1863, -1350, -120, 956, 1890, 1790, 886, -320, -1328, -1748, -1665, -387, 755, 1663, 1859, 1055, -229, -1320, -1849, -1623, -803, 734, 1718, 1881, 1246, 20, -1166, -1794, -1578, -847, 313, 1442, 1834, 1206, 259, -669, -1634, -1794, -819, -44, 1120, 1841, 1515, 452, -703, -1298, -1699, -1076, 353, 1087, 1471, 1709, 677, -582, -1296, -1592, -1302, -197, 1140, 1723, 1436, 895, -96, -1401, -1814, -1206, -561, 744, 1773, 1677, 688, -253, -1126, -1969, -1625, -367, 615, 1290, 1778, 1115, -66, -976, -1421, -1517, -617, 573, 1241, 1586, 1307, 216, -1161, -1628, -1354, -750, 127, 1372, 1672, 989, 466, -802, -1722, -1523, -826, 74, 1083, 1762, 1274, 254, -480, -1329, -1730, -1073, 97, 1032, 1518, 1681, 734, -519, -1246, -1486, -1281, -132, 878, 1385, 1439, 787, -91, -1310, -1479, -1196, -417, 682]
3618F82R69k19p03p18j010p41L37Q92R76P16N12n25j174r05m54jN81J278P36K84
3638A513j57r21j425m45J25N02Q80J112J71k58o02j066p37o2O20O81R99P27m33
3657A224p06r77p46l51N72Q47Q57O52Qp15j134n12n21M01P81J045O88p4m92r85
3677a38j002k37J80P07J116O94Rn20q76p93n35Q0O26J128Q01L24m71r32j044m21
3697a304k4O29R74O91N07l80p83r66p27K4N79P98R21L08j20o81p95r40Q0K70R41
3718BQ15M21Rp33r31o82n6O3Q50J039M71J13o47q29r67l32N77M77Q72Q33M5o57
3740G53q25o82o19J44R10Q06O40L35n24j029o49n36J31N47R49P61J05o4r32j073
3760h52k66K4M67J017O74K36m45m48j005o12m3N07O27P86N29j55p81n22p04l06
$$ y = [682, 1651, 1432, 729, 11, -999, -1740, -1403, -511, 465, 1181, 1693, 1168, -6, -911, -1365, -1366, -785, 493, 1229, 1513, 1356, 435, -990, -1435, -1310, -808, 72, 1184, 1355, 1097, 495, -571, -1308, -1370, -750, -69, 930, 1657, 1224, 518, -459, -1205, -1556, -984, -137, 720, 1372, 1380, 665, -469, -981, -1502, -1101, -320, 725, 1413, 1339, 847, -138, -1140, -1377, -1197, -490, 626, 1320, 1329, 809, -67, -860, -1395, -1315, -689, 439, 1240, 1564, 1093, 161, -883, -1304, -1328, -699, 275, 966, 1473, 1093, 310, -656, -1383, -1359, -780, 18, 939, 1247, 1127, 446, -349, -1289, -1209, -939, 2, 817, 1238, 1247, 514, -417, -1099, -1155, -1092, -242, 797, 1268, 1381, 734, -95, -1062, -1394, -817, -340, 532, 1365, 1410, 753, -72, -754, -1373, -1229, -319, 487, 1127, 1462, 938, -91, -740, -1276, -1145, -598, 351, 1112, 1217, 1153, 221, -852, -1118, -1094, -627, 390, 1064, 1300, 855, 407, -598, -1210, -1253, -746, -119, 667, 1196, 1041, 260, -262, -966, -1272]
3780a272M40P09Q21L16J36n87j087n26k86J89R98Q91M70l5m52r06q40k14K70M38
3800e27J004P27m9o36l85q89n32J86O83O31O86L59l08r50o15n42L4O40R02N53
3820I72K51k21p94q92n03N0L96Q47Q91O6j82m73q22p75J30J72P94P81N16k17n64
3841D23o87p37k31L85R10M18N90J6m25q91o34m26K86P49Q55K99K72l50r26q12
3861i16k17K44M57P87O97J1l46n67p23n65J69M67O27Q49L49n86o43n41n46k10
3881a203P33P60N43L24k03o99r51q5m62M55Q52O02N03o2o31r49m38o2R0P38P82
3902F37L75j80k32q09p05k17M42N29O58O57j3m40p44p68k93K22N01Q93M33J12
3922A058l91q76m51k45R2L03Q91L30K87l11o93m69n22RM48P59O38K02j90o71o70
$$ y = [-1272, -832, -123, 698, 1014, 1150, 563, -524, -1050, -1336, -1147, -149, 742, 1212, 1177, 725, -181, -1021, -1235, -965, -527, 477, 1204, 1155, 519, 134, -755, -1287, -1101, -418, 213, 899, 1258, 950, 0, -615, -1157, -1123, -483, 419, 972, 1223, 1002, 208, -684, -1187, -1137, -741, 106, 997, 1063, 881, 408, -414, -1189, -1059, -887, -93, 688, 1204, 987, 423, -264, -1001, -1232, -847, 63, 481, 1071, 1087, 662, -229, -863, -1289, -1003, -254, 601, 900, 1172, 822, -104, -916, -1133, -889, -432, 355, 1052, 1063, 717, 150, -573, -1138, -969, -502, 125, 974, 1323, 737, 94, -447, -993, -1203, -470, 290, 833, 1157, 954, 255, -696, -781, -1243, -788, 64, 666, 1169, 1107, 476, -473, -911, -973, -883, -145, 637, 1012, 832, 600, -209, -914, -1131, -689, -160, 498, 1155, 1142, 702, -42, -810, -1103, -881, -380, 513, 946, 1058, 667, -209, -660, -905, -813, -510, 381, 711, 998, 687, -6, -475, -997, -988, -540, 219, 857, 1059, 869, 198, -472]
3943d72n00n6K52P78Q41K23k18m15r04m37l8K63N47O46N46j39n60o31l94m56L49
3964g75O20O56N53j98k93o85n27m08J54O62P02O62k58j56p91n66j73n1M51P92
3984C71M60k1k84m74o95l21J16M06P16L06L76n6o44q29j84l55O04O85M59K79n5
4005H60o70n14l68j74J10O52P89J09k2l14q58n05O9K54K83P02O54k41m30m61n86
4026f61l51L26O08N32N12J15m03q01l78l87J06P04M13M45K06m54o34n80j6j22
4046h20N19N16O86n2j26n77o32n35L92L01N09M54L18m34k73n91l54k55M59O75
4066A80K90N67k10n72o27m24j67K65Q24M47J25K53m60n76m76k54J56M03P27L71
4086H42j22j89n66o69j78M00L0P11N82Ln60k02n42n77K69M90O88J02L72j84p90
$$ y = [-472, -972, -1028, -776, 2, 843, 1066, 848, 433, -471, -908, -946, -683, -136, 510, 1056, 917, 357, -274, -668, -1124, -775, -155, 501, 1054, 856, 563, -122, -649, -1057, -903, -241, 461, 1123, 865, 709, -82, -648, -821, -872, -421, 371, 831, 810, 526, 52, -643, -964, -848, -442, 274, 580, 956, 900, 256, -573, -757, -1112, -508, 177, 636, 915, 860, 190, -324, -692, -866, -756, -104, 685, 794, 772, 458, -400, -905, -836, -582, -299, 403, 1057, 816, 386, -75, -661, -1012, -686, -78, 454, 966, 1081, 678, -123, -501, -888, -782, -78, 335, 780, 986, 532, -102, -682, -698, -820, -301, 215, 901, 849, 723, 146, -486, -1021, -629, -328, 181, 635, 953, 519, 246, -345, -699, -954, -495, 180, 470, 1037, 827, 255, -372, -796, -963, -698, 126, 573, 698, 951, 491, -85, -561, -815, -659, -256, 471, 842, 720, 531, -35, -704, -882, -482, -452, 259, 841, 844, 284, 82, -460, -1037, -768, -278, 410, 512, 884, 700, -90]
4107i0k53l95k3J87P78L52L57k73n66l99n89O8M36K24Q01J81k32l40m14m90j08
4128g88K13O85K43N38l1p06m02l76j88L38M05N72K73j31k68m22k75m98J81M05
4148b32O45M18j15j58n84m78l67L05L49M54N39K24m64n07m74l22J6M48N80L54
4168F31K87l18n78m65k43j9K79O75M4M69j21n32n48k81J7K26N08N51J58j13j67
4189D60o60l63j64K08N35M39L03p5k35m06o73k0QM86M59M02J03k55n96l60m46
$$ y = [-90, -343, -738, -761, -574, 204, 556, 913, 640, 74, -325, -914, -846, -410, -186, 615, 796, 564, 224, -190, -680, -788, -575, 110, 353, 891, 860, 154, -248, -624, -812, -474, -69, 503, 776, 645, 377, -45, -320, -818, -637, -232, 413, 831, 716, 558, -26, -504, -871, -566, -217, 237, 776, 1000, 536, 29, -445, -767, -751, -303, 277, 631, 918, 600, 22, -443, -686, -705, -426, 249, 293, 762, 641, 109, -439, -720, -703, -477, 31, 582, 740, 627, 460, -200, -563, -727, -519, 16, 455, 758, 683, 448, 42, -631, -651, -643, -157, 302, 704, 807, 552, -44, -404, -850]
$$ [...]
8190b2R
8191a3
##END NTUPLES=NMR FID
##END=
