##TITLE=1H_PR193_ph10
 D2O, 8 sc, 
 3.7.2020
##JCAMPDX= 6.0         $$ Bruker NMR JCAMP-DX V2.0
##DATA TYPE= NMR FID
##DATA CLASS= NTUPLES
##ORIGIN= UXNMR, Bruker Analytische Messtechnik GmbH
##OWNER= root
$$ XWIN-NMR		Version 3.5
$$ Mon Aug  3 12:11:49 2020 Russian Standard Time (UT+4h)  she@DPX200
##.OBSERVE FREQUENCY= 200.1314999998
##.OBSERVE NUCLEUS= ^1H
##.DELAY= (6, 6)
##.ACQUISITION MODE= SIMULTANEOUS
##.ACQUISITION SCHEME= undefined
##.AVERAGES= 8
##.DIGITISER RES= 18
##SPECTROMETER/DATA SYSTEM= spect
##.PULSE SEQUENCE= zg30
##.SOLVENT NAME= D2O
##.SHIFT REFERENCE= (INTERNAL, D2O, 0, 15.7039)
##AUDIT TRAIL= $$ (NUMBER, WHEN, WHO, WHERE, WHAT)
$$ ##TITLE= Audit trail, XWIN-NMR		Version 3.5
$$ ##JCAMPDX= 5.01
$$ ##ORIGIN= Bruker BioSpin GmbH
$$ ##OWNER= she
$$ F:/spectra/data/she/nmr/H-F/1/audita.txt
$$ ##AUDIT TRAIL=  $$ (NUMBER, WHEN, WHO, WHERE, WHAT)
(   1,<2020-08-03 12:10:38.53 +0400>,<she>,<DPX200>,
      <created by zg, POWCHK disabled, PULCHK disabled
       configuration hash MD5:
       00 E9 B6 7A A2 85 ED C7 34 08 36 98 17 FE 4E 26
       data hash MD5: 16K
       F9 6F 30 4A B3 B1 30 D1 CF 6D 76 A4 A9 8A 0B 29>)
$$ ##END=
$$ 
$$ hash MD5
$$ B8 DC 04 79 CC FA 93 38 A4 CA EF 87 74 1B A1 BA
##$RELAX= 
##$RELAX= 
##$RELAX= 
##$RELAX= 
##$RELAX= 
##$RELAX= 
$$ Bruker specific parameters
$$ --------------------------
##$DU= <F:/spectra>
##$EXPNO= 1
##$NAME= <H-F>
##$PROCNO= 1
##$TYPE= <nmr>
##$USER= <she>
##$AMP= (0..31)
100 100 100 100 100 100 100 100 100 100 100 100 100 100 100 100 100 100 
100 100 100 100 100 100 100 100 100 100 100 100 100 100 
##$AQSEQ= 0
##$AQ_mod= 1
##$AUNM= <au_zg>
##$AUTOPOS= <>
##$BF1= 200.13
##$BF2= 200.13
##$BF3= 200.13
##$BF4= 200.13
##$BF5= 200.13
##$BF6= 200.13
##$BF7= 200.13
##$BF8= 200.13
##$BYTORDA= 1
##$CFDGTYP= 0
##$CFRGTYP= 5
##$CHEMSTR= <none>
##$CNST= (0..31)
1 1 145 1 1 1 1 1 1 1 1 1 1 1 1 1 1 1 1 1 1 1 1 1 1 1 1 1 1 1 1 1 
##$CPDPRG= <>
##$CPDPRG1= <>
##$CPDPRG2= <>
##$CPDPRG3= <>
##$CPDPRG4= <mlev>
##$CPDPRG5= <mlev>
##$CPDPRG6= <mlev>
##$CPDPRG7= <mlev>
##$CPDPRG8= <mlev>
##$CPDPRGB= <>
##$CPDPRGT= <>
##$D= (0..31)
0 1.2 0 0 0 0 0 0 0 0.06 0 0.03 0 0 0 0 0.0002 0 0 0 0 0 0 0 0 0 0 0 0 
0 0 0 
##$DATE= 1596442237
##$DBL= (0..7)
120 120 120 120 120 120 120 120 
##$DBP= (0..7)
150 150 150 150 150 150 150 150 
##$DBP07= 0
##$DBPNAM0= <>
##$DBPNAM1= <>
##$DBPNAM2= <>
##$DBPNAM3= <>
##$DBPNAM4= <>
##$DBPNAM5= <>
##$DBPNAM6= <>
##$DBPNAM7= <>
##$DBPOAL= (0..7)
0.5 0.5 0.5 0.5 0.5 0.5 0.5 0.5 
##$DBPOFFS= (0..7)
0 0 0 0 0 0 0 0 
##$DE= 6
##$DECBNUC= <off>
##$DECIM= 24
##$DECNUC= <off>
##$DECSTAT= 4
##$DIGMOD= 1
##$DIGTYP= 9
##$DL= (0..7)
0 120 120 120 120 120 120 120 
##$DP= (0..7)
150 150 150 150 150 150 150 150 
##$DP07= 0
##$DPNAME0= <>
##$DPNAME1= <>
##$DPNAME2= <>
##$DPNAME3= <>
##$DPNAME4= <>
##$DPNAME5= <>
##$DPNAME6= <>
##$DPNAME7= <>
##$DPOAL= (0..7)
0.5 0.5 0.5 0.5 0.5 0.5 0.5 0.5 
##$DPOFFS= (0..7)
0 0 0 0 0 0 0 0 
##$DQDMODE= 0
##$DR= 18
##$DS= 0
##$DSLIST= <SSSSSSSSSSSSSSS>
$$ [...]
##$SUBNAM2= <"">
##$SUBNAM3= <"">
##$SUBNAM4= <"">
##$SUBNAM5= <"">
##$SUBNAM6= <"">
##$SUBNAM7= <"">
##$SUBNAM8= <"">
##$SUBNAM9= <"">
##$SW= 24.9337058888022
##$SWIBOX= (0..15)
0 0 2 0 0 0 0 0 0 0 0 0 0 0 0 0 
##$SW_h= 4990.01996007984
##$TD= 16384
##$TD0= 1
##$TE= 0
##$TE2= 300
##$TE3= 300
##$TEG= 300
##$TL= (0..7)
0 120 120 120 120 120 120 120 
##$TP= (0..7)
150 150 150 150 150 150 150 150 
##$TP07= 0
##$TPNAME0= <>
##$TPNAME1= <>
##$TPNAME2= <>
##$TPNAME3= <>
##$TPNAME4= <>
##$TPNAME5= <>
##$TPNAME6= <>
##$TPNAME7= <>
##$TPOAL= (0..7)
0.5 0.5 0.5 0.5 0.5 0.5 0.5 0.5 
##$TPOFFS= (0..7)
0 0 0 0 0 0 0 0 
##$TUNHIN= 0
##$TUNHOUT= 0
##$TUNXOUT= 0
##$USERA1= <user>
##$USERA2= <user>
##$USERA3= <user>
##$USERA4= <user>
##$USERA5= <user>
##$V9= 5
##$VALIST= <valist>
##$VCLIST= <CCCCCCCCCCCCCCC>
##$VD= 0
##$VDLIST= <DDDDDDDDDDDDDDD>
##$VPLIST= <PPPPPPPPPPPPPPP>
##$VTLIST= <TTTTTTTTTTTTTTT>
##$WBST= 1024
##$WBSW= 4
##$XGAIN= (0..3)
0 0 0 0 
##$XL= 0
##$YL= 0
##$YMAX_a= 208535
##$YMIN_a= -169200
##$ZGOPTNS= <>
##$ZL1= 120
##$ZL2= 120
##$ZL3= 120
##$ZL4= 120
##$ABSF1= 10
##$ABSF2= 0
##$ABSG= 5
##$ABSL= 3
##$ALPHA= 0
##$AQORDER= 0
##$ASSFAC= 0
##$ASSFACI= 0
##$ASSFACX= 0
##$ASSWID= 0
##$AUNMP= <proc_1d>
##$AZFE= 0.1
##$AZFW= 0.1
##$BCFW= 1
##$BC_mod= 2
##$BYTORDP= 1
##$COROFFS= 0
##$CY= 11.3945322036743
##$DATMOD= 1
##$DC= 2
##$DFILT= <>
##$DTYPP= 0
##$F1P= 16.9975609425685
##$F2P= -3.02152046262296
##$FCOR= 0.5
##$FTSIZE= 0
##$FT_mod= 4
##$GAMMA= 1
##$GB= 0.15
##$INTBC= 1
##$INTSCL= 1
##$ISEN= 128
##$LB= 0.24
##$LEV0= 0
##$LPBIN= 0
##$MAXI= 10000
##$MC2= 0
##$MEAN= 0
##$ME_mod= 0
##$MI= 1.114404
##$NCOEF= 0
##$NC_proc= 0
##$NLEV= 6
##$NOISF1= 3.799351
##$NOISF2= 2.8
##$NSP= 1
##$NTH_PI= 0
##$NZP= 0
##$OFFSET= 15.70392
##$PC= 1
##$PHC0= -9799.45
##$PHC1= 14.00093
##$PH_mod= 1
##$PKNL= yes
##$PPARMOD= 0
##$PSCAL= 0
##$PSIGN= 0
##$REVERSE= no
##$SF= 200.130013532006
##$SI= 16384
##$SIGF1= 3
##$SIGF2= 2
##$SINO= 400
##$SIOLD= 16384
##$SREGLST= <1H.CDCl3>
##$SSB= 0
##$STSI= 0
##$STSR= 0
##$SW_p= 3612.71676300578
##$SYMM= 0
##$S_DEV= 0
##$TDeff= 0
##$TDoff= 0
##$TI= <>
##$TILT= no
##$TM1= 0
##$TM2= 0
##$TOPLEV= 0
##$USERP1= <user>
##$USERP2= <user>
##$USERP3= <user>
##$USERP4= <user>
##$USERP5= <user>
##$WDW= 1
##$XDIM= 8192
##$YMAX_p= 0
##$YMIN_p= 0
$$ End of Bruker specific parameters
$$ ---------------------------------
##NTUPLES= NMR FID
##VAR_NAME=  TIME,          FID/REAL,        FID/IMAG
##SYMBOL=    X,             R,               I
##VAR_TYPE=  INDEPENDENT,   DEPENDENT,       DEPENDENT
##VAR_FORM=  AFFN,          ASDF,            ASDF
##VAR_DIM=   8192,          8192,            8192
##UNITS=     SECONDS,       ARBITRARY UNITS, ARBITRARY UNITS
##FACTOR=    0.0002004,     1,               1
##FIRST=     0,             0,               0
##LAST=      1.6414764,     0,               0
##MIN=       0,             -169200,         0
##MAX=       1.6414764,     208535,          0
$$ Real data points
##PAGE= N=1
##DATA TABLE= (X++(R..R)), XYDATA
$$ [...]
2060a270j837M96R14J950J899J000o07j753j900j557j98J393J949J776O04n14
2076B345j716j950j519J58J215J751J815N61n99j547j712j541J59J158J822J583
2092A983Q04q42j265j556j524l96J140K226J660K93k14j680k110j525N30R89K225
2109G38J379O67q40j493j563j403K39Q63J681J845P26r76j592j386j308j00R86
2126a537K336J672K85o35j731j822j260L43J322J790J237K77m86j401j715q58
2142b183j76R99K090J232N77n77j461j761j105R2R26J715J706K02n93j341j500
2159a158r64r1J219J506J497O35o71j685j733j046Q9J438J741J226M38p47j444
2176B50j574q84r0J403J570J459K29o69j768j367p57K95R17J391J693j08m21j478
$$ plain form
2060 -1270 -3107 -2611 -1697 253 2152 3152 2545 792 -1108 -2665 -2863 -1470 479 2255 2859 2345
2076 2345 629 -1321 -2840 -2682 -1467 284 2099 2660 2061 514 -1198 -2739 -2580 -1422 400 1983
2092 1983 2787 1945 680 -876 -2400 -2796 -1656 570 2230 2523 2309 629 -1481 -3006 -2476 -1487 738
2109 738 2117 2784 1944 451 -1112 -2515 -2276 -1413 268 2113 2839 1863 271 -1115 -2423 -2523 -1537
2126 -1537 799 2471 2756 2121 390 -1432 -2692 -2349 -1027 763 2000 2277 1791 390 -1325 -2183
2142 -2183 -2359 -1360 730 1962 2539 1962 501 -1260 -2365 -2273 -1347 368 2074 2276 1683 342 -1158
2159 -1158 -2122 -2213 -994 512 2009 2644 1973 288 -1445 -2491 -2402 -964 777 2003 2441 1694 250
2176 250 -1324 -2208 -2298 -895 675 2134 2363 1694 -74 -1441 -2198 -1903 -986 405 2098 1990 1569 91
2194I1j572o69P1J486J394J085L26n22j572j570q92L40J207J483J343J49r75j236
2212c3j540q08M86J047J434J262L57p39j504j490l99N4J235J438J095N55r04j554
2230hj695r23O69J261J520J216Q0j117j319j377k99K92J250J118Q68L31n10j313
2248D4j323p40K42J098J427J092J61p04j635r09p39M14J328J281P33J00j089r19
2266a38j324k70J90J007J172J154M8q34j076j473q32M37J466J445J083K2q82j719
2284e24j073m50N22J247J174P61J09q14j426j402J06L64J045J224Q20R0o98j326
2302b51j388m52P70Q77J555M23L69p72j359j055l59J69J525J333M16M3j099j175
2320d30q53m07J71J459Q84Q48n4n77j390j107l67L83J226J711J82k70n12j270
$$ plain form
2194 91 -1481 -2150 -2079 -593 801 1886 2212 1690 118 -1452 -2344 -2004 -797 686 2029 2178 1203 -33
2212 -33 -1573 -2381 -1895 -848 586 1848 2205 1466 -38 -1528 -1927 -1873 -638 800 1895 2450 1546 -8
2230 -8 -1703 -2626 -1957 -696 824 2040 2120 1003 -316 -1693 -1992 -1700 -450 668 1536 1867 1357 44
2248 44 -1279 -2019 -1777 -679 748 1840 2001 1297 -338 -1247 -1986 -1572 -244 1037 1770 1870 781 -138
2266 -138 -1462 -1732 -1542 -535 637 1791 1839 1005 -71 -1544 -2376 -1939 -473 972 2055 2077 1195 -524
2284 -524 -1597 -2047 -1525 -278 896 1657 1766 952 -474 -1876 -1770 -1406 -361 863 1683 1773 1075 -251
2302 -251 -1639 -2091 -1321 -444 1111 1534 1903 1131 -228 -1283 -1642 -1473 52 1385 1801 1844 745 -430
2320 -430 -1283 -1690 -1519 -60 824 1672 1618 1041 -349 -1456 -1823 -1440 -214 1497 1679 1409 897 -373
2338c73j213m37P43J376Q63O54P2j224r11j112p6N13J362O69Q78j10j027r50q59
2357a162m47K08J267R84P37K51j463j083o15k58N59Q21J237O71l77p24j167r13
2375a474l23M38J507P71O37j26n63j359r41j63P52Q69R39Q13m41j145o59r45N9
2394a354K94R94J284M86m46o86j212p27k83P49R23J030P74l43j107q98r06o0N38
2413i50J187P26N17r8q81j030q87J0M56Q82J122O20n40p72q90r22R3Q17O60R86
2433A106N03n13r79p01p17m4P74Q41Q19L88q2r38j043p78O8Q41P50P51P07o48
2453A105p07r90o21n7O43R72Q51QQj077j015o25J17N56J165R05J01k74q01n71
2473c07j127J96O20R72O01K28k38n75o74p28m25O68Q92R26K17J94r74j152o07
$$ plain form
2338 -373 -1586 -2023 -1280 96 959 1613 1685 461 -450 -1562 -1638 -1125 237 906 1784 1674 647 -303 -1162
2357 -1162 -1609 -1401 -134 850 1587 1838 375 -708 -1323 -1581 -1022 -201 1036 1707 1330 606 -561 -1474
2375 -1474 -1797 -1359 148 919 1556 1430 867 -492 -1433 -1596 -844 25 964 1777 1336 191 -468 -1413 -1354
2394 -1354 -1060 -66 1218 1704 1258 572 -640 -1367 -1650 -901 22 1052 1826 1483 376 -522 -1428 -1488 -950
2413 -950 237 963 1480 1382 501 -529 -1416 -1406 -950 -68 1054 1674 1134 362 -528 -1450 -1357 -540 120 1106
2433 1106 1609 1096 117 -584 -1301 -1345 -571 270 1089 1477 1395 457 -586 -1364 -1296 -455 295 1046 1753 1105
2453 1105 398 -592 -1213 -1270 -627 345 1196 1204 1212 135 -880 -1505 -1388 -832 333 1238 1339 1065 264 -307
2473 -307 -1434 -1238 -618 354 955 1183 945 370 -304 -1032 -1457 -789 103 1029 1246 1440 466 -686 -1293
2492a293L18N36P28Q08J70m55j039n37p00M18L81J252N66L23n65p72r45n30K39
2511a097N53R39O83M99r04p33o02k76j06N35J015N56J76k99q05r69o4j25J17J512
2531F05L45M36o93o95o96n57J77P29M65J104j91k07n45j078j75j66P03O81Q46
2550A088J45j45r02r06m72l5P03Q68P75j6l33n54p87p80M90O74O64N48q1K3r35
2571C2q20l52J48O35R37K54L43m58q08p14m50L60N49O43M12J75k09p42m70l93
2591i28k45N71P88O00O27q90l80r34m05J98N18R22K57M54j45q10q12n53K18O37
2611c12O91P79j68m39o26p33l04J52P10M02J131j87n87o14o17o40L35Q68M43N34
2631H18N75o22o31o86l79M28M47O45L38q0m64k13p48j07j94P73L89N14M6p6j028
$$ plain form
2492 -1293 -975 -439 289 1097 1267 812 -227 -764 -1464 -1046 -665 587 1153 1476 911 139 -806 -1336 -1097
2511 -1097 -544 395 1078 1577 673 -60 -662 -938 -1044 -509 506 1062 1238 939 134 -835 -899 -1024 -907 605
2531 605 950 1386 693 -2 -698 -1255 -1078 -349 116 1220 1029 822 277 -801 -976 -1142 -439 242 1088
2550 1088 1233 1088 186 -720 -1192 -1227 -524 344 1119 1103 770 216 -571 -1351 -861 -187 477 1025 944 967 32
2571 32 -788 -1140 -992 -357 580 834 1177 719 -89 -803 -1253 -893 -344 299 711 886 677 -65 -535 -928
2591 -928 -1173 -602 186 786 1413 523 143 -791 -1196 -998 -480 442 699 1153 1008 198 -614 -1167 -949 -312
2611 -312 379 1158 990 551 -75 -808 -1112 -960 -250 152 1283 1096 509 -105 -722 -1362 -1027 -159 284 818
2631 818 1393 771 140 -546 -925 -497 -50 595 933 853 389 176 -572 -679 -873 -100 289 803 849 773 -255
2652b55k98m25K47K36J170M15k77m34j89q23l74M16L61Q57K72j3l47o37o46k12
2672i56M54K74O93L02M87o90m47p03m55N2O82R07M00j45k41q99m93k02O63j03
2692d20M42P44J99k46o83n97k65L44L26J24Q25Q5k99p60q12N3K31M22R22J28R4
2713H57m79q20l03k86L35L60R16M71N6n13q16n30J05k69O25N41O36r2k94n18o07
2734f25l42L80P02J51O95k25j80p67p26j20M31O06N98K63j06j60j091j46k76L49
2754e89N86L58L81N2o57j58r78M37k17N54O58L38p4o2j036k82N7R8M82L63O09
2775I20l72j18o73o38J53K85N09M06qJ96k96l58m44Qj07K85O77o0j70j32m17j14
2797d68J01L8L90M10K6n5k80k36m99l4J30L56M33M59qn08k90n91l0k7Q99K50J36
$$ plain form
2652 -255 -553 -978 -731 -495 675 1090 813 379 190 -633 -1007 -591 -230 627 899 886 539 -98 -744 -956
2672 -956 -502 -228 465 767 1254 564 117 -586 -1041 -989 -307 600 1000 855 614 -285 -778 -980 -317 -420
2692 -420 22 766 965 719 36 -561 -826 -482 -156 -32 793 878 579 -181 -993 -940 -709 -287 635 763 857
2713 857 378 -442 -745 -1031 -696 -336 580 1051 1107 594 -222 -752 -647 -916 -291 250 886 794 500 -18 -625
2734 -625 -967 -587 115 266 961 736 556 -211 -937 -1057 -626 -20 578 841 735 575 -516 -662 -938 -589
2754 -589 -3 355 736 788 131 -27 -1005 -568 -785 -231 427 765 691 629 -407 -689 -632 -534 -52 311 920
2775 920 548 430 -243 -881 -728 -443 66 472 464 660 364 6 -438 -430 -537 -252 425 365 195 63 -354 -468
2797 -468 -367 -329 61 471 497 442 162 -74 -573 -607 -477 -121 312 771 763 255 -35 -626 -656 -683 216 466 602
2820F02j75N8m99o05j3M17J70L07K81j98q1m42k28n18N58K46M54L05p2l99m49
2841b81l30N2J37L66N27J89m0l42m58l13o0N8P67J50K28k07l33k87k69j18J14
2862d50O46oL76J16m84m03l75j66M6O14L86N35l84k81m59j34j3j76Q52J46o8o1
2884B57n8n09l04K5MO41J63M42k40l33l95j01l21N43M47m2K15l07k7l56m38L49
2906c45o7O42P5J22l37p6j54k81Q4J27O07K09l63K32l63k62n11OK24L50J03J99
2928B21K08m55l6n06R7L97J1O70j71k3n13m49j13L58J66J98J32K19j85q1n19J47
2950b27k81J18O57J41j3j18l84n4k2k94L15K43O71j84m70R4l43k32J57q8L81L63
2972D30LK75p19j54m35l0N19o3N66j1j06m83J16k81j04M01P7J97K04p1j35n79
$$ plain form
2820 602 427 485 -14 -619 -632 -215 -45 262 543 345 264 -178 -406 -924 -366 -120 334 639 567 168 -281
2841 -281 -611 -559 -422 -56 471 660 620 278 -180 -493 -553 -495 272 422 650 443 110 -177 -446 -564 -450
2862 -450 196 190 566 682 198 -205 -580 -746 -700 -86 300 835 451 170 -289 -423 -436 -612 240 386 318 257
2884 257 199 -310 -614 -589 -585 56 219 661 421 88 -307 -408 -729 -186 261 219 434 127 100 -256 -694 -345
2906 -345 -412 230 305 427 90 14 -140 -421 -337 -210 397 606 243 475 112 -150 -661 -655 -431 -81 22 221
2928 221 429 -26 -62 -568 -471 -74 -63 607 436 413 -100 -549 -662 -304 -138 60 192 411 226 145 -374 -227
2950 -227 -508 -390 267 408 395 277 -107 -161 -183 -477 -162 81 752 568 98 192 -151 -383 -226 -314 67 430
2972 430 433 708 -11 -165 -600 -630 -111 -174 392 381 275 -208 -92 -373 -477 -76 1 198 402 331 196 -383
2994c83l49L08O9M12L19n1J10k21n21k39K94L40O4L87J0k33k23m82l3Q9K43M01
3016C11O4K60m02k28j68j31k80N07J08L01J3J60l17o53kK73j14K67J26L17j04
3037C08k52l14k94M10l5Q4N07J52m56j20l78L28j87N7M96P7R4r9o09o3k56N6K62
3060b32L71Q3K62k80k75j01k97k38M55M29L73l65j15M8m37j51J79L77n3J19M10
3081E62j40p44k4J80j36J30K17N96o9k09l30j31n46K40L25o3O94j27K2j62m68
3102a83l87L46L64k4N97k97j7l98j75k33M9L13K39P3P2q4k30m91l32O13K32L63
3124D10k04K83K6l86m57k37K50jL29N01n47J07q2l5m11K92J02K24oL3k07j16k46
3147c78K7l2L11J55M79r1l67k79l68L70l7J39K03M93o07J19l46k29L3K85L9O4
$$ plain form
2994 -383 -732 -424 -355 57 376 325 435 214 -307 -546 -252 88 152 539 549 316 93 -389 -422 -333 -90 311
3016 311 375 635 233 5 -163 -294 -574 -67 41 342 355 515 198 -455 -457 -184 -298 -31 95 412 308
3037 308 56 -258 -552 -142 -177 -93 414 566 110 -10 -388 -60 -247 -190 306 383 477 378 -231 -294 -550 -494 -232
3060 -232 139 222 484 204 -71 -172 -469 -707 -252 177 550 185 70 118 -319 -470 -291 86 33 152 562
3081 562 422 -322 -346 -166 -302 -172 45 641 572 363 33 -98 -644 -404 -79 -142 552 425 447 285 -183
3102 -183 -570 -224 140 116 713 416 399 1 -174 -407 -358 -45 194 267 339 255 25 -466 -798 -185 47 410
3124 410 206 489 515 129 -328 -565 -315 -316 13 514 -33 74 -8 -43 -454 -162 -60 164 158 191 -16 -132 -378
3147 -378 -351 -383 -72 83 562 471 104 -175 -543 -173 -210 -71 132 625 18 137 -209 -438 -405 -120 -81 -17
3169a7L93j61k12j59j54j45R3N98J05K85k11l89j68N5l28R6L18K29j61J38N0l50
3191i5j39Q8j8M53j07J65L2k23l26k6O1l10L06K58L88j10q7n05n2r2J68J09J86
3214A24l5m3J42j97l26K04k49M43K99j19J01o33R1n6j37K74K91K84m71j14K95
3235A68m74J44m2k93J97N89O2j54k95M64p57K96Q4j83M03J13j26J80p08K1L33
3256B2M7j74M03lo6k81q0j20K71j26J70q8L52k93J61l24Q1p4j6j7K88Q2J75l70
3280B0j41j95J28Q8L33Q9j14j18L5j77j19J76j49J82J94j24j36P9l29J71k66K29
3302a44L25M0K20j84j91n7j99p5K75J64j81J11N0Qk16jr7n3j11P18j82k29L03
3325B94o18K17l96K85M36K41q9k02p9l62j6J69L1J19K39Q8q3l31Jj58j16j0M37
$$ plain form
3169 -17 376 215 3 -156 -310 -455 -362 236 341 626 415 26 -142 -87 -415 -319 -1 228 67 205 255 -95
3191 -95 -234 -146 -164 289 182 347 379 156 -170 -196 -135 -445 -139 119 507 397 310 -195 -247 -339 -171 -62 124
3214 124 89 46 188 -9 -335 -131 -380 63 362 243 344 -289 -198 -254 -391 -117 174 458 -13 -127 168
3235 168 -306 -162 -204 -497 -300 289 351 197 -98 366 -391 -95 -11 -194 209 322 196 376 -332 -311 22
3256 22 69 -105 298 295 229 -52 -132 -252 19 -107 63 -25 327 34 195 -129 -48 -122 -138 -155 133 215 390 20
3280 20 -121 -316 -188 -100 233 322 208 90 125 -52 -171 5 -144 38 232 108 -28 51 -278 -107 -373 -144
3302 -144 181 221 441 257 66 9 -190 -265 10 174 -7 104 154 162 -54 -55 -152 -205 -316 402 220 -9 294
3325 294 -324 -107 -503 -218 218 459 370 168 89 -273 -289 -120 -89 30 269 357 274 -57 -56 -214 -330 -340 97
3348I7j09J66p0O7j22l27K34K3j02L94j58J75k96J35k29j16J03L9J79J18n2n6
3370I3n57J85K83j33R8L0J51m3k47j03K82n45M51k10M70k45L46l2n46k06M01N2
3392b5%J81k01K99J1j92j09K79j20J67j67K18k54j99K8l19J56J34J38k7J22J30
3414B50om15j16RQ7K79J9j34M47l59k99J30p3K34q3N19l39R7l70K06j22r5L42
3437B08r1M70p34J06J82j88k41O2%K31J0J45N5l36P7j79J73n6K29K36k97k98L63
3460A27k21K9Q5N3j20K02p3j01J01m09K22m9K11K06r2K72l22j14M1j67L42k98
3482g5K84k69K26Q7l24J12l76M87j99o7M60m88K73j0j70n8k76K57j41K55j2Q4
3504F0%o0k40K31k8R0k1L14k35k32O5j5N5J93k58K09O2o9O4j56n61J85K51N7K3
$$ plain form
3348 97 -12 154 84 151 29 -298 -64 -41 -143 251 93 268 -28 107 -122 -238 -135 -96 83 201 149 93
3370 93 -464 -279 4 -129 -31 -1 150 107 -140 -243 39 -506 -55 -265 205 -40 306 274 -272 -478 -77 -25
3392 -25 -25 156 -45 254 265 73 -36 243 123 290 123 341 87 -112 -84 -403 -247 -113 25 -2 120 250
3414 250 244 -171 -287 -278 -191 88 107 -27 420 61 -238 -108 -181 53 -30 489 150 247 -123 83 -39 -134 208
3437 208 117 587 -147 -41 141 -47 -288 -226 -226 5 15 160 215 -121 -44 -223 -50 -106 123 359 62 -236 127
3460 127 -94 -65 20 73 -47 155 82 -19 82 -327 -105 -154 57 263 171 443 121 7 48 -119 223 -75
3482 -75 209 -60 166 253 -71 41 -335 152 -47 -114 346 -142 131 121 -49 -107 -383 -126 -267 -12 -24 60
3504 60 60 0 -240 -9 -37 53 32 346 111 -121 -56 -71 -16 177 -81 128 190 121 185 29 -532 -347 -96 -39 -16
3529a6j06J61k80l6L0j68J11K76K31j85j20J99l06P1PK0J61j29Q0J17j1j59j39
3552a91J0L77k16O1j13L18k78j3N0j96RP6Q6J89j80J26j99j00o0K17J05p7L3J15
3576A49j67l14M06j55Q4M1l2K64k94k71Q9J66J89j30j18L55j08j26P7k2p9q7m8
3599a31O8P9L27l14J84r5j60l40M53J40K5j53o9m9k2j2L26k73o1j88L15K06j95
3622F1l2Rm7Q0k0r3l1K44k41J58m87N97O6j93j1k4l69L92r8q3O7j8K32k07J58
3647A10J3l76L36J0j16l05L24j01K07p5L91l80k08J03R9q0K68j46j78J31nJ11
3669A33l93K98N7p0j48L00o2O0k42J63o3j24o1L40r2k75J98r1K48j22m6J64l2
3692A40j65k4L9J59k34N6K52k32r2K11l4m7l3lJ0M8l03L95j74J53o9j98R4k64
$$ plain form
3529 -16 -122 39 -241 -277 -247 -415 -304 -28 203 18 -102 97 -209 -138 -131 -111 50 -79 1 118 107 -52 -191
3552 -191 -181 196 -20 41 -72 246 -32 -45 5 -191 -182 -106 -20 169 -11 115 -84 -184 -244 -27 78 1 34 149
3576 149 -18 -332 74 -81 3 44 12 276 -18 -289 -200 -34 155 25 -93 262 154 28 105 83 4 -83 -131
3599 -131 -63 16 343 29 213 118 -42 -382 71 211 236 83 14 -35 -57 -69 257 -16 -77 -265 50 256 61
3622 61 29 38 -9 71 51 -42 -73 171 -70 88 -399 198 264 71 60 36 -333 59 -39 -122 -55 -73 159 -48 110
3647 110 123 -253 83 93 -23 -328 -4 -105 102 27 418 38 -170 -67 32 -48 220 74 -104 27 22 133
3669 133 -260 38 95 25 -123 177 115 175 -67 96 33 -91 -152 188 96 -179 19 -72 176 54 8 172 140
3692 140 -25 -49 -10 149 -85 -29 223 -9 -101 110 76 29 -4 -7 3 51 -252 143 -31 122 53 -145 -51 -315
3716c15J38J38K59l13L1k44K67j16J08J31j06L08k03r7k12K43n1M5m1N0l4l0j02
3739a46K11j28K2K17K07l39J07m18L47J52k90K0Q6Kk87L17p9K47p53N21j10J13
3761A9j98J01K52l62J87M3o7J31j69J8K90l6o7l30K97j11m8K50l6j57J06m0l93
3784c20L47%l9J02J22o72N39j9m9J57k9j59K44Plk35K6k80J30q7K96J17j85N1
3808F1j91K36l34ML33km9l21J73n7L24p3k70J96k1k29L68j07j24J85j1J27k80
3831f2o1N3o7P1K8L7m11J76l5L60k17J53j26L33m01L40l78J57K26j10J10l89L72
3854A59k87L57j19R2k42J12j45j84M41k43L62q1p2l1J21k01o7l6P5P0l24J68j12
3877a87L28n5K2j69P8k59L27j72J94o4Lj28K20Q5q5j18pN7k95J64K5k2J29pm80
$$ plain form
3716 -315 -177 -39 220 -93 -62 -306 -39 -155 -47 84 -22 286 83 -14 -226 17 -34 11 -30 20 -14 -44 -146
3739 -146 65 -63 -41 176 383 44 151 -267 80 232 -58 -38 48 50 -237 80 1 248 -505 16 -94 19
3761 19 -179 -78 174 -188 -1 42 -25 106 -63 -45 245 209 142 -188 109 -2 -50 200 164 7 113 73 -320
3784 -320 27 27 -12 90 212 -460 79 60 11 168 139 -20 224 231 228 -7 19 -261 -131 -218 78 195 10 61
3808 61 -130 106 -228 -224 109 107 58 -263 -90 -147 177 104 -166 30 9 -220 148 41 -83 102 91 218 -62
3831 -62 -123 -70 -137 -66 -38 -1 -412 -236 -271 89 -128 25 -101 232 -169 171 -207 -50 176 66 176 -213 159
3854 159 -128 229 110 202 -40 72 -73 -257 184 -59 303 222 150 119 240 39 -28 -64 11 81 -243 -75 -187
3877 -187 141 86 108 -61 17 -242 85 -87 107 43 46 -82 138 223 138 20 13 70 -225 -61 -36 -58 71 64 -416
3902d16N16l1k41J61L4N1J2l4m6L03l08k46K21J17Q1p5j15J89l77J27J75q5k9
3925a6K6N3q2j87K4J69K91k39r5q9Q6L3k22J8J74j09M26l30P1J42l1l51O8J02
3949f8j60M47k91J44k15J07J47j69M19n22K5K76M8M3j51j05M9j38o8R1J73K05
3971B87m31O4P1L10j42j25J18K0m82J20J30K3J63l62J84K1K30l40L09j57J15k42
3993a16k08N3J43J50j20L8K48l47K13q6j63K10O0k20J12L80m25N3k9j60N1K73
4015A10o7J02k53K45J05l98l3N4N6J46j37J9J52k0mL9k09J35J11o2m8k97K30L05
4039B81R3o87O63k14m61K92jK26l14R5j40K73j15j55K44o3J51k31J64k58j3J80
4061A0m2J10j67k08K87L55n79J85Q3R3K3j89R3j4J11l38K10l31K90J72k41o9K29
$$ plain form
3902 -416 100 69 -172 -11 23 74 86 52 6 309 1 -245 -24 93 174 99 -16 173 -204 -77 98 13 -16
3925 -16 10 63 -19 -206 -182 -13 278 39 -56 -145 -59 -26 -248 -230 -56 -165 261 -69 2 144 113 -238 -170 -68
3949 -68 -228 219 -72 72 -143 -36 111 -58 361 -161 -136 140 188 231 80 -25 24 -114 -182 -91 82 287
3971 287 -144 -80 -9 301 159 34 152 172 -310 -190 -60 -37 126 -236 -52 -31 199 -141 168 11 126 -116
3993 -116 -324 -271 -128 22 -98 -60 188 -159 54 -32 -195 15 75 -145 -33 347 -78 -25 -54 -214 -163 110
4015 110 43 145 -108 137 242 -156 -189 -135 -79 67 -70 -51 101 81 77 116 -93 42 153 91 43 -254 -24 281
4039 281 374 -313 350 136 -325 -33 -34 192 -122 -27 -167 106 -9 -164 80 17 168 -63 101 -157 -170 10
4061 10 -32 78 -89 -297 -10 345 -234 -49 34 127 150 -39 54 40 151 -187 23 -308 -18 154 -87 -156 73
4084G3j92m0J59J08q6J22k9M5P1l9Pk41j6k61M86r9j37J06j73j52Q7L77n8J19
4108B37j50q7j7l1M1J00j13N0k12O17l87K12k26J75L7k56p2p1K84j05j93o0J09
4131a18J5K86J67j80m8Ol55J28mk9R9J15k78K35qm9k03K6m7M64k21OJ56N5l63
4156a45J75o7K72k21k2J47J93k63k27K57l48K49J94k13j84N8K56k13j6J54k45
4177b09L54n23J59J48K38qj95l06L52M5j76M24j24l12p0J2Q3L8J55j92R6J52k1
4200A20q4o6J0r2L67m18L73r9j91k42M0K38J20r6P8q1J05j70j29O8Q1j39J71M5
4224Im2M19k16r7j76J0R3L51m75Q8J94l7L07n08rk80P72m24J8R8j26%J14j57K31
4249A57N7k64M7J46K14m15O9J29j54J26j89Q8J41j94J99j82k86O4N14n07L22j77
$$ plain form
4084 73 -119 -159 0 108 22 144 115 160 231 192 199 -42 -58 -319 167 68 -69 37 -136 -288 -201 176 118 237
4108 237 87 0 -17 -48 -7 93 -20 30 -182 435 48 260 34 209 246 -10 -82 -153 131 26 -167 -227 -118
4131 -118 -103 183 350 170 122 128 -227 -99 -103 -132 -33 82 -196 39 31 -18 -221 -195 -242 222 1 7 163 218 -145
4156 -145 30 -37 235 14 -8 139 332 69 -158 99 -249 0 194 -19 -203 -145 111 -102 -118 36 -209
4177 -209 145 -378 -219 -71 167 159 -36 -342 10 55 -121 303 179 -133 -203 -191 -108 -70 85 -107 -11 141 120
4200 120 36 -30 -20 -112 255 -163 210 111 -80 -322 -282 -44 76 -20 58 -23 82 -88 -217 -149 -68 -207 -36 9
4224 9 -33 386 170 73 -103 -93 0 351 -124 -36 158 121 428 -80 -89 -369 403 -21 -3 95 -31 -31 83 -74 157
4249 157 214 -50 -3 143 357 -58 11 140 -14 112 -77 11 152 -42 157 -25 -311 -247 267 -240 82 -95
4271i5j19m5L44n3k38M13j98p1J08r1r1j72j2m6M63k51J88J66k81j03K5j72J68
4294a63M13o8o2R4k85l3J77L1j47l5j9M02o73P3M74m15M06LjQ5k69k9j7P9k83
4319b62J22M13J2l60K20L7m9k30j92K99j26J44J62q9l11P4K55q5k78K68m9K1j18
4342a22Q6k43M86m18P2K43k40M64k77K40l55J43k11J0Ok37J63J08o1J02L37l70
4364g4p8J80K46k51K7k1%m35K07K28J59j7k5k4k33J23L6l97M38J81j86n6nj38
4388a15K68k15j27J99LJ1J61j0k17k7j89L03J26l28L35j75j6j30j0p1J28j71L16
4411D9Q7N3k25r8J14K0j83J49K33l33J71K11k92J9j98J60j30J58P0J64K28q30
4433d03L02J12K1j27K20o6qk37J99j28O4nJ94j92M29k89q1j50J8K45k94Q3n0J51
$$ plain form
4271 -95 -214 -259 85 32 -206 207 9 -62 46 -45 -136 -308 -320 -366 97 -154 34 200 -81 -184 -159 -331 -163
4294 -163 250 182 120 214 -71 -104 73 104 -43 -78 -97 305 -368 -295 179 -236 170 173 172 257 -12 -41 -58 21 -262
4319 -262 -140 273 285 -75 145 182 133 -97 -289 10 -116 28 190 101 -210 -136 119 34 -244 24 -25 -4 -122
4342 -122 -36 -279 207 -211 -139 104 -136 328 51 291 -64 79 -132 -122 -116 -353 -190 -82 -143 -41 296 -74
4364 -74 -152 28 274 23 50 29 29 -406 -199 29 188 171 146 122 -111 12 48 -349 89 270 84 28 23 -115
4388 -115 153 -62 -189 10 13 24 185 175 -42 -69 -258 45 171 -157 178 3 -13 -143 -153 -224 -96 -267 49
4411 49 136 189 -36 -134 -20 0 -183 -34 199 -134 37 248 -44 -25 -223 -63 -193 -35 35 199 427 -403
4433 -403 -101 11 32 -95 125 59 51 -186 13 -115 -51 -56 138 -54 375 86 5 -145 -127 118 -176 -93 -143 8
4457Hj22J86M3j91J46j8Q3k36K9K47m30K7L90j74J1k51J95K37L1J37j83k40P4
4480an2K6L0J01O7k71J15J36l45K33j61J16L15l75K9j19K52l02J76J65j17L14
4502C32j38l5l82K59n3k25j09L77K56l8j7m24r1J07J10J99j34K60q0k30K26k36
4524f6J7l05L22K46k58J62l2k05r0J03m4L1J00K26j45m2J79k70K29p0j72K27j35
4547HL57m41P0j3O9q5j64M73j06J82l12K15n68K68J24O8k14P9K03o4k12j6k83
4570c62J28M03l98N28m2l35nK3k71K94j82N50n40k3J49l6L7KK24j13n8K7L33l61
4594b8J03j10j5j39L50q5M8j57j03J96J22k38j09J32j31K20k8q0J31j42J07M6
4616I0l92K27n9K4J27J22m51L13j34k8J49j70J83j20L2j68J18K09J81j09k08L44
$$ plain form
4457 8 -114 72 115 -76 70 52 135 -101 -72 175 -255 -228 162 -12 -1 -252 -57 180 211 348 165 -75 -1
4480 -1 -53 -27 3 104 171 -100 15 151 -194 39 -122 -6 309 -66 -37 -156 96 -206 -30 135 18 332
4502 332 194 159 -223 36 -17 -242 -351 26 282 244 227 -197 -288 -181 -71 128 -6 254 174 -56 170 -66
4524 -66 -49 -354 -32 214 -44 118 86 -119 -209 -106 -150 -119 -19 207 62 20 199 -71 158 88 -84 143 8
4547 8 365 -76 -6 -19 50 -35 -199 274 168 350 38 253 -315 -47 77 145 -69 10 213 149 -63 -79 -362
4570 -362 -234 169 -229 299 257 -78 -83 -60 -331 -37 -219 331 -209 -232 -83 -119 -82 -80 144 31 -27 0 333 -28
4594 -28 75 -35 -50 -189 161 76 124 -33 -136 60 182 -56 -165 -33 -164 56 28 -52 79 -63 44 90
4616 90 -302 -75 -134 -110 17 139 -312 1 -133 -161 -12 -182 1 -119 -87 -255 -137 72 253 144 -64 280
4638B80n55J58k22J87N5Q3j87M18k75P7J00k47K26k78L23j1o8J21l68K15k03Q1
4660i0j98O9J51K31J05j62j74J41J32l36L40l15K51j91k4J2j93L83j50N7L8k4
4682E3k24K9K11m62j11L67J7J93n8J67N0n99K88o0L68j04J39k16k02R9K7k61K9
4705b60M36k44K48k77J4k3j63N2L81k57K56L6l27J91k64M5J11k95m7L34j9K4L30
4728B82m62J03J88o4K63j79J46j36k31K90j90k6r6o4K61M5lj56M6Q5l47J49r0
4751a86J02M59l07J83o0k42j35k04M55Qp0j96K6Jr5Q2K52k72J21J97j66N8L34
4774C45m01k75O26j77k04j01L73j57J58j63m33N34k35j8K49l08K83K5j5j6m2j5
4796C3J14J21k94r4j82R2R8p7K96J4J14j75M5k60O5o8O0R3K51l96J13j21J52J7
$$ plain form
4638 280 -275 -117 -339 -152 -97 -14 -201 217 -58 19 119 -128 98 -180 143 132 64 185 -183 32 -171 -90
4660 -90 -288 -219 -68 163 268 106 -68 73 205 -131 209 -106 145 -46 -70 -58 -251 132 -18 39 77 53
4682 53 -171 -142 69 -393 -504 -137 -120 73 15 182 232 -367 -79 -139 229 125 264 48 -154 -55 -28 -289 -260
4705 -260 176 -68 180 -97 -83 -106 -269 -217 164 -93 163 199 -128 63 -201 -156 -45 -340 -387 -53 -72 -48 282
4728 282 -180 -77 111 47 310 131 277 141 -90 200 10 -16 -112 -176 85 130 127 -29 17 102 -245 -96 -186
4751 -186 -84 375 68 251 191 -51 -186 -390 65 73 3 -193 -167 -166 -261 -179 73 -199 -78 119 -47 11 345
4774 345 -56 -331 295 118 -86 -187 186 29 187 24 -409 125 -110 -128 121 -187 96 121 106 90 48 33
4796 33 147 268 -26 -120 -302 -210 -112 -189 107 121 235 60 105 -155 -90 -158 -98 -5 246 -150 -37 -158 -6 11
4820A1K75k3l78Q7Q8J34k28j39l4K34k88K04q5j22L85m1j33l6J60j06J94j63j57
4843a61K98k29m7j38j4K36K24j90M0j41Q0J7J2J18j32J38k03L62k85pK91l45K88
4866B12k65K78j51O5k8rl1P7R9n80J01L17L09l28q5J04k7l10J78r5J97j1rL63
4890C71m79K09l29J98n7J61k9K5J33n11M43j32m85O86j01J05j40j30Mq0L60r0
4912A32l01K49j55K36j91J59j70N7J89l07J79O6p8l3J2j43K10n7J9j82K9J05n3
4935b8K21k66J26J13j19j7j30K16l21j54K62K01J04k24j66M34j21l20n9K47j82
4956a83K37k93M36J49l22O2k62J26K18j35L12j40J6j05j81J32j30m9q3J45J92
4977A42l66L85j62J4J7k87K9K16R8k2n9K3J33k52j34L05P2P8k47J68l53J25J41
$$ plain form
4820 11 286 263 -115 -28 60 194 -34 -173 -207 27 -261 -57 -142 -264 121 80 -53 -89 71 -35 159 -4 -161
4843 -161 137 -92 -139 -277 -291 -55 169 -21 19 -122 -42 -25 -13 105 -27 111 -92 270 -15 -22 269 -76 212
4866 212 -53 225 74 139 111 102 71 148 247 -333 -232 85 394 66 -19 85 58 -252 -74 -169 28 17 8 371
4890 371 -108 101 -228 -30 -87 74 45 70 203 -308 135 3 -482 204 103 208 68 -62 -58 -138 222 132
4912 132 -169 80 -75 161 -30 129 -41 16 205 -102 77 143 65 32 44 -99 111 54 73 -109 -80 25 -28
4935 -28 193 -73 53 166 47 30 -100 116 -205 -359 -97 104 208 -16 -182 252 131 -189 -248 -1 -183
4956 -183 54 -239 197 346 24 86 -176 -50 168 33 345 205 221 116 -65 67 -63 -112 -195 -50 142
4977 142 -224 161 -1 13 30 -257 -228 -12 86 64 5 28 161 -91 -225 80 152 230 -17 151 -202 -77 64
5000F4J23j21k02j11M91j16P2k58j47J39J3o5L19j82k40L94j58k97K13Q7L38k30
5022A26l8m7j59j8L59k97K62m71J91L37J46p9l36O4k86O2R8J16J49J5j58L5l22
5045b51L89J61%k63j74rK7J22M2j48r5K05m4L84p1r4l41J33K60k74J97P2l03J24
5069D9lkj24J4Q2R8k08J72j6J36k15l03K33K24k5Q7j98k3j56M51k15l48J72M36
5093C18l40K17k73K83k94m8J70K46k83Q4L29o83K19j9j89M18k25K27j03N6K16
5114C26n04J44O3q8j2L75k13k85J33J53M2m05K43j38r8M67P8l41L39m36Q1K2p5
5137a29J11K5J33J01j91k47K63J58o2k29q4K48k86L5K97q9R1q0Lp2J85p2j99J22
5161C2l52N26m08M0k45N58q2k11J66j95q3L06J89j56J54l31M8Q2j77J84N8%J51
$$ plain form
5000 64 187 66 -136 -247 244 128 200 -58 -205 -66 -53 -118 201 19 -221 173 15 -282 -69 18 356 126
5022 126 88 41 -118 -136 223 -74 188 -283 -92 245 391 312 -24 40 -246 -184 -86 30 179 194 36 71 -251
5045 -251 138 299 299 36 -138 -147 -120 2 44 -104 -199 6 -38 346 275 181 -160 -27 233 -41 156 228 -75 49
5069 49 46 44 -80 -66 16 114 -94 78 62 198 -17 -320 -87 137 112 199 1 -22 -178 273 58 -290 -118 318
5093 318 -22 195 -78 205 -89 -137 33 279 -4 80 409 -274 -55 -74 -263 155 -70 157 54 110 326
5114 326 -178 -34 29 -59 -71 304 91 -194 -61 92 134 -271 -28 -166 -264 203 281 -60 279 -157 -76 -54 -129
5137 -129 -18 7 140 241 50 -197 66 224 162 -67 -151 97 -189 -154 143 54 145 65 68 -4 181 109 -90 32
5161 32 -320 206 -202 -162 -407 151 69 -142 24 -171 -254 52 241 85 239 -92 -44 38 -139 45 103 103 254
5184B54q6l9l04K09l6k71J35J37K31j27O5j98n1J28k00J96L16m23K06o6r4J94
5206A76l14K0L14j79J96k88J04l7m53L40j01K67m5j57O17j57j90l34j80L89L22
5227C10l84l6L49k10j3j71K70j32q3J9J01j82L47p5j44Q4ML24o03N5K4o0J41k39
5251c04MK06K18k0r2m3J79l41R3m1J78n5n4J52q1m4K03l97j18L58K07j25J23R2
5275B98j60j07J36k75R9M9m47O01j58J69k48J00j35j3p9M47l72K47k85J0j5O1
5297g7j57L14l47M77j60j76%J92j79r7N5M54r2j57J12j03j22rJ91r1JR8J47p0
5321B04k57J56j79J65j43J61l0J00j5m33M41k71L00k54N3K38j89k3O9l22J47J01
5343A9r4J6J42l2K27J6l11n4rL02L1j22l87L69j21j47J7J76r1N51o93L72L3j05
$$ plain form
5184 254 168 129 -175 34 -2 -273 -138 -1 230 103 168 -30 -81 47 -153 43 359 -64 142 76 -18 176
5206 176 -138 -118 196 17 213 -75 29 -8 -461 -121 -222 45 0 -157 460 303 113 -221 -401 -12 310
5227 310 -74 -110 239 29 16 -155 115 -17 -100 -81 20 -162 185 110 -34 50 54 378 -225 -170 -146 -206 -65 -304
5251 -304 -300 -94 124 104 12 -31 148 -193 -100 -141 37 -18 -72 80 -1 -45 158 -239 -357 1 208 83 206 298
5275 298 138 31 167 -108 -9 40 -407 194 36 205 -43 57 -78 -91 -170 277 -95 152 -133 -123 -138 -77
5297 -77 -234 80 -267 210 50 -126 -126 66 -113 -210 -155 299 207 50 162 59 -63 -72 119 28 29 127 274 204
5321 204 -53 103 -76 89 -54 107 77 177 162 -271 170 -101 199 -55 -2 236 47 24 93 -229 -82 19
5343 19 -75 -59 83 51 278 294 -17 -71 -80 222 253 131 -256 113 -8 -155 -138 38 -53 498 -195 177 210 105
5367A05r6k28M15l7q3P5r1nk44Q3L07j78ON9P6j18j59l3l0K1K3J83l6j76m0L92
5393A91j88Jj29rJ80l9l6kR7p4l96J9M62k31N0J02j8J56j84k43l1K07L17ok35
5418c9J19m38N00l07K27K70m52j67L19o5r1J40J78l71L60P6o8k07Nr8j38J67r2
5441a72J54j27l7K47J79j26o0j4k03R3l6O3K02r9l3L8j12K70k63Ro0K44j08j35
5465h6k86K96j73N66k62J24j8j89j5K75n10J90J12k27J81m0R2R8j01j43L1J43
5487E8j5j72J27J65m19J89J21K4j44L72j13k58L67k9l55lpm0J07M18r1j46p9J3
5511I0m7k87P9L77l15K19k10j41j52M06j77Q2jL2K08j11j40n0J49j28J89n3J45
5534A64J58n11J02J48k33J54R3j33J43N6k28J74q3J48l88KJ14K21Q3j80K1j73
$$ plain form
5367 105 9 -219 196 159 76 151 60 55 -189 -106 201 23 29 88 164 46 -113 -146 -176 -155 -132 51 15 -161 -201 191
5393 191 3 4 -125 -134 46 7 -29 -31 66 -8 -404 -385 77 -154 -104 -2 -20 136 -48 -291 -322 -115 202 196 -39
5418 -39 80 -358 142 -165 62 332 -120 -287 32 -33 -124 16 194 -177 183 259 191 -16 -11 -109 -247 -80 -172
5441 -172 -18 -145 -182 65 244 118 58 44 -159 -66 -102 -39 163 64 31 69 -43 227 -36 -27 -87 157 49 -86
5465 -86 -372 -76 -249 317 55 179 161 -28 -43 232 -278 -88 24 -203 -22 -62 30 128 27 -116 -85 58
5487 58 43 -129 -2 163 -256 -67 54 78 -66 306 193 -65 302 273 -82 -85 -92 -132 -25 393 302 156 77 90
5511 90 43 -244 -165 212 -103 116 -94 -235 -387 19 -158 -76 -77 -45 163 52 -88 -138 11 -117 72 19 164
5534 164 322 -189 -87 61 -172 -18 75 -58 85 141 -87 87 4 152 -236 -234 -120 101 184 4 25 -148
5556a48K26K5n1n3m3J25j37j91K47j80p8J60j05L85j68n4j02P9k0M5k7M12k19
5579A28qJ53M5m68P1Q0J64N5l94j32L01L9J03k76j59N51j60j38K63j35o9j34j4
5602a34O6j84K35J26j34M2%j80J32R0l12K20O9J07l42k3L64k80p4P6L24l58O9
5625a01k6K15J8j15j66K39r8N1J03L0r1k34J07j2o0j0N72m00n8j7r0J66j23k46
5649c46K76J82J38m06L21n1k82j41J52K68R2l3q6k7o0j00r2K80L11n78l7K93k83
5672b09J26Q6O0j63L1k78L08j7j69L22k35K20L3K9m5n9N0r5K0k00K8J46L4K35
5696B58j56k97NL85k08K9J71j15m3J26q6l5j92N43l41N4k78L41q2Lk42J96J43
5719A79l42J26M1K19k17k44K75L3j42k68K92J8k00K55j08J87l66L83j04Q8j8p1
$$ plain form
5556 -148 78 103 52 -1 -44 81 -56 -247 0 -180 -258 -98 -203 182 14 -40 -142 -63 -83 -38 -65 347 128
5579 128 120 273 318 -150 -79 1 165 220 -174 -306 -5 34 137 -139 -298 253 93 -45 218 83 14 -120 -134
5602 -134 -68 -252 -17 109 -25 17 17 -163 -31 59 -253 -33 36 143 -199 -222 142 -138 -212 -136 188 -170 -101
5625 -101 -127 88 106 -9 -175 64 -34 17 120 150 59 -175 -68 -80 -140 -150 422 22 -36 -53 -143 23 -100 -346
5649 -346 -70 112 250 -156 165 114 -168 -309 -157 111 203 170 84 57 -3 -103 -195 85 396 -182 -219 74 -209
5672 -209 -83 3 63 -100 -69 -347 -39 -56 -225 97 -138 82 115 144 99 40 90 -5 15 -185 -157 -11 23 258
5696 258 102 -195 -190 195 -13 16 187 72 29 155 69 34 -158 385 44 98 -180 161 79 82 -160 36 179
5719 179 -163 -37 4 223 6 -238 37 70 -72 -340 -48 -30 -230 25 -83 104 -262 121 17 105 87 16
5741A6j08Q3j70j7L74k49l4K20j40J80k6j71kk56K45J67o1N3J89j59j34L1k22
5764a91J35l3j6K53p1R9j41Q7l46Q8K30k77nJ09K13k74K99j35k72N23l24K73l35
5787a11j75M61j51l5k57J99K0M7k9L03j43K2j35k20L06K7Pm68L58J8j73j13J53
5810h9J16Q3j49N3L84n28J56l5j60N0r0L66k88K07j43K24j38j07L8k26J59K85
5832A68k8k86M7J36r1Qj05L03l0J52j82l42K88l71L80p8J44j7q7J52j6k66N3P2
5856DK8N7PQj02j61j9M32l23J34j12P3L83n68O5k27M16j56K04j15j43J30j58K20
5880G7p5l1k34M14J50k68K63l43Q0k91J5J88L52R6n48j6K51R0m5J2k16m8L20k01
5904hm0K32m2k80J25K41J2%m70M15j41j48M84m41k39K07J87J22l58J09p4J07l79
$$ plain form
5741 16 -92 -9 -179 -196 178 -71 -105 115 -25 155 129 -42 -44 -300 -55 112 51 104 293 134 0 31 -191
5764 -191 -56 -89 -105 148 77 176 35 122 -224 -136 94 -183 -188 -79 134 -140 159 24 -248 275 -49 224 -111
5787 -111 -286 175 24 -11 -268 -69 -49 -2 -31 272 129 151 16 -204 102 129 136 -332 26 44 -129 -242 -89
5810 -89 27 110 -39 14 398 -130 26 -9 -169 -119 -209 157 -131 76 -67 157 19 -88 -50 -276 -117 168
5832 168 140 -146 -99 37 -54 -46 -151 152 122 274 92 -250 38 -333 47 -31 113 96 9 161 145 -121 -68 4
5856 4 32 89 96 104 2 -159 -178 254 -69 65 -47 26 409 -159 -94 -321 95 -61 143 28 -115 15 -143 77
5880 77 2 -29 -263 151 301 33 296 -47 33 -258 -243 -55 297 393 -155 -171 80 170 125 137 -79 -127 193 -8
5904 -8 -48 184 142 -138 -13 228 240 240 -230 185 44 -104 380 -61 -300 -93 94 216 -142 -33 -107 0 -379
5927c79M73n2K2n1O4J83n28L09k79L12k20K19K38j90j21J27k19j1J88J47j36r4
5949BK11k48J18j66j0J19q8Q7J6R8m3j73J65M0k43L35r2r3Jj00p6j02J32J30l12
5974b92K00J59J95l30J8J66m52L07K5K13l63m8J5k16M01j77L1n2P7M45l73Mn6
5997a03LO5Q4Q1P0J19k58q3l9J94r8l5L3j63J83Q5l92J91N0o0J57k95K73k34J22
6022e0j13l1J04j77M48n4j46q2L53K7m35O2M2J46j97J56L03j09l80J37R4m47M47
6045I8j90L13n67M73j57J19j87J29l98M20K58M9l87R0K47m87J99K04j8j08Q0k7
6067A53r3k55K34Oj49K81j33k41M7J6J72j18Mk17M29O7k17k8Q3j91M7J31J6K02
6091B46j02M0k67j50J7J77P9j67K19j42Q9J26k10j08O7j57Q7R1J86j78J89k10
$$ plain form
5927 -379 94 42 64 13 77 260 -268 41 -238 74 -146 73 311 121 0 127 -92 -103 85 232 96 2
5949 2 213 -35 83 -83 -93 26 -62 25 41 139 96 -77 88 128 -115 220 128 35 36 -64 -140 -242 -110 20 -292
5974 -292 -92 67 262 -68 -50 116 -336 -29 -4 209 -154 -202 -187 -403 -2 -179 -148 -200 -123 322 -51 -47 -103
5997 -103 -100 -35 49 130 200 319 61 -22 -61 133 35 0 33 -130 53 138 -254 -63 -13 -73 84 -211 62 -172 -50
6022 -50 -163 -194 -90 -267 181 127 -19 -101 252 279 -156 -94 -52 94 -103 53 356 247 -133 4 98 -349 98
6045 98 -92 221 -346 127 -30 89 -98 31 -367 53 311 360 -27 63 310 -177 22 226 208 100 180 153
6067 153 60 -195 39 45 -104 177 44 -197 -150 -134 38 -80 -76 -293 136 203 -14 -42 41 -150 -103 28 44 246
6091 246 144 184 -83 -233 -216 -39 40 -127 92 -50 39 165 -45 -153 -86 -243 -156 -65 121 -57 132 -78
6113g8j12K8P0J2J33N7K2J3m08K40J11l16r8L51j94L9J13J63j56j64J51J40j40
6136b3M7n6j47L47j52J57K26l24J45J68m01l0K12l84M9q2L91m23M05j82l7j45
6158b39J11P6N3M7o3r4J1K60j71l28k7J77j28L08j33N20l60M6k53J74Or1J88R5
6182A85J94n39M28k91j1nM0k74K66j25R7M1K8J8J30o5m2J27l93K55M07p09K71
6205C3J6O1m2o6j4j43j65J61R7p2K22j90K82j50N8M9l28J03j79L52k0p5L53k83
6229F0p6J21l39J60J16r7K27M0o1R1j81r3J31k60j14J67K68j83j31L6kq5M07m88
6253b86M89P5j63k9N0k10P9K64m52J16K31k64J48p9K4J79m41L81k83k0J38K18
6275A65k11l9K4L13r5k64RK25R4j64j97J65r9J29j80o1L03k21qL5J96l72J09K74
$$ plain form
6113 -78 -190 -162 -92 -80 53 110 132 145 -263 -23 88 -228 -326 25 -169 -130 -17 146 -10 -174 -23 117 -23
6136 -23 24 -32 -179 168 16 173 399 75 220 388 -13 -43 169 -215 -166 -248 143 -280 125 -57 -94 -239
6158 -239 -128 -52 1 48 -15 -109 -98 162 -9 -337 -364 -187 -315 -7 -140 380 20 66 -187 -13 -7 -98 90 185
6182 185 379 -160 268 -23 -34 -39 1 -273 -7 -132 -35 6 34 52 182 117 75 202 -191 64 471 -238 33
6205 33 49 110 68 2 -12 -155 -320 -159 -62 -134 88 -102 180 30 88 137 -191 -88 -267 85 65 -10 343 60
6229 60 -16 105 -234 -74 42 -55 172 212 151 242 61 -32 99 -161 -275 -108 160 -23 -154 -118 -120 -205 202 -286
6253 -286 203 278 115 86 136 -74 5 269 -183 -67 164 -100 48 -31 -7 172 -269 112 -171 -191 -53 165
6275 165 -46 -85 -61 252 157 -107 -98 127 221 57 -140 25 -74 55 -125 -186 117 -104 -112 -77 119 -253 -144 130
6299A30l01K90j98l61N49l8k69R2J3K24p4j1o3m5j49M66q7n9M43l71j83j91R8
6322i5j69K59k10M45k30k2P5j10k1j0j9L26j67n6J37J9l79J41Q3Q1j53L92j81
6345A36k15j86N7J03R9K4J53j33J21k0m7j69k3J26l9R5m8K33q2j47j14J53k22
6368a45L19Qk19J09J32j32l7j18j64J96m3k21J68N44n29m6L6J06j25J41M5j46
6390a21j3J18K5k51L45Qj03J91q9l96K91np9j53M82j41N8j37L2j88J53j10Q0K5
6414B2J51j99P6k88J78M8J40j28k37M47j29J24k17K82l65K96j19J94l1j11Q7j54
6436F7k74M7J25j89K83L32j32j10m4l02J28l9J2K60k61L37j21k16k05K46o8N6
6458f8M0j63L14n2k59M2L97k76J62l07Q5PK35j84m3M4L4m8O8j82L61j03k03J8
$$ plain form
6299 130 -171 119 -79 -440 109 71 -198 -106 -93 131 57 46 -17 -62 -211 255 168 109 552 181 -2 -193 -95
6322 -95 -264 -5 -215 230 0 -22 53 -57 -78 -88 -107 219 52 -4 133 152 -227 -86 -3 78 -75 317 136
6345 136 -79 -265 -208 -105 -6 18 171 38 159 139 92 -77 -100 26 -13 82 34 267 185 38 -76 77 -145
6368 -145 174 182 -37 72 204 72 35 -83 -247 -51 -94 -315 -147 397 -132 -178 -142 -36 -161 -20 25 -121
6390 -121 -134 -16 9 -242 103 111 8 199 110 -286 5 0 -79 -232 250 109 167 30 62 -126 27 -83 -3 22
6414 22 173 -26 50 -238 -60 -12 128 0 -237 210 81 205 -12 270 -95 201 82 276 245 134 221 67
6436 67 -207 -160 -35 -224 59 391 259 149 105 -197 -69 -108 -96 164 -97 240 119 -97 -302 -56 -124 -68
6458 -68 -28 -191 123 71 -188 -146 251 -25 137 -170 -85 -78 157 -27 -70 -26 8 -40 28 -154 207 104 -99 -81
6482h1K58k88J54J55j06k35P0K50o7m02J66J69J44k42Rj30J29Kl10K62j84L98
6504A21J67j4k47nk39J92Q0k85J19J75j80N14m66No8j23M45m5K5k61P6j78J23
6527f9LMj07K52k8N3J73l65k52K73k37L05O0J23k01J07k70N3N0J68k61J97j98
6550a67L36j14r2j40K08J62j22q4o4K89J45m02k85N15r6%n8j41L08j56p0K9j38
6573a37J91J13j1k80j19PK06K03k72m6OK52j83L05J1l30j96P3J37M22l7k83K5
6596E7J43j69J8o7j19L10j37J03J91l9k81J85k71k44l6K88L5p3K04n2J29l07j4
6619a46J63q8J23J71k61r3O4p8PK1kJ18K0%k70L34n80N50n0J06q8n2j30L69o9
6644A39j28j00J76Jj72O3R6N0j85j11J89J88N8n63M98k23k11J84N3k01OL40o4
$$ plain form
6482 -81 177 -111 43 198 92 -143 -73 177 110 -292 -126 43 187 -55 -46 -176 -47 -45 -355 -93 -277 121
6504 121 288 274 27 22 -217 -25 55 -230 -111 64 -116 398 -68 -63 -131 -254 191 146 171 -90 -14 -192 -69
6527 -69 -66 -62 -169 83 55 108 281 -84 -336 -63 -300 5 65 188 -13 94 -176 -123 -73 95 -166 31 -167
6550 -167 169 55 -37 -177 31 193 71 -13 -77 212 357 -45 -330 185 89 89 31 -110 198 42 -28 1 -137
6573 -137 54 167 156 -124 -243 -236 -30 173 -99 -145 -139 113 -70 235 246 -84 -280 -207 -70 352 315 32 57
6596 57 200 31 49 -18 -137 173 36 139 330 291 10 195 -76 -320 -356 -68 -33 -106 98 46 175 -132 -146
6619 -146 17 -71 52 223 -38 -131 -67 -145 -138 -117 -119 -1 19 19 -251 83 -497 53 3 109 21 -31 -161 208 139
6644 139 11 -89 87 88 -84 -21 75 125 -60 -171 18 206 264 -299 199 -24 -235 -51 2 -199 -193 147 83
6667H3n6Rk76M04k55j98L32j13J84J15k92j84K27r1K1p0M9M7K52L6m28M01j15
6690H2p0J41j83N2P9q4k00rj7J19K25K72k48p4k6J75k6k53M3k19L49o2l78K35
6714g7l68M40j0O2j06O4Q0O4P1j56l1k74K8K39j61K20J21r1J1k59J70j30pK43
6738A43o7n2m0k29J07j09R7K71j37J77j93k14J30N2Mj3j44L92J37l99K34o1m47
6761c61J94K86l68L84j5k44L21K9k84R1Nl52J82J97j47L25l26qK17R8j36L9n0
6784G7k50K9K39m18J49K70P2j09j08k8J13j99L28k56K43n0j65N31k15l67K2j7
6806a09K38k87K95j21K2K27l49o9j25L01q4L9J80j18k73M17m46M51n64K29K68
6827A22k8m4j2j9j4M86o50j5K27j26R8J52L6l08l5K09r2L14k84N3l36M61n13K85
$$ plain form
6667 83 27 36 -240 164 -91 -289 43 -70 114 229 -63 -247 -20 -111 -90 -160 -111 -64 188 224 -204 197 82
6690 82 12 153 -30 22 101 17 -183 -192 -209 -90 135 407 159 85 59 234 208 -45 -2 -221 128 66 -312 -77
6714 -77 -445 -5 -15 47 -59 5 85 149 220 64 33 -241 -213 26 -135 85 206 115 126 -133 37 -93 -100 143
6738 143 76 24 -16 -245 -138 -247 -150 121 -16 161 -32 -246 -116 -64 -60 -73 -217 175 312 -87 147 86 -361
6761 -361 -167 119 -249 135 120 -124 197 226 -58 33 38 -314 -132 65 -82 243 -83 -91 126 224 88 127 77
6784 77 -173 -144 95 -323 -174 96 168 59 -49 -77 36 -163 165 -91 152 102 -63 468 253 -114 -92 -109
6806 -109 129 -158 137 16 38 265 -84 -153 -278 23 -61 -22 158 40 -233 184 -262 189 -375 -146 122
6827 122 94 50 38 19 5 491 -159 -174 53 -73 25 177 213 -95 -130 79 -13 301 17 70 -266 195 -318 -33
6851c3k01J96K05l05L25k89j53Q1N6o7J47J02j23L50l21J03k09j2r1K27N7o6K83
6874B62j36J53q6j08k82J73O3j2N9PjJ01k35j72j34M20P8l84M12l60L82n27K29
6897i8J84j24K37j76J44l03K29N3k05K65k46L0nj17K20j08j62J83M4J4k99L82
6919A42k0l10L00j59K06k6P1l90J43J26k77Q7O8Nk16M41m41L54j49j14L92j21
6941A12N5k54J12rr2K94M0m75K53m39M54J80l5Q2J15m24q4J09MMj60K89J32l07
6965d4l0%o7k38L10J37k62J96J08J33k49k16M10o14P32l38n9M4M0m4N8n2RK81
6989B45k51J35l09J31m02K84j25K34L35j52k12N9J58N4l30L6nJ07M5j45J89J12
7011A93k86J07k77K15M9J67q4l7j63Q6n6kK03j50J04J12J10m13J06L00l86K27
$$ plain form
6851 -33 -234 -38 167 -138 187 -102 -255 -174 -118 -185 -38 64 -59 291 -30 73 -136 -148 -239 -12 45 -21 262
6874 262 126 279 193 85 -197 -24 39 27 86 93 92 193 -42 -214 -348 72 150 -234 178 -182 200 -327 -98
6897 -98 86 -38 199 23 167 -136 93 146 -59 206 -40 -10 -15 -132 88 -20 -182 1 45 59 -240 142
6919 142 122 -188 112 -47 159 133 204 -186 -43 83 -194 -107 -39 -34 -250 191 -250 104 -45 -159 233 112
6941 112 167 -87 25 16 -76 218 258 -217 36 -403 51 231 196 278 393 -31 -115 -6 -2 2 -158 131 263 -44
6965 -44 -74 -74 -141 -379 -69 68 -194 2 110 243 -6 -222 188 -426 306 -32 -91 -47 -7 -51 7 -45 -36 245
6989 245 -6 129 -180 -49 -451 -167 -292 -58 277 125 -87 -28 130 184 -146 -110 -115 -8 37 -108 81 193
7011 193 -93 14 -263 -48 1 168 84 47 -116 -30 -86 -88 115 -35 69 181 291 -122 -16 284 -102 125
7033A25k96L74j92J94l39k86N55p2q7j9jL81m69J1J11K71l42J93k00M6J04j69
7055a07p7J17j24j8N58n67K00J06n2J1j25R3j77O5J66j03K38J58l97L79q4l36
7077g6N8N8k23K21M2Lm03M9L21M5J43k74L95n78k1K48j0pJ12N9mk08k1o9k9K99
7103A30j75K24j06K55n56rL16K1K6k31K62J18k11J07o0j80J11N0k65K97k7L5n4
7126G8j09M0k99O9K03J23j03K39n8k00J80K7j51j7o1L88k46k28j38L43k8j15J57
7149I4l2L9l76M59k4k58j4J8J88j59K43J89l69R1k4N0K4l94K82l4q6J78j12j93
7173b20L27l56L17L07j55l85L1O26k28j73j05J06p7j02J43l4j9j28L3O7L44n38
7195b19K40R8k91K09j89L23l48J27j02J74n96P40k42j49J92k50K90l48O16N5j34
$$ plain form
7033 125 -171 203 11 205 -134 -420 135 63 -24 -43 -44 337 -132 -121 -10 261 -81 112 -88 -42 62 -107
7055 -107 -184 -67 -191 -209 349 -218 -18 88 36 47 -78 15 -162 -97 69 -34 204 362 -35 344 260 -76
7077 -76 -18 40 -183 38 80 83 -320 -271 50 95 238 -36 359 -219 -240 8 -2 -9 103 162 158 -50 -71 -140 -169 130
7103 130 -45 179 73 328 -228 -237 79 100 126 -105 157 275 64 171 111 -69 42 92 -173 124 97 132 78
7126 78 -31 9 -290 -221 -18 105 2 241 183 -17 163 190 39 22 -39 349 103 -125 -263 80 52 -63 94
7149 94 62 101 -275 184 160 -98 -112 -94 94 -65 178 367 -2 89 65 115 139 -255 27 -7 -93 85 -27 -220
7173 -220 107 -249 68 375 220 -165 -134 492 264 91 -14 92 15 -87 56 22 3 -125 -92 -25 319 -219
7195 -219 21 119 -172 37 -152 171 -177 -50 -152 22 -574 166 -76 -225 -33 -283 7 -341 275 330 196
7216A96m7N5l02J15j53Q9j22M2O8J77r5J74j86j56J29K3J51L4P2k97j40l8K55
7239D4j67M7K37k10L71j87k61o1r0M13k64j20J84j4q0J78J58j72K41l05R1J09
7261A42j93k64L07O8r3J22j37j4J14j29k18J36L79o1m8j40L66l85J72m3r2J06
7283I5n0M6k16R2L4L7K8o1J56m04N94l73Q6o2r1P0JJ74r3J39n02M10R0l99K18
7308A9j5r2K03J87o6j44P9l75P7L9K4j23L95k80K5q8oJ17k93O40o7o7q5jo3K71
7334C11j75j38J93j66q0R3o6k19L79j26j71K18l3o5K07ok08k5j71n4L54p6J38
7357A14l14L43j22J6j23j9K58l15K23j64J52N6l59K67p9J09k06K18K94j89k52
7378i2K62j53J83j31lj49J75k66m7N01k10r2P7Pk11J10r3k2mo1K78L3j67M17n40
$$ plain form
7216 196 149 204 -98 17 -136 -47 -169 -127 -59 118 23 197 11 -145 -16 7 158 192 264 -33 -173 -211 44
7239 44 -123 -76 161 -49 322 135 -126 -187 -277 136 -128 -248 -64 -78 -158 20 178 6 247 -58 33 142
7261 142 -51 -315 -8 60 -33 89 -48 -62 52 -77 -295 -159 220 159 111 -29 337 -48 124 81 -11 95
7283 95 45 91 -125 -33 1 38 66 5 161 -243 351 -22 64 2 -89 -19 -18 156 63 202 -300 110 200 -199 19
7308 19 4 -88 115 302 236 92 171 -204 -127 -88 -64 -187 208 -72 -47 -135 -141 -24 -317 323 256 189 104 103 40 311
7334 311 136 -2 191 25 -55 38 -28 -247 132 6 -165 53 20 -45 162 156 -52 -77 -248 -302 52 -24 114
7357 114 -200 143 21 37 -86 -105 153 -162 61 -103 49 105 -254 13 -66 43 -163 55 349 160 -92
7378 -92 170 17 200 69 66 -83 92 -174 -221 280 70 -22 55 62 -149 -39 -132 -154 -158 -219 59 92 -75 342 -198
7403a98O1P2kMk19L53j58P0J45J80m3l49L2M9Nj74J79K01k03J9J18m42L4M33k91
7428a24K79m27L35Q1R7m08R9K1K10m0J00l16j6m3J15j0N49n20p3J26l20K71k9
7451d3n6O5K22o1j43J04k37L72k38j92L50l99L63J14J9j71l50Q7N9j37L90oK11
7474C23j69j22j18J05m18K59M44m39J24lJ33k28L29j43m33K30L82k84r7L11k77
7495i1q9J18j11N0L30j51J5O2Mk28J48k44K54r9q9J04L2K35j36j39j71K93j09
7518a2K1p2K65j49l5l14j01N58l01M09j23J10j48n6l26M80k40J39j24J95j60n5
7540c9K67j37j55l0K81k33J17N5k12j27L23k30J80PK0L5k81k46M47K1j42J10L48
7563C79l96k2K18k4k12L49k47l4P3R0j07j40q3K11J87j16j96j67J52L2R3j48J08
$$ plain form
7403 -198 -137 -65 -67 -63 -282 71 -87 -17 128 308 265 -84 -52 -3 2 -172 7 208 5 24 142 -300 -266 167 -124
7428 -124 155 -272 63 144 241 -167 -68 -47 163 123 223 -93 -109 -152 -37 -47 502 -18 -91 35 -285 -14 -43
7451 -43 -99 -34 188 127 -16 88 -149 223 -15 -207 143 -256 107 221 240 69 -281 -194 -135 -272 118 112 323
7474 323 154 32 -86 19 -399 -140 304 -135 -11 -14 119 -109 220 77 -356 -126 256 -28 -125 186 -91
7495 -91 -180 -62 -173 -123 207 56 71 133 137 -91 57 -187 67 -32 -121 -17 15 250 114 -25 -196 97 -12
7518 -12 9 -63 202 53 18 -296 -397 161 -140 269 146 256 108 52 -274 206 -34 105 -19 176 16 -39
7540 -39 228 91 -64 -94 187 -46 71 126 -86 -213 110 -120 60 67 87 122 -159 -405 42 63 -79 31 379
7563 379 -17 -39 179 155 -57 292 45 11 84 174 67 -73 -156 55 242 126 -70 -237 -85 -53 40 -108 0
7586@J60l09p1L12q7J77k23K37k15k7J30j51M06j58N2k74J51q0P1l24J33R8m9
7609d1Q6P0M9k72K0N6J13L31m49q7K43j57o9l18N37l58K59P4r0J99k81P2l07M64
7633A44k02j64M30l24Q8R3j19p6K46j63K07o0K6l9l7k91K77J97m65L16n4J87N1
7656B68l60p8R1qL50m71K85j30R9k9J97j73k0Q1j12K3J4J90m62K94n6r8K10k1
7680H4p7k5K6J02q3J18n09N26j1l36J80k62K66j07K05j38m4K12P1k98J95j90K52
7703A57k66k9l2J85r2j80L97m3j75q2M14k72R7p2k99L87k32K90m39J35J22k9J60
7726A02m4J58K99k41p0k23L5kLJ26J16m38j5K8K78l9J49j75J1k07r2K07q0j23
7750b37L50p0r7p9K81j61Q6j73L25k28j78M16k62j87J93J93k07J31j76L87l84
$$ plain form
7586 0 160 -149 -220 92 5 182 -41 196 -19 -46 84 -67 339 181 233 -41 110 30 101 -223 -90 8 -41
7609 -41 45 115 164 -108 -88 -32 81 412 -37 -124 119 -38 -107 -425 112 -246 13 87 -3 196 -85 -13 -320 144
7633 144 -58 -222 208 -116 -28 65 -54 -130 116 -47 160 100 126 87 50 -241 36 233 -232 84 30 217 268
7656 268 -92 -170 -79 -87 263 -208 77 -53 46 17 214 41 21 102 -10 13 27 217 -245 49 -7 -105 105 84
7680 84 7 -18 8 110 27 145 -364 162 151 -185 -5 -267 -1 -108 97 -41 -85 127 198 -100 95 -95 157
7703 157 -109 -138 -170 15 -77 -257 140 97 -78 -160 254 -18 79 7 -292 95 -137 153 -286 -151 -29 -58 102
7726 102 58 216 515 274 204 -19 16 14 17 143 259 -179 -194 -166 112 73 222 47 58 -149 -241 -34 -114 -237
7750 -237 113 43 -54 -133 148 -13 73 -100 225 -3 -181 235 -27 -214 -21 172 -35 96 -80 307 -77
7771g7j38L90j89j98J47q5J48N6P8k39M9l8r1N5j54L22j11q2P6L7J24l17O2M10
7795B35j6l62J32K9n2P9j36J09p0K13j95j23J83J5k23K67J19j32k59K34p9K7P3
7818F8l88r3M10n2J03k4Q4j49L05k26k06Q1L17j42q7K0J73j98O0l6J33k8ol59
7842b40K62N3j74J20l9o9J63j8k49J51l04K44L83l96O3j6K04k13J33l8r3J22m70
7865d21O71m99K91N01m86p3l17L92l13P2qJ1L52K7k53N4K45k46l2L83l57K02K7
7888B23j29J49j31k44J16M0K19j37lo3j57J28j72j0K03J71k88Q9J65q0m9j11n8
7911a29J00N6j15K32j85k04K5OJ46J06j45J87k07M14o37K36q1L57m24L46k35M2
7933a09K2P5R6o8q7j30P7L25m10l1L84k19j8k08K90Q5K45l91P9j39K62j32K48
$$ plain form
7771 -77 -215 175 -14 -212 -65 -150 -2 54 132 -107 -58 -96 -187 -132 -286 36 -75 -157 -81 -44 80 -237 -175 235
7795 235 219 -143 -11 18 -34 45 -91 18 -52 161 -34 -157 26 41 -182 85 204 72 -187 47 -32 -5 68
7818 68 -320 -413 -3 -55 48 24 108 -41 264 38 -168 -87 230 88 1 21 194 -4 56 20 153 125 119 -240
7842 -240 22 75 -99 21 -18 -87 76 58 -191 -40 -344 -100 283 -113 -50 -66 138 -75 58 20 -73 49 -421
7865 -421 250 -249 42 543 57 -16 -333 59 -254 -182 -190 -179 173 200 -53 1 246 0 -32 351 -6 196 223
7888 223 94 243 112 -132 -16 24 243 106 103 40 -117 11 -161 -171 32 203 -85 4 169 89 40 -71 -129
7911 -129 -29 27 -88 144 -41 -245 -220 -214 -68 38 -107 80 -127 287 -350 -114 -195 162 -262 84 -151 -109
7933 -109 -87 -12 84 16 -71 -201 -124 201 -209 -240 144 -75 -93 -301 -11 74 319 -72 7 -132 130 -2 246
7956B46j54N2k9L1P4L6k87k1l6k6p3K07J36p5M0l13J44p7pJ27J34l3q5O2j15r0
7982a32r2P3R2k2j07K07l05o1N01o3j82m3K67O9k14L2%p4K06l11J23K60j27p7
8006B0k94K44J28q7L34l81K06l26R6k53J41J89K34j73K87n91L20k45J68l28L22
8027A1k88N26l04J88j34M4M6k57K47l70K96K84m16L01j27j42k0J97q7m7K25j31
8049D2n1lJ28l29J26J01L39l07J91J26j49k48j18J70l3k4J54k0j44J07j10J63
8071A11r9j71K96j16K0q2R1J19k62j6J40m3k6J32m77N89j21l40J92O0p2P5l35
8094c35L68J30l90L47M1j79R7j43j31J58J97j30l36j05J90N01l42J9L05m05P2
8115g1J07j11n4r1J19K27K26N5m65lp3K03P7M9p8k41K81l90J37K21k5j91k18L70
$$ plain form
7956 246 92 144 115 146 220 256 -31 -52 -88 -114 -187 20 156 81 121 -192 -48 -125 -132 -5 129 96 11 73 -42 -132
7982 -132 -224 -151 -59 -81 -188 19 -286 -347 154 91 -91 -134 133 202 -12 20 20 -54 152 -159 -36 224 97 20
8006 20 -274 -30 98 11 345 -36 170 -156 -60 -313 -172 17 251 78 365 -226 94 -151 17 -311 11
8027 11 -277 249 -55 133 -1 43 89 -168 79 -291 5 289 -127 174 47 -95 -115 82 -5 -52 173 42
8049 42 -9 -12 116 -213 -87 14 353 46 237 363 214 -34 -152 18 -15 -39 115 95 -49 58 -52 111
8071 111 12 -159 137 21 41 -41 50 169 -93 -109 31 -12 -38 94 -383 206 85 -255 -63 -3 -75 0 -335
8094 -335 33 163 -227 120 161 -18 79 -64 -195 -37 160 30 -306 -411 -221 280 -62 -43 262 -143 -71
8115 -71 36 -75 -129 -220 -101 126 352 407 -58 -61 -134 69 146 195 117 -124 157 -233 -96 125 100 -91 -309 61
8139F1K0j44J55l54L64j52J79l0J23k79NQK1J11r0M1l6M5j5j59L33k81q4K8J02
8164b8R5j68J12o3l17R6K26J67l3n7m2N3j97oK36j23N1K12k63L9j16l2L09k9l7
8189H5M5J64
$$ plain form
8139 61 81 -63 92 -262 102 -50 129 99 222 -57 -52 -44 -23 88 -2 39 3 48 33 -126 207 -74 -158 -130 -28
8164 -28 67 -101 11 -52 -369 -273 -47 120 87 30 -12 41 -156 -162 74 -49 2 214 -49 -10 -126 -158 151 122 85
8189 85 130 294
8191B94
$$ Imaginary data points
##PAGE= N=2
##DATA TABLE= (X++(I..I)), XYDATA
0@%%%%%%Kj0J6j6J6j8K6l2M0m8N6o9Q0r4J10j28J52j75K00k32K65l02L40l82M33
31B30m89N52o19O89p66Q50r45J051j164J290j429J583j753J940k154K392k661
48a403K970l327L748m248M858n621O602p928R831j2800J8140l0788J17506J10995
62B08535j58073j27853p6307M5835O9938O5925K1474J6063J802j0648m8534n8018
74d9861m4543K171L9065O8238P0143M5988k2733r4611j22362o0695M8596J28166
86G562J07300J7870o6133p6879l5035K120j305j2867N604N2142P6284M2610l0322
99H8951q6291q6825l7605K5261P1368Q3391N7622j9o4449r4153o3722M805N9615
112d2051O2830K8921K706R28L6k6449o4803o8526j1158P0119J09224O8436j7371
$$ plain form
0 0 0 0 0 0 0 0 2 -8 8 -8 8 -10 16 -16 24 -24 32 -37 43 -51 59 -69 83 -92 108 -124 141 -161 179 -203 230
31 230 -259 293 -326 363 -403 447 -498 553 -611 679 -750 833 -920 1020 -1134 1258 -1403
48 -1403 1567 -1760 1988 -2260 2598 -3023 3579 -4349 5482 -7318 10822 -19966 97540 208535
62 208535 50462 -77391 -153698 -107863 -37925 28000 49474 65537 67339 56691 8157 -49861
74 -49861 -94404 -92233 -53168 15070 85213 131201 108468 13857 -108505 -169200 -120604 7562
86 7562 114862 132732 66599 -10280 -45315 -43195 -44500 -57367 -51763 379 76663 119273 88951
99 88951 2660 -84165 -121770 -96509 -25141 58250 115872 115853 51404 -42749 -106471 -101666 -42051
112 -42051 20779 49700 52406 53334 53370 26921 -37882 -106408 -117566 -47447 61777 130213 112842
125A12842q1131q3557m0530P409L8314M8842M5576K6278o405l7211m7845l5946
137e3364j3804P198K7584M8415N8089L2082k9827q6763q9226k5077N6741R2923
149B4971O1211j058m1812m2172k3538j3787j3931m555K3075N1271N1429J7539
161H8643l0161o2971o3272l2155J8350O4578P9533M6957j7920p2889p7935l1702
173i0944K5712N0612L5858J0242K231Q150J402k6399n4338m8235j89N5730P8870
186D8702M9699q777n7511p1402m4664M71M2806O0045M3815O168k9377l9303k6458
199b5786r162k358j309J1670L5693M9220K7711k4502o9719p0229k1788M1151P2680
212A3272N6254J1310k9351m6659m0291k0377K441K2120L2727L1072J8606k65j9963
$$ plain form
125 112842 31711 -51846 -92376 -84967 -46653 2189 47765 74043 67638 30427 -17418 -53364
137 -53364 -67168 -59970 -32386 16029 74118 106200 76373 -10390 -99616 -124693 -67952 24971
149 24971 86182 85124 43312 1140 -22398 -36185 -50116 -54671 -31596 19675 71104 88643
161 88643 58482 -4489 -67761 -99916 -81566 -16988 62545 109502 91582 18693 -59242 -90944
173 -90944 -65232 -14620 21238 31480 33711 41861 43263 16864 -37474 -85709 -85898 -30168 48702
186 48702 98401 89624 32113 -39289 -83953 -83482 -40676 19369 63184 69352 39975 672 -25786
199 -25786 -34948 -37306 -38615 -26945 8748 57968 85679 61177 -8542 -78771 -100559 -59408 13272
212 13272 69526 80836 51485 4826 -35465 -55842 -53401 -31281 1446 32518 51124 50859 30896
225C0896l5699m1246k6268Q382M7475O3541L9330j2085n6169o3035k9794J3922
237f0750L9845L8566K1715O256n631j8169l0481l3862j8028J1760M0130M7653
249C9004K8712n341l7264n0759l7856m190L1748M9085L8830Q670k1626l4190k8338
262b3515j6020l675P758K3274L6348L3486P867l1229n5844m6236p443L5381N4605
275A4757M1440Q158k3341l8684l4499j7349M105K1197K8544K5524J5092q76j9182
288B4886l3748l6422j9077J4914M5897N2654K6241j8726n0121n0126j9202J5957
300d6873L5290L2089J5835J443q676j6159k3063k4140j3172Q726L0630L9377K7576
313E8883k225l3247m9131l6639k892L4298N0440L5432K608k7352l6190k5470p883
$$ plain form
225 30896 -4803 -46049 -72317 -63935 -16460 47081 86411 74326 18157 -44878 -74672 -60750
237 -60750 -20905 17661 39376 45632 40001 21832 -8649 -42511 -60539 -48779 -8649 39004
249 39004 67716 62375 25111 -25648 -63504 -67694 -35946 13139 51969 60639 39013 4823 -23515
262 -23515 -39535 -43210 -35452 -12178 24170 57656 65523 34294 -21550 -67786 -75229 -39848 14757
275 14757 56197 64355 41014 2330 -32169 -49518 -45413 -24216 4328 29852 44944 44068 24886
288 24886 -8862 -45284 -64361 -49447 -3550 49104 75345 56619 6498 -43628 -62830 -46873
300 -46873 -11583 20506 36341 37784 29108 12949 -10114 -34254 -47426 -38700 -8070 31307 58883
313 58883 56658 23411 -25720 -62359 -65251 -30953 19487 54919 57527 30175 -6015 -31485 -39368
326c9368O084J2479J9543K4228K1009L218k2630m0808l6446q929K5189M5462M0198
339D9229J3227j9772m0468l8647j7430J1007K9830L1204J8677J802j1111j8948
351H600k2573k1017r650J1215L2656L7411K0446j1281l7120m0146k2341P412K8920
364a7468L3739K3225M255j4482k6338k6733j6399L69J7331K7077K7060J4273o234
377C9675k7199l6530k6677l46K7571L9392K9792L879k0477l1212k6191j1946M440
390c5829J7869K5425K4014J2581p452k6634l3006k3333J44K3733L5993K8917P495
403D9917j8408l3379l0161j2201J0378K4362K4650J5658L093q505j8149k3110
415a5855k0008o108J5595L1538L1920J3705j4594l4230l4895j6266R692K8609
$$ plain form
326 -39368 -33284 -20805 -1262 22966 43975 47193 24563 -16245 -52691 -61620 -36431 9031 49229
339 49229 62456 42684 2216 -36431 -53861 -42854 -13024 18180 36857 38659 27548 8600
351 8600 -13973 -34990 -44640 -33425 -769 36642 57088 45807 8687 -31459 -53800 -46388 -17468
364 -17468 16271 39496 43751 29269 2931 -23802 -40201 -39832 -22501 4576 31636 45909 39675
377 39675 12476 -24054 -50731 -51077 -23506 15886 45678 49557 29080 -2132 -28323 -40269 -35829
390 -35829 -17960 7465 31479 44060 36608 9974 -23032 -46365 -46221 -22488 13505 42422 49917
403 49917 31509 -1870 -32031 -44232 -33854 -9492 15158 30816 33909 25404 7255 -15855
415 -15855 -35863 -41971 -26376 5162 37082 50787 36193 1963 -32932 -49198 -39506 -10897
427a0897L1110J8386q08j7131k3481k0113j0402J926J4061K2325K3242J3599n484
440C6333k5888l4765k3586J874K7722L7857K5936P88k3042l1658k3713o199J1665
453b6676K0309K0571J3856L713q295j8354k2774j7810k433J7098K9962K7061Q877
466D5105j5534l1768l0239j1818J0987K6707K6752J4173k249j5345k0173j7870
478b1272j0253K352J4384K2690K1577R461r881k5671k9875j6042N593K5558L0416
491A9037J9734k50j8863k5960k1513p293Q235J9151K1627J6202L853j0924k2467
504E69k3822j4076L985K1383K7759K0087J559j7710k6372k1784o611R791J9455
517e787K0556J3668J802j1306j9688k0806j2053L295J8425K5557J9699K936j5573
$$ plain form
427 -10897 20213 38599 37791 20660 -2821 -22934 -33336 -31410 -17349 4976 28218 41817 36333
440 36333 10445 -24320 -47906 -46032 -18310 19547 45483 46271 23229 -8429 -32142 -38341 -26676
453 -26676 -6367 14204 28060 31773 23478 5124 -17650 -35460 -37893 -20795 9167 36228 45105
466 45105 29571 -2197 -32436 -44254 -33267 -6560 20192 34365 32116 16771 -3402 -21272
478 -21272 -31525 -29173 -14789 7901 29478 38939 29058 3387 -26488 -42530 -36937 -11379 19037
491 19037 38771 38521 19658 -6302 -27815 -35108 -26873 -7722 13905 30107 33960 23036 569
504 569 -23253 -37329 -33344 -11961 15798 35885 37444 19734 -6638 -28422 -35033 -25242 -5787
517 -5787 14769 28437 30239 18933 -755 -21561 -33614 -30319 -11894 13663 33362 36298 20725
530B0725k6089k2874q191J0158K2053K2807J2148j724j3887j9086j6833q792L083
543b6502J5076K2594J9428N689j2808k6082k5647j0847R593K5073K6276J3328
555C5171m352j8354k2462j5558k913Q280J5976J6833J2249K716r236j8300k1108
568b1058j2941M014K0023K6823J8082p49j8840k6424j8550k766J2968K0042J7166
581A7790P906k557j1338j5607j4894p769K307J4970K0650J7668L905j3110k4699
594d778k3172q467J1156K4308K3140J0700o147j7790j9217j3520k637Q103J5106
607c215J6564J2324J635j1091k0046j9814q654P169K0662K3089J3492l329j8168
620A0618k2264j5204j523J1170J7720J6152P913j870j1584j6403j5191p011O223
$$ plain form
530 20725 -5364 -28238 -36429 -26271 -4218 18589 30737 29013 15126 -3960 -20793 -29585 -26502
543 -26502 -11426 11168 30596 36285 23477 -2605 -28252 -39099 -29506 -4433 21843 35171
555 35171 30819 12465 -9997 -25555 -28468 -20188 -4212 12621 24870 27586 18350 50 -21058
568 -21058 -33999 -29985 -9962 16861 34943 34194 15354 -11070 -29620 -32386 -19418 624 17790
581 17790 25696 23139 11801 -3806 -18700 -26469 -24162 -9192 11458 29126 33031 19921 -4778
594 -4778 -27950 -36417 -25261 -953 22187 32887 26740 8950 -10267 -23787 -26424 -18321 -3215
607 -3215 13349 25673 27308 16217 -3829 -23643 -32297 -25128 -4466 18623 32115 28786 10618
620 10618 -11646 -26850 -28373 -17203 517 16669 24582 22712 11128 -5275 -20466 -27477 -21254
633b1254J6360K0287J3742j265j5554k1470j6479l377J1293J9027J6950Q235l634
646B2861j3305j7090j3794m812O498J5983J8856J2506k32j5039k1553j7450m080
659c0651J1894K0340J8765P695n876j5864j7153j1279j307P617J4607J5251J0239
672B4278j14j1926j8725j7278n288R640J9535J9951R185o194j7362j8467j1154
685b3919Q49J1252J4805J2177O718k553j0419j4086j3590n998N521J6147J9347
698A6251J2308k331j6399k1943j4980q7J3639J8642J5057M315p085j3559j3845
711a0017r686k053P363J3111J4952J0081p81j3056j8409j6002l563J1150J9778
724B868J8262O301p787j6728j6854q401K465J0104J3576J0707N588k209j0325
$$ plain form
633 -21254 -4894 15393 29135 27870 12316 -9154 -25633 -29010 -17717 1310 18260 26495 22861
646 22861 9556 -7534 -21328 -26140 -19642 -3659 15197 27703 27471 12432 -9121 -26571 -30651
659 -30651 -18757 1583 20348 28043 22167 6303 -10850 -22129 -23436 -15819 -1212 14039 24278
672 24278 24164 12238 -6487 -23765 -29053 -19413 122 20073 29258 23064 5702 -12765 -23919
685 -23919 -23070 -11818 2987 15164 21882 19329 8910 -5176 -18766 -24764 -19243 -3096 16251
698 16251 28559 26228 9829 -12114 -27094 -27181 -13542 5100 20157 24472 17387 3828 -10017
711 -10017 -19703 -21756 -14393 -1282 13670 23751 22970 9914 -8495 -24497 -28060 -16910 2868
724 2868 21130 27431 19644 2916 -13938 -22339 -19874 -9770 3806 14513 20101 17892 7567
737G567j4562j2480m250P842J6701J6914Q348n041j5594j7972j1100R42J1905
750a0780J6050J2647M145o054j2197j3540r259k286P552J4467J5084Q315l524
763B0620j4301j8507j2262L35J2870J7128J3253L822p384j3315j3633q615r2R534
777a0547J3735J2603N788l640j2508j5607j1136j190J0706J6953J4532L578p854
790A5413j4775j3619o715L016R013J1914R870M671k947j0706j3666j1503j585
803b1619R152J6115J4530N586o675j5553j6003q020L059J2206J4839R845J234
816A8696o701j1160j0713p457r89P190J3029J4117P131m984j4968j6783r991K833
830b0750J3527J6304J0563R78q634j3249j1650m725L180Q579J0931Q763L411l163
$$ plain form
737 7567 -6995 -19475 -23725 -15883 818 17732 26080 21039 5445 -12527 -23627 -22685 -10780
750 -10780 5270 17917 22062 16008 3811 -9729 -18988 -21274 -13722 745 15829 24144 20620
763 20620 6319 -12188 -24450 -24115 -11245 5883 19136 22958 15574 2259 -11374 -19989 -20081 -10547
777 -10547 3188 15791 21579 17939 5431 -10176 -21312 -22502 -11796 5157 19689 23267 15413
790 15413 638 -12981 -19696 -16680 -7667 4247 14117 18788 15841 5135 -8531 -20034 -21619
803 -21619 -12467 3648 18178 23764 17089 1536 -14467 -22487 -19428 -7222 7617 17462 18696
816 18696 11995 835 -9878 -17335 -18324 -11134 1895 16012 23143 18159 3191 -13592 -23583 -20750
830 -20750 -7223 9081 19644 20622 11988 -1261 -12911 -17636 -14456 -5877 5054 13817 17228 14065
844A4065r969j3202j0231r39R659J6391J3817K765q951j5633j2624m795M392J0610
858d645J1352Q622J336m958j0645j1084p497N80Q182J2852J1811N031n927j3965
872A045j5028q339M018J3290J4741Q775q61q409j1369r430m611J597P874J1912
886E205J0757L037n854j2809j2534o885K444J0936J3134J0375Q11q373j2994j1105
900a3855l390M085R887R755P117J729m424r543j2155p664J311J0279J4640R904
914A7676J010q708j2932j0782l597L837J0046J1045Q074K96o728j0771r431n371
928a6336K220P994J2126J0238K576o510j4232j2904n254O030J2923J1982N585
941A6438k492p536r359p844l958K599Q026J0213Q000J705n525j1282j1037n908
$$ plain form
844 14065 4096 -9106 -19337 -20276 -10617 5774 19591 22356 13405 -2228 -14852 -19647 -15255 -4645
858 -4645 6707 15329 16665 11707 1062 -10022 -17519 -16939 -8757 4095 15906 20937 15010 1045
872 1045 -13983 -22322 -18304 -5014 9727 18502 17641 9232 -2137 -11567 -16178 -14581 -6707 5205
886 5205 15962 18999 13145 336 -12198 -19083 -16639 -5703 7431 17806 18617 10244 -2750 -13855
900 -13855 -17245 -13160 -3273 6482 13599 15328 10904 1361 -10794 -18458 -17147 -6868 7772 17676
914 17676 18686 9978 -2954 -13736 -17333 -13496 -3450 7595 15669 15965 9237 -1534 -10965 -16336
928 -16336 -14116 -6122 6004 16242 18818 12308 -1924 -14828 -20082 -14052 -1129 10853 16438
941 16438 13946 6410 -2949 -10793 -14751 -12152 -4126 6087 14087 15792 10267 -1015 -12052 -17960
955a7960L154J0954J2775Q687j241r459j2462q688p62N625Q466P743N326R60m494
970H624r013r806o241J968J0014J2570Q584N30q444j2695j0414k764N575J1114
984c98J0828N019k354q211q664p039k610K454P441R632Q106J773o835j2204j0612
999a3674l827N538J1115J1135N416k428q367r826p455j363M642P991Q578M851
1013A2326k02m788r222q768m743K748J0045J1316P588j473q734j1929p612n41
1027a3989N518Q747Q129M665r94o242q767q193l474L746R146J0293O485q21p821
1042F428j1190q932j808N824J1078Q869L346k948p239p800o217j744L160P314
1056a859Q658O534q9o847j0791q549j872N429J0224Q870M476l080p662r316n882
$$ plain form
955 -17960 -14806 -3852 8923 17610 16369 6910 -5552 -14240 -15002 -9377 -911 6832 12158 13118 8624
970 8624 -389 -10195 -16436 -14468 -4454 8116 16700 17230 8786 -3909 -14323 -17087 -11512 -398
984 -398 10430 15449 13095 4884 -3780 -10819 -13429 -10975 -3534 6098 14204 15977 9142 -3062 -13674
999 -13674 -17501 -11963 -848 10287 15703 13275 4908 -4918 -12373 -13736 -9094 -1103 7475 12326
1013 12326 12124 7336 -1886 -10654 -15397 -12649 -2604 8712 16300 14827 6093 -5836 -13448 -13989
1027 -13989 -8471 276 8405 13070 12076 5834 -2933 -11126 -14600 -10854 -1708 8585 15070 14249 6428
1042 6428 -4762 -13694 -15502 -9678 1400 10269 13615 10667 3428 -4372 -10589 -12333 -9173 -1859
1056 -1859 6799 13333 13244 6397 -4394 -12943 -14815 -9386 838 9708 14184 11104 3442 -5874 -11756
1071a1756j15M866P182O914M549n17n170q510q109l732M095R661J0480N545k892
1086A2491q792j0255o674L62O012Q740P135K784k011o268p435o366j754L182Q060
1101g89Q695N720j483p512j0362p659p09O738R657Q172K017l800p185p186m233
1116i919n89M012O613O569M904m92o175q768p489k024N236R206Q734L564l270
1131A0112q193q544n063N02N855P422O335K634j866n869p569o146j523M201Q517
1146H05Q475M400l088q250r574n067P59N912Q386O364K345l285o363p660m214
1161a0055k48M340P016P180L421j776o868q419o140j9N614Q612O938J893l380
1176H109p190o701m102Q3M590O621O368L056j518o629q153n776K01N099Q327P055
$$ plain form
1071 -11756 -11871 -7005 177 7091 11640 11123 5953 -2557 -10666 -14398 -10303 -642 9838 15383 12491
1086 12491 3699 -6556 -13230 -12868 -6856 1884 9019 11803 9792 3524 -3911 -10277 -12031 -8849 -789
1101 -789 7906 13626 12143 4631 -5731 -13390 -14099 -7361 2296 10468 12485 8685 1500 -5686 -9919
1116 -9919 -10508 -6496 117 6686 11590 11098 4923 -3845 -11334 -13358 -8122 1084 9818 13382 10112
1131 10112 1919 -6625 -11688 -11186 -5331 2091 8426 11060 9194 3325 -4244 -10390 -11913 -7712 805
1146 805 9280 13680 10592 2342 -7232 -12299 -11540 -5628 2758 9122 11467 8182 1819 -5841 -10055
1161 -10055 -10303 -5963 1053 8233 11654 9878 3010 -5409 -11549 -11568 -5954 2658 9596 11489 8109
1176 8109 919 -5782 -9884 -9801 -5211 1410 7778 10834 9316 2687 -5466 -11242 -11041 -5942 2385 9440
1192I440K699l564p867p891l874J203N740O904N382J900k450n867o933n284l61
1207a0823M598Q313P208K747l828p443p766m070J364N778P539N291J219l524o228
1222C75n454l551R6L971O053O196K810j908o309q056n346Q28N903Q229N862P68
1238A0467m227o653n925l122J034N017O338M710J763k377n852o727m504p6N259
1253d875P591O575J755l686p341p544k889J956N976O919M030N71k830o034o010
1268e836l026K16M933O940N005J330k709o537o721l579J417N363O827N372L71
1283I366l780o065n498k764J057M474O105M531J837k625o565o279l400J009N397
1298c200P042M744O92l576o457n882k847J577N486O120M365O52l291n897n496
$$ plain form
1192 9440 12139 8575 708 -7183 -11057 -9854 -4114 2790 8172 10072 7622 1755 -5178 -10462 -10823
1207 -10823 -6225 2088 9296 12043 8215 772 -6994 -11064 -9700 -3922 3617 8908 10127 6603 375
1222 375 -5079 -8630 -8534 -4563 1490 7686 10496 8588 2279 -5777 -11123 -10295 -4392 3837 9699 10467
1238 10467 6240 -413 -6338 -9460 -8426 -3409 2929 7639 9402 7025 1173 -5554 -10058 -10134 -4875
1253 -4875 2716 9291 11046 7360 19 -7525 -10414 -8458 -2482 4437 8467 9038 6208 174 -5836
1268 -5836 -8862 -8646 -3713 3227 8232 9562 6853 316 -6405 -9984 -8567 -3204 3623 8995 9366
1283 9366 5586 -479 -5977 -8741 -7684 -3210 2895 7426 9263 6638 73 -6206 -9606 -8597 -3200
1298 -3200 3842 8586 9278 5702 -755 -6637 -9484 -7907 -2421 3699 8064 8716 5425 -472 -5968
1313e968l014J024N123O750M848O65m185o317n597k086K235M828N948L637J90
1328H081l162n602m934k754R88M614N968M299J554l623o123n799k467J756N416
1343a788N947L828p0l676n296m957j958J462M404N096M286Q02k610o069n564k852
1359i015J536N538O419M152j84m242o034n153j436K230N161N597K587K44l251
1374D149n374m606k145J422M598N756L787N53l817n466n720j654K472M799N362
1389D116L484l75l764n221m128j298J455M210M967L612J19l250n052m957k046
1404h128K069M420N857L587o74l463n916m204j466K500M427N178K931n2l555n272
1420a761m116j772J910M635N377K978k69l529n424m300j487K521M892M967K362
$$ plain form
1313 -5968 -8982 -7958 -2835 3915 8763 9428 5243 -1074 -6671 -8757 -6522 -1694 4254 7891 8081
1328 8081 4919 -683 -5617 -8371 -7383 -2769 3199 7498 9052 5429 -694 -6493 -8960 -7204 -1788
1343 -1788 4159 7987 7917 4241 -1055 -6012 -7970 -6508 -2104 2992 7278 8080 5470 -599 -6163 -9015
1359 -9015 -7479 -1941 4478 8630 8446 4204 -1830 -6983 -8419 -6189 -1028 4569 7156 7400 4149
1374 4149 -1225 -5831 -7976 -6554 -1956 3800 7587 8140 4323 -1143 -6863 -8517 -6045 -1246 4116
1389 4116 7600 7225 3461 -1760 -5888 -7186 -5731 -1521 3446 7058 7177 3927 -1125 -6082 -8128
1404 -8128 -6059 -1639 4218 7805 7131 3668 -2248 -6452 -7918 -5418 -991 4187 7118 7066 3511 -1761
1420 -1761 -5877 -7649 -5739 -1104 4273 7251 6982 3453 -1971 -6271 -7758 -5237 -345 4622 6984
1435F984k28l836m636m139j385K172M506M727K715j30l757n081l774j527K352
1450e037M281M921K488n45l322m596l957j304J838M538M916K721n80l254m960
1465a852m391j239K652M803N205K047q84l789n100l842j62K322M156M660K079
1480F665p86l452m765l431j162K045M571M917K813j327l483n290l515o86K737
1495d149M467M272J552r17l074m560k918q62J982L789L870K807j48l634m689l727
1511e939r98K556M848M436J785j264l248m874l409j53K863L549M237J923j213
1526E099l494m174k850p49K155M431L948K490j361m081m373l259J30K783M248
1541I43L611J443j450l240m055k442n59K251L834L751J845j012l415m403k681
$$ plain form
1435 6984 6756 2920 -1716 -5855 -7240 -5068 -562 4165 6880 6750 2993 -2088 -5862 -7389 -5037
1450 -5037 -756 4165 6653 6108 2786 -1810 -5767 -7071 -5233 -695 4221 6942 6362 3108 -1852
1465 -1852 -6243 -7482 -4830 -27 5178 7225 6341 2552 -2548 -6390 -6552 -4230 -74 4586 6665
1480 6665 5879 2427 -2338 -5769 -6931 -4886 -315 4602 7415 6088 2605 -2685 -6200 -6886 -4149
1495 -4149 318 4590 6142 5225 2151 -2409 -5327 -6189 -4207 -418 3452 6259 6111 2477 -2212 -5939
1511 -5939 -6937 -4381 467 4903 6688 5424 2176 -2698 -6107 -6260 -3397 152 4389 6312 5099
1526 5099 1605 -2569 -5419 -6168 -4013 418 4366 6856 5495 1414 -2959 -6218 -6088 -3305 943
1541 943 4554 5997 4547 1307 -2748 -5190 -5749 -3498 336 4087 5932 4920 1505 -2898 -5579
1556e579%K154M062M005J507j226l341m471k310n24K452L912L652J828j261l549
1572A311m165l034J49K606M351L292J465j194m071l579k559l93K875L840L748
1587D642J148j142l448m207k543QK754L710L833J320j919l616l841k251O15K661
1603b276L490K714J415j222l100l777k329j7K220L698L633J338j521l574l583
1618b891k551L30K844L690L679L50j701l422l484j936K88K470L470K941J026r77
1634D126l367m015k285J87K734M112L488O75j677l947l531j827O61K972L395K454
1650D155N97j175l297l188k030K82K358L766K822J089j549l478l564k030Q13K416
1666b013L764K848N70j946l070l392j422L23K397L579K632O53j587l352k959k006
$$ plain form
1556 -5579 -5579 -3425 637 4642 6149 4923 1582 -2889 -5199 -5723 -3271 641 4293 6121 4860 1311
1572 1311 -2854 -5888 -5739 -3133 1218 4510 5975 4781 710 -2869 -5428 -5821 -2946 894 4642
1587 4642 5790 4648 1200 -3007 -5550 -5542 -2788 922 4755 6075 4156 540 -3301 -5552 -4937 -2276
1603 -2276 1214 3928 5343 4121 1021 -2756 -5085 -5102 -2882 816 4449 5787 4266 692 -2891
1618 -2891 -5442 -5112 -2268 1422 5101 5451 3750 328 -3156 -5092 -4804 -2334 1136 4077 5103 4126
1634 4126 759 -3256 -5541 -5354 -2620 1492 4980 5655 3978 31 -3500 -5327 -4666 -1694 1701 4155
1650 4155 4752 3577 280 -2908 -4938 -4656 -2298 1468 4290 5379 3830 352 -3212 -5242 -4429 -2013
1666 -2013 1751 4599 5169 3223 153 -3239 -4661 -4338 -1941 1638 4270 4923 3336 -16 -2975 -4981
1682d981P36K547L570L011Q1j717l265l139k055Q03K626L989K466K15k106k972
1698a91l303j378Q01K530L441K316M75j820l003k897j881J027K366L254K398O03
1714D738j504l163l235j799N74L056L391K559J63k252l029k836j238O51K649L238
1730A963K159M78k033k638k908j628O29K533L401K126O60j733l772l154j108R01
1746d124L080L520K062k82k091k702k903r66Q55K627K906J974K75j879k707k793
1762c148j142N96K636L182J944M57k111l021k904r86J784K153K414K090j03j582
1778B259k816k634j142P01K524L338J646O1j460k987k871j053J042K602L007K181
1794D398l29j954l246k222p90R88K532K839J746j81j510k900k905r11J131K763
$$ plain form
1682 -4981 -4245 -1698 1872 4883 4964 3247 -18 -3157 -5212 -4409 -1783 2206 4672 4887 2781 -191
1698 -191 -3494 -4872 -4071 -1541 1900 4216 4691 2871 -132 -3029 -4910 -3883 -1517 1737 4135 4738
1714 4738 3234 71 -3164 -4963 -4389 -1333 2058 4617 4780 2528 -501 -3337 -4575 -3924 -1275 1963
1730 1963 4122 4600 2567 -71 -2979 -4607 -3978 -1445 1956 4082 4742 3009 -763 -3917 -5025 -4124
1746 -4124 -1044 2476 4538 4256 2165 -537 -3440 -4406 -3551 -924 1982 3956 4231 2352 -355 -3148
1762 -3148 -4290 -3694 -1058 2124 4068 4525 2414 -607 -3511 -4497 -2713 -560 1854 3944 3841 2259
1778 2259 -557 -3191 -4333 -3632 -1108 2230 3876 3937 2477 -510 -3381 -4434 -3392 -790 2217 4398
1794 4398 4069 2115 -1131 -3353 -4143 -3155 -623 2216 3962 3781 2271 -629 -3534 -4445 -3314 -551
1810e51K929J890l13k076k361k975p37J053K510K621J966l56j835k933k342n76
1826d086J048K627K853J508j81k133k656k249m94O64K894K189J864k3j902k595
1842f72k478j028J034K479K887J722r2k124k686k427o35J366K786K082J629p95
1858C048j631k457k179o54J272K249K643J736m29k006k736k213m02J265K477K489
1874B472J072k45k102k559j781l70J434J796K445J277k63j545k793j792q89J113
1890b730K662K401J459l31j876k965k102m87J206K819K521J356r02j849k496j647
1906b961o23J315K253K654J072m17k143k631j992j10J615K167K195J148q00j688
1922A054k498j884p2J284K559J642J151j15j928k513k032n9J525J958K288R76
$$ plain form
1810 -551 2378 4268 3955 1879 -482 -3457 -4194 -3141 -631 1990 3956 3600 1765 -1168 -3510 -4086
1826 -4086 -3038 -411 2442 3950 3769 1636 -1020 -3269 -3763 -3099 -205 1984 3848 3825 1923 -672
1842 -672 -3150 -4178 -3144 -665 2222 3944 3852 1728 -958 -3385 -4020 -2654 132 2214 3843 3048
1858 3048 1417 -1040 -3219 -3873 -2601 -352 2291 4027 3598 1592 -1144 -3357 -3759 -2494 -17 2472
1874 2472 3544 3299 1197 -1362 -3143 -3513 -2079 -283 2162 3439 3176 1631 -1162 -2954 -3843 -2730
1890 -2730 -68 2333 3792 3461 1585 -1380 -3482 -3969 -2763 56 2577 3933 3031 1182 -1314 -2961
1906 -2961 -3584 -2269 -16 2638 3710 3293 1150 -1481 -3473 -3583 -1968 199 2394 3542 2742 1054
1922 1054 -1444 -3328 -3400 -2116 443 2085 3236 3121 1193 -1320 -3352 -3411 -1886 72 2360 3336
1938C336m24k129k018j909m7R54K131K455J324q78j637k609j604m61J530K357
1954C71K199J078q57k091k123j766R9J157K357K002P34m79j525k524j821j61J549
1971a801K153K234J129j162j836k352j486R1J428K443J569M53o38j859k009j135
1987b778j16J290J652J977J162n63j987j959j708p2J216K512K028N58o14k149
2003D49k106j358M51Q80K271J930M60n72j692k438j215k91J469K340J970Q42r80
2020B410k081k158j297K50J495K163J671O83j044j925j799j193L4J454J849J817
2036B329M40o56j766k034j235M36R93K482J323M65m22k034k149j062K93J226K145
2053G74J395O84n43j931j981j063j23J416K188J574M86r03j635k284q97o1J732
$$ plain form
1938 3336 2912 783 -1235 -3144 -3191 -2237 -106 2349 3673 2795 1158 -1451 -3055 -3516 -1986 371
1954 371 2570 3648 2791 700 -1423 -3189 -3090 -1933 424 2426 3160 2681 1156 -1368 -3189 -3350 -1801
1971 -1801 352 2586 3715 2553 717 -1635 -3121 -3030 -1602 841 2410 2863 2225 366 -1643 -2778
1987 -2778 -2894 -1604 48 2025 3187 2624 637 -1322 -3030 -3102 -1886 626 2654 3212 2598 449
2003 449 -1657 -3015 -2564 -1684 587 2517 2977 2405 713 -1725 -2940 -3231 -1762 578 2548 3390 2410
2020 2410 329 -1829 -3126 -2876 -1381 782 2453 3136 2092 167 -1632 -2825 -2791 -1337 512 2329
2036 2329 2769 2113 347 -1687 -2922 -2486 -1493 989 2312 2777 2355 321 -1828 -2890 -2597 -1371 774
2053 774 2169 2853 2310 379 -1602 -2665 -2788 -1372 816 2390 2876 1973 338 -1946 -2843 -2904 -1172
2070a172K066J423L95o74k046j773r63K34J576J524J884L03j180j539j982q86
2086b810M89J403J947J268K07n57j692j567j298R0J501J754J382N59r66j514j908
2103a712j222M00J639J974J272K60j216j462j640q48L47J491J499J567M17j053
2119A713j415k344l86K95J337K068J288M51j263j756j834r64M48J602K111J019
2135B370Q0r40j712j513m98J69J190J636J374M86r57j902j179j002J35J688J446
2152H71J209Mp84j509j494o72L88J378J512J096K76q03j602j548p05J29J671J388
2170H05J581n7r36j741j585m71M82J428J460J477J88j416j592j635l39M96J596
2187b59J228J440j99j046j468j614j53N88J029J242J257J31q28j711j270o77N52
$$ plain form
2070 -1172 894 2317 2712 2038 -8 -1781 -2744 -2510 -934 590 2474 2777 1597 58 -1924 -2810
2086 -2810 -2321 -918 1029 2297 2504 1947 255 -1312 -2610 -2520 -1019 735 2117 2676 1710 196 -1712
2103 -1712 -2934 -2534 -895 1079 2351 2611 1395 -67 -1707 -2555 -2208 -717 782 2349 2766 1713
2119 1713 298 -2046 -2432 -2137 -800 1268 2556 3007 1744 -12 -1846 -2810 -2362 -760 1351 2370
2135 2370 2450 1510 -202 -1715 -2213 -2044 -854 782 2156 2642 1685 -217 -1396 -2398 -2263 -575 871
2152 871 2080 2084 1300 -209 -1703 -2375 -1987 -609 903 1999 2275 1472 -130 -1678 -2383 -2254 -583 805
2170 805 2386 2329 1393 -348 -1933 -2404 -1922 -494 966 2443 2631 1215 -377 -2012 -2351 -1855 -259
2187 -259 969 2409 2210 1164 -304 -1918 -2071 -1483 -454 788 2045 2176 1348 -363 -1633 -2310 -1758
2204a758J165J823M95N62r97j643j489k39M15R61J765J225j37j033j512j322l58
2221b077L83J060J882J072l43r02j566j421p51Q10J596J587P91j73j041j521j228
2238a842n11J013J185J354J074m56r74j167j344k94N72J092J365Q64J58j295j592
2255g98j035m5M97J371J132P69q9j209j143p89n23P10J272P03Q74J57p29j697
2273e72r75p63O08J432J555Q51l50j526r80r94l99J094J092J340M47L8j350j245
2291f97j283J88K60J343J469N66j56j093j088j268l26Q04J462Q94Q89j90j312
2308D62r88q97m95R24J257P69P21k68j027q45j340j24P61J210J357K57r8p77j567
2327g08q14k81Q35J262R29N30p7j157j377r43J84R07O83J503L06m05j018j016
$$ plain form
2204 -1758 -593 1230 1725 2287 1290 -353 -1842 -2081 -1666 -705 1060 2285 2148 1115 -397 -1719 -2077
2221 -2077 -1694 -634 1248 2320 1977 1075 -491 -1912 -2663 -1853 -257 1330 2121 1948 907 -614 -1842
2238 -1842 -2353 -1340 -155 1199 2273 1817 843 -324 -1668 -1962 -1390 -298 1067 1931 2089 794 -798
2255 -798 -1833 -1878 -1381 -10 1122 1891 1802 593 -550 -1339 -1862 -1152 120 823 1697 1854 1125 -572
2273 -572 -1547 -2310 -1702 -270 1285 2136 1786 260 -720 -1714 -2113 -1019 73 1413 1860 1898 548 -697
2291 -697 -1980 -1792 -1532 -189 1280 1846 1690 597 -491 -1759 -2085 -1281 181 1075 1964 1774 462
2308 462 -526 -1423 -1918 -994 263 1032 1753 1485 458 -387 -1727 -1851 -1090 120 1477 1734 1636 859 -708
2327 -708 -1522 -1803 -968 294 1223 1753 1676 519 -858 -1801 -1617 -710 -27 1476 1782 1377 359 -657
2345f57j242K25P41J484O50N33m76j196q60q45j22O76J371Q96N25k80j172r31
2363f80p02r2L27J221J022K41q0j083p93r56ON69J269R30M85k82q15j360j016
2382a789j5R67J274Q92O90q79r93j112n29m6P49J067R90M94p47p97r43o56kP23
2402f62Q83R73O69q36q08j108o38j7O66J365J044j7n33p48j230j74k82O86R69
2421B02J017M71o03o65j384l31r9O99J061J275L31p17j395r18m58K18P48O60J227
2440A339P7n15r09p91p04K97M35J134Q96M27q08p95r49m93k8P82J127R41J07o38
2460I32q14j093n60K8J104P55J089j51k16r64j438q3K33Q62R25N45K03l28r72
2479E7q77o37K15N35J014J082J23p31q99o09r05N01Q25P37R82j59m27q43j054
$$ plain form
2345 -657 -1899 -1674 -933 551 1201 1734 1258 62 -798 -1643 -1765 -1089 282 1178 1703 1423 251 -680
2363 -680 -1382 -1474 -1147 74 1096 1337 1257 174 -619 -1575 -1569 -1000 269 1199 1684 1402 587 -773 -1789
2382 -1789 -1804 -837 437 1329 2019 1140 147 -965 -1494 -1540 -791 276 1266 1760 1013 216 -727 -1383 -1385 -662
2402 -662 221 1194 1863 1027 219 -889 -1527 -1544 -878 487 1531 1514 981 233 -997 -1171 -1453 -767 202
2421 202 1219 1690 1087 422 -962 -1293 -1392 -693 368 1643 1974 1257 -138 -1056 -1514 -1296 -548 112 1339
2440 1339 1416 901 -8 -799 -1503 -1206 -771 363 1259 1686 878 83 -866 -1359 -1387 -605 522 1463 1570 932
2460 932 118 -975 -1535 -1507 -403 352 1441 1290 1074 110 -1328 -1411 -1178 -316 609 1154 1357 1029 57
2479 57 -820 -1457 -1242 -707 307 1389 1512 781 -118 -727 -1632 -1131 -306 431 1413 1254 827 -16 -1070
2498a070k33K37M72J187M12M20o31p86q56n60P5P57J271K42M48o44q35p57l18
2517a169j07O23J196N38J10m73r01o28k66J01M21J005N57K49j59j091o75n46J46
2536a069R71O99P54o1m32r95o52k14K07O06N87O14K76o82p45o21n18K55R31N63
2556D74Q15m2q60p34k88p24L61N99J060M06J32l17j241p04n7J67R59O23M97L63
2576A489q72p33q60l87M63N11O39Q34K1l33r21o35n52M81P20Q39L92j1k77j203
2596c95m81n92Q92L25Q84L46J70n57r65m70om4N98P00N65j61j33q69p64j1J60
2617h08P42N33Q47k26o44m25j048j65M35N20J009K32j08j99r28o80l50M97M43
2636c23J015M71k62m17o13o42k20M35N61P13L52m12l21l71p06j69P5P58N04O21
$$ plain form
2498 -1070 -1303 -1066 -594 593 1005 1425 794 8 -848 -1408 -1333 -576 695 937 1385 741 -94 -851 -1169
2517 -1169 -1276 -653 543 1081 1191 718 -183 -811 -1077 -976 -555 450 1007 1256 1097 6 -669 -1215 -1069
2536 -1069 -98 601 1355 1294 862 -133 -785 -999 -792 -186 401 1015 1291 609 -136 -757 -1275 -1020 -89 474
2556 474 1289 1247 387 -347 -635 -1359 -998 -399 661 1067 1199 882 -359 -1063 -1120 -953 6 629 1126 1489
2576 1489 617 -116 -976 -1363 -900 -389 250 1084 1105 772 -149 -784 -1336 -855 -135 704 1096 1085 808 -395
2596 -395 -876 -1468 -576 -251 633 979 1149 592 -373 -843 -849 -893 -295 405 970 809 676 -193 -957 -968 -808
2617 -808 -66 467 1314 1088 444 19 -1029 -1194 -759 -239 770 1002 894 695 -233 -913 -1263 -766 -323
2636 -323 692 1163 901 484 -129 -771 -991 -556 5 718 1070 658 337 -34 -740 -909 -834 -76 428 1049
2656A049k55n39n24n71k85M93N66R45L20k31o33m93o66J04K44L68P96M93n36o19
2676B6j71p83J01O27l5O42O31kn65p79m83l02L88N43N92N84k49l14o68m40m79
2697a136M53P60O35L01l83l69n05n36k55K68P98N62J86M0m70o23m31j94K52M21
2717b26N25O92P5m03r44m72r0J46Q91M33L11k28m36n61l44k38L72Q46L7J75K83
2738H44n10p81q8j26J07L67M62L11L6l96p37k46j88M54N36L21J82Q2l10l36q68
2759h84K19Q6M86N77N82l59m08q50j75n3M09K90N68r5O76p20r72J76j87KQ60K96
2781E24K56l84K8o62o68RM41N54N15J72k08n16l54n18J01N47K33M62K21l52k33
2802A68n08o08K71J92P77O51j3n02m97o33j0O1J47O70K63L36O1j006m98J67j6
$$ plain form
2656 1049 794 255 -269 -840 -1125 -632 -66 879 1199 968 335 -158 -824 -720 -476 -108 688 1181 645 26
2676 26 -145 -928 -827 -200 -235 407 1038 1036 471 -308 -791 -1093 -705 -162 430 1014 765 451 -217 -657 -1136
2697 -1136 -683 77 712 1013 630 261 -244 -780 -1035 -767 31 593 779 819 349 -274 -705 -899 -647 -226
2717 -226 299 991 1066 663 -281 -753 -843 -697 194 627 938 710 274 -287 -631 -869 -497 349 386 561 844
2738 844 334 -447 -535 -661 -554 -187 275 586 622 226 -511 -757 -945 -491 45 366 548 630 320 -16 -884
2759 -884 -665 -579 -93 484 1066 707 299 -551 -726 -779 -370 -80 488 393 1069 349 -623 -447 -634 -632 228 524
2781 524 780 396 424 -238 -906 -897 -456 98 613 785 577 61 -293 -811 -710 -163 70 532 753 401 168
2802 168 -340 -948 -677 -485 292 943 930 428 -69 -702 -712 -651 -504 166 429 765 826 -180 -678 -511 -527
2823e27M58K56L44K86j92n04n43Rp1K23L06K79M64k89l67m76l26M9J86M27M79
2844D71J30j22j27n89k47q8K71N87J04L76l56m02k87n52M19N6L85M45J8R3n93
2865hm6q84K95L65K67M08K96j33m38r22J11K27M71rM79M2k99k98r7j61j47M78
2887cR3N46j16n4n04k19k21K3K43L30N14Nm22j73j88l07K19m7O10K24j95P0l45
2910H3n30k58J6L99P14l17L73J75m95o57j56L62Q1Q1N85rJ28n16l29m62K58k3
2932d97M10O11j92k04k2o44k18K07O23L3K79J37j39n11q7k3k20K56P90J46l50
2953C85J15l22l40m57M7M66K26M62j32k54n1n22j83J33M50K58M58N8l66m30l96
2974c95J1j00M53K55L03K49n63l67r1l65J90N38J8K22K92n28p4j03l69P9K53J52
$$ plain form
2823 -527 -69 187 531 817 625 121 -422 -413 -484 -261 45 324 788 499 132 -344 -670 -621 -435 -8 471
2844 471 601 479 352 -237 -484 -572 -301 286 390 766 410 8 -279 -831 -412 -356 29 474 492 585 -8
2865 -8 -54 -938 -643 -278 -11 397 693 560 122 -800 -689 -462 9 0 479 521 222 -76 -173 -334 -481 -3
2887 -3 90 636 520 466 -38 -257 -478 -455 -212 118 632 637 215 42 -146 -453 -234 -281 329 553 358 428 83
2910 83 -447 -705 -689 -290 424 107 480 655 160 -497 -653 -291 -210 -129 456 447 575 59 -270 -732 -474 -497
2932 -497 -87 524 332 128 106 -538 -756 -549 74 107 386 523 384 -127 -214 -237 -457 -201 589 735 385
2953 385 500 178 -162 -619 -572 -106 120 582 450 196 145 -377 -560 -427 23 281 739 797 431 1 -395
2974 -395 -384 -484 -31 224 527 776 213 -154 -245 -610 -420 118 136 358 650 122 48 -55 -424 -345 -92 60
2996F0L26j57j43q9k83r5L23rK70M97n10J56j28o88K52k81N66L47O0lj69l43l49
3019c90k88m8O69K05n8J89l12q0k00P3k55M96o3M12o4L55q07k57nJ22J41M46q2
3042A99J13k16m6l32j06M28p0R0L40J58n60K48m03k77K58j45N52K77L26m86m21
3063g3l41o3J72K32J96K16K46m80j60k38j33J8K13M28J41Q2l89n1l71R8J83k02
3085b76O27q2l1j64q7k96j11K30K82Q6Q8j2k84l32J25k7j54M64J81J60O9k62l12
3108a18j54N0J30L23p3K80j12j04m16J1k78K08L16J52k6J89q6n14J30k32K19J92
3130H7P9K70j28l61q0Q8k00J74Q1K74R4l01j64Q8m72K53J05L69J8k1K84l32l58
3153a53l7o0O9K54RJ90M4j53j90K9l88M40J15J07Q5r5l21j46R9rkJ81J90j92K16
$$ plain form
2996 60 386 229 86 -3 -286 -381 -58 -67 203 700 190 346 218 -470 -218 -499 67 414 474 471 302 -41 -390
3019 -390 -678 -726 -57 148 90 279 -33 -113 -313 -240 -495 1 -62 350 286 641 -166 -423 -428 -306 -165 281 199
3042 199 312 96 50 -282 -388 40 -30 60 400 558 -2 246 -157 -434 -176 -321 231 508 834 348 -73
3063 -73 -414 -477 -305 -73 123 339 585 105 -55 -293 -426 -408 -195 233 374 456 67 16 -355 -257 -74 -276
3085 -276 351 269 238 74 -13 -309 -420 -190 92 178 266 254 -30 -362 -237 -264 -418 46 227 387 456 194 -118
3108 -118 -272 -222 -92 231 158 438 326 222 -194 -183 -461 -253 63 215 189 378 292 -222 -92 -324 -105 87
3130 87 166 436 308 -53 -133 -45 -245 -71 10 284 378 77 -87 1 -471 -218 -113 256 274 253 537 205 -153
3153 -153 -190 -250 -181 73 82 272 316 163 -27 2 -386 54 169 276 361 266 -55 -201 -102 -111 -113 68 258 66 282
3178B82m4l45j24P6J29J06M09l20p3R9m9k31l79K18M57r0j59J96p8m3j50j68J26
3201a55R1M18L37k03m24J81m24J47n9K14J02O6J39k79j43k62q3J97O1J16K91j84
3223A44j59J86n17M7K23j16K64L74l26M7l67j43L05L7NN0J49l3n4k3r9l49n6L03
3247a08K35N15m59r9K7n00P8K60J66M5N01n24J36m19K61o53L07M17K36l38M8j47
3269a5j26n9p4J26L38j73K96m35J77l10K4Q4KL19j6J63j09L3o99kr6N50L9K11
3293B48k36K88k95j58nM4m1L29r0J88l2m20J32p5j06m8K18J42J91j9p7n19N3M5
3317b43K59M7J59q0R5k79k29J12k30J74J40j3J82j12L5j04J74j79Q8J5mK18k96
3340g1K8J2M1J65k02L43P3J8k75o5k7l23j28K34L60R2l1k06m0k38q6J58K07M7
$$ plain form
3178 282 238 -107 -231 -155 -26 80 489 169 96 195 146 -85 -464 -246 211 121 -38 158 80 37 -113 -281 -155
3201 -155 -64 354 691 488 64 245 -179 -32 -91 123 225 291 430 151 8 -254 -337 -140 -79 37 328 144
3223 144 -15 171 -346 -299 -76 -192 72 446 120 167 -200 -343 -38 -1 4 54 203 170 116 93 -6 -355 -411 -108
3247 -108 127 642 183 84 111 -389 -311 -51 115 160 661 137 273 -146 115 -538 -231 186 422 84 132 -15
3269 -15 -141 -200 -274 -148 190 17 313 -122 55 -255 -231 -147 -145 174 158 321 212 245 -454 -456 -552 -2 37 248
3293 248 12 300 5 -153 -158 -114 -155 174 84 272 240 -180 -48 -123 -229 -277 -59 83 274 255 178 -341 -288 -243
3317 -243 16 63 222 142 237 -42 -271 -159 -389 -215 -75 -88 94 -18 17 -87 87 -92 -4 11 7 225 -71
3340 -71 -43 -31 10 175 -27 316 389 407 132 67 40 -283 -411 -177 183 275 244 38 -2 -240 -326 -168 39 86
3364H6K40k77J46k02k62J23l45M85K91k6J83l12l8r9l67M83j05M8L50l09K42o21
3386b86K22l63K38P3R0K85l7k89J21j70mo2N2L61r7j74J52l6j99j77K20K56m1
3409A35K3j6J42l73j84L27k9m1k17J54L90m74J08k42J15J05j71L87j42J50O9m8
3431A68k01j10l30M16K76n5P2M3m35j4L41l72j07K43K37J56kk15k37j35J38K24
3453A01J68N5j0J38m32L7j77O9j32J10L17j94Pk01rPk48L55l8K11j08K4L7j25
3477c8j41K75k21K37L4MK44k83M6k45O5j14J95J17N3q7j20o6j94o1Q5K28k91N62
3501B84l37J15k77o2J78K19m0j36Q3K05M4n50J43o2J06K25m4n4M2j01J77m9l03
3524a94J23L78j42j16J77k14k44M2l4L43k15N7L02j19k10K9k27K5J63L01j73O2
$$ plain form
3364 86 326 49 195 -7 -269 -146 -491 -6 285 259 442 130 92 -7 -374 109 4 52 402 93 335 -286
3386 -286 -64 -427 -189 -116 -26 259 222 -67 54 -116 -120 -182 -130 231 134 -40 112 76 -123 -300 -80 176 135
3409 135 158 142 284 -89 -273 54 25 -16 -233 -79 311 -163 -55 -297 -182 -77 -248 139 -3 147 216 168
3431 168 -33 -143 -473 -57 219 164 236 279 -156 -170 171 -201 -308 -65 172 328 326 111 -126 -261 -123 101
3453 101 269 324 314 452 20 57 -120 -51 -183 -73 244 50 57 -144 -153 -146 -394 -39 -77 134 26 50 87 -38
3477 -38 -179 96 -125 112 146 150 394 111 157 -88 -23 -137 58 175 228 141 21 -45 -239 -300 -215 13 -278 284
3501 284 -53 62 -215 -277 -99 120 80 -56 27 232 276 -274 -131 -193 -87 138 94 40 82 -19 158 109 -194
3524 -194 -71 307 165 49 226 12 -232 -190 -224 119 -96 -39 263 144 -66 -37 -264 -239 -76 225 52 114
3546A14O5j29k47J60j40N8L95l02N9J45j49j14j86K95k65M29j15r3K65k89Ok86
3568c24m3J44K82Q3j47qj63M10k88l7oJ8K88k91K48l24K68l32ML69r0K82m38K39
3592A44l3j51Pp0L06j74j19J10j9J4J12m12K84K3p8K36k66J39j6pK27m05J00J73
3616A25j58L71n24L97l0j99N1J91j37j0M8o9k16J05J00j79K10j24J30J31k25j44
3638a56J06J72J08o12J69J15K15l7J71l07n6J56N5m9J47r3q7j12K3k30K30J7J06
3661E1l3k39L84k63k3K13J06m1k07J11J07l17M4N3r2o4L4K57K49o42M26k39M14
3684B89m87J74K8p4K16J79r6j64o8j11L87k20k63K49J93l94j5J63l5J21j04J73
3706A41j72M2l11P7K98l02L66j8j76K21k23K35j42q7Q2k9K14k5k36j52m9M74l28
$$ plain form
3546 114 179 50 -197 -37 -177 -119 276 -26 33 178 29 -85 -271 24 -241 188 73 -20 245 -44 -38 -324
3568 -324 -367 -223 59 142 -5 -13 -176 234 -54 -91 -97 -79 209 -82 166 -158 110 -222 -218 151 61 343 -95 144
3592 144 111 -40 -33 -103 203 29 -90 20 1 15 127 -285 -1 22 -56 180 -86 53 37 30 257 -148 -48 125
3616 125 -33 338 -186 211 181 -18 33 224 87 77 125 56 -160 -55 45 -134 76 -48 82 213 -12 -156
3638 -156 -50 122 230 -382 -213 -98 117 80 251 -56 -112 44 99 50 197 104 17 -95 -72 -302 -72 -55 51
3661 51 18 -221 163 -100 -123 90 196 155 -52 59 166 -151 -107 -54 -146 -210 -176 81 330 -312 114 -125 289
3684 289 -198 -24 4 -70 146 325 229 65 -3 -114 273 53 -210 39 232 -162 -177 -14 -49 72 -32 141
3706 141 -31 11 -300 -223 75 -227 139 121 -55 166 -57 178 36 -51 31 2 216 191 -45 -197 -246 228 -100
3729a00l5K3rO0O1rjJ26k02J19q9jQ5j90K1j14M89kl60p8K58j1k6o8j50J4K91
3756A02n3j34j92R9K56K81m23q7J21Q2M6K51k22m38K02N2ml8N6J90p3j53l6q5
3780b00J97P5kJ03j94P8k17qL35Qk45J70j46Q1J17J10n05N4M15j40j82J76q8k1
3804b9K16k92K03l7O8j70K42n63L74J28l36L98j98Lk51L21j27m15M90p0R0j69
3826a24j00j8L29O0l32K33P0j4j68M64n42N2Kk19M12J21J12l87M6J12N7j96j64
3849a94oJ83J31rl1k93K36j62K64k46L80m65P5j4K33o9o9M4J32j64L67j44k36
3872e7j14L67l7J27k98n8R2N3Rk00j56M36K5j46Lj5L09m69N3j23J3K78R0k53R4
3897B3l42O24k26j23J56j23J72j56j05O8K08l05L06j89m0J07J86k54J93o06K33
$$ plain form
3729 -100 -135 -112 -121 -61 0 -9 -10 116 -86 33 -56 -57 28 -162 -141 -255 234 232 -128 -206 52 41 15 -53 -203 -189 102
3756 102 49 -85 -277 -178 78 359 -64 -151 -30 52 98 349 127 -311 -109 -57 -61 -99 -43 147 74 -79 -115 -200
3780 -200 -3 72 70 173 -21 57 -160 -168 167 175 -70 100 -46 35 152 262 -243 -189 226 86 -96 80 -8 -29
3804 -29 187 -105 98 61 129 -41 201 -362 12 140 -196 202 4 7 -244 77 -50 -465 25 -45 45 -124
3826 -124 -224 -242 87 147 -185 48 118 104 -64 400 -142 -90 -88 -307 105 226 338 -49 -3 109 166 -30 -194
3849 -194 -200 -17 114 105 74 -219 17 -145 119 -127 253 -212 -137 -151 82 13 -56 -12 120 -44 323 179 -57
3872 -57 -171 196 159 286 -12 -70 22 75 84 -116 -272 164 189 43 46 31 340 -129 -76 -199 -186 92 182 -71 23
3897 23 -319 305 79 -44 112 -11 161 5 -100 -32 176 -129 177 -12 -52 55 241 -13 180 -426 -193
3918a93j10M71k39K03m0k2J8j09p3J2J06o3j1Q0J20j98M47m97j04L14j22J32j60
3941c8K18q8k36K37j99j02m4K82J36j63j03N5m8K49J10k38J26k38j5q0K33l3L53
3964C74m53L14n05J27L87m39M09n39K71Q6J03l45N44l22l8Lj9L1J81R0j40m08
3986b88M52l40M06n15J79kL8l6O1J42r8m8J56j35m6K61j08k12K32k8k9K0j05P2
4010B9j79Q4l04J67O1lJ61J5j18L39j09J5k16M1J70j55qm8q0P1J51K25k98ml3
4035b6n32M14OJ60j8j88J16j91K90l1J22m14K89J59pj76Q2M7k83L72l82N6K64
4058A29o0J09J03j12k83q1L1O5l7l7K23L03n90K95j9j38O1P7Q2k0l6Nj35Rk4j38
4084b18K92n0j60m2Q7K74k86m0L7%r9r2O39m90N2K03j59l4L85n3k89j97J69M36
$$ plain form
3918 -193 -303 168 -71 132 92 70 88 -21 -94 -82 24 -39 -50 30 150 -48 399 -98 -202 112 -10 122 -38
3941 -38 180 92 -144 93 -106 -208 -252 30 166 3 -100 -45 -93 156 266 28 154 -84 -99 -179 54 21 374
3964 374 -79 235 -270 -143 244 -195 214 -325 -54 32 135 -210 334 12 -26 -23 -42 -11 170 260 120 -288
3986 -288 164 -176 230 -285 -106 -108 -70 -106 -45 97 -1 -49 107 -28 -74 187 79 -133 99 71 42 62 -43 29
4010 29 -150 -66 -370 -203 -142 -145 16 31 -87 252 143 158 -58 -17 153 -2 -10 -58 -138 -67 84 309 11 7 -26
4035 -26 -558 -144 -138 22 4 -184 -68 -259 31 0 122 -292 -3 156 149 -27 55 102 -181 191 -191 -135 129
4058 129 69 178 281 169 -114 -195 -164 -99 -136 -173 50 353 -237 58 39 -99 -38 39 121 101 65 70 -65 -56 -80 -218
4084 -218 74 24 -136 -178 -91 183 -103 -143 -106 -106 -205 -297 342 -148 -96 107 -52 -86 299 246 -43 -240 -71 365
4108C65m13nPO5J7J08p9m9j36K70k09J87m2J38l40L12k78J19L7o1r1M7k9K28j26
4133D2Nj88J14j53L25j89J2m6K76j68l57L54k11N3J90QJ65P9k85k78K35j1k78
4156c06J74J20l6L95l25p3q3N4k41K25K66r1k84K7Q5L9o8j09J61J52k24R0nJ82
4180A25M5k92L71l54L5J55p0O3j42J12j32J5K9M8L69n11J52O1l4l35L98j54j2
4203e8K45ll7l81P5L07O1k35pJ69j61j81L57k32l8k76J61M7K84K36j36k2m16j49
4227c90M80j17L9p7J90k55P3Q9j64J06qL85j46K36o03J06q1j6L64l97L01o7K00
4250B48j83j70J4K7p4J31N8L9L2O0k28R9jq8j36J13J20P7j15J38j11m14J25J96
4274d3J40k5k2j11j3K27k45m8j90O02l29K26J08k04m2q2j77K70J20l15K04P5p
$$ plain form
4108 365 -48 -53 -46 19 36 144 65 16 -120 150 -59 128 86 224 -116 196 -82 37 74 13 -78 -31 -60 168 42
4133 42 47 -141 -27 -180 145 -44 -32 -78 198 30 -327 27 -184 -131 59 67 232 311 26 -252 -17 -28 -306
4156 -306 -132 -12 -48 347 22 -51 -134 -80 -321 -96 170 79 -205 -178 -93 -54 -122 -231 -70 82 -142 -52 -57 125
4180 125 170 -122 249 -105 -70 85 15 78 -64 48 -84 -69 -40 8 377 -134 18 79 45 -290 108 -46 -58
4203 -58 187 184 147 -234 -159 148 209 -26 -33 136 -25 -206 151 -81 -119 -395 -234 -187 97 333 197 175 -241 -390
4227 -390 90 -27 12 -65 125 -130 -57 32 -132 -26 -34 351 205 441 -162 -56 -137 -153 211 -186 115 48 248
4250 248 65 -105 -91 -64 -138 -7 51 90 122 182 -46 53 52 -36 -172 -59 61 138 23 161 50 -364 -239 -43
4274 -43 97 72 50 -61 -74 153 -92 -140 -330 272 -57 169 277 73 31 -51 -228 42 162 -153 51 126 119
4297A19j75o8p6L16R1m6j32M8j51k02M86l18m2Q2P1J71k77Q6jKl29J41M62r4k02
4322c8j58L75m04l8M13j76J39K01k82m0N7N2k64k9J44q5K34k34L18p7k70M9N6
4345e7o4J37k03J79K0j88J13K30l53O6M41m57P7J99l24J85o7J11M5p6m5M23k32
4368A60r6j51l3n6L50p0j9j50N3n7l53K00N6K10k22n9M51k65J10o0l92L67Q8o5
4392cK01j92l63L23K11k49O9k6k68L25p0KN1o2k15L85Mj95K02J90l63j7o1M37
4416C16n88M60p2k0L0k52K12l89K64N3j87K49J60N3k79j74N0n7J98j89J23J51
4438A12k19J57J09k40N2P1J50l0Jm28M35n2m82K25J36K2j85J85J39J28k21k14
4460a49J85j29L42m98O30l63k8o8J52J5j01j34L45k57R7L01m74P8N8N4L9nL6k10
$$ plain form
4297 119 -56 -124 -200 116 207 161 29 77 -74 -276 210 -108 -150 -68 3 174 -103 -17 -18 -16 -345 -204 258 164 -38
4322 -38 -196 179 -225 -263 150 -26 113 314 32 -8 49 101 -163 -192 -48 -133 101 -133 185 108 -162 -113 -57
4345 -57 -121 16 -187 -8 12 -176 -63 167 -186 -120 321 -136 -59 140 -184 1 -66 45 90 14 -31 392 160
4368 160 64 -87 -120 -176 174 104 85 -65 -12 -69 -422 -222 -166 44 -178 -237 214 -51 59 -1 -393 -26 62 -3
4392 -3 198 6 -357 -34 177 -72 -3 -29 -297 28 -42 -40 11 -51 -266 119 123 -72 130 320 -43 -60 -121 316
4416 316 -272 188 116 96 126 -126 86 -303 -39 14 -173 76 236 289 10 -164 -114 -171 27 -162 -39 112
4438 112 -107 50 159 -81 -29 42 192 162 163 -265 170 118 -364 -139 -3 19 -166 19 158 286 65 -149
4460 -149 36 -93 249 -249 381 18 -10 -78 74 89 -12 -146 199 -58 39 340 -134 -56 2 56 95 90 126 -84
4484h4R4J29j53J62n8j32Q6j53j46K22k5k8J45Q3J1k49J17ON6k50Q1r3L02k46
4508a23J33J95J9l29j6n2K07J74j32K28k28j04j2j91M48l94K31j07P9K12k80J90
4530A48j17k96j83L19j2J86k92K97J30k05J25j05L9M6k9k30M42l47R0j90K15j12
4552h1J74k99L80k7j53k9l90M64m5J7J7r4p7o4M3n5L5L13j54L51j37m4j31P5o2
4577B7j75L08j17J04k7k5k99K14K58j71N7j23J68j50J38k01m85O22k66L12l82
4598b13K10J36k55O3P9r6r6L6p6K15K29n34L13j82L04l72P3M46p1l62n1K38J05
4621A39m85M53o3K3j47J77J57l20O6J87k7RJ06k89q4K9k7J04k43L07k23Q5R9N9
4645I2M6j56J45L0j23j03q1M11j29j32J51l59K76j82l3L12m04K58m1j49J78m15
$$ plain form
4484 -84 10 139 -14 148 90 -42 44 -109 -255 -33 -58 -86 59 142 153 -96 21 27 83 -167 -86 -179 123 -123
4508 -123 10 205 224 -105 -121 -173 34 208 76 304 76 -28 -40 -231 217 -177 54 -53 26 238 -42 148
4530 148 31 -265 -448 -129 -141 45 -247 50 180 -25 100 -5 34 80 51 -179 263 -84 6 -184 31 -81
4552 -81 93 -206 174 147 -6 -35 -425 39 -6 11 28 -66 -143 -207 -164 -219 -184 129 -25 326 189 145 14 89 27
4577 27 -148 160 43 147 120 95 -204 10 268 97 154 31 199 49 187 -14 -499 123 -143 169 -213
4598 -213 -3 133 -122 -59 20 -76 -172 -136 -212 3 232 -302 11 -171 133 -239 -166 280 209 -153 -204 34 139
4621 139 -346 107 44 67 -80 97 254 -66 0 187 160 169 275 -14 -98 -69 -96 8 -235 72 -151 -66 33 92
4645 92 138 -18 127 157 34 -69 -150 261 132 0 151 -208 68 -114 -147 165 -239 19 -22 -171 7 -408
4667d08K9L00J60P9K3k7l05nJ01q0K75K27j76P6l10j23K75j12J46k4J37k27P1
4690A02k83K76m54L55K6n0J69j82J66n4l02K80J49m11J59O5j49J85Jl59N82M8
4712C19j56k39J63j87L85l04J64j73k57M55K0k04K63j75L5Q1m5J9l51K01r7K65
4734A82l06k41K63M7j66M06k32l05M40j69J39k73J30j06j19K16K24j73J58k29
4754a14J31j52J92m2j6J27j14k73K56k07K94k33R5J05J08K3nj42l4M9k49J27l0
4777a04K40j13J98l56J44k11L48m8J95n82M46J2k24p0j58K25L75k99J96J45m49
4798i0J81L52n71L07k90J26J01k71K09M0j06j58o5J68J01J6J75l24o9m5J17L4
4820f2L5K08l02K3L95l33J71n6k96L21J54l28m9K18q5l0J96p3l32J68L1k64L05
$$ plain form
4667 -408 -379 -79 81 160 183 156 -149 -154 -53 -133 142 369 193 269 -41 -164 111 -1 145 121 258 31 102
4690 102 -181 95 -359 -4 22 -28 141 -41 125 71 -231 49 198 -213 -54 11 -138 47 48 -311 271 319
4712 319 163 -76 87 -100 285 -19 145 -28 -285 170 190 -14 249 74 109 190 145 164 -187 14 -83 182
4734 182 -124 -365 -102 -55 -221 185 -47 -352 88 -81 58 -215 -85 -191 -310 -94 130 -43 115 -114
4754 -114 17 -135 57 15 -1 126 12 -261 -5 -212 82 -151 -56 49 157 180 175 33 -1 48 -201 -74 -104
4777 -104 136 23 221 -135 9 -202 146 98 293 -289 157 169 -55 -125 -283 -58 317 18 214 359 -90
4798 -90 91 443 -128 179 -111 15 116 -155 54 94 -12 -170 -235 -67 34 50 225 -99 -168 -213 -96 -62
4820 -62 -27 181 -121 -98 297 -36 135 79 -217 104 258 -70 -119 99 14 -16 180 107 -225 -57 -26 -290 15
4843A5j08n5J36p5rR1J67l55K60J4j1p6J23O9j37K67j45k31j42K0j8P4K59j07
4867B6Kj54K39k57J04j60K34l2p9J20j25M6J05l23K45J89k52M89o44J42N41m38
4889A8m2j42P7L85k22J88k41J03O0j53l97M25J37k98L35m00L7J59k01K09J21q9
4911F9j17j08kL63m05J48M4O0K9j44rk4J04k28K29j36o1K81O9k03L34l31j84j
4935b23K40L3k03L26j72j6q9k06K41J30j95L1K12j13J2J36k06j56K71j46J22J07
4957A36k37M5J68k43L76l17m5Q3J5J94j11k93K0O6J1k28N63rM9k34J23k22J0J65
4981H5j38L30k54P6R9k78n3J43j18P8R7K05m98O40m55K9l43J65K42j14j6K37j0
5004A49k33K98m8l01k3L03j43J58J4l83K33L3kj72K70q0J9j00Ql3j51K23Q0j38
$$ plain form
4843 15 -93 -148 -12 -87 -96 -5 162 -193 67 81 70 -6 117 186 49 316 171 -60 -202 -182 -200 -126 133 26
4867 26 28 -126 113 -144 -40 -200 34 2 -77 43 -82 -36 69 -254 -9 180 -72 417 -227 -85 456 18
4889 18 -24 -166 -89 296 74 262 21 124 184 31 -366 59 196 -102 233 -167 -130 29 -172 37 158 69
4911 69 -48 -156 -158 205 -200 -52 -8 52 81 -63 -72 -96 8 -220 9 -127 -188 93 162 -41 293 -38 -222 -223
4935 -223 17 50 -153 173 1 -15 -104 -310 -69 61 -134 -103 109 -4 8 144 -62 -218 53 -93 29 136
4957 136 -101 -56 112 -131 245 -72 -117 -34 -19 175 64 -229 -209 -143 -132 -360 203 194 243 9 132 -90 -80 85
4981 85 -53 277 23 99 198 -80 -133 10 -108 -30 67 272 -226 414 -41 -12 -355 -190 52 -62 -78 159 149
5004 149 -84 214 166 -135 -158 145 2 160 174 -209 24 57 55 -117 153 73 92 -8 0 -33 -184 39 119 -19
5028a9K96l61p2P3P6O9j22J32k27j2M33k52j34K4rk1mN5O9J61J03l14j13O0J49
5053D0J12l90L42j33OL44m90jJ92M4j00J30K0j8r4N4k68J52N6m7L3J87o1k52K20
5078G8k13p1Q1J65l18M24J55m77J17J14l1J56n8J27k05j68k40L03k06J29k17L11
5100d4l6k1K68j6k41J93m89L50J07j13J13k36M17k80J30l6l09O4J81pl06N02l89
5123a98J36k07K82K6j04K44rR7l09j94J88L66l45j70m1J17L92j95o3j63L13r5
5145F8L6r6l1J11k46KP1k44K59O3m6K41j05j49p6J12k5J97r0j09J95j8j18j77
$$ plain form
5028 -19 277 -84 -156 -83 -7 62 -60 72 -155 -167 266 14 -120 -96 -105 -126 -130 -75 -6 155 258 -56 -169 -109 40
5053 40 152 -238 104 -29 -23 321 -169 -170 22 66 -34 96 116 98 4 58 -210 -58 -2 -49 -16 171 110 -142 78
5078 78 -135 -206 -125 40 -278 146 301 -176 -59 55 24 180 122 249 44 -124 -364 -61 -267 -138 -355 -44
5100 -44 -80 -101 167 151 -90 103 -386 -36 71 -42 71 -165 252 -28 102 66 -243 -179 2 -5 -311 191 -198
5123 -198 -62 -269 13 39 -65 179 170 267 -42 -236 -48 318 -27 -197 -238 -121 271 76 13 -150 163 68
5145 68 104 8 -23 88 -158 -156 -85 -329 -70 -7 -53 188 83 -66 -142 -30 -55 142 52 -57 138 120 2 -175
$$ [...]
8191a2
##END NTUPLES=NMR FID
##END=
