##TITLE=1H_PR1933_rm
 D2O, 8 sc, 
 2.9.2020
##JCAMPDX= 6.0         $$ Bruker NMR JCAMP-DX V2.0
##DATA TYPE= NMR FID
##DATA CLASS= NTUPLES
##ORIGIN= UXNMR, Bruker Analytische Messtechnik GmbH
##OWNER= root
$$ XWIN-NMR		Version 3.5
$$ Wed Sep  2 13:32:11 2020 Russian Standard Time (UT+4h)  she@DPX200
##.OBSERVE FREQUENCY= 200.1315066352
##.OBSERVE NUCLEUS= ^1H
##.DELAY= (6, 6)
##.ACQUISITION MODE= SIMULTANEOUS
##.ACQUISITION SCHEME= undefined
##.AVERAGES= 8
##.DIGITISER RES= 18
##SPECTROMETER/DATA SYSTEM= spect
##.PULSE SEQUENCE= zg30
##.SOLVENT NAME= D2O
##.SHIFT REFERENCE= (INTERNAL, D2O, 0, 15.7039)
##AUDIT TRAIL= $$ (NUMBER, WHEN, WHO, WHERE, WHAT)
$$ ##TITLE= Audit trail, XWIN-NMR		Version 3.5
$$ ##JCAMPDX= 5.01
$$ ##ORIGIN= Bruker BioSpin GmbH
$$ ##OWNER= she
$$ F:/spectra/data/she/nmr/H-F/1/audita.txt
$$ ##AUDIT TRAIL=  $$ (NUMBER, WHEN, WHO, WHERE, WHAT)
(   1,<2020-09-02 13:31:25.78 +0400>,<she>,<DPX200>,
      <created by zg, POWCHK disabled, PULCHK disabled
       configuration hash MD5:
       00 E9 B6 7A A2 85 ED C7 34 08 36 98 17 FE 4E 26
       data hash MD5: 16K
       4B 20 78 B7 5E F4 3A B7 6A F5 C8 D5 48 DB 01 C5>)
$$ ##END=
$$ 
$$ hash MD5
$$ B5 EF 43 81 97 51 93 4E E7 45 06 B7 70 A4 8E 16
##$RELAX= 
##$RELAX= 
##$RELAX= 
##$RELAX= 
##$RELAX= 
##$RELAX= 
$$ Bruker specific parameters
$$ --------------------------
##$DU= <F:/spectra>
##$EXPNO= 1
##$NAME= <H-F>
##$PROCNO= 1
##$TYPE= <nmr>
##$USER= <she>
##$AMP= (0..31)
100 100 100 100 100 100 100 100 100 100 100 100 100 100 100 100 100 100 
100 100 100 100 100 100 100 100 100 100 100 100 100 100 
##$AQSEQ= 0
##$AQ_mod= 1
##$AUNM= <au_zg>
##$AUTOPOS= <>
##$BF1= 200.13
##$BF2= 200.13
##$BF3= 200.13
##$BF4= 200.13
##$BF5= 200.13
##$BF6= 200.13
##$BF7= 200.13
##$BF8= 200.13
##$BYTORDA= 1
##$CFDGTYP= 0
##$CFRGTYP= 5
##$CHEMSTR= <none>
##$CNST= (0..31)
1 1 145 1 1 1 1 1 1 1 1 1 1 1 1 1 1 1 1 1 1 1 1 1 1 1 1 1 1 1 1 1 
##$CPDPRG= <>
##$CPDPRG1= <>
##$CPDPRG2= <>
##$CPDPRG3= <>
##$CPDPRG4= <mlev>
##$CPDPRG5= <mlev>
##$CPDPRG6= <mlev>
##$CPDPRG7= <mlev>
##$CPDPRG8= <mlev>
##$CPDPRGB= <>
##$CPDPRGT= <>
##$D= (0..31)
0 1.2 0 0 0 0 0 0 0 0.06 0 0.03 0 0 0 0 0.0002 0 0 0 0 0 0 0 0 0 0 0 0 
0 0 0 
##$DATE= 1599039085
##$DBL= (0..7)
120 120 120 120 120 120 120 120 
##$DBP= (0..7)
150 150 150 150 150 150 150 150 
##$DBP07= 0
##$DBPNAM0= <>
##$DBPNAM1= <>
##$DBPNAM2= <>
##$DBPNAM3= <>
##$DBPNAM4= <>
##$DBPNAM5= <>
##$DBPNAM6= <>
##$DBPNAM7= <>
##$DBPOAL= (0..7)
0.5 0.5 0.5 0.5 0.5 0.5 0.5 0.5 
##$DBPOFFS= (0..7)
0 0 0 0 0 0 0 0 
##$DE= 6
##$DECBNUC= <off>
##$DECIM= 32
##$DECNUC= <off>
##$DECSTAT= 4
##$DIGMOD= 1
##$DIGTYP= 9
##$DL= (0..7)
0 120 120 120 120 120 120 120 
##$DP= (0..7)
150 150 150 150 150 150 150 150 
##$DP07= 0
##$DPNAME0= <>
##$DPNAME1= <>
##$DPNAME2= <>
##$DPNAME3= <>
##$DPNAME4= <>
##$DPNAME5= <>
##$DPNAME6= <>
##$DPNAME7= <>
##$DPOAL= (0..7)
0.5 0.5 0.5 0.5 0.5 0.5 0.5 0.5 
##$DPOFFS= (0..7)
0 0 0 0 0 0 0 0 
##$DQDMODE= 0
##$DR= 18
##$DS= 0
##$DSLIST= <SSSSSSSSSSSSSSS>
$$ [...]
##$SUBNAM2= <"">
##$SUBNAM3= <"">
##$SUBNAM4= <"">
##$SUBNAM5= <"">
##$SUBNAM6= <"">
##$SUBNAM7= <"">
##$SUBNAM8= <"">
##$SUBNAM9= <"">
##$SW= 16.880792210976
##$SWIBOX= (0..15)
0 0 2 0 0 0 0 0 0 0 0 0 0 0 0 0 
##$SW_h= 3378.37837837838
##$TD= 16384
##$TD0= 1
##$TE= 0
##$TE2= 300
##$TE3= 300
##$TEG= 300
##$TL= (0..7)
0 120 120 120 120 120 120 120 
##$TP= (0..7)
150 150 150 150 150 150 150 150 
##$TP07= 0
##$TPNAME0= <>
##$TPNAME1= <>
##$TPNAME2= <>
##$TPNAME3= <>
##$TPNAME4= <>
##$TPNAME5= <>
##$TPNAME6= <>
##$TPNAME7= <>
##$TPOAL= (0..7)
0.5 0.5 0.5 0.5 0.5 0.5 0.5 0.5 
##$TPOFFS= (0..7)
0 0 0 0 0 0 0 0 
##$TUNHIN= 0
##$TUNHOUT= 0
##$TUNXOUT= 0
##$USERA1= <user>
##$USERA2= <user>
##$USERA3= <user>
##$USERA4= <user>
##$USERA5= <user>
##$V9= 5
##$VALIST= <valist>
##$VCLIST= <CCCCCCCCCCCCCCC>
##$VD= 0
##$VDLIST= <DDDDDDDDDDDDDDD>
##$VPLIST= <PPPPPPPPPPPPPPP>
##$VTLIST= <TTTTTTTTTTTTTTT>
##$WBST= 1024
##$WBSW= 4
##$XGAIN= (0..3)
0 0 0 0 
##$XL= 0
##$YL= 0
##$YMAX_a= 75109
##$YMIN_a= -62894
##$ZGOPTNS= <>
##$ZL1= 120
##$ZL2= 120
##$ZL3= 120
##$ZL4= 120
##$ABSF1= 10
##$ABSF2= 0
##$ABSG= 5
##$ABSL= 3
##$ALPHA= 0
##$AQORDER= 0
##$ASSFAC= 0
##$ASSFACI= 0
##$ASSFACX= 0
##$ASSWID= 0
##$AUNMP= <proc_1d>
##$AZFE= 0.1
##$AZFW= 0.1
##$BCFW= 1
##$BC_mod= 2
##$BYTORDP= 1
##$COROFFS= 0
##$CY= 11.3945322036743
##$DATMOD= 1
##$DC= 2
##$DFILT= <>
##$DTYPP= 0
##$F1P= 16.9975609425685
##$F2P= -3.02152046262296
##$FCOR= 0.5
##$FTSIZE= 0
##$FT_mod= 4
##$GAMMA= 1
##$GB= 0.15
##$INTBC= 1
##$INTSCL= 1
##$ISEN= 128
##$LB= 0.24
##$LEV0= 0
##$LPBIN= 0
##$MAXI= 10000
##$MC2= 0
##$MEAN= 0
##$ME_mod= 0
##$MI= 1.114404
##$NCOEF= 0
##$NC_proc= 0
##$NLEV= 6
##$NOISF1= 3.799351
##$NOISF2= 2.8
##$NSP= 1
##$NTH_PI= 0
##$NZP= 0
##$OFFSET= 15.70392
##$PC= 1
##$PHC0= -9965.549
##$PHC1= -3.599098
##$PH_mod= 1
##$PKNL= yes
##$PPARMOD= 0
##$PSCAL= 0
##$PSIGN= 0
##$REVERSE= no
##$SF= 200.130013532006
##$SI= 16384
##$SIGF1= 3
##$SIGF2= 2
##$SINO= 400
##$SIOLD= 16384
##$SREGLST= <1H.CDCl3>
##$SSB= 0
##$STSI= 0
##$STSR= 0
##$SW_p= 3612.71676300578
##$SYMM= 0
##$S_DEV= 0
##$TDeff= 0
##$TDoff= 0
##$TI= <>
##$TILT= no
##$TM1= 0
##$TM2= 0
##$TOPLEV= 0
##$USERP1= <user>
##$USERP2= <user>
##$USERP3= <user>
##$USERP4= <user>
##$USERP5= <user>
##$WDW= 1
##$XDIM= 8192
##$YMAX_p= 0
##$YMIN_p= 0
$$ End of Bruker specific parameters
$$ ---------------------------------
##NTUPLES= NMR FID
##VAR_NAME=  TIME,          FID/REAL,        FID/IMAG
##SYMBOL=    X,             R,               I
##VAR_TYPE=  INDEPENDENT,   DEPENDENT,       DEPENDENT
##VAR_FORM=  AFFN,          ASDF,            ASDF
##VAR_DIM=   8192,          8192,            8192
##UNITS=     SECONDS,       ARBITRARY UNITS, ARBITRARY UNITS
##FACTOR=    0.000296,      1,               1
##FIRST=     0,             0,               0
##LAST=      2.424536,      0,               0
##MIN=       0,             -62894,          0
##MAX=       2.424536,      75109,           0
$$ Real data points
##PAGE= N=1
##DATA TABLE= (X++(R..R)), XYDATA
$$ [...]
1780B86J144o80j425o85R08J024R46q91j346n51N63R56Q27k48j336p40N57J272
1798E81P07o23j374m62O67R78P80p63r00q75N50J218O24l50j207q19O00J207N30
1817A069o38q98p03M94J298N88n73j363n25O03J340L93l17j431m47M13J328J98
1835H29m25o48j027O72J306K80k54j476o02N67J306K54k47r78o64N69J271L21
1853A054n35j093n30M92J088N15m44j111n00M97J036O49n45j274k14L48J181O72
1871A286n06j322p13O93R68O31m95r79m65K69J479K44n39r84p24N30J425J84n35
1890D47j067k38N28J062M74n43j052o99O95J108K06m07r19n87M11J023P64o99
1908E07j081k32L15R73N88o41j061n37N73J223M58n41j170m82J006N89M73n74
$$ y = [286, 1430, 750, -675, -1360, -452, 572, 1518, 627, -719, -1270, -707, 249, 1076, 828, -508, -1248, -691, 581, 1288, 665, -709, -1171, -504, 474, 1254, 491, -409, -1284, -734, 484, 1108, 758, -449, -1268, -668, 539, 1069, 431, -467, -1170, -676, 622, 1210, 637, -726, -1251, -648, 692, 1085, 768, -663, -1110, -697, 631, 829, 404, -244, -1271, -599, 707, 987, 733, -743, -1345, -778, 528, 782, 535, -443, -1107, -538, 733, 1054, 519, -574, -1104, -612, 476, 991, 547, -564, -1064, -567, 469, 1118, 573, -701, -915, -567, 614, 1286, 780, -542, -1255, -562, 406, 1037, 542, -437, -902, -633, 846, 1090, 551, -433, -1157, -627, 798, 982, 447, -620, -858, -330, 732, 1206, 663, -389, -1088, -393, 715, 921, 514, -405, -992, -581, 442, 1206, 507, -574, -806, -491, 482, 1070, 429, -632, -1169, -596, 627, 1085, 544, -626, -1108, -102, 487, 960, 386]
1926C86p71o62N99R19N17n35r30m63M65R68L28k98p80r07P71P91O19l59j069l32
1946g43kJ002P75m09j005m04K54J028M81o38o45q59P99R06K39l35r18n66O42Q08
1966D10O57p01r61k95M04Q25O02m97q94m22L57J016O31n25j135n28O38P70N70
1985I22l95r63k91M99Q38J72k79p97q02P65N75P89o23j159lN16O70M37m73q76
2005d78l89N21O00O31m19r74l48O40N81L64k67j062n85N51R79N87l81j196j71
2024h16L70R20L68o06o29m39L50R53M52n98p50l26M30Q42L25j84j237m85N21Q86
2044C47N34n30q10k66K35O61O77o59o75l53K63J088K36n16m16o12M39P68N63n91
2064C83p73l04M83P40K30m19q15j28L62Q63L03q43n05k83M71O71K20n57o68k87
$$ y = [386, -385, -1047, -448, 471, 988, 453, -477, -940, -475, 493, 821, 523, -257, -1164, -393, 398, 1017, 658, -411, -743, -745, 257, 1032, 623, -382, -786, -532, 496, 977, 339, -306, -1165, -366, 540, 779, 444, -474, -1040, -398, 410, 1067, 366, -595, -890, -486, 339, 941, 444, -450, -872, -515, 501, 1132, 607, -528, -1056, -418, 352, 922, 527, -436, -727, -228, 610, 782, 503, -294, -1096, -331, 244, 1033, 410, -749, -752, -236, 434, 871, 398, -478, -867, -346, 254, 885, 466, -508, -856, -216, 365, 729, 462, -600, -1185, -634, 345, 932, 551, -645, -816, -446, 474, 842, 236, -393, -832, -482, 471, 923, 325, -425, -751, -321, 521, 846, 662, -575, -1060, -539, 347, 881, 351, -459, -725, -490, 171, 848, 189, -486, -839, -576, 512, 748, 232, -184, -796, -357, 411, 974, 383, -390, -694, -211, 529, 759, 340, -475, -603, -241, 622, 925, 82, -423, -706, -235, 436, 656, 99, -569, -856]
2084h56M54Q19L19m49p24RJ50Q93J61n03q15l21N50Q39K24j78j111n6M40O24N35
2105A004p50p71j44M62O43j7n8q56j48L48Q19K1l66n87N7M5P09M45o31o42q1K67
2127b31N56M84n95q41j25M91O29R3j85o85k96M78O92K36l72r91j71M70R88j01
2147E24k89o00m24O79L51O11o01p68j98M66Q12J49m86o93j11K13R17J81p20l47
2167c34k20M12N74L0m74m66j70N50O19J24k81p27k10L14O98J21m16p14k33N67
2187b36P87J27m24o77n28O80P04J63k29j074j3N75N43Lj20n87p4K64N78N6l54
2208A64n21k64N11N43L74n15m82k10K67O28K61p47l83m57O28O78K2l35n64j04
2228e06L53L42K76m03m86r6L93N77J56n16o01k69Q32M71m5k4o18l78O08M50l7
$$ y = [-856, -402, 417, 736, 287, -437, -428, -278, 615, 776, 273, -542, -863, -313, 526, 750, 572, -539, -595, -155, 469, 1004, 254, -517, -661, -199, 444, 427, 369, -487, -635, -287, 532, 553, 187, -400, -343, -298, 411, 856, 225, -417, -498, -231, 325, 809, 214, -627, -752, -261, 368, 461, 276, -409, -705, -227, 465, 701, 329, -662, -833, -363, 625, 524, 235, -365, -789, -110, 241, 852, 251, -517, -715, -249, 563, 712, 226, -467, -578, -365, 552, 733, 13, -334, -554, -142, 432, 462, -12, -478, -648, -98, 521, 645, 364, -363, -573, -259, 439, 560, 144, -570, -803, -236, 551, 678, 254, -423, -951, -271, 433, 596, 367, -707, -720, -145, 398, 401, 281, -306, -380, -116, 462, 518, 164, -357, -621, -110, 433, 807, 292, -190, -400, -133, 495, 756, 9, -374, -831, -203, 475, 497, 162, -402, -506, -153, 189, 465, 62, -424, -520, -127, 450, 606, 90, -511, -780, 52, 523, 478, 454, -164, -542, 66, 516, 479]
2249D79r3q03j01N61J33N01n14m19l10L55Q34J20o30p53l9N39M83J90k72p29j8
2270d86M58M69K65m38n75PK34M13K61n48m84L8K91M37L59o04m89j51N25K22J70
2291C74l51m30n1M04O47l91j74m26J41J77L45J55k80o43L2L73N31J04m34o66J91
2312c72K33N21j60k41j65m09L77P16J4n09k26j86K82N40L7m15l25j66O06M27j3
2333E66j39q19M6K53J36N24n47o09K35K15O56j61k95m86nJ32M73J95m17k12k26
2354d85J65P48N6l30m01l8K03M85L9k83p07Q7L95L36J19j33o15j68K14P14J29
2375E30n95l48m8M53L81QJm63j39J70K60j6j65k43k72L96N20r1m65l40J16P2L58
2398H0K37o7n47j57L50J98M94q60K38j59p9L99J88l06k57k82N71K72K3l24k60
$$ y = [479, 386, -417, -518, 43, 176, 677, 163, -256, -566, -211, 623, 743, 113, -640, -679, -140, 343, 533, 261, -468, -486, -28, 441, 706, 268, -307, -300, -66, 347, 608, 60, -424, -386, -95, 342, 701, 97, -392, -543, -18, 204, 374, 23, -407, -458, -54, 593, 202, 28, -398, -257, -80, 265, 420, 140, -503, -471, -98, 433, 537, 103, -563, -372, -139, 382, 222, -19, -184, -593, -216, 500, 514, 5, -221, -407, -125, 415, 452, 37, -288, -454, 152, 579, 566, 427, -392, -346, -93, 43, 567, 20, -589, -354, -139, 517, 356, 61, -425, -430, -298, 175, 370, -47, -259, -485, -320, 428, 484, 154, -247, -285, -82, 403, 442, 159, -548, -461, -66, 270, 389, 256, -359, -527, -313, 401, 530, -65, -413, -461, -8, 373, 381, 382, -81, -220, -50, 210, 194, 29, -214, -486, -90, 430, 339, -126, -466, -350, -278, 80, 317, 250, -297, -454, -104, 94, 588, -272, -34, -193, -272, 127, 315, 9, -248, -530, 41, 313, 336, 12, -248]
2419b48k98M63L92K07l94k80l74O95O1J1j41m20J09q9N93J11n24l79L00K10L24
2440C29j7m11j14q1M23J63J67k68l37j59j7M61J74k73l83k4M03L93O2m39m00q1
2462d29N75J6M9j94l25Q0K27M22m27p3k71J39J10M70N6m70Pj86K11R0J64k00j30
2485h9j31L2M51K4l88J14k51N01J59k14p5m67M34k13K62L32j84o39Q9L16K94R7
2507D54l00k25l93L43L49q7p3k65l2K41M26j80l90o1N8J00j6L95j90l48q4K35
2529d3L15j85%m86J50M39J33n4k80k17J8K15M18o6n00j86K6M34o9M36n14l22J53
2552a85L57K19j19k12l01N2L74m2J53l57j2k5n5N81j01k04k44k02N67o2P0m31
2574a79Q2j78N5O66j89l14k42Q1K26K05j18m2l87J40N9L93nk37r0j35L25K38l42
$$ y = [-248, -546, -83, 309, 516, 122, -158, -532, 163, 224, 235, 94, -326, -217, -306, 287, 398, -126, -505, -205, 5, 329, 312, -99, -213, -294, 129, 292, 459, 191, -146, -305, -322, 139, 313, 40, -343, -367, 36, 429, 491, 52, -348, -429, 146, 162, 211, 17, -308, -228, -1, 421, -6, -79, -350, -211, -101, 369, 425, -45, -38, -224, -13, 77, 241, 41, -89, -220, -188, 263, 287, -101, 13, -238, 263, 422, 208, 133, -334, 100, -113, 149, 481, 297, -342, -253, 63, 357, 454, 154, -71, -464, -121, 228, 141, 68, -197, -229, 12, 438, 258, -132, -193, -135, -35, -51, 344, 154, -194, -278, -43, 272, 87, 87, -399, -249, 190, 323, 269, -11, -228, -210, 5, 423, 357, -143, -329, -303, 131, 62, 498, -16, -338, -185, 172, 391, 272, 60, -241, -189, 185, 143, 296, -61, -73, -98, -153, 428, 327, 123, -121, -323, 244, 182, 252, -179, -97, -275, -220, 446, 257, -57, -299, -218, 8, 213, 95, 53, -334, -194, -135, 258, 253, 16, -74, -209, 116, 354, 12]
2597A2n3r2k54M50K06J78k65k78j33K74J76L9j37m20J49L41J31j44n3j56k95J40
2619a84L92K58k90l65k3K82M18m41j27j50O5J15L96k93j6p6k90M55L05J4l93j99
2641a47l43K56N10j96j39j04q6R4K26M0l93J48N3P9J94L2q3k58k42J44N68Kk37
2664A18n16K45J69K54l3l09j70J87K05N8K23o05q4j36J57N65j76q1j38k15K14
2685f8K79l9l3k65j12J29K79kk53q2nM9K24J31l72N5m7K45J80k84j39m07L38K17
2709A8J9Q1P1k35j41J70J91K19m12j61pN09O1k10l34m8J81P2M1K04m40q3q4K38
2733h0N07k51k13o8k07N90m4k10l8k9M1K32j91m3q1k7L3K62J0k71J71k31R9O0
2757B1K68j80ok79k80M06L26j40L5n13J63J62L90k07r3k69j2M78l3k8k24N7n1
$$ y = [12, -41, -133, -387, 63, 269, 447, 182, -96, -229, 45, 221, 260, 123, -297, -148, 193, 324, 180, 127, -29, -324, -184, 208, 466, 176, -189, -212, 70, 488, 47, -80, -230, -165, -50, 346, 53, 37, -39, -329, 126, 431, 445, 52, -147, -490, -234, 276, 80, -59, -163, -249, -155, 71, 111, -282, -134, -81, -2, 192, 224, 141, -117, -359, -215, 353, 355, 118, -398, -153, 16, 270, 237, -72, -242, -55, 150, 208, 431, -174, -258, -394, -237, 328, 152, 71, -67, -282, -68, 211, 172, 139, -126, -238, -109, 170, 168, -85, -167, -172, -123, 101, 232, -140, -85, -132, 113, 293, 9, -130, -537, -199, 18, 37, 118, 189, -46, -187, -17, 174, 393, -19, -180, -187, 322, 383, 173, -161, -209, -28, 44, 85, 289, -151, -234, -318, -80, 427, 176, -37, -105, -312, 278, 234, 24, -14, -43, -2, 230, 39, -4, -85, -112, -79, 183, 193, -78, 93, -138, -39, 21, 289, 109, 103, -176, -456, -50, 276, 136, 171, -342, -179, -17, 373, 166, 73, -196, -208, 270, 237, 209, -15, 42, -9]
2780ik8J05m3l27L90k19q2J85L30k57l75K84J53M6r4j40o1j36L33m3K64k97j8
2803c9l19N08r6nq0j02l0O6L93J8N7n43J49j08L85k5k31k52L04Q4J66k10r1j54
2827a55K1K38J92j47j68n6p2J27K56k1j99j16J34L7N8J62l80J92j99O0J77j01
2849D0J87m04k29K86L03Q6l17J89l62K37J64j35m9l80J44K40Q3Rj81k42Q0L88
2871A37j1J36o3l72J14K50k8j73K5r7L7L7L01k92n8J11j67M32j97M1k53l00J76
2894b14K49J61p5P8m81j0L45P0K84m57k48K65J56k19J75j70Rj19J41K21j88o7
2916i4q6J0J80M71l70j53j24K47q3K14j14k79O7N1m1J63J47l06L4j7J59k4J67
2939B19l04J09r1O1L74j71k83j73J74L4R6j73n6K6RM7L3K54Rl78J79j73K16L1
$$ y = [-9, -37, 68, 25, -302, 88, -131, -213, -28, 302, 45, -330, -46, 107, 153, 59, -81, -142, -278, 55, 12, 276, -21, -39, -358, 150, 54, 49, -31, -133, -163, -97, 296, 314, 371, -172, -23, -131, 254, 229, -2, -254, 50, 134, 300, 90, -1, -155, -134, 104, 296, 149, -19, -75, -147, -20, 236, 215, 16, -100, 34, 71, 129, 291, -89, 103, -96, -36, 141, 40, 227, -177, -406, -120, 183, 269, -48, 141, -221, 16, 180, 45, -4, -384, -240, 0, 83, 92, -89, -331, -251, 137, 126, 262, 199, -173, -59, 191, 163, -10, 15, -82, -45, -8, 293, 1, -57, 54, -113, 319, 122, 163, -90, -390, -214, 35, 196, 121, 199, -282, -292, 53, 123, 407, -50, -298, -33, 123, -96, 79, -91, -82, -201, -60, 161, -27, -94, -180, -170, 10, 481, 111, -42, -166, 81, -2, 212, 98, -181, -114, -63, -104, 59, 206, -100, -66, -83, 76, 52, 219, -85, 24, -67, -6, 368, 197, -86, -259, -85, -51, 45, -128, -184, -158, -149, -102, -69, 185, 194, -184, -5, -178, 38, 69]
2963F9j22P1r2J75m6J41j03k72J54Q4o2J54l07O0K01j41J8P1L6pm85L83N42m14
2987A08j79o1l8J62O9J50n52L06nJ83j12J01j9l68K1K78J40m2o9N0n26N7M75j16
3011A3j66j4P2J52M3P5m93O5L46l6j5j06R4p7kK17K3l99J06j08K56K3j98J83k89
3036b35J31N7o0L89j66j32k46j13M71q8J5o6k17L30l1q5O0Q0k79N9K08P1m3j38
3060b8j78K38P4l6P2k49o0P4J23J4j71J42k14K03m9J9P3j12q7K40MP3k92J39j05
3085i3J36j29J76Q0l07Q2k02K55J52k9j68l4J9k8P6l5J99m32J68J82N8j77J42
3108I1p5q5J06P0n4j73om07L50K27J8r2m1Q1j53M69k87j2L5j59J49L6j2n9o4l0
3134g7K69q0Or5l3r8J67j5p9n1j56L91k2R3l45N6o7L87j28Pl12K56K3j87K36K42
$$ y = [69, -53, 18, -74, 101, 55, 196, 93, -179, -25, 59, -3, 151, -156, -96, 105, -36, -18, 53, 89, 82, -403, -20, 522, 108, -71, -132, -170, -8, 61, 211, -341, -35, -40, 143, 31, 132, 113, -255, -234, 44, 184, 142, 73, 123, -403, -346, 129, 13, -153, -167, -95, 57, 100, 175, -318, -253, 93, 57, 42, -64, 30, -47, -49, 168, 191, -208, -102, -210, 46, 69, -129, 54, -235, -104, -47, -107, 282, 116, -16, -262, -375, 96, 8, 23, -43, -260, 70, 39, -46, 14, 94, -185, -126, 82, 153, 110, -28, -206, 32, 106, 70, 142, -107, -167, -93, 30, 44, -127, 15, -199, 4, -45, -26, 47, -65, -152, 88, 92, 165, -127, 12, -93, 43, -86, 90, 170, -137, -55, -257, -2, 150, 121, -47, -81, -62, -90, -14, -49, 150, -282, -114, 68, 126, -51, 91, 16, -69, 37, 107, 53, -120, -126, -533, -183, 44, 62, -30, -71, 10, -143, 326, 39, 27, 62, -97, 52, 88, 76, 17, -47, -77, 192, 112, 118, 23, -10, -108, 59, 44, -35, -86, -242, 149, 127, 220, -125, -69, -136, 251, 123, 130, -182, 74, 97, -90, 146, 388]
3160C88j02l14j33qK12j39K29k10j36J14K11m2Q9j71j11K39j91J73l1k18K63j69
3182e7q4P7R3p4j79N6K17n0j8J73k22n0lJ51j03J89k1O1j58r1J51mk06P3K25j51
3208eJ28L5l18PJ89k41L41j59q2kR3N7k71L88j96j0j9J97j46o6K65k37J58m2j23
3233e9k13k8R9K72k15P7P4j52J68K6j38j09K11l45M48k07J53q7K11o75K65N06
3255B82l66M2J77j92N5j05M0p0L55j33p4q5K50J1Ok98mJK2j22L26k50J92j58K22
3280A24j9k79J36p0Q9J61k34J16j40N9J64q8J10k12j8J9%J28K01m75L01k3j16
3303f6M1J28m27M89k43O7q8K79k9n08N80k01J31M1k74J14j18K72j79o6j5j72J86
3326e8J57l8Jpk27J20o7K36j85J94m6k08R5K22j71n2j51K63j36p3j05J80K27l78
$$ y = [388, 286, -28, -161, -169, 43, -96, 133, -77, -213, -99, 112, 70, 159, -12, -123, 116, -75, 98, 67, -151, 112, -57, -141, -64, 29, -45, -224, -168, 49, -1, -19, 154, -68, -118, -121, 30, -73, 116, 95, 156, -2, -93, 58, 54, -152, -79, 146, -5, 123, 158, -160, -153, 36, -205, 136, -23, -105, -107, -14, 43, -228, 160, -36, -46, -65, 132, -14, -80, 185, -52, 106, 64, -59, -272, -300, -201, 71, -144, -67, 7, -145, 23, 49, -89, -198, 13, -332, 116, -91, 62, -25, 186, -489, -224, 282, -84, -42, 135, -57, -2, -107, -67, -137, 218, 85, 11, -74, 176, 187, 193, -105, -109, -108, -86, -208, 118, -132, 60, -98, 124, 105, -174, -38, -108, -19, 142, -92, 24, -116, -57, 107, 19, 129, -83, -101, -82, -82, 46, 247, -228, 73, 50, -66, -25, 103, -324, 165, -78, -11, -99, 180, 151, -357, 223, 22, 153, 194, -80, 34, -84, 188, 9, -57, -72, -244, -58, 99, 61, 62, 55, -172, -52, -119, 117, -68, 126, 80, -128, -33, 189, 18, -34, -185, 78, -58, -131, -236, -56, 171, -207]
3350b07K73j05J45k6q6O9j24j31K41J50k54r1K95J1k0k46l0J1J70j57L2J19j24
3373h5K67k01k89J99J36l1O8K0k5j11j22J79j31M5K15k7r0j19J44j06L1O9j36
3396a00R1J62k64J21j61j23L18J00m03L82j93J48pk11K07P9k62M1k53K30J87M2
3418A31k3o4j51J73J2m1M6j37o6m6J24p9L01m22P2K34K8K69j06k17l30M82k12
3441b2K01k21J1j35J22K86j41K4k17K3q4J15K1k85L98N4r3k03l8L93l42J30j45
3464a48j21M29o5j5j48M4r9J3J43q0%J96p3j28K00j16j64P1J81j51M6l7oj86J86
3489b8J42k04J1L3J34q4L9o1m9J33j90J70N1j58rJ79n0n1j6K8q9R7K0N7j22K6
3515Im2j08K60p7Q5j49M2Pj15Q0J47j41Q2j00j21k6M8K03j19M5P4k55K15m0m9
$$ y = [-207, 66, -39, 106, 80, -6, 63, -61, -192, 49, 199, -55, -146, 149, 160, 140, -106, -136, -125, 45, -112, -80, 39, -85, 182, -19, -308, -109, 27, -4, 64, 84, 59, -52, -174, 5, -126, -81, 134, 107, 17, -102, 42, -64, -33, 36, -100, -9, 153, -111, 10, -151, -274, 44, 144, -259, 123, -70, 78, 71, -140, 67, 146, -116, -75, -328, -98, 89, 131, 108, 44, -107, 66, 78, 37, 83, -54, -120, -166, -42, -121, 180, -242, -170, 64, 92, 361, 255, 38, -292, 190, -22, 179, -42, -31, -166, -44, 242, 101, 125, -92, -69, -153, -38, -17, -302, 96, 150, 57, -146, -184, 209, -133, -3, -148, -269, 160, 95, 80, -68, -24, -123, -110, 33, -47, -47, 149, 76, -52, 148, 32, -132, -61, 120, -31, 15, -22, -28, -214, -28, 114, -90, -79, -46, 88, 4, 43, -18, -67, 66, -124, 46, 97, -61, -70, 109, 59, 8, -8, 20, -69, 28, 48, 105, -17, 9, -33, -141, 119, 42, 127, -22, 20, 27, -88, -8, 139, -2, 80, -20, -141, -167, -119, 84, -35, 10, 84, -171, 44, 4, -45]
3540d5o3R8r2M02n01K04j12LO6k15K60k1l6p7K73j23J63o0oj79m2L31j77J7j72
3565a04N7J5l0k93K74J44l1j87J24L09m05k4L37l14K09j7j0k84L13K43k13k02
3587h9J33j21J34QL4j55K26j46P4q3r7J22q3M6Q2j00K6J7M6L9l22K74L4j60Q6
3612B5j60K87j77R7Ql24L18k38J96J12p6K4j02J37k31K27j75J54K2n0j98K64j92
3635e2J46k13P2Q2j92N3J35J55n2k3j48j87J61Q9P8Nj12J49k10QJ7J67j29K93
3659B92m33J34J45k40K89j74l3K1K12k8l89J35J5j82J28j35J40O7J58j78Q3K31
3681B58j69k87L03k22J34j65Q9J85p3k73K05l7j28L24j82R4l2LR7j15M5l34L30
3704E0m2K17J13k14J52P5o4k83R0k68O4J27J18k68L22K3k98J54O9o2jj56q5R2
$$ y = [-45, -108, -10, -102, 300, -201, 3, -109, -106, -40, -255, 5, -16, -52, -129, 144, 21, 184, 124, 118, -61, -103, 228, 51, 68, -104, -47, -32, -62, -355, -81, 63, 32, -155, -31, 278, -127, -151, 186, -128, 81, 64, 54, -230, 83, 326, 113, -89, 44, -77, 57, 65, 99, -56, 170, 24, 98, 15, -82, 40, -43, 3, 85, -15, 11, 28, 74, 113, -209, 65, 99, -61, 25, -135, 152, -25, 72, 80, -244, 74, -164, 32, 144, 68, 92, -10, 127, -104, 123, -52, 102, 124, 74, -124, 140, -52, 94, -119, -47, 35, -157, -104, 31, 186, 134, 111, -37, -224, -63, 26, 104, 109, -3, 146, -64, -56, -39, 128, -1, 292, -141, -7, 138, -102, 187, 13, -20, 1, 213, 185, -204, -69, -54, -236, -108, -243, -103, -36, 122, -56, 27, 258, 89, -198, 105, -117, 17, -148, -59, 126, 53, -220, -15, -52, -180, 144, -38, 56, 24, 27, 124, 9, 54, -280, 50, 8, 225, 338, 124, 276, 351, 287, 4, 94, -174, -110, 17, 135, -133, 189, 212, -86, 68, 137, 75, 74, -82, -167, -75]
3728g5p2J18P2r2M8P2L1k66M66j93k12N9%K11k95J2j68L94l64L97r3j94J52J04
3752A12k34J07P6K8m4k5J80l53L24j31k09R8J03j72J90j65J78k0j24K51O1m08
3774a77K20P9k38o2J75l0j86K16J39j7M4j63rp4rL73m11J7L86r1j67j8J68k3j66
3799b4k8j6N7J48r7k41rJ05J51J57q4r7m3j14L1J41o8Q4j43N4mO6j25K76k38j3
3825g4j18J91j7K73l94J21N6k4kk32L10j14l5J71j60j0j03K92j02J54j05k21L4
3848a09l9J82j34J88Pp9J9j87R0oQ1M3j21O1N5kL7k6q7o3K16l37K1K42P5j09q0
3875f2J15n0j57J73n4j32J94l5K75k97O1J23m9P6j77j18p1J27J12J17p5O1k6N
3899A36K95n39J46j22M39l09N8j06q5n7J45J74m1k24j91O7L66r1j27N0k57M41
$$ y = [-75, -147, -29, 43, -49, -1, 71, 102, -164, 302, 109, -103, -44, -44, 167, -128, -116, -284, 110, -254, 143, 50, -144, 8, 112, -122, -15, 61, 89, 45, 20, 200, -153, 171, 40, -169, -71, 32, -140, 50, -115, 63, 43, -81, 170, 231, -177, 43, 122, -116, -178, -3, -33, -219, -3, 136, 119, 163, 0, -9, -83, -92, 281, -130, -113, 273, 182, 15, -3, 165, 142, -24, -52, -68, -11, 137, 40, -201, -210, -105, 46, 203, 119, 22, -21, -135, -104, 37, -31, 53, -90, -36, -40, 26, -99, 177, -61, -74, -192, -1, -18, 255, -139, -18, 38, 14, 12, -220, 90, -24, -59, 112, -48, -58, -161, 131, 29, 183, 78, -143, -109, -148, 34, -100, 88, 95, 16, 35, -152, -62, -68, 13, 56, -65, -4, 51, 49, 86, 60, -27, -90, 126, -211, -190, 52, 127, 18, -62, 53, 3, -154, 19, -35, -167, 27, -8, 267, -30, 31, 154, 105, 181, 4, -114, -185, -58, 54, 171, 96, 157, 131, 136, 431, -108, 38, -84, 355, 46, 104, -2, -87, -144, 1, 175, 134, -90, -281, -214, 152, 61, -66, -16, -273, 168]
3921A68j11k08K10j17j08L09k33L7K40N8j81n7j31j7J09R3J00j67R9J5m8J4J41
3944B15k58J04J45q3k1q6k10K54J56l17K0nJ91kK7k64L9j12O4L2K96j43p1L8j29
3969a20J58l02M16k12K77j60O2O1j17r7pk23M5J05j40L24j91J31k05K35l7k2Q4
3992F5O9j81K4J14l05J67J29l34K84lM3j77K50j5j68J20p3P1k16N0K40j49k14
4015b09R6M4k75M23oL3j19j37R5J13pl30J67R2R5OJ9q1J39k68K36k39J49J2j16
4040f8J33j72K9J08j12Ko5K18q8l4j00p9K35K2k75K1J19R6r3R4Mo6P2J4J09K85
4066D09k27j24m5j26R4k08K84n4j85N3M9J80r2j26N8K18O4k50J26n4J06j84QK8
4090BP5K0R2j94j3m8K25J34m18J84J08j54no1j33J82J09Pk59K79n8l6l22J05M46
$$ y = [168, 57, -151, 59, -58, -166, 143, -90, -53, 187, 245, 64, 7, -124, -141, -32, 61, 161, -6, 93, 108, 60, 74, 215, -43, 61, 206, 123, 102, 16, -194, 60, 216, -101, -81, -86, 105, 103, 130, -134, -95, -207, -143, -111, 185, 42, -29, 9, -120, 38, -264, 152, -60, 217, 57, 119, 180, 63, -34, -41, -264, -219, -114, -254, 70, -121, 10, -195, 40, 3, -19, 65, 134, -47, -23, 91, -214, -47, 82, -252, 32, 29, 72, -105, 145, 130, -38, 82, 9, 80, -136, -86, 154, 5, -209, -113, -69, -344, 79, 73, 106, -13, -150, -55, 58, 51, -279, -112, -20, 75, 81, 100, 19, 158, -110, 126, -113, 36, 48, -68, 65, -107, -78, 30, -82, -80, -145, 73, -15, -49, -149, -228, 7, 29, -246, -225, -106, -10, -103, -9, -5, -71, 1, 15, 124, 409, 182, 58, 13, -113, -19, -227, 57, 3, -182, -129, -80, 100, 8, -118, -60, 158, 222, -28, 98, 44, 150, -34, -26, 2, 77, 97, 189, -5, -18, -66, 159, 293, -125, 59, 167, 13, 8, -53, -186, -4, 105, 112, -147, 132, 74, 38, -284, -179, 267]
4115B67j71j83L8rM9k26J61J09j65J88j57J18o0q0J19J64P8k40m8O2Q5k01R8k4
4139b8j45K48pk49L47q1k1q8R8Ll12K10K37j41j11LJ94j74L4K22k67J56r7j1q7
4164f7L1Q6j73J53k2j22M8L20j51j18M0l3J08k2j05K60k54j16K2J77j47l0K31
4187A16j02J36j03j27rJ05j13q8kL47k70j16K45O4j58j64L33j26j2o3O0J06k67
4210b08N16k27J53j45n8j36O0J66l04N6J28J09lq0N6L4Q0k69J07R1k61J32k9K23
4234A91l75J07j50K53j08j66L66k49J12J1j90L73p6mo5j12qJ7k7J65k12K35j47
4257e9J7J37O9j44l9L0j47J69j90P1J74j06k5Q8j58N4K7K39l42J55n7L17l21K39
4281A98k20J71k9k1l23K90Q7j70jj7j35M05l5n2j56m8j34K59J00j01j15L7R9j04
$$ y = [267, 96, -87, -49, -58, -9, -235, -74, 35, -130, 58, -99, 19, -41, -121, -2, 162, 240, 0, -48, 14, 99, -102, -4, -28, -173, 75, 68, -181, 166, 85, 64, -24, 74, 77, -235, -25, 212, 71, -40, -37, 157, -17, 17, 239, -28, 128, 31, 20, -67, -36, 50, -123, 30, 8, -114, -66, 254, 103, -15, 25, -8, 100, 78, -27, 233, -21, -137, -115, 62, -85, -115, 116, 14, 150, 47, -80, -89, 16, -97, -185, -187, 160, -110, -226, 19, 83, -75, -239, 94, -32, -44, -107, -47, 59, -208, 308, 81, 234, 89, 31, -105, -45, 121, -183, -127, 1, 110, 107, 27, 83, 117, 197, -72, 35, 126, -135, -3, -32, 191, -184, -77, -227, 26, -82, -248, 118, -131, -19, -8, -198, 175, 99, 95, 30, -82, -90, -73, -100, 65, -147, 88, -59, -42, 95, 164, 20, -19, 11, -136, 33, -157, -86, 88, -18, -43, 45, -113, -59, -32, 207, -135, 20, -37, 280, -41, 198, -22, 149, 120, 99, -224, 66, 153, -17, -18, -35, -170, 235, 200, 148, -8, -56, -190, 69, 169, 68, -47, -10, 89, -15]
4305a5r6pK4K38J1l11J68k1O2Pk11lM23l64Mk00J24J60j03Q7o1J20k26J94q3J2
4331f7J06j24Q3J24k22J53K3j74j16K37O4q1J11k56O4J22j2K66m7l64J2JJ8K06
4355A27%J2k76J7M19j96j6k8l6J20k49J70k20N6J12j08J43p4J76k66j8j20K19
4378c6j28Q3J20l3L8J06j48j30RJ86q3nP0k72M24k82K15P9q8mJ45k96j1L8K6K32
4404B55l54N0l16M91k00J30q3m5J20k48K71j12j83M42j63J38p8p9J02k55J17k6
4426b6K10o5k19K4LJ26j4O9j44L8Q4k96LO3J89q9L5kj7J37j20J03j10j44K74n7
4452E5l4j60O5J2K28j23K9J3q4J25j29L1l4Q0j7m8o7j58L4Q6K73l2q4k05L1R5
4478a8o1J72l3k1m8l8j7J17j42J48k73J56R4J03r7q7L13k16J76l37N9p6j20L47
$$ y = [-15, -111, -118, -94, 144, 155, -156, 12, -9, 53, 60, -151, -154, 269, -95, -91, -291, -167, -7, -110, -23, -84, 36, -190, 4, -79, -67, 39, -85, -2, 122, -100, 53, 76, -98, -214, 23, 87, 6, 117, -139, -75, 47, 35, 301, 254, -110, -98, -97, -79, 127, 127, 139, -137, -120, 299, 103, 87, 59, 23, 143, -106, 64, -156, -100, 12, -96, 47, -27, 149, -117, -135, -255, -36, -164, -81, 39, 6, 44, 150, 2, -128, -119, 67, -16, -21, 49, -223, 201, -81, 134, 213, 125, 121, 266, -30, -41, -3, 23, 255, -99, -49, -365, 126, -74, 56, -27, -72, 48, -200, 71, -41, -224, 218, 55, 193, 115, 36, 138, -117, 0, -26, 184, 119, -100, -76, -73, 53, 39, 108, -36, 2, 86, -210, -207, -144, 45, -44, -9, -11, -28, 109, -11, 92, -18, -162, 112, 55, 21, -139, -74, -62, 166, 43, 72, 85, 1, 126, -3, 28, -6, 74, 57, 9, -58, -216, -182, -96, 177, 145, 61, -144, -113, -18, -79, 93, 60, 39, -9, -47, -64, 53, -89, 59, -214, -58, 36, 139, 42, -45, 268, 52, 228, -109, -50, -126, -246, 101]
4502A01k84M37j86j21J98j96j15J33J17J31l84L84n1j46J88m2k92J41k51L68J01
4523B31j86l14K84Q4K2r4l8q7J35P3n2k3n1j20j02K75j7m8qJ70k44K62j06O3j49
4548d0J91k22O0J90p8P2l30J21M8j72L94j9k96N2j29K68j17Kj43N5j7J92q9o5
4572g2n7O2J1L07n83L92j57j7K06j50K89l23J42l7J3J42k10l8q9J74O7oL2j00
4596bk35J91J83j72J35k83L15j80J43m5j32J66k88J88k69K81P6j64j50M77k30
4617Ek53L85M7r3lk1k61J06Q4j48J40J93k84p0P6j66J63l2L46k79M2J4q7J38l22
4642b80M23j00q5L5K06k73j17K65Lk36Q2K98j34j01J32m5n4j6j9K12j75j09j22
4665b10K22j75K35n7q3J1l2L50j89k21j63N12J42m60p4J18J49M5l3p9n6j1J16
$$ y = [101, -183, 254, 68, -53, 145, -51, -166, -33, 84, 215, -169, 215, 164, 18, 206, 164, -128, 13, -238, 130, 231, 45, -269, 15, 99, 121, 27, -11, -98, 37, 110, 58, 35, -16, -136, -238, 37, 20, -28, -36, 134, -110, 152, 46, 109, -40, 151, -71, -11, 179, 101, 173, -157, -36, 12, -160, 234, 215, -81, -29, -158, 110, -7, -5, -148, -93, -110, 82, -7, -72, -129, -67, -56, 251, -332, 60, -97, -114, 92, -58, 231, -92, 50, 13, 26, 168, -42, -80, -169, 5, 72, 66, 98, -2, -237, -46, 137, -35, 100, -183, 132, -48, 95, 50, -82, 84, -204, -16, -285, -4, 72, -92, -242, 235, 5, -248, 137, 184, 91, 88, 67, -194, -88, -4, -152, -12, 181, -103, -173, -97, -263, -100, -132, 214, -65, -23, -9, -96, 42, -280, 143, 43, -42, -7, 199, -74, -191, 74, 77, -159, -77, 221, 87, -14, 118, 73, 19, 3, -16, 196, 21, -88, -210, 12, -163, 72, 15, -68, -57, -89, 261, 72, -149, -312, 200, 342, -118, -192, -74, 75, 120, 87, 8, -48, -59, 57]
4688E7l71L88P2k23J12J11K2m22K19J82j90L45k92jn9nl6K1oJ95j61J34j03K96
4712B85l19Q6j29Q6K43j17l30K63J68l61M7L52k93J37j45Q4Kj2J54j73j10OJ13
4735C7m8n4K91M8l03jL48l89J35m3n6K37j90J15k93M38j53k11j0K71l56L62k91
4758a16J85o8r9J46q8O9o7j04M20k40j30l7J50k15%K01n9K08p8K8q3p1J04k81
4782b25K23k10K56r4Q6J50j12m4j08P4J6n6J86L3l55K73J9j0j19j2K0p7j07K55
4806F2l21M66k80J03m1O1l13K32o7K93k11N8j20q5J12K40j67j03O7r6p4K83p4
4829B5Q8n8o3J74j19j19Q5L38l04j15nK35p4k40J73j82K77o8k15R1J13M6J7o7
4853C3l00J28K11m3p2K4K31l37k19M23o8j52K71j74j78J45k13M19N4j06k20K14
$$ y = [57, -314, 74, 146, -77, 35, 146, 168, -254, -35, 147, -43, 302, 10, 9, -50, -55, -91, -70, -76, 119, -42, 92, -11, 285, -34, 52, -77, 9, 252, 135, -195, 68, 236, -125, -78, 274, -19, 118, -27, 57, 59, 47, 201, 28, -82, -76, 37, -11, -65, 226, 274, -29, -30, 318, -71, 64, 21, -35, 202, 12, 127, -166, 272, 119, -92, -102, 169, -187, 175, -116, 69, 1, -98, 48, -40, 29, -38, -142, 278, 38, -92, -129, 21, -194, -194, 7, -52, 156, 78, 106, 23, -48, 56, -225, -2, -212, 44, -50, 36, 186, 74, 30, -78, -4, 12, -44, 142, 175, -180, 93, 112, 102, -17, -29, -9, -86, -193, 62, -259, 207, -73, 30, -11, 50, -263, -31, -98, 195, -16, 42, -78, -163, -51, 189, 22, -81, -14, -110, -184, 99, 25, 113, 55, -8, 166, 47, -72, 13, 351, 47, -68, -73, 162, 88, -152, 21, -161, 116, 48, -167, -76, 37, 83, 100, 33, -267, -139, 72, 29, -43, -19, 212, -125, -344, 79, 11, -141, 130, -44, -222, -77, -290, 129, 183, 77, -143, 71]
4875G1n6P1n7N5l79M47j67j57O1l2N5K07M0m9o4k21j32M59j07Rl7N5j3o3L52l81
4901c3O1Q2M1j9m7k8p6K2J21N0J11j97l22J29l6J62J25l33K64o1k61K76j77O5
4925h1J44J08l85K98j49k44L18m4R1k62K64l8j76M8J17J4R7k0j15m9qQ6m3R7J06
4950A74j93M7N0j23Kj84J01J38j36l8J12K1j98L02J12j92o7K20j88P4r2L7r0K39
4974A28j32j17J93k42J71R2j05l2m1O1j48j0n7J23K87l91L07j30km3P4J77k14
4997e1k7L15j04l0Pn7L44k60j62L2K2J41r8n7r1j88K87k9P9qk53J67P5l2J0P7
5023A09j73R6k9l9j79J16O6O6J13l26M3K23m7J98k34K34m57P1L36l77M76l26j21
5046a61J44k20K87k49J54R4L1M9j98k9j46K26n1K65k28j30L19k81j4J61O4l19
$$ y = [71, 15, 86, 29, 84, -295, 152, -15, -172, -111, -143, -88, 119, 159, 110, 46, -175, -307, 152, 45, 54, 17, 72, 59, -4, 348, -33, 28, 110, 151, 132, 85, 57, -19, 3, 124, 174, 285, 88, -234, -105, -141, 21, 146, -187, 77, 16, -245, 31, -146, -81, 63, 171, -214, 84, -65, -309, 9, -35, 56, -206, 58, 20, -156, -108, 9, 23, 120, 100, -15, -64, -72, 14, -29, 68, 174, -19, 28, 78, -45, -43, -227, -126, 12, -124, -162, -50, -29, -227, 75, 187, -5, -72, 148, -40, 34, -58, -21, -111, 128, -4, -121, 72, -170, 1, 93, -12, -44, -85, -24, -172, -182, -239, -116, 171, -220, 87, -43, -45, -88, -14, 163, -51, -78, 237, 133, 103, 110, 53, 397, 137, -25, 7, 29, 170, 72, 15, -76, -264, 23, -6, 73, 65, -188, -21, 54, 22, 32, 109, -64, 32, 3, -36, -215, -99, -33, 33, 146, -180, -137, 86, 39, 237, 3, 237, -220, -149, 187, -190, 286, -40, -161, -17, -237, 50, -199, -45, 49, 80, 129, -69, -98, -244, -18, -69, 196, -32, -162, 157, -124, -138, 23, 87, -232]
5068b32K95j28q6R4j5K78k92%N2R4J42r3j3m1J3k9k1O3p9J6K1k06L06p9q5n4J99
5095A20N6j09j69P0Q8j70m6K92k3j38J5l7J09j90K64j67J58j87r7M9LK39l29K87
5119H8q9J54l66K61L7k2J03j20L6Lj7j8J1k6j36R6o8Q4L6p9q2J87N3N8j94J39
5145A29nj87R2j33o1J51P7k78L6R8K41k68J95j11j25K33j46K28J36l31j64K77
5167H4l66P7L23k12K30k13K48j11R0p6m0J8K0j19K15r0k9q0M3J31k02j20K40J24
5191A85r5K0j34r6M00l26J67j79L5L03m74N4R5N8J22j91r0k6J21j33K42J81m90
5214b51J83k26K12K72pl92Q3K82l66K01l1J41j56P3j06ml7r1J22o3K28j12p1J82
5238F6L0l39J56K28j36k00L11j25K44k25j86L4m0K35O8p1L7l6j08j99K58q9J12
$$ y = [-232, 63, -65, -151, -57, -72, 206, -86, -86, -34, 60, 202, 109, 96, 55, 68, 39, 18, 81, 2, 18, 39, -167, 139, 60, -25, -79, 120, 176, 67, -102, -32, 56, -114, -160, 132, 109, -29, -14, -51, 58, -132, 132, -35, 123, -64, -161, -112, -109, 130, -199, 88, -1, 153, -213, 48, 85, 63, 166, 46, 82, 85, 68, 50, 61, 35, -101, -5, -73, 11, 47, -32, -114, 73, 126, 184, -10, 129, 124, -63, 29, -104, -165, -14, 63, -215, -179, -81, 160, -108, 87, -24, -149, 84, -62, 166, 302, -29, -193, 84, -282, -205, 118, -94, 136, -77, 171, 60, 150, 74, 34, 52, 72, -47, 168, 78, 49, -31, 12, 143, -59, -179, 61, 185, 90, 110, -24, -120, 280, -46, 121, -58, -23, 280, -194, -140, -45, 13, 135, -56, -146, -172, -51, -184, 58, 239, -251, -68, -294, -82, 190, 183, -209, -126, 156, -210, -9, -40, 101, -55, 18, -88, -92, -129, -220, -98, -161, 67, -45, -116, 66, 96, -243, -87, 141, 5, -195, 116, -9, 235, 10, -176, -142, -182, 53, 121, 50, 87, 51, -57, -256, 2, -87, 25]
5261B5J58k28J15k26K44o9J06m2j47%k31K91Q8p8P8j8J53l27N4J10K6j08O2J35
5285A71j00J52l24M6K39j61J02k78K45j79J02M0q5J82k86J0K97J5l13j30L41L
5307H9M1p9l40M0K55j45J11Q7j99J47j28O8K08k23o9J81j77L2K37l45J74O2J3
5330D0j54L07k28L89m16k7L6J84l6l05K36j94K11k38K31j79l3K41mo4Q5P3l68
5353b13L34j00j95J92K6N3j75O1k66L22j88l2L31j39M2j47j6P8j71L56K0k35J22
5376F0j8k41L06p8j34J08J55j50nO5j27J62k42J20q6Q1O0M9j61m4J98J45j33J20
5400B10p7k39q7M27k31J02j87K70j59k00J80Q0oj95N7j15K03p2j18K35k1j03k19
5423b65L91l47q2N22k32J1N5K9l8j51Q4k08M91k55j76K07k27K31J90k48MK45L7
$$ y = [25, 183, -45, 70, -156, 88, 19, 125, 83, -64, -64, -295, -4, 84, 6, 84, 66, 219, -108, -54, 56, 82, -26, 36, 171, 71, 223, -101, -55, 184, 23, 125, -153, 92, -87, 15, 55, -30, 152, -134, -124, 173, 188, -125, -255, 86, 89, 130, 51, -289, -249, 6, -139, -28, 59, -140, 7, -121, -53, 155, -68, -137, 44, -133, -101, 136, -209, -35, 27, 40, -114, 193, -35, 354, -62, -89, -53, 131, 95, -210, 26, -168, 43, -195, 36, -143, -176, 65, 61, -3, 82, 155, -213, 121, 21, -174, 18, 44, 97, -78, -17, -283, 39, -149, -181, 150, 11, 53, -94, -110, -32, -203, 153, 173, -62, 60, 42, -199, 107, 29, -105, 3, 158, 8, 3, 68, -59, 103, -139, -19, -105, -24, 36, 85, -76, -120, 78, 223, 90, 210, 133, -106, -193, 234, 3, 105, -82, 188, 29, -171, 9, 89, 83, -112, -55, -170, 33, -39, -157, 78, 57, -46, -265, 126, -221, -303, 219, -13, -2, 53, 82, 44, -107, -23, -231, 260, 5, -171, 36, -191, 40, 230, -18, -14, 231, 268]
5446B68Jm58J66P6K54j92j13k53M45j17l46L68J8k62J19o6K60lj74r4j2J77n1
5469A1J02k56K30p1O9j95L1L40l08M2K24l31l9J35N2k22L01j30k33L08l6J86l72
5492a62K87k50J74J4p1J47l57J83N4Kl67L14O0M8M9l38J06K61K8j63J15k20R6
5515A0p8j33L76k94jJ81j56P6M1k48L73r3p7L93k46o5j01J9K52k60J56j34j49
5538a58J01P4O9J47j54l36N28m32J93jk2m00J09J89J38J05l01J84j11j90J35j08
5560b41J69k0L2J75K5k33L22j63k72J73J28L4j83J03j08o2J20mq0O7m8J11O0j7
5584H8j52N6r7K70j55k05j6p3K62j62J46r6K15j87KJ27J5m2j77K45j11Q3R3m67
5608c38K37J40Qj48J32n9o2R4N4m8j53J64nj61K92j29Q8j56O9J09j57j23J57R2
$$ y = [268, 269, -189, -23, 53, 307, 115, 2, -251, 194, 77, -269, 99, 117, -145, -26, -92, 168, 165, -9, -103, -115, 62, 11, 113, -143, 87, 16, 85, -110, -79, 261, -47, -5, 219, -112, -151, -16, 36, -186, 115, -15, -248, 60, 24, 210, -162, 125, -125, 49, 63, -8, 139, -218, -35, 19, 21, -346, -32, 28, 76, 125, -213, -107, 154, 182, 19, 134, -86, 10, -68, -201, 175, -119, -120, 61, -95, -19, 22, -226, 147, 54, -23, 370, 124, 59, -42, -23, 229, -31, 125, -9, -158, -57, 17, 86, 233, 79, -257, 271, -161, 32, 31, 9, -391, -282, -93, 45, 150, -151, 33, -78, -268, -133, -241, -72, -92, -60, 115, 140, -93, 229, 66, -206, -33, 95, 129, -54, 49, -59, -121, -1, -5, -85, -18, -66, 45, 105, 88, -64, -8, -105, 165, 10, -195, -211, -284, -22, -184, -38, -134, 81, -106, -104, 23, 38, -4, -181, 64, -47, 36, 129, -338, -101, 39, 47, -101, 31, -28, -90, 4, 58, 10, -143, 21, 16, -145, 147, 18, 106, -50, 19, 128, -29, -152, 5, 97]
5632I7J02M9l8j73k04J13R1n4R7k0q0K93k38j04P8J13q2q1j30Q4o0Q9NlrQ3J95
5659B13j88l3K40Rl37P0r0J17R8j17j87J57j60J99p0L4N7k77J18L23j64j10J25
5682B7j15J45k93N83l51q7J49m4j44m6J89J43J6p7l5P3j36j0J80p1j75O8K1o0
5706e0%R4K6j07J90j15r5j36RJ19P0j09oK40k58J67j17QJ86l66J20j03L66j57
5730b4k59K01M4l1j21M06n1m67R2K70j51N0k80K71l4J59j4l26J83J50j3Q7l17
5753a75M31j70J45j51k14J19M7l6j06m9J47j30J61J85k41J32L5k03R9j29k5L23
5775A95k45M8K97m05j59L30k43r1M00p7o4O7q8K38q9J7jn4P4r7M2j01j0L0r7%
5801h3M9j48O3Q2L48j14k90J18Pk99K41k1N8O2J05k15Q4j62M9j18j9J61R8J16
$$ y = [97, 199, 248, 210, 37, -167, -54, 37, -17, 80, 60, -20, 273, 35, -69, 9, 122, 40, -41, -171, -87, -147, -58, -53, -56, -65, 18, 213, 25, -8, 232, 241, -96, -26, -116, 1, 99, -18, -205, -48, -208, -9, -79, -45, 12, -265, -147, 176, 12, -98, 27, -88, 57, -236, 347, -4, -91, 58, 14, -130, -176, 13, 156, 172, 95, 60, 133, -3, -13, 167, 96, -79, -11, 10, -50, -50, 44, 70, -37, 153, 38, -57, -193, -184, -65, 5, -104, -110, 130, -128, 39, -78, -70, 116, -250, -130, -233, 133, -24, -283, -82, -38, -69, -190, 216, 165, -302, -210, 60, -91, -41, -321, -50, -84, 75, 61, -265, -82, 68, 55, 142, -175, 256, 86, 231, 80, -134, -15, 32, -4, -110, -159, -12, -142, 19, 204, -37, 95, 130, -73, 26, -103, -128, 195, -50, -2, 295, -110, -269, 61, -182, -273, 127, 50, -14, 53, -35, 203, 114, 131, 130, 76, 150, 53, 95, -6, -16, 14, -83, -83, -34, -182, -119, -37, 311, 197, -93, 25, 32, -267, -26, -47, 11, 73, 178, -37, 47, -115, -66, -184, -203, -42, 56, 172]
5825A72k46j27L69j42k09J03j29K72r1J38j84J38j99J35L4q7J37k0k89K24l18
5846c19N26pj42k54J71j6N5j12J81j91J20J78j58K10k85K49Q4m14K83j06j37K17
5868A33k80L41k18j04PJ9J00R8k17n2J71m4J52r7k63J87k5N7J40m20M94q6m30
5891c37R4K85M1j10J9l25K66M5MJ39j26k3r5m3J27L01k04J31Mj63j40j38M19k83
5915a12J40J70j08L7K06k77r9j33J57j22J45j09j27L15j28Q3J46l51K54o6J82
5936B03j19k9j63Q4l0J04L0j71O1l1J02o3k05M22j64j80p2M82m06J40n5j34K39
5959D5j86J98j29J07Rk68K18m8R1o1rJ72j74J52j58K11j88j7k9J91j10Q3k36O2
5983g4J99m4k71K35m05L52k84L20M8k62K12j33NJ71j41j20K54O2L7k93P8K8P5
$$ y = [172, -74, -201, 168, 26, -183, -80, -209, 63, -28, 110, -74, 64, -135, 0, 34, -53, 84, 64, -225, -1, -319, 207, 200, 58, -196, -25, -41, 14, -98, 83, -108, 12, 190, 32, 242, -43, 206, 290, -124, 159, 53, -84, 133, -147, 194, -24, -128, -121, -102, -2, 96, -121, -173, -2, -46, 106, 9, -254, -67, -92, -35, 105, -315, 179, 93, -337, -243, 42, 83, -27, -8, -333, -67, -22, -18, 121, -5, -28, -123, -166, -39, 262, 58, 189, 193, 30, -110, -248, 171, -112, 28, 198, 90, 127, 333, 56, -43, -176, -19, -141, 4, -105, -232, 83, -45, 38, 184, -167, 87, 21, 203, 84, 55, -108, -24, -54, 50, 80, -91, -30, -61, 41, -22, -227, 195, 31, -149, -221, 261, -145, -5, -60, -194, 45, -141, 57, -72, 35, 44, -224, -6, -54, 37, -24, -33, 139, -35, 117, -41, 170, -18, -35, -64, 127, 17, 100, -136, -74, 125, 81, -190, 45, -360, -8, -292, 28, 76, -186, 26, -107, -102, 69, -72, -192, 62, 124, 161, -132, -54, -26, 49]
6006D9o0n0J02j93R0J59j29K1J20j19m6k23L07j35J07k08K91l0j11R7P8j31j37
6029a51J61K01l24J06K5j03L3L1R7l5j66J32j99L37oj99j57K60J31k13K49k42
6051c2K6OJ92k25J15j39j28K45qL1j87J01J16k2j00q4J25j86L19j84Q0K7Qk01
6075a05o4L20j40P2j74k4J02k41K82l03Q0L61j9j25j85J68P0o4P9n4P4k25J49
6098C4M5o9Lm3K1J68M1j1l09J76P4q0M8k60K24j52J33NL4j66J1o2K7R4J91r4j08
6125b5J55j58M7k6Q8j06j61J74m1J25r8O9K9m6L86n44K73o3j53J97j41K3Q9J44
6149B37j77O4K2k92L43m83L95k20J48J2o3O0N9j45j22K86j35l8J37j51J45P4J19
6172B75l52J86j43kJ95j17K97j48k17J37j21L5r8J12m6Lr1M2j05L43j71oL0%L31
$$ y = [49, -11, -61, 41, -152, -62, 97, -32, -11, 109, -10, -56, -279, 28, -107, 0, -208, 83, 53, -58, 39, 117, -14, -151, 10, 211, -113, -7, 18, -85, -52, -21, 76, 41, -125, 7, -192, 145, 139, -60, -217, 43, 174, -39, 210, -32, -6, 0, 192, -33, 82, -57, -185, 60, 52, 83, -104, -3, 113, 91, -9, -93, 32, -154, 165, -19, 61, 88, 96, -105, -169, 151, 11, 83, -91, -115, -13, -254, 28, -275, -195, 166, 147, 22, -163, 5, 75, 11, 90, 36, 110, -115, 34, 79, 10, 13, -30, -9, 159, 200, 189, -120, 56, 130, 50, 98, -162, 62, -90, 43, 48, 82, -84, -73, -135, -108, -14, 177, 83, -25, 130, -28, 19, -7, 81, -25, -186, -12, -53, 72, -26, 43, 72, 26, 412, -132, 141, 78, -75, 122, -19, 4, 93, 237, 60, 124, 146, -146, 197, -286, 109, -111, 37, 49, -14, 46, 105, -40, -162, 124, -11, -49, 88, -63, 82, 156, 275, -77, 109, -34, -36, 159, 42, 339, 191, -26, 111, -10, 25, -73, 39, -7, -4, -95, -53, -158, 185, 14, 8, 38, 38, 369]
6197C69m35J18j10Q3k5p1N7J5m4J46r3J52n2m7J62j57jj84j11N20n09L29M0np1
6222G6j08m2P4j23K19k05J58J85j31j87K36j16j58O4J32j52J09Q9n6lJl73M86
6245A75l5j98J3K9k7J13j1J5r6o8K8J23k85K39l5r1J84Jk54J94J9k42J72P6J12
6270A51o1J20k44K11k16LrK10K0o5j54L58k37m9L0J8l8j00M31m36O8J05K4j64
6294b4O3j55J36p9j31K38j74K40r3J32k18k5o1J70N0K3j57j57J75Nm8J9Np2K57
6319A19r1k73R8K97k48J17P9o8l4J71l02P5L9q7m3L06j56qm3K70l6k64L00k00
6343A8K8J8n9J44k3o3j31j04K44r9P6p0J37k72J63o3j05L30k12r1J94j37k2J59
6367F0k13J08J2J65k35Q6j0M06l57j0l04K94RK84q0k83L5P1N2n5j11J92l11K78
$$ y = [369, -66, 52, -58, 25, 0, -71, -14, 1, -43, 103, 10, 162, 110, 63, 225, 68, 67, -117, -228, 292, -217, 112, 152, 147, 76, -32, -74, 0, -123, 96, -109, 49, 234, 103, -84, 152, 36, -122, -58, 74, -78, 31, 120, 64, 61, 62, -311, 175, 140, -58, -45, -16, -43, 70, 59, 74, -22, -90, -62, 61, -224, 15, -20, -111, 73, 74, -180, 14, 33, -209, -37, 39, 151, 90, 210, -34, 177, -39, -36, -45, 165, 185, 120, -34, 324, 87, 38, 68, 86, 48, -52, 379, -57, 11, 116, 140, -24, 39, -116, 20, -59, -190, 48, -126, 114, 21, 153, -65, -90, -151, 19, 69, 92, -65, -222, -47, -42, -90, -71, -66, -138, 119, 28, -245, -147, 150, -98, 19, 98, 30, -4, 167, -135, -60, -21, -108, -151, 155, -1, -9, -52, 218, 182, -82, 218, 18, 46, 64, 5, 149, 126, 63, -68, -172, 72, -27, 49, -21, 116, -156, 7, -56, -161, 169, -43, -134, 60, -77, -99, 60, -153, -45, -33, 132, -103, -17, -27, 379, 22, 12, -292, 2, 11, 295, 215, -68, -33, 38, 90, 35, -76, 116, -195, 83]
6391H3k34j1K25J0k2O2l1j2J31j96K5p6m4M3J37k80R9j65J67L6J11l1l0J26j65
6416d2K10k06O0P3k52K32J25l10L12j81k58M29k70L38j77q6J8J9J43m2k06l0R3
6439hK9k06K69N9l24O8J13L9R3k17M4K04m05J57J12n6J25j51k2JQ5j31P4O6j36
6464a18K29N2j16j05J42P1J0j86k13L00l4J26or2j86O4P3LJ09r7j16j56L62k51
6488a35R9R0j50j6K69k57L45k16m8K49k16j2L3qk43Q8N5r5P7K27j89K38r3l0j71
6513a09J20N6J79o9k74K57l38J74k74L05Ok49R0rJ26n3o0Q3K9j61K52r3J31j40
6537b1O4j3l5M0K4J7p4K9R1j9J5j55rK1L1k9L9j40K25l7k65J28m1J76j09K53j29
6564G7J42j42q7L4j3j9j7q6M9J35J15k65J1J42k12J21q0N5q9J77K6k22J02K16
$$ y = [83, -151, -162, 63, 73, 51, 113, 82, 70, 201, 5, 30, -46, -90, -47, 90, -190, -91, -256, -89, -53, 58, 27, -3, 123, -42, 168, -38, 22, 95, -157, 75, 200, -110, 202, 21, -237, 192, -78, 260, 83, -3, 15, 34, 177, 135, -71, -101, -8, 21, -185, 84, 143, -181, -113, 0, 39, 132, -85, -41, 163, -242, -85, 27, -29, 96, -55, -77, -76, 9, -122, -48, 18, -118, 111, 163, 47, -58, 84, 155, 165, -21, -234, 66, 32, 158, 152, 60, -126, -62, 11, 14, 123, 26, -90, -246, 116, -135, -36, 54, -96, -112, 157, -100, 245, 29, -19, 230, 14, 2, 35, 27, -216, -128, -73, -168, -91, 136, -53, 185, 92, 62, -109, 11, 67, 246, 177, -97, 160, -178, -4, -278, 27, 33, -216, -126, -135, -9, -62, -122, -39, -10, -171, 81, -12, 119, -21, 43, 30, -5, 35, 59, 76, 2, 31, 122, 103, 118, -37, -46, -25, 6, -23, 16, -124, 101, 64, -201, -73, -114, 62, -47, 206, 77, 219, 77, -10, 24, 11, -8, -25, -111, -62, 73, 188, -77, -66, 76, -136, -15, -95, -40, -129, 48, 74, -148, -46, 170]
6588A70l5j14Q2k44J52M3K63l24k7m4n0K9m1R0K78m10N56j27j13N9j61M8o7O2
6612G5k37K92m9m2j32L79k23j57k5P0Q1N1k74J8K19j68J44j40J09J3j02L94k45
6635E1J7Q3j59O2l9Nk62J36J56q0p0J70K15j33O0l9k28N6k01L42j30m9J69k26
6659i4L4K01m28K23o8J76J19k80K09J18k81MK61l60J60K01k61j19K88j09J25j03
6681A6J71j42R1j55j43Q2J46j06J63j13nR4j08K48m9K1j88J3j62K58l66J56L09
6704B31j80R4j42Nk69K17m9P0j86K04K83j45j18J01j15r9J17m9K43k39r2L0R1
6727CJ53l04K04l2L4j55J53j14j31Q0K61p6q1KN1k04K31J61n04K95j63J75k1K3
6751D1J74j8j76J91j26j91L13k45J8J33L7k61J44r7N5P6K05k32j31J50j26P3M5
$$ y = [170, 135, 21, 103, -141, 11, 54, 317, -7, -34, -78, -128, -99, -140, -50, 228, -182, 374, 247, 134, 193, 32, 80, 13, 75, -162, 130, 81, 39, -93, 286, 63, -94, -119, -49, 32, 83, -191, -173, 46, -122, 22, -118, -9, 4, -98, 296, 51, 68, 151, -8, 54, 15, 20, -242, -106, 50, -30, -100, 70, 285, 152, 212, 173, -55, 1, -200, 142, 12, -37, 132, -94, -60, 141, -287, -64, -132, 44, 163, -117, 92, 210, -71, -67, 194, -166, -6, 195, -66, -185, 103, -6, 119, 16, 187, 45, 136, -19, -162, -80, 66, -40, 123, 10, 5, 99, -9, 239, 190, 211, 23, 36, -126, 132, -234, -78, 231, 51, 145, 3, 8, -261, -44, -93, -23, -209, -5, 278, 133, 15, 116, 1, -98, 19, -30, 213, -26, -118, -88, 3, 156, -148, 56, 24, 58, -97, 56, -58, -189, -109, 152, 76, -5, -3, 48, -156, 75, 236, -268, 27, -136, 39, 18, 41, 215, 197, 21, 212, 86, -105, 208, -37, -19, 114, 151, -110, 34, -63, -8, 68, 273, 41, -90, 60, -66, 7, 52]
6774E2p4J47O2l85J72N9N7J54l26OM4K88k31r2K07k11J87j2j38kK92k32R9k10
6798h7O7P2j07J27m02M60or7P4nK7k12Q1k7Q8PJ19l35q8K02L8J70m46K05J38Q3
6824A46j56k15M14k82K34k66Q8k8J05R6j04J36j00j92O8K19k97K28p4j64J33o
6846a7J2o2K53q1K5RL4m4%k67j5K72j8j67J00Q5l04K27n2m2M9m%j8k26M85k42
6873hK4M22n57j08M58j76k8K1n2N3j17J78j38q2K95j14j93J60k8j49K51j9k61
6896a68J89q1Qk5j65L86k03M0L7Q4j80J65k13mK47q1n1M9K48m43L0J79O2k9k59
6921a78M8m3K08r4L2j79L56k8j84Q5n9J38j74J4L1j30N4L70m21J47j24J54J74
6944A97j54r6J24l37L23O0k4K18m06L9J03Jk25N1J07j04J38M8p0o6R9K7o5K1J56
$$ y = [52, -22, 125, 187, -198, -26, 33, 90, 244, -82, -76, -32, 256, 25, -67, 140, -71, 116, 104, -34, -36, 256, 24, 123, -87, -20, 52, -55, 72, -330, 130, 124, 27, 101, 96, 123, -89, -8, -35, 53, 60, 179, -156, -244, -42, -4, 166, -280, -75, 63, 146, -10, -225, 189, -93, 141, -125, -37, -65, 40, 136, 32, 168, 68, -124, -56, 163, -134, 94, 20, -144, -11, -17, -5, -67, 186, 105, 130, 139, 173, 129, 129, -138, -153, 119, 101, -66, 34, 119, -185, 42, -10, -52, -3, -7, -7, -25, -251, 234, -8, 16, 438, -119, -227, 231, 55, 27, 48, -4, 49, -68, 110, -28, -110, 185, 71, -122, 38, 10, -139, 112, 93, -168, 21, -60, -52, -77, -242, 144, -59, -19, 18, 102, -78, 87, -126, -130, 117, 36, -15, 34, 282, -161, -131, 48, 110, 81, -178, -130, -173, 35, -59, -27, -206, 150, 122, -62, 23, -36, 102, -72, -58, -27, -157, -103, 267, -154, -7, -131, 23, 197, 43, -53, 71, -266, 57, 117, 93, 311, -95, -56, 47, 48, -177, -126, -19, -123, 15, 63, -7, -73, 26, 53, -12, 9, 165]
6969A65p8l98L97N2J16k63Rm1J50l9R2j44l2l9K29l46K30M3Qj50K60l18K52k62
6993a07l0J86k60M06N2k23K68j99J41j76K6Q3k04L02j93n9K7r7J4J3j3J73k24
7016i4j46L35l67J17K65K8q6M0p7j97J50J54N8r3k10J34LM5J4l2k60K38L9j88
7040a30J87j02r4J06j41J01j6J54Ko2L74j72k62m9N7J89j3k16J04rp3J93j17K00
7064B11k38J58l48J60O8n9L8k2l2J01L8k2O2j54j22L03l8r1O1n8p9L5j53J58n0
7089g3L4J1Q1n4J21l35k1M28j61N9J35k31o5k4J69j30J70o5n8j40J65m5r7K25
7113I9j67J50m0r9j18K15O8j99L12l05j58K33j32K72k92K49k17J08K67n54L46
7134C8j02j1Q8j01m4K95j20o9j9L15k86R1N2j41kq0N1J15k45K53k47J81K13j95
$$ y = [165, 87, -311, 86, 138, 254, -9, 0, -41, 109, 70, 162, 18, -14, -53, 176, -170, 60, 103, 111, -39, 221, -97, 155, -107, -137, 49, -211, 195, 247, 24, 292, 93, 234, 58, 84, 167, -37, 265, 72, 13, 40, -57, -43, -30, -43, 130, -94, -240, 95, -272, -155, 110, 138, 52, 92, 15, -182, -32, 122, 180, 87, -123, 11, 14, 59, 73, 41, -219, 19, 58, -130, 57, -45, -139, -33, -174, -73, -89, 65, 67, 5, 379, 207, -55, -104, -47, 142, 129, -87, 17, 8, -65, 128, 11, 211, -27, 131, -217, -57, 11, -48, -10, -32, -64, 37, 75, 53, 115, -39, -161, 142, 104, 13, 74, 16, -63, -28, -181, -23, -73, -39, -28, 53, -1, 120, -215, -236, 192, 31, 90, 225, -6, -71, -95, 74, -56, 114, 49, -9, -149, 16, -29, -126, 99, -68, 82, 42, -57, -175, 40, 108, -91, 221, -84, -242, -9, -141, 131, -161, 88, -129, -21, 246, -308, 38, -64, -75, 13, -88, -132, 163, 43, -26, -45, 270, -16, 75, 127, -14, -16, -96, -45, 70, -175, 78, -169, 12, 225, 30]
7158C0o1k42M40k44n6J81Q6k0O6j67J9ll17QN02k14K96m24K22k4L5j62K75k31
7182el8J34k34J50K3K1p6pM3k16R4n9J39J08j15P6L2k06Q3J6p9k17M69Q2j24k59
7208a65n1L3K13J77l68J39J21j69Rk3N6K37m34J65M7J31k07K34L3q8k51qK09k90
7232b50m8L70N4k26r3K75P2k92K18j69J57p%K23j09k82N0j64J22J79%k29M1Lo1
7257a66K91k73l9R2K52l75Q3J65j33k7K75k13m1j03L23j6J8l05k1K93J3J6j02
7280GK10l17J30l9j62q9K31P7M2k28O9N6p4L23j46k3J03l97L27j43J8pO3j46J60
7305D5r5Q9P2l17O31k99m5j92Q0l8l0j19K45o0j74R7J74k19%N9R0K12m45L42l37
7330b34J27l3J9K24k58J7J47k1J60lj03n1j34J48k6Q3J12j09jl36m2K73j03K06
$$ y = [30, -31, -273, 167, -77, -133, 48, 134, 114, 180, 13, 32, 29, -288, -280, 222, 8, 304, -120, 102, 78, 113, -49, 226, -5, -43, 91, -143, 7, 30, 51, -25, -32, 11, -205, -111, -170, -31, 77, -38, 38, 70, -136, -53, -37, -116, -333, 136, 218, 94, -165, -216, -183, 30, 207, -161, -22, 99, -70, -61, -84, -28, 209, -225, -60, -13, 118, -89, 145, 178, 90, -161, -169, 40, -250, -298, 72, 126, -100, -193, 82, 154, -138, 80, -89, 68, 61, 61, 284, 175, -107, -57, -221, -99, 80, 80, -149, -108, -105, -166, 125, -148, -187, -95, 157, -218, -135, 30, -103, -130, 145, -68, -109, -212, 111, 95, 113, -192, -213, 80, 93, 109, 7, 217, -100, 30, -9, -171, -260, -29, 48, 90, -138, -69, -13, -87, 236, 90, 67, 170, -227, 100, -43, -25, -32, 31, -115, 45, -50, 39, 111, -206, 425, 126, 81, -111, -31, -69, -99, -218, 27, -33, -207, -110, 64, -155, -155, -96, -6, 206, -239, 103, -234, -107, -140, -121, 103, -155, -138, 9, -12, 148, 145, 42, -9, -143, 5, -21, 62, 174, 65, 64, -272, -314, -41, -144, 62]
7354F2M4%k07K10M7r2n2R9p2mO5k47K75r5Ml3j66k9J43j0R2j16l9m8K20OK28k96
7382a1Q8J02l3l0J4j58J06o0J0j21J09K55l19O3n4K35n9n1q4o1J52J02k69j99
7406b73M02k73J82j70K04j25r4P8n9n2J67K61l05o1L09k59Q8J60k95J66k55KO4
7429a38J41j20M17k07K3k47Q9oJ73j53N6J7l4L03l71R7j64j68L5J57O6J4J27j66
7453e9QK44k69K95q6j84r6J83nk07o0K00K4j74J45J9o8J97k49P1K37j61j9N4J58
7478A98j83o2m3K33m31J45Q1J87o7J16j56j42O0k2j6R7J89k64k5J69o5kM1j3j50
7503a25J8M3O3O7j23j83Q2L3J52J95m52L31k70K48o9N4o0J22j44pj24K19j63J08
7527A5n8k6J1J03K58l45J03j0o6j73J02j87K72j10L20m18L81k55K51k57J42k17
$$ y = [62, 106, 106, -101, 109, 156, 64, 12, 111, 39, 35, 100, -147, 128, 33, 37, 4, -162, -191, -48, -58, 34, -82, -121, -169, 51, 57, 285, -11, 77, 179, 146, 116, 130, -28, 78, 18, 28, -93, 16, 271, -48, 15, -39, 196, 137, 86, 2, -59, 93, 195, -74, -273, 129, -144, 38, -132, 72, -53, -147, -69, -128, -180, -13, 248, -57, -118, 191, -68, 20, 180, -115, 51, -204, -202, -138, 3, -117, 300, 93, 116, -131, -42, -48, 125, -28, 28, 45, 11, 314, -57, 40, -124, -292, -257, -100, -34, -20, 107, -59, -51, 193, -76, 219, 133, -51, -147, 36, 31, -176, -236, -36, -12, -186, -41, -22, -90, 107, -142, -71, 166, 5, -14, 40, 198, 15, -47, -90, 143, -288, -143, -62, 125, 58, 174, 18, -124, -64, -86, -102, -5, 184, -80, -105, 64, -1, -3, 38, 25, -125, -107, -64, -1, 66, -57, -240, -158, -125, 27, 222, -230, 101, -169, 79, 10, 64, 4, 126, -18, -25, -149, 70, -93, 15, -43, -69, -58, 45, 303, -42, 61, 51, -15, -188, -86, -273, -1, -111, 209, -209, 172, -83, 168, -89, 53, -164]
7549a64L09J4l03L42k41r8K73p0j7j08L0K51k02L51k96J89k45k62L04j07m5PJ75
7572H7J3Q3k22K52k68M2j34M07m86K22J98k25J5J13m2P3j27k0j18J85Q7k33K76
7595A78k20K1Q0j02r2K14k8j35n6K1J88j58J10O3K3q3j84J63J36j41j32m0L91
7618B17p1j85J13Q4j34m8p0L1K98k86l9R0j70N0J38j12PK29k48J2m1Q3K31j52
7642B7p1K65j17r4K3Q7k48k9k45M44p5j37L6J84j24j74L8L90k26R7j19k0J66n
7666G3j4J35j09K4j39L40k37n5K01m1l6k83K12P4j59J03Nj08ON8p7O7K29k80k22
7691b33J45J42K3K2j09j29M9J00j8N3o5p1O0L3k6l2K21p1k58M52k36m2j38J02
7715b6L40m84K48J67j74J18j35n5J0P2j58j4L08l97Q7R2o3k2Q9k1o8J23n1P0L
$$ y = [-164, 145, 159, -144, 198, -43, -141, 132, 62, 45, -63, -33, 218, 16, 367, 71, 260, 15, -247, 57, -50, -95, -88, 87, 100, 183, -39, 213, -55, -13, -147, 260, -226, -4, 194, -31, -16, 97, 55, 128, 1, -19, -137, 48, 135, -98, 178, -42, -21, 59, -43, -135, 79, 51, -84, -140, -119, 69, -89, 21, 84, 107, 24, -160, 3, 139, -2, -134, -174, 217, 146, -39, 74, 158, 24, -24, -94, -63, 235, -51, -90, 0, -170, -120, 18, -94, -87, 142, -106, -94, -135, -52, 179, 27, -44, 221, 104, 10, 33, 120, -128, -157, -402, 42, -33, -170, -134, 50, -74, -248, -210, 180, -46, 51, -68, -88, 78, 73, 59, 194, 85, 109, -30, 310, 73, 18, 219, 178, 142, -141, 71, 145, -14, 89, 94, -14, -8, 50, -27, 40, 269, -11, -233, -88, 54, 77, 99, -10, -139, -90, 10, -8, 45, -20, -91, -31, 2, -24, -56, 165, 94, -164, 288, 52, 10, -128, -26, 314, -170, 78, 245, 71, 189, 54, -1, 9, 81, -77, -91, 217, -180, -93, -1, -64, -86, 3, -18, -86, 37, -14, 56, 59]
7740E9j19L0j56L2m0K65m8K06l54K4J57q8J18j64J65j82m1J22k23K41m9m6K36
7763A45N8k06R5j0j02L20k70N7O5m49L85k79L65L8j12J2K4j61m1J62j3j90K92
7786A85n5j75L7m8J98k52l5O4N1k87L37J96j8j82O8J17l95L18q9J57q3k09J04
7809DJj89J18O4J2O3j40J25J86l62K7k6K98p5k0m6j56%K50L0j8l55N6K00o3J88
7835A72l73J85J47p4k3q4K14k09k2k17M07l01J29J84m6K72k44k01N7k5o4J73j80
7858a23K85k26J68j4k34KK2R1O3J12j42l6K16j11lj21J73k1j86J59j12K00k65
7881a03J9Q0j66L05k06J24j28M2J17k12L7O0j41k1Q7K89l47K54J40j74j85K66
7903A37j00OK7Ko6M8p1L41l57L04m30K82l1N7l8j63k8K42j59q1J08k45J49J18
$$ y = [59, -60, -30, -186, -154, -194, 71, 23, 229, -125, -101, 56, -32, 86, -78, 87, -95, -136, -14, -237, 4, -45, -91, 145, 203, -3, 92, 82, -20, 300, 30, 87, 152, -297, 88, -191, 174, 212, 100, 112, 136, -25, -66, 96, 83, -107, 185, 130, -45, -8, -56, 142, -110, -145, -81, -30, -317, 20, 216, 198, 16, 84, 201, -194, 124, 35, 192, 109, -100, 4, 5, -184, -66, -2, 10, 73, -67, 58, 244, -118, -91, -117, 181, 106, 86, 40, -116, -116, 134, 164, 146, -209, -153, 47, -16, 172, -201, -16, 131, 57, 34, -50, 164, -45, -67, -284, 123, -178, -49, 135, 89, 361, 117, -84, -27, -52, -116, 57, -123, 162, -64, 104, 90, -144, -142, -120, -29, 34, 146, 4, -32, 184, 73, 70, -51, 122, 101, -85, 74, -38, 162, -103, -84, -4, -170, 135, -71, 53, -75, -33, 84, -128, -91, -31, -172, -193, -106, 183, -164, 90, 230, 56, -129, 137, 37, 43, 70, 72, 6, 54, -17, 324, -33, 271, -159, 123, 92, 149, 111, -52, -80, 162, 3, -78, 30, -215, -66, 52]
7927E2P7L6k63j06M12j41o4P5j26J66n7l51M70j93K07j55J42j10l4q3j00%K29
7950H3j42pK05r0j1L6j63rK38r9J48n0J72j13j05j26p6M7J09p1K23l47Q7L72l26
7975a5J7J2j77J29M4k55N5K79j50Q7n6k58K11L17j34k11J29Q5l17K88j23m8K31
7998A40m05L78m53O28k64Rj41L3K21J50l25K4J35K6j24QO1p6Q2R3j62J38mm75
8022c03M60j94J36p1K4l7nm5M3Q4l98J05L10j76l3K17j24j82J53o7L2m3J11J55
8046A52j32j50K78k37K60k03J67J0j18J07j07O1j14j06K27r5k37L45J75l00j32
8067a49R9K3M0M4k16K3j86M39k98J41PL0R4j09j6K7J63j17j01J83q0K30n58K54
8091c3j19J40Q0K0k20J81l59L88J34j23k78L67k21R5NM9k29J54l6k1qmj64n8L20
$$ y = [52, 129, 165, -98, -204, 208, 67, 3, 78, -48, 118, 61, -290, 180, -13, 194, 39, 181, 71, 37, -46, -146, -146, 83, -59, -66, 139, 49, 38, 74, -89, -98, 140, 41, 189, 139, 311, 198, 93, -33, -109, -62, 47, -24, 199, -148, -61, 311, -15, 2, 14, -163, -34, 10, -245, -190, 89, -61, 26, -30, -288, -77, 240, 106, -105, 24, 109, -208, 80, -43, -91, 140, -265, 113, -340, 288, 24, 33, -108, -75, 146, 296, -29, -5, 130, 156, 32, 40, 101, 25, 107, 200, 38, 176, 172, -303, 157, -37, 99, 28, 52, 15, 10, -35, 8, 92, -306, -201, 109, -67, -100, 117, -7, -189, -36, -103, -71, -114, -3, 152, 20, -130, 148, -89, 171, -32, 135, 145, 27, 134, 27, 88, -26, -132, 95, 0, -237, 108, 283, -17, -149, -50, -27, 13, 57, -159, -136, -322, 117, -181, -40, -33, -3, 91, -18, -34, -7, 156, 39, -62, 121, 41, 271, -287, -33, -152, -12, 68, 88, -132, 49, -310, 78, 212, 89, -189, 178, -43, 52, 57, 106, -123, 31, -5, -26, -34, -38, -202, -260, 60]
8116F0l3J10l71J30K65l61M41k72J84k11L2k6O9m9Q1J14j33o9J05o1J17j04n3
8139c5nJ58j28j07K51k08J81k75K28o0J15j30q8k9J74k69J81k3K64k09P7k42K68
8162H9Q8l07Q0L48l18K45r0m43L35p2qr5J11O2Kj41P5rj28Q4R5Kk62L60j59K19
8188A63j56J10N1
$$ y = [60, 27, 137, -234, -104, 161, -200, 241, -31, 153, -58, -26, -52, 17, -32, 49, 163, 30, -39, 66, 5, 122, 18, -35, -40, 118, -10, -117, 134, -74, 107, -168, 60, 0, 115, -15, -103, -132, 42, -227, -46, -69, 195, -14, 63, -179, 89, 177, -130, -50, 298, -20, 225, 135, -308, 27, -45, -53, -148, -37, 25, 27, -114, -39, -48, -176, -92, 3, 5, -257, 103, -56, 163, 7, 117, 168]
8191A68
$$ Imaginary data points
##PAGE= N=2
##DATA TABLE= (X++(I..I)), XYDATA
0@%%%%%%%%%%%%%%%%jRj6J6j6J6k4L2l2L3m1M9n7O5p3Q8r9J08j22J38j58J82k02
39a05K26k51K76l08L40l78M20m63N10n61O19o82P51q28R14j009J115j238J379
58G27j539J727j954K230k575L020l620M476n811Q205j3825N4412K6213r1014m3566
73f2894J2801O4700L7466n510m9647m7128m140N4005N4302J710n8839n3677L380
86e3471N8553N1146n673n7537m6804Q317N2135M2182l763m5722m6164l746M9436
99a111N4454q33n9327n0364J2443N6265L7714j1421m3921l6900J957M1675M4378
112D5009M71m7330m5588L205M8360M3123m743m6702m2408N279M7062L9761o846
125C8653m3663l7281L343M1072M0616j014m5143m2323O070M7405L6344r463m0996
$$ y = [0, 0, 0, 0, 0, 0, 0, 0, 0, 0, 0, 0, 0, 0, 0, 0, 0, -1, 8, -8, 8, -8, 8, -16, 16, -16, 17, -24, 25, -32, 33, -40, 48, -51, 57, -65, 73, -85, 97, -105, 121, -130, 146, -162, 178, -200, 220, -243, 267, -294, 325, -357, 394, -434, 480, -529, 586, -652, 727, -812, 915, -1039, 1191, -1384, 1636, -1984, 2492, -3319, 4886, -8939, 45473, 71686, -19328, -62894, -50093, 14607, 52073, 46563, -3084, -50212, -54352, -347, 53955, 55665, -3174, -56851, -53471, 5082, 56228, 50555, -6982, -53786, -45469, 6666, 48848, 45085, -637, -46801, -50547, -1111, 53343, 52510, -6817, -57181, -44738, 11527, 49241, 37820, -6101, -43001, -41044, 631, 45009, 45480, -1850, -47438, -44233, 4127, 47250, 42507, -4195, -46603, -41324, 5738, 45499, 38653, -5010, -42291, -38948, 2124, 42740, 41726, -3417, -45740, -39670, 7735, 44079, 34616, -6380]
138f380l2468M362L6261L6187J55l9489l9814K465M2407L7430m591m0614l5832
151c9921M130M0012L5621m766m0112l3344N226L7299L2452k890l6481l4850L064
164c4560L8686L3758n977l7362k9972M897L3175L1036o88l4231l4485J942L7549
177C768L3388n365l6269l0767M811L4311L0403l354l4678l0769M263L4714K8889
190C3345m578l2404k8777L356L2038K9555l553l2539k8472L925L1262K7861j949
203B9070l0894l0206J937L3449L0478n558l4140k6103O033L0393K5027l015k9155
216b684k7250K083L1026K7771l922l1392k5602M158K9390K5688l350k8855k5879
229b8818L043K8439K5811k109k8724k6947K434L0469K7152m812l1129k4626O583
$$ y = [-6380, -38848, -34486, 1775, 37962, 38117, -1372, -41186, -38721, 3686, 41116, 36525, -4089, -39921, -35791, 4221, 39842, 35076, -5036, -38380, -33154, 4145, 36597, 33707, -2774, -37624, -34560, 4126, 37884, 31907, -5455, -35427, -30530, 2645, 33681, 32993, -1238, -35723, -33781, 3768, 37156, 31791, -4478, -35245, -30434, 3877, 34280, 30926, -3752, -34521, -30258, 4456, 33345, 28767, -3637, -32414, -29058, 2980, 32535, 28982, -3557, -32029, -28104, 3158, 31019, 29070, -1824, -32030, -30093, 3356, 33834, 28276, -5864, -31967, -25934, 4459, 29486, 26471, -2684, -29934, -27851, 3175, 30946, 27024, -4368, -29970, -25812, 3578, 29266, 25916, -2939, -28818, -25775, 2664, 28475, 26366, -2358, -29305, -26871, 3598, 30750, 25938, -5191, -29817, -23234]
242b3234K8557K1703m603k5121k3051J385K6149K5956k176k8782k5408M359K8798
255D532K3089m757k6611k2877L622K6082K3146k623k6129k4066K739K7132K4618
268B7897m409k8559k2279N808K6850K0189n220k4186j9805K168K3272K2757j370
281B3113k5601k3874L265K7371K1857m708k6092k0484M563K4249K0575l085k4169
294c020k1408L142K4616K1719l689k5734k0786N113K4726J9134m783k2943j8511
307b2424K775K1997K0200j640k3152k1808K966K5091K0677m615k4762j8865M666
320a8894K3216J8023l966k1752j8711L001K2248J9540l705k2961j8951M583K2631
333D302J7953m691k1316j7149K944K0483J8605k395k1597j9305L001K3073J8868
$$ y = [-23234, 5323, 27026, 22423, -2698, -25749, -24364, 1785, 27741, 25565, -3217, -28625, -24266, 4532, 27621, 22864, -3747, -26624, -23002, 3080, 26226, 23603, -2526, -26592, -23853, 3279, 27897, 23488, -5071, -27350, -21542, 5308, 25497, 20277, -3909, -23714, -21546, 1726, 24483, 23113, -2488, -26362, -23097, 4274, 26131, 21423, -4669, -25153, -20590, 3659, 24234, 21149, -3020, -24428, -21286, 3330, 25049, 21360, -4374, -25160, -20047, 4679, 23813, 19030, -3913, -22424, -19649, 2348, 22548, 20908, -2244, -24052, -21086, 4005, 24682, 20067, -4695, -23560, -18894, 4322, 22345, 18379, -3373, -22084, -19083, 3165, 22705, 19000, -3961, -22912, -18329, 4302, 22255, 17564, -3752, -20901, -17957, 2526, 21131, 18736, -2861, -22166, -19165, 3908, 22776]
346B2776m984k2490j7148M990K1496J6142m330j9947j6765K966K0681J7572l499
359A7460k1180j7667M703K1099J6064m351k0348j5593L458J9415J7029l038k0094
372c043j7424L272K1224J6960m783k0987j5397N023J9649J4684m149j8730j4862
385a8563L013J8585J6088l152j9231j6651L982J9978J5503m289j9375j4491L911
398a4692J8101J4790k954j8656j5126K671J9791J5613m775j9598j4096N267J8019
411D355J3517m292j7153j3461L237J6769J4481k536j7951j5289L582J8717J4359
424A8335m355j8345j3318M479J7138J3208l596j6828j4186L493J7847J4137m376
437A3633j7982j3106M643J7157J1911l909j6121j2081K824J5907J3634k925j6798
$$ y = [22776, 17792, -4698, -21846, -16856, 4640, 20782, 16452, -3495, -20260, -17294, 3387, 20959, 17460, -3720, -21387, -16684, 4415, 20479, 16128, -4220, -19813, -16355, 3060, 20089, 17051, -3043, -20467, -17195, 4029, 20989, 16206, -4781, -20178, -15155, 4494, 19178, 15029, -3701, -18563, -15550, 3035, 19123, 15971, -3260, -19911, -15929, 4049, 19552, 15263, -4112, -18603, -14692, 3409, 18199, 15245, -3411, -18537, -15866, 3925, 19538, 14763, -4835, -18931, -13664, 4355, 17872, 13580, -3573, -17034, -13797, 2972, 17453, 14917, -3034, -18323, -14741, 3976, 18335, 13980, -4365, -17683, -13204, 3934, 17142, 13546, -3282, -17468, -13975, 3872, 18009, 13633, -4349, -17455, -12812, 4345, 16256, 12347, -3774, -15855, -13031, 2876, 16510, 13585, -3213]
450c213j3654L238J7506J3326m308j7206j2404M341J6261J2200l811j5589j2477
463a5790L281J5860J2879l589j6356j2596M160J6105J1461l728j5100j1417L028
476a1802J4633J2523k693j5839j2895L487J6293J2189m097j5648j1785M494J4972
489C832J1104m063j4225j1162L056J4570J1967l541j5000j1488L530J5231J1068
502A4879m059j4409j0481L190J3960J1190k772j4662j1786L340J5428J0800l727
515A0891j5200j0200M256J4068R932l574j3417j0432L039J3643J0917l083j4065
528c225j0810L637J4219J0233m235j3412r951L473J3393J0251l155j3245j0494
541a3321K916J4153J0080l696j3963r742M289J3260Q931l720j2245r406K851J2436
$$ y = [-3213, -16867, -13629, 3877, 17203, 12895, -4311, -16715, -12374, 3887, 16087, 12276, -3313, -15790, -12509, 3351, 16230, 12641, -3715, -16311, -12151, 3954, 15415, 11687, -3413, -14830, -11802, 2831, 15354, 12661, -3178, -16073, -12586, 3707, 15896, 11799, -3849, -15634, -11140, 3832, 14936, 10873, -3352, -14514, -11458, 3112, 15079, 11538, -3462, -14950, -11420, 3811, 14879, 10820, -3589, -14070, -10880, 3080, 14270, 11498, -3164, -14950, -11610, 3818, 14618, 10891, -4309, -14509, -10253, 3815, 13747, 10173, -3244, -13676, -10637, 3006, 13923, 10840, -3225, -14035, -10398, 3821, 14054, 9819, -3593, -13544, -10071, 3322, 13573, 10418, -2827, -13321, -10405, 3748, 13828, 10132, -3831, -13573, -9284, 3976, 12907, 9187, -3058, -12464, -9613, 2823]
555B823J0088k643j3388j0190L412J3581R450l869j2807r083L681J2288R128l207
569I264j2205r652L234J2523R436l725j2452r079L918J2473Q061l219j1896q139
583a1458K385J1685R207k633j2020r578L385J2428Q941l702j2309q178L684J1417
597C254Q296l153j1389q670L189J1748Q339l438j1636q127L407J1504Q039l458
611G905j1162p692K819J1109Q322k796j1561q448L152J1798Q041l760j1259p505
625a1037L794J0618P203k755j0844q046L250J1178P548l405j0823p498L326J0872
639C381P047l055j0410p578L159J0631P481l216j0584p778L297J1028P497l751
653G149j0788o799L745J0145O565k882r972p060K685J0067P464l049j0830o548
$$ y = [2823, 12911, 10268, -3120, -13310, -9898, 3683, 13133, 9264, -3543, -12626, -8945, 3343, 12471, 9264, -2941, -12593, -9359, 3164, 12600, 8875, -3577, -12656, -8738, 3735, 11796, 8577, -3319, -11458, -9073, 2612, 11819, 9186, -2834, -12412, -9027, 3401, 12342, 8640, -3669, -11847, -8163, 3254, 11550, 8397, -2992, -11662, -8473, 3275, 11614, 8176, -3460, -11587, -8180, 3324, 11363, 7905, -3257, -10949, -8130, 2979, 11301, 8505, -3056, -11504, -8352, 3446, 11487, 7727, -3532, -11037, -7243, 3375, 10578, 7823, -3021, -11067, -7817, 3361, 10909, 7504, -3319, -10817, -7491, 3381, 10428, 7373, -3037, -10615, -7456, 3175, 10656, 7440, -3144, -10922, -7625, 3403, 10900, 7149, -3639, -10438, -6693, 3452, 10017, 7135, -2837, -9897, -7212, 2855, 10319, 7270, -3560, -10108]
667a0108L220J0155O493k962r912o605K601R915P321l157r981p131L207J0331
681C387O694l642r792o532L680R534O009l302q669o616K404R526P187k811j0276
696c219o681L507R696O051l385q948o317K985Q979O692l008r474o403L210R314
711B999O322l184r481n912L589R035N418l277q521n333K362Q231O705k294r177
726b518o769L017R796N658l495q890n534L219Q330N857k856q552n878K801Q696
741B882O018l307q731n499L246Q367N385k844q436n216K643P950N784k203q628
756b589o043K714R165N555l581q645n114L823P621N065k587p749n778K501Q233
771B591N634k988q130n445L225Q105M854k526q295n284L205P914N036k658p879
$$ y = [-10108, -6888, 3267, 9760, 6798, -3114, -9719, -7118, 2797, 10118, 6961, -3020, -10151, -6944, 3387, 10081, 6439, -3353, -9885, -6205, 3329, 9338, 6036, -2633, -9249, -6845, 2681, 9868, 7057, -3219, -9900, -6393, 3303, 9354, 5969, -2979, -9296, -6311, 2668, 9360, 6352, -3122, -9525, -6315, 2999, 9321, 6137, -3344, -9256, -5667, 3368, 8786, 5509, -3012, -8345, -5983, 2248, 8953, 6659, -2518, -9287, -6270, 3526, 9184, 5689, -3201, -8735, -5516, 2814, 8671, 5815, -2737, -8615, -5814, 2882, 8900, 5593, -3138, -8637, -5391, 2976, 8361, 5517, -2919, -8135, -5492, 2458, 8242, 6039, -2589, -8632, -5918, 3247, 8802, 5221, -3424, -8538, -4715, 2906, 7971, 5384, -2365, -8143, -5642, 2591, 8225, 5237, -2893, -8338, -5113, 2992, 7846, 5320, -2975, -8259, -5054, 2860, 7896, 5238, -2641]
786b641n304K811Q145N270l397q074m689L420P354M416k726p350m584K407P461
801B519N111k687p814m911L115P332M805k791p452m647K726P561M549k887p699
816c170m075K539P230N093l131p641m401L187P442M123l026o977l954K275P149
831B663M311k344p422m697L016P295M229k727o924m434K692P040M503l170o934
846b903m259L084P029M048k915p095l798K779O713M152k762o580m251K642O602
861B486M268k278o728m532K582P143L739k857o438l985K651O448M019k541o592
876b615m030K701O519M229l052o575l514K602O265L864k771o171l848K389O298
891B291M151k253o794m038K807O691L821l365o325l022K665O006L561k624n974
$$ y = [-2641, -7945, -5134, 3011, 8281, 4884, -3190, -7879, -4459, 2895, 7311, 4585, -2765, -7349, -4942, 2519, 7630, 4943, -2871, -7782, -4667, 2665, 7470, 4679, -2773, -7420, -4694, 2867, 7416, 4529, -3170, -7245, -4706, 2524, 7617, 4486, -3155, -7556, -4369, 3073, 7196, 4170, -2807, -6761, -4486, 2663, 6974, 4630, -2792, -7489, -4473, 2822, 7051, 4324, -2600, -7034, -4342, 2698, 7201, 4031, -2903, -7162, -4078, 2951, 6999, 4084, -3011, -6809, -4030, 2683, 6835, 4073, -2507, -6758, -4116, 2486, 6754, 4476, -2252, -6784, -4202, 2941, 6680, 3823, -2615, -6600, -3949, 2499, 6518, 3977, -2615, -6645, -3944, 2575, 6804, 3752, -2823, -6337, -3735, 2530, 6394, 3623, -2548, -6396, -4007, 2291, 6442, 4189, -2605, -6643, -3836, 2855, 6676, 3311, -3014, -6036, -3371, 2635, 6196, 3572, -2402]
906b402m032K507O557L700l020n903l217K408N910L519k476o168l382K449N811
921B261L855k291o401l690K739O246L302l024n895l125L018N493K902j985n543
936b138l586K178O034L205k104o104l452K678N923K689k087n587l155K128N842
951B464L363k478n915l206K361O292K762k696n551k848K620N355K897k367n248
966b195l406K452N739L000k342n812k862K402N501L103k563n573k789K442N247
981B344K859k040n696k995K781N404K874k873n246k465K380M979K839k499m799
996b153l123K442N128L011k514n387k786K851N058K398k348m901k739K372N353
1011B662K503k446n253k555K500N142K411k392n205k418K667M649K486k316m467
$$ y = [-2402, -6434, -3927, 2630, 6330, 3310, -2593, -5810, -3402, 2508, 6027, 3551, -2617, -5999, -3550, 2261, 6116, 3825, -2576, -6266, -3527, 2719, 6021, 2997, -2898, -6023, -3005, 2488, 5390, 3405, -2138, -5724, -3546, 2488, 5693, 3589, -2515, -5967, -3289, 2634, 5323, 3236, -2351, -5506, -3378, 2464, 5827, 3349, -2566, -5772, -3411, 2881, 5643, 2947, -2604, -5452, -2832, 2523, 5420, 3053, -2195, -5601, -3149, 2590, 5590, 3248, -2564, -5426, -3024, 2477, 5580, 3017, -2556, -5345, -2903, 2344, 5203, 3163, -2533, -5528, -2747, 2657, 5531, 2658, -2588, -5053, -2673, 2306, 5145, 2646, -2153, -5276, -2834, 2294, 5305, 2791, -2596, -5382, -2531, 2527, 4925, 2577, -2324, -5063, -2691, 2662, 5165, 2719, -2534, -5089, -2589, 2553, 4964, 2572, -2633, -5051, -2384, 2265, 4751, 2435, -2032]
1026b032k834J961N149K857k448n102k592K638M954K330k367m979k154K403M506
1041B290K468k538m583k514K290M944K422k251m971k388K564M594K137j915m799
1056b250k285K004M620K884k488m774k901L096M570K212k331m991j628K303M191
1071B232K282k188m706j935K061M400K668k405m750k048K210M583K184k350m221
1086a983k414K127M369K500k297m740k210K430M805J894k504m405j808K106M493
1101B363J697j916m111k238J981M435K204k418m352j851J872M514K216k405m069
1116b078k058J936M291K198j921m531k227K196M445K033k592m041j717K347L810
1131B091J783k061m040j605J897M000K208k224m080k211K280M311J703k299m149
$$ y = [-2032, -4866, -2905, 2244, 5101, 2653, -2449, -5041, -2403, 2551, 4881, 2514, -2465, -4619, -2216, 2290, 4758, 2220, -2363, -4877, -2587, 2357, 4779, 2528, -2443, -4831, -2267, 2327, 4464, 2549, -2250, -4535, -2531, 2089, 4973, 2485, -2289, -5190, -2094, 2476, 4688, 2357, -2634, -4262, -1959, 2232, 4514, 2326, -2380, -4315, -2254, 2146, 4814, 2409, -2341, -4389, -2179, 2404, 4588, 2238, -1983, -4397, -2270, 2099, 4599, 2302, -2438, -4648, -2218, 2587, 4481, 1977, -2428, -4236, -2130, 2363, 4060, 2144, -1967, -4205, -2224, 2211, 4415, 1997, -2355, -4206, -2334, 2180, 4396, 1991, -2078, -4136, -2200, 2091, 4289, 2368, -2163, -4390, -2194, 2251, 4284, 1692, -2349, -4066, -1719, 2091, 3874, 1813, -2227, -3832, -1935, 2065, 4273, 2049, -2031, -4242, -1962, 2349, 4052, 1753, -2396]
1146b396j430K072L840J890k095m180j775K223L982J882k231m147j463K064L911
1161B147J592j607m276j738K092L868J867k349l633j848K407L646J431k190l713
1176b304j351K029L558K032k584l393j615K010L649J518j750m017j335J918L718
1191B083J550k084l400j857J930L832J795k289l686j626K441L555J247k156l516
1206b181j442J969L970J143k047l357j623K310L105J878k553l151j591K200L307
1221A937J425k016l300j485J917L671J318k088l445j494K290L438J115k383k746
1236a846j166J619L396J024j892k983j412J876L431J241j884l474j139K092L255
1251B138R23j881l274q68J758L108J287j929l295j129K015L195J116k056l117
$$ y = [-2396, -3826, -1754, 2086, 3976, 1881, -2299, -4074, -1851, 2131, 4013, 1782, -2365, -3828, -1764, 2147, 3739, 2132, -2144, -3882, -1790, 2078, 3945, 1596, -2037, -3885, -1478, 2168, 3599, 1409, -2304, -3655, -1626, 1932, 3964, 1380, -2013, -3628, -1618, 2031, 3549, 1799, -2218, -3553, -1635, 2083, 3633, 1549, -1851, -3708, -1778, 2054, 3849, 1560, -2126, -3752, -1311, 2244, 3491, 1335, -2181, -3623, -1654, 2316, 3459, 1412, -1945, -3568, -1258, 1847, 3725, 1172, -1979, -3570, -1370, 1937, 3362, 1346, -1954, -3439, -1522, 2149, 3467, 1379, -2066, -3560, -1270, 2168, 3283, 900, -1846, -3012, -1393, 2003, 3027, 1135, -1848, -3260, -1384, 2047, 3288, 1404, -2070, -3209, -1117, 2138, 3061, 1180, -2094, -2962, -1204, 1904, 3191, 1262, -2033, -3162, -1147, 2048, 3164, 1108, -2009]
1266b009j006J845L030J179j744l133j171J980L042J087k081k762j324J934L077
1281A944J017j778l139p63J616K682J545k147l117j086J949L188J056j943k854
1296a830j115K032K558J030j389l141j042J773L156Q71j729l124j157K186K845
1311A924R10j714k985j084J923L082P79k087k487j070J935K709J092j895l034
1326b002p32J669K521J559k183k430j096J729K724J071k089k773q99J912K883
1341A864O50j551k636q05J815K217J307j920k669j180J958K731P90j896k505p44
1357b574J840K362Q78j410k760q18J259K850J253j754k737p69J542K434J104j861
1373H39k383q20J598K516O11j417k590r77J542K789J197k144k538p83J892K359
$$ y = [-2009, -3015, -1170, 1860, 3039, 1295, -1838, -3009, -1029, 2013, 3100, 1019, -1743, -3067, -1133, 1944, 2961, 1183, -1956, -2719, -1103, 1579, 3124, 977, -2140, -3226, -1277, 1911, 2967, 1024, -1830, -2945, -913, 1645, 2675, 1286, -1855, -2897, -1124, 2032, 2903, 1174, -1950, -3107, -921, 1924, 2834, 1120, -1865, -2949, -1026, 2056, 2835, 748, -1739, -2809, -874, 1835, 2927, 1032, -2002, -2734, -1065, 1456, 3015, 832, -1598, -2694, -965, 1759, 2830, 741, -2032, -2931, -1019, 1864, 2514, 963, -1673, -2478, -663, 1554, 2861, 941, -1728, -2908, -950, 1781, 2571, 675, -1830, -2574, -734, 1628, 2506, 1096, -1664, -2482, -1223, 1627, 2880, 1126, -1611, -2380, -838, 1596, 2700, 839, -1544, -2364, -766, 1750, 2361, 944, -1646, -2623, -1081, 1708, 2905, 761, -1777, -2560, -668, 1691]
1389A691P41j662k275q26J462K744P08j784k747n86J782K527Q84j900k171p43
1405b155J455K263P67j520k290j063J628K586Q82j684k731n00J691K403N69j663
1421F38k242p11J477K437N59j412k274p59J555K526O04j661k419n15J390K239
1437A432P79j395k237j055J626K566N61j714k185n95J696K058O29j573k178m66
1453b051J304K381K83j206k506l94J793K083N61j794j933q08J489K335K64j017
1469G84k347m63J414K111O94j542k302n77J863J854M68j239k241l70J301K046
1485A454N44j517j998n58J512K139P86j872k110l22J343K018O41j818j653o97
1501b108J707J920M32j464k283k94J551K185L30j554j707q04J782J805J62j272
$$ y = [1691, 2432, 770, -1505, -2331, -869, 1875, 2583, 799, -1948, -2534, -752, 1775, 2659, 759, -1412, -2155, -700, 1563, 2330, 810, -1480, -2543, -915, 1671, 2553, 869, -1862, -2362, -671, 1732, 2301, 638, -1604, -2315, -838, 1599, 2158, 746, -1528, -2287, -732, 1794, 2398, 737, -1682, -2197, -807, 1432, 2211, 816, -1421, -2476, -850, 1716, 2277, 563, -1622, -2217, -521, 1537, 2166, 593, -1585, -2051, -747, 1634, 1917, 711, -1795, -2189, -396, 1687, 2248, 454, -1479, -2287, -798, 1537, 1801, 784, -1563, -2026, -612, 1499, 2193, 651, -1651, -2228, -365, 1489, 1957, 718, -1523, -1893, -592, 1454, 1998, 481, -1517, -2075, -563, 1576, 2362, 490, -1620, -1942, -599, 1419, 2060, 242, -1411, -2108, -401, 1519, 1951, 487, -1796, -2090, -539, 1646, 1976, 422, -1285, -2089, -307, 1498, 1660, 388]
1517C88j755o53J565J846M70j502j842l74J467J778M31j455j851m11J486J786
1533A374L84j404j953j64J142K235J86j385j826l74J391J729N00j297j780n85
1549a827J334J950N39j390j944m94J430J870O7j068j685p18J608J764L49j439
1565C46j509m73J400J680N99j848j743J3J355J370M08j092k165K4J056J544P67
1582A732j380j977j66J636J323L84j187j820k94J270J778M72j260j866j43Q02
1598f96K087K11j303j547m05J428J645K68j334j745j24J051J784K70j341j467
1614a218m93J260J876J51j263j610m35J451J703J08j258j635q6J177J861Q4j381
1631B92j665k71J259J451M23j276j510j80J260J338M12j200j468n20J310J515
$$ y = [388, -1367, -2020, -455, 1391, 1861, 359, -1483, -1857, -390, 1388, 1819, 364, -1487, -1898, -412, 1374, 1758, 354, -1599, -1763, -621, 1614, 1800, 415, -1411, -1785, -394, 1335, 1835, 538, -1242, -1827, -493, 1457, 1996, 606, -1338, -1832, -402, 1468, 1535, 467, -1218, -1936, -328, 1436, 1785, 346, -1163, -1636, -236, 1444, 2043, 195, -1548, -1535, -180, 1190, 1598, 506, -1659, -1635, -579, 965, 1732, 352, -1625, -1791, -155, 1168, 1552, 365, -1455, -1749, -479, 1299, 1771, 511, -1355, -1498, -696, 1391, 1602, 299, -1248, -1653, -225, 1420, 1688, 354, -1391, -1515, -464, 1320, 1590, 249, -1218, -1711, -451, 1425, 1576, 313, -1297, -1732, -281, 1422, 1530, 272, -1363, -1449, -272, 1589, 1673, 292, -1373, -1644, -385, 1066, 1489, 213, -1297, -1477, -217, 1121, 1533, 333, -1135, -1655, -345, 1170]
1647A170K35j379j333j38J256J625J89j485j377l92J218J767K45j370j463l47
1663a579J414J299J59j014j547l97J464J380J15j044j583R9R03J520J00j237j357
1680a305j03J238J436N3j045j511j8J117J165M50j385j269l04J282J533q7j194
1697E3j297k19J301J367L93j311j478l76J243J477J36j115j436O4R88J425J27
1714A342j336j103l25J213J582O9j204j514N8J075J209K28j060j220j45J018J260
1731A147J69j191r92k67J094J028J64j275r97q3J157J191K8q60j229l01J062J210
1749A055K62j490j005M0J081J190K94j371j317m5J370R89L36j348j069j09J086
1766e1J049L50j063j318o8Q20J433J94j149j245p9J072J204oj160q52k98J191
$$ y = [1170, 1405, 26, -1307, -1445, -189, 1436, 1625, 140, -1237, -1629, -411, 1356, 1601, 231, -1232, -1579, -165, 1134, 1293, 279, -1268, -1665, -201, 1179, 1294, 250, -1333, -1234, -331, 1189, 1289, 52, -1305, -1408, -170, 1266, 1319, 274, -1237, -1255, -138, 1027, 1477, 92, -1177, -1481, -199, 1334, 1247, 53, -1244, -1463, -162, 1205, 1598, 287, -1191, -1567, -324, 1153, 1289, 174, -1262, -1198, -210, 1215, 1342, 6, -1097, -1422, -209, 1373, 1442, 238, -1276, -1218, -143, 1066, 1294, 234, -986, -1131, -113, 1147, 1316, 125, -867, -1134, -40, 988, 1152, -123, -1120, -1203, -46, 1145, 1173, 313, -916, -1217, -155, 1055, 1317, -173, -1178, -1138, -57, 1133, 1427, 56, -1261, -1306, 64, 1053, 1389, 41, -1028, -1137, -51, 998, 1348, 285, -1033, -1101, -281, 1152, 1346, 197, -1048, -1127, -55, 1149, 1143, -17, -869, -1167, 24]
1784B4J317l81q40r09k56J055Q92L09j101j238j12R48J408O3j381p75l30Q94J622
1803A209p4q76j264J08Q16J260r3j131r49J48P84J156K01j189j222K12Q61J182
1821A139J49j252q83k06J033R61M19j478q82j87J056J098J60j298p12k08R02J036
1839H47L61j102r61L7R65J050j66j076r94o1R60J084j7p30j347J39R19J139j30
1858I17j003j010J35J069Q52M0q62j113j64J153Q92k5r56j075K95R03P84J60r63
1877B9q86J51N84J005P8p77j049N2Q35R01J08j093j035K06R36Q70q3j096o13k
1897h79R65Q43K2q55q64j83P95J030J13q69r43j5J005R47k46p94r79j40J136Q07
1917H96Q2j116p66P5P76R43L1q88p94j84J055R65m65o61p94k11J053J081l15q32
$$ y = [24, 1341, 960, 120, -789, -1045, 10, 902, 1211, 110, -1128, -1240, -292, 1116, 1179, -202, -977, -1307, -413, 1209, 1135, 259, -1005, -897, -81, 1179, 1086, -45, -994, -846, -62, 1094, 1295, 106, -1116, -904, -43, 1139, 1288, 36, -847, -1053, -20, 941, 1360, -118, -1000, -1187, -131, 967, 1127, -171, -883, -1091, -189, 847, 1208, 106, -855, -818, 147, 1197, 1031, -45, -1039, -1100, -140, 944, 927, 197, -1150, -1011, -92, 1047, 917, -86, -1096, -961, 108, 960, 1000, 138, -975, -1139, 14, 906, 881, -75, -1150, -855, 48, 832, 992, 29, -857, -706, -122, 883, 961, 184, -865, -813, 22, 923, 1031, -62, -1097, -891, 45, 915, 832, -264, -877, -879, 86, 929, 951, 96, -768, -951, -156, 874, 987, 118, -825, -840, 165, 1112, 866, 72, -907, -1047, 89, 896, 978, -138, -904, -829, -53, 890, 921, 33, -761, -945, 110, 1075, 610, -51, -845, -1056, -3, 1078, 763, -69]
1937f9r19K42N00J201j48q04j007L9Q75Q87K85j325l29l06R58Q65j03r19q41J55
1957g63Q88O14l2o73q46n9J000Q52j34q50r76K60P76Q66M1r60o77k3P54P04J55
1978I17j142p13J37Q13R15m4j077n06k39Q82R10J44r52n97p2Q17P46k20o28r28
1998h37L0J156O13k43o54n51l59R87M94M9p63o25o4J014O28k5q64p43L02N72Q43
2019I60m61m17p25j40P04R87k21p55p68K38Q24O03k0q13p83JQ44O29J31q39p34
2040g55M4P50P52O3r70n54j05R02N54P9q07p61J28O14N61J24p31o13l6Q76O56
2061G71l51o70m54Q3O81O58j10o46n91L0P57M91K19q45q13L0Q92P73l76p36n87
2082g94J46O20P13l00k57p43M1O89K65J45p63m35O5P72O88k18q20l81j5P99O44
$$ y = [-69, -988, -746, -246, 955, 807, 3, -1004, -965, -90, 797, 1082, -243, -572, -878, 80, 945, 842, -77, -918, -763, 125, 739, 707, 34, -812, -871, 129, 981, 847, -3, -979, -719, 57, 923, 964, 4, -673, -696, 58, 762, 917, -225, -938, -801, 12, 927, 883, -194, -700, -939, -57, 853, 997, 45, -552, -624, 193, 939, 719, 91, -837, -807, 349, 962, 719, 65, -486, -845, 142, 636, 685, -78, -703, -767, 247, 875, 850, -14, -757, -455, 117, 960, 499, 82, -643, -783, -79, 908, 687, -68, -836, -598, 226, 829, 809, -4, -787, -786, 58, 687, 818, -21, -755, -711, 39, 791, 854, -116, -670, -775, 127, 681, 760, -47, -808, -680, -66, 495, 619, -112, -725, -761, 115, 771, 420, -250, -704, -621, 60, 718, 608, -38, -629, -599, 158, 649, 868, 23, -790, -760, 132, 905, 529, -207, -794, -648, -28, 685, 385, 128, -615, -574, 115, 380, 525, -238, -673, -608, 164, 852, 634, -186, -567, -582, 217, 861]
2103H61j81n46q41n3Q83O95j26p13p13K20O86M57j70n62m83m5O47O07j72p83k99
2124f31j0P08L82J53r29l10J5O26P93k67o90m05Q0N93N47P5p79l91k20P94O16
2145G50j51o66l91PM49N25J37o85n39J39M57P22r9p71m47M9O12P46l76o51m64
2166f47J44N68O15j97m19n30J80L66L36rm62p21K88N46M79j59n47l27K48M02P26
2187H80l29n00o77Q1M88P61J43r78m79J80N28N57l00p20m15L20P29N39k98o31
2207a21j78m2L37N51n9m60p52L73L83L41J10o73j46j23N49M87j60n44m82K75N88
2228B54J32R4o43j52j72N66M69j92n18p17M45O26L21k71l81p30N45K15P68n0o07
2249Bn25J40M58M35j24n58m15J50O02J85R9m81m35K38M19L48n9q02J87n73P54
$$ y = [861, 680, 134, -707, -760, 123, 818, 692, -21, -734, -514, 172, 629, 459, -103, -586, -631, 16, 623, 451, -332, -631, -641, 67, 449, 602, -327, -637, -622, 4, 797, 530, -160, -565, -485, 108, 655, 730, -49, -440, -660, 134, 750, 599, -67, -458, -451, -2, 523, 660, -25, -564, -425, 32, 754, 655, -116, -563, -514, 98, 844, 468, -183, -647, -503, 65, 680, 483, 64, -466, -286, 80, 416, 407, -55, -776, -488, 58, 537, 378, -169, -496, -248, 154, 880, 551, 51, -626, -545, -57, 704, 847, -131, -610, -430, 98, 655, 355, -365, -780, -460, 269, 808, 510, -121, -299, -341, -4, 547, 488, 28, -724, -351, 32, 373, 483, -190, -336, -459, 90, 577, 417, -127, -609, -334, 254, 386, 480, -163, -315, -487, 79, 548, 356, -162, -879, -434, 192, 513, 242, -139, -869, -324, -109, 659, 609, 2, -523, -383, 75, 510, 386, -172, -587, -437, 165, 350, 449, -32, -467, -229, 190, 538, 479, -323, -136, -709, 45]
2270D5M99p3l94m43n5M68N61l32k65m72K45L55M46k41n53k72M0N39K31j1m24n50
2292f56M27M75K56k81k63m46j3R36J65k84p48k28J43P26J41p8l13m06Q3L97M59
2313D92p4m35l83l00Q54L80k92k76l80k2M89L45r8k15o69K17O18J72k05l25m14
2334e21K16N79K14j77n16m98M32N59K6J67o28k68J46J81L53K7n20j96o4O17J44
2355B73l6k30l59k5M81L19p0n44k00%O21L62j54o07o7j00L73J89J50k83m57K97
2377f7p8N92j10l33n21M74K70J41O1l87o70N30L22L14j83n86r7J72L54L22q2n21
2399h3m58M54K21K41r4m30j20k46O21J73j10l81j06j27N94J72j59l03Om5L08L25
2421D53j71m04k8J1K12K65j25l31j3qK97L45j82n33k27J4M72L56j02l49k64K06
$$ y = [45, 544, 471, 77, -366, -421, 47, 608, 276, 11, -461, -216, 139, 585, 344, -209, -481, -441, 98, 329, 318, -106, -656, -229, 246, 502, 221, -42, -488, -501, 435, 600, 316, -432, -660, -517, 209, 350, 272, -41, -447, -364, 33, 492, 418, -17, -400, -700, 154, 534, 242, -34, -414, -436, 53, 398, 300, 85, -584, -367, 251, 423, 218, -107, -521, -305, 274, 488, 311, -205, -703, -271, 288, 314, 481, -147, -415, -269, -88, 265, 292, -228, -424, -488, 129, 273, 237, 7, -352, -377, 104, 423, 353, -191, -391, -391, 230, 592, 438, -169, -236, -336, 37, 226, 376, 93, -364, -67, -145, 447, 337, 4, -517, -43, 227, 368, 429, 42, -628, -98, 224, 538, 355, -231, -328, -156, 198, 520, 438, -83, -541, -87, 134, 375, 281, -149, -269, -515, 106, 279, 169, -212, -318, -445, 149, 321, 162, -141, -135, -180, 128, 453, 282, -122, -150, -139, 73, 338, 213, -118, -131, -139, 158, 503, 321, -212, -439, -425, 47, 403, 301, -48, -312, -106]
2443a06K78M16k87n94j27L57O0L45P6o03M4j15L14K15K1l72j83K96K9L75j40k84
2465A5l32k2M57K61n40Q8k30N1M50kj42J9j66j10K72J54j39k54p7q6Q05p8l20
2488G4o2l35j76R21k42K20m64j50J09K85J98j76m24r8M4L58L47k96J1n77J86M32
2510A85j28K30k00p06M64J40K17N3m40j18K26K17J36n6o41M7K86K86K6k1k10m49
2532d56M92J04K09l95k02J73j02K32L32j10m46J3OO20l31p5k32j65J95K27K62
2553C51n1n51j51L22L76j8j55j67k73O8M20J25o2j29k25j33M16K29k77j58k51
2574b94J8M10K51l40l2k32P8L96J68n32J55l81Q1K72J47r1k09k79J06L55J79j18
2596A08k79q8J7M18J69j78m38J23J07L52r9k77j9J5k07K46N74j77n23j59K61J13
$$ y = [-106, 172, 588, 301, -293, -420, -63, -3, 342, 418, -185, -141, -256, 58, 273, 294, -78, -261, 35, 64, 439, 299, 15, -317, -339, 118, 379, -161, -73, -303, -252, 198, 196, 54, 73, -93, -203, 69, 223, 84, -170, -247, -333, 472, 394, 74, 12, -323, -499, 422, 180, 400, -64, -214, -105, 180, 378, 202, -222, -320, -276, 82, 429, 133, 144, -433, -247, 185, 57, 287, 87, -619, -155, -15, 202, 255, -185, -303, -77, 140, 276, 220, -421, -374, -88, 198, 224, 203, -7, -456, 36, 140, 349, -46, -248, -75, -177, 55, 387, 277, -169, -156, -150, 470, 139, 64, -168, -333, -138, 89, 351, 300, -251, -402, -80, 296, 278, 123, -44, -317, -249, 171, 296, 234, 105, -120, -253, 163, 392, 115, -43, -294, -276, 134, 385, 45, 13, -219, -141, 255, 423, -109, 46, -335, -254, 18, 165, 74, -135, -414, -308, 47, 226, 108, -171, -259, -242, 176, 345, 167, -271, -148, -41, 311, 212, -65, -84, -69, -276, -30, 544, 367, -156, -315, -54, 59]
2618E9J06p3l47JJ78N6J19K54l51k09R1K17L51m27l58K73j61L30J28m7k02l13
2640c25N60q6j12J89j89l33K21J85J8J9k59j97K38L16L0k07k00j4n8J61M43m08
2662hj00noj3L67j32l38Q7j00J45J93M7j10l89J86K20n2L25l08l24J28L68J03
2685B84k28j2l08l4L25K31j09m43j28J44L47J34j31m5l49L69J46M8k88o8r7K45
2707C3M4Qj93m3j55K54q4M36k02l03J82P7J07j12q5Jj02Q3J60J54k63j68k35L51
2731e5K28J19j91k24QJ6K36K8q9L0l08J25K24k80L22k05m64J44M19Q0j13l4j21
2754a05MM49J7k53j75l70O26r2L18m57n4L4R2J48Lk93m9J48J2J30%j20j34j69
2778b90J86K00J11k29J2k52O1L6O14l50k16k07J41R0K23J06k78Rj65L78r1p7k60
$$ y = [59, 165, 92, -255, -254, -76, -20, 99, 353, 2, -207, -116, 101, 452, 25, -333, -60, -221, 109, 237, 190, -12, -325, 235, 149, 37, 226, 37, -296, -75, 110, 128, 147, -112, -309, -71, 245, 275, 68, -132, -146, -204, -43, 400, -8, -108, -113, -119, -132, 235, 103, -235, -148, -248, -103, 90, 137, 27, -362, -176, 44, -8, 317, 9, -315, -187, 181, 284, 56, 44, -264, -298, 27, 258, 149, -294, -422, -278, 69, 203, 72, 27, -322, 47, 193, 241, -47, -115, -212, 33, 77, 85, -108, -151, -306, -52, -136, 300, 98, -205, -23, 54, 161, 49, -36, -35, -137, -54, 106, 260, -3, -171, -406, -55, 173, 292, 101, -123, -115, -99, 137, 165, 76, 106, -202, -77, 147, -133, 189, -16, -480, -336, 83, 163, 50, 16, -105, -101, 348, 365, 112, -63, -433, 193, 101, 419, -38, -92, -58, 34, 182, 185, -108, -157, -9, 3, 133, 133, 13, -121, -290, -104, 96, 207, -22, -10, -262, -201, -165, 449, 99, -117, -324, -183, -93, 130, 236, -42, -33, -198, 180, 89, 12, -248]
2801b48n5K92KJ47J4j90k36J68L55n9J32l70k56M3L39L1kk43K01r8q5K53k03j50
2825b18p6L43J65J86m09L5K2j10rR9K11m15J74j28L90j88nk26O1P9J16M4j84p8
2849a21j51K16QQ7P8m9k93J64O2L47l97J75j84j91M18P3k35j09K37j68j39L72
2871B00o3n4j10J00K4k13K36m19K92J1K33P7k01m95J87J99R2qk03oK98k91L23
2894B09k04J52m37O2J51p4K23r1j71j10J77pJ78p0j12k12L97K99j67j40j83j84
2916c14L77MO8l51M7J65p7Q7J58o3j42M5j11M10l7j32k13n0K74J11l34M6m4j4
2940i0K40j36M5m9k12J10o1J92j20j05J5M11j19k3P7j00j93m1j3K37K75l31k27
2963b18r9L28K79m5k20l75L55J6L3j85K44m43J90J94K5j18J50j96l0M1O3K27l59
$$ y = [-248, -303, -11, -9, 138, 152, -38, -274, -106, 249, 190, 322, -48, -304, -261, 78, 109, 107, -136, 65, -33, -118, 135, -68, -218, -294, 49, 214, 400, -9, 26, 48, -62, -71, 28, 239, -176, -2, -130, 260, 72, 67, -159, -98, -19, 97, 141, -43, -121, -272, -56, -48, 39, 117, 68, -225, -61, 1, 348, -49, 126, -58, -249, 169, 242, 7, -102, 135, -33, -172, 200, 137, 83, -27, 73, 97, -116, 120, -299, -7, 4, 237, 314, 113, -382, -195, 4, 96, 88, -115, -121, 177, -114, 209, 5, 157, -280, -218, -67, -141, 82, -9, -180, -290, -113, -120, 58, -12, -124, -336, 61, 360, 193, 53, -130, -314, 63, 67, 135, -216, -169, -4, -81, 6, 164, 101, -41, 4, -107, 303, 266, 134, -79, -129, 145, 256, -78, -32, -76, -90, 150, 14, 59, 10, -202, -92, -153, 39, -81, -186, -171, 240, 121, 98, 175, 75, -118, -159, -172, 65, 340, 9, -218, -317, 11, 290, 245, 25, -350, 5, 21, 54, -131, 113, -330, -140, 54, 79, -39, 111, -85, -115, -74, -11, 216, -143]
2986a43K32l17j94L41L09Pk43K3q4K44J12k66j52n3PM78k55j83pj4kK05K22j49
3010A18l26K8K51P6j85J13j86j4K18o5J07j83J29m08L13J13J67n10L9J05j00L07
3032A07L2r3k98R8n3L18L9k4k46Q3r9L09j52k9j26J2J92K78j19j23m05J74q6L56
3056A45J17k73N8j22M86l04m7M5m4m53L38j07J96j41J09j23o9K23P2K2k34l3J53
3079A4p2J20j60jj37J82L2l1K71l74j64N20l22q1L67j01k00k51N46j66j19J03
3101b4l3m6J47O1q7l16K33N8K17J35n22K60k63J29K56j70j34n1p7K83l0j1O5j89
3125a09k5N8j5J0j22J62j91J40K3jJ9j68k04L42J90j20L09k69n8%j6M8L3j74P
3150a31O0M6J24r6J38k29P8o5N9J4j54K5K20J31j52j9j88K37k44K97K03k65j85
$$ y = [-143, 89, -228, -422, -81, 228, 235, -8, 15, -69, 175, 287, 21, -131, -184, -177, 301, 46, -137, -144, -158, -160, 45, 267, 118, -208, -180, 71, 147, -38, 75, -111, -125, 93, 28, 135, -48, 81, -327, -14, 99, 266, -244, -205, -100, -200, 107, 139, 46, -252, -154, -207, 111, 150, 126, -120, -37, -136, 173, 21, -8, -134, -122, 70, 348, 229, 106, -299, -125, -211, 145, 262, -11, 47, -75, 411, 107, 60, 105, 61, -392, -54, -161, 35, -106, 3, -120, -189, 34, 106, 128, -106, -139, 14, -58, 62, -98, -99, -236, -54, -22, -53, 218, -156, -320, 200, -122, -203, 164, 63, -137, -388, 158, -8, -127, -24, -57, -103, 44, 105, 18, -298, -65, -7, 210, 345, -177, 83, -180, -51, 205, 35, -99, -150, -227, 56, 26, 15, 80, -109, -134, -76, -91, -81, -203, -41, -232, -92, -69, -70, -51, -219, -423, -81, 109, -11, 298, 29, -29, -29, -45, 3, 36, -138, -131, -71, -25, 99, 3, 141, -88, -10, -75, -16, -2, -156, -131, 89, 220, 68, 49, -139, 98, -146, 151, 354, 89, -96]
3173i6K46r4O8J41l27O9j48j70L70J25j99j14m9J82P0j5j6l41L07J89k44K01m6
3196A09N2k52K83n8L5Jl21J33K2N8J14l9j91j05J53N3o0L5M7k10J49K45k59R5
3220H9k55K87k21M7K55l4k02M40m53K71j80j03L6k06jK36j07L11k60J44l37N25
3242B82l67J89j34K6QRo7m7r7m7J00K85k33K9Q9k66L72n1k39O2P4K5j32K92K3
3267A85j68p8j0J77k70K41l1l2O1m4n1K54k17n8J28j25J20J25m23O2P1L6K44j17
3291H0q5o6K04k27K56J12n58J77J61l26K71R8J07m29L90R7k7j41K0j22oJ60J0
3314A56j4j89K47q0M2ok22R3q5J27k93L99O0k72j51R1P0R8%L6n5mQ7k09J77l47
3340b44L81o9r0N8O4O0k16M8l2K89k33l9P9j93l5K61Kl2j02j00R5N2J78l41L46
$$ y = [-96, 150, 56, 124, 265, -62, 7, -141, -311, 59, 184, -15, -129, -178, 4, 74, 59, 43, -298, 9, 198, -46, 155, 109, 161, -91, 192, 134, 169, 170, -151, -18, 4, 62, 176, 137, -54, -159, -6, 47, -13, 22, 69, -141, 8, 253, -6, 89, -166, 121, -100, -53, 202, 168, -34, 406, -47, 224, 44, -59, -23, -229, -230, 6, -101, 210, -50, 94, -243, 282, -85, 104, -30, -4, 4, 13, -54, -101, -198, -245, -145, 140, -93, -64, 25, -241, 131, 80, -159, -97, -23, 2, -130, 162, 185, 17, -61, -71, 106, -164, 77, 46, 14, 75, 31, -20, 234, 17, -41, 87, -38, 82, 207, -216, -154, -83, -47, 197, 80, -5, -71, 133, -94, 162, 274, -284, -107, 54, -272, -1, 97, 204, -225, 165, 262, 235, 94, 114, -8, -14, 146, 156, 142, -47, 200, 120, 162, 156, -66, 27, -58, 69, -224, 175, 235, -37, -188, -97, -27, 71, 71, 107, 52, 48, 135, -74, 103, -244, 137, 68, -22, 36, 100, 160, -56, -8, -40, 249, 16, -23, 56, -137, -172, 89, 91, 59, -43, -143, -48, 4, 182, -159, 187]
3365A87l66K14L2m3K8r0J65O5p3L4o0k62K95j11j81r9L23j24p1QN31j96m15J53
3389e6l13L84r5L24r0k80p6K24J02p5j93J67N7LK7K14j19k04M0j72K23k9n1k8
3413a6n7M5L40k97r4k5J23J8n0n5J29j75k6J77l00L74o7o6N1j01M5L00l58o7L10
3438A58j12Q6j17k91J60m0K38K60m21l9l1K23k33J01J06j33J94oN2j36L2p7j59
3461a85L79j90rK81l35K3N1J0J69l28j39Q7L6J33jk13M18o2r4k6J57j52J64j27
3485D7j76O9J25OL4L4j79j65L13n0j86K22k64J27K8J33j66j89O0K52Q7k13M13
3508C62n31K54J85P3l80M40n20R0R2l1j2n2K08l72L30j02r1J04J54m78J15R2J33
3531F3k91K65l8J52R3k43JJ19j56k8k1J75j1j88j1K13r2j47K41p9m2J83N4p0o8
$$ y = [187, -179, 35, 67, 24, 52, -38, 127, 192, 119, 153, 93, -169, 126, 15, -166, -265, 58, -66, -137, -129, 402, 206, -209, -56, -369, 15, -80, 244, 154, -126, -202, 22, 124, 49, -144, 23, 80, 83, 110, 324, 205, 1, 41, -131, 92, 63, 12, -16, -73, -28, 312, 15, -79, -104, 19, 37, -13, -68, 61, -114, -140, 37, -263, 111, 44, -22, 29, -72, -27, 273, -85, -152, 158, 46, 132, 15, -276, -116, -156, 82, 342, -79, -118, -149, 74, -159, -58, 48, -85, 109, 103, 155, 19, 51, -26, -185, 194, 4, -5, 276, -59, -36, 15, 25, 194, -134, -273, -186, -150, -17, -18, -231, 187, 125, 31, 5, 162, 10, 174, 47, -129, -60, 65, 71, 105, 139, -40, -205, 108, 58, -128, 94, -170, -43, -15, 118, -48, -237, -177, 75, 162, -51, 362, -169, 85, 270, 343, -37, 403, -117, -27, 65, 34, 22, -30, 178, -194, 136, 34, -57, 47, 201, -277, -162, -70, 63, -228, 37, -1, 151, 244, 1, 2, 121, -35, -63, -84, 91, 80, -108, -119, 94, 2, -145, 96, 17, -25, 158, 212, 142, 74]
3556G4l37J15J02P5J38j7Oj20k14J54rL72l92k51K27J81j74j9J5K4L4m4K6j01
3580a35J47j68J51q6J76L1j56J14J25k40R7O0l08J82j24J1K65r3p6J7Rk54K60
3603EL9j35K05r1K85l11J3k66K12lR7p8j68J45l2M8J77q5j95K10j12m4R3j91J81
3628aJ94m45K99J14j58J0k37L51Rj20J05r9k43N31k12k8j68j32K45j9O6j87P1
3651e4j52J64Q9j36J40J35j27j61K89k27mp0n3%J18k0P8m2j20M78k86R2k54j78
3675c01K34q4j04J20J37j50p3K79P2R8k14K03q8n0Jj07j96M06j51J70j66j97M67
3698C06l51J61j94j05J22O7O7j43Q9M0j18p0L42k00j62K11k75J31K6J23J14l13
3720a32P8J58k88J24p9R3N5p0j73L15k22p1K75J6o7R8k49J17%r8K14j42R2j20
$$ y = [74, -263, -148, -46, 29, 167, 150, 156, 36, -178, -24, -33, 339, -53, -304, -77, 104, -70, -89, -74, -50, -16, -60, -34, -135, 12, -156, -5, -91, 85, 116, -40, 74, 199, -41, 56, 116, -192, -10, -134, -123, 142, 49, -27, -10, -1, -255, 5, 44, -91, 114, 23, 308, -3, 10, -256, -44, -47, 50, -28, -196, -51, -83, -35, 142, 57, -138, 72, -40, -84, 9, -182, -1, 193, -252, 47, 161, 3, 13, -224, 127, 136, 16, 121, 22, -221, 310, 98, 70, -98, -230, 15, -4, 62, -125, -54, -206, -42, 47, -89, 51, 186, 59, -102, 187, -40, -44, -114, -167, -167, -49, -69, 9, -33, -153, 325, 39, 131, -123, -301, -67, -151, -255, -135, 2, -148, -221, 58, 130, 228, 14, 217, 129, 79, 80, -27, -223, 183, 32, 202, 36, -161, 306, -45, 116, -78, -183, -61, 6, 73, -70, 19, 59, -59, -129, 213, 13, -149, 62, -213, -82, -56, 67, 181, -132, -54, 104, -184, -60, -139, -46, 9, -61, -234, 81, -141, -212, 63, 79, 12, 110, -139, -22, -22, -120, 94, -48, 44, -76]
3744g6n9J30j01Q4jK6q2J9j56K42L20m74K67j99J62k87j19K65k32J69J17L1K2
3767F8j90n6K91k06K68k69L2J08K46k23j51J66l11K08j29J9J5J24K9j15R6n3j0
3790d3K18l32R2p9K18R1k1j40P1J3l2k15K41l0k54O1K78k37N5J72k82N6k8j46
3814b73K94J2n0m4J22N3n6j80O1Mj11j67N2J91r8J71p1N2K37q7j73P7R2M5J3j97
3840c1J44m66K84K7Q5O2j52k0K62nl03K22J36p8m1j5k79j05J74L05k81l4K9J04
3864B4O9j83J68l4j33o4L26l2j31m1J97l95J98J17n0p9K05Jo5mjN3j6jn06K62
3890a15J92j30J8q6K50j73J18j72J84N2j71J17K0j24k16K60n8o2j12J45m4K18
3912A11Lj88q8K08k09J73j51N3M7Q5q3k41L32k00J54j00J89k16K66Q2l47L7J59
$$ y = [-76, -135, -5, -106, -22, -23, 3, -79, -60, -216, 26, 346, -128, 139, -60, 102, -185, -304, -39, -271, -102, 15, 46, 68, -122, -178, 113, -93, 175, -94, -62, 46, 292, 69, -82, 84, -227, -19, -148, -129, -114, 10, 39, -76, 20, -33, -43, 175, -157, -65, -144, 74, 165, 144, 4, 75, 88, 56, -159, 82, 52, -202, -141, 137, -100, -45, 127, -155, -99, -127, -273, 21, 33, -17, -61, 61, 114, 58, -122, -61, -57, -168, -335, -283, -92, -190, -19, -90, -38, 199, 112, -61, 16, 108, 153, 166, -31, 113, -353, -69, -42, 43, 105, -47, -67, 195, 190, -113, 109, 245, 167, 126, 111, -168, -273, -99, 206, -75, -109, -80, 24, 93, -90, 78, 44, -89, -153, 173, 141, 10, -31, 166, -229, -31, 86, 36, -43, 162, 163, 98, 94, 93, 146, 130, 129, -377, -115, 77, -53, -35, -121, 129, -44, 74, -98, 86, 138, -33, 84, 104, -20, -236, 24, -34, -96, -208, -63, -107, 111, 114, -74, -162, 46, -163, 10, -141, -88, -41, 44, -39, -280, 52, -148, 6, -94, 95, -121, 145, 227, -120, -83, 76]
3935G6J12k61J20P9k1j19m6j20J68N7j6n1O1j07J69Q8j19J06K3q9k07P1k10K83
3959D7J7o1R2p6q7L94m54n1K89K1j91J23J3j11L76k31K4P0p0r0Mp2L44k53k11
3984a44MK65m71K89K1o8N6O4K17k45j82j22M79j52K20j05k77k8J46K59j90o3j63
4007a90K06m9O0j50J06q4J07j74J7N3K38m5o6K18m05J28p2Q5k4J69n45O83k17
4030D9l43L74l6L0k75L55j87p8K60q1j84J34j28K13l44L3K99j59J6L5O2p0J70
4053A45n2k79K20k9k00K17j3R0j24o4J15k07J17k5J56j94P2p9L01k13j1R1j14
4076h0QKJ70L0j31l22L38k79K21o8J70J20j88J18k29J74k22j59M17l2K1pp3q8
4100h9J96n3l44L31j12J67p5j32J81j1M9J26j64j26j6j9M6J84n6L3j75q6J54m6
$$ y = [76, 188, -73, 47, 126, 105, -14, -60, -180, -12, 45, 29, -22, 39, -68, 101, 189, 70, 176, 199, 110, -97, -26, -236, 47, 64, 3, 95, 19, -68, 326, -128, -179, 110, 131, -60, 63, 76, -35, 341, 110, 134, 204, 134, 44, 48, -24, 320, 67, -144, -140, 125, -346, -57, -36, -104, -48, 16, 233, -12, -194, -316, 163, 11, 231, 126, -151, -179, -33, 226, 36, -27, -190, 16, -33, 27, -123, -17, -101, 6, -168, -151, -98, 140, 95, 29, 247, -158, -30, -102, -17, -41, 128, -417, 266, 49, -294, 80, 44, 74, -201, 154, -33, -111, 149, 68, -116, 18, -110, 103, -241, -208, 91, -68, -52, -17, 45, -25, 145, 93, -186, 34, 5, -195, 22, 9, 99, -25, -89, 26, -181, -64, -89, 67, -127, -55, -134, 167, -46, -57, 34, -80, -72, -70, 100, 130, -1, -323, 15, -264, -43, -111, 59, 179, -9, 109, -120, 54, -168, -327, 90, 58, 79, 72, -1, -89, 107, 54, -290, 41, -71, 96, 21, -111, 70, 59, 108, 234, 70, -56, -72, -91, -45, 139, 83, 116, -59, -145, 9, -37]
4124c7Q4J3k31K1J55L7o2K64j45j61J00K36j53k5j83O7m1J72l25J97P9n9k03L44
4148A44m5l59L12j79M2N0J20K48k78j69J72k15L17j97J37k15J09JR4p2k2r5J61
4171F1k46M09j67n0K6k4m1J80j82k7j19K7j4K27o8p2j37K39l5J75k77Q8J47k94
4195a74M3M18m1l20L2K7O9l0R8l81J69O9j19K23k96L38k53Q4J32PQ1m3j74q8%
4220a29L97k4k93Q7pm7j88K66n0J57j64J3J20k60K08ml6j03qM5J98j73Nm6j33
4245a69m0J42O0jO8j2k00R5J32k12L89k82K50j52j26L19l72K62p8j51PK14p1l39
4269b67K53o3j45J75N5J6%j79p3K87l8J03j03j5j6j54K89J25k25J55j10j10oq5
4293a31J0MN08n36J85kn9R5o8L4m8J56l04rQ5R9q2j07J06k7J4J15J1r4n0r4L92
$$ y = [-37, 47, 60, -171, -150, 5, 42, -20, 244, 99, -62, 38, 274, 121, 96, -87, -20, -61, 111, -214, -17, 62, 3, -200, 144, 99, -260, 52, -127, -85, -35, 85, 333, 55, -114, 58, -157, 160, -37, 100, -115, -6, -5, 89, 17, -5, -100, 61, -185, 224, 57, 7, 33, 9, -32, 148, -34, -61, -180, -153, -167, 60, -8, -80, -217, 22, -13, 162, -115, -27, 120, -174, -131, 287, 246, -74, -42, -15, 54, 24, 122, -259, -90, -21, -140, 83, -213, 125, -128, -44, 88, 95, 176, 133, -41, -129, -129, 268, 244, -49, 38, 31, -16, -204, 62, 12, 169, 5, 18, 138, -122, 86, 82, 46, -57, -65, -20, 178, 5, 10, -36, -169, -209, -67, -7, -8, 60, 48, -152, -57, 75, -137, 252, -30, 220, 68, -58, 261, -111, 151, 73, -78, -71, 143, 72, -267, -14, -77, -222, -47, 8, 24, 24, -155, -228, 59, 21, 124, 21, 6, -10, -164, 125, 250, 25, 180, 70, -40, -46, -131, -121, -117, 391, -145, 40, 38, -21, 74, 6, 40, -8, 148, -156, -165, -80, 19, -63, -170, -64, -91, -77, 38, 49, -45, -95, -189, 203]
4320B03k18J18j70n3P9K31l39J56j49L56k75k06M61k70J12R4q2j44J35J27j32
4341C4p5J20m7j39K33L4p9r5Lj03K7j47M44k5j91J4l5j7J18k52j08J52K29N3k47
4366i9j08j58M60N1j48p5j24K59m8K55j36j27n8p3J87K85m11O0R7k62L17k11M1
4389b6K91l80N0k8pJ10J31j0L9j02q0j89J41j29N8J50j27n6J62j08Q1J39j13K4
4413B1l6J26n3j31k56L94j66n0J57J72n9n3j03j2j19K40lj15K64j81P2m05O46
4436C50k11k98J10N6j81K0J55Q0p1Q9r8p5J06M3Q3l39R2M2L24k99K0K9j34J51
4460D4R9l10J19K29k82J26K12l30ol0R4pm0J80n0m3j70J75Q5j1j63n2p0K58q0
4485b3L8j96M53j75M1m9j72J89J64j43O8Rj89j63j13L39q5k7J0M2K56j83L3J01
$$ y = [203, -15, 103, -67, -120, -41, 190, -149, 7, -142, 214, -61, -267, 194, -76, 36, 130, 48, -96, 39, 166, 34, -41, 79, 32, -107, 126, 160, 81, -14, -11, -114, -87, -234, 210, 185, -6, 8, -27, -44, 74, -178, -286, -134, 95, 148, -99, -207, -365, 95, 146, -2, -77, -201, 58, 10, 265, 129, 2, -56, -129, 58, 343, -68, -8, 89, -173, 144, -67, -26, 265, -115, -65, -93, -100, 10, 141, 131, 170, 68, -12, -201, -60, -189, -131, 19, -108, -164, -2, -110, -29, 110, -3, 21, -15, 111, 58, -73, -329, 65, -101, -151, 6, 178, 119, 66, -37, -49, -168, 72, 69, -46, 218, 37, 109, -296, 350, 139, -159, -49, 7, -174, -154, 1, 81, 10, 99, 1, -74, 32, 75, 158, -181, -89, -47, 277, -22, -2, 27, -107, 44, 143, -167, -48, 181, -101, 25, 237, -93, -99, -129, -35, -42, -82, 98, 48, 5, -165, 10, 95, 84, -79, -131, -201, 57, -23, 15, -181, 272, 97, 138, 89, -83, 106, 270, 127, 195, 204, 15, -148, -261, 78, -7, -34, -24, 18, 274, 91, 124, 225]
4509B25o7l65j12M02J34J32l59R9j0j42J25L4M4j66J44k94J76J55k25J28p6J03
4531H5m5J75k44J32o5l9J78j16j16J18k5k05J86L0Kn6j55O0Q5K12k63Q0j33N5
4555f4o4l3K39k20j71K87l6K82j18j69l6N4P3j70J35J89k89O3J49k60O6J6j48
4578b25R1J01J59l84o5K66K05j55j99R4J7Q8M5k20K06N1j5j70p4K40K70m21j5
4601a10J62k51R6R8n3J63L3m5p6K26o9k78J80j51K44j61j13LN5m2J29J33j79R6
4625I0l92N31j13j60J48Jk50L2J09K38J02n12J96j80R8NK8J95n5k86R1J5Q4j0
4649Ej91K78J1Q4m4j85J16o7l33K22M11l74j14K59N5p6P3l41K11M7O5p0J0q9k81
4674c18K46p2J84Nk31L66j90k0j0J27J72k82r4J88j09K15j61m5J00Qp0j68L51
$$ y = [225, 158, -207, -319, 83, 217, 349, -10, 89, 79, -63, 62, 96, 140, -26, 118, -176, 0, 155, -70, 58, -18, 85, 40, 215, -29, 103, 38, -1, 177, 61, -55, 63, 38, -167, 19, 49, 51, -5, -160, -100, -15, 197, -66, 14, -119, -64, -128, -161, 78, -142, -313, -26, -62, 220, 102, -67, -103, -49, 24, -146, -11, 178, -111, -48, 101, -159, -93, -77, -225, -134, -33, 126, -258, -323, -57, 148, -7, -206, -112, -95, -7, 38, -182, 24, 75, 60, -110, -184, 56, 326, -95, -110, 52, -199, -103, -5, -58, 105, 138, 93, 17, 243, 174, -104, 76, -75, 169, 8, -105, -102, -47, -89, 40, 173, -6, 90, -302, 229, 116, -44, 104, 105, -145, -113, -4, 234, 336, -176, 20, -160, -62, -57, -29, 166, 111, -175, -84, -69, 15, 5, -186, 92, 103, 187, 143, -42, 74, 7, -326, -104, 307, -67, -181, 78, 133, 57, 130, -211, 0, 47, 112, 42, 52, -37, -318, -72, -144, 40, 45, -186, 180, -10, -30, -40, 87, 259, -23, -117, 71, -38, 177, 16, -29, 71, 79, 9, -159, 192]
4697A92k46J70k90K65l3j01J82j76Q9J38l32P8m1J56Q4r2n8j30R1k8K78j5j33
4720D8Rj59L0LL89m64R7K30k94K58k42jP2j39K13J17o9k63J08O9k46L23j12n4
4744g7q4K20J33k36J86L6n1j65nJ30j71R5j06j65K29m4o5J45j51K6J88J12j99
4767a9K12l18J32m8j44J83r4r4J17l0K65j83K17Qm89L30O7N0j83k4q9k9j3J06
4791g0j0J00j4j29L01j86J56l31Q9q4J92j2k01K62j03o3R7K35k61J35O9q5O4p7
4815G4K9k18l5J09J62j01K72n75L33j80j54M12j34mj18K21mj65O7o9K41l44M4
4838a37M3J32J91m26K35O1j1m5k84K74P5k57L26j20K0k43K57k3o1j77M31k70r
4861a8J32p2j17m5K5Q0L5j32K8j86N00j06k21K08o8p9P0p0m5m6J45J56k73j40
$$ y = [192, -54, 116, -174, 91, 58, -43, 139, -37, 52, 190, -142, -64, -105, 51, 135, 43, -15, -145, -54, -82, 196, 181, 48, 57, -102, -72, -69, 320, -144, -47, 183, -111, 147, -95, -96, -24, -163, 50, 167, 98, -165, -57, 12, -234, 89, -23, -77, -161, 59, 192, -44, 142, 178, 127, -38, -43, 87, -84, 11, -95, -260, -31, -75, -140, 5, -146, -120, 68, 180, -19, 193, -125, 7, -41, -185, -2, -96, -190, -73, -103, 162, -21, 196, 204, -285, 45, 112, 162, -21, -45, -134, -163, -176, -70, -80, 20, 6, -123, 178, -8, 148, -183, -94, -178, 14, 2, -199, 63, -40, -103, -6, 229, -32, 103, 172, 87, 151, 74, 103, -115, -150, -41, 121, 20, 292, -283, 50, -130, -284, 128, -6, -10, -128, 93, 89, -76, -9, -78, 163, -181, -137, -94, 38, 229, -197, 38, 99, 88, 43, -241, 33, 108, -149, 177, 57, 77, -166, 91, 68, 7, -170, 261, -9, -18, 114, 42, -75, -120, -95, -15, 20, -112, -84, -270, 230, 124, -97, 111, 43, -36, 34, -36, -81, -127, 18, 174, -99, -239]
4885b39M2J35K56k26k47L11j66K57o4j52J31j97P2j3M1O0m5J34j83J87k10J66
4907E0k46K46l6q4j06K95j28l8rK45k55K1K30j68j1k9j65J72N5q3K57n3l78m9
4931b67R0J53J03J0n5n7K11m95O30m09J71r3j71M55l65K42m7k9l55J85J21j98
4953a70O9O7J79j62k1K33q0q6m0k51K94j34Qj03K66k61K80L1j71j1L6K23k8q5
4977H3j38Q2j72R3K8M8k17L50k27J81q0L3r9K78l62J22k29J19L80l70p2J41mJ50
5001A18k72K69j37l8j0J33n8K6J2P4k53J95j69j0L13k94J17K4LK0O3n4j9r3J4
5026b6j3L4j3J11k11J36R5j14j0J7J97k33j76J57K13l07k3K21m4J48j86n4Q1L0
5050C0j34K24r8j66M38k56j43J36J2j47J62n8K27l11j34L00k21N1J12J51j29K3
$$ y = [-239, -197, -62, 194, -32, -279, 32, -134, 123, 59, -93, 38, -159, -87, -100, -59, 1, -44, 90, -93, 94, -116, 50, -196, 50, 14, -70, -176, 119, -9, -47, -56, 189, -66, -45, 185, 17, 6, -23, -188, -16, 39, -44, 213, 160, -218, -267, -177, -24, 79, 89, 34, -23, 188, -307, 323, -86, 85, -8, -179, 276, -89, 153, 106, 77, -278, -93, 28, -170, -101, -34, 145, -17, -38, 195, 115, 29, -11, -262, 32, -102, -94, -197, 69, -192, 88, 119, -52, -63, -27, 196, 168, 83, -55, 27, -145, -52, -24, 24, -193, 157, -70, 111, 31, 64, -35, 243, -119, 3, -226, -107, 273, -97, -169, -28, -32, 118, -154, 115, -22, -60, -70, 63, 5, 31, 43, 117, -136, 59, -110, -120, 193, -101, 16, 40, 43, 63, 126, 72, 53, -40, -26, -39, -5, -18, 93, -118, 18, 113, -1, -11, 6, 203, -30, -206, -49, 164, -143, -166, 55, 11, 159, -27, -81, 0, 30, -104, 120, 22, -144, 294, 38, -105, 31, 43, -104, 58, 0, 227, -84, -218, 82, -139, -88, 24, 175, 46, 69]
5072F9k23J41Kl04K81K26k85m1N0k1L36k26R0Lk62J4R6L41m38L44q2k23J77n1
5096A4M9k54K08k0j42M24l39J1m3o9L0K1oN7M4l49L47J14nj91p2p3J36K20N6p6
5122I2l64L89k5J15l06J21j03K00k14M1lj8K04j49K0j78M2J93j49N8J13j2l2o2
5146b7J84r9J02P5m88N37l62J42J35j20j46k0J40j27m0J29J22k23K01j99K36j11
5168D1l1J31k58P7J67j58J29k8N1j88m2J65J67j93m6M4j76l7K06j1p7k40K32K5
5192e0Q0j20K24J4j64j0J17j62K72k17J41n1j92J46j30L99k46j66J41k4n2R8p3
5215b5k1j94K09L7j08R2J49j79q7M7l0P2J37j9k45L18m44K83j05K62j16k39J02
5238a04j9J09q8J75j67j97K27J04k80L07j32M0m7L6J60k86K82p4j08L2J04r5Q4
$$ y = [69, -154, -13, -11, -315, -34, 192, -93, -134, -84, -105, 231, 5, 95, 98, -164, -150, -54, 287, -151, 193, 111, -112, 65, 14, 63, -191, 17, -3, -145, 279, -60, -49, -92, -161, -131, -110, -116, -59, -15, -364, -17, 97, 92, -99, -171, -244, -108, 112, 168, 92, -272, 117, 92, 207, -99, 22, -81, 119, -95, -54, -57, -75, 129, -20, 0, -178, -136, 57, -92, -34, 79, 67, 35, -27, 157, 58, 160, 235, -253, 284, -78, 64, 199, 79, -67, -87, 53, -74, -114, 15, 137, -86, 115, -84, 152, 41, 10, 141, -117, -40, 127, -31, 98, 70, 121, -67, -109, 56, 223, 30, -16, 28, -148, -185, 21, 10, -67, -307, -75, -50, 30, -90, 134, 148, -16, -26, 91, -71, 201, -16, 125, 74, -118, 28, -102, 297, 51, -115, 26, 2, -50, 48, -25, -46, -240, -31, 6, -102, -10, 139, -40, -127, -80, -110, -38, 99, 80, -165, 153, -291, -8, -113, 149, 33, -206, -104, -123, -14, -102, 73, -94, -291, -64, 40, -240, 67, -65, -25, -72, -36, 124, -162, 120, 46, -62, -30, 74, -21, 63]
5261F3l88L39K2j36m0J91R1j73J2J1j8q9o8K51j42M0N1l32L48j10j80L54r2J14
5285A19nJ27j32j37Lk1J3%K14j30j08P2J9q3K68l12j76K91m5P7k7k6k37L20k26
5310a42l1J61j8L4K0p5R4k53N7k3J62O4K26k71j31M6j57PK88n7k66K57N3J36N
5335A86q8K7j15q3K00j64R3k19o8L6K09o0N9m5l1Q6j05J70j82J80j76K72l59J94
5359A7L4r6L6N5n4l16L36J8K2l5%j53Pk7J40m5j2m4O4K58k4n4q5J31j75K4j69
5386a47J66O6k61P2J18q9J47rj71K00Mj39k09K05J16j09J79j1k16j13L41o0j13
5409c3L9r0K97k92ML6M6K1K13l69L18j35j76K15l5j68K80j07o3p2k3O5J08k9j94
5434a44R1o3J54l9M6j1j0RO6j76J66k46J15J3P7p0j87O10l86p0o6M6k85O27l88
$$ y = [63, -325, 14, 36, -100, -140, 51, 142, -31, -19, -8, -26, -115, -183, 68, -74, -34, 17, -315, 33, -77, -257, 97, 5, 119, 114, 241, 109, -28, -25, -46, -33, -33, 181, 51, -57, 15, 34, -49, 219, -93, -269, 22, -23, 54, 27, 1, -236, 84, -142, -173, -12, -30, 4, 24, -51, 43, -210, -153, -176, -14, 50, 276, 5, -126, -80, -237, -230, 58, 1, -265, -8, 45, 181, 186, 98, 125, 10, -73, 127, -37, 56, -163, -231, -195, 14, -46, 13, -32, -63, 23, -82, 88, -94, 86, -90, 182, -177, 17, 51, -45, -9, 46, -8, -324, 12, 30, 52, 17, 17, -136, -129, -156, -16, -61, -73, -117, -53, 205, 181, 127, 42, 173, -2, 22, -147, 19, 85, -176, -104, 14, -75, 72, 63, -108, 92, 96, -43, -252, -47, 69, -40, 139, 128, -88, -201, 140, 80, -33, 6, -84, 213, -79, -75, -39, 7, 28, 241, -128, 190, 55, -121, 94, 59, -109, 171, 64, 1, -71, -94, -29, 79, 50, -144, -53, -116, 38, -1, 45, 34, 24, 33, 99, -77, 89, -157, -42, -29, 48, -22, -209, 401, 15, -55, -121, -75, -360, 267, -121]
5459a21K64j46J45L4l00K68k18K68j02j46K40l37R4k8J07n9k11L81k10P4N2J28
5481A77j56l8m3K4m7J12j68P4J17j00J01j29J25p4K0m1L55j43r4O4o5l7K0l3j9
5506BMj35K12j42J20Lj63n9l3K67R7o3j03J4l9Q6k55O5L41j99k7J27j20j72K68
5531I6p7N9m1K1j46M5K04l03p7K61j3k09K3K41k91K49j47O6R2j3N0k53J83Q2K5
5556A27k26K30o6j34j4K5lO0K03j30K60m81K54p4J49m20J00J47j72M4R7R1j44
5579g7K67k16J68j46%l0P4j57J50L3j20j35J43J9J69k86J62J5oM5n7j31n1K99
5603A32R2k19J8l8P2j36K47q8l58J81Q7J22l5n5p9p8J17j59J91r7J29O1j7j72
$$ y = [-121, 143, -3, 142, 176, -124, 144, -74, 194, 92, -54, 186, -151, -57, -85, 22, -37, -248, 133, -77, -3, 49, 177, 21, -17, -60, -36, -83, 29, -139, -65, 52, -48, 53, -76, 49, -25, -5, -46, 309, 166, 72, 136, 71, 34, 54, 21, 2, 6, -129, 83, -59, 61, 64, -99, -158, -191, 76, 173, 110, 7, 21, -18, 68, -187, -122, 219, 20, -7, 120, 0, -172, 96, 19, 78, 37, 58, -88, -43, 161, -142, -219, 42, 29, -180, -157, 84, -207, 42, -105, -39, 53, 40, 90, -163, 20, 102, 127, -99, 131, 65, -69, -83, -58, -61, -1, 202, 72, 332, -149, 105, 31, 180, -240, -140, 7, -165, -121, -24, 67, -77, 190, -26, 142, -4, -4, -34, 40, -117, 33, 66, -54, -189, -46, -27, 142, -144, 18, 33, 27, 72, 15, -116, -167, 132, 224, 5, 23, -15, 57, -79, 168, 80, -278, -97, -10, 112, 77, 22, -57, -135, -18, -177, 14, -83, 46, 107, 90, -82]
$$ [...]
8191h5
##END NTUPLES=NMR FID
##END=
