##TITLE=1H_PR193
 D2O, 8 sc, 
 30.7.2020
##JCAMPDX= 6.0         $$ Bruker NMR JCAMP-DX V2.0
##DATA TYPE= NMR FID
##DATA CLASS= NTUPLES
##ORIGIN= UXNMR, Bruker Analytische Messtechnik GmbH
##OWNER= root
$$ XWIN-NMR		Version 3.5
$$ Thu Jul 30 12:34:46 2020 Russian Standard Time (UT+4h)  she@DPX200
##.OBSERVE FREQUENCY= 200.1315
##.OBSERVE NUCLEUS= ^1H
##.DELAY= (6, 6)
##.ACQUISITION MODE= SIMULTANEOUS
##.ACQUISITION SCHEME= undefined
##.AVERAGES= 8
##.DIGITISER RES= 18
##SPECTROMETER/DATA SYSTEM= spect
##.PULSE SEQUENCE= zg30
##.SOLVENT NAME= D2O
##.SHIFT REFERENCE= (INTERNAL, D2O, 0, 15.7039)
##AUDIT TRAIL= $$ (NUMBER, WHEN, WHO, WHERE, WHAT)
$$ ##TITLE= Audit trail, XWIN-NMR		Version 3.5
$$ ##JCAMPDX= 5.01
$$ ##ORIGIN= Bruker BioSpin GmbH
$$ ##OWNER= she
$$ F:/spectra/data/she/nmr/H-F/1/audita.txt
$$ ##AUDIT TRAIL=  $$ (NUMBER, WHEN, WHO, WHERE, WHAT)
(   1,<2020-07-30 12:33:47.07 +0400>,<she>,<DPX200>,
      <created by zg, POWCHK disabled, PULCHK disabled
       configuration hash MD5:
       00 E9 B6 7A A2 85 ED C7 34 08 36 98 17 FE 4E 26
       data hash MD5: 16K
       4A 5C 5C 45 67 A4 C8 F6 9D 4D 00 B1 A7 EA 05 FF>)
$$ ##END=
$$ 
$$ hash MD5
$$ 71 7C 45 BA 2A 2C 26 FB 44 29 65 A8 57 96 B6 C5
##$RELAX= 
##$RELAX= 
##$RELAX= 
##$RELAX= 
##$RELAX= 
##$RELAX= 
$$ Bruker specific parameters
$$ --------------------------
##$DU= <F:/spectra>
##$EXPNO= 1
##$NAME= <H-F>
##$PROCNO= 1
##$TYPE= <nmr>
##$USER= <she>
##$AMP= (0..31)
100 100 100 100 100 100 100 100 100 100 100 100 100 100 100 100 100 100 
100 100 100 100 100 100 100 100 100 100 100 100 100 100 
##$AQSEQ= 0
##$AQ_mod= 1
##$AUNM= <au_zg>
##$AUTOPOS= <>
##$BF1= 200.13
##$BF2= 200.13
##$BF3= 200.13
##$BF4= 200.13
##$BF5= 200.13
##$BF6= 200.13
##$BF7= 200.13
##$BF8= 200.13
##$BYTORDA= 1
##$CFDGTYP= 0
##$CFRGTYP= 5
##$CHEMSTR= <none>
##$CNST= (0..31)
1 1 145 1 1 1 1 1 1 1 1 1 1 1 1 1 1 1 1 1 1 1 1 1 1 1 1 1 1 1 1 1 
##$CPDPRG= <>
##$CPDPRG1= <>
##$CPDPRG2= <>
##$CPDPRG3= <>
##$CPDPRG4= <mlev>
##$CPDPRG5= <mlev>
##$CPDPRG6= <mlev>
##$CPDPRG7= <mlev>
##$CPDPRG8= <mlev>
##$CPDPRGB= <>
##$CPDPRGT= <>
##$D= (0..31)
0 1.2 0 0 0 0 0 0 0 0.06 0 0.03 0 0 0 0 0.0002 0 0 0 0 0 0 0 0 0 0 0 0 
0 0 0 
##$DATE= 1596098026
##$DBL= (0..7)
120 120 120 120 120 120 120 120 
##$DBP= (0..7)
150 150 150 150 150 150 150 150 
##$DBP07= 0
##$DBPNAM0= <>
##$DBPNAM1= <>
##$DBPNAM2= <>
##$DBPNAM3= <>
##$DBPNAM4= <>
##$DBPNAM5= <>
##$DBPNAM6= <>
##$DBPNAM7= <>
##$DBPOAL= (0..7)
0.5 0.5 0.5 0.5 0.5 0.5 0.5 0.5 
##$DBPOFFS= (0..7)
0 0 0 0 0 0 0 0 
##$DE= 6
##$DECBNUC= <off>
##$DECIM= 24
##$DECNUC= <off>
##$DECSTAT= 4
##$DIGMOD= 1
##$DIGTYP= 9
##$DL= (0..7)
0 120 120 120 120 120 120 120 
##$DP= (0..7)
150 150 150 150 150 150 150 150 
##$DP07= 0
##$DPNAME0= <>
##$DPNAME1= <>
##$DPNAME2= <>
##$DPNAME3= <>
##$DPNAME4= <>
##$DPNAME5= <>
##$DPNAME6= <>
##$DPNAME7= <>
##$DPOAL= (0..7)
0.5 0.5 0.5 0.5 0.5 0.5 0.5 0.5 
##$DPOFFS= (0..7)
0 0 0 0 0 0 0 0 
##$DQDMODE= 0
##$DR= 18
##$DS= 0
##$DSLIST= <SSSSSSSSSSSSSSS>
##$DSPFIRM= 0
$$ [...]
##$SUBNAM2= <"">
##$SUBNAM3= <"">
##$SUBNAM4= <"">
##$SUBNAM5= <"">
##$SUBNAM6= <"">
##$SUBNAM7= <"">
##$SUBNAM8= <"">
##$SUBNAM9= <"">
##$SW= 24.9337058887773
##$SWIBOX= (0..15)
0 0 2 0 0 0 0 0 0 0 0 0 0 0 0 0 
##$SW_h= 4990.01996007984
##$TD= 16384
##$TD0= 1
##$TE= 0
##$TE2= 300
##$TE3= 300
##$TEG= 300
##$TL= (0..7)
0 120 120 120 120 120 120 120 
##$TP= (0..7)
150 150 150 150 150 150 150 150 
##$TP07= 0
##$TPNAME0= <>
##$TPNAME1= <>
##$TPNAME2= <>
##$TPNAME3= <>
##$TPNAME4= <>
##$TPNAME5= <>
##$TPNAME6= <>
##$TPNAME7= <>
##$TPOAL= (0..7)
0.5 0.5 0.5 0.5 0.5 0.5 0.5 0.5 
##$TPOFFS= (0..7)
0 0 0 0 0 0 0 0 
##$TUNHIN= 0
##$TUNHOUT= 0
##$TUNXOUT= 0
##$USERA1= <user>
##$USERA2= <user>
##$USERA3= <user>
##$USERA4= <user>
##$USERA5= <user>
##$V9= 5
##$VALIST= <valist>
##$VCLIST= <CCCCCCCCCCCCCCC>
##$VD= 0
##$VDLIST= <DDDDDDDDDDDDDDD>
##$VPLIST= <PPPPPPPPPPPPPPP>
##$VTLIST= <TTTTTTTTTTTTTTT>
##$WBST= 1024
##$WBSW= 4
##$XGAIN= (0..3)
0 0 0 0 
##$XL= 0
##$YL= 0
##$YMAX_a= 152064
##$YMIN_a= -125096
##$ZGOPTNS= <>
##$ZL1= 120
##$ZL2= 120
##$ZL3= 120
##$ZL4= 120
##$ABSF1= 10
##$ABSF2= 0
##$ABSG= 5
##$ABSL= 3
##$ALPHA= 0
##$AQORDER= 0
##$ASSFAC= 0
##$ASSFACI= 0
##$ASSFACX= 0
##$ASSWID= 0
##$AUNMP= <proc_1d>
##$AZFE= 0.1
##$AZFW= 0.1
##$BCFW= 1
##$BC_mod= 2
##$BYTORDP= 1
##$COROFFS= 0
##$CY= 11.3945322036743
##$DATMOD= 1
##$DC= 2
##$DFILT= <>
##$DTYPP= 0
##$F1P= 16.9975609425685
##$F2P= -3.02152046262296
##$FCOR= 0.5
##$FTSIZE= 0
##$FT_mod= 4
##$GAMMA= 1
##$GB= 0.15
##$INTBC= 1
##$INTSCL= 1
##$ISEN= 128
##$LB= 0.24
##$LEV0= 0
##$LPBIN= 0
##$MAXI= 10000
##$MC2= 0
##$MEAN= 0
##$ME_mod= 0
##$MI= 1.114404
##$NCOEF= 0
##$NC_proc= 0
##$NLEV= 6
##$NOISF1= 3.799351
##$NOISF2= 2.8
##$NSP= 1
##$NTH_PI= 0
##$NZP= 0
##$OFFSET= 15.70392
##$PC= 1
##$PHC0= -9804.752
##$PHC1= 22.20091
##$PH_mod= 1
##$PKNL= yes
##$PPARMOD= 0
##$PSCAL= 0
##$PSIGN= 0
##$REVERSE= no
##$SF= 200.130013532006
##$SI= 16384
##$SIGF1= 3
##$SIGF2= 2
##$SINO= 400
##$SIOLD= 16384
##$SREGLST= <1H.CDCl3>
##$SSB= 0
##$STSI= 0
##$STSR= 0
##$SW_p= 3612.71676300578
##$SYMM= 0
##$S_DEV= 0
##$TDeff= 0
##$TDoff= 0
##$TI= <>
##$TILT= no
##$TM1= 0
##$TM2= 0
##$TOPLEV= 0
##$USERP1= <user>
##$USERP2= <user>
##$USERP3= <user>
##$USERP4= <user>
##$USERP5= <user>
##$WDW= 1
##$XDIM= 8192
##$YMAX_p= 0
##$YMIN_p= 0
$$ End of Bruker specific parameters
$$ ---------------------------------
##NTUPLES= NMR FID
##VAR_NAME=  TIME,          FID/REAL,        FID/IMAG
##SYMBOL=    X,             R,               I
##VAR_TYPE=  INDEPENDENT,   DEPENDENT,       DEPENDENT
##VAR_FORM=  AFFN,          ASDF,            ASDF
##VAR_DIM=   8192,          8192,            8192
##UNITS=     SECONDS,       ARBITRARY UNITS, ARBITRARY UNITS
##FACTOR=    0.0002004,     1,               1
##FIRST=     0,             0,               0
##LAST=      1.6414764,     0,               0
##MIN=       0,             -125096,         0
##MAX=       1.6414764,     152064,          0
$$ Real data points
##PAGE= N=1
##DATA TABLE= (X++(R..R)), XYDATA
$$ [...]
2066E78q94p43k94L88O84Q16O88r2o45j227k90k37O49O83N61O05j67l58j066o39
2086a000j77L86N05J066O17j85p95j066n64L7P04R11P69k59k39n17o18o14j24
2105a163N62N55P36J80r5l96n03p40k27M47Q83P63K37k85o94q39l56j30Q65N62
2125C62M10O58r00J77j313k16l99M54P41R90K57K00j126q39l09k26L85Q90Q46
2144A042J96m89p66m23l60J57J41P64M08K81j21m28j028l65l13O50P08J078J53
2163A285m71q77o63n44L85N93O02N91N7l76n22n71k99O2J30P84O30K32k9p80o26
2184d07p79K56O49Q64N36j67k64p90m18k67J7O16L15M63J63j09o66m90j06n06
2204a090M10Q22Q18J30k67r29m68q41M31R00N99M94q8o63j26r34m5J04K10Q43
$$ y = [578, -316, -1059, -1353, -965, -281, 535, 1223, 1131, 486, -741, -1031, -1268, -619, 64, 625, 1230, 1063, 705, -361, -1000, -1177, -791, -286, 780, 1397, 1212, 417, -649, -1213, -1176, -472, 439, 1208, 949, 710, 193, -425, -1039, -1163, -601, -46, 690, 870, 775, 379, -124, -864, -1091, -644, 239, 1002, 1239, 954, 260, -579, -935, -1065, -200, 362, 772, 1430, 530, 707, -606, -822, -1221, -767, -26, 964, 1221, 1421, 295, -544, -853, -1079, -694, 196, 1042, 1238, 749, -17, -440, -800, -643, -502, 262, 670, 951, 830, 402, -626, -991, -1304, -654, 54, 1132, 1285, 814, -63, -726, -1270, -885, -292, 310, 901, 958, 582, 60, -511, -810, -748, -618, 166, 796, 1028, 999, 219, -407, -1186, -930, -281, 583, 1119, 952, 688, -102, -520, -787, -770, -154, 161, 624, 787, 678, 12, -478, -584, -1090, -680, 142, 960, 1090, 823, -106, -574, -1415, -984, -84, 515, 1009, 921, 258, 132, -802, -847, -743, -533, 310]
2224C10K92L36k33q25p46k03J86O22P36O10j99m88o89n66j73L12M95N93L73Kk13
2245E32o59l95l55r1P48M96N00L95m65n98p44l45L13N10O70P55n48k01m62q12
2265g56q4Q2M37Q70O00L5o68o86m99l84L36M18Q86M77m06j46j080M0n00L44M60
2286b24O59M37j15k87o07n73l9K86J89O06M98R3m21q86k40m43K56P12O90L7K53
2307H81p73k99m66j49K22M40M98M13k13l48J9q61m29J16Q24M88O23N0o53p59k36
2328f12o0J14N05P56nk04m35j70n43l6PM65Q30L85k01k72r35m68k18M44N90P54
2350F91M9Q4o43o19m8k48J18L58P03M23k0n46n15o28k07L85O98L08N79q2o67n05
2372c32l66k56O47M83O72J18k70l48m07l84k17M18J79L52O55j53m64l13q60j43
$$ y = [310, 602, 938, 705, -120, -866, -1069, -883, -261, 475, 1085, 886, 398, -291, -857, -1030, -718, -223, 370, 743, 745, 532, -127, -522, -877, -968, -220, 276, 776, 1171, 706, 108, -636, -981, -668, -158, 512, 1267, 719, 518, 56, -756, -840, -758, -321, 549, 1149, 1184, 516, -170, -669, -1053, -717, -299, 587, 1064, 658, 512, -568, -528, -1028, -684, -224, 435, 872, 757, 470, -137, -710, -749, -463, -274, 332, 830, 923, 502, -384, -624, -1067, -811, -99, 591, 628, 881, 108, -191, -657, -806, -584, -144, 354, 767, 554, 206, 225, -636, -1065, -949, -125, 363, 986, 1036, 383, -376, -612, -672, -558, -53, 703, 698, 494, 59, -111, -654, -690, -683, -218, 612, 997, 796, 524, -411, -879, -1097, -653, -63, 691, 740, 824, 181, -438, -486, -734, -616, -258, 445, 868, 848, 302, -213, -841, -1048, -663, 35, 343, 922, 840, 173, -332, -698, -954, -307, 176, 848, 966, 696, 348, -59, -443, -660, -242, -63, 289, 944, 791, 327, 14, -846, -989]
2392i89L11Q83P34J92n67j50j042J35l55M48M25N78m9n7j56m83m75l55L19N46
2412a07P87J70j7n62o45m75Q9N38M45O09J03m74l94n90j60j26N52L29M37K10k64
2433D55j19o54l76K06P8O21N34l22O0j61o54q8n19N22O93K36L88l82l78n62j47
2454e69k37L38M11M02O35k22p46m80j57K18k69J010N44kk72p13m23j03J20P8O64
2475B27J26K95k42j6r61k29K56J65M70Q12L6o75l11m19j73R0N47l7P36j61j2l41
2497A83n13m32J19K72L41N44N94q65k5o77l56K70K57L06N62J84l64m91k52k60
2517f03K54J6M52L22LJ38n42m20k39k36L84R02J99k44Jm65m90p8j21P94J37O94
2539H58o71O7m13J00n44K25K31K74M36Q5l15k89n96K47r2L98L35J84J24l17p28
$$ y = [-989, -678, 205, 939, 1131, 564, 414, -628, -493, -848, -400, 25, 603, 554, 497, 341, -142, -617, -972, -653, -107, 680, 850, 833, 271, -374, -849, -760, -222, 223, 832, 935, 461, 67, -523, -683, -809, -257, 72, 509, 719, 455, 336, -318, -694, -488, -410, 211, 745, 423, 483, 322, -332, -420, -939, -417, 276, 512, 900, 518, 140, -422, -569, -806, -468, -57, 345, 980, 758, 12, -468, -625, -407, -676, 334, 878, 876, 604, -109, -532, -635, -515, -437, 227, 353, 648, 406, 390, -571, -800, -544, -379, 91, 903, 939, 264, -47, -466, -639, -549, -2, -39, 697, 536, 524, 183, -330, -762, -643, -371, -30, 514, 1108, 243, 218, -459, -815, -545, -288, 18, 580, 764, 400, -91, -343, -603, -349, -333, 119, 441, 444, 582, 40, -380, -619, -855, -471, 431, 630, 386, 387, -78, -568, -646, -767, 27, 164, 858, 187, 254, -159, -59, -603, -378, -147, 127, 563, 648, 333, 44, -552, -305, -397, 1, 336, 520, 644, 327, -401]
2560d01j04M6j35K90L62M36j6q4o24j79j0j39M14M85K14K86m07j81q66L1L34L89
2582A41L25J09L19o16n16j34j81j13P61J32L55k30J89l54p11m2L58L46K13L97
2602G48k01n30k27m64J46M3M78L41K19J5r4j83r28j08N69J54J97M56J10m74l40
2623g3o26L44jK73O03k01O6k57k75l30r7K15K67N66R9k78P0m17l97m8L23r0O76
2646D12N06j99k23o60r6j25LO02K47r4J00o45l03j3j97J06N56N68K75m27j14m54
2668a75k06j26K21L90M17j31O6p39P7j53l9J38J7O94J05l60r5j32k25k55P6N87
2690A52L35J55q6p38P1k44k38J85K65O25nk51j35k81k45K26K5R0N57j41j10j05
2712A07k18l52Q6K02M67K80Pj32l97n79J3J35L29K20M06j16k20K6l64k61m49O80
$$ y = [-401, -505, -459, -594, -304, 58, 494, 478, 394, -230, -409, -419, -558, -144, 341, 555, 841, 434, 253, -613, -582, -248, 141, 466, 575, 894, 278, -238, -372, -553, -666, 95, 227, 582, 352, 541, 187, -524, -566, -208, 138, 351, 748, 547, 17, -210, -674, -528, -485, -7, 334, 553, 568, 474, 291, -637, -745, -176, -22, 175, 631, 741, 267, -73, -699, -355, -356, -83, 520, 319, 385, 128, -147, -477, -574, -359, -92, 474, 573, 295, 365, -52, -449, -497, -174, -264, 412, 918, 719, 496, -164, -260, -385, -382, 220, 467, 373, 473, -172, -475, -488, -685, -579, -23, 545, 820, 393, 279, -175, -381, -507, -286, 104, 521, 390, 456, -283, -206, -359, -398, -260, -243, 451, 556, 196, 101, -31, -256, -511, -435, 152, 487, 642, 556, -182, -111, -355, -593, -408, -143, 482, 477, 226, 91, -190, -435, -209, -184, -94, 463, 322, 212, 107, -111, -463, -377, -175, 292, 572, 579, 447, 50, -529, -516, -381, -52, 168, 574, 458, 238, 264, -100, -361, -810, -130]
2734a30N5M78k2j89Q3n08l04L88L14o1L21j49J17k74l14k96L74r7L81N7J14Q2
2756D20j73l36m94j96O32L12M9K36Q3m79l94k02J03L79K53L88j71Ko25Q3m75M38
2778a67jN28m20N77l28l40r9Q1m22M34N01K29j37k10k76j70r9K73j20L60L11K25
2800G30p04k3o1n43M76kJ74K25O3l19m3l86j11K25J76K38L77j46k11m12k5K20
2822h2n5R8K19L20j35k18k40k60J20k58O02J45L77l36j39r1k81l06M75j34K60
2843H1L51K18k54k54l65k42J27j45Q81J06j94m5k89m69L58J7K40J88n5J43j37
2864B61o31K91k06m3K55L76J74m82m4j19k85l8O0M28K33R9O1k77p9n41J50L21
2886c6k9K45J36j71Jm18R9m45K24L36L16M49l07m5n43q1j68L76K2O62m90J02q9
$$ y = [-130, -75, 403, 381, 192, 275, -233, -537, -149, 165, 104, 425, 276, 393, 119, -195, -491, -117, -214, 167, 224, 338, 420, 247, -89, -583, -779, -147, 165, 214, 450, 533, 54, -340, -542, -439, -60, 193, 581, 410, 412, -213, -130, -605, -167, -168, 360, -60, 517, 189, -151, -250, -169, -591, -157, 344, 573, 436, 226, -50, -220, -319, -46, -166, 194, 505, 730, 26, 3, -58, -601, -125, -127, 47, 272, 335, 16, -27, -413, -524, -299, -123, 115, 492, 346, 135, -277, -302, -82, -137, -39, 180, 500, 365, 147, -93, -353, -233, -491, 111, 256, 633, 297, 158, 67, -214, -520, -45, -179, 81, 432, 650, 396, 142, -223, -465, -338, -483, 398, 504, 310, 265, -24, -493, -135, -118, 122, 310, 255, 398, 261, -370, -79, -285, -328, -73, 303, 477, -5, -49, -168, -453, -491, -431, -3, 230, 329, 390, 113, 34, -507, -357, -36, -65, 180, 316, 145, 146, -272, -173, -618, -394, -58, 258, 707, 400, 355, -188, -269, -437, -61, -39, 623, 133, 235, 146]
2909A46m75P5k01K14M67K55j40j5m20j03j33j10j1N78L49k23R5j31n01p8J10L27
2931G5L4J47O4q5j54m67K25j5J02J17J05J02J44n19m53K02J80kK83m2L81l95J69
2954A98k73j80l5J83L09k01J39J44k01n9k27j80r6O37J37l2Q4j54m47j12K61M3
2976f2J3J71K37m3m30k45K6O0J98P0K40L16k28k22j41j54l7J67J89l42M19J82
2998C84m06k88M7k1nL71N1K44o5l37L2l53o0K82K34M38k23m7m44j07R1j30M75
3021A63K29j88n3p1k39L01j71k05O5J70K56K03l44k28p3p8k09L80K94J9j40O2
3043A43j85k94J9O5O6J77K80j95Nj22j11j01J23J16K20L61j52m36K39n29M67k96
3065a40K85K21k26j38l5K3j41m19K69K96n8J97K74o7l33m04J50M2J17K02J20j03
$$ y = [146, -329, -254, -455, -241, 226, 481, 341, 326, -94, -197, -330, -440, -451, 127, 476, 253, 348, 217, -284, -362, -252, 75, 109, 256, 320, 235, 81, -386, -161, -176, -74, 43, 148, 250, 394, -125, -578, -376, -196, -198, 85, 43, 424, 29, 198, -75, -255, -290, -107, 202, 1, 140, 284, 83, 24, -203, -383, -479, 158, 295, 263, 347, 193, -254, -366, -105, -62, -49, 122, 359, 316, -114, -359, -333, -273, -75, -5, 235, 551, 323, 101, -40, -194, -231, -64, 125, -217, 202, 384, -22, -310, -263, -284, -289, 82, 133, 377, 312, -25, 7, -346, -406, -124, 110, 548, 325, 278, -166, -273, -182, -312, 163, 392, 204, 151, 80, -159, 142, -29, -234, -169, 1, 257, 460, 116, -112, -185, -263, -472, -92, 202, 221, 81, 143, -42, -336, -317, -252, -186, -9, 271, 76, 81, -41, -152, -253, -130, -14, 206, 567, 415, -21, 218, -311, 156, -140, 145, 366, 140, 2, -33, -10, -151, -570, -301, -5, -63, 134, 408, 341, 8, -396, -246, -204, -87, 115, 235, 132]
3087A32p3m6m25J85K9M63k40Q8lj49Qm03J54J68L76n7K5l8j2m76J28J15k57L36
3111B8j60M86K2k74l02k00J50K18P5J23m78P44k03k58l83L05k8K63K23P8l5l46
3133D8k53Q9m18L47j40M54K19j89m57K49L2J18l33M73N4Q0o6n18j4J65l7p6J68
3156eK31Q6j75j46n8k94K11J07K73K10l23n2m7j66j91J74j56L50J30K74k20L3
3178B46n91r0M8L19L80j5L3k39k25k45j6L18J25o5M03k51k0k92K74n71L79J03
3200HJ9m8L30k6k26j53k21K4L02P8J82k23qK6k68m3J72l7k20O64k5j90J9l34j45
3225c43K85K6k14L85o1p5m47K02q4O8n2L79m3K48j62Pjl24o3K00J71J96n2l05
3249e9Q9j05k59J44J69L9M5L10m2m18l2j65L5j8K23K57n4p0j79m3m75M50K31R0
$$ y = [132, 59, 13, -412, -227, -198, 265, 25, 113, 110, -39, -31, -434, -280, -112, 264, 207, 232, 194, 182, -294, -166, -51, -308, 28, -132, 354, 376, 102, -200, -400, -250, -32, 43, 166, -312, 432, 229, -29, -412, -107, -135, 128, 351, 429, 394, 48, -205, -116, -534, -187, -327, 127, 346, 157, -300, -51, -19, 99, -234, 239, 293, 373, 307, -211, -225, -60, -97, -173, -5, 226, 312, 137, -9, -67, -361, -150, -43, 230, 440, 117, 65, 18, -148, -339, -165, -321, 29, 159, 433, 213, 246, -345, -435, -387, -68, 312, 297, 330, 91, -134, -379, -395, -77, 48, -17, 386, 135, 115, -177, 97, -474, -95, 8, 27, -21, 309, 283, 57, -96, -317, -293, 9, 87, 269, 46, 38, 64, -204, -247, -75, -112, -332, 332, 307, 117, 136, -198, -343, -58, -32, -246, 139, 78, 3, -444, -242, -326, -258, -310, 69, 26, 274, 112, 119, 118, -206, -269, -69, 102, 298, 246, -59, 30, -75, -334, -190, -21, 18, 63, 373, 331, -87, -119, -284, -249, -267, -44, 213, 159, 89, -90, -133, -608, -158, 73, 163]
3273A63L4%j14k14K91l54K76j76J60K37k9k5k53n7j72R5j01L19J92M6m1n33K85
3296B9l47K04l04O31J31m82K22N2k21l23J55L72NK14p4l82j90J61J33m20M70k03
3318a67L10J49k27L7m17L81k00O5J83j17m0j44K36j71m51K16L14J48L55k85k51
3339g6J31m87J33K99j8R0J46m0k41K0k67J84L08k05Q6J22K5k88j33K62l35J83
3361a01q8L74NO1L9j59l74O1K12K1R3j92K06k5P8n84L1J94K05Q6J78j97j62Q2
3385D4m24q9L38J37P6M8J33l39n7j8K38k7l18L48J46p9j87K25m63J74n4J53K55
3408B60k46K11j50o8q0l58L48M4J17J80k76j11o5P5N0k48L56J62J03j83j05j35
3430a19k59L67k11M45j95J10P1j92j05j67Q7K14L05j43j68Q8k15J04l2K30l64
$$ y = [163, 197, 197, 83, -131, 160, -194, 82, -94, 66, 303, 274, 249, -4, -61, -233, -138, -239, 80, 272, 318, 277, -256, 29, -318, -114, -418, 213, 344, -138, 84, 136, -85, -408, -253, 119, 124, 338, 264, -118, -308, -147, -14, -434, 36, -167, 143, 292, 65, 102, -315, 66, -134, -69, 114, -3, -43, -187, 49, -122, -573, -357, -43, 105, 460, 175, -76, 55, -432, -299, 0, -18, 72, 218, 178, -63, -43, -310, -126, 182, -23, 63, 185, 210, -78, -211, 51, -284, -101, -189, 185, 190, 251, 290, 131, -243, -182, 30, 51, 144, -48, 158, 133, 211, -373, -342, -148, 57, 143, 321, 124, -38, 44, -380, -469, -131, 6, 82, 130, 263, -76, -133, -151, 87, 60, -258, 90, 236, 157, -30, 195, -268, -94, -148, 5, 260, 14, 225, 75, 7, -73, -431, -83, -39, 78, 258, -18, -129, -194, -119, -69, -317, 39, 201, 304, 121, 16, -119, -378, -11, -222, 223, 28, 138, 209, 17, -88, -255, -168, 46, 351, 208, 40, 128, -87, 17, -15, 215, -149]
3451a49J2L23J9j99K14l06k88J02J69K6L38j07p2J05m36K4q9K0K48J52K94j12
3473B88k17k12Q4R4j88K47K16k28K96m51l9j11k5K85O8j54J35J85m77L11k49r9
3495b41o7J05N94j81j15j10k13l6K13j43O2M89m08J50j01m1j40oK04J23qP9K44
3518D53n15j51l8NJ59K30k62P7L46l44k04M5k25L67L34j59K7j78J36m44J07M5
3540a89N26j76L7L37n90j01K3o3l9J92M72M9k47k40o8j36m4J1K57j87K90n1j34
3563g1K09l61k8O9J93J52j2K09m32j99L73n53M36L64m00J33k45K91l11L4L1N0
3585f8J38n1K23l07L49l44k73K62j20j3M04m5L23l97k36j50q1L07R9L07l22K02
3607B07l01o6k04k14O42l5j27J98j77K79n60J00j75K92J85J32J19j00p5j89K98
$$ y = [-149, -137, 186, 205, 6, 220, -86, -374, -272, -103, -77, 261, 154, 82, 187, -249, -225, -314, -294, -46, 106, 400, 288, 71, -141, -57, 37, -151, 96, 312, 84, 380, -71, -110, -221, -246, 39, 107, -47, 88, 273, -204, 107, -142, -241, -308, -203, 391, 210, 95, -15, -228, -264, -51, -194, -132, 357, -51, 99, -2, -43, -183, -189, 15, 138, 130, 209, 453, -62, -213, -251, -246, -87, 143, -119, -42, 304, -40, -244, -199, -424, -57, 277, 118, 145, -33, 103, -341, -234, -189, 337, 161, 198, 535, -55, -156, -133, -196, -235, -43, 429, 478, 231, -9, -77, -213, -257, -246, 11, -176, 114, 63, -71, 138, -223, -251, -182, 11, 163, 151, 360, -72, -271, 102, -451, -15, 349, -51, 82, -163, 128, -183, -149, -118, -68, 70, 19, 242, -65, 284, -60, -333, -71, -191, -204, 200, 155, 478, 81, -155, -305, -386, -79, 20, 327, 5, 207, -94, -160, -364, -578, 64, 29, -98, 100, -77, 202, -358, -258, -433, -141, 44, 176, 295, 195, 120, -69, 229]
3628B29p44M42p6L85k38J53R8j92l30J20j58J92M01m17l2M10m11N2J2j23N06k34
3650D5J55k48M7jk43J60j92N10nj12K06k17j86j49N6M04k4j15P2n2J48k87l3j
3674f2K72l02L04n6r9p8P1k85j96N25K1P0j46K17n52J35L15k47l8N9L58j52o3
3697G1m6J27l54j30L87k3J01j96K53m25L23m00n0K41J68J00j12j23j76K40m5k86
3719c55K43K71P7J80l51k34K29l49L00l57M65J64l24J85K2j41n3k59K01Q1J32
3740A27P0q0J55k37K2k34R6K18l17J56J03j65q1k62M20j23J31L05k75K2K20l46
3762g5p6o6L43J66l25M04l12j22k7j66J66J43K65o85N61p1l82K44k56N73j24O
3784A84j5K68k96k71j2j3P1j02J77L37n8l3l70q2N0k69L79K88n4m34J66J01m33
$$ y = [229, -515, -73, -149, 236, -2, 151, 249, 57, -273, -153, -311, -119, 282, -135, -167, 243, -168, -116, -104, -227, 279, 45, 200, -48, -1, -2, -245, -85, -277, 233, 228, 116, 322, 105, -81, -230, -174, 230, 206, 91, 163, 111, 259, -28, -61, -62, 210, -92, 212, 156, 57, -21, 50, -235, -431, 94, 115, 185, 39, 256, -296, -161, 154, -93, -131, -72, 286, 134, 71, 25, 152, -202, -332, 55, 32, 133, -63, 190, -235, 88, -312, -362, -121, 47, 147, 35, -88, -264, -24, -69, -355, -112, 159, 236, 416, 65, -169, 60, -289, 11, -346, 119, 283, -41, 144, 166, 25, -28, -287, -86, -5, 127, 197, 117, 272, 35, 57, -177, -81, 137, -180, -24, 79, -86, -167, -429, -9, -132, -1, 304, 29, 51, 271, -75, -151, -217, 126, 292, -33, 371, 59, -63, -90, -256, -90, 53, 318, -367, 194, 123, -259, -15, -271, 302, 178, 184, 169, 437, 141, -130, -142, -155, -84, -186, -9, 328, 270, 237, -133, -215, -165, -434, -55, 233, 179, -255, -89, 12, -421]
3807d21N87j44k7O5Q8j9k18L20l42L59l50P0J60j14P5Kl06k4K56k6m0J24M4ol2
3832H1J05l52P7o2J78r8J33J9k13K34O4k91kK53o7M08k95k43K31m40N8K06J06
3855I0P9j64L7M4R8k77n2kL0m7R5J21j09J18k69M33k2k6J12k98K9O9k29nL88j31
3881A12l2L9j37K23j48k17J86m28J92M17l93J61p9m5m4M5L2J15j10J59J46j45
3903D9J26k00K0n2j89K09L8J55m7r5J7l00L57o3O5k08N3K35Qq6j88M9n9L50j56
3928H8j58K1j93J61M3j23K16j51K56j8k30n9N1k05K11J02J16J02k11p7Q9N4k06
3951a21J17j75O3K04R9j90J21k57Q3K51J5j21l2j22J00J29k49j29K06k47M50j01
3973I4J15K0m0l09o3J80k69j4L92K8j04k71K30j1KQQ7m9M9j13L14k94P4R4l69
$$ y = [-421, 166, 22, -5, 60, 148, 129, -89, 231, -111, 248, -102, -32, 128, 14, 89, 91, -215, -239, 17, -9, -49, 75, 119, 113, 81, 186, -166, -89, -151, 27, -71, 62, 81, -132, 102, 166, -125, -127, 126, 59, 467, 172, -71, 160, -280, -222, -16, 90, 169, 5, 42, 86, 184, -93, -145, -147, -117, -164, -69, 52, -57, 61, -208, 225, 203, 177, 289, -9, 20, 89, -140, -145, 243, 112, 80, 119, -18, 205, 57, -160, 26, -402, -210, 207, -186, -25, -104, -149, -193, -148, -116, -1, -111, 48, 194, 49, 175, -25, -5, -57, -246, -37, 1, 156, 109, 14, 31, -269, 88, 25, 90, -118, -65, 170, 178, 92, -96, -47, -106, 244, 88, -70, -49, -242, -81, -38, -161, 55, -96, 160, 142, -88, -147, -96, -301, -90, 12, 128, 230, 19, -58, 31, 85, -121, -4, -179, -116, 88, 187, -3, 118, -139, -56, 195, 210, 89, 57, -65, 35, 164, -85, -214, -8, -255, 195, 94, 209, 229, 189, -120, -183, -3, -272, -286, 106, 134, 30, -241, -11, -22, -20, -12, 75, 26, 75, -38, 276, -18, 56, 150, -219]
3998b19J61J03M1R7l55L05n87L42p9Q6K41Q4k02k86L17j19Q4j8O0p6R2o7j07j44
4022b46J40j1%j42J57K03j07j96J91LJ19j74K79o91M23Q5k4j62K28k37L00m2j85
4045h9m1K06J07k17n2K5n4J97o2j14K59l01K3k37K59K33J4j78j20J80k50K93J30
4068B11k10j34r7J77K37q0k77R9K46K3k44q2J25o5L2R6k89R8P3L01m83K5M68j50
4092A00j19j4J27l80K55LK64k08j27j15J16K23j92j71K44j40O3N4L64m22K6N2
4114Ck41R8L55J86l85k79K06K77j42j56O7K55j03k7l1m73M68k21J72LJ16k60q9
4137b01O9k11K67O0r9L04j93j92J66j8o7J40o7j42K06J0M7J72k32R8j78L6l18
4160c43L52L09m75O8j26L41K09n00K03L24k29J46k89Q0q2j12L61j37o2M0j9N8
$$ y = [-219, -58, 45, 86, 183, -172, 133, -454, -112, -191, -105, 136, 220, 18, -268, 49, -70, 14, -4, 56, -20, 72, 5, -102, -246, -106, -117, -117, -259, -102, 101, -6, -202, -11, -8, 111, -63, 216, -475, -52, 33, 9, -153, 75, -162, 138, 96, -89, -130, 76, 183, -34, -86, -61, -115, 82, 20, -94, 165, -136, -113, -350, -91, 142, 156, -22, -142, 38, -212, 81, 211, 1, -133, -230, -53, 184, 104, -173, -74, 172, 195, -49, -131, -6, -71, -39, 57, -232, -134, -61, 240, -243, -218, 250, 100, -19, -33, 94, -286, -31, -28, 236, 28, -99, -214, -98, 125, -67, -238, 6, -134, -71, -17, 347, -75, -49, 3, -238, -140, 215, 401, 16, -263, -57, 220, 78, -78, -11, 244, 141, 114, 83, -390, 78, -143, 29, 32, 148, -112, -201, -132, -343, -76, -16, -115, 189, -4, -196, -30, -48, -115, 25, -42, -184, 22, 32, 79, 251, 19, 117, -61, -25, -343, 9, 318, -157, -89, -215, 126, 335, -165, 38, 362, 133, 279, -10, 70, -12, -124, 237, 100, 38, 78, 59, 117]
4182A17J9k73L48k51j58K44j77K58k16K44k35j73KM97j86J6j55K61K03n15K16
4203H6Q5j44J70q9r4J49j49N9j15J30M8k59K79J8l08j9J27kn8M3J41O6j29j04
4227f9j19L45l51M66j99m3K2k6N5J63l96PM8Q6k98N63k93j06rj74J02K34r6K22
4251A34l64M5j34J55K48k84M20m65L92q2J07J52m24J66j30J93j79J40j38Q9J64
4272B05l14J56J3J22q9k08J58j62K80k08J5K85k56P9K93n41J52N5k90K88j66n4
4294a87J87j7K81j69p3J5J0j8j67K17J43k12O5j37K2j54L46j13lN6j34k38J56
4317a24L30j20o1l1l4j51J41J5k02M76k45p3J62m4nl20N42l30J26j7L1j47K23
4340A42p4M3k18p8L17l04o1L74K28l22Q6j82L3l29L55k30K71J06Qj71J9m07j2
$$ y = [117, 136, -137, 211, -40, -198, 46, -131, 127, -89, 155, -80, -253, -251, 246, 60, 76, -79, 182, 385, -130, 86, 171, 27, 197, 108, 14, 163, 14, 73, -42, 88, 136, -123, 156, 174, -134, -153, -26, -28, -86, -43, 98, 164, 35, -69, -188, 157, -194, 272, 73, 30, 52, 26, 81, 244, -152, -145, -97, -11, -309, 254, -39, -145, -154, -328, -226, 8, -88, 134, -230, -185, -319, -164, 84, -200, 220, -245, 147, 65, 172, 324, -100, 66, -64, 129, -50, 90, -48, 41, 205, -109, 47, 60, 182, 93, -115, 43, -119, 161, -47, -32, 253, -3, 76, 369, -172, -20, 35, -255, 33, -133, -187, 0, -17, 264, 95, 22, 37, 47, 29, -138, 79, 222, 10, 75, -62, -40, -194, 152, 39, 36, 92, -42, -280, -124, 206, 86, 25, -6, -40, -191, -50, -35, -237, 239, -6, -79, 83, 39, 34, -286, 256, -74, 52, 35, 66, -81, 142, 68, 111, -107, -185, 132, -172, -233, 141, 369, 47, 133, -49, -16, -345, 10, -220, 51, 157, 165, -6, 13, -394, -406]
4363d06N46j01j99O7J07p0K60j45kr7J41k79J43r1K32k17J03q5K61q3K1J5Q4k33
4387b8k54M14n8J94j59q7n9J20j48oJ49L9k76K82M8O3j29K47j88j37n1j04J24
4410dJ71j95J80k11M0k3Ok2J33l7J76m53K75N6l78M78k27L60l76K39m00L23j66
4433e5P5j11j84L94P4k39K76l16K91r0k03J97p6R5j83L56n44Q1J42O8J9j71J07
4456CJ06l79O8K64k29K49m9q4l9L87j89k68P2J02J62k71K8Q9K4m7J4k49o4P23
4480D23k02k73J01N9J71k61k6J67l2k87K66m1l53J98P7j98J06J02M0k7q2n6KK95
4504A69m29L10o7q6J68k20J16P5K37j86o4j09M9nJ43K35l70q4k6Q5K0N5L2j28
4528h0q1N06m91R9o7J66K7j27M14k20k32M2m7o5K59l2m8J27o1j9l17K20l54L84
$$ y = [-406, 140, 39, -160, -93, 14, -56, 204, 59, 57, -40, 101, -178, -35, -126, 106, -111, -8, -93, 168, 85, 106, 121, 205, -28, -282, 132, 74, 268, 109, 22, -37, 83, -65, -71, 78, 117, -159, 123, 171, 234, 105, 352, 164, 27, -24, -128, -4, 167, -28, 152, -59, -19, -42, -36, -58, 75, 38, 214, -239, 36, 92, -286, 192, -35, 325, -51, 188, -212, 111, -55, 20, -91, -275, 119, 193, -46, 230, -86, 205, 115, -88, 109, 33, 128, -55, 301, -243, -162, -20, 48, 67, -104, 3, 109, -270, -202, 62, -167, 82, 33, -51, -90, 297, 108, -160, -88, 14, 176, -95, -67, 22, 46, -1, 13, -236, -300, 423, 221, -52, 49, 108, 279, 18, -8, 159, 127, -160, 106, 65, -288, -90, -13, -211, -105, -3, 37, 10, -72, -128, -126, 169, -260, 50, -17, -103, 65, -155, -39, 36, 273, 87, 23, -86, -37, -42, 101, 336, -34, -118, -144, -59, -39, 16, 48, -80, -161, 345, -146, -47, -114, 52, 79, -48, 366, 146, -86, -44, -91, -156, 103, 71, 23, 150, 89, 70, -247, -27, -381, 3]
4552Cj40M7K25K4j49j90q6K88J21j67R7J8r9M06m91K5m7N6k43j1M66m4j1j24j07
4577a33J88m5n2m7J16k20K88M8p1k9l5m7J97n92K59L88j63j67L33r3k01j76J94
4600f0J73r3k69P0L13k45K22L3n8l10L74o3r8K4J4Kj30mK50k14j58K46j98k07
4624c86K13QL71r1l23R4l1j3K23j07P9k59RK25J9l28J43K48l29J95L5K13k12J77
4648A73l05M08j82j32M5K75O0k41k51J05J12k41k2o1L47J14j39M9o7r8J60n4n1
4671Dj73J16J49j74J82k65J92o6O0j83r4K48j27J50j5J42k39L72n14J99r1r8O8
4694a57L53m18L79j24Qk76N7M08j61m9pP6k52O4Q3j38K56L1lN7J0l84J88k2R1
4719G0k29L2J11j45l3K44j08J73k32J18J26q8k9L7J05j35K72l55j34K61J26J07
$$ y = [3, -137, -90, 135, 159, 10, -180, -266, 22, 143, -24, 73, 91, -8, 398, -93, -68, -115, -59, -302, -313, 153, 109, 98, -26, -133, 55, 10, -42, -89, 27, -193, 95, 143, 72, 43, 8, -39, 158, -434, -175, 213, 50, -117, 216, 123, -78, -254, -60, 113, 20, -249, -179, 134, -111, 111, 144, 86, -224, 150, 87, -11, 13, 27, 29, -101, -105, 145, -69, -227, 19, -179, -386, -173, -165, 206, 115, -208, -114, -145, -158, 65, -42, 37, -222, -213, 12, 31, -297, -154, 94, -235, -40, -5, 208, -4, 173, -132, 276, 94, -38, 7, 282, 342, 101, -150, -45, 67, -174, -196, -257, 90, 204, 65, 114, 47, -51, 109, 55, 4, -169, -53, 96, -78, 104, -161, 31, -35, 25, -158, -252, -4, -131, 19, 4, 146, -93, 279, -235, -36, -127, -225, -157, 196, -222, 157, 33, 41, -235, -178, 230, 69, 20, 13, 89, -163, -99, -16, -154, 102, 133, 130, 187, 197, -187, 1, -21, 70, -159, -127, -16, -161, -194, 50, -58, 115, -117, 1, 127, 39, 10, 47, 152, 17, 289, -66, -200, 61, 187, 294]
4741B94o6k15J74j05K2k82R8J31K23o91O17k43k10K43K31p5j60j80k5J88L8L12
4763C19j83n99K00L14r9j6Q0r0J83k0l35M12J03l14j75L12J02j82o8m5r9J60K15
4786A75j20J7j34K18k33m3p6K42l3j5k3p8K67o8J4j93J00o6J36j46p5K45l94K85
4810BM2N5n2j03nL7j93k29N30j99M15l79J61j24K1j28L28L7k50M74k82l09K2J37
4834Hk37L62j09r5L0L30k82j1M03l62k15K8L71j19j47K8J27j62J69k2k18KK94
4857A73o29N21l31K92j06L5L10m75K44N5j94L7K13j59J88l25J75l19K16J84k19
4878a14L21k55J34K04k06O9k72J48k80J90J1K38j65J11k16K37O0l21J93M5l0k21
4900a19Q4q6K66j16j76J79l83K92m3P2J36j83J63k47K46m66M24p5K46k11m4lM11
$$ y = [294, 228, 13, 187, 82, 104, -178, -80, 51, 274, -417, 200, -43, -253, -10, 221, 146, -14, -194, -219, -31, 7, 319, 136, -463, -263, 51, -48, -64, 16, -74, 109, 89, -246, 166, 269, -45, -220, 92, 194, 12, -56, -101, -200, -40, 175, 55, 72, -62, 156, -77, -120, -196, 46, 13, -2, -25, -103, 164, 96, 110, -83, 17, -49, 87, -59, -134, 111, -283, 2, 44, 99, 47, -56, -61, -24, -217, -446, 84, -115, 300, -79, 82, -42, -21, -149, 179, 216, -34, 440, 158, -151, -129, 8, -229, 133, 24, -71, -41, 289, 7, -4, 399, 37, -178, -150, 221, 102, -45, -17, 110, -52, 117, 95, -123, -121, 173, -456, 65, -266, 26, -80, -45, 265, -210, 34, 89, -105, -68, 145, -14, 174, -151, 24, -295, -79, 105, -114, 207, -48, 86, 290, 84, 153, -119, 29, -251, -61, -50, 188, 23, 134, -82, 155, 215, -106, 87, 132, 102, -119, -35, -121, 145, 29, -147, 32, -351, -59, -102, -30, 106, -77, 86, -161, 85, -381, 43, -32, 214, 3, -41, -44, 367]
4923C67m69j51M52l76K93l36L51m2Q8j74K56k14o5N5J26k35j39L10m05K69P6j40
4945a03K72P0l28K23k67K71n8j65j81K59j35K29r4L7J6j1k91L31j48K56k42J45
4967H6L4k74L72n90M19J50m05O40m48k36K76R9Q0k60K4J46j88N0l4k29K77j64
4989a75k99N13k08L22j82P5j36l25M97J5M1N9j96J84l55J50k66J31j4K71j28j87
5011b13K03j7O8P3J12l74J32J17j45k8J68k61K36K07l14J44jJ79k47k11L12K6
5033A66k85J98k1o5J6P6j56N36n48J68q2O2J53J5k92J44J6p7M9k6j25M3J69k53
5057a19J16o7j06K90l24J80O9k5k9J64l3r0L1j02K07j27j70k2rJ74r8r9j47M02
5081F6P7o3J45k05Pk4K8j07Q6n2j39J27J28l04J14O5j24J1M47m27K02j1l0Lj36
$$ y = [367, -102, -253, 199, -177, 116, -220, 131, 89, 177, 3, 259, 45, -20, 35, 161, -74, -213, 97, -308, -39, 37, -103, 169, 239, -89, 134, -133, 138, 80, -85, -266, -7, -142, 87, -7, 30, 46, 35, -256, 75, -73, 183, -59, 86, 120, -154, 218, -372, 47, 197, -208, 432, -16, -252, 24, 123, 203, -57, -33, 113, -75, -25, -59, -288, -11, -175, -474, 39, -169, 153, -29, 46, -90, -415, 82, 97, 138, 197, 1, 185, -170, -20, -286, -155, -169, 102, -26, -213, -10, -27, 41, 114, 226, -148, -16, 101, -44, -72, 96, -165, 71, 278, -36, 108, 107, 286, 39, -172, 140, 166, -119, 79, 58, -7, 9, 85, -71, 465, -83, 85, 3, 65, 218, 233, -59, 85, 101, 24, 73, 47, -78, -35, 134, -119, -3, -70, -176, 114, -210, -30, 39, 14, -15, 149, 116, 26, 57, -45, 162, 35, -135, -157, -166, 8, -90, -189, -336, 66, 143, 80, 225, 20, 27, 3, 31, -76, 10, -42, -181, -54, 74, -230, -116, -51, -175, -164, 283, -144, 58, 47, 17, 20, -116]
5106a16J1j31mN9J95j44J5N0N0R3J37Qr9k0j35k11R8L80k78J35M8j18Pk87J58
5131i9M43l10L1K71p17K70J10j81K06j54L8J09L10k63J34k33j17J38j15M35l51
5152d5J00j94K06J17l24m5l2M02k97J74j34J57o2J51Rl3k83j12J87p2L95q0l64
5175a79o9R7j5J83j35lL19j73m6j74PL22n41L37j50R0L32k02R6j25K28J38n50
5198b13L07k12J65L03k13O5m4j1q5J8J03k77m8j54L12j42J04K90k78L8j41J40
5220B7j46K43L9k37R6J76l71J92K0k57L22M3k99K04J39m16j23K92K38j18k54M4
5242a46K73j18k9j99K38k23R4K75j94j15K21m0K94j22l68L23q6j41J61o7j6j4
5264AJ77K8j66k27K12j2o5J05j42J4k68L90n6R3r5n5R3J07o4k0j05j05J54l95
$$ y = [-116, -105, -236, -240, -181, 14, -130, -115, -65, -15, 78, 215, 223, 124, 104, -31, -242, -144, 236, -42, 93, 141, 23, 30, -257, -99, 344, 34, 65, 336, -381, -111, -1, -182, 24, -130, -92, 17, 327, 64, 198, -35, -152, -14, -129, 306, -45, 55, -139, 67, 184, -140, -185, -217, 185, -112, 62, -72, 85, 23, 174, 183, 150, -133, -245, -58, -130, 265, 185, -179, -248, -151, -166, 17, -118, -121, 198, 25, -21, -195, -188, 134, -407, -70, -220, -130, 202, 0, 96, -29, 199, 337, -213, 94, -118, 47, 350, 137, 202, 158, 147, 62, 80, 183, -94, -142, -296, 16, -126, -22, 268, -10, 28, -113, 27, -119, 124, 163, -74, 22, 198, -173, 19, 39, -218, 104, 147, -152, 52, 191, -225, -348, -56, 182, 64, -190, -146, 127, 9, -20, -219, 19, -204, -110, 165, -29, -144, 77, 37, 331, 209, -159, 164, 78, -63, 98, 31, 15, 1, 178, 206, 40, -187, 25, 13, -52, 53, -89, -75, -343, 47, -9, 84, -11, -66, 27, 134, 70, 50, -55, -160, -6, -401]
5288d01N36j53J81m20L5L19j65L58k69K99j37l39J64j82K25l4o4K76Q0j94k32
5309a17m1j5J79K76l11J20j39K27r9J70%l74J42p0J68J31j48K10j28j18j13Q4
5331C4K08k09J60j90j07l8J57m2m2J00J2Q5j25n2j34J28J27j83n6L33k31Pk72
5354c30J89r5K55p5J42j23Q8P9l01K14j49M2R3K11k03l62N08k77k9K15j71R5M4
5377F0K11m3k01j78K18j26P9k2J05j84n0p3K62k38K07J9j86K67l63J08K21l75
5399b82J70J59k63K54j2K46k46n7K04l8j87M8J49j45j78K60J52l22L34l11N3O0
5421D8m3j67M37l35p6j01L14j52K75k49l4R1J02J40l40n4J9J09k47M3L08k12K98
5444A74l98K41N9j61K83j85ll42L56j09J0N0o4l3K34qP1k96J86l9n49N26L2k40
$$ y = [-401, 135, -18, 163, -257, -222, 97, -68, 290, 21, 320, 183, -156, 8, -174, 51, 17, -47, 229, 309, 115, -117, -158, -173, 6, 282, -29, 91, -48, 179, 80, 250, 250, -124, 18, -52, 116, 247, 99, 309, 181, 63, -50, 34, 242, 33, 193, 3, -104, -142, 15, -27, -69, 31, 43, 128, 3, -49, -183, -55, 72, -111, -167, 166, -65, -58, -330, -141, -236, 19, -56, 86, -37, 51, 130, -171, 43, -106, -64, 29, 240, 37, -325, 183, -94, -123, 92, -79, 16, 60, 271, 228, 27, -151, 67, -59, 20, -2, 103, -81, -131, -204, 58, -180, 27, 46, -140, 127, -236, -128, 93, -282, -112, 47, -216, 38, 26, 272, 26, -31, 173, 135, -52, -4, 145, 0, -178, 82, 234, -88, 246, -65, -12, 48, 5, -162, 275, -60, -136, -237, 77, -75, 200, -49, -83, 8, 110, 250, -90, -144, -125, -16, -263, -220, 88, -124, 174, -224, 17, 76, -85, 198, 13, 10, -332, 24, -85, -75, -25, -89, -122, 112, 104, 175, -121, 65, 26, -523, 3, 35, -205]
5468b05L62k6l1k24L52k14q4Q4O0j14L03l9k38K52k33J24r6m3Q7q7k54K77m9j23
5492a59o7J98k06N14j00r3l35L88r6l5KK04p1J17n7j77J1j51J45J1j63J53N8j36
5516d5k21M00m67M29j38J09k05O1K28j48P2k03J99L9j77K42m44J73R8j51J98l8
5538A1R7k2J28j12j38J03j40M6m5P8j09q8N37k95Q2n64P79l52j78K97r7K1q6k25
5562b72J31J79K23n2k77J81j96K56m55L13k16J92J74p6p8k15Q1k45K80J95o3m9
5584A1Q9j48k2O8mO9M6p1q7JM4j2k94J58Q3J56j64k9l2J74o1l1q1j22J53J35q
5611B1K63k34J46j29O5L54m59K95l40K99n02L47K0K72k77k71J74k6j1p5k1p3J69
5634Gk62J67Q2J8j49L4j3N5L27p1l47L78%Lm29K23k11J92j43j30L96l48L27j21
$$ y = [-205, 157, 131, 100, -124, 228, 14, -70, 14, 74, -40, 263, 224, -14, 238, 5, 129, 33, -10, 77, -10, -264, 13, -36, -159, -226, -28, -234, 280, 180, 87, -248, 140, 44, 9, 11, 215, 144, 261, 204, 27, 38, -113, 32, 43, -120, 33, 91, -45, -266, 134, -333, 96, -42, 67, -138, -77, 151, 3, 75, -128, 71, 110, -67, 175, -269, -96, 2, -149, 49, 11, 108, 86, 214, 102, -36, 67, -73, -27, -72, 6, -103, -191, 346, 51, 133, -431, 348, -4, -182, 115, 18, 39, -47, -272, -141, 38, 261, 209, -68, 113, -83, 173, -282, 31, -185, 7, 181, 105, 27, -188, -107, -352, -72, 123, 60, 11, 100, -48, -70, -2, -6, 63, 109, 38, -49, -48, -4, -16, -310, -152, -69, 87, -77, -106, -138, 36, -25, -56, -137, -259, -106, 29, 21, 284, 50, 196, 67, 132, 486, 27, 322, -18, 281, -221, 126, 146, 418, 141, -130, 44, 18, 7, -68, -89, -162, 7, -255, -88, -6, 12, -137, -103, -116, -61, 266, 195, -152, 226, 226, 229, -200, 23, -188, 4, -139, -269, 127, -221, 106, -15]
5658a5j18J15P8j9j26P2Q4j06K21k23j17N14K3k90pR7j60J44j29K79k81K2K18
5681B76j45j59K1L77l79J57j66n0K1K32K9n76M53L8l52L76k4P0j29R0l9j41K32
5704B12J5r4p3j06P3q2N6r0J27J2j34K37p5J7k73L38Qk51K70k74O5l1j9l13M74
5729H9M6Q8m00L74l45m5K19Q1j92K99k62j18l2J37p4K50j38K19k27j63L9m1J27
5752f9N6Q9l0l06P9M31k19p2k10J12n9K46N4k9QJ00k76J20K0Q3Q4o8j30J43j61
5777doj01J99K85k96j94J60J90k56l28P3K86k15K92l86K82j94K05O2O2l41K83
5799E8m9J24j53L33k48N4j51K31l22K18Q3J86k23l95K41K86k24J92m8j41K2k8
5821D6J15j21j6j28J68K36n7j20j89q0L05p7R7l8j45M4l57K69L3l3J19r3l40P21
$$ y = [-15, -133, -18, 60, 41, -85, -13, 71, -35, 186, -37, -154, 360, 383, 93, 86, 183, 23, 167, 38, 317, 36, 58, 276, 131, -28, -7, 370, -9, 148, -18, -68, -47, 185, 214, -362, 91, 129, -223, 153, 129, 199, 70, 160, 121, -20, 212, 227, 133, 60, -46, 27, -55, 1, -89, 38, 50, -84, 153, 78, 95, -178, 160, 168, -83, 187, -87, -22, -53, -72, -385, 89, 135, 223, -177, 197, -148, -193, 26, 107, -85, 214, -48, -166, -198, -61, -135, 115, -23, 196, -31, -194, -155, -196, -69, -13, 76, 46, -260, -181, 250, 31, -41, -251, -139, -198, 48, 102, 73, 81, 181, -95, 25, 45, 128, 212, 144, 14, 157, -4, -10, -111, 88, 373, 77, -117, 43, 233, -23, -351, -278, 8, -207, 85, -301, -19, -213, -8, 54, 116, -225, 58, 9, 133, -20, 313, 65, 119, -32, 199, -123, 95, 178, 364, 141, -254, -13, 273, 49, 241, 193, 52, 74, 46, 161, 40, 24, -104, 64, 300, 243, 123, -66, -146, 159, 82, 179, 141, -4, 40, -317, -48, -15, -48, 71, -22, -362, 359]
5845C59k91j09K47k84Q9q5J36k82L10o0J14j95rJ4rL9j67J34Q9j39J1P5K48l46
5869a11L9K04o7O3j32K31j98Q0j10n0K45Q7r4k98P4k33M40L8l24K39n5J26m86
5892b92j19L60QJ31P7n25N67k72L26j62Q9k08j88K66k50J55R1p2rL9o5K11L10
5915D68m54p7Q4p7j33J60K64m9n21K88K64m31J28K00p8j88O8J3L8K8M2N3L13n89
5939a86K27k1J45j90L75n17K32k15j64K42l4J07K6K08m24R3j0L4K9O2J97l71N1
5962a04K17J11j71Q2J28l33p8J32M5o7o1j10n5M64k11Lk13j08K5M18Nk79K34K7
5986A01k46mL26k65J09J35l08J49P6n1m7j59K72k93K74k46M4K02J49q0p2j84K14
6009I6k61L78j78p5j38J75R5m30N80l80M08l92K12j03J56k54K34K8j22R4l23J35
$$ y = [359, 68, -41, 206, -78, 11, -74, 62, -220, 90, 30, 144, -51, -60, -46, -55, -16, -183, -49, 40, -99, -88, -13, 235, -111, -72, 132, 65, 128, -4, 227, 29, 109, -1, -51, 194, 281, 187, -111, -37, -270, 170, 208, -116, 123, 68, 194, -292, -411, -51, -43, 88, 165, -360, 207, -65, 261, 99, 188, -20, -208, 58, -192, -37, 54, -18, -27, 12, -53, 158, 468, 14, -63, 21, -56, -189, -29, 235, 186, -335, -47, 217, -214, -86, 114, 36, -152, -84, -71, -33, -5, 37, 90, 403, -186, 41, 20, 165, -25, 350, -167, 65, -150, -314, -72, -106, 1, 27, 235, -189, -96, -106, -72, -43, 19, 216, -155, -104, 113, 224, 53, 135, 263, -70, -148, -16, 29, -38, -99, -209, -264, 200, -11, -8, -221, -329, -304, 114, 119, -160, 74, 101, -145, -149, 177, -88, 21, 156, -152, -3, 73, 22, -25, -184, 88, -205, 69, -177, -133, 69, 218, 138, 66, -118, 96, -165, 213, 35, -40, -178, -3, 92, -338, 242, -138, 270, -122, 90, -13, 143, -111, 123, 151, 29, 123, -200, -65]
6031f5MJ18j18n6r1k2J60K26k20j60K36J03k08R2P6l8j63K67j79k42L16j53J55
6054C8LN3j4j80J82P0j07M6j29J7l34L14j85Q5J22J7k7q7j23K33J47j71j67O5
6078a32K25k6j74L62n75J07L23j75O8J66k96l9K16R2K4l09Q0K72j90R8j60J39
6100I6J10n5l67J23J57j67P7k47J26J37n0k82M82k0n3q7J3j04M6J74J03M7k07
6123E2j54K36k5j64K7J07j55R9K79n15J75K6L4l02P03o20K60J16j87j77J72j47
6145a60Q7k62K48m5O4k52L09j31l42P34k11j07o4j67M80N3l63Q1K74r1L1j52J38
6168A52j51k50J95K04m08J9J04n0J03R4J23n79J51L70o2N4q9J18j57N6K9j66K38
6191I8q4p8O3Q8J30n95R8L66K8n9Jk00J88mQj63J47k62K42j35o9J79K05k60N2
$$ y = [-65, -61, 57, -61, -117, -208, -230, -70, 156, -64, -224, 12, 115, -93, -1, 75, 37, -126, 141, -38, -280, 36, -117, 38, 41, 94, 80, -100, 82, 152, 45, 91, -38, -21, -355, -41, -226, -141, -19, -2, -29, -116, -239, -6, 141, -30, -197, -132, 93, 67, -107, 255, -320, -213, 110, -65, 3, 169, -127, -166, 50, 142, 166, -143, -63, 209, 19, 117, -43, 96, 206, 151, -216, -93, 64, -103, -26, -273, -147, -10, -60, -342, 140, 120, 67, -20, -7, -111, -65, 109, 212, 259, 52, -102, 134, 109, -55, -28, 79, -76, 23, 302, -213, -38, -12, 22, -280, 423, -197, 63, 179, -8, -185, -13, -160, -73, -335, -87, -132, -68, -320, -11, -142, -484, 250, 39, -68, -132, -299, 181, 234, -129, -48, 226, 135, 166, 14, 152, 1, -249, -54, 150, -258, -239, -135, -185, -82, 12, 135, -444, -293, 77, 15, 69, -20, 98, -59, -3, 26, -140, 98, 14, -64, -1, 87, 217, -378, -280, 86, 114, 55, 56, -144, 44, 40, 48, -115, 32, -230, 12, -123, -192, -13, 192, -68, -16]
6216a6J18j82L82k55K28n1l20M5l2n5m4J2R1m8N3J24J59k67J30k87K58R6j50J19
6240A08k23K0L56k75kqJ20p7p3L91o99K86j14J70R9l22L44n4n7R8m8J31k6j81
6264c6L8k19QL43j70J96l26K21n7m7N8J36l6k50K11L6k91J77M07n44j35K53O0
6287C3M7J57j83m1l3j53K24o1j9M4j01K92l66J67J30m32K78j15J21j20K32k70
6309a69M7K25l39K29Q1J14k36K70m2p0k68N3K5r3J72j47j41J69J3L54j82k28j58
6332c21P5L6M37j10J88l81j17M55m12Q3J17j44J37k29J96k08L04p5R1j50K44n7
6354A59k29K43nj65p1j7j40mK94j58j15J57p0J16K66O6m31P1J82nn3j56L10q1
6378A64L0k83j04N24j71L7p0j97J60Q3k86m6L42k15Nk63L9J63Q0j0j81K79l25
$$ y = [-16, 102, -80, 302, 47, 275, 224, -96, -51, -83, -138, -182, -170, -79, -127, -74, 50, 209, -58, 72, -215, 43, 139, -11, 108, -115, -95, 261, -14, -16, -24, 96, 19, -54, 337, -362, -76, -190, -20, 79, -243, 101, 47, -10, 88, 40, 171, 145, -36, 2, -217, -209, 134, -36, 160, -166, 55, -2, -49, 9, 145, 109, -141, 70, 106, -185, -8, 399, -145, -280, -27, 33, 80, 237, 54, 13, -20, -173, 51, -10, -29, 15, -86, 206, -160, 7, 137, -295, -17, -132, -11, -131, 101, -169, -122, 103, -236, -7, 74, 188, -48, 222, 180, 110, -158, -105, -80, -173, -1, -148, -289, -120, -107, 247, 65, -163, -321, -246, -210, 227, 117, 305, -76, -193, 262, -150, -67, 50, -94, 43, -186, 10, -198, 106, 31, 122, -28, 216, 159, -70, 173, 168, 3, -68, -85, -225, -229, 65, -93, -208, -51, -121, -5, 261, 327, -104, -33, 149, 144, 91, -65, 245, 164, 194, -89, -193, 331, 160, 197, 127, -70, 90, 173, -113, -159, 183, -32, -27, -290, -251, -88, -8, -18, -199, 80, -245]
6401b45L97Q7l21j82L69k39M31m57L32k23K45l0l94K27j36r2R6K61l7j15k78L24
6423B0p2k9N8R4J14L1k24L21n55K45k6J26j40J01l4j04K36j51Jj52P1L79o16L13
6447Gl9p5K89k62o1L17L9k35K8j44J80R5o5M7m3p4jJ4j45K10m14K06M30k07J32
6472B29k83J7j9k96M61j53L2J03j53L1N5J83j09k93M75n37J43J81K23k02j08J16
6494I6j94j36Q1M73l96J79j95K03m1m4O8P6k07l7J21k22L39n6j17L0n6K11o8m22
6518c14K54J94k20k63N59m27M07j43j70K08K84o58M11l79M55j91q6j37L54l29
6538a91K97j26J66j67K05J4k53L67m28m4K75K2R2j32q6J68l52K11lj54j32N35
6560B84k51J2j70L31j83j18J07k45K18J55l5l41L4L16k05K27J1l23N09j81j78
$$ y = [-245, 152, 239, -82, -264, 105, -134, 297, -160, 172, -51, 194, 164, -230, -3, -139, -231, -135, 126, 89, -26, -304, 20, -52, -81, -23, 71, 185, 216, -8, 313, -242, 3, -23, 103, -37, 64, 30, -74, 162, 11, 12, -140, -69, 310, -306, 7, -32, -107, 182, -80, -141, 176, 215, -20, 8, -136, 44, 139, 74, 121, 78, 4, 3, 17, -128, 82, -332, -126, 304, 97, 229, -54, -37, -56, -352, 109, -44, -12, 91, -62, -31, 24, 207, 98, -195, 280, -257, -114, 67, 290, 88, -20, 96, -98, -234, -153, 320, -76, 103, -92, 111, 70, 26, 94, 170, -37, -74, 47, -175, 164, 108, -9, 21, -35, 176, 108, -314, -60, 134, -86, -349, 210, -217, 190, 47, -123, 85, 369, -289, 122, -257, 198, 7, -79, -216, 138, -191, 106, -20, 146, -21, 184, 198, -55, 312, -116, -160, 115, 137, 229, 97, 11, 179, -173, 38, 35, -119, -251, 284, 33, 45, -125, 206, 23, -95, 12, -233, -15, 140, 105, -236, -202, 114, -91, 136, 147, -176, 333, 152, -26]
6581b6K03l93K17n0J45n6k75J28J49j6k30K95k9J39k91j40Q5N45j87K2j78k00
6603a43L27l02J62K56k73j08J45j52O1J10k08J72j08R3o3j74J87L8J30j48J49
6624A51l50R7L17k69K15m29L52nP0j82Q3k7l70M80j99J76L7N3j11M0k17pj36J50
6648h1J42k20K95R4r9l24O0L60Kj91l6L6j1j88K23q0j6L9q8J58l38R8J8R7K28
6673A78j79o5J95r2j37K99o2k13J74k26k0K25k62K19k96J88J08k91K33j9J36q6
6695Gn0o5OK07k03K76m55L93k72M85l95k67L55qK8K8N6j22N3j2K9K72j52m0P8
6720B32r4mq2k41o1K67j20L10j94q9m0l4L12r6l42M94k19n9O7J68m1k84K14k71
6744b07J2K5J67l8K39l44K09Q3k14J4R5k62J21J72J67q2R6k03k05K84j53rR2j59
$$ y = [-26, 177, -216, 1, -49, 96, 40, -235, -107, 42, 26, -204, 91, 62, 201, -90, -230, -145, 400, 213, 235, 57, -143, 184, -118, 44, 300, 27, -81, 64, -88, -27, 83, -125, 47, -61, 32, -31, -205, -18, 20, 150, 2, 151, -199, -102, 215, -54, 161, -268, 84, 79, 149, -33, 50, 23, -347, 133, -66, 110, 147, 200, 89, 129, -88, -95, -231, -81, 61, -159, 136, 230, 131, -193, -133, 227, 229, 38, 2, 38, 27, -161, 62, -18, -34, 5, -83, 75, -263, -165, -147, -50, 178, -1, -66, 129, 37, -100, 199, 137, -76, 98, -128, -148, 77, -185, 34, -262, -74, 34, -257, -24, -43, 93, 7, -43, -108, -102, 105, -98, 178, -277, 116, -156, 329, -66, -333, 22, 14, 42, 70, 126, 4, 57, 45, 74, 346, 194, 154, 232, 138, 134, 52, -189, -250, 17, -103, 207, 13, -76, -116, -150, 162, 66, -276, 218, -1, -60, 7, 175, 134, -150, 64, -207, -195, -170, -3, -41, 198, -146, 63, 146, -68, -54, 41, -221, -100, 72, 239, 157, 253, 50, -155, 129, -24, -33, 59, -100]
6768a00J73q6J1o5N8m9j52P6P0J51q7n8K70k57Q8k25j41K62l0l5r2J85k52L33
6792D8N8j03KP5j65J22J40R4k51J53n7k44K67k50J91m58N61Q1m83K60KP1j12l1
6816b9K49n13L34%J38k72K73k51j9J67l21L98k09J22Lk55L24j50K16q7l60J48
6838i4k36N16j05j96K01k17K42m75N90l24o5J90N7J1r4K37n20L21o5K7J51l80
6860b28J6K31o8J79K46l09j66L10j81PJ2j79K92j66l1R0k04J7O1K17j25j89L18
6883A50j28k72R6J82l88L12R3k84M28P7k52J88k16m4L68k97J28j72o1j61K55j28
6905a26k8N18k60N0j05k65M79k27K0K18k83J65k49J09J13l7j36K38m46L87m23
6926b88K59L1Q6m06Q8L18m0j97P2K0q4N5j00K64j00k58K30n4J69l32M0K55%n9
$$ y = [-100, 73, -13, -2, -67, -9, -58, -210, -134, -64, 87, 0, -58, 212, -45, 43, -182, -323, -61, -91, -126, -218, -33, -285, 48, 106, 3, 5, 80, -85, 37, 177, 271, 20, 173, 116, -128, 139, -111, 80, -378, 183, 264, -219, 41, 43, 114, 2, -29, 220, -293, 41, 41, 179, -93, 180, -71, -90, 77, -244, 154, -55, 67, 70, -185, 139, -11, 205, 118, -242, -94, -330, 186, 81, -115, 86, -131, 111, -364, 226, -98, -163, 27, 84, 95, 1, 238, -282, 39, -26, 1, 152, -228, -212, 19, -49, 130, 376, 67, -99, 211, 30, 37, 49, -130, 162, -4, -35, 55, -149, -132, -71, 146, 21, -168, 150, 22, -250, -154, 28, -360, -48, 45, -239, 189, 266, 14, 202, -14, -58, 310, 13, 141, -31, -92, -253, 2, -126, -154, 364, 104, 154, 49, -216, 263, 36, 56, 274, -9, 156, -93, 16, 129, 92, -44, 194, -252, 135, -288, -29, 2, 88, -318, -230, 88, 48, -149, -77, -57, -141, -86, -186, 78, -22, -280, -50, -104, 65, -267, -227, 28, 28, -31]
6950c1J17M3N6m17k8R2J27o8k2L20m76N26k43n7N2r9J73J14j5l2k58K26j65Q6
6974B1k4O3P5Q0Q3j27k42K25m17l7M55K22m29K44k29O9O8k78J73j72K53M7k96
6997a73R8L8Q2j60J14J16l92L10R2m95L61l15L40k28K31m2M1r4n1K60k36q3K03
7020A7j12N3n2J85j33m8J06m7K00n0j12J69j23j05l5j59j5L70m4j64o4R0p3K67
7044A21l24K91j09R4K4J49q8k36Q3q4k05M10k88L12q8k7R6%k98L6M13k8r0r5l90
7069c21J15J56Q8K5j90L17k50o5J07J43j07J84Om00J28J06l54N49l85L15j29r6
7091e8J05o8J72j32J4rK37m64K50j11%j12K20K08l33L07n47K86K43j80K69k04
7113I3Qk64l6K21r2K45J05j42k40n3L48q7Qk8j01p3OJ84j5j04M4R7m30J86L43
$$ y = [-31, 86, 129, 185, -232, -260, -168, -41, -109, -131, 189, -287, 239, -4, -61, -9, -108, 65, 179, 164, 132, -126, 100, -65, 21, -3, 60, 135, 215, 298, 171, -71, 154, -263, -300, 155, 377, -52, 192, -37, 32, 100, -178, -5, -177, 76, 123, -173, -75, -37, 45, -115, -1, 115, -277, 33, 125, -370, -9, -324, 16, -212, 19, -23, 18, -76, -127, 133, -103, -186, 17, -95, -42, -94, 91, -42, -90, 16, -31, 169, 119, 7, 176, 53, -52, -87, -246, -261, 109, 65, -99, -163, -73, -146, 121, -203, 88, -21, 73, 97, 246, 158, -78, 5, -79, -284, 126, -162, 150, 62, 35, 131, 131, -167, -131, 282, 254, 164, 69, -321, -206, -50, 38, 63, -127, 190, -60, -125, -18, 125, 18, 202, 208, -192, -64, 42, -312, 237, -148, 167, 38, -58, 47, -21, 151, 19, 33, 24, 261, -203, 47, -64, -64, -176, 44, 252, -81, 226, -321, -35, 208, 28, 297, 93, 101, -163, -199, 22, -70, 175, 280, 138, -102, -155, 193, 106, 114, 86, -15, -88, -82, 102, 87, -17, 27, 124, -306, -120, 223]
7138B23P1l28J63l33J85K2rj6j00M13k63k01L24j46J97Qj95r8J44j70J69Q3j40
7161Co8K25m29J60Q9j82L65k56n1J84K29m18J1Q1P8j94J52K42l14R0%o5K05Q0
7185B17ol61J22L17n95N31j80k46L28l69K53j15J22j15K28j73K52k23J39l5k04
7206a13K03k05M03k65J40k79j96L03L0Q6J13l73K82l05L4m1L88j22Pj42q0Q5P4
7229B7L12m14O7M6m4j33mJ51J17j82k9N4m5J81j05qn8r4K11q2n9L8J68j21Q1J78
7255B53l44N7j99K97j51J67LK00m11J93j23k38K84p0R0J86l28J34L4q5M1m5R7
7278D2O2J37l65R9j64K73j69J77J55j16q0M1j77M19m09m9R7jJ08J43l94L67M1
7301B37k13m5k13J38O2K96j12k80K25M5k34LL0k42L81J22m9j02R0l56jR2P3Mn8
$$ y = [223, 294, -34, 129, -204, -19, 3, -6, -22, -122, 291, 28, -173, 151, 5, 202, 210, 15, -83, 61, -109, 60, 143, 3, -65, 160, -269, -109, -20, -202, 163, -93, -144, 40, 269, -149, -138, -57, 21, -173, -21, 221, -93, -3, -3, -68, 137, 217, 211, -150, -28, 289, -306, 225, 45, -201, 127, -242, 11, -104, 18, -97, 131, -42, 210, -13, 126, 91, -113, 90, -115, 288, 23, 163, -116, -312, -9, 21, 107, 220, -153, 129, -176, -142, -183, 205, 83, 90, -52, -132, -47, 27, 339, -75, -8, 38, -6, -139, -143, 8, 125, -57, -86, -32, -77, 104, -1, -9, -67, -161, 50, -32, -91, -53, 115, -6, 75, 253, -91, -34, -233, 64, -87, 80, 83, 283, -128, 65, -58, -296, -12, -82, 8, 194, -134, 0, 34, -51, -10, -55, 42, 104, 241, -124, -25, -189, 84, -85, 92, 247, 131, 51, 92, -85, 334, -75, -124, -27, -28, 80, 223, -171, 196, 237, 24, -21, -234, -96, -34, 262, 150, -130, 95, 140, -94, -91, -61, -303, 78, 200, 151, 49, 139, -217, -218, -126, -53, -49, -107]
7326a07K59k7o2k2J33l18rl0J35N2n2j72K82j87J44m48J77M24k23k03K42K01J1
7349B00k39O2j10J51j12J26m09M16K25j50j30m4j55L56k37m8R9n6o3K7J44k06
7371a53P7J44k62K61k25J00J86j71K81m04K35K22L1l22p8O6k18K49L10k44P6Q6
7393B47k14r0L05l53L4M3J8q5K86k58J2N34n79K09q1J05k63K38J55l05j3R2K73
7416C10k07l24K21p3M8Q1O9l07l1K98j85j54j3K04K40n0j0r3p5K18k62J89R2m67
7440b81L52k35K47Lj74J28j86J90M1k95q6J94J26n2l2p3r6r9L42m9J72k85M5K20
7464A17P9j96p7j8J24j50M3K45k28J1r8J91P6M9k26k15K19J44j02j65k65M38j09
7487a13j5K92j22J38k22Rn8J46q9N7j25K61l4k70M9J43j02L64k87J62j18K23k03
$$ y = [-107, 152, 125, 63, 41, 174, -144, -153, -183, -48, 4, -48, -220, 62, -125, 19, -429, -252, 172, -51, -254, -12, 189, 200, -39, 23, -87, 64, -48, 78, -331, 85, 310, 160, 30, -14, -169, 187, -50, -98, 1, -55, -118, -91, 53, -153, -76, 68, -194, 67, -158, -58, 128, -43, 238, -166, 69, 291, 322, 0, -78, -12, -230, 19, 329, 85, 161, 247, 33, -57, 248, -105, -71, -28, -10, -95, 191, -67, -55, 479, -100, 109, 28, 133, -130, 108, 263, -42, -55, 37, 310, 103, -221, 0, -73, -25, 56, 125, -182, -213, 85, -100, -254, -267, -63, 177, 127, 117, 24, -51, 167, -95, 94, 186, -281, 71, -164, 83, 86, -88, 40, -146, 44, 85, -210, -296, -102, 24, -28, -60, -133, -229, -328, 14, -35, 137, -148, -103, 117, 196, 0, -77, -95, 29, -121, -78, 167, -61, -50, -148, 43, 119, 168, -58, -273, -54, 90, -12, -177, -442, -4, -113, -128, 164, 42, 180, -42, -33, -91, 55, -34, 23, -102, 159, 125, -145, -96, 47, -55, 309, 22, 184, 66, 289, 86]
7510H6q5q4L85l66K26k5l40M87k93J83j87k62M98m76J83N9K11j08j30N0L22l60
7532b6l0j86K83l5k4p6j54N06k40q0J41Q0l4j67L38l59K95l1l16J63J05m4j63
7555e4L68k85j75J04J87k46J85P2k96J23J82l7L4k34m6Q9K2J20k17o8N16k74k03
7578a33K74Qj93KR6k05J38j3j6R7P5l25L70l95K24k19K02K46j45lk65o3p9L59
7602C7M2j71j69M24j11q1J68l26K79j0n14J52K95j20J49L7l20j23M94m1j68K23
7624A46OJ7k75J41k65K58p1N3K3J0l47L23J55l52K23R4n5M9m03N15j48j62J33
7647F8K67n74M40m9k43j5j8J35J00n1N2j84j72L59l08J19NK87j61qoJ06k56R5
7671a2j49Q8L17k75K54j27N6l03J99O0K87l53o7L55m62N2J03J4L5k39N19m12K60
$$ y = [86, 1, -83, 302, -64, 162, 137, -203, 284, -9, 174, -13, -275, 223, -253, -70, -11, 200, 92, -38, 12, 334, -26, -56, -242, 41, 6, -18, -94, -248, 258, 18, -62, 79, 159, 125, -42, 296, -63, 232, 201, -115, 48, 153, 109, -54, 314, 29, -146, -42, 145, -101, 84, 156, -140, -17, 165, 128, 162, -72, -118, -29, -7, 113, -104, -172, 344, 70, -133, 141, 149, -44, -42, 54, -151, -13, -26, -42, 55, 130, -195, 175, -220, 4, -215, -13, 233, 88, 85, -180, -243, -322, 37, 79, -92, -261, 163, 52, -29, 139, -187, 92, 82, -432, -280, 15, -105, 44, 81, -239, -362, 132, 91, -77, 146, 152, 169, -106, 35, -230, 28, -43, 10, 33, 43, -304, 19, 174, -178, 45, 139, 84, 133, -270, 245, 97, -65, 68, 335, -239, 201, 152, -91, -106, -124, 11, 111, 60, 112, -72, -244, 115, -193, -74, -69, 218, 57, 49, 43, 149, -107, -12, -161, -73, 244, -31, 223, 96, 152, -151, 48, 108, 395, 42, -25, 330, -132, -80, 23, 37, 72, -167, 352, -60, 200]
7694B00r7j76j12J0mK43k47j8K57m88L30J47j10j89K81k95K39N9J19j16j51K95
7716A77j31J31j49O9L8j81k83L80J37l47J64P6M2q2J26j50l8l9J6j62J77m4K22
7739A49k2k96J41O7j93L15m11J92J87L59l71M8j47j08J60p3J31j43r3R2r3l3K51
7762A09j63J88k11J1P0R0n2j05j41QL46n7l5l04M53l82m7K91l38J58J57L7R9l87
7786b05J60K8M4n3j21j35L67l0j86L0J27J58j3l52K37L2L1Q5j90J62k41o7K95
7809A63k95L14n4k86K57P2j92R8jok21L90j46k50J95k64P7K92j04j0K47p1l53
7832a48L67k71J31J09J8j29p3J9l36K93j76K73k4Ro3P5q8j17J4R3j52k9K87o7
7856A5k07m5R6K52j43KR0N6m20J63N8Q5K32l41J23J70n78J60K01K76m17J12j23
$$ y = [200, 103, -73, -185, -175, -179, 64, -183, -201, 56, -432, -102, 45, -65, -254, 27, -268, -29, 30, 149, 33, -118, 177, 46, 177, 28, 97, 135, -46, -329, 51, 188, -159, 5, 81, 123, 41, 167, 17, -21, -60, -44, -206, -29, -73, 149, 127, -169, -28, 39, -154, 161, -250, -58, 129, 488, 117, 165, 18, -90, 70, -3, 128, -15, -108, -16, -109, -142, 109, -54, 134, -77, -66, 4, 94, 42, -63, -204, -196, 150, 93, 58, -246, 207, -175, -222, 69, -269, -111, 46, 83, 182, -205, -45, -17, 27, -26, -147, -282, 85, 55, -131, -101, 26, 184, 171, -181, 56, 88, 119, 204, 14, 176, -65, -132, 163, -132, 182, 128, -158, 99, 171, -21, 77, 76, 70, -151, 239, 93, -157, 38, -226, -149, 143, 39, 29, 276, 205, -148, 219, -52, 79, 188, 206, 77, 4, 23, -313, -20, -196, 77, 53, 62, -1, 74, -14, -131, -117, -24, -176, -205, 82, 15, -192, -237, -141, 111, -32, -30, 60, 116, -304, -141, -83, 2, 234, -107, 16, 186, -392, -232, -31, 245, -172, -60, -183]
7879a83J97pk76L16K8j42J1P7j35J91O3j87J41Lj20o9J32j67L05j68J67o9p1J38
7903A75j91P6j77L24k99J64k44K88j32j62l6l10M10j72L21Q7R1k03j44J86o9r0
7925a07p4J68R6K4l50M18k10J96P1j69n2q5L58j51j69J96o4Lj34K85l58J39L4
7948F5n1K11l26Q8K14j41k18J64k2JN3q2K47lk91l4M3J32O5J05j44k78j6L04m77
7973c91N46pk08M12l72ml1k6J28K19k89K60n99M13l5j27M98k75j68k0K78l32P0
7996f0j00L36j02j45J40k15J42j84J40J13k53m4oL14k60K00l46L49j84L09j27
8017A7J44m33L96n23J85L71k31O4J86qj0P8m56J98K4j34J25P8J36k16J92j01j86
8040a04K49l93L54k50L33l87M9J51l38L81P7J67n96N06r5m3r4J68Nk12n9KK31
$$ y = [-183, 14, 7, -269, 47, 75, -67, -56, 21, -114, 77, 140, -47, 94, 97, -23, -92, 40, -127, 178, 10, 177, 108, 37, 175, -16, 60, -117, 207, -92, 72, -172, 116, -16, -178, -214, -524, -114, -286, 35, 122, 213, 10, -134, 52, -17, -107, -181, -13, 83, 107, -243, 175, -35, 161, 232, 63, 11, -74, 284, 133, -36, 160, 96, 99, -35, 250, -108, 31, 65, 14, 225, -101, -13, 201, 60, -158, 6, -16, -15, 38, -44, 203, 200, -91, -125, -82, 50, 115, 220, 76, -202, -218, 86, -391, 155, 148, -60, 352, -20, -24, -55, -81, 47, 266, -23, 237, -362, 51, 16, -111, 387, 112, -56, -76, 202, -130, -60, -160, 176, 74, -71, 69, -146, -4, -188, -48, 65, -188, -232, -238, 76, -184, 16, -330, 19, -165, 144, 17, 161, -272, 124, -399, -214, 157, -74, -10, 176, 168, 158, 236, -220, -22, 2, -132, -7, 71, 207, -9, 183, 82, -104, 145, -248, 106, -144, 189, -198, -149, 2, -336, 45, 122, 289, -307, 199, 104, 61, -33, 135, 140, -72, -131, -129, 102]
8063A02j02l0l9K08j3j06j4p6J61j33J90l24Q6M9J65r4LOqp8o4q9K09L5j63J93
8089G4j10j39L09l58M2K58j4k40P5K04q1m8o4L2q3K17j01k03J71K92m9r2l40K88
8113D0k03k0L43J3j77m7J06l3K8j63J57J94k31k29K36j16J73o6k19J98J04J02
8135A90r6J52j52o97Q53m54L45m66R4L53j83P5L3J07l20K83m1L5r3M8J49l34K17
8158I8l34K25j02k55L15J04j57Q4j3J39k86L15J3J44k19j39J8Q2o8N8M5k95L47
8181A19q3k43L35k74J00J27j97j38N91k22
$$ y = [102, 0, -30, -69, 139, 126, 20, 6, -70, 91, -42, 148, -176, -90, -41, 124, 30, 33, 39, 31, -47, -111, -200, 9, 44, -119, 74, -36, -175, 134, -224, -182, 76, 62, -178, -103, 101, 20, -28, -92, -60, -143, 74, -27, -230, -59, 233, 184, 92, -248, 40, -163, -183, 160, 173, -4, -51, 55, 22, 50, -113, 44, 238, 7, -222, 14, -102, 71, 5, -214, -16, 88, 190, 94, 246, 94, -603, 250, -204, 141, -325, -231, 122, -61, 14, 47, 154, -166, 117, 76, 111, 18, 66, 215, -119, 98, -236, -11, -113, -368, -53, 51, -106, -22, -35, 104, -182, 133, 146, 290, 71, -68, -50, 32, -36, 22, 67, -228, 119, 36, -207, 128, -146, -46, 81, -116, -254, 337, 115]
8191A15
$$ Imaginary data points
##PAGE= N=2
##DATA TABLE= (X++(I..I)), XYDATA
0@%%%%%%%%JrJ6j6J6k4L2l5M3n1N9p2Q5r8J14j30J51j73J96k26K56k89L26l65
32a93M10m60N13n73O40p10P86q71R68j073J185j311J454j614J792j994K225k493
50a319K807l179L635m207M940n931P352r567J3552k2983Q8101P8863j17198r8042
64f3176o1920L9552P5046O9127M924l0568l7622l106R882L226k7348k8523k079
77e2585M3962O0957L6446k4980o7569o7880j8267L8088O6113M7269N539l0577
89C6516m0408k6888m889Q249J2657J2733J4308J3375O184o153j9643k5676k0003
102c9638m102J6596L2022L3465J8759r121l7387m9458l2440P280M5705N8376L4713
115G4770r893m6425n1263k5787J0362L1302K8624J4273L185o05m474j5167k9400
$$ y = [0, 0, 0, 0, 0, 0, 0, 0, 0, 1, -8, 8, -8, 8, -16, 16, -19, 24, -27, 32, -40, 45, -53, 61, -69, 82, -91, 105, -121, 135, -154, 172, -193, 217, -243, 270, -303, 337, -373, 413, -458, 510, -563, 622, -689, 765, -849, 943, -1051, 1174, -1319, 1488, -1691, 1944, -2263, 2677, -3254, 4098, -5469, 8083, -14900, 73201, 152064, 34866, -63176, -125096, -85544, -10498, 58629, 63553, 32985, -4637, -7743, 2139, 5365, -21983, -50506, -52585, -8623, 52334, 88780, 63800, -3769, -71649, -89916, -51828, 14285, 61554, 67093, 36516, -3892, -30780, -35669, -27420, -14763, -2030, 12278, 25653, 31837, 25684, 6041, -19635, -39638, -43740, -27144, 4878, 38343, 57102, 47981, 10594, -38864, -71304, -64024, -18319, 40057, 74770, 64877, 18452, -32811, -58598, -48236, -16934, 11690, 25963, 29148, 28543, 24069, 8902, -20498]
128b0498l0362q200K8810N4835M5502K975m4073o2662l9078Q902M5341M8328K0661
141E0481j1322k5750k0074p855k385m085k804R546K4759K7118R225k0636l8875
154a2657l2180l933K5404L4265K1607Qj4249j4521r812q429r616o350Q453K7255
168E245L2325J5681j6975m2454m0572j2332K4740M2664L3016N298j9075k6322
180A239j8216p323j022K644R639K0455K5289J4093j2023l7138m1712j8116J9580
193d2611M5906M3006J3118k1956m0325l2803q585J4870K4971K0948J0071r04q680
206A7026j2607j4740j1749m517P301J7523J9480J2081j223j5552k2593j9780o697
219c6047J1109K4847K6005J3515q827k5504k7203j3629P039K1617K0311Q952k846
$$ y = [-20498, -50860, -59060, -30250, 24585, 70087, 73062, 28989, -33673, -72751, -63849, -18508, 29820, 50481, 39159, 13409, -6665, -14520, -16905, -20990, -23794, -14248, 10511, 37629, 46854, 26218, -12657, -44837, -48770, -23366, 10899, 32506, 32514, 18265, 3744, -6068, -14497, -24113, -30463, -22010, 5245, 37570, 53251, 36276, -6178, -46750, -59082, -34342, 8322, 41338, 46636, 27561, 1239, -16977, -24300, -25322, -22678, -13039, 7416, 32705, 46798, 34775, -2363, -44075, -62191, -42611, 3295, 46301, 59419, 37463, -2862, -35665, -44250, -29380, -4409, 16539, 26610, 25706, 17026, 4419, -10321, -22070, -26587, -19286, -1763, 17717, 29798, 28575, 13023, -9570, -29350, -36047, -24938, -91, 25914, 39429, 30602, 5098, -22105, -35734, -28695, -7078, 13233, 22185, 19339]
232A9339q087n539n055q548j3321r051Q077K7299L2571J4201j8598m3893m1116
245e1721q803K9853M7646L3553q03l0996l5202j7396N941J6942J2326M174J735
258G249O568R264j119j8478k8402j8955Q260L4391L8092J5921j8054l9701l3058
271c8022o707K0495L0090J9522N05j2612j2872n921j196k384m918j485P499J6919
285H913J6380M062j3553k4631k0791m109J4648K5140K1557O140j1024k1362j9871
298a8501r324L926J3802J6547J2772M210n104j1927j5531j2745n075O439J7885
311b626K2222J4257k116k0668k8445j9970N74K1913L0229K0281o55j9344k4796
324i144j6300q38J1063J4288J0944O319J784l616r606j5046j3882l147J2202K2480
$$ y = [19339, 11252, 5713, 658, -7890, -21211, -30262, -22185, 5114, 37685, 51886, 33288, -10605, -51721, -60524, -30671, 16975, 50528, 49725, 18729, -16473, -33869, -27928, -10986, 1340, 5514, 7249, 13817, 23081, 21962, 3484, -24918, -43873, -35613, -1222, 36870, 52791, 34737, -4964, -38022, -44729, -24234, 5856, 25378, 25883, 13271, 399, -5522, -6718, -9102, -14020, -15505, -8006, 8913, 25293, 29355, 15802, -8829, -29620, -33729, -19081, 6059, 27616, 33756, 22732, 1370, -18501, -27825, -23899, -10097, 6450, 19222, 23432, 18328, 6401, -9130, -21875, -26950, -20511, -2626, 19596, 33853, 31737, 11069, -17376, -37346, -36772, -14859, 15370, 35651, 34996, 15652, -9144, -25444, -26282, -15219, -931, 10013, 16332, 18116, 14500, 4894, -10152, -24034, -27181, -14979, 7501]
338G501J9616M238j3955k3411j7983k565J1461J6902J1901K834l114n033n497
351B895p634r257o585L626J4332J9611J2453m158j9850k3617j3115M274J8583
364h442K0895J1639j046j1167j3884j1095o073K54O791J3850J5468R685k972j6799
378G104k3443j5309K188J8276K5499J6898n57j7455k2673j5534q55J0892J6088
391A119J2907M763k411q663j0318j0088n781J283Q923J4969J3040M315q775j7013
405a730j7142o265O995J6714J6574P441m243j2489j2925p668N5M454O406P568
419C745O737N011l97q691j4599j3176l825J0634K0356J8665N059j1607k1606j8486
433b2180n614R981J7698J5770N577l670j0437j0781q650n090J201P962J3230J3611
$$ y = [7501, 27117, 31355, 17400, -6011, -23994, -26559, -15098, 1804, 13705, 16539, 13425, 8392, 2895, -4739, -13996, -20581, -16955, -2623, 16988, 29441, 25283, 5433, -18184, -31299, -27025, -8442, 12453, 24092, 23046, 11879, -2005, -13100, -19173, -18919, -12128, 1722, 17190, 26875, 23903, 7104, -16339, -31648, -29460, -11184, 14315, 31213, 30656, 13201, -9472, -25006, -25861, -14969, 1119, 14026, 18789, 16378, 7715, -2603, -12691, -18472, -17189, -8266, 6703, 19743, 24058, 15283, -1730, -18872, -25137, -18142, -1428, 15146, 22587, 18344, 5855, -7070, -14738, -14683, -10229, -3823, 3745, 10482, 15493, 15096, 6405, -8194, -21370, -25195, -14561, 5795, 24460, 29519, 17912, -3694, -22180, -27794, -17813, -115, 15655, 21232, 17562, 7125, -3656, -12306, -17396, -16195, -8233, 4997, 18608]
447A8608N874p288j7816j9690r032P506K0408K0287Q865p106j7741j6613p424
460b1162M718J0700J0404N939J827j620m066o854q903p075k81Q780J5071J2778
474B0256J863j0451j7649j4093k519R916J4999J1561K951m514q754q167n171l100
488a2872Q02N006R762J1404O244l413j4388j7756j0665M063J7199J9685J1226
501B6297m048j5831j7692r694J527J0464J2317Q623K975k405o216r533r164n465
515a7845K674J1090J4839J0516j38j2976j7283j2445Q3J2072J6616J1176J24q899
529I604j1655p725k755K337M642N710N404N036J790l647r192j1642o585L458J2130
544c090J4643Q880k443j2193j5054q636J372Q892J1432P605K115k963o219p371
$$ y = [18608, 24482, 17194, -622, -20312, -29344, -21838, -1430, 18857, 27722, 20616, 2875, -13738, -21162, -16444, -5744, 4660, 10599, 12426, 10806, 6740, -114, -9017, -16092, -16373, -7593, 7478, 20256, 22119, 11668, -5981, -20074, -22593, -12677, 2322, 13883, 16834, 12320, 3566, -4601, -9772, -12872, -12070, -7064, 2698, 14102, 20346, 16933, 2545, -15211, -25876, -21813, -4614, 15071, 26297, 22249, 6418, -11274, -20968, -19441, -8977, 3340, 11963, 14938, 12533, 6317, -3216, -12380, -17845, -15171, -4081, 10758, 21274, 21136, 8160, -9123, -21568, -21485, -9413, 7203, 18379, 18503, 9604, -2051, -9776, -12531, -10194, -5552, 158, 5562, 10598, 12388, 8741, -451, -12093, -18678, -15220, -3090, 11553, 20433, 17990, 5797, -9257, -17893, -16521, -7629, 3803, 11408, 13523, 10560, 4341, -3030]
558c030o577m234N67P985J1818J1037K336q957j6411j4413l648R862J7676J4165
572A8176L670q399j4411j2046l750M974Q482Q248M912J681j548n392q568q257
586a2228l896M610J1366J2913O865m634j2947j4100o625L838J1216J1374N392
599A3144j665n880o603m428k529j142J468N273Q222P325J477o258j1837j1667
613a5100l050O874J3542J1719L923n745j1575j0332m679K042O783Q136O623L238
627A2399j684o125r220q190l012M691J1756J2110N841l773j2192j3725p419L130
641a5413J1216J2552P498j811p617r450o532j930K085N559O661N609L094j902
655I619o803r887o592j31O706J1479R103J694o582j0644q376k362L818P481O354
$$ y = [-3030, -9607, -13841, -13274, -5289, 6529, 17566, 19902, 10945, -5466, -19879, -23527, -13665, 4011, 18176, 21846, 13447, -964, -13010, -16760, -11786, -3304, 4944, 9856, 11537, 9989, 4597, -3971, -12228, -16124, -11514, -148, 12765, 19630, 14996, 2049, -12051, -18676, -14838, -3622, 7752, 13144, 11479, 5599, -1004, -5432, -7961, -9103, -7635, -2362, 5860, 13185, 14662, 8404, -3433, -15100, -18150, -11276, 2266, 13985, 17908, 12163, 588, -9744, -14423, -12381, -5598, 2538, 9161, 12399, 10715, 4590, -4630, -12820, -15832, -11141, 615, 12725, 18566, 14793, 2601, -11124, -18543, -15413, -4197, 8355, 15853, 14042, 6425, -3025, -9557, -11487, -9402, -3843, 2818, 8427, 11521, 9619, 2816, -7071, -13663, -13794, -7088, 4391, 13494, 15188, 8606, -2038, -10414, -12776, -8958, -1477, 4877]
670D877L753M74k526m269n669n706k879K824Q179J0273O337k348r670j2677p637
685a6664J514R522J2261P923r32o670r090o564k378K145N156O739N816L276j882
700A0172p413r869p384J05Q341J1869R607M44q120j2204q966o80N723R621P048
715H294K088k693m400n068m329k455K64L717O756P098L552l475q596r340n582
730a4169K972Q474R558N756j546o487p681n053r06K372M217M752M412K711j325
745H057n125q251o598j217O374J0661R266J931o421j1224r226k740N416R216Q071
760H190L401k360n402o555m891k035J510M959O971O154K035m628q740q877l536
775a3804L712R390R812M351k842q287q130m137R59M845N551L979J743n49k033
$$ y = [4877, 8630, 9104, 6578, 2309, -3360, -9066, -11945, -9121, -942, 9331, 15668, 13320, 3650, -9027, -16664, -15150, -5628, 6633, 14556, 13624, 6954, -2136, -8700, -11078, -8933, -3777, 2962, 8778, 12054, 10172, 2759, -7110, -14494, -14389, -6048, 5821, 15428, 15872, 7752, -4452, -13418, -14098, -8375, 1246, 8294, 10382, 7689, 3289, -1779, -6108, -8563, -8299, -4582, 2174, 9272, 12824, 9349, 753, -8587, -14169, -11197, -2723, 6835, 12591, 11045, 4558, -3123, -8176, -9082, -6710, -2493, 2259, 6671, 9382, 8057, 2932, -5319, -11917, -13134, -6760, 3901, 13167, 15098, 8677, -2547, -11773, -14513, -9097, 119, 8190, 11591, 9231, 3829, -2726, -7617, -9652, -8142, -3183, 3788, 9942, 11977, 7349, -1391, -10268, -13804, -10092, -702, 9110, 13461, 10619, 2332, -5798, -9935, -8976, -4131, 1420, 5399, 7142, 6593, 4560]
790D560m594m958l949m1M719P764P020J524n050r452p782k342M570Q230P201K772
806A0192k319n277n233l533j022J079L329N270N076K659k285p111r036n209K355
821a1065Q818J0630N877k570q956r679m908J595O309O983M469j6j616l800m022
836a951l922k384P86N109P199N896J32n888q961p235k29N793Q474O514O57m186
852E804o287m606j755P17K624L329L260K905J353k222n101o279l784J653O377
867b012P947N082j062o270p980n872L07M795O808N457J322j964n121m694l444
882f701j104K297M602N454M290j08m270p383o444k056M593Q398P782K586m253
897G683p590p137k526K506N192N709K899k4k045l477l888l607j255K072N221N976
$$ y = [4560, -34, -4992, -8941, -8982, -4263, 3501, 10521, 12045, 6995, -2457, -10239, -12581, -8011, 219, 7420, 10192, 7873, 2596, -2637, -6170, -7192, -6113, -2784, 2486, 7562, 10221, 7936, 825, -8211, -13420, -11065, -2247, 8383, 14260, 11690, 2734, -6945, -11853, -10258, -3949, 3034, 7503, 7487, 5871, 2071, -1951, -5873, -8257, -7471, -2362, 4837, 10733, 10865, 4977, -3984, -11219, -11448, -5655, 2819, 9333, 9990, 5804, -483, -5089, -6844, -6127, -3503, -174, 3086, 5991, 7344, 5122, 21, -6258, -10042, -8389, -2012, 5935, 11017, 9955, 3685, -4295, -10167, -9860, -5065, 1743, 7200, 8522, 6558, 1437, -3257, -6701, -7805, -5508, -906, 4548, 8838, 8730, 4460, -2923, -9367, -11423, -6830, 1568, 9350, 11936, 7683, 93, -7044, -9570, -7064, -1872, 3837, 6736, 6712, 4667, 1190, -2698, -6305, -7560, -5488, -267, 5709]
913E709L277r42o110p003m155R78N203O085L667N74k925l913l512k188m37J237
929d455L695M734L870J38m141o497n945j208M465P145O083J597l593n922n242
944e276k469J180L631M335L947J882j044m129n856m176p58M174P028N847J298
959I614l291p050n723k426K396N134N315K935l19l003m308l528j895N75K897M147
975A470L923J765j721m397n127l704J57M455N850M634O64l292n633m627r50J702
991d831L805L623K441K71j331k916l200l566j120K232M642N505L497j770o058
1006A224p311l889J713O323P003L502j624m844m829k799K08J807K437K611K620
1021D152J847r79l480n156m440j85M434P373N203P22n516p144m409m61M205N242
$$ y = [5709, 8986, 8044, 1934, -5069, -9224, -8246, -3043, 3042, 6709, 7283, 4358, 445, -3067, -5255, -5692, -4455, -760, 3974, 7844, 7982, 3841, -2656, -8601, -9809, -5344, 1801, 7884, 9481, 5888, -34, -5276, -7745, -6565, -2934, 1401, 5348, 7230, 6186, 2057, -3799, -7975, -8733, -4559, 2469, 8316, 9614, 6323, -727, -6450, -8876, -6480, -1346, 3969, 6904, 6585, 3582, -726, -4254, -6149, -5574, -2677, 1470, 5393, 7158, 5437, 1040, -4087, -7791, -7634, -3179, 2671, 7305, 7969, 4677, -956, -5583, -6533, -4831, -1026, 2597, 5038, 5309, 3978, 1062, -2138, -5704, -6824, -4592, 50, 5555, 9052, 7282, 1224, -6087, -9976, -8263, -1940, 5063, 8565, 6941, 2097, -2732, -5531, -5323, -3516, -1079, 1532, 4152, 5999, 5020, 1540, -3616, -8056, -8241, -3807, 3566, 8769, 9491, 3975, -3169, -7578, -8039, -3834, 1408]
1037A408L391O60j717k440j957j792j519n74J481L530M163K477j525m826n443
1052d683l102J223M810N738L212o69l860m820l215l98J808L148L238K304K33j487
1068C480k892m035k579O7L109N460M048J207l161n794m958k075K777N140N673
1083E467J870j740m258m229k619M71K263K736K383K260J78j469l351m215k235
1098f488J184M080N024L077n10m182m813l274N7L019L743K722N89o51j884k552
1114h59k023j779J28K445L918L680P90k927m589m281j373K517M371M254J744j399
1130D617k937l641k169j137J496K836M003K330K04k696m645l657j431K535M509
1145B17M634J548j282l852m570k092J58K672L755K653J094r26k405l099k660r42
$$ y = [1408, 4799, 5459, 3742, 1302, -655, -2447, -3966, -4540, -3059, 471, 4634, 7111, 5586, 760, -4683, -7785, -6562, -1752, 3986, 7198, 6529, 2669, -2151, -5366, -5764, -3956, -808, 2430, 4734, 4967, 3480, 588, -3447, -6026, -5959, -2850, 2610, 6658, 7865, 4704, -1090, -6048, -8123, -5346, -206, 5467, 7337, 5597, 1339, -2890, -5509, -5038, -2775, -39, 2344, 4604, 4782, 3313, -38, -4253, -6488, -5304, -1224, 3800, 6877, 6367, 2185, -2628, -5902, -5845, -2826, 917, 3639, 4228, 3577, 1693, -859, -2882, -4661, -4533, -2088, 1830, 5510, 6300, 3373, -1216, -5497, -6870, -4353, 18, 4272, 6016, 4617, 1680, -1961, -4130, -5267, -3771, -935, 3068, 5398, 5602, 2906, -1739, -5396, -6827, -4292, 217, 4851, 6399, 5117, 1265, -3305, -5397, -5239, -2567, 1188, 3841, 4935, 4009, 1604, -1495, -4155, -5097]
1161e097J539L179M039J948o46l399m127k524j51K446L750L404N10j754k529k840
1177b252j849L93J321K503K147J818m2j386l718l221j770J787L869M648K270j382
1193E136l905m504k473Q31K815L725K896j24j522k449k347j925j93J058K476L525
1209C020K469k33l005m786l651P9L394M756L708K14k656m541k562p92J482K351
1225g53K035J404K26K33j804k531k334j178J671K895L642J996j180l975l348k206
1241e207R92K859L597J877P2j975k466k012j070r4J361K307K494J651l22k144
1257A920m047k959k77K466M258L603Q94k367l936l489j085Q63L137L288J448J77
1273C894j693k446j548j723l04J743K821L313Q80j118l120m035j848Q29L055M124
$$ y = [-5097, -3558, -379, 3660, 5608, 4962, 1563, -2564, -5088, -5239, -2793, 957, 4361, 4871, 3117, 588, -2252, -4101, -3708, -2387, 116, 2263, 4081, 4039, 2653, -1065, -4286, -6056, -4269, -400, 4248, 6518, 5136, 1231, -3273, -5746, -4915, -2100, 1625, 4521, 4397, 2875, 426, -1921, -3846, -4039, -2981, -505, 3020, 5489, 5256, 2251, -2535, -6186, -6107, -2713, 2043, 5751, 5965, 3309, -1232, -3794, -4586, -3104, -753, 1282, 2686, 2912, 3145, 1341, -1190, -3524, -4702, -3031, -136, 3506, 5502, 4322, 347, -3001, -5207, -4215, -1356, 2241, 4118, 4190, 2215, -251, -2263, -3333, -3427, -2066, 241, 2735, 4386, 4064, 1920, -2127, -5086, -5363, -2897, 1361, 4964, 5858, 3491, -445, -3934, -5019, -4156, -1019, 2269, 3717, 3894, 2201, -245, -1793, -3516, -3820, -2077, 744, 4057, 4937, 3819, 699, -3336, -5184, -4355, -1300, 2824]
1289B824J481k49k470k764j575n93P17J345K278J528P32l04k160k668k166q6K380
1306a750L064K909P15k040l454k629j165J190K755K280J440k8j229k027k085j432
1322c486r0J814K607K852J058j523l443l302j660J188L026L850J743j85k462l187
1338a200k123l53J401J561K425J479O1p15k582k384j709M97K275L299K369j40
1354D161k088l211k259o06J316K860K041J005m69j418j637j522j060O48J094K196
1370A051K041O67q57k553l213j366L98K969L262J733k97k272l018k095k56J521
1386b285J863K477Q40R3q68k382k200j271L78K240L026K325L12k608l354k492
1402c906k67J642K697K545J021j095k011j763j508l29J107J554J684J569J07j206
$$ y = [2824, 4305, 4056, 1586, -1178, -2753, -3346, -2629, -1284, 994, 2522, 3254, 2950, 790, -1878, -4044, -4130, -1750, 1314, 4223, 4938, 2898, -556, -3185, -4350, -3160, -405, 1875, 3315, 3287, 2058, 31, -2054, -3486, -3576, -1762, 845, 3697, 4755, 3232, -211, -3513, -5173, -3985, -959, 2891, 4634, 4449, 1987, -1200, -3323, -3676, -2275, -714, 1711, 3190, 3251, 2536, -46, -2430, -4139, -3642, -1367, 1932, 4301, 4161, 2073, -1138, -3397, -4003, -2687, 173, 2214, 3219, 2750, 1332, -305, -1827, -2887, -2239, -1145, 1051, 3092, 3759, 2902, 349, -2864, -4230, -3832, -863, 2399, 4132, 3835, 1563, -1455, -3550, -3806, -2285, -422, 2055, 2895, 2988, 2120, -262, -2462, -3733, -3355, -1115, 1911, 4236, 4548, 1940, -1414, -3906, -4173, -2531, 166, 2711, 3732, 2637, 626, -1137, -2645, -2974, -1867, -313, 1371, 2940, 3047, 1841]
1418A841k234k303j196J101K514K938J240o60k208k375j756M27J248J820J515
1433A912O26j45j065j482k047r19M40J705K384K029Q4j634l060k210p19J689K985
1450E73K330O04q53j942k196j200l44J243J900J619J215K46j489k368k240q90
1466c792J371K614K876R21r96k735k370j548L61K100K135J410J00n68j390j130
1482f41j384n12R46J282J873J646m71j752k119j822m85J766K409J642P13j075
1498B016j967j509r07OQ94J432J710O51K10j332j939j964n62J047K542K475R40
1515C743n80k484k941j393O47J615K838J475n9r35j868j491j197M54N95J834J371
1532A624J079Kj655k676j490J98J434K224K413J99j433k234j676p57P62J254J452
$$ y = [1841, -393, -2696, -3892, -2791, -277, 2661, 3901, 3241, 1033, -1342, -3098, -2671, -1423, 397, 1912, 2538, 2393, 1328, -154, -2201, -3120, -2680, -975, 1409, 3438, 3522, 1888, -1172, -3382, -4101, -2412, 573, 2903, 3507, 2654, 712, -1484, -2684, -3028, -1785, 115, 1734, 2949, 3195, 1706, -662, -2902, -3792, -2421, 193, 3069, 3990, 2994, 259, -2111, -3659, -3298, -1198, 937, 2347, 2447, 1879, 489, -641, -2025, -2537, -1591, -309, 1564, 3210, 2739, 987, -1132, -2954, -3439, -1673, 736, 2378, 3091, 2016, 49, -1460, -2367, -2361, -1467, -35, 1675, 2326, 2536, 1204, -735, -2699, -3261, -2214, 328, 2803, 3743, 3163, 679, -2262, -3655, -3008, -1393, 1445, 2920, 2861, 1926, 58, -1433, -2630, -2176, -1581, 253, 1624, 2703, 2705, 1050, -1626, -3116, -2918, -1484, 740, 3153, 3352, 1919, -315, -1991, -2748, -1986, -732, 720]
1549G20Q74L91m90j250j273j336j96O71K173J840J161o65k055k509j064L46J683
1566i79K526J233J20j510j445j583p39J36J042J478J737R11m43j524k236j939
1582c215j13K128K132J653O73j198k526j633r43P94J839J753Q18j71j013j023
1598d5j536l30k64J192J664J475P10j342j285k102q23L62J757K092J146m20r98
1615A253j664j236m43K11J089J613J010K24k24j577j340j357l6J361K109J589
1631B582J12j184j941j879l73N85J837J481R42q1q86j492j207o86J59R44J980
1648H93J549pn84j971j910q56R46J843J916R50o01j064k192o35l30Q25R92R84
1666G48J111M3p03j558j043r44K98J376J694J688m26j022j782j655l37R42J551
$$ y = [720, 1594, 1985, 1495, 245, -1028, -2364, -2560, -1889, 284, 2124, 3285, 2620, 565, -1944, -3008, -2662, -979, 1547, 2780, 2900, 1390, -55, -1638, -2377, -2241, -1199, 279, 2016, 2927, 2484, 960, -1276, -3215, -3328, -1200, 932, 2585, 3258, 2060, -466, -2099, -3042, -2248, -409, 1344, 2162, 1991, 978, -45, -1581, -1911, -2175, -983, 681, 2156, 2866, 1524, 239, -1863, -2686, -2324, -567, 1525, 2671, 2251, 1253, -411, -1647, -2090, -1879, -790, 823, 1833, 2057, 1833, 256, -1084, -2441, -2477, -1116, 993, 2582, 2694, 1510, -431, -2310, -2683, -2098, -261, 1220, 2162, 2081, 1195, -297, -1504, -2190, -2031, -1087, 893, 2442, 2435, 1851, -120, -2030, -2886, -1940, -97, 1819, 2769, 2168, 1104, -1088, -1723, -2053, -1228, -236, 748, 1859, 1902, 1199, -359, -1402, -2346, -2048, -672, 1022, 2710, 2284, 1262, -520, -2175, -2512, -1570, -19]
1683a9J190O64r6j039j090j008l95J10Q11J713J280lm60j788j788q29P37J705
1701c05J920R24l92j323j662j149n16J701Q65J060Q11j58j066j081j156n66M4
1718b049J693J770J086N3j798j612j321r3J241J625J016N38n98j443j041o54j86
1735a773P43Q29Q72J127j03n19j481j291o43O00J610J672N75Oj848j448r59L9
1753a992J033J178R55K69j21q28q63j040n86N38J155J542J086n07r98j780j323
1770b282k01J207K047J108M2k53j560j075r46K53O92J446P14N15j39q86j298q90
1788a506l66P51J053J830Q17o04j575j606o30J36R87J370J189p8o63j067o60q99
1806a521J41M76R27J053Q65l22r61j288j273k97J099J276J766n9p14j156j020
$$ y = [-19, 1171, 1835, 1739, 700, -390, -1398, -1793, -1683, -872, 841, 2121, 2118, 1658, -130, -1918, -2747, -2010, -305, 1615, 2539, 2147, 824, -838, -1987, -2503, -802, 63, 1123, 1934, 1776, 710, -371, -1527, -2093, -2049, -356, 1414, 2500, 2553, 755, -857, -2178, -2271, -1030, 595, 1611, 2149, 1551, 108, -933, -1587, -1773, -1030, -201, 671, 1798, 1695, 1176, -305, -1596, -2239, -1639, -29, 1643, 2218, 2224, 376, -1072, -2031, -1992, -959, 219, 1174, 1443, 1322, 494, -369, -1409, -1995, -1457, -302, 1240, 2326, 1819, 821, -959, -2282, -2483, -1276, 771, 1879, 1921, 1668, 108, -967, -1913, -1660, -968, 478, 1192, 1707, 1568, 682, -616, -1506, -1872, -1121, -68, 1762, 2579, 1975, 400, -1206, -1836, -1700, -713, 657, 1846, 1768, 1105, 38, -622, -1521, -1380, -904, 23, 1076, 1941, 1619, 658, -630, -1903, -2200, -1101, 175, 1941, 1882, 1168, 12, -1008]
1823a008j013N31N53J175J348Q5m77p22j336m81n03O56J683J172N66p23j478j243
1841a215p49R7J451J239R29p2j113n12j100j46K04M22Q98J026L47n42o35j700
1859a171o85P4J193J051R44M55r28j010j366o1K99Q20J169L27J6k64p62j055n53
1878a507m3Q19J039J052N66p16j208j270n55K44J064J209R34N1p64j220m34p91
1896a530j1R88J117P30K72k89j107j226p49K18J271J104Q00p0n05j570n37o41
1914a735Q15Q36Q37N14j25l87n30j249k87J62N58J272R28r2k48j446j120j52N0
1933a399J002J152N81j68p88p64m10n92L41M54R49N08M19p7j339q98n45J26J030
1952d18J012J384k94r04j030j148K5M68J047N26N66N0p28q67n98n45L92P15Q16
$$ y = [-1008, -2021, -1490, -937, 238, 1586, 1671, 1194, 472, -864, -1345, -1848, -1192, 491, 1663, 2229, 1506, 28, -1215, -1964, -1867, -416, 823, 1752, 1680, 567, 55, -1045, -1191, -987, -565, 333, 1359, 1706, 1164, 529, -1171, -1856, -1782, -589, 462, 1406, 1861, 933, -77, -1443, -1504, -1205, -385, 784, 1111, 1127, 863, 101, -954, -1507, -1550, -731, 308, 1360, 1926, 1210, 2, -1268, -1823, -1579, -515, 694, 1628, 1679, 915, -305, -739, -1530, -1541, -553, 564, 1294, 1566, 1277, 170, -1056, -1805, -1587, -316, 788, 1588, 1518, 1013, -557, -1094, -1735, -920, -84, 753, 1267, 1142, 755, 225, -1024, -1311, -1149, -591, 681, 1609, 1517, 1269, -177, -1297, -1449, -1399, -397, 755, 1336, 1168, 380, -384, -794, -1386, -1045, -591, 358, 866, 1285, 1208, -131, -1029, -1574, -1448, -418, 594, 1978, 1684, 780, -250, -1398, -1373, -905, 142, 668, 1234, 1284, 556, -311, -909, -1454, -1062, -347, 469]
1971D69P89p6m09r09j089m49O85J162R18K56j98j029r25k45j03O71M93O26L81
1990A018l8m90p77r90N8k8J039R42P63j59n69j371o96k81P48J146N46N43j5j049
2010C40p77m76k51K43O77N66J235q4p11j084o38p19N52J199J124L12l75q86j063
2029h16n07K15P59M55J164j35j44n22o65o56k01K66O58J036N70n33l75r56q98
2048a285LP75P98R59J95o13q76n44l73j9M45N43O13J39L89o24j139l81l53O25
2068g23Q68Q92L52k51o88j418j95R2N33P24O74K76k34n99p13n33O2K84N47R76
2088I26P55o43p12j109l02n48Q51J216M87K38n01o22q71m03K61O36Q43N22j74
2107H50m7p88q19n5j59M13R37M57L07n07q22o38l44L52P43N06O31P2m99o62l03
$$ y = [469, 1258, 1182, 773, -136, -1225, -1674, -989, 173, 1091, 1347, 1149, 120, -805, -1050, -1153, -482, 11, 637, 1018, 980, 490, -287, -1277, -1219, -1247, -208, 734, 1497, 1338, 769, -602, -1298, -1579, -831, 315, 861, 1404, 1389, 340, -437, -913, -1164, -921, -244, 322, 1557, 1473, 762, -322, -960, -1679, -1127, 72, 1196, 1508, 1133, 247, -816, -1323, -1108, -349, 106, 1270, 1135, 991, 469, -196, -852, -1053, -787, -129, 907, 1477, 944, 569, -387, -1285, -1282, -507, 291, 1250, 1445, 832, -44, -588, -961, -980, -535, 8, 621, 760, 1149, 525, -614, -995, -1348, -723, 145, 1037, 1389, 1138, 450, -968, -1163, -1071, -538, 186, 860, 1136, 902, 303, -410, -943, -881, -597, -50, 926, 1681, 1038, 326, -783, -1085, -1633, -782, 434, 921, 1159, 658, 36, -835, -1238, -977, -341, 502, 1024, 850, 803, 15, -804, -859, -1018, -605, 332, 789, 1096, 589, -233, -871, -1215, -863, -120, 386, 1017, 1089, 590, -72, -375]
2128c75n30J1L83Q76N66L65m85p35p84p32N40M56R83P32j31m76j016m25J37K6
2148f14K13J090M44J5l66l62p39j014M49L59R87N09N48o39j097p18m05M24P80
2167a36Q60K16r7o70j13m72p66L65Q06L39O60r9j55p42q79l48J19R76N33O45L09
2188A351q15o40n22j65j78Q32N34J72L50n45l36o13m62L29L85M12J224j23n34
2207F56r57n03o06N97M72R91K93p7m29p23l22k00K38N08L83N37k27P0p20q66r1
2228i76K67N80Q46M05l5r31n40l99k65M05O49L60P57l74m40n48l12m73J80M13
2248d31R79K07K37n80m60o56m26M74R31M88M00l33o00p68k74k63M78M70N91N56
2268A020j8l62q32p39j16M73O09Q77Q6J57j085k45n83j03M11M27N37L22j54l94
$$ y = [-375, -905, -894, -511, 365, 931, 1296, 811, 76, -708, -1440, -900, -444, 539, 1271, 1140, 664, -352, -777, -640, -614, -401, 689, 1133, 1148, 782, 420, -319, -1333, -884, -525, 462, 971, 1519, 880, -217, -935, -1340, -916, -136, 724, 940, 843, 173, 60, -412, -1178, -813, -7, 332, 992, 893, 738, -4, -883, -1231, -1112, -136, 397, 1042, 1351, 536, -104, -626, -791, -969, -137, 397, 569, 919, 374, 38, -575, -1037, -708, -323, 89, 1313, 1190, 656, -301, -804, -1410, -813, -341, 650, 943, 866, 437, -286, -608, -808, -570, -62, 321, 858, 631, 701, -19, -885, -976, -709, -129, 717, 1122, 1087, 156, -384, -783, -1048, -643, 6, 366, 1123, 749, 309, -239, -551, -1024, -844, -431, 548, 755, 992, 412, -48, -704, -1130, -656, 275, 763, 1163, 830, 230, -538, -812, -1075, -597, -127, 464, 1020, 1002, 640, -192, -931, -1047, -574, 35, 912, 998, 1155, 70, -175, -758, -861, -450, -23, 514, 836, 682, 288]
2288B88k50q65j00L87N2R39N47m40m40n92o13J07M28O96N08M66l23p35o96k7n46
2309a209N94N06N34L34J45n96m11p50j92L20M23O54P47k54m18q48k49j25n8J249
2329C96J93L75j90l35n28o87j28N33J92R97J23l94k97n77p14K7N43K31J134l3
2349H61j44p70l70k09k3M77N30M35p9J89r26l11k59l19K55Q49K20M37J72q83o03
2370d71j38l08N18P60L25n5j08m16l11n25K12R6M20M84nJ08k52o33l81k09K94
2391e95Q00N43K18l26p24m17n20L54O9Q17K94K40j49p65l29k41l48Q72M33N74
2411H00J57n11j51p21o06K51N18M73L64J94O9q63m13j98m5M12O22N7L86L7p24
2432A08m48m67k5O27M08M53J05k1p76m01j71o1M81N98J36J90l44m62m99l28K93
$$ y = [288, 38, -827, -927, -540, -488, 451, 998, 558, 118, -474, -1087, -980, -552, 144, 652, 1118, 795, 60, -636, -663, -1209, -615, -109, 425, 759, 904, 308, -103, -853, -1045, -725, -302, 352, 1099, 845, 427, -421, -670, -795, -853, 396, 589, 964, 774, 439, -89, -776, -904, -371, -179, 818, 941, 547, 250, -327, -1041, -1014, -471, -240, 894, 861, 717, -53, -423, -632, -655, -178, 352, 787, 708, 897, -29, -340, -599, -918, -663, 186, 406, 843, 1015, 132, -471, -609, -917, -399, 361, 686, 631, 523, 107, -204, -729, -517, -421, -1, 483, 478, 586, 334, -299, -680, -889, -595, 205, 748, 966, 640, -84, -501, -1021, -667, -598, 219, 513, 753, 604, -161, -490, -731, -1079, -207, 226, 800, 957, 446, 295, -426, -1032, -781, -263, 210, 574, 768, 837, -26, -439, -637, -682, -270, 352, 409, 795, 832, 108, -340, -807, -832, -205, 203, 656, 761, 740, -36, -437, -608, -669, -188, 410, 546, 736, 392, -70, -569, -897, -604]
2453f04M28M07K72N6N4o26p38jJ36L37N65L59kl46l08p35N9K51M70K11K57k07
2475B95J90l27n92k6l61P68L03M01K22l70m77p95M7J31O37K91M00l31l9o52p2
2496c57k13J99K9N36M92M6k62k31o84j42kL97N52O72j10o64o22k93k42L36M76
2517h7L99J63O6j58m37m34j31K8N69P4L95M22m90o68k99r8K60N86L24M2j57k52
2539A17n93J33o8k29O11M42L25j88j4n39n17jr0M69N05J94l8l83n40n2j51L80
2561b27L38N12j23k92N8l24l28l23N29J34O93J79j2l72m93n75j59L62N28P49k77
2582E77J13n91j40o56J78R5O35K78J32l14k06l29j98l27M50M06J99L69k41m53
2602b3m52j66NM17O52J56J01k58m3o17n10L25K30K69O19r4k65l52n8o80J05J42
$$ y = [-604, -176, 231, 503, 559, 613, -13, -751, -752, -616, -279, 286, 645, 643, 297, -11, -746, -687, -436, 34, 245, 502, 295, 485, 158, -434, -460, -821, -53, 250, 651, 873, 503, 26, -769, -722, -591, 46, 337, 737, 406, 367, -285, -357, -570, -371, -342, 194, 686, 732, 470, 239, -445, -587, -589, -192, 360, 1032, 922, 258, -364, -657, -899, -563, -87, 312, 475, 541, 383, -54, -488, -619, -591, -22, 52, 447, 869, 379, -289, -588, -686, -426, 160, 484, 526, 369, 117, -476, -343, -411, -640, -29, 413, 738, 550, 536, -3, -520, -521, -611, -142, 363, 557, 519, 136, -404, -456, -607, -227, 111, 623, 500, 208, 266, -58, -386, -709, -180, -46, 647, 826, 814, 442, -51, -626, -785, -423, 105, 854, 577, 690, 99, -41, -697, -519, -424, 211, 489, 621, 307, 101, -228, -426, -753, -303, 103, 302, 671, 430, -23, -475, -641, -636, -219, 433, 589, 690, 432, 389, -228, -738, -413, -183, 86, 705, 611, 346, -6, -64, -744, -639, -497]
2624d97O04J73L13k30j45m33n85L06Q2M69L97j49K26nm76m78k13R4N03N70K58
2645G84k22n37j90r04M18K37N92M04L07n33k28m28l70J21K78N56K04J50k30m26
2665a7k16k16j27N09L17J91Q1p0n15m20P3k8N04r6N84K72o23m37O1j85l84M47
2687b95J48O14J85m94k08k83q4j92L83N74j69M01k73m83k09pLJ34O0Q03J7l44
2709B81j18n0q58M20J52L47J79M20o09l57j61j0j06K63N26K83j21m80Ln34K88
2730b42l57L12P01R4j59m7k97l41k92J90K45N58j4J46k97m13j98P6K75k39M80
2751A81R1J84k33j42j60k95lK88R0N39k14k21l78o8J00q8J78M81J80l76M0j02
2773G2l28J3J13J64P5L28J22l43J25r49O5M29K55N8L72l77j89j28m27J11L29J99
$$ y = [-497, 107, 280, 593, 363, 218, -215, -800, -494, -412, 57, 454, 305, 531, 526, 50, -428, -641, -547, -44, 526, 784, 562, 25, -165, -1069, -651, -414, 178, 582, 889, 356, 128, -300, -670, -549, -271, 285, 489, 639, 409, -17, -233, -449, -576, -67, 250, 441, 522, 452, -63, -483, -410, -438, 66, -30, 554, 826, 203, -234, -173, -358, -742, -295, -147, 467, 652, 158, -50, -333, -417, -609, -226, 348, 179, 580, 307, -176, -385, -392, -389, -255, -195, 608, 625, 281, 163, 113, -745, -325, -173, 174, 353, 773, 164, -193, -354, -364, -470, -207, 319, 602, 481, 1, 4, -530, -242, -599, -287, 414, 508, 349, 302, 5, -336, -628, -438, -193, 365, 351, 497, 200, -213, -411, -335, -60, -299, 181, 272, 456, 223, 81, -79, -374, -377, -89, 1, 540, 326, 105, -273, -341, -241, -329, -151, 330, 510, 134, 174, 72, -256, -243, -130, 34, 109, 437, 559, 216, 341, -608, -543, -114, 141, 199, 571, 194, 5, -123, -550, -439, -110, 89]
2795H9L2P1j63n5J21n57K73j06L53K88L8O7m06p5j52l52O3L95K71lQ3j20k48O5
2819b8l98P3M37J03K60J4o80m1j25O2o3O58J34K32l49J69o83k53J13M8N35q6R2
2842B24K4k61k88L0k62L45L92n1J22K63n84j84j51K78K5K80J45J68l74r4k51l3
2864b37r2p3O65k29K00N6l26j47r2j31L20RK37j27J35j5m15J86p2r5K56L39j81
2887A71j24k21j57K17n03N74J22Q2P4J9k29P0m88K67n1L65OJ3J80o58J86l33J06
2910c12L26j68L84k5r7j37r8l69K88Q3J49M86j95l22N2k73k49L06j03J97M47k03
2932A67K12m44p4j44J00J45L1J31M5j56j6o3j96r0Q6O83r7j08r8l9l92J92k27
2955c52K58K07J80j96K34k33k1l49J77J65J56k9J09N9l58j68j94K32J8M75j94
$$ y = [89, 121, 192, 29, -26, 95, -462, -189, -295, 58, 346, 384, 451, 45, -30, -182, -534, -471, -76, 195, 192, 275, 155, -93, -28, -426, -353, 84, 187, 447, 461, -219, -260, -385, -323, -386, 272, 406, 638, 289, 458, -225, -478, -365, -317, 218, 132, 224, 248, -13, -301, -271, -533, -188, 204, 153, 275, 538, -46, -230, -381, -103, -78, 202, 347, 515, 141, 47, -204, -237, -329, -402, 263, 34, 234, 290, -36, -183, -275, -406, -86, -77, 160, 33, 168, 153, -262, -76, -148, -243, 13, 352, 171, 47, -174, -331, -114, -617, -43, 79, 161, 235, 254, 25, 95, -393, -126, -177, 188, 194, 207, 387, -271, -85, -418, -312, 14, -154, 230, 205, 108, -29, -127, -496, -208, -125, 24, 510, 315, -7, 45, -228, -477, -171, -274, -77, 370, 167, 379, -65, -139, -283, -183, -38, -7, 124, 169, 13, -3, -66, -262, -352, -266, 417, 320, 212, 114, 75, -317, -125, -352, -94, 113, 293, 97, 331, 98, 77, -272, -95, 70, 226, 197, 306, 365, 7, -161, -355, -123, -105, 370, 176]
2976A76N1l8j21j53k09K51K68M3K6o9l5k97qj3K5N8M49j44m8j08j49j96j40K55
3000a26O9J64jJ64k20J18m82J77J29L12k55J24J68j56k72m24J8K13K4K79L35P
3022C65k75j69l10R9KK93L28o0K97j90l1n23K18j91J38J23K87l53Rn96P1K51j54
3045c71M96K86j53P6l90J73l85j10N05j65O07n89J01q7P2l39k08K48K3L96R1J20
3067C97k63mo01O1K58K48j36L57O3l22l98J64j55L07pPL59j86L6k71J4P0k69L54
3091H3J52m1J76j43m77L07O0k50L1K00J01k0Pk82j99M58o77M38M31L2j61j86l4
3114Fl86N34j90M33k10k00J94j90j44l87L89k7L25J43p9L4M2n23J81L5j14K84
3136A50j23J83l21J07j79j17K70m6R6O0K65l64O6l04N3L14j40K01O3K11j39l98
$$ y = [176, 227, 189, 68, -85, -294, -43, 225, 268, 294, 225, 190, -107, -115, -128, -103, -45, 404, 260, 212, 104, -45, -241, -381, -126, -57, 107, 106, 270, 50, 168, -314, -137, -8, 304, 49, 173, 341, 185, -87, -511, -493, -280, -256, 23, 358, 365, 90, -79, -389, -290, -288, 5, 333, 273, 570, 380, 349, -174, 44, -147, -9, 114, 401, 48, 57, -539, -468, -217, -371, 125, 411, 258, 334, -56, 117, -268, -378, 127, -38, 569, -20, 81, -6, 66, -273, -481, -233, -210, 186, 277, 397, 134, 130, -471, -410, -152, 96, -40, 317, 380, 58, -340, -176, -331, -24, -31, -24, 335, 149, 185, -86, -72, -2, -271, 83, 235, 194, 370, 227, -250, 57, 117, -133, -102, 98, 199, 179, 186, -96, -295, 163, -514, -76, 355, 387, 226, 40, 6, -380, 154, -36, 397, 187, -13, 181, -9, -153, -540, -151, -178, 147, 290, 211, 245, 287, -236, -55, -20, -134, 150, 27, 210, -111, -4, -183, -300, -30, -76, 20, 80, 345, -19, 47, -257, -204, 110, -30, 171, 234, 445, 306, -92]
3158i2J77k60r6M03J27n0J94j59j97P9l25L11m49M89K06n8l01q8j61j32R7K83
3180bm6k3J18r2Mk72N20n22L55J29J08J24k62k16l81K01K1L79j30L26K43l40n34
3203b92j23J03J00J02L01k2K53k01J10n23J91k73J70M14J05l45K57l63r4mm0M4
3225a30N78k57J57k24l66n9m1K13L06j96K88r7J06n9l84k36J77L27m8K90q8k58
3247ak44J41k94L05J51j80K27L8M6l88K25k37L4J52M6J81J2J13j90j49l12L39
3269A5OP7K55j39n5k42j03j79K29J72L02j27k56J40Nn87L53J54K7k8R5K70n88
3292b04J22j06j57nM70N6K05k57L5m64J95J77k2j9k49K20J57j70k98J72j61K46
3314e7n1L16Lj18o0j22k80K8R3K21k3K57k1l30K10jl67J72K80k32J98O6r6j72
$$ y = [-92, 85, -175, -271, 132, 259, 209, 403, 244, 47, 126, -199, 112, -337, 152, 358, 300, -1, -89, -250, -382, -285, -2, -48, -71, 47, -45, -41, -313, 207, -315, 40, 169, 277, 401, 139, -77, -458, -257, -236, 143, 13, 339, 582, 242, -292, -415, -312, -212, -110, 191, 169, 422, 221, 331, -192, -1, -274, -104, 310, 415, 70, 327, -36, -130, -134, -174, -130, 448, 191, 348, 124, -242, -301, -342, -129, 177, -19, 269, 172, 278, 219, -165, -401, -224, 103, 55, 345, 257, -1, -245, -104, -398, -93, 58, -122, 105, 143, 189, -199, 26, -211, -177, -25, 21, 202, 214, 327, 137, -12, -324, 15, 21, 98, 353, 214, 159, -83, -186, -365, -136, 36, 338, 211, -45, 95, 100, -487, -134, 20, 47, 19, 114, 384, -204, -82, -188, -345, -350, 120, 176, 381, 124, 159, -305, -110, 67, 45, 26, -223, -3, 154, -16, -314, -142, -303, -57, -108, 208, 211, 93, 33, -89, -369, -341, -248, -27, -50, 207, 186, -144, 66, 65, -302, -130, 150, -82, 116, 182, 86, -86]
3338h6j44r6K84lN4J93K49n63J65j03l27M21N9m7K90j8l78j87o6j54K76K60Q3
3361A62J10K41p24j15K77n6Q0K20j30K36j5n63N7OK4K56k60k3N19Qj39l32J07
3384e4l05J95L76k5m8k73k7J42k0l16K78M52n38O18m42k46K16J26m90P6L31J52
3406A78l21K06Q4k85o9J84O9J69L53m71ml29K7L27L8l39J39L71k92J77n28J75
3428a41Q5k22M10K1K00l11M1q7j29J06r2K8O8K70l00J71r2j2j36J5J45J13r8M0
3452I3L38n11k35o0J07L43mN5n0K7k11L17k94k12L62L2J48j70J58j03O4j50m93
3475d49O62k24M7J95K17n61J29l95L70k8K10L20l61L46o23J10j06k99N92k22J10
3496D0J90j50k48j01K9K20N4K73k94l47M30j61NK3P3k08K11J31q1n3j2p2J21l43
$$ y = [-86, -230, -326, -42, -45, 9, 202, 451, -112, 53, -50, -377, 44, 103, 56, 346, 328, -50, -237, -303, -457, -181, 79, 162, 272, 513, -211, -326, -49, -105, -25, 195, 65, 301, 286, -277, -220, -214, -190, 66, -194, -217, 302, 310, 171, -161, -54, -359, -164, 212, 187, 139, -134, -161, -19, -39, -355, -77, 375, -163, 455, 13, -233, -17, 109, -381, -305, 26, 178, -143, 63, 147, -138, -207, -23, 46, 215, 568, 97, 93, -236, -209, 118, 156, -183, -44, 327, 35, 212, -316, -141, -56, -278, 132, 153, 353, 42, 83, -4, -133, -27, -119, -91, -23, 247, -53, 118, 26, 14, -122, -107, 38, 151, 53, 93, 431, -80, -315, -375, -268, 75, 71, 126, 76, 103, -108, 209, -85, -297, 65, 97, 245, 75, 233, 130, 194, 44, -449, 213, -11, 36, 231, 448, -113, 16, -379, -9, -37, 173, 493, 132, 478, -145, -35, -141, -440, 152, -70, 40, 230, 80, -168, -269, -240, -20, 34, 307, 13, -334, 96, -65, -60, -37, 36, -172, 39, 170, 89, 36, 24, -48, 73, -270]
3520b70K77j88M80j67j31j70k9J66k02J57K02K08k71m6J10l51J43J54k03J33J75
3541A77J57k30q4j94j31J48K92k31M64j92J47o12K19J21k73k47K54L90m66M26
3561A35k0p5k51J16K17J59J64j16j50n5l22o8L73k25K90k45K26K03m22k45M35
3582A24m62N66l8k03K47l64j0k16J74N2J98K57Om71K28j86j38k6l0M90n7r5j44
3605i8J62j2q9Pl4L20K18j18k74K7M8j37pj57N02m65J72J68m41K91l06p7N06m01
3629a95n7M44K9r7r6j59O9k18q2M92l1M7K0k89O5M3JK46mO7l54J31k59k9J81K52
3655B17n30L26K62m32n0K23m28M19J85L0k96J77j93J30k37K51m22L63p1P0J71
3676A65O0o16N06J3k10K21n06O24Rk72m1k94J89l1K8M72m02J49K13k55mk09O1
$$ y = [-270, 7, -181, 299, 132, 1, -169, -198, -32, -234, -77, 125, 333, 62, 16, 126, -225, -82, 72, -131, 2, 177, 334, 104, 20, -174, -305, -157, 135, -96, 368, 176, 323, -289, -70, 51, -222, -469, -215, 175, -291, 135, 115, 40, -211, -95, 122, 281, 445, 329, 179, 124, -198, -266, 107, -118, 172, -73, 153, 356, -66, -311, 124, -338, 228, 190, -13, 234, -130, -140, -356, -182, -130, 68, 325, 331, -140, 88, -98, -236, -262, -292, 198, 141, 46, -98, 64, 52, -37, -30, -64, 256, 474, 356, 82, 109, 157, 20, 13, -144, 358, -107, 65, 233, -208, 83, -223, -300, 206, -195, -252, 192, 221, 124, 28, -131, -62, -280, -362, 130, 99, 146, 166, -123, -58, -15, -14, 232, 228, 295, -59, 72, -187, -216, -35, 217, -313, 13, 275, -157, -207, 16, -412, 7, 192, 222, -74, 103, -90, 40, -197, 54, -368, -5, -76, -6, 165, 225, -391, 115, 128, -82, 139, -367, 257, 266, -6, -47, -341, -152, -183, -155, 317, -85, 64, 277, 22, 18, -191, -130]
3699a30Q8J63K04j68J15n08K14j96j50O98l29K90j07J76l96K69j64j36j69J06
3719a30K58j64J8l8J87k25J41j33P2p4L42k77O4l54M0K34LL39k40K42l03o4L03
3742B41j67J94k85k4L49l86J21J82j05n46L09N8K54j26J57j14l47K28l2j16J30
3763b5K0j3L51l69R4N1P4l41J65L8J4P0j62l3r4J49k78L57j9o5M2O2k71Qj72J8
3789c29J86K75n2k23J57m8j36O6K29j98O0K64j03N2k15k64J33L47J73k69l1k1
3811E3k51j61L46j95j10J67M27j44O2k94n6lp2J8M57j53j96J56J60l88N1%j65
3834b91M04KOQJ49l02n6j68o4K71K86l79J14J11k72j55K37K3K52J23m67N71j82
3857B21j36J89k13mj5q3R6L7n5l0R9p7j43N8L28j01l66K2m3K15k95L64k25L04
$$ y = [-130, -42, 121, 325, 157, 272, -236, -22, -218, -368, 330, 1, 291, 184, 360, -36, 233, 69, -67, -236, -130, 128, -36, -18, -56, 131, -94, 47, -86, -14, -88, 254, -23, 41, -313, -273, -39, -36, 303, 63, 305, 2, -62, 241, 74, 268, -17, -41, 308, -78, 43, 225, 120, -426, -117, -59, 195, 69, 226, 112, -235, -7, -39, -155, -25, -5, -18, 333, -36, 58, 109, 183, -158, 7, 45, 59, 129, -33, -66, -160, -11, -289, 68, 49, -16, 26, 88, -183, -175, -347, -329, -143, 132, 80, -143, 14, -34, -170, -104, 125, -73, -13, 251, 148, 200, -15, -279, -146, 201, 374, 105, 74, 53, -198, -359, -13, -208, -318, -151, 276, 132, 194, -100, -156, -159, -231, -213, 244, 91, -105, 51, 211, -177, -126, -126, -291, 113, 115, 121, 129, 278, -24, -80, -248, -312, -41, 245, -134, -20, 91, -181, -336, -99, -76, 176, 299, -168, 403, 221, 85, 274, 61, 57, 42, -41, 55, 92, 37, 7, 106, 29, -114, -56, 272, 171, -195, -173, -216, -1, -296, 68, -157, 147]
3881A47K42l32Ql73K89k8L9K3J11j04J00j16j44mL81k61o0j72ML62n8j70klJ79
3906E8k01L70k9j17K19l73P5n7J75p7j9q0k1K79j86j9N8lP7K8J00N2r5l52O4J43
3932F9K3k53K79J02k88K71m15l11L57k3kJ59j18L01k24J30O5l51K11k1j19J90
3954C2j7o9K56l99K18R2k43P8J23l2m5j39P4J24J13p5l1p7L9pM6O1l77L33J79
3979B57l01J4Lo4J21j75J93j41K29j56p7P2J27k69O5J04R6j05j52L99k30j37J3
4002a14k4J20N2L1q3K17m58M50m6J66m23J16j28MM09j79l32J52j80oJ95J43R5
4025A77Q1j97n1K6L1j25J04O1j06L52m02J88j85KJ38M4q7P2oj29k1J26j10J23
4049A06k37K82q4J37j29J1j76J58k42k27M33k27L42j73j86P0K26k95M30k42M1
$$ y = [147, 389, 57, 65, -308, -19, -47, -8, 15, 126, 22, 122, 6, -138, -142, 239, -22, -82, -254, -250, 112, 54, -116, -118, -121, 58, -143, 227, 198, 81, 300, -73, 2, -55, 120, 43, 24, -56, -77, 202, 16, -3, 55, 52, 129, 157, 257, 309, 214, -138, -74, 69, 92, -161, 118, 220, -68, 203, -212, -523, -166, -189, -191, -32, -150, 151, -73, 57, 122, -229, -18, -39, -158, 32, 15, -54, 202, -197, 21, 113, -130, -52, 71, 39, -6, -145, -71, 53, 166, 91, 60, -17, 22, 15, 61, 122, -255, 78, 257, -44, -30, -27, -91, 30, -145, 48, -93, 136, -20, -97, -25, 102, -167, -102, 2, 98, -7, -159, 240, 10, -127, -114, -138, -18, 34, 65, -18, 199, -259, 191, 145, 311, -112, 4, -124, -120, 289, 110, -222, -70, -250, -256, -61, 82, 177, 258, 61, 10, 36, 67, -58, 46, 107, 1, 353, -49, 139, -46, -44, 94, 138, 51, 123, 117, -12, -33, 93, -17, 106, -131, 151, 67, 204, 75, 86, -90, 68, -174, -401, 32, -195, 147, -26, -212, -142, 84, -211, 219, -23, 18]
4070A8k96K51j65K91l54M58k04J32J14N1k56j46J79j83R0j6m0J26m2k22K62j7
4092C1%m2l61M13K89n01L64j66j25j8Q1L36l16N9k09K59j84nP1K57j31l08M74
4115B68l87J69l2j29nj33M26k99j49J87Q8q8K19o3P7k88K36J35K5o20J05J63j2
4138a07J80K7o1k76kK85K18l38K44k4jk44Q4j11J92j68q8K70j59L8K4j6o8j58
4162b59L90l65J25J69j68K00k67K71q3qN3j09q1J78K1J37m68l8K42K69k74J81
4184A16m4k64Q7N4L38k94r7R7n1k2K68j89j02L14m16J46K97k85K91k74J72O1k46
4207d3j70K92j18J22O8R0m80J29J25k57K33mJ16L0K1l0N9m30K00L7j38K04k82
4230b26J38P3r2J12P8n85K88K07PK99k81N9j64J40j22J08j29J12p8J69m0j34m3
$$ y = [18, -278, -27, -192, 99, -255, 203, -1, 131, 245, 296, 40, -106, 73, -110, -20, -36, -76, 50, 8, -214, 48, 31, 31, -11, -372, 41, 330, -171, 193, 27, -98, -116, -35, 301, -15, 44, -165, 94, -90, -95, -24, 233, 102, -206, 268, -119, 50, 18, -111, -116, -249, 177, -122, -271, -84, 4, -84, 135, 72, 149, -139, 97, 232, 257, -363, -258, -95, -107, 73, 100, 39, -237, -239, 46, 264, -74, 170, 146, 145, -99, -15, -126, 66, -102, -190, 80, -79, -41, -17, -33, -101, -259, 131, -234, -109, 60, -108, 92, -175, 96, 13, 5, 58, -51, -132, 46, 67, 204, -264, -302, -60, 209, -65, 116, 72, -192, -105, -51, 287, -7, -104, -7, -58, -80, 188, -1, -103, 211, -205, -59, 238, -47, 244, -30, 142, 203, -43, -213, 79, -39, 83, 151, 241, -239, -110, 15, -242, -9, -13, 103, 133, 154, 124, 183, -247, -47, -10, -148, 56, -226, -88, -15, -107, 5, 83, -502, -214, -7, 0, 299, 18, 77, -87, 53, -69, 39, -90, 22, -56, 113, 73, -61, -104]
4253a04J16LO4r7J35K5k48J43K95m71oJ42p8p7K73k08K62j48J10k72J65q4p2L3
4277i9L63j31j24P8J69j40j7j67K2k36L51r7O1LK07k09K8K8kj85M4MJ40k99J55
4302e3N27p21J65R6m0j5l5L21j72K6k15K89j44L07k38k55K02j24K35l06L15j88
4324b3J17k06L62l60m6J30L29m44j77M09L3m5m0O9J62M2l11K50m74J24K64o6J30
4347B29j39j55l6L1J65l44J20QJ78m5k29J05K80l58J12J23pJ01l52K74l09K08
4369d0J69k07N7l8j53K18N0jL00k33l08L18l59M67n0Rk19P5m6j15K70j44r7J42
4393F5n6j92J04J96j62k1L53n47J36n8K27q0P9l8J40l32L35l2j43r8J77n7N6k00
4417a48pQ2K84L2l12k50L8L60r8P3l1o5j56Q0R1J91k17J42j87J88k30K02K22k33
$$ y = [-104, 12, 15, 79, -18, 117, 142, -106, 37, 332, -139, -145, -3, -81, -158, 115, -93, 169, 21, 131, -141, 24, -60, -132, -99, 264, 133, 9, 87, 256, 116, 99, -68, -46, -282, 69, -28, 33, 36, 243, 34, 62, 90, 88, -97, -53, -49, 91, -208, -53, 474, -247, -82, 14, -26, -41, -76, 245, 73, 99, -116, 173, 29, 336, 98, -157, 45, -79, 156, -150, 165, -23, 94, -112, 250, -110, -156, -26, 303, -141, -318, 91, 124, 79, 39, 108, 270, 312, 1, 251, -223, -99, 165, 99, 229, 90, -65, -101, -70, 95, -249, -129, -121, 57, 12, -217, -112, 168, -190, -78, 45, 38, 139, -213, 61, -248, -40, 129, -78, -21, -59, -212, 6, 56, 55, 355, 122, -186, 132, -227, 240, 190, 199, -20, 55, 9, -106, 164, 20, -77, 65, 9, -183, -79, 117, -45, -66, 287, -260, -124, -182, 45, -35, 44, 6, 146, -186, 149, 117, -26, -124, 53, -4, 52, -148, -155, -73, 211, 243, -69, -319, -281, 79, -19, 54, 23, -42, -198, -118, -27, 164, -53, 89, -98, 90, -140, 62, 284, 51]
4441E1K0Q5j68j00K17L3j75k82J01j08L92j71K53l23K09j26P4L0j31J46R4l46
4463b25Q1M26m02r3J66O0j69J80j57L98l99P9J75k01J52k8R4l7k16J69p1m2n6
4486a16Q8L6M5j99L10l91L42k04j67K56K06o1k01J39J99k72K6j14OJ6j0J31o3
4509BRq7R7P0N7l04K7l9L11l4n2m9m7l5K10j74J67m50N36k84j5q4j1M33l02K57
4535B09oj78L1J01n3pk31J61R2J04k45J6j19P7L5j10N3R3P2j48N2K55m60K06j3
4560a3j39K73j34K13n28M15o2k27P7M28j81L3J84m93M6j30K80K6l7M3j31Q7K37
4583B67j06l01l7K74K09m30K00R4j18O5k01J20j30K69l1j24ml6j70j4K33N3N4
4606A36N9k16M19m74k22M5M76l65J3L19j94j34J05m4K77j78k9N4l63L63J71q1
$$ y = [51, 71, 156, -12, -112, 105, 138, -37, -319, -218, -326, 66, -105, 148, -175, 34, -92, -18, 12, -119, 27, 121, -225, -144, 282, -120, -213, -47, 13, -156, 24, -133, 265, -134, -55, 120, -81, 71, 43, 137, 100, -116, 53, -18, -60, -116, -28, 8, 53, -146, 164, -227, 115, -89, -256, 0, 206, 145, -56, 83, 282, 10, 36, -78, -72, -56, -66, 65, 2, 11, -76, 21, 91, 148, -156, -129, -168, 143, 109, 57, 8, -39, -74, 136, -38, 129, -321, 215, -69, -84, -168, -179, 254, -48, 209, 203, 25, 56, 157, 104, 97, -134, 27, 119, 223, -22, -6, -125, -48, -13, -123, -70, 23, 95, -53, -1, 254, -206, 0, -13, -152, 121, -13, 200, -328, 87, 25, -202, -125, 303, 122, 155, 339, -154, -108, -238, 42, 68, 31, 74, -57, 30, 267, 161, -140, -177, 97, 306, -124, 76, 170, 52, 117, -84, 36, -94, 175, 144, 20, 16, -20, -190, -204, 29, 82, 136, 195, -21, 398, -76, -298, -253, 223, -142, -129, 190, -4, -138, -33, -77, 200, 22, -7, 47, -316, 47, 218, 137]
4628A37m2p0N1R1j02K01k31j86N9J94m5j33m0P2J87N8J9l73K4J15K14pn99N90
4652A84J6N1j91j13M6j06o2K1R2j71L93j1p6j35J46k64L88L9m35J93m1Om0k44
4676c14j43O96j99p3J92l11J64k65L35k6O2l20P8P0J12l5J23j39o0K77k99O8j55
4699a62J59k2J6M8k30L88j67N6k5m06J22K78l81M57O5k45P4j60O7L67m90J17j22
4722a96J27K19l18J01K9J03qJ48J64q5r3j58j67qM2L7n9K06l3K91k52j32l6J28
4746E0l2k76K28J42Q8k40J98J41m77L09j70J20J02j48j17r5K97m5J5l2n8L7k4
4769A3o4k57M92m01J46J91j69K92lj07o9j06J20k41J81Om17M62k97J93n2L41n66
4792c12M29k79L7N7Q1l5r1J14K00j58oN1j6J65l33M80l98l7J62j26L71l65K59
$$ y = [137, 95, 25, 76, 167, 65, 266, 35, -151, -92, 102, 57, -76, -116, -44, 143, 201, 220, -153, -129, -14, 200, 193, -406, 184, 200, 251, 60, -53, -7, -113, -175, -154, -62, -233, 160, 149, 73, -62, 84, -180, 208, 247, -188, 5, -36, -30, -70, -314, -457, 239, 40, -33, 159, -152, 12, -253, 82, 56, 118, -202, -124, -54, 58, 23, 146, 7, -53, 224, -75, -7, -162, -3, -25, -9, 39, -191, 197, 30, 86, 61, -345, -223, 55, -326, 131, 196, -49, 25, -135, -68, 299, -191, -74, -196, -69, 150, -168, -67, -38, 65, 57, 205, 369, 284, 191, 33, -134, -142, -100, -63, -122, 84, 51, 342, 90, -42, -78, 50, 18, -258, -30, 112, 200, -40, 158, 299, -178, 131, -39, 81, 183, 35, -82, -177, 120, 75, 90, 58, 0, 37, 13, -51, -308, 184, -217, -71, 120, -49, 243, 240, 133, 64, -42, 78, -163, 18, 24, -393, 69, -228, -35, -87, 254, -312, 117, -162, -125, -68, 13, -22, -113, 1, 201, 43, 37, 88, 72, 237, -96, 384, -14, -51, 111, -15, 356, -9, 250]
4815B50j14o4J9j95J16j12K65p7j24J7J17l45K73j53j36K08j63j57L40n6K77l87
4837b01M71m42K61k29J02j1K02J0k57O6l12L90m63M11J2r5J93j41Q4n3K15k91
4859g8J7n7J86RJ39k12j50K67N3j80K9n6j8K71l68K9o0j7K05r3k24L43m51M57
4883D1jJ03N8n25K88j89J54N1k78M1N99m16j02L1J18K72k64q5J11J7r0o2m0P3
4907i5j33M12Ol70Q7J22J21R7k21K32k27l32J84J21n2Pr5J99k80K76M6k94K98
4930A09j06q5K8o8J92l7M9j83n7K60J86J16j33k79l33O41m9l26L6K5l0K95l22
4953g1p3L62N6m78J9M79j71L7oj11M4j53J71P6k20j8j39J40L8J88m01J79L49j97
4977A00K00m47L74j97k13R8K19k43K7Q8J02K4l0l23L58n45L75M29p90M58n7j74
$$ y = [250, 136, 72, 91, -104, 12, -100, 165, 88, -36, -19, 98, -247, 26, -127, -263, -55, -218, -375, -35, -91, 186, -201, 270, -172, 89, -140, -38, -49, 153, 163, -94, -28, -340, 50, -413, -2, 10, -85, 108, -33, 51, -2, 213, -78, -61, -118, 68, 77, 216, 4, -146, 121, 174, -6, 23, -33, -51, 220, -148, -119, -179, -196, 9, -84, -308, 35, -416, 41, 40, 143, 201, -324, -36, -225, -71, -20, -298, -257, 342, -74, -176, -145, -27, 245, -19, -104, 7, 24, -66, -128, -168, -95, -228, 184, 190, -180, -93, 29, 150, 247, 26, 258, 31, -301, -117, 4, -48, -41, -136, 63, -217, 59, 105, -189, 109, 3, -82, -54, -122, 70, 33, 82, -101, -158, 102, 288, 404, 271, -8, -341, 300, 251, -75, -39, -14, -44, 251, -71, -144, 218, 274, -204, -185, 294, 123, 160, 154, 43, 87, -66, 105, 181, -39, -57, -196, -56, -18, 170, -231, -52, 297, 100, 300, -147, 227, 30, -183, -85, 134, -109, -82, 6, 108, 132, 102, -221, 137, -408, -33, 396, -394, 64, 7, -167]
4999a67j67L46M6n9N5J8k46R7J80k62J25K2J51k71L28Ok08Pj87L22j91P3J18K04
5023C40l26J55l06K47j43k47M64k49R6k72J35J12J5Kr4kJK44k50J13N1J6o3J28
5047A67j17J41k67n3N8k59k4O23l50J41J32j79O5j49M0J26R9l33L06k18j3K23
5069A59l52K37P8m16J99j45K29O1m4j21O5l32L99j36K45j35k9M9j48j27J41J84
5091F1j17J05k41Q6K6L8M09l02q2J96k51O1L5nQ7k08m9J04j41N9M8N5K04l10L6
5116i6L82j95j18j07P7N0p5P0J27r0n4j07J79J26N7M2k11l7j10P8q5J0P5R1j66
5141h7P0J03j55m2J03no7l3L32k51N5o4r7M9O4j7M7N0L3j04Ml71K56r1J24m3K34
5168I7Mk47K79pk56L50k18j0k07L30K5k22K48k88J25k65L0K53j36l8J06J12q3
$$ y = [-167, -334, 12, 58, -1, 54, 72, -174, -77, 103, -159, -34, -12, 139, -132, 196, 202, -6, 1, -186, 136, -55, 18, 136, 340, 14, 169, -137, 110, -33, -280, 184, -65, 31, -241, -106, 6, 21, 23, -71, -73, -72, 172, -78, 35, 86, 102, 39, 167, 50, 191, -76, -129, -71, -330, -354, 269, -81, 60, 192, 13, 78, -71, -31, 95, 194, -139, 167, -51, -64, 159, -193, 44, 122, -294, -95, -240, -11, 50, 6, -115, -50, -382, 17, -119, 126, -9, -38, 11, -137, -264, -123, 61, -56, 49, -192, -106, -80, -42, 367, 65, -17, 179, -72, -11, 24, 19, 106, -102, -151, -47, -188, -129, -81, -26, 178, -132, -96, 286, 91, -27, -134, -57, -7, -82, -12, 115, 25, -29, -136, 43, 169, 226, 268, 57, 20, -90, -12, -97, -87, -12, 79, -87, -17, 86, -69, -111, -8, -13, -80, -113, 219, -32, 23, -41, -138, -89, -25, -42, 5, 55, 88, -16, -12, -383, -127, -218, -94, -137, 97, 101, -146, 133, 126, -130, 220, 2, -8, -215, 115, 140, -82, 166, -122, 3, -262, -232, 21, -115, -153, -47, 65, -18]
5191a8m2K52n43N15j63J6m1J35k63M04n79M17k28K81k35O3j1l9Q1j93K64k02Q1
5214d8k11P9J47OR4j7l47L02L0m1P1J43j99m8j00L48k23N9p9K48j02m0K5j87j4
5239a04K81k26J73m05K69J84k98J5J0K38n7qn34N11k36K50n8j33L60k63j4Q7j74
5262a32r7l9L84k26O0l27M53O2j40l64N02q8j39L36l95K65M2J9l40n6J56J66k3
5285G9l34J86K4J82J09l13R7R4k55R3M2Kq1P5j12J77nnk0m12M32P6k93K3O0K62
5311A83m63K71R3L27m08l36L55p3j41L91j65k5J03j59J90l48M8J64J11j96J9O0
5333AJ80k84K8L7JJ0L55k96k2J46k83l5j44M17j78K59l05n2J09j4J94J1j45k23
5357b33L43m1K98j90j90o0J82K19k53L14j96j64L16l74n3J0m7K85k59K78K2k21
$$ y = [-18, -60, 192, -351, 164, 1, 17, -24, 111, -152, 252, -327, 90, -138, 143, -92, -29, -40, -79, 2, -191, 73, -129, -48, -259, -180, -33, -27, 67, 50, -297, 5, 35, -6, 65, 208, 9, -39, -139, 209, -14, 45, -34, 214, 112, 72, 97, -90, -104, 177, -49, 124, -281, -12, 172, -126, -111, -101, 137, 80, 72, -462, 49, -187, 63, 5, -128, 232, -31, -45, 42, -132, -229, -268, 116, -110, -50, -377, 76, 138, -2, -366, 136, 48, -91, 245, -150, 115, 157, 176, -164, -220, -64, 102, 79, -255, -69, -45, 137, 246, -67, 30, 124, -131, -38, 4, 6, -75, 0, -112, 65, 60, 55, 35, -377, 55, 131, -162, -139, -79, 183, -280, -9, 84, 411, 3, -333, 22, -51, -192, 199, 34, 9, 112, -47, 143, -205, -157, 7, 118, -78, -59, 1, 181, -103, -75, -38, -37, -27, 328, 32, 10, 156, -127, -162, -306, 111, -67, 192, -113, -165, -56, -70, 124, 135, -10, -233, 110, 69, 367, 177, -13, -73, 109, 328, 75, 389, 193, 29, 345, -29, -82, -72, -119, 166, -93, 185, 207, -14]
5379a4j11K16l01J61k9j31K57k99L77j68q4N7O2J19J7K9k20J2J45Pj51J10kj47
5403h8K24l28M11m39M28J38m78J21j75J16j09R7N1J6K1o9r7R5Q6mn9K82l40L11
5427B11n07K49k73K31R0K81l58K64k2l01L71L01m82j39j34K30L31n21J27Q5k0
5448A4l5K03k78L7j67K33n5J64k20Q8J83Q6l85N6k11J96K97k18j40K33q3l06K64
5471d4q2O2j83N89n00R6L33l80rJ12j45P6M29n11J71l02M34j03k27L29j93J73
5493A25j31J02k24k89K69L04k74Q6j43K04j16Q4J54m42K06J57m5j10L24j95J5
5514F1j62K99o7m0j13N6p2m9O7M4j26k01M5K59R8l68J73J38l67O7K47L7m4J71
5538A53l1m08k1L67L68m41Q0J07j91J18J67o7l59L25J2j28R6j33J49k94P9j18
$$ y = [-14, -125, 91, -210, -49, -78, -209, 48, -251, 126, -42, -126, -69, -7, 112, 129, 158, -62, -50, 95, 102, -49, 61, 59, -88, 136, -192, 219, -220, 208, 346, -132, -11, -186, -70, -179, -82, -31, -15, 6, -63, -160, -65, 21, 17, -42, 240, -100, 211, -296, -47, -320, -89, 1, 282, -76, 188, 166, -135, 236, 537, 55, -84, -218, 12, 343, -178, -51, 34, 14, -21, 182, -96, -59, -226, 7, -48, 116, -104, -16, 167, 253, -132, -76, -287, -91, 206, -12, -152, 81, -2, -308, -44, -126, -64, -247, 342, -158, -62, 271, -109, -118, -6, -151, -75, 354, -157, 14, -288, 146, 43, -184, 145, -48, 125, -6, 96, -128, -417, -148, 156, -118, -32, -175, 29, -87, -3, 151, -291, -85, 72, 27, -83, 241, 46, 61, -101, 198, 131, 91, -22, 34, -38, -87, -20, 24, -102, -303, -258, 1, 99, -269, -96, 42, -325, -258, -11, 26, -18, 153, 122, -286, -307, 60, 428, -13, 67, 174, -17, 101, 268, 201, -158, 167, 179, 51, 147, 14, 163, -131, -52, -170]
5560a70J50P2j20L33l96L97j12j37j25J03k72M66k12N2J14l55L08j13J9l48M77
5581A31lK81m44k66K17p7L56j57M9J22j33k19R7K7KK8M74l26j94k5j23K46MK67
$$ y = [-170, -20, 52, -68, 265, -131, 266, 154, 17, -108, -5, -277, 189, -23, 29, 143, -212, 96, -17, 2, -346, 131, 128, 409, -35, -301, -84, -161, 195, 38, 87, 209, 76, -143, -46, -19, -17, 11, 485, 159, -35, -60, -183, 63, 67, 334]
$$ [...]
8191h2
##END NTUPLES=NMR FID
##END=
