##TITLE=1H_PR192_S
 Met-d4, 8 sc, 
 1.10.2020
##JCAMPDX= 6.0         $$ Bruker NMR JCAMP-DX V2.0
##DATA TYPE= NMR FID
##DATA CLASS= NTUPLES
##ORIGIN= UXNMR, Bruker Analytische Messtechnik GmbH
##OWNER= root
$$ XWIN-NMR		Version 3.5
$$ Thu Oct  1 09:54:14 2020 Russian Standard Time (UT+4h)  she@DPX200
##.OBSERVE FREQUENCY= 200.1315066352
##.OBSERVE NUCLEUS= ^1H
##.DELAY= (6, 6)
##.ACQUISITION MODE= SIMULTANEOUS
##.ACQUISITION SCHEME= undefined
##.AVERAGES= 8
##.DIGITISER RES= 18
##SPECTROMETER/DATA SYSTEM= spect
##.PULSE SEQUENCE= zg30
##.SOLVENT NAME= MeOD
##.SHIFT REFERENCE= (INTERNAL, MeOD, 0, 15.7039)
##AUDIT TRAIL= $$ (NUMBER, WHEN, WHO, WHERE, WHAT)
$$ ##TITLE= Audit trail, XWIN-NMR		Version 3.5
$$ ##JCAMPDX= 5.01
$$ ##ORIGIN= Bruker BioSpin GmbH
$$ ##OWNER= she
$$ F:/spectra/data/she/nmr/H-F/1/audita.txt
$$ ##AUDIT TRAIL=  $$ (NUMBER, WHEN, WHO, WHERE, WHAT)
(   1,<2020-10-01 09:52:22.89 +0400>,<she>,<DPX200>,
      <created by zg, POWCHK disabled, PULCHK disabled
       configuration hash MD5:
       00 E9 B6 7A A2 85 ED C7 34 08 36 98 17 FE 4E 26
       data hash MD5: 16K
       C1 AA 8B 67 6A 46 0B 68 6C 8A 46 4B 48 3E DF 99>)
$$ ##END=
$$ 
$$ hash MD5
$$ D3 32 58 76 26 3F 52 16 5D 3F 24 F4 E6 B3 C8 14
##$RELAX= 
##$RELAX= 
##$RELAX= 
##$RELAX= 
##$RELAX= 
##$RELAX= 
$$ Bruker specific parameters
$$ --------------------------
##$DU= <F:/spectra>
##$EXPNO= 1
##$NAME= <H-F>
##$PROCNO= 1
##$TYPE= <nmr>
##$USER= <she>
##$AMP= (0..31)
100 100 100 100 100 100 100 100 100 100 100 100 100 100 100 100 100 100 
100 100 100 100 100 100 100 100 100 100 100 100 100 100 
##$AQSEQ= 0
##$AQ_mod= 1
##$AUNM= <au_zg>
##$AUTOPOS= <>
##$BF1= 200.13
##$BF2= 200.13
##$BF3= 200.13
##$BF4= 200.13
##$BF5= 200.13
##$BF6= 200.13
##$BF7= 200.13
##$BF8= 200.13
##$BYTORDA= 1
##$CFDGTYP= 0
##$CFRGTYP= 5
##$CHEMSTR= <none>
##$CNST= (0..31)
1 1 145 1 1 1 1 1 1 1 1 1 1 1 1 1 1 1 1 1 1 1 1 1 1 1 1 1 1 1 1 1 
##$CPDPRG= <>
##$CPDPRG1= <>
##$CPDPRG2= <>
##$CPDPRG3= <>
##$CPDPRG4= <mlev>
##$CPDPRG5= <mlev>
##$CPDPRG6= <mlev>
##$CPDPRG7= <mlev>
##$CPDPRG8= <mlev>
##$CPDPRGB= <>
##$CPDPRGT= <>
##$D= (0..31)
0 1.2 0 0 0 0 0 0 0 0.06 0 0.03 0 0 0 0 0.0002 0 0 0 0 0 0 0 0 0 0 0 0 
0 0 0 
##$DATE= 1601531542
##$DBL= (0..7)
120 120 120 120 120 120 120 120 
##$DBP= (0..7)
150 150 150 150 150 150 150 150 
##$DBP07= 0
##$DBPNAM0= <>
##$DBPNAM1= <>
##$DBPNAM2= <>
##$DBPNAM3= <>
##$DBPNAM4= <>
##$DBPNAM5= <>
##$DBPNAM6= <>
##$DBPNAM7= <>
##$DBPOAL= (0..7)
0.5 0.5 0.5 0.5 0.5 0.5 0.5 0.5 
##$DBPOFFS= (0..7)
0 0 0 0 0 0 0 0 
##$DE= 6
##$DECBNUC= <off>
##$DECIM= 32
##$DECNUC= <off>
##$DECSTAT= 4
##$DIGMOD= 1
##$DIGTYP= 9
##$DL= (0..7)
0 120 120 120 120 120 120 120 
##$DP= (0..7)
150 150 150 150 150 150 150 150 
##$DP07= 0
##$DPNAME0= <>
##$DPNAME1= <>
##$DPNAME2= <>
##$DPNAME3= <>
##$DPNAME4= <>
##$DPNAME5= <>
##$DPNAME6= <>
##$DPNAME7= <>
##$DPOAL= (0..7)
0.5 0.5 0.5 0.5 0.5 0.5 0.5 0.5 
##$DPOFFS= (0..7)
0 0 0 0 0 0 0 0 
##$DQDMODE= 0
##$DR= 18
##$DS= 0
##$DSLIST= <SSSSSSSSSSSSSSS>
$$ [...]
##$SUBNAM2= <"">
##$SUBNAM3= <"">
##$SUBNAM4= <"">
##$SUBNAM5= <"">
##$SUBNAM6= <"">
##$SUBNAM7= <"">
##$SUBNAM8= <"">
##$SUBNAM9= <"">
##$SW= 16.880792210976
##$SWIBOX= (0..15)
0 0 2 0 0 0 0 0 0 0 0 0 0 0 0 0 
##$SW_h= 3378.37837837838
##$TD= 16384
##$TD0= 1
##$TE= 0
##$TE2= 300
##$TE3= 300
##$TEG= 300
##$TL= (0..7)
0 120 120 120 120 120 120 120 
##$TP= (0..7)
150 150 150 150 150 150 150 150 
##$TP07= 0
##$TPNAME0= <>
##$TPNAME1= <>
##$TPNAME2= <>
##$TPNAME3= <>
##$TPNAME4= <>
##$TPNAME5= <>
##$TPNAME6= <>
##$TPNAME7= <>
##$TPOAL= (0..7)
0.5 0.5 0.5 0.5 0.5 0.5 0.5 0.5 
##$TPOFFS= (0..7)
0 0 0 0 0 0 0 0 
##$TUNHIN= 0
##$TUNHOUT= 0
##$TUNXOUT= 0
##$USERA1= <user>
##$USERA2= <user>
##$USERA3= <user>
##$USERA4= <user>
##$USERA5= <user>
##$V9= 5
##$VALIST= <valist>
##$VCLIST= <CCCCCCCCCCCCCCC>
##$VD= 0
##$VDLIST= <DDDDDDDDDDDDDDD>
##$VPLIST= <PPPPPPPPPPPPPPP>
##$VTLIST= <TTTTTTTTTTTTTTT>
##$WBST= 1024
##$WBSW= 4
##$XGAIN= (0..3)
0 0 0 0 
##$XL= 0
##$YL= 0
##$YMAX_a= 248492
##$YMIN_a= -220967
##$ZGOPTNS= <>
##$ZL1= 120
##$ZL2= 120
##$ZL3= 120
##$ZL4= 120
##$ABSF1= 10
##$ABSF2= 0
##$ABSG= 5
##$ABSL= 3
##$ALPHA= 0
##$AQORDER= 0
##$ASSFAC= 0
##$ASSFACI= 0
##$ASSFACX= 0
##$ASSWID= 0
##$AUNMP= <proc_1d>
##$AZFE= 0.1
##$AZFW= 0.1
##$BCFW= 1
##$BC_mod= 2
##$BYTORDP= 1
##$COROFFS= 0
##$CY= 11.3945322036743
##$DATMOD= 1
##$DC= 2
##$DFILT= <>
##$DTYPP= 0
##$F1P= 16.9975609425685
##$F2P= -3.02152046262296
##$FCOR= 0.5
##$FTSIZE= 0
##$FT_mod= 4
##$GAMMA= 1
##$GB= 0.15
##$INTBC= 1
##$INTSCL= 1
##$ISEN= 128
##$LB= 0.24
##$LEV0= 0
##$LPBIN= 0
##$MAXI= 10000
##$MC2= 0
##$MEAN= 0
##$ME_mod= 0
##$MI= 1.114404
##$NCOEF= 0
##$NC_proc= 0
##$NLEV= 6
##$NOISF1= 3.799351
##$NOISF2= 2.8
##$NSP= 1
##$NTH_PI= 0
##$NZP= 0
##$OFFSET= 15.70392
##$PC= 1
##$PHC0= -9971.039
##$PHC1= 15.80089
##$PH_mod= 1
##$PKNL= yes
##$PPARMOD= 0
##$PSCAL= 0
##$PSIGN= 0
##$REVERSE= no
##$SF= 200.130013532006
##$SI= 16384
##$SIGF1= 3
##$SIGF2= 2
##$SINO= 400
##$SIOLD= 16384
##$SREGLST= <1H.CDCl3>
##$SSB= 0
##$STSI= 0
##$STSR= 0
##$SW_p= 3612.71676300578
##$SYMM= 0
##$S_DEV= 0
##$TDeff= 0
##$TDoff= 0
##$TI= <>
##$TILT= no
##$TM1= 0
##$TM2= 0
##$TOPLEV= 0
##$USERP1= <user>
##$USERP2= <user>
##$USERP3= <user>
##$USERP4= <user>
##$USERP5= <user>
##$WDW= 1
##$XDIM= 8192
##$YMAX_p= 0
##$YMIN_p= 0
$$ End of Bruker specific parameters
$$ ---------------------------------
##NTUPLES= NMR FID
##VAR_NAME=  TIME,          FID/REAL,        FID/IMAG
##SYMBOL=    X,             R,               I
##VAR_TYPE=  INDEPENDENT,   DEPENDENT,       DEPENDENT
##VAR_FORM=  AFFN,          ASDF,            ASDF
##VAR_DIM=   8192,          8192,            8192
##UNITS=     SECONDS,       ARBITRARY UNITS, ARBITRARY UNITS
##FACTOR=    0.000296,      1,               1
##FIRST=     0,             0,               0
##LAST=      2.424536,      0,               0
##MIN=       0,             -220967,         0
##MAX=       2.424536,      248492,          0
$$ Real data points
##PAGE= N=1
##DATA TABLE= (X++(R..R)), XYDATA
0@%%%%%%%%%%%%%%%qJ6j6J6k3L1l2L9m7N6o4P2q8J01j14J32j51J72j95K19k48
$$ 0 0 0 0 0 0 0 0 0 0 0 0 0 0 0 0 -8 8 -8 8 -15 16 -16 23 -24 32 -32 40 -48 53 -61 71 -80 92 -103 116 -132
36a32K80l12L51l96M39m89N44o01O67p38Q15q99R90j091J204j328J461j611J780
$$ -132 148 -164 187 -209 230 -259 285 -316 351 -387 428 -471 519 -572 632 -696 765 -846 934
55I34j966K176k414K688l010L388l841M398n098O015p275R129j2164J8255n3940
$$ 934 -1032 1144 -1270 1418 -1592 1796 -2045 2353 -2745 3270 -4005 5124 -7040 11215 -42725
70d2725J57860J10827j14723j53872j39167M0019R9519J70555R8675j54161k16649
$$ -42725 115135 225962 111239 -42633 -181800 -141781 -42262 128293 226968 72807 -143842
81a43842o0844J07748K07647O4113p4100j12807j39207k5320J51242J76375N0511
$$ -143842 -204686 -96938 110709 174822 100722 -12085 -151292 -176612 -25370 151005 201516
92B01516j64948j86562p317R4709J21250R7055l3162j42009j48435K912J81945
$$ 201516 36568 -149994 -157311 -62602 58648 155703 122541 -19468 -167903 -164991 16954
103A6954J38318k0724j10940j24772l6969O1745J22866J21453l9411j79986j13747
$$ 16954 155272 134548 23608 -101164 -138133 -76388 46478 167931 128520 -51466 -165213
114a65213M5620J52109R4761j9824o6999j16090p9456P3646J60534R1918q4214
$$ -165213 -119593 32516 127277 107453 40454 -75636 -155092 -81446 79088 171006 86792
125H6792j58940n5976M2162R3080R6295J8232p6363j39924o4093J08980J45125
$$ 86792 -72148 -128124 -85962 7118 103413 121645 45282 -94642 -158735 -49755 95370
136I5370M1207p7088j14269m9508J3751Q1318J22474J8571j17042j27590j4996
$$ 95370 136577 59489 -54780 -104288 -90537 -9219 113255 131826 14784 -112806 -127802
147a27802J08763R9100J9997l6620r3809q2492J6357J09701J10195j5477j21380
$$ -127802 -19039 80061 100058 63438 -30371 -112863 -96506 13195 123390 107913 -13467
158a3467q3626M071O6410Q5945M3647l1286j09938r3800M8481J27215O6927l3406
$$ -13467 -97093 -93022 -26612 59333 102980 71694 -38244 -132044 -83563 43652 110579 77173
170G7173q8347o4618j4128M6247J07553N8795o8367j18931n3075O1985R8709M1160
$$ 77173 -11174 -75792 -89920 -43673 63880 122675 54308 -64623 -117698 -55713 42996 84156
182H4156j2625o3451q6693k5280P1818J13996L3545q7853r4133k2534L9567P2580
$$ 84156 71531 8080 -78613 -103893 -32075 81921 115466 27613 -66520 -89054 -49487 23093
194B3093N8875K415p8941j02280l670R7228Q6599L820o6082o9027l2871J9472
$$ 23093 81968 84383 5442 -96838 -100508 -3280 83319 87139 21057 -47970 -80841 -61369
206f1369Q2020P8113j7531r9756p8719K1286Q1946N8351R534l9198p5875n3910
$$ -61369 20651 98764 81233 -18523 -97242 -75956 5990 64341 73875 34677 -41198 -95108
218i5108L3405J01657O2734m3886q8738m7152J4989N5323O2803K8609m6476r5170
$$ -95108 -61703 39954 102688 58802 -29936 -77088 -62099 -6776 56027 84636 38160 -57010
230e7010m2133N8717R1005L3335l9741o2538m5475n716N5501Q2134K2426o9213
$$ -57010 -99143 -40426 50579 83914 44173 -18365 -63840 -69556 -14055 68079 90505 21292
242B1292q9060j5192N8950O4225K8620j7451o0605o3944l297P6924P9459m294
$$ 21292 -67768 -82960 -24010 40215 68835 51384 -9221 -73165 -76462 462 79921 75627
254G5627p1590o1559q457L7680N6867M4824j4677p8440o4600K1142P9470N4266
$$ 75627 4037 -57522 -65979 -28299 28568 73392 58715 -19725 -84325 -63183 16287 70553
266G0553j2708n0961n0504k4341L0545P4072M6831l5587q2775m1549L1651N9582
$$ 70553 57845 6884 -43620 -67961 -37416 36656 83487 47900 -34875 -76424 -44773 14809
278A4809M0349K223m1507o3641k8493M6348P9699K6808m6544o3322k6969J7478
$$ 14809 55158 57381 15874 -47767 -76260 -29912 49787 76595 30051 -33271 -60240 -42762
290d2762M7616N0124J0699n3778p2353j1300N8489O2845J1412l5345m8312l4629
$$ -42762 4854 54978 65677 11899 -60454 -71754 -13265 49580 60992 25647 -22665 -57294
302e7294O570N7513N9203m085o5579n7223M897M8429M5296J7570k1924n5610m4142
$$ -57294 -50724 6789 65992 61907 -3672 -60895 -55998 -7569 37727 55297 33373 -22237 -66379
315f6379J7231O8503M7532j9604n6517l9252o87L4249M9204K8122k8981o6716
$$ -66379 -49148 19355 66887 47283 -9234 -48486 -49173 -14924 34280 62402 33421 -33295
327c3295l4744L3083O0045L0072j6628m1949l9206j1190L7390N9668K0678m2742
$$ -33295 -68039 -34956 25089 55161 38533 -3416 -42622 -53812 -16422 43246 63924 21182
339B1182o0152j8051L1701M4738K7856m945m2657m9359o371M9785N6122L845m2972
$$ 21182 -38970 -57021 -25320 19418 47274 42329 -328 -49687 -56058 -6273 49849 53694 10722
352A0722m3848j4415J9600M2948L6966o830n3282m7326Q919M9950M0077L88l0987
$$ 10722 -33126 -47541 -27941 15007 51973 45143 -8139 -55465 -46546 3404 43481 43869 12882
365A2882l9594k3422J8576N2463L5965j9864n4302l2709J3668L8891L3572Q421
$$ 12882 -26712 -50134 -31558 20905 56870 37006 -17296 -50005 -36337 2554 36126 44547
377D4547k7646m7815k3576K9426N4516K2529k5614m2796k5285O255L3444L9998
$$ 44547 16901 -30914 -54490 -25064 29452 51981 26367 -16429 -41714 -35459 -2015 37983
389C7983R616l6396m8809j2108L4353M3871J4702j8780l5614l0561K610M0204
$$ 37983 47599 11203 -37606 -49714 -15361 28510 43212 24432 -11182 -41743 -39133 1071
401A071M2715O78m2346l9589k846K8096L5038J8579j3796m0806l2930J0593M5498
$$ 1071 43786 44464 2118 -37471 -40317 -12221 22817 41396 27600 -13206 -46136 -35543 9955
414I955L2893p649l5790l1021n674K2353L7775K2150j9428m5955k5662J8965M0345
$$ 9955 42848 35199 -591 -31612 -37286 -14933 22842 44992 25564 -20391 -46053 -27088 13257
427A3257K3414o211k8061l2612j0383K6445M2739J5598k6824m0500j6431J7119
$$ 13257 36671 30460 2399 -30213 -40596 -14151 28588 44186 17362 -23138 -39569 -22450
439b2450L2541K4283j814l0525l5517o489L2593L8892O508k5921l2084j5839J2163
$$ -22450 10091 34374 32560 2035 -33482 -39971 -7378 31514 38022 12101 -19983 -35822 -23659
452b3659L2224K8563m258l6605l2486K626L1008L0439N715k0539l1953j8031J3986
$$ -23659 8565 37128 32870 -3735 -36221 -33595 -2587 27852 33567 13028 -18925 -36956 -22970
465b2970L6791K4592j1546l5137k4708N250K5570K6831R288j9958l5768j6413
$$ -22970 13821 38413 26867 -8270 -32978 -27728 -2158 24673 33961 14003 -21765 -38178
477c8178J9874L6537J7461j5363k8245k1435P19K6059K9464P471k4133l5677r322
$$ -38178 -18304 18233 35694 20331 -7914 -29349 -28630 -2571 26893 34364 10231 -25446 -34768
490c4768K1793L0179J4655j2437k6393k1775n45K8357L0925J501k6178l0170o191
$$ -34768 -12975 17204 31859 19422 -6971 -28746 -29291 -934 29991 31492 5314 -24856 -31047
503c1047J9671K6364J6387j0277l0730k1429N659K9055K5392k163k3376k5611
$$ -31047 -11376 14988 31375 21098 -9632 -31061 -25402 3653 29045 26882 3506 -22105
515b2105p841J8014K8148J5294j2551l1376j8437R942K6081K0554n41k1037k5493
$$ -22105 -29946 -11932 16216 31510 18959 -12417 -30854 -20912 5169 25723 25182 4145 -21348
528b1348q842J9595L0471J0214j5830k7688j4531R523K2874K0336J023k3469k5563
$$ -21348 -30190 -10595 19876 30090 14260 -13428 -27959 -18436 4438 24774 25797 2328 -23235
541b3235n528K1218K8888O335j6902k3209j4111Q401K3565J9664l71k5705k3840
$$ -23235 -28763 -7545 21343 27678 10776 -12433 -26544 -18143 5422 25086 24715 -990 -24830
554b4830K14J9305K4765O887j6277k2175j4639R480K5926J6691m102k3753k1540
$$ -24830 -24616 -5311 19454 26341 10064 -12111 -26750 -17270 8656 25347 21245 -2508 -24048
567b4048J794J8116K2204P778j6569k3629j1618J1042K5361J3558o533j9647j9883
$$ -24048 -22254 -4138 18066 25844 9275 -14354 -25972 -14930 10431 23989 17456 -2191 -22074
580b2074l22J9213K1969O536j7805k3767p485J1403K2400J3093p101j9066j8333
$$ -22074 -22396 -3183 18786 25322 7517 -16250 -23735 -12332 10068 23161 16060 -3006 -21339
593b1339l47K0819K0517L108j7158k2353n082J1555J9180J4022p190k0602j6767
$$ -21339 -21686 -867 19650 22758 5600 -16753 -21835 -10280 8900 22922 15732 -4870 -21637
606b1637J633K1034J8752O67j5753k0373o011J2955J8892J2414q087k1591j3793
$$ -21637 -20004 1030 19782 20449 4696 -15677 -21688 -8733 10159 22573 14486 -7105 -20898
619b0898L339J8970J7668l24j4832j9206o443J4098J9169R471q381k0392j1918
$$ -20898 -17559 1411 19079 18755 3923 -15283 -21726 -7628 11541 21012 12631 -7761 -19679
632a9679L812J7492J7553q57j6315j7579n226J4381J8964P168q466j9005j1702
$$ -19679 -15867 1625 19178 18321 2006 -15573 -20799 -6418 12546 19714 11248 -7757 -19459
645a9459N371J6568J5993q62j6855j6394l084J3336J7799O300r072j7555j1631
$$ -19459 -14088 2480 18473 17611 756 -15638 -18722 -5386 12413 18713 9641 -7914 -19545
658a9545O367J7320J4057j694j6794j5353j549J2531J7080O141j0168j6843j0344
$$ -19545 -13178 4142 18199 16505 -289 -15642 -17191 -4660 12420 18561 8393 -8450 -18794
671a8794O798J7338J1839k357j5446j4924o52J2443J6180N778j1313j6263q598
$$ -18794 -11996 5342 17181 14824 -622 -15546 -16198 -3755 12425 18203 6890 -9373 -17971
684a7971O685J7326J0714l303j4721j4526mJ3519J4750M595j1079j5822o700O458
$$ -17971 -11286 6040 16754 13451 -1270 -15796 -15800 -2281 12469 17064 5985 -9837 -16537 -10079
698a0079J6209J0413m261j4350j3023Q9J3347J4319L455j0743j5596n923P516
$$ -10079 6130 16543 12282 -2068 -15091 -15002 -1655 12664 16119 5376 -10220 -16143 -8627
711h627J4826R642m367j4594j1090M17J2897J3225K557j0907j4481n176Q119J4522
$$ -8627 6199 15841 11474 -3120 -14210 -13793 -896 12329 14886 3979 -10502 -15678 -7559 6963
725F963Q307n132j3968j0369J500J3039J2588J423j1017j3736m747Q482J3823
$$ 6963 15270 10138 -3830 -14199 -12699 340 12928 14351 3334 -10402 -15149 -6667 7156
738G156P953n243j4316r799K676J2583J1883L87j0703j2940m054Q687J3218O980
$$ 7156 15109 9866 -4450 -14249 -11573 1010 12893 13280 2577 -10363 -14417 -5730 7488 14468
752A4468n917j3338r174L232J2133J0747K09j0525j2309l397Q946J3138N532o228
$$ 14468 8551 -4787 -13961 -10729 1404 12151 12360 1835 -10474 -13871 -4925 8213 13745 7517
766G517j2474q303L448J1879J0328p91j0881j1242k486R092J2020M937o363j2316
$$ 7517 -4957 -13260 -9812 2067 12395 11604 723 -10519 -13005 -3913 8107 13044 6681 -5635
780e635p200L870J1810R283j223j0864j0807j360R095J1486M208p215j1237o798
$$ -5635 -12835 -8965 2845 12128 10905 41 -10766 -12126 -3031 8455 12663 5448 -5789 -12587
794a2587M587J1294Q342j923j0335r928o83Q867J0770L893p340j1275n908M503
$$ -12587 -8000 3294 11636 9713 -622 -10550 -11233 -2366 8404 12297 4957 -6318 -12226 -7723
808g723J1636P645k667r908r333j44Q706J0468K781p258j0884m953N103J0719
$$ -7723 3913 11558 8891 -1017 -10350 -10494 -1788 8680 11461 4203 -6681 -11634 -6531 4188
822D188P137l272r508q442L1Q865R369K197o954j0730l843N212J0097O585l397
$$ 4188 11325 8053 -1455 -9897 -9866 -1001 8368 10565 3611 -7119 -10962 -5750 4347 10932 7535
837G535r470q087M85R088R271J484p471r688l824N643R555N992l428r492p549
$$ 7535 -1935 -10022 -9537 -449 8822 10306 2835 -6853 -10677 -5034 4521 10513 7085 -2407 -9956
852i956J104Q798Q939N04p280r288l061N692R389N094l400r543o638J675Q428
$$ -9956 -8852 -54 8885 9389 2109 -7179 -10240 -4548 4841 9935 6535 -3008 -9646 -7971 457
867D57Q297J76p374q550k980O293R095M403l713r462n762K164P589P702L55p493
$$ 457 8754 8930 1556 -6994 -9974 -3681 5414 9817 6104 -3358 -9120 -6956 633 8335 8690 1197
883A197q216k189N851R281L558m667p768n943J963P541P539N40p866q283r57N841
$$ 1197 -7019 -9208 -3357 5924 9482 4815 -2953 -8896 -6933 608 8147 8687 821 -7462 -8419 -2578
899b578Q293K893m313p513n612K446Q485N927m01p626p676r5N402Q017K857m600
$$ -2578 5715 8608 4295 -3218 -8830 -6384 2101 8028 7627 1 -7675 -7770 -2368 5649 8506 3906
915C906p509m809K223Q799N837j532o979p395k27N932P614K794n429p602l603
$$ 3906 -3603 -8412 -6189 2610 8447 6915 -64 -7459 -7686 -1754 5860 8654 3225 -4377 -7980
930g980K669P824N080j127o674p074j10O502O712K236n450p145l141L109O788
$$ -7980 -5311 2513 7593 6466 -208 -7282 -7392 -890 5822 8058 2608 -4537 -7678 -4569 2219
945B219N683j693o757o755l05P632N665J463m580p128k503K540O728N539k115
$$ 2219 7902 6209 -548 -7303 -7608 24 5689 7152 2572 -4556 -7059 -4519 2209 7748 5633
960E633p028n525K66O939N442M71l536p283k795L824O262M939k432p213m121J18
$$ 5633 -1395 -6920 -6654 285 5727 6198 2662 -4621 -7416 -3592 2670 7609 5177 -2036 -6157 -6039
976f039N863O056L2l769o958k641M773O030L384k158o878l741M91N733O236n2
$$ -6039 -176 5880 5912 2143 -4815 -7456 -2683 3347 6731 4573 -2305 -6046 -5555 178 6414 6362
992F362n291n795k091M396N782K605j173o689m914J343N936N702k98n716m411
$$ 6362 1071 -4724 -6815 -2419 3363 5968 4795 -1894 -6808 -5465 471 6173 5875 159 -4252
1007d252j757L336N994K734j973o052n281K720N844M396m04n262m544r19K651
$$ -4252 -6009 -2673 3321 6055 4082 -1970 -7251 -4531 1313 5709 5305 43 -4501 -5420 -2769
1022b769O425K771l168n339m800K562N952L397J25m769n267k81K945O018K628
$$ -2769 3656 6427 3259 -2080 -6880 -4318 1634 5031 5156 387 -4880 -5161 -2216 3802 6430
1037F430l850m906l286J453N597L818l76m704n543J17M363M429K010l293m510
$$ 6430 2580 -2326 -5612 -4159 1438 5256 4880 176 -5367 -5250 -887 3542 5552 2259 -2251
1052b251l321J217N737M129q72m998m526K65L750M230J872k513n449k750J505
$$ -2251 -5572 -4355 1382 5511 4639 -359 -4885 -4620 -870 3360 5232 2719 -2730 -5480 -3975
1067c975N995L801j980m475l867j78L982M243J751k366n994k463K295N110L512
$$ -3975 2020 5821 3841 -634 -4501 -4679 -697 3546 5297 2931 -3063 -5526 -3231 1879 5391
1082E391j972m355l191q29M307M589R93k994n151j780K470M201L011j004m617
$$ 5391 3419 -936 -4127 -4956 -649 3940 4933 1939 -3212 -4992 -2522 1679 4690 3686 -931
1097i31l496j30M208M637O9k855m524j991K731M055L036j116m954l558R83L716
$$ -931 -4427 -4557 -349 4288 4357 1502 -3022 -5013 -2282 1773 4809 3693 -1261 -4819 -3836 -120
1113a20M024J04k729m037j857K106M714K681j632m825k899J221L386L617N71l152
$$ -120 3904 4008 1279 -2758 -4615 -2509 2205 4886 3254 -1571 -4470 -3249 137 3754 4325 1173
1129A173l991k007K710M748J913j886m112k788R77L146L847N07l427m024j168
$$ 1173 -2818 -4825 -2115 2633 4546 2660 -1452 -4240 -3263 -117 3730 4237 810 -3214 -4382
1144d382K670M182J685j521m037k653O63L810L406O7l399l536p55K128L823K168
$$ -4382 -1712 2470 4155 2634 -1403 -4056 -3393 417 3823 3890 491 -3045 -3800 -1672 2151 4319
1160D319j684l941k989J116M224K827n70l132l301o39K221L739J988j967l893
$$ 4319 2635 -1306 -4295 -3179 1045 3872 3302 170 -3131 -3770 -1549 2190 4178 2211 -1682
1175a682k205Q60L977K521n02k569l667p63K658L759J619k251l693j717J194L223
$$ -1682 -3887 -3027 950 3471 2969 400 -3267 -4030 -1372 2387 4006 1755 -1938 -3655 -2461 762
1191G62K505J81l129l442l81K983L012J367k434l435j322Q15L191K984q16k877
$$ 762 3267 3448 319 -3123 -3504 -521 2491 3858 1424 -2011 -3333 -2518 673 3657 2841 -36
1207c6l123k07K661L421O73j967l141j758J043L776K192r00l185k379k3K040L352
$$ -36 -3159 -3366 -705 2716 3389 1422 -1719 -3477 -2434 1342 3534 2634 -551 -2930 -2953 -913 2439
1224B439Q97j888l291j660J556L255K096q89l154k255o8K501K788Q49j944l464
$$ 2439 3336 1448 -1843 -3503 -1947 1308 3404 2515 -639 -2894 -2962 -461 2327 3176 1232 -2232
1240b232j313J953K944J710o96k672k636k56K898K752N82k287k839r53J349K848
$$ -2232 -3545 -1592 1352 3062 2366 -306 -2942 -3198 -300 2452 3034 747 -2092 -3045 -1696 1152
1256A152K044r35l066j992R6K657K445K25j946k607j293J826K687J723r68k921
$$ 1152 3196 2261 -805 -2797 -2701 -44 2401 2626 680 -1927 -3220 -1394 1293 3016 2048 -873
1272h73j952N80K156K484M40k278k542j074J560K792J948j521k714j838M54K414
$$ -873 -2825 -2245 -89 2395 2835 557 -1985 -3059 -1499 1293 3241 1720 -994 -2832 -2378 36
1288C6K292L90k265k721n59J822K882J223j318k754j741L71K627K045K98k354
$$ 36 2328 2718 453 -2268 -2827 -1005 1877 3100 1782 -972 -2713 -2342 285 2330 2628 274
1304B74k639m64J835K637J181j388k246j924N51K652K176l05k331k157m44J892
$$ 274 -2365 -2829 -994 1643 2824 1436 -810 -2734 -2183 469 2645 2340 9 -2148 -2592 -700
1320g00K582Q36j237k631j605Q50K623J670k81j907k252m56J982K037R86j252
$$ -700 1882 2718 1481 -1150 -2755 -1905 718 2388 2107 200 -2052 -2508 -526 1511 2497 1245
1336A245k349j133O35K102K068l53k211j979m39K014K092N48j285k110j271Q31
$$ 1245 -1104 -2237 -1602 500 2568 2215 4 -1975 -2414 -400 1692 2240 955 -1155 -2426 -1595
1352a595J994J891k8k472j882j42J941K219K33j094k036j451Q45K436J453l47
$$ -1595 399 2290 2262 -210 -2092 -2234 -293 1926 2159 1065 -971 -2422 -1577 859 2312 1965
1368A965k355j500j17J550J873Q52j468j974j248Q69K423J261l97k114j844L02
$$ 1965 -390 -1890 -2007 -457 1416 2268 800 -1174 -2422 -1553 870 2131 1734 -380 -2224 -1922
1384a922J732J826L07j078k036j137Q92K291J128l70j846j921K39J975J534P48
$$ -1922 -190 1636 1943 865 -1171 -2308 -1416 875 2003 1633 -213 -2134 -1895 80 1614 2362
1400B362j772j957o65P24K235J136p15j681j794L27J933J555J04j102k165l46
$$ 2362 590 -1367 -2032 -1308 927 2063 1348 -333 -2127 -1800 133 1688 1792 690 -1475 -1821
1416a821O61J998J261o59k118j261K30J762J486J31r50k152n22J042J640J655
$$ -1821 -1160 838 2099 1440 -678 -1939 -1709 53 1539 1670 720 -1432 -1954 -912 728 2383
1432B383r13k204j189L00J776J495j52r78j742q87J333J677J215p61k085j095
$$ 2383 1470 -734 -1923 -1623 153 1648 1496 518 -1224 -2111 -778 899 2114 1353 -732 -1827
1448a827M18J374J670k29j138j456q13J385J666Q63p88j861j172N38J534J618
$$ -1827 -1409 -35 1635 1406 268 -1188 -2001 -616 1050 1913 1125 -736 -1908 -1370 164 1782
1464A782j56j491j365n09J075J923K73n90j730j050Q12J355J114J16j609j055
$$ 1782 1626 135 -1230 -1739 -664 1259 1532 942 -788 -1838 -1026 329 1443 1559 -50 -1105
1480a105m20Q68J710L60n75j525j318J024J596Q50M1j653j260L54L60J705J034
$$ -1105 -1525 -657 1053 1413 838 -687 -2005 -981 615 1465 1506 -147 -1407 -1053 -693 1012 2046
1497B046j354j390j207Q80J496R75n6j201j740O4J205R83J027j138j526o89L68
$$ 2046 692 -698 -1905 -1025 471 1446 1390 189 -1551 -1487 -282 701 1728 590 -936 -1625 -1257
1514a257K090O29m44r10j800J49J390J127P84q74j772p30N89J818Q22n51j264
$$ -1257 833 1462 1018 108 -1692 -1543 -153 974 1758 884 -888 -1618 -1029 789 1611 1060 -204
1531b04j082o4J386P17Q12o30j975l08O16J094J525r29j150p50l13J020J398M30
$$ -204 -1286 -1350 36 753 1565 935 -1040 -1348 -732 362 1887 958 -192 -942 -1255 -235 1163 1593
1549A593j103j820m55J019J379J058p96j157r99j06J302J047R8n00j408q13J173
$$ 1593 490 -1330 -1785 -766 613 1671 875 -282 -1281 -1387 -85 962 1060 560 -848 -1661 -488
1566d88J127P10k85j370q33J20Q55J468j29p93j084q94R76J576N49p31j456q46
$$ -488 639 1349 1064 -306 -1139 -1019 -164 1304 1175 382 -702 -1596 -620 956 1505 774 -682 -1528
1584a528O90Q57R84J94j049r23n07L81J917L41p53r93r39N53R03Q95K15q43j468
$$ -1528 -838 19 1003 1197 148 -775 -1282 -901 1016 1357 604 -389 -1328 -775 128 1023 1238 395 -1073
1603a073j41O77J653R4p32r33o84L01J012J038p8j232r93k6O99J059N32l76j231
$$ -1073 -1214 -537 1116 1210 478 -455 -1139 -838 174 1212 1134 -98 -1091 -1117 -418 641 1173 797 -434
1622d34q91L72J217P45j19j107o31l83P09R94Q64p34j337o35M39J497L74j27l96
$$ -434 -1325 -953 264 1009 890 -217 -848 -1231 -522 472 1336 602 -735 -1370 -931 566 940 813 417
1641D17j008o53P57J338P11r62j347m06N05R59O48q8l75j512l19R77J290M4o15
$$ 417 -591 -1244 -487 851 1562 600 -747 -1153 -648 311 959 871 496 -1016 -1335 -358 932 976 361
1660C61q66k72J17P86J073r8j190j017k32J376Q27l9m51n55r72L21J106J133q34
$$ 361 -505 -777 -660 126 1199 1101 -89 -1106 -1338 38 865 826 375 -180 -1152 -831 275 1408 574
1679E74r94l13Q0O28P32J96j33j165r47O18J434P15r65q38m17p2M94R36O67n70
$$ 574 -420 -733 -653 -25 707 903 770 -395 -1342 -724 710 1425 460 -378 -795 -867 -373 563 1230 660
1699F60j739j4P98J042Kj42o31q24l87R50J585k18q49j354M24N24K02O84J55p78
$$ 660 -1079 -1093 -295 747 749 607 -24 -848 -1235 -285 1300 1082 233 -1121 -697 -173 29 713 868 90
1719I0j419K28J447O15k76r14R8m05K4P15Q01Pj510q76M98J360J89l45K13q63
$$ 90 -1329 -1101 346 961 685 -229 -131 -536 -512 203 1004 1011 -499 -1375 -877 483 672 327 540 -323
1739c23n05o8J744O64j093r74l43N66K69M54P09m78j351o84J196J282k31o97n63
$$ -323 -828 -896 848 1512 419 -555 -898 -332 -63 391 1100 622 -729 -1413 -217 1065 834 137 -426
1758d26N5l28L48J291J15j007j457N90R81N17j31O9k70j135l75J093J285n18q51
$$ -426 -371 -699 -351 940 1055 48 -1409 -819 162 679 548 617 347 -788 -1163 -70 1215 697 -154
1777a54n30N10p3K96O00M80j160j105L18J571M5n81l61j64l74r7J128P38l21j756
$$ -154 -684 -174 -247 49 649 1129 -31 -1136 -818 753 798 217 -144 -308 -682 -779 349 1087 766 -990
1797i90j42J299L08k25O2L10r65j029P12J716m5j123l60K12J86k70N13J074p33
$$ -990 -1132 167 475 250 312 622 -343 -1372 -660 1056 1011 -112 -472 -260 -74 -344 169 1243 510
1816E10j498j37J344N72l04n19O9l21n92R05J122l7j763o81J230N92j37j81M06
$$ 510 -988 -1125 219 791 487 -32 37 -284 -876 29 1151 1114 -649 -1330 -100 492 355 174 580
1835E80n30j130O8J469R58j156o71j86M33j25O1J156j42j600m37Q30J251k82p17
$$ 580 50 -1080 -1012 457 1415 259 -412 -598 -165 -290 -229 927 785 -815 -1252 -422 829 547 -170
1854a70K84k01p96M52Q61J066j241j335O20P40j91K7K59K20j113o80J286R92m64
$$ -170 114 -87 -883 -431 430 1496 255 -1080 -460 280 89 116 375 595 -518 -1198 88 1080 616
1873F16j243L18L05m33R6R61O39j210r12L70J329m47o18L29M1o21l86P83J552
$$ 616 -627 -309 -4 -437 -341 620 1259 49 -863 -493 836 389 -229 100 141 -480 -866 -83 1469
1892A469o54j853M59R77j81j96J2O08o20j242L54J666Q4j149l11P96n02l92J012
$$ 1469 815 -1038 -579 398 217 21 33 641 21 -1221 -867 799 883 -266 -577 219 -283 -675 337
1911C37N94n90j387o9J504K85m77j34K79l96q81L66J455J36j471l17O43L10P9
$$ 337 931 341 -1046 -1115 389 674 197 63 342 -54 -935 -569 886 1022 -449 -766 -123 187 266
1930B66lL79l34j461M39J307L99q30q91P15N8p89M58J486m16j467o25J220J042
$$ 266 263 642 308 -1153 -714 593 992 162 -729 -14 44 -745 -287 1199 783 -684 -1309 -89 953
1949I53j043j78J36K33o35m98J612P27j527p62O83N98l17m76J012J28j179o59
$$ 953 -90 -268 -132 101 -534 -1032 580 1307 -220 -982 -299 299 -18 -494 518 646 -533 -1192
1967a192J043J247l56j170P9P37j012J24J027O89j181j314R55J053k97n87N71
$$ -1192 -149 1098 742 -428 -349 388 -624 -500 527 1216 35 -1279 -324 729 432 -155 416
1984D16N7j076k72R50J395j115j031J8Q72l29k64P72O26j013j062O51J373j03
$$ 416 473 -603 -875 75 1470 355 -676 -658 214 -115 -379 393 1019 6 -1056 -405 968 865
2002H65j272J26P50p80m86P17J154l84j752M26J392k39n55j97O85l83j198P15
$$ 865 -407 -281 469 -311 -797 -80 1074 690 -1062 -636 756 517 -38 -235 450 67 -1131 -416
2020d16J498k84j336l21Q91K17p40M14J118o77j312J85J044Q56j215k00N62k88
$$ -416 1082 798 -538 -859 32 249 -491 -77 1041 364 -948 -763 281 1137 -78 -278 284 -4
2038dp09O60P71L66j676m56J334K21r01O20N96o20q63k44K072l21j051o23N79
$$ -4 -713 -53 718 1084 -592 -1048 286 507 -394 226 822 202 -661 -905 1167 846 -205 -828 -249
2057b49Q54p87N7J042l30j271m37J142Q71q84l86L86K44j005J78J146P12j441
$$ -249 605 -182 -125 917 587 -684 -1121 21 892 8 -378 8 252 -753 -575 571 1283 -158
2075a58j061J127Q00m25r52R53M53j378n53J274J102j012p88K22N68m92N1Q99
$$ -158 -1219 -92 708 283 -669 284 737 -641 -1194 80 1182 170 -618 -396 172 -320 -269 630
2093F30L17r97j230P44J064n5r98N21L93o45n27R50J002p83j268L28J074k56o18
$$ 630 947 -50 -1280 -536 528 473 -525 -4 389 -256 -783 167 1169 386 -882 -554 520 264 -354
2112c54L48Q72r15j087Q28J174o9j470l1R73j26p38P89N88n71j059J78J314n7
$$ -354 -6 866 -49 -1136 -308 866 797 -673 -704 269 143 -595 194 782 211 -848 -670 644 587
2131E87r28K3R27p53o85M53J028K03j314k88J067K02r23K26R49m09j391L43J605
$$ 587 -341 -318 609 -144 -829 -376 652 855 -459 -747 320 522 -401 -175 774 365 -1026 -683 922
2150I22N4j188l65P09M3o97K80J120N9j616k49J199N45r23q9O68l36o58J2J089
$$ 922 976 -212 -577 132 175 -522 -242 878 937 -679 -928 271 816 -107 -196 472 136 -522 -510 579
2170E79L69r29j007Q38N40m12n10Q66M02j228m95J474M74r78m24L64M67n10m20
$$ 579 948 19 -988 -150 390 -22 -532 334 736 -492 -987 487 961 -17 -441 -77 390 -120 -540
2189e40Q70O53j125n40O05Q17q38j79M12o1n60l02J004O63n48j152L40R38m66
$$ -540 330 983 -142 -682 -77 740 -98 -277 135 74 -486 -788 216 879 331 -821 -481 457 -9
2208ij10L69L72p56q71O95J236o66p58K71N65n22m85R21O02q40r40M63J094l26
$$ -9 -119 250 622 -134 -1005 -310 926 260 -498 -227 338 -184 -669 252 854 14 -926 -463 631 305
2228C05m09K59J85l04n55K89J013k38r55j48Q03Q7o78M46N02m70q91L64J102l2
$$ 305 -104 155 340 36 -519 -230 783 545 -410 -558 245 332 -346 100 602 132 -759 -395 707 675
2248F75j017J66L82k14l35L04O35n5j066j61R00J21k96k40O50k7r40P4J041Q2
$$ 675 -342 -176 206 -8 -343 -39 596 541 -525 -686 214 335 39 -201 449 422 -518 -444 597 679
2268F79r17l19M66K34m59J36Q76l60q26k38R89K66o87j89J90K57o02K34P25M54
$$ 679 -238 -557 -91 143 -316 -180 696 336 -490 -728 261 527 -160 -349 -159 98 -504 -270 455 909
2288I09j276k06N54J57k18j89N06r3m21l85Q75J25j73n31J15M22l03k07O27L35
$$ 909 -367 -573 -19 138 -80 -269 237 144 -277 -662 213 338 165 -366 -251 171 -132 -339 288 623
2308F23q64n10P15P88n38l87L15o8l56k43N57O64n13r81N96O07j01o60L50M22
$$ 623 -241 -751 -36 752 214 -173 142 74 -282 -525 32 696 183 -798 -202 405 304 -356 -6 416
2328D16n89n27N47P95m24m97j47P70l70l80N83N41p46o50K31Q96K5n96j49N31
$$ 416 -173 -700 -153 642 218 -279 -426 344 -26 -406 177 718 -28 -678 -447 449 474 -122 -271 260
2348B60l63k33K34O29j58j030K00M64K4j64J61N06l93q97M65O76K2p80j32N37
$$ 260 -103 -336 -102 527 369 -661 -461 3 27 -137 24 530 137 -760 -295 381 403 -377 -509 28
2368B8K63o62K98N43k62m70k16O73L31n20l47L10R1l23PN37J61m39m08N32J05
$$ 28 291 -371 -73 470 208 -262 -478 195 526 6 -341 -31 60 -263 -256 281 442 3 -405 127 232
2389B32k11k75N10K1n02j04M78L52m34n94N66J58j89j48N67k08l02o78P56M02
$$ 232 21 -254 256 277 -225 -329 149 501 67 -527 39 197 8 -140 427 219 -83 -761 -5 397
2409C97m20M9%R1k22l97Q82K83q91j92M53K89l21k59L23N06q98l13O83J11j8l54
$$ 397 -23 26 26 117 -105 -502 380 663 -228 -420 33 322 1 -258 65 571 -327 -640 43 154 136 -218
2431b18J91J37l9l21K44M79m66l92J30N87k02j51K2m3R4n19M89M81k82l35k29
$$ -218 -27 110 71 -250 -6 473 7 -385 -255 332 130 -21 1 -42 52 -467 22 503 221 -114 -343
2452c43N60L8m00Q2K41j85P7l47M15J8l27o2L24k44j02K88L87l28k98l7L03J77
$$ -343 217 255 -145 -63 178 -7 70 -277 138 156 -171 -233 91 -153 -255 33 420 92 -206 -243 60 237
2474B37j66p4j03L55n44P4P81j57o64NJ91J7j04J20K49r2m27M4L80M45m86m15
$$ 237 71 -3 -106 249 -295 -221 560 403 -261 -256 -65 -48 -152 -32 217 125 -302 -258 122 567 81 -334
2496c34J35Q0J21N1K58J33n35j84K71L8L02j92n3K2l03k13N14J33k40j67p5K10
$$ -334 -199 -119 2 53 311 444 -91 -275 -4 34 336 144 91 113 -190 -403 111 244 4 -163 -238 -28
2518b8K2r1M99j28n57J9K22J56p1k5j39K59k45kL44J7l04k39n4L18L26l78k43
$$ -28 -6 -97 402 274 -283 -264 -42 114 43 18 -121 138 -107 -109 235 252 -52 -291 -345 -27 299 -79 -322
2541c22O96m31j47L17J72k23j45Q0nj20J5K73j07%k88K17L01k72MK71k57K0p8
$$ -322 374 -57 -204 113 285 62 -83 -3 -8 -128 -113 160 53 53 -235 -18 283 11 15 286 29 49 -29
2564b9J11J44l29l07L05J60L29m37J24M1l67K6K17L53j96j97j60J4J14j30M71
$$ -29 82 226 -103 -410 -105 55 384 -53 71 112 -255 -229 -12 341 145 -52 -212 -198 -84 -214 257
2585B57j90Q1l21pL59m7r8p9j2k73K17K48J01k04o3j36j32K74m6K79j57J5k42
$$ 257 67 148 -173 -180 179 132 34 -45 -57 -330 -113 135 236 32 -31 -167 -299 -25 -71 208 51 66 -176
2608a76j37M22K43m67J45j73J58k44K95J64J40n09l05M33K43p4O8k05O2m8j37
$$ -176 -313 109 352 -115 30 -143 15 -229 66 230 370 -139 -444 -11 232 158 226 21 83 35 -102
2629a02J93j44K49o51J67M70lk58K82l35p0J05K18l25J95q9J64j15R3j66M07J21
$$ -102 91 -53 196 -455 -288 182 179 -79 203 -132 -202 -97 121 -204 -9 -98 66 -49 44 -122 285 406
2651D06l61l93K38L73k18k11L18j64j08J83l5K66k43j19k40K87r0K22K3K8m0k43
$$ 406 45 -348 -110 263 45 -166 152 -12 -120 63 28 294 51 -68 -308 -21 -111 111 134 162 122 -121
2673a21k20K98K55l24J12r1J11J8K33j33j21Mj83J61N3j2j65J11l3j32K22O7K54
$$ -121 -341 -43 212 -112 0 -91 20 38 271 138 17 21 -162 -1 52 40 -125 -14 -47 -179 43 110 364
2696C64o30L14k02L15l11K04j18j4o5J72L8K7K2l09M3J2R3k9L25k47j48j05J72
$$ 364 -266 48 -154 161 -150 54 -64 -78 -143 29 67 94 116 -193 -150 -138 -45 -74 251 4 -144 -249 -77
2719g7K14L7j76l4q5J13j24L89J24l33k63R4R9j89L32l3J24k56J2j76N14j58j14
$$ -77 137 174 -2 -36 -121 -8 -132 257 381 48 -215 -121 -22 -211 121 88 212 -44 -32 -208 306 148 34
2742C4J8m5LJ67n2j31L00n47J02J73L13l91K64l82LN0L5J83J48k44M1m7j51J18
$$ 34 52 7 10 177 125 -6 294 -253 -151 22 335 -56 208 -174 -171 -121 -86 97 245 1 42 -5 -156 -38
2766c8J41L9q2k83J49K35J0l0k00M9l2L23Rl22L32o03K45qR2j66R6M2k01O7K58
$$ -38 103 142 60 -223 -74 161 171 141 -59 -10 -42 281 290 -32 300 -303 -58 -66 26 -140 -44 -2 -203 -136 122
2791A22j35J01j60J1j9k24L84N0l1k39R0J24k5K1o2l6o9J55k5k3M3J99k17k14
$$ 122 -13 88 -72 -61 -80 -304 80 130 99 -140 -50 74 49 70 8 -28 -97 58 33 10 53 252 35 -179
2815a79J31L7O7m9K25j97k05K63q7l7P6K3k8n1ll02L15J6q1J66k16K2J1lr5K37
$$ -179 -48 -11 56 7 232 35 -170 93 6 -31 45 68 40 -11 -14 -316 -1 15 -66 100 -116 -94 -83 -86 -181 56
2841E6j60L82m4k36o2m2Q6o8K29l28M90n88M51M4l61r0K77q6j3K67n22M25rK9
$$ 56 -104 278 234 -2 -64 -106 -20 -88 141 -187 303 -285 166 210 -151 -241 36 -50 -63 204 -318 107 98 127
2865A27j04n9j19J99N6K1m24q0J90R1L48l01J01JK58k34J21j93N4j18j75P2J32
$$ 127 23 -36 -155 44 100 121 -303 -383 -193 -102 246 -55 46 47 305 71 192 -1 53 -65 -240 -168 -36
2888c6K50M5k66K5n8k59L44N7K4j41k2o7N4K05j29k3R2k12Q3KP9j61J32N3j16
$$ -36 214 259 -7 18 -40 -299 45 102 126 -15 -37 -104 -50 155 26 3 95 -117 -34 -32 47 -114 18 71 -45
2913d5L6J2q0p3k23L11k08j20O89K9j40k50j10o2J02L55j77k03n0K5P0K14N4r8
$$ -45 -9 3 -77 -150 -373 -62 -270 -390 299 328 188 -62 -172 -234 -132 223 46 -157 -207 -182 -112 102 156 58
2937E8m0k38K45JJ76l10J1J04n1K61j59k01M71m31j31L92l52N29Mo58J59l88N30
$$ 58 18 -220 25 26 202 -108 -97 7 -44 217 58 -143 328 -103 -234 158 -194 335 339 -319 -160 -548 -18
2960a8k4N1o8k30K12J51k3p9L4k6l9j64M98l29O0N6m8n3r9K61k28K94l03l6m5
$$ -18 -42 9 -59 -289 -77 74 51 -28 6 -20 -59 -223 275 -54 6 62 14 -39 -138 123 -105 189 -114 -150 -195
2985a95N91l06k23m9j6M53q0m71k1J58Q6Q07p87J15J32K8o3m47M8L52%k86J02
$$ -195 396 90 -133 -182 -198 255 175 -296 -317 -159 -73 734 -53 62 194 222 159 -288 -240 112 112 -174 -72
3008g2o9J07K55k55J41k45K74j7l12L41L7l49L86l28J3J71l83K65N7j26J49NR1
$$ -72 -141 -34 221 -34 107 -138 136 119 -193 148 185 -164 222 -106 -93 78 -305 -40 17 -109 40 45 136
3031A36M4ok52o6j46N93l76J54J07l25J88j63K81j60j2k09K12J02j42J35k29P8
$$ 136 180 174 -78 -144 -290 303 -73 81 188 -137 51 -112 169 9 -3 -212 0 102 -40 95 -134 -56
3053e6k4L2j74K71m7R6L4j95r4J50O4J68q4k12JL8K3j7NL1O2j0p3k13J99J15K8
$$ -56 -80 -48 -222 49 2 98 132 -63 -157 -7 57 225 141 -71 -70 -32 -9 -26 -21 10 72 62 -11 -224 -25 90 118
3080A18j78J29j22L5rK8r9j90L42j20J90o5o6j15K70k95L03l76K98R6n3J51j10
$$ 118 -60 69 -53 -18 -27 1 -98 -288 54 -66 124 59 -7 -122 148 -147 156 -220 78 174 121 272 162
3103A62R5l03J74J4P8j86K5r7o6L6J04Lk66Q5J89r1j53R8K92j98J6j49K19j7M0
$$ 162 257 -46 128 142 220 34 59 -38 -104 -68 36 39 -227 -142 47 -44 -197 -99 193 -5 11 -138 81 64 104
3128A04k23K54j43N8L1k63J45K09j80l3J82k26K57m47K11J15m27L20k1j0J18J
$$ 104 -119 135 -8 50 81 -182 -37 172 -8 -41 141 -85 172 -275 -64 51 -376 -56 -77 -87 31 32
3150C2P0j82J16J14k01J80q3k23K24k50L19j58K36j53j37m7K65J62j24k91J82
$$ 32 102 -80 36 150 -51 129 46 -177 47 -203 116 -42 194 41 -96 -143 122 284 160 -131 51
3171E1m8j26n6J87q8K51K5k37J61K19l78J09K09k03k20L66p5k88k0J69O5J58k03
$$ 51 3 -123 -179 8 -80 171 196 -41 120 339 -39 70 279 76 -144 222 147 -141 -161 8 73 231 28
3194B8j71J24J65j02j5j0n8O6k22M38j52qN5j56k57J30J8M31N6m59n0J37R0Q9
$$ 28 -143 -19 146 44 29 19 -39 27 -195 243 91 83 138 -18 -275 -145 -127 304 360 -99 -149 -12 78 167
3218A67q1or1p3N8j33L68k33j51L2Q5j35J58k8K2k00L60M3l46K08j67J91l4j34
$$ 167 86 80 -11 -84 -26 -159 209 -24 -175 -143 -58 -193 -35 -63 -41 -241 119 162 -184 24 -143 48 14 -120
3242a20m6K15k9k2m8J8mM0j40K92j9k1l72K53Q3j47R4P2l27J9J79k44L85q2j87
$$ -120 -166 49 20 -2 -50 -32 -36 4 -136 156 137 116 -256 -3 80 -67 27 99 -228 -209 -30 -274 111 29 -158
3267a58K15J94l34j55O7J97L55m98j25J90K51O6l46K41j91r5J26O2j63N5k62R4
$$ -158 57 251 -83 -238 -171 26 381 -117 -242 -52 199 265 -81 160 -31 -126 0 62 -101 -46 -308 -214
3289b14K18K5J29l42K8K11j21J88l34L07l17o7j7K16L03l51l6J87J46k37N6j8
$$ -214 4 29 158 -184 -156 55 -66 122 -212 95 -222 -289 -306 -90 213 -138 -174 13 159 -78 -22 -40
3311d0J75P0k06q6K18j41J89r8j21P6J08J9m5l60K47k8J63J8j98L13k57K4K33
$$ -40 135 205 -1 -87 131 -10 179 81 -40 36 144 163 118 -242 5 -23 140 158 -40 273 16 40 273
3334B73l31L2J80n4K0l52K55j72K79J85k66L4j01J4Q7j16J39k79J94l20L48j6
$$ 273 -58 -26 154 100 120 -232 23 -149 130 315 49 83 -18 -4 83 -33 106 -173 21 -299 49 33
3356C3J75k08j11K07j24O1nk7J06qk62J04P7J54q0l15J8K44n4L14l02oj80K81
$$ 33 208 0 -111 96 -28 33 28 1 107 99 -163 -59 18 172 92 -223 -205 39 -15 299 -3 -9 -189 92
3380I2j62J98j16j31jO7L5O2l85M44p5nP2j57K49j00P2k26p9L6j06K03p9K84k96
$$ 92 -70 128 12 -119 -120 -53 -18 44 -341 103 28 23 95 -62 187 87 159 -67 -146 -110 -216 -13 -92 192 -104
3405a04J3J58J23K45m50n1l3O3J43j6O5q0k95K46k06o6J46o4j11M48n0%k63J22
$$ -104 -91 67 190 435 -15 -66 -99 -36 107 91 156 76 -219 27 -179 -245 -99 -163 -274 174 124 124 -139 -17
3429a7r0l2JK66j60lN7J42l22J24j92P9n5j5N3P1J83l24K46j58Q7K41j20l40L92
$$ -17 -107 -139 -138 128 -32 -35 22 164 -158 -34 -226 -147 -202 -217 -164 -93 90 -234 12 -146 -59 182 62 -278 114
3454A14k35K2J04o1K46j27j83m2n2Q8kj61O23l76R5j43J82j86J33L7mL7n0j71
$$ 114 -121 -99 5 -56 190 63 -120 -162 -214 -126 -128 -289 334 -42 53 -90 92 -94 39 76 72 109 59 -112
3478a12M00l27L2k38K87J02l44Q0K09l02J60j55K28l7P6j09O5k3k15L82k8q7k9
$$ -112 288 -39 -7 -245 42 144 -200 -120 89 -213 -53 -208 20 -17 59 -50 15 -8 -223 159 131 44 15
3501A5P7l26K43o4K6j4k38L52k75L29j6q7k66J37N0p6J61l8l1M2j37M8K02J5n3
$$ 15 92 -234 9 -55 -29 -43 -281 71 -204 125 109 22 -244 -107 -57 -133 28 -10 -41 1 -136 -88 114 129 76
3526G6o6L5k21J24j02K00O1q2j20J4L2L7J13k92J44l1JJ88M0m9j30J22k61K96
$$ 76 10 45 -176 -52 -154 46 107 25 -95 -81 -49 -12 101 -191 -47 -78 -77 111 151 102 -28 94 -167 129
3550A29m5p2n9J08j21k4J01o2K90p8j44l8K7k7j54K25j51NQ6J14M5l74R7M8j04
$$ 129 84 12 -47 61 -60 -84 17 -45 245 167 23 -15 12 -15 -169 56 -95 -90 -4 110 155 -219 -122 -74 -178
3575a78J22J19M5l6j36j85K97J51k79J31n4k11K45J13kj78J7r0K09l45L90j34
$$ -178 -56 63 108 72 -64 -249 48 199 -80 51 -3 -214 31 144 142 -36 -19 -109 100 -245 145 11
3597A1j61L91l21l1k58N06j39J18j45j78K51J05o1J8p4K37k85n6K82n84K06J60
$$ 11 -150 241 -80 -111 -369 137 -2 116 -29 -207 44 149 88 106 32 269 -16 -72 210 -374 -168 -8
3619hj21N0n6K11J49k81K75l03m7K03p1J01j00R1k05J98j36K74j4j37n8p5R0o2
$$ -8 -129 -79 -135 76 225 -56 219 -84 -131 72 1 102 2 93 -112 86 -50 224 210 73 15 -60 30 -32
3643c2J87j9j34m5K83l0k78m8N9k5J68J34q3j58J49k64J57j73K81k50R8j43K52
$$ -32 155 136 2 -43 240 210 -68 -116 -57 -82 86 220 137 -21 128 -136 21 -152 129 -121 -23 -166 86
3666H6m3R0J73m16K00j39R9r7J27j9j22R3J3q6j33j7J12N7K6n3L5J59m27K51K7
$$ 86 43 133 306 -110 90 -49 50 -47 80 61 -61 32 45 -41 -174 -191 -79 -22 4 -49 -14 145 -282 -31 -4
3691dr1R4J31K13m13L07n32N36k35L07j05k65L0J59j79N1P4o5j84M20j62j31O
$$ -4 -95 -1 130 343 -70 237 -295 241 6 313 208 -57 -27 132 -47 4 78 13 -171 249 87 -44 -38
3714c8l11L88K7r1J58k23K63l46J04K41j21p2J19j15RM2p9K26M3l34J27J07j41
$$ -38 -349 39 66 -25 133 -90 173 -173 -69 172 51 -21 98 -17 -8 34 -45 181 224 -110 17 124 -17
3737a7J52k35K04J24k24k8K93j38N4m48K72P9k14J20Q6j9l8j16J7K87k5j46L1
$$ -17 135 -100 104 228 4 -24 269 131 185 -263 9 88 -126 -6 80 61 23 -93 -76 211 186 40 71
3760G1k65J00m4L94j36j43Q6k74M40l27O5O2r9k06M37l37K47n1j96K54j79J46
$$ 71 -194 -94 -138 256 120 -23 63 -211 229 -98 -33 29 -70 -276 161 -176 71 20 -176 78 -101 45
3782D5m6l7K26j81o5q5L74l20O2R6K38k14n7k5pK18k20l11L57R0k29M1R3J2n8
$$ 45 -1 -38 188 7 -58 -143 231 -89 -27 69 307 93 36 11 4 222 2 -309 48 138 -91 -50 43 55 -3
3807cO8l8J24l46o0J25R0j74L27L3k04j10Q6O7O7J51l79K69j06K5J92k96J48m0
$$ -3 65 27 151 -195 -255 -130 -40 -214 113 146 -58 -168 -82 -15 52 203 -176 93 -13 12 204 -92 56 16
3831A6k1p2j05J47j76L64kk91O6J83K03m53J01%j17J19l7J93j10n1q6L91k83K10
$$ 16 -5 -77 -182 -35 -211 153 151 -140 -74 109 312 -141 -40 -40 -157 -38 -75 118 8 -43 -129 262 -21 189
3855A89j87j45L85k21k14M20l17J35r8j12J07k1J03o4J89J16l63j14K39Lj32L98
$$ 189 2 -143 242 21 -193 227 -90 45 -53 -165 -58 -79 24 -40 149 265 -98 -212 27 30 -102 296
3877B96k87j10j51L52k13J13j92K24m7N4j88J63K62l61k32K33L11O5o50L20J53
$$ 296 9 -101 -252 100 -113 0 -192 32 -15 39 -149 14 276 -85 -317 -84 227 292 -358 -38 115
3898A15j51Q1j63L39j09j50j50L80k20q8p9L57r6j36Q9n4J26k11j17N54k25k14
$$ 115 -36 45 -118 221 112 -38 -188 192 -28 -116 -195 162 66 -70 19 -35 91 -120 -237 317 92 -122
3920a22L41l30J67k37J26l3K5l28K23K90J55k58R9mj50N6j86L55J6j05L6J1o8
$$ -122 219 -111 56 -181 -55 -88 -63 -391 -168 122 277 19 118 114 -36 20 -166 189 205 100 136 147 79
3943G9j63K13k40K78k39l4j64K38j5PJ21j2l4j79l7L42j2k06j53L84j89k52K28
$$ 79 -84 129 -111 167 -72 -106 -270 -32 -47 -40 81 69 35 -144 -181 161 149 -57 -210 174 -15 -267 -39
3966c9J24k9l43K90J27j03r5J40J64K4l63O5K71j48q7J0K17p0m55L86q6j32k5
$$ -39 85 56 -287 3 130 27 -68 72 236 260 -103 -38 233 85 -2 8 225 155 -300 86 0 -132 -157
3989a57J13J43m1k01L25mnj13n3K67l32j55K25K15r3l69K62j11J51l08K28k2m
$$ -157 -44 99 58 -143 182 178 173 60 7 274 -58 -213 12 227 134 -235 27 -84 67 -241 -13 -35 -39
4012c9L9q9Q3M69n94J22Lj08O9j14L72K5n19L8O19k04l37p8N05j26j15j45J38
$$ -39 0 -89 -6 463 -131 -9 -6 -114 -45 -159 213 238 -281 -243 376 172 -165 -243 262 136 21 -124 14
4035A4K49m60J63K92k05k84J1N96k05k65o7J78L98n93j57O21j29j97j15L00J04
$$ 14 263 -197 -34 258 53 -231 -220 376 171 -94 -161 17 415 -178 -335 286 157 -40 -155 145 249
4056B49m42p1M40k67M4j75L55N4j81j96J06K55l46L8k4L56j16j21Q2Q4j16k04
$$ 249 -193 -264 176 -91 -47 -222 133 187 6 -190 -84 171 -175 -137 -161 195 79 -42 40 124 8 -196
4078a96J73J93l17n6J47O7j9lQ5J14l20ln4L43m92J66L56R4j16k34OQ2o5k55M59
$$ -196 -23 170 -147 -203 -56 11 -8 -11 74 188 -132 -135 -189 154 -338 -172 184 278 162 -72 -66 16 -49 -304 155
4103A55Mk03j7J79O0K3j92j88J16r2J6K24J53l65M5K8J77Q5m08J09M46l09j29
$$ 155 159 -44 -61 118 178 201 9 -179 -63 -155 -139 85 238 -127 -82 -54 123 208 -200 -91 355 46 -83
4126h3J84K15k04j28l6K37k90l7J38M3O8J9m33M24j83k31K09k7L04k09NK55m05
$$ -83 101 316 112 -16 -52 185 -105 -142 -4 39 107 126 -307 117 -66 -297 -88 -115 189 -20 -15 240 -165
4149a65J91l3J89j05k54J95j08J76j9j15J18K21l59n0J87Q0k02j01L35K90n66
$$ -165 26 -7 182 77 -177 18 -90 86 67 -48 70 291 -68 -118 69 149 -53 -154 181 471 -95
4170i5m91N99N4Q1l36N3L55o37L98jl5J12j23k2J49M7k42J75n5N0o6j22J55J84
$$ -95 -586 13 67 148 -188 -135 220 -417 -19 -20 -55 57 -66 -88 61 108 -134 41 -14 36 -30 -152 3 187
4194A87m29K16L57l44k74K15M97l72j24J75J61n29lM71j71Ol23K21J70q0j06M3
$$ 187 -242 -26 331 -13 -287 -72 425 53 -71 104 265 -264 -267 204 33 39 -284 -63 107 27 -79 -36
4216c6J16J03M0n1k03J85k19J85J45l40o9k1K11J42j84N0M44l44k26J47N7k96
$$ -36 80 183 223 172 -31 154 -65 120 265 -75 -144 -165 46 188 4 54 498 154 -72 75 132 -164
4238a64q4K06K78k93J15m38N58J01m81j25N96j99j28j68J46J35j16J15O0Q5l20
$$ -164 -248 -42 236 -57 58 -380 178 279 -202 -327 269 70 -58 -226 -80 55 -61 54 114 199 -121
4259a21J88j22l5P2k64K55K34j59k61L57j57J9l23K56R8k38L63n8Q9l06M1J06
$$ -121 67 -55 -90 -18 -282 -27 207 48 -213 144 -13 6 -317 -61 37 -201 162 104 193 -113 -72 34
4281C4J15l11NK07j66Q6l56L65J66l69J62K60m8l66J21J21J57j67k27L70j21j22
$$ 34 149 -162 -157 50 -116 -30 -386 -21 145 -224 -62 198 150 -216 -95 26 183 16 -211 159 38 -84
4303h4N9J03N6j24j3R6j67Q4l34L54N4k6R8j93K38j89m4Q2j10J8J21j63M20l26
$$ -84 -25 78 134 10 -3 93 -74 10 -324 30 84 58 156 -37 201 12 -32 50 -60 -42 79 -84 336 10
4327A0j3L5r5J16k94L18J07k12O0j74M5J67j45J37J44k13o9o1K19n1k7J33k23
$$ 10 -3 32 -63 53 -241 77 184 -28 32 -142 -97 70 -75 62 206 -7 -76 -137 82 31 4 137 -86
4350h6J61r6L22k45n9r6j60L22j55l3K02j35J31q3J93j67Q9j10q3l8K30n9j8L7
$$ -86 75 -21 301 56 -3 -99 -259 63 -92 -125 77 -58 73 -10 183 16 105 -5 -88 -126 104 45 27 64
4374F4j80L7p1M12l31P5j10K42j19j60K43j50Q8k8j02j19J39m3R2j5L52l83M1
$$ 64 -116 -79 -150 262 -69 6 -104 138 19 -141 102 -48 40 12 -90 -209 -70 -113 -21 -36 316 -67 -26
4397b6K50m25O4j5J38l9j03J58J24m9k26K88L7j38J23q0k11M43l70qQ5q6r6P9
$$ -26 224 -201 -137 -152 -14 -53 -156 2 126 77 -149 139 176 38 161 81 -130 313 -57 -65 20 -66 -162 -83
4421h3Q1K3K44k27kp4j65m7J35K88m8l02K94J84k71k80K02J0j03O5J42p1j03l0
$$ -83 -2 21 265 38 36 -38 -203 -250 -115 173 125 -177 117 301 30 -250 -48 -38 -141 -76 66 -5 -108 -138
4445a38j51K12M5L3J4K03j10k00J0l8J16r1J54M7k49J60j80K93k69J34K64l43
$$ -138 -289 -77 -32 1 15 218 108 -92 -82 -120 -4 -95 59 106 -143 17 -163 130 -139 -5 259 -84
4467h4L22m24Q9K35k40L43l71m8K07j81Q5M51m42K71j74R8Kj17r9J50O9r6k44
$$ -84 238 -186 -97 138 -102 241 -130 -178 29 -152 -67 384 -58 213 39 137 139 22 -77 73 142 46 -198
4490a98L13j64J21r1O2O6O2l10J91k6k72L83j6l3k36K78j1k2n1J04j18j32K67
$$ -198 115 -49 72 -19 43 109 171 -139 52 26 -246 137 121 88 -148 130 119 97 46 150 32 -100 167
4513A67j60K03k94k7O9M6J37p1Q0l66L48p9oK01l91J96K0L2k41k1J60Nj27K64
$$ 167 7 210 -84 -111 -42 4 141 70 150 -216 132 53 47 248 -143 53 73 105 -136 -157 3 8 -119 145
4537A45n2o1q3P2q6l8J53j27k10J64oK17j16k29L10J8k15K38j82j9O1J99j91R7
$$ 145 93 32 -51 21 -65 -103 50 -77 -287 -123 -129 88 -28 -257 53 71 -144 94 -88 -107 -46 153 -38 59
4561E9k02L95l31jJ91k39J33q1L66m84L40p1j95K28J17q0k63J70m2P3p8J1o0m6
$$ 59 -143 252 -79 -80 111 -128 5 -76 290 -194 146 75 -120 108 225 145 -118 52 10 83 5 16 -44 -90
4585i0K20k3j10J28k80J35L3K42k13j03L71k79k5J59j06j48j10J08K26m42K31
$$ -90 130 107 -3 125 -155 -20 13 255 42 -61 310 31 6 165 59 -89 -199 -91 135 -307 -76
4606g6J85L5k9l12NJ27JJ92p3M9o7N5j3R7k51j29K89k16J18P4k6J25q1j48R4r2
$$ -76 109 144 115 -197 -192 -65 -64 128 55 104 37 92 79 176 -75 -204 85 -131 -13 61 35 160 79 -69 25 -67
4632f7J22K1k52L01m5j06k30R7J58Np6K30k03o1L23k34Q3j10j1K62l08K31J86
$$ -67 55 76 -176 125 80 -26 -256 -159 -1 4 -72 158 -45 -106 217 -17 66 -44 -55 207 -101 130 316
4655C16l46N1j17j59L71k53N0lJ42N7j83J57O9J2j10q9K3J00K2k32L55l14J49
$$ 316 -30 21 -96 -255 116 -137 -87 -90 52 109 -74 83 152 164 54 -35 -12 88 110 -122 233 -81 68
4678F8P3m4k85K86l4m28J80J59k9k8K67l53L83l69K89k0j63J13M1k66M3m4N8J1
$$ 68 141 97 -188 98 64 -364 -184 -25 -54 -82 185 -168 215 -154 135 115 -48 65 106 -160 -117 -161 -103 -92
4702i2K37J01j59k0J02j56j55L75k35k2o5l5q0K99j82J25j80K14l29N18k40R3
$$ -92 145 246 87 67 169 13 -142 233 -2 -24 -89 -124 -204 95 -87 38 -142 72 -257 261 21 114
4724A14Q0q7j5k05J72o6J00k4Jl51M83l08J53j98O2j46L35J31j96Q8O7J8k60N2
$$ 114 194 107 92 -113 59 -7 93 69 70 -281 202 -106 47 -151 -89 -235 100 231 35 123 190 208 -52 0
4748@q9O1j4J20k56J62Pj79J41K35k12J23p8K64l93o2L99l74J91L1J6j81J86k93
$$ 0 -89 -28 -42 78 -178 -16 -9 -188 -47 188 -24 99 21 285 -108 -170 229 -145 46 77 93 -88 98 -195
4772a95R5m5K23k64P6J67j30NK64j11Rj20J92J58m94L56k94L20k50j40J28K02
$$ -195 -100 -145 78 -186 -110 57 -73 -68 196 85 94 -26 166 324 -170 186 -108 212 -38 -178 -50 152
4794A52O9k28P1k33K53J69m70K59j10Q9o2K05k52OO9r5J1O3R3k28J2J91m2j07
$$ 152 221 -7 64 -169 84 253 -217 42 -68 21 -41 164 -88 -82 -13 -108 -97 -34 59 -169 -157 34 -8 -115
4818a15N06l09P5l58K42k66K28J62r1J74k67O2j3j04R5L2q1O2r2K32p7j03l7m3
$$ -115 391 82 157 -201 41 -225 3 165 74 248 -19 43 30 -74 21 53 -28 34 -58 174 97 -6 -43 -86
4842h6k30M46q2M2k0O9l02J58j25J14nJ53l25K42J11p0P3j24R4O8J0l81K69o4
$$ -86 -316 130 48 90 70 139 -163 -5 -130 -16 -21 132 -193 49 160 90 163 39 133 201 211 -170 99 35
4866C5m9O1J05j74j94K11l3R5M0j94l2L5K56j83P0J82m07K30j11J06j89j12K76
$$ 35 -14 47 152 -22 -216 -5 -38 57 97 -97 -129 -94 162 -21 49 231 -176 54 -57 49 -140 -252 24
4889B4N4j0O1j22o3J18j01k83M95k84P3m6K57j19l2j74Q6Q1K38n28K83J77k76
$$ 24 78 68 129 7 -56 62 -39 -322 173 -111 -38 -84 173 54 22 -152 -66 15 253 -275 8 185 -91
4912i1M3n1MJ72j31K42j34j26P9J38j67M1J61j41j79K00k43K96k56M9L3p7K98
$$ -91 -48 -99 -95 77 -54 188 54 -72 7 145 -22 19 180 39 -140 60 -183 113 -143 -94 -61 -138 160
4935A60k85M02k85j01M3p2J16j13J98N1j42q8p3K26k67L7K88j1J91l04J33k2k22
$$ 160 -125 277 -8 -109 -66 -138 -22 -135 63 114 -28 -116 -189 37 -230 -193 95 84 275 -29 104 82 -140
4958a40j57L87k54K05r9O9j39Q3j13O7M00l95J73q8Q5l72K78pK01j11Mk69j53
$$ -140 -297 90 -164 41 -58 11 -128 -45 -158 -91 309 -86 87 -1 84 -288 -10 -17 184 73 77 -192 -345
4981c45M91k19J17j48J48K9j3j79j4J86J1k27J22k9j4K34k62J86J39l83L82j85
$$ -345 146 -73 44 -104 44 73 60 -119 -133 53 64 -163 -41 -70 -84 150 -112 74 213 -170 212 27
5003B7L3m06K70m3K43j34k85L34K60k87Qj46J53j03J51j73K19Q8k08j65L28l18
$$ 27 60 -346 -76 -119 124 -10 -295 39 299 12 20 -126 27 -76 75 -98 121 209 1 -164 164 -154
5025a54R2R7k9L1n8J29j15m9l7N1J5R7J22l07K05j31L2Oj08J57j20J02P2j02j35
$$ -154 -62 35 6 37 -21 108 -7 -56 -93 -42 -27 70 192 -115 90 -41 -9 -3 -111 46 -74 28 100 -2 -137
5050a37J32n8k5J30J64R5k09P5k69K48k20kJ0l8N7K76l78L9k2J08J57k62J61o0
$$ -137 -5 -63 -88 42 206 301 92 167 -102 146 -74 -76 -66 -104 -47 229 -149 -110 -132 -24 133 -129 32 -28
5074b8P9k44K44j88p8R3J17r0J44J56r1J08m07J99K72n17K49j26j7K8j7o4K49
$$ -28 51 -193 51 -137 -215 -122 -5 -95 49 205 114 222 -185 14 286 -231 18 -108 -125 -97 -114 -178 71
5097G1k04Q9n3N8J12q1M5J10k93L0P6J08m5M5P6J3k12l9K62k99N7l4J82Mk02J53
$$ 71 -133 -44 -97 -39 73 -8 37 147 -146 -116 -40 68 23 68 144 157 -55 -94 168 -131 -74 -108 74 78 -124 29
5123B9P1l97K78K68j22j75N6k59J60j69M38l42J9L3K89l29J71l2kJ35k86J18k11
$$ 29 100 -297 -19 249 127 -48 8 -251 -91 -260 178 -164 -145 -112 177 -152 19 -13 -15 120 -166 -48 -259
5146b59K53J59q7j38M4J37k1n4r8J12M5j0j12M7K30j96j06n3K40j37K8j50P8J43
$$ -259 -6 153 66 -72 -28 109 88 34 -64 48 93 83 -29 18 248 52 -54 -107 133 -4 24 -126 -48 95
5170I5j44P2p0J2J04j30J30l62K46J22J7j52j17K62l5k64j4K03J12J12k86p0J95
$$ 95 -49 23 -47 -35 69 -61 69 -293 -47 75 92 -60 -177 85 50 -214 -228 -25 87 199 -87 -157 38
5193C8j71K5J05j05J05j76L89k44J4r7L48j99k95L82k96M10l26Q8J3O9P2l89L93
$$ 38 -133 -108 -3 -108 -3 -179 210 -34 -20 -117 231 32 -263 119 -177 233 -93 -5 8 77 149 -240 153
5216A53J4J35k07Lm21K40K2k2K92m55Q8J20k7J93k65L36k64N1J91k60j51K10K0
$$ 153 167 302 95 98 -323 -83 -61 -83 209 -246 -158 -38 -65 128 -137 199 -65 -14 177 -83 -234 -24 -4
5239dJ11m95L96J85k58N7k9NJ2k47J24M2N4j01J98q7N8o4p3j7l7P6J38n5k08K15
$$ -4 107 -388 8 193 -65 -8 -37 -32 -20 -267 -143 -101 -47 -148 50 -37 21 -43 -116 -133 -170 -94 44 -11 -219 -4
5265dj5R1J19l41o0M92k71j02l2l8M16l87M3J06o5J68j25m9J86k09N1K66j02l23
$$ -4 -19 72 191 -150 -210 282 11 -91 -123 -161 255 -132 -89 17 -48 120 -5 -54 132 -77 -26 240 138 -185
5289a85K49N4N0j37j94J4J06jj4j63K02M59n91MQ5M52n27K26J09k80J27p0j33
$$ -185 64 118 168 31 -163 -149 -43 -44 -58 -221 -19 440 -151 -147 -62 390 -137 89 198 -82 45 -25 -158
5312a58J41k00L27j77k04M11j97P8oq8m8Q0J05j73J51J7k34J47j21K35j58PK16
$$ -158 -17 -217 110 -67 -271 140 -57 21 15 -73 -121 -41 64 -109 42 59 -175 -28 -149 86 -72 -65 151
5335A51j32k05K54l6M9J8j02J46j02O9j83m5k2J81k03K84j04Nj89J70J59l93J77
$$ 151 19 -186 68 32 81 99 -3 143 41 110 -73 -118 -140 41 -162 122 18 23 -166 4 163 -230 -53
5358e3o9K97m7M3j43q3Q0k78K96K6k01K18k91K59q4j60J89l7O8o5J92j03o4r6
$$ -53 -122 175 128 171 28 -55 25 -253 43 69 -132 86 -205 54 -30 -190 -1 -38 30 -35 157 54 -10 -106
5382a06K71j94K57m44J88j80L56j80p3J71k15P1j11o6j65N99l78L21j14j50L24
$$ -106 165 -29 228 -216 -28 -208 148 -32 -105 66 -149 -78 -189 -255 -420 179 -199 122 8 -142 182
5403A82r1j70q1J48J18J46n9j91o6Nr6J24K3J04k40J66j06L7n7O8m0J44j26j28
$$ 182 91 -79 -160 -12 106 252 193 2 -64 -59 -155 -31 -8 96 -144 22 -84 -47 -104 -36 -76 68 -58 -186
5427a86K74l7J11l41J35Nk44L40k03J97q5q6P0p2J18R7j72p7K22J4J14j14Km45
$$ -186 88 51 162 -179 -44 -39 -283 57 -146 51 -34 -120 -50 -122 -4 93 -79 -156 66 80 194 80 82 -363
5451c63N45k07L04k51J16j86R4k84J38o0OL36j80oNM7k10K13J12k12l7J69Rl92
$$ -363 182 -25 279 28 144 -42 52 -232 -94 -154 -148 188 8 2 7 54 -156 57 169 -43 -80 89 98 -294
5475b94K95J55l61K67q6p1K50P7k52k7j48K70J07j25k73J51k19M57l66K33j56
$$ -294 1 156 -205 62 -24 -95 155 232 -20 -47 -195 75 182 57 -216 -65 -284 173 -193 40 -116
5496a16K6P5J8k61K46M9k35K69j55L39j10k20K9Q7l3K96l16L8J50j17j43L5RK11
$$ -116 -90 -15 3 -258 -12 37 -198 71 -84 255 145 -75 -46 41 8 304 -12 26 176 59 -84 -49 -40 171
5520A71N2m4q1q2q7K34k49J92n2q9j64L56k29K49k05J4J46j80j3K1N1J52l15K03
$$ 171 223 179 98 16 -71 163 -86 106 54 -35 -199 157 -72 177 -28 -14 132 -48 -61 -40 11 163 -152 51
5544E1n1N9P3p9l0l9p8R6J58l11L21j96K34k48J88k35KQ2J59j57J1p1K12j99O
$$ 51 0 59 132 53 23 -16 -94 2 160 -151 170 -26 208 -40 148 -87 -85 -3 156 -1 10 -61 151 -48 -42
5569d2j01J31K73k99J29j98r5J75J94m10K53R9j24L9J85j60o9m5P3Q6O0j19r5
$$ -42 -143 -12 261 -38 91 -107 -202 -27 167 -243 10 109 -15 24 209 49 -20 -65 8 94 154 35 -60
5592f0N1J45l74R4K83R4j77J04j24j93J45R7j00m8K51k37n3M1Q6j5K44j20kj68
$$ -60 -9 136 -238 -144 139 233 56 160 36 -157 -12 85 -15 -63 188 -49 -102 -61 25 10 254 134 132 -36
5616c6Q3k30L53R9j65nj76K2o2J79j27K54k71J78j75P5j48L24k80M3j2m1O4N6
$$ -36 47 -183 170 269 104 99 -77 -55 -117 62 -65 189 -82 96 -79 -4 -152 172 -108 -65 -77 -118 -54 2
5640BR0k66J32K02k87Q6Q5j8J04j40q0J08k56K54j44L65l44K33j0k99P1P2M54
$$ 2 92 -174 -42 160 -127 -41 44 26 130 -10 -90 18 -238 16 -128 237 -107 126 116 -183 -112 -40 414
5663D14j54k78o2L2j46K32J42j37J27j40m79N42k9j25L9k9L6k4n6j26M9K59k02
$$ 414 260 -18 -80 -48 -194 38 180 43 170 30 -449 93 64 -61 -22 -51 -15 -39 -95 -221 -172 87 -115
5686a15O6J87l5k14LJ23j10K14l04L70k22Q1k4p2K00o4j74j1L40n8j49N6j93M8
$$ -115 -49 138 103 -111 -108 15 -95 119 -185 185 -37 44 20 -52 148 84 -90 -101 239 181 32 88 -105 -57
5710e7J78l16L60l89K67k97K43r5K22j41O9j19k34L07J25j32j94K22J71l96L24
$$ -57 121 -195 165 -224 43 -254 -11 -106 116 -25 44 -75 -309 -2 123 -9 -203 19 190 -206 118
5731A18k96j9N04j71n0J81m02P9J53r0j38L19j7j47j21K51j77J20k19L70n2J77
$$ 118 -178 -197 307 136 86 267 -135 -56 97 7 -131 188 171 24 -97 154 -23 97 -122 248 196 373
5753C73m27K5o1M8q0M5K82l05J03J39r7Oj85K15j13K6JJ24j32Q5O0m2k4j46lk33
$$ 373 -54 -29 -90 -42 -122 -77 205 -100 3 142 45 51 -134 81 -32 -6 -5 119 -13 72 132 90 66 -80 -83 -316
5779c16N60k63k0j18L84j86m7j53K46j06K2m5Mj37j18K09J00J11j64M3k42K47
$$ -316 244 -19 -39 -157 227 41 -6 -159 87 -19 3 -42 -38 -175 -293 -84 16 127 -37 6 -236 11
5801A1N9j39K01o1j05PJ68k36j02J97K76k95n7O7J65n2l14K14j8J49J1j74kk1
$$ 11 70 -69 132 71 -34 -27 141 -95 -197 0 276 -19 -76 -9 156 104 -210 4 -14 135 146 -28 -30 -51
5825e1J79k90J64K62l15K74J34k62M7j96J23K16k01k21M8K36l41L33l8k57L1O9
$$ -51 128 -162 2 264 -51 223 357 95 142 -54 69 285 84 -137 -89 147 -194 139 101 -156 -125 -56
5847e6J20o0J31M8m61L07j18k9J65L1J56k27j74K32j26N4L4o1k6J26J58l53J52
$$ -56 64 4 135 183 -278 29 -89 -118 47 78 234 7 -167 65 -61 -7 27 -34 -60 66 224 -129 23
5870B3k3o2k0j60J54J31J02k67K27P4q6l0n3k26L15m2j84L00j83O8J83k8j24j59
$$ 23 0 -62 -82 -242 -88 43 145 -122 105 179 93 63 10 -216 99 57 -127 173 -10 58 241 213 89 -70
5894g0RP1oJ86o6k27M32l86Q6j6M1K2K9lR4j58L0K5r0k23P7j2K26N2J3j99J66
$$ -70 -61 10 4 190 124 -103 329 -57 29 13 54 76 105 102 196 38 68 93 3 -220 -143 -155 71 123 136 -63 103
5921A03j53j75M07r3k10O6O1o5M5k16J90K37k72J59j77K88j02j18n8j47L25p9
$$ 103 -50 -225 182 89 -121 -55 6 -59 -14 -230 -40 197 -75 84 -93 195 93 -25 -83 -230 95 16
5943A6lp3L02k37J64j49J6oL5j07P3j52K12P4k60P9N8n6O6J45j83o6j59J01O2
$$ 16 13 -60 242 5 169 20 36 30 65 -42 31 -121 91 165 -95 -16 42 -14 52 197 14 -52 -211 -110 -48
5968d8J6J78j56l05L67J50p4n7r8oj2nJ49m2j9p8q5K01j0n6j17J71r8L84l24k71
$$ -48 -32 146 -10 -315 52 202 128 71 -27 -33 -45 -50 99 57 38 -40 -125 76 66 10 -107 64 -34 350 26 -245
5994b45K23qJ80j71l3j49L5jJ45r0K13r3O4j4j6j08m3j1L2r7L64l05j77L59r7
$$ -245 -22 -30 150 -21 -54 -203 -168 -169 -24 -114 99 6 70 56 40 -68 -111 -122 -90 -187 177 -128 -305 54 -43
6019d3p9K67m16J07K17R3k80K19L4n8o8j59M0J62K20k64j88J41M2J55j6l34P5
$$ -43 -122 145 -271 -164 53 146 -134 85 119 61 -7 -166 -126 36 256 -8 -196 -55 -13 142 126 -208 -133
6042a33J1Q0Q6j10J59J82l69K66k60l0Q7j02J59J46k72j65M61l00l2K78j16J26
$$ -133 -122 -42 44 -66 93 275 -94 172 -88 -118 -31 -133 26 172 -100 -265 196 -104 -136 142 26 152
6064A52j54J00j68J18j79oJ01L1qN8J42n18J27L41j28R0k29l9J93j31orJ44j93
$$ 152 -2 98 -70 48 -131 -137 -36 -5 -13 45 187 -331 -204 137 9 99 -130 -169 24 -107 -113 -122 22 -171
6088a71j08J47O8M6nj19R4O3r0k65N20j77on5R7j94k3L34j27j65J21j29Q7M7J54
$$ -171 -279 -132 -64 -18 -23 -142 -48 15 -75 -340 180 3 -3 -58 39 -155 -178 156 29 -136 -15 -144 -57 -10 144
6113A44j42j97j14K33K4k23K76J30k18J64n3k1o8R0o0K9k47K21J07j62R2o4J27
$$ 144 2 -195 -309 -76 -52 -275 1 131 -87 77 24 3 -65 25 -35 -6 -253 -32 75 -87 5 -59 68
6136F8o2N0j61j28M22j97p2n3J63L1r7k3J82o5j33J42j64K1k30L1M84l47J98j15
$$ 68 6 56 -105 -233 189 -8 -80 -133 30 61 -36 -59 123 58 -75 67 -97 -76 -306 -275 209 -138 60 -55
6160e5j1J50l0pk2K34k28l5j25J83k40L07k05N7J08n8l8k9J80k07P4j81J80j43
$$ -55 -66 84 54 47 25 259 31 -4 -129 54 -186 121 -84 -27 81 23 -15 -44 136 -71 3 -178 2 -141
6184a41J4O1M0JO2j10J59k27J90J82j47l27J54K53k9k12j6j5J36j6j20l2n0J78
$$ -141 -127 -66 -26 -25 37 -73 86 -141 49 231 84 -243 -89 164 135 -77 -93 -108 28 12 -108 -140 -190 -12
6208a2J28j19J5%j56k8PJ42J53N2j62O4k10K94j47KJ26l38K54p0o5K14q9j56J48
$$ -12 116 -3 12 12 -144 -172 -165 -23 130 182 20 84 -126 168 21 23 149 -189 65 -5 -70 144 55 -101 47
6233D7K4r6k40M07l24K45J76l39o5J70o4k44R6M83q1k51r1j5Q0J06J25l31L21
$$ 47 71 -25 -265 142 -182 63 239 -100 -165 5 -59 -303 -207 276 195 -56 -147 -162 -82 24 149 -182 139
6256A39l86Q5M18k13m3k99L37q5k14L48Q7j59j34J34l00K93J11k29R6r7K37J14
$$ 139 -247 -162 256 43 0 -299 38 -47 -261 87 174 15 -119 15 -285 8 119 -110 -14 -111 126 240
6278B40j46j37Q6l3P9k32J34k06J19j06J02N2r2K39j47J38L3j43L8J2K1J62k12
$$ 240 94 -43 43 10 89 -143 -9 -215 -96 -202 -100 -48 -140 99 -48 90 123 -20 18 30 51 213 1
6301An5j54P23o83j60N46j6mk17K47j89Rl6Pp4R1k02Q4L3J30K6o7j0J4k4j54R0
$$ 1 -54 -208 515 -168 -328 218 202 198 -19 228 39 48 12 19 -55 36 -166 -82 -49 81 107 40 30 44 20 -134 -44
6328d4J95j11j33O1n9J62Kl1k0n3J11l24K20M9K60k90n0M6q0J02p4k39K85K49
$$ -44 151 40 -93 -32 -91 71 73 42 22 -31 80 -244 -24 25 285 -5 -55 -9 -89 13 -61 -300 -15 234
6352B34j41j37K3J84j06j93L6J26J0j32q3L6K29P2k30J22l4k16J15m7J59j44J19
$$ 234 93 -44 -21 163 57 -136 -100 26 36 -96 -179 -143 86 158 -72 50 16 -200 -85 -132 27 -117 2
6375BK39k68j7j1k0J5P3ML4J2Q5j98M15l30k52K95j44K52l52R2J91J41l71J34
$$ 2 241 -27 -44 -55 -75 -60 13 17 51 63 148 -50 365 35 -217 78 -66 186 -166 -74 117 258 -113 21
6399B1k28Q8K50N5n1k05k7J22jk82L72k29J29N2K1l9j93K30m4K8Knj72M6p1j24
$$ 21 -207 -119 131 186 135 -70 -97 25 24 -258 114 -115 14 66 87 48 -145 85 41 69 71 66 -106 -60 -131 -255
6425b55K74R2j52j8M6JM4K2j35L19k47N5P2j30j28p6L00J56m18K65l9Q8j81j10
$$ -255 19 111 -41 -59 -13 -12 32 54 -81 238 -9 46 118 -12 -140 -216 84 240 -178 87 48 136 -45 -155
6449a55l6K42p4Lj00j9o9K63r7J10j05K21k07R5q6P9J08k69J26j4j9k7nk46L38
$$ -155 -191 51 -23 -20 -120 -139 -208 55 -42 68 -37 184 -23 72 -14 65 173 -96 30 16 -3 -30 -35 -281 57
6474E7k19J26J00P7mj27p8J65l49N31k18M8K3k63K56j58j00OJ99j9k18J90J28
$$ 57 -162 -36 64 141 137 10 -68 97 -252 279 61 109 132 -131 125 -33 -133 -127 72 53 -165 25 153
6497A53R3l1m42K02m7j1J51j89J3oL08o42O56j29m1k94L34k07J08j1j53K62j8
$$ 153 246 215 -227 -25 -72 -83 68 -121 -108 -114 194 -448 208 79 38 -256 78 -129 -21 -32 -185 77 59
6520E9L7j01J30Rk67L1K39K0J1j75K94k05l40P5K20p5k06j9L83k92O53m60j41
$$ 59 96 -5 125 134 -133 -102 137 157 168 -7 287 82 -258 -183 37 -38 -244 -263 120 -172 481 21 -120
6543a20M08l76mK22l4p2k1K5r2K66j93J34k16p0J73K84k03j87O0j31K24K1j58
$$ -120 288 -88 -92 130 96 24 3 28 -64 202 9 143 -73 -143 30 314 111 -76 -16 -147 77 98 -60
6566f0N7k57K72j8j08J91l2M4K59k12k27M1l0j2K08oom6P3k5p5m1J31l18J32J36
$$ -60 -3 -260 12 -6 -114 77 45 89 348 136 -91 -50 -80 -92 116 110 104 58 131 106 31 -10 121 -197 -65 71
6592G1k31M3L5K11k27j0J09J88j12k33J38J03n5j49p3K48j25n9J73Q8l07J30O6
$$ 71 -160 -117 -82 129 -98 -108 1 189 77 -156 -18 85 30 -119 -192 56 -69 -128 45 133 -174 -44 22
6615B2%q5j43L23l06K64n0l2o1J19R9nL0r9j2K47l30K4l48K96q6OK07J86m66J66
$$ 22 22 -63 -206 117 -189 75 25 -7 -68 51 150 145 175 76 64 311 -19 5 -343 -47 -133 -127 80 266 -200 -34
6641c4J73j07o2j22K54k57K20j1j17J41K18l30K77n8k27k6Pl6N7J8r7L07k64K44
$$ -34 139 32 -30 -152 102 -155 65 54 -63 78 296 -34 243 185 -42 -68 -61 -97 -40 -22 -119 188 -76 168
6665A68j25n6j06q2J09R8R5J3j05j10J66O6l25J41K24k46K16J7j97K25k58J78
$$ 168 43 -13 -119 -201 -92 6 101 114 9 -101 65 131 -194 -53 171 -75 141 158 -39 186 -72 106
6687A06j93K5M9K48k29l6K03k08K12k11J09r4m8k47K94Pk59K69M9j31J28J08j01
$$ 106 -87 -62 -13 235 6 -30 173 -35 177 -34 75 -19 -67 -314 -20 -13 -272 -3 46 -85 43 151 50
6710E0j14j26J13O6K32k57l7m8J51q8Q3j14Q4jN0M5j42J26k4l52K22j27j49M35
$$ 50 -64 -190 -77 -11 221 -36 -73 -121 30 -58 25 -89 -5 -6 44 89 -53 73 49 -303 -81 -208 -357 78
6734G8M1j18Q2r2N7n2qj20L06O5j96l04K21m3J06K4K5o9q0q5K99J79k37p3J86
$$ 78 119 1 83 -9 48 -4 -12 -132 174 239 43 -261 -40 -83 23 47 72 3 -77 -162 137 316 79 6 192
6759A92j21J3k33n4j69L04M01l20m7j03K64k78J92j47J0M9m2N4j3M7J43j61l1
$$ 192 71 84 -149 -203 -372 -68 333 13 -34 -137 127 -151 41 -106 -96 -47 -89 -35 -48 -1 142 -19 -50
6782e0J13p0J1Q4j91J12L1J30N9j13k07J39m7o4j34j0K16j02J03q9p7L97l10j26
$$ -50 63 -7 4 88 -103 9 40 170 229 116 -91 48 1 -63 -197 -207 9 -93 10 -79 -156 241 -69 -195
6806a95J40O4j42n1J75J18k04P3j96R5L91m34K7N0J5j89j8M58Nl9j52r7J11j7
$$ -195 -55 9 -133 -184 -9 109 -95 -22 -218 -123 268 -166 -139 -89 -74 -263 -281 177 182 143 -9 -106 5 -12
6830a2%j00j34J52O7p4J69q5J70l20J86j3j47J57l0K7l9O8j03RJ25j19K43j72
$$ -12 -12 -112 -246 -94 -27 -101 68 -17 153 -167 19 6 -141 16 -14 13 -26 42 -61 -52 73 -46 197 25
6854B5l40K88o6o1J79J75l5l34J3J46L3Okj98K80k67K55k27K3J21j22K60L5k87
$$ 25 -315 -27 -93 -154 25 200 165 -169 -156 -10 23 29 27 -171 109 -158 97 -130 -107 14 -108 152 187 -100
6878a00M1%j27L95j38K5l6P6j09j26J15mo1K18l61J22J83j31J55k65J76P6j04
$$ -100 -59 -59 -186 209 71 96 60 136 27 -99 16 12 -49 169 -192 -70 113 -18 137 -128 48 124 20
6901B0j18K08j91n0OL10k81J81J74j72o4J7M0K4ok38K11j76J1M2J57p1j0o4M26
$$ 20 -98 110 -81 -131 -125 185 -96 85 259 87 23 40 80 104 98 -140 71 -105 -94 -52 105 34 24 -40 386
6926C86m65R6q7K25L1p9k32L0o1L19J99l80m9J05Q0l10M7P5m7pK57m11K13j08
$$ 386 -79 17 -70 155 186 107 -125 -95 -156 163 362 -18 -67 38 118 -192 -145 -70 -117 -124 133 -278 -65 -173
6950a73P9Q9j15L65m24J2J11J52j12J08n4M4k59M90n87M47K1m98R50k73N03r63
$$ -173 -94 -5 -120 245 -179 -167 -56 96 -16 92 38 82 -177 313 -274 173 194 -304 646 373 876 -87
6972h7j49N57j96l51O5l53J111o3n97M11m77P9l8J34J75m18K77j30J4Q1j93L90
$$ -87 -236 321 125 -226 -161 -514 597 534 -63 348 -129 -50 -88 46 221 -197 80 -50 -36 45 -148 242
6994B42j67k52K26j42J74m4j50J77j69K47k71J2R7j20J28l5n7Q6m4O2R6Llj52
$$ 242 75 -177 49 -93 81 37 -113 64 -105 142 -129 -117 -20 -140 -12 -47 -104 -18 -62 0 96 99 96 -56
7018e6k67L91K07k67j38K44q5j13Pj3K7n5j2j55M16j47n7N9j30L17k07M5K9j67
$$ -56 -323 68 275 8 -130 114 29 -84 -77 -90 -63 -118 -130 -285 131 -16 -73 -14 -144 173 -34 11 40 -127
7042a27K05M2M8l13J68K73n30K75o9l14L59J82k92j7R3o2n3K38Kk26L82j45j74
$$ -127 78 120 168 -145 23 296 -234 41 -28 -342 17 199 -93 -110 -17 -79 -132 106 108 -118 264 119 -55
7065e5r7K78j02n2P4O4p1p1M9J9l9r6L80k68j70L23l32j5K71K1j17J16K5q5j83
$$ -55 -152 126 24 -28 46 110 39 -32 17 36 -3 -99 281 13 -157 166 -166 -181 90 111 -6 110 135 50 -133
7090a33K24k9J02j2j63P9l00J88J05k66J8J46K17l95J56J2k16K34L41k64Q7L1
$$ -133 91 62 164 152 -11 68 -232 -44 61 -205 -187 -41 176 -219 -63 -51 -267 -33 308 44 131 162
7112A62l0k03o7L02N8k77K16j25j55K3J74o2q6Q8P5k14P7j1K20j70J0O0l65L46
$$ 162 132 -71 -138 164 222 -55 161 36 -119 -96 78 16 -70 18 93 -121 -44 -55 165 -5 5 65 -300 46
7136D6p6j15K50j29p3K59k09K58J7k76J8P1j7J04k88K50mJ62k14j47J48L1Q6j85
$$ 46 -30 -145 105 -24 -97 162 -47 211 228 -48 -30 41 24 128 -160 90 86 248 34 -113 35 66 152 -33
7160c3J52k5K2j91j11J00L7N0M1j12J2K74k78L3M5q9J82j3m1j14j04J37l1J44
$$ -33 119 94 116 -75 -186 -86 -49 1 42 -70 -58 216 -62 -29 16 -73 109 96 55 -59 -163 -26 -57 87
7184H7K2l1k99m8K41PJ15l8J84j78j34J32j23m7J20RO1K9p8J42j60O1J31k12J94
$$ 87 109 78 -221 -269 -28 -21 94 56 240 62 -72 60 -63 -110 10 19 80 109 31 173 13 74 205 -7 187
7209A87j27l5J16L0k26K6o7m6Q1j79L49k97J33j7p7J76m40L59k31K84O5j37Q5
$$ 187 60 25 141 171 -55 -29 -96 -142 -61 -240 109 -188 -55 -72 -149 27 -413 -54 -285 -1 64 -73 12
7232A2j93P6J1k7N8q4K62N2m0j83%M6q5K3J80k0j32Lm2r2J18k88J48K92j24O9
$$ 12 -181 -105 -94 -121 -63 -147 115 167 127 -56 -56 -10 -95 -72 108 88 -44 -41 -83 -175 -57 -345 -197 95 -29 40
7258D0Lj69P4N6J68j2k60J3P4N9J32M0j52J60j12j01j50j79K89J1m8J28j8j16
$$ 40 43 -126 -52 4 172 160 -100 -87 -13 46 178 218 66 226 114 13 -137 -316 -27 -16 -64 64 46 -70
7282g0K3r2J99o4K23l47J66o8J51m62Q0M14j78k0j5J34l6l7K34n8p9j18J94j78
$$ -70 -47 -139 60 -4 219 -128 38 -30 121 -341 -261 153 -25 -45 -60 74 38 1 235 177 98 -20 174 -4
7306dOO5k84L4N1p5K34j34K78p2m9l7J50k28J54j39J83k6k94M89m58J87k75P1
$$ -4 2 67 -217 -183 -132 -207 27 -107 171 99 50 13 163 -65 89 -50 133 107 -187 302 -156 31 -244 -173
7330a73J75Q7K55k72k65L23k20J3J26J8j9k29J37j4l61M73l08L08j32J13q1L3
$$ -173 2 89 344 72 -193 130 -90 -77 49 67 48 -181 -44 -58 -419 54 -254 54 -78 35 -46 -13
7352a3J16r2k35K77r2j5L46k60J28l61L64j37k7o4Q6j65J94m9J60o7l7l5k04K13
$$ -13 103 11 -224 53 -39 -54 292 32 160 -201 163 26 -1 -65 21 -144 50 1 161 94 57 22 -182 31
7376C1lOr2J65L4n6j89J80j49K43l21L64j26j03j3j06J89K6j03k26L31Q5l39J35
$$ 31 28 34 -58 107 141 85 -104 76 -73 170 -151 213 87 -16 -29 -135 54 80 -23 -249 82 167 -172 -37
7400c7j86K52n3J94l69J43R2k2lJ20P0j48k00k61M30n5m2J73m9k28K95n8k20J34
$$ -37 -223 29 -24 170 -199 -56 36 14 11 131 201 53 -147 -408 22 -33 -75 98 49 -179 116 58 -162 -28
7424b8j33K04j24L31q1o5j02J21j31j78M20j73Q3P2m27J41K83j97o1J22q4J14
$$ -28 -161 43 -81 250 169 104 2 123 -8 -186 234 61 144 216 -211 -70 213 16 -45 77 -7 107
7446A07p9o4m9J29K5nj16P4j55J73j62J28j31O1K21j52j51J80N3j10j08L2k05
$$ 107 28 -36 -85 44 69 64 -52 22 -133 40 -122 6 -125 -64 157 5 -146 34 87 -23 -131 -99 -304
7469c04M40k21l2o5K42P1J7k50J78l9J8r1j09J42k57K55k09J40J5M0m5l5J36j08
$$ -304 136 -85 -117 -182 60 131 148 -102 76 37 55 -36 -145 -3 -260 -5 -214 -74 -59 -19 -64 -99 37 -71
7493g1N8O0j72J8J10j0O2m4J54M0j61J83j18k07J0P6r1L4Q0M7j34J06R0q2R6j40
$$ -71 -13 47 -125 -107 3 -7 55 11 165 205 44 227 109 -98 -88 -12 -103 -69 11 58 -76 30 120 38 134 -6
7519fK9p1J66J0k66P4Q7J04j21Q2q4N1p7l9qQ6m4L9Q2Kj58JJ85J63n03K76q6K48
$$ -6 23 -48 118 128 -138 -64 23 127 6 88 4 55 -22 -61 -69 17 -27 12 94 96 -62 -61 124 287 -216 60 -26 222
7547B22j16n1q6J43j58J92j45J16k48N06n61K15l4K03l14k9J55k1P9o3q7R0P9
$$ 222 106 55 -31 112 -46 146 1 117 -131 375 -186 29 -5 198 -116 -145 10 -11 68 5 -82 8 87
7570H7l0o0j57L85l03J6j45K14l15K87J34j10R4o4j23j20J58K40k55J7k1O1l9
$$ 87 57 -3 -160 225 -78 -62 -207 7 -308 -21 113 3 97 33 -90 -210 -52 188 -67 -50 -71 -10 -49
7593d9K80o1l43J09J33J6k07R3oJ02j66R8j06J46J6J6ok26L09n42L66j18j04K80
$$ -49 231 170 -173 -64 69 85 -122 -29 -35 67 -99 -1 -107 39 55 71 65 -161 148 -394 -28 -146 -250 30
7617C0k2J64k14N8k41J12K86j49j09L22j52k93L05o6l9m0J76l3N9rl64J92j31
$$ 30 8 172 -42 16 -225 -113 173 24 -85 237 85 -208 97 31 -8 -48 128 95 154 145 -219 -27 -158
7640a58J79q8N0O8K02k90k84K88K3r8N7j67J19J04m7n0J26M8j08K69j4k71r8R2
$$ -158 21 -67 -17 51 253 -37 -321 -33 -10 -108 -51 -218 -99 5 -42 -92 34 82 -26 243 229 -42 -140 -48
7664d8K1q6NJ68K00l17n8J63j22K62k40K73l76J88n1M8J08j27j19n0L66j29J90
$$ -48 -27 -113 -108 60 260 -57 -115 48 -74 188 -52 221 -155 33 -18 30 138 11 -108 -158 208 79 269
7687B69l72J77L93m98j29nM29M1r61O04L96p61N24j38J36J68l37j71R10k84k83
$$ 269 -103 74 467 -31 -160 -165 264 305 -656 -52 344 -417 107 -31 105 273 -64 -235 675 391 108
7708A08k76L15k19L36k78K54j9k24L23m55J11J08p0k04P7K7J22j37J67q7K18k41
$$ 108 -168 147 -72 264 -14 240 221 -3 320 -135 -24 84 14 -190 -113 -86 36 -101 66 -21 197 -44
7730d4O4J23j79k10K35O0k10K57k18M8J39J1k16J19l7O1J08k93K05j1j05Q3l7
$$ -44 20 143 -36 -246 -11 49 -161 96 -122 -74 65 76 -140 -21 -58 3 111 -182 23 12 -93 -10 -47
7753d7j33L20k2k55L35n7j47o2K25k25L3K1J4Q1j07j63R5J06O7L0l6K09k44J45
$$ -47 -180 140 118 -137 198 141 -6 -68 157 -68 -35 -14 0 81 -26 -189 -94 12 79 109 73 282 38 183
7777A83l68K12K48k24p5J84j70j42M6K24k03J31l2J85p7R9j26j53J74k06K71n4
$$ 183 -185 27 275 51 -24 160 -10 -152 -106 118 -85 46 14 199 122 221 95 -58 116 -90 181 127
7799A27p8n9j03J0L7r5M6J08o5J34q2J63k6j39r3J21nJ01O1J6k28Q8o2J3O4l55
$$ 127 49 -10 -113 -103 -66 -161 -115 -7 -72 62 -20 143 117 -22 -115 6 1 102 163 179 -49 39 -23 -10 54 -301
7825c01K56R8J29m31K87k8j29p9N7L74j52J83k10J39k93O0P7j98J07J07M2M8q1
$$ -301 -45 53 182 -249 38 10 -119 -198 -141 233 81 264 54 193 -100 -40 37 -161 -54 53 95 143 62
7848F2j44K93j17J19l02n8J41j14j46J58j3J6o0J55P4J08k57OJ27k12QJ30K22
$$ 62 -82 211 94 213 -89 -147 -6 -120 -266 -108 -121 -105 -165 -10 64 172 -85 -79 48 -164 -156 -26 196
7871A96j91k25L54k00J31mj14j06L50j81m9R9j44K32j82q3N1N2J84j10m8j15J75
$$ 196 5 -220 134 -66 65 61 -53 -159 191 10 -39 60 -84 148 -34 -117 -66 -14 170 60 12 -103 72
7894G2Rj83Q9J12j54J1q0Oj70J56M30j94k11K54k42K05K6j76m4LK69l39K14j9
$$ 72 81 -102 -13 99 -55 -44 -124 -118 -288 -132 298 104 -107 147 -95 110 136 -40 -84 -81 188 -151 63 44
7918D4qR8j63m9q0p0J00J49p1L16m32k11K24K66j24K50m10O8J34M3k9j56K14j76
$$ 44 36 134 -29 -78 -158 -228 -128 21 -50 266 -166 -377 -153 113 -11 239 -171 -103 31 74 45 -111 103 -73
7942g3l4J91J68l20J50j91J97n2j20J04J9O8K63k66l29J65O9j19J0J15j35K13
$$ -73 -107 84 252 -68 82 -109 88 36 -84 20 39 107 370 104 -225 -60 9 -110 -100 15 -120 93
7964I3j98J53k05K89p0rr9J92j92p6J27J84j9j83m5p6K55J01j32qj12o3nK12k6
$$ 93 -105 48 -157 132 62 53 -46 146 -46 -122 5 189 170 -13 -58 -134 121 222 90 82 -30 -93 -98 114 88
7989H8j35J50j46Q4m5L4r6N3L2P5k0p6m37N16o4j29J25j70J16p1K08j13K2n7J15
$$ 88 -47 103 -43 41 -4 30 -66 -13 19 94 74 -2 -439 77 13 -116 9 -161 -45 -116 92 -21 1 -56 59
8014E9J9P6l01J77P6l59K93q6M6J29K8k59K61l04L06n75N31j42K31k55P0M6j96
$$ 59 78 154 -147 30 106 -253 40 -46 0 129 157 -102 159 -145 161 -414 117 -25 206 -49 21 67 -129
8037a29M0J12j28J86o6J6j94L5J03j17J94M1K1j41Jj09L13m28J98j60L29l2k7
$$ -129 -89 23 -105 81 15 31 -163 -128 -25 -142 52 93 114 -27 -26 -135 178 -250 -52 -212 117 85 58
8060E8L56o23N2n6K71j01J73m2r6K79k35j42P0J2q9J69Q1k03O0j32J67K60j31
$$ 58 414 -209 -157 -213 58 -43 130 88 -8 271 36 -106 -36 -24 -113 56 137 -66 -6 -138 29 289 158
8083A58j45j22J15J03j87J78Kj44O3L9J1m7l9l5j15J48J19o5j6K70m25J10j82
$$ 158 13 -109 6 109 -78 100 102 -42 21 60 71 24 -15 -50 -165 -17 102 37 21 291 -134 -24 -206
8106b06R7prK29j95J62k7L7O5k35K72k69J91m6n7J6o2n5LJ20J36j61k3J35l11
$$ -206 -109 -116 -125 104 -91 71 44 81 146 -89 183 -86 105 59 2 18 -44 -99 -96 24 160 -1 -24 111 -200
8131b00J70m5M7k3J04J61n6k59Q7R0j28J67k41K71l14K28K5l9j88J14J7J74r9
$$ -200 -30 -75 -28 -51 53 214 158 -101 -14 76 -52 115 -126 145 -169 59 84 45 -143 -29 -12 162 63
8154F3M0j64N4M7j06j50M13l51M8P0r2L0R3O6LP7n6K25n07L21k15l7J44K24m3
$$ 63 103 -61 -7 40 -66 -216 197 -154 -106 -36 -128 -98 -5 61 64 141 85 310 -197 124 -91 -128 16 240 197
8179A97j50m8M5J32l56L71l71K32R2K7j28j26
$$ 197 47 -1 44 176 -180 191 -180 52 144 171 43 -83
8191h3
$$ Imaginary data points
##PAGE= N=2
##DATA TABLE= (X++(I..I)), XYDATA
0@%%%%%%%%%%%%qJ6j6J6j7K5l2M0m8N6p2Q8j00J12j32J53j77K03k30K62l00L40
$$ 0 0 0 0 0 0 0 0 0 0 0 0 0 -8 8 -8 8 -9 16 -16 24 -24 32 -40 48 -52 60 -72 81 -96 107 -123 139 -161 179
34A79l82M32m88N50o15O82p58Q45r38J038j149J270j404J551j706J880k073K280
$$ 179 -203 229 -259 291 -324 358 -400 445 -493 545 -604 666 -738 813 -893 987 -1086 1194
52A194k513K773l061L389l759M182m675N251n940O784p837R199j1042J3678j7796
$$ 1194 -1319 1454 -1607 1782 -1977 2205 -2470 2781 -3159 3625 -4212 4987 -6055 7623 -10173
67a0173K5184m2511J60124J15868k59261j27150n2361J35894J43738Q5340j4086
$$ -10173 15011 -27500 132624 248492 -10769 -137919 -190280 -54386 89352 174692 160606
78A60606j91198j90375O3980J79979J68438k0728j68187j16962m0448N7014J82553
$$ 160606 -30592 -220967 -156987 22992 191430 170702 2515 -114447 -154895 -97881 84672
89H4672J10502o0398j99339j41943Q6357J68371Q4807P385j03056j46280o2464
$$ 84672 195174 134776 -64563 -206506 -120149 48222 133029 140414 37358 -108922 -171386
100a71386Q8419J93318Q2281j17034j47645p1571M1638J20632R8680L0170j00276
$$ -171386 -82967 110351 192632 75598 -72047 -143618 -101980 18652 117332 147502 47226
111D7226j77993m0546J28936J56391L8442j00248j04926o2019k975J20172J38199
$$ 47226 -130767 -171313 -42377 114014 152456 52208 -52718 -114737 -117712 2460 140659
122A40659P140j40390j49794J1098J17632R4665L9250n1116j09111r0495J0616
$$ 140659 147799 7409 -142385 -131287 -13655 81010 120260 69144 -39967 -130462 -119846
133a19846J47339J22375l7758j27816r9171J0865Q1302Q3752O3501m2984j42082
$$ -119846 27493 149868 112110 -15706 -114877 -104012 -22710 61042 124543 81559 -60523
144f0523q2428N6491J37872P3778m8836q4210p4002k6912P2160J13433N3287p2609
$$ -60523 -142951 -86460 51412 125190 76354 -7856 -81858 -108770 -36610 76823 130110 57501
156E7501j36918m3228P0463R2514N4391j5006p5348r1638l3671R4518J28717J2545
$$ 57501 -79417 -122645 -52182 40332 94723 79717 4369 -87269 -120940 -26422 102295 114840
168A14840r0867r5752k5238M7078P1921P2717K850j05924j02015P628J03972R3457
$$ 114840 23973 -71779 -97017 -49939 21982 94699 97549 -8375 -110390 -102762 1210 94667
180I4667p782o7751o7717m5531K8317R6407P9158k2675j17881p6871L4739P9662
$$ 94667 86885 19134 -48583 -94114 -65797 30610 109768 87093 -30788 -107659 -72920 6742
192F742O3234J2333m7577q4015n8869M6174J16218N3934n1577r1349m8730J8917
$$ 6742 69976 82309 34732 -49283 -108152 -61978 54240 108174 56597 -34752 -83482 -64565
204f4565N7466P1001L2019o1804j03782l5630O8553R6161K6860m2132o2980n4298
$$ -64565 -7099 63902 95921 34117 -69665 -105295 -36742 59419 86279 44147 -18833 -73131
216g3131m586O8308R0057J6188q4138q9996n666O0464O5553L1482j9579o8336
$$ -73131 -77717 -9409 80648 96836 12698 -77298 -82964 -22500 43053 74535 54956 -13380
228a3380p2030M704R0383P8094j2310p6126o1348o379L7242O4567N0569k3290
$$ -13380 -85410 -80706 9677 87771 75461 -665 -62013 -68392 -31150 33417 83986 60696
240F0696q9086o4491K9737Q6607N0587j5135n1527n7256k6176L7922Q2911M7597
$$ 60696 -28390 -92881 -63144 23463 74050 58915 7388 -49868 -76044 -38122 44789 92386
252I2386m7175q8301l6577L5020O1567M3129K541m6418p3452k7260N8973Q3971
$$ 92386 45211 -43090 -79667 -44647 16920 60049 62590 16172 -57280 -84540 -25567 58404
264E8404K1794n2926o4998k6142J7976N1765N8568P088o5221p5698m974O6407
$$ 58404 80198 27272 -37726 -63868 -45892 5873 64441 71529 6308 -69390 -74364 -7957
276g957O2243Q412l5403n2432l9692J0837O5884O2915j1142p3945n4566Q552M9382
$$ -7957 54286 62698 27295 -25137 -64829 -53992 11892 74807 63665 -10280 -64846 -56294 -6912
289f912M8162J9640k4839o3321m7277K6008P5953M4620k5343n9268l9386J26L6192
$$ -6912 41250 60890 36051 -27270 -74547 -48539 27414 72034 46691 -12577 -51963 -51837 -15645
302a5645N6519K8988l7620p2621l1780L9739O3314K7142j7696m3165m5574j1040
$$ -15645 40874 69862 32242 -40379 -72159 -32420 30894 58036 40340 -2825 -48399 -59439
314e9439M5112O5624J7734n1113o2037j4418L3300M6383L1675o056m8655n5019
$$ -59439 -14327 51297 69031 17918 -44119 -58537 -25237 21146 52821 46765 -1890 -56909
326e6909k569N8295N6016L89m5441m5205j5101J9854M8100M1716j1569o0338m7597
$$ -56909 -59478 -1183 54833 55222 9781 -35424 -50525 -30671 17429 59145 47576 -12762 -60359
339f0359J3325N4144L9369n02l1708m4351k5502K3395N8593L6247k6157n8406
$$ -60359 -47034 7110 46479 45977 14269 -30082 -55584 -32189 26404 62651 36494 -21912
351b1912l0414J5456L9895L6597R331l1839n3439k2946L6690N7033K0030k8478
$$ -21912 -52326 -36870 3025 39622 48953 17114 -36325 -59271 -22581 34452 54482 26004
363B6004m3947k6173N584L6983M4895R043m3176n2900q760L9576M4254J4015j9063
$$ 26004 -17943 -44116 -38532 -1549 43346 52389 9213 -43687 -52447 -12871 31383 45398 26335
376B6335l8943l3411L988M6241M5835m033m6334m0091j918L0009L7246K0201j5808
$$ 26335 -12608 -46019 -42031 4210 50045 46012 -322 -40413 -42331 -12322 24924 45125 29317
389B9317m4752l4738J3536M9443L4076j0482l8061l2025o857K4466M2481K2912
$$ 29317 -15435 -50173 -36637 12806 46882 36400 -1661 -33686 -40543 -16077 26404 49316
401D9316k3795m9686k4985K2521M1187K4134n208l0908l6104j0661L1299M6284
$$ 49316 25521 -24165 -49150 -26629 14558 38692 33484 2576 -33528 -44189 -12890 33394
413C3394J3693l1005m1808j5578J8045L3785K6379r76l5042l9909l712L8104L9617
$$ 33394 47087 16082 -25726 -41304 -23259 10526 36905 35929 887 -39022 -42734 -4630 34987
426C4987M440k7954l2598j6799J2166L6158L0903o792m1042l3620N208L4550L0872
$$ 34987 39427 11473 -21125 -37924 -25758 10400 41303 34511 -6531 -40151 -34943 -393 30479
439C0479M721k1571l4173j9443J5402M0037K6836j4574l8434k4774N443K7982
$$ 30479 35200 13629 -20544 -39987 -24585 15452 42288 27714 -10720 -35494 -30051 -2069
451b069K9419Q962k2499l8718j6376K3186L7621J7482j4281l1732k3132J533K8446
$$ -2069 27350 36312 13813 -24905 -41281 -18095 19526 37008 22727 -9005 -32137 -30604 -2158
464b158L2865N910k8730l5750q440K3625L0975J4000j0389k8995k7009K731L2985
$$ -2158 30707 36617 7887 -27863 -36303 -12678 18297 32297 21908 -7087 -34096 -31365 1620
477A620L1691m65l0876k8395m330J8022K9391J7172j1959l2436k5140Q396L4242
$$ 1620 33311 32846 1970 -26425 -30755 -12733 16658 33830 21871 -10565 -35705 -27309 6933
490F933K4346l370k5839k6128n431J6288L0859J7888j6406l3725j9082J1058L0084
$$ 6933 31279 27909 2070 -24058 -29489 -13201 17658 35546 19140 -14585 -33667 -22609 7475
503G475K0330k020k2338k8732o091K1701L0491J1867j8330k9567j4217R089K6498
$$ 7475 27805 25785 3447 -25285 -31376 -9675 20816 32683 14353 -15214 -29431 -20342 6156
516F156K1864j919k4590k8117l561K4688K6765P051j5995k5978j4813P668K7486
$$ 6156 28020 26101 1511 -26606 -30167 -5479 21286 28337 12342 -13636 -28449 -20781 6705
529F705K3803n870k7734k2954K3K2623K3222O422j3495k6693j5825J1284K7697
$$ 6705 30508 24638 -3096 -26050 -26027 -3404 19818 26240 12745 -13948 -29773 -18489 9208
542I208K0652q282k7437j8096J217J9286K3421O191j4703k7066j4199J5577K5750
$$ 9208 29860 21578 -5859 -23955 -22738 -3452 19969 26160 11457 -15609 -29808 -14231 11519
555A1519J5046p169k4984j8038J167J9325K4854M290j8336k3993j1309J5597K4125
$$ 11519 26565 19396 -5588 -23626 -22459 -3134 21720 26010 7674 -16319 -27628 -12031 12094
568A2094J2254o184k3942j8667L286K0402K2629J754j9156k0245q466J2077K4066
$$ 12094 24348 18164 -5778 -24445 -21159 -757 21872 23626 4470 -15775 -24241 -12164 11902
581A1902J3018p937k3538j8692O338K0886J8413J237j8171j9407o839J1709K3641
$$ 11902 24920 16983 -6555 -25247 -18909 1977 20390 21627 3456 -15951 -22790 -11081 12560
594A2560J2481j0583k2478j5470O693K0133J5655J607j7053k0536n229J2946K2804
$$ 12560 25041 14458 -8020 -23490 -16797 3336 18991 20598 3545 -16991 -22220 -9274 13530
607A3530J0650j2522k0500j2878N510K0615J4852o7j6390k0619l384J5055J9341
$$ 13530 24180 11658 -8842 -21720 -16210 4405 19257 19190 2800 -17819 -21203 -6148 13193
620A3193R254j1690j9961j1571N116K0276J5540k879j6314j8256k730J5165J7742
$$ 13193 22447 10757 -9204 -20775 -15659 4617 20157 17278 964 -17292 -20022 -4857 12885
633A2885Q301j1125k0339j0046O431J9092J4904m477j6360j5647k407J4899J7216
$$ 12885 21186 10061 -10278 -20324 -13893 5199 20103 15626 -734 -16381 -18788 -3889 13327
646A3327O515j0693j9979r108Q243J7592J3610m567j6736j4259j836J4762J7198
$$ 13327 19842 9149 -10830 -19938 -11695 5897 19507 14940 -1796 -16055 -17891 -3129 14069
659A4069M621j1244j8235q736R121J7315J1136l822j7127j3451N3J4071J6886
$$ 14069 18690 7446 -10789 -19525 -10404 6911 18047 14225 -2902 -16353 -16300 -2229 14657
672A4657K954j1838j6584p703R095J6778R961m090j6474j3123J300J3530J5833
$$ 14657 17611 5773 -10811 -18514 -9419 7359 17320 13230 -3244 -16367 -15067 -1537 14296
685A4296K847j2433j5478p048Q979J6951Q639m704j5863j2644K194J3729J4193
$$ 14296 17143 4710 -10768 -17816 -8837 8114 16753 12049 -3814 -16458 -14264 -535 13658
698A3658K475j2072j5172n329Q921J5541Q674n987j4931j1485K544J4220J2529
$$ 13658 16133 4061 -11111 -16440 -7519 8022 16696 10709 -4222 -15707 -13163 1057 13586
711A3586J426j2248j3913m024Q334J5584P062o229j4387j0160L127J3148J2082
$$ 13586 15012 2764 -11149 -15173 -6839 8745 15807 9578 -4809 -14969 -11842 1306 13388
724A3388M91j1878j3508l709R506J4497O893p142j4590q653L521J3561J1416q82
$$ 13388 13879 2001 -11507 -15216 -5710 8787 15680 8538 -6052 -14705 -11184 2377 13793 12911
738A2911j1338j3118l055J0011J3804N438p074j3670q157M135J2933J0605r71
$$ 12911 1573 -11545 -14600 -4589 9215 14653 7579 -6091 -14248 -10113 2820 13425 12454
751A2454j1539j2776j560R693J2850N181p539j3133p722M736J2627R682j762j1442
$$ 12454 915 -11861 -13421 -3728 9122 14303 6764 -6369 -14091 -9355 3272 12954 11192 -250
765b50j1165j107R588J2481L875p473j2899o451N248J2022Q942k453j1107j0524
$$ -250 -11415 -12522 -2934 9547 13422 5949 -6950 -13401 -8153 3869 12811 10358 -749 -11273
779a1273n81R892J1379L391p743j2398n440N511J2117P571k820j1297r534Q8R970
$$ -11273 -11854 -1962 9417 12808 5065 -7333 -12773 -7262 4855 12426 9606 -1691 -11225 -11137 -1167
794a167J0679K459p859j1559m853N939J1165O936k959j0856r227R75R624J0386
$$ -1167 9512 11971 4112 -7447 -12300 -6361 4804 11740 8781 -2075 -11302 -10327 -703 9683
808I683J769q394j0497m350N808J1494N941l630j0281q662J757R290R575J543
$$ 9683 11452 3058 -7439 -11789 -5981 5513 11454 7824 -2457 -11119 -9362 -72 9503 11046
822A1046q410j0383l179N692J0776N613m175r718q263J988R753Q638P29p958r930
$$ 11046 2636 -7747 -10926 -5234 5542 11155 6980 -2738 -11001 -9013 740 9378 10107 2149 -7781
837g781k709N956J0555N055m917r520o884J925R475P930N8p537r629k199O588
$$ -7781 -10490 -4534 6021 11076 6159 -3361 -10245 -8320 1155 9085 9143 1606 -8023 -10222 -3634
852c634R704M584m964r664n881K459R108P510m12p751r232j707P065Q984L938
$$ -3634 6070 10654 5690 -3974 -9855 -7396 1712 9222 8810 1059 -8173 -9880 -2815 6169 10107
867A0107n009r418n232K315R198P399j227p768q337j389P102Q582K936m445r454
$$ 10107 5098 -4320 -9552 -7237 1961 9360 8133 365 -7972 -9361 -2259 6323 9259 4814 -4640
882d640m928L222Q614O046o64q346o426j279O178Q974K331n280q451n068M205
$$ -4640 -9568 -6346 2268 8314 7650 -696 -7122 -8401 -2223 6751 9082 3802 -4649 -9717 -5512
897e512Q922N180j635p893o199p54O133Q774J499m978q387m280M619P448M882
$$ -5512 3410 8590 6955 -938 -7137 -7891 -1758 7016 8515 3537 -4850 -9130 -4511 2937 7819
912G819j102p657o588lO019Q187J743n901p157l682L951P736M464j406p520o822
$$ 7819 6717 -940 -7528 -7531 -1512 6675 8418 2517 -4640 -8322 -4371 3365 7829 6423 -1097 -7919
928g919J140O125P052J428n663o777l660L699Q627M157k738p226n813J633N712
$$ -7919 -6779 -654 6398 7826 2163 -4614 -8274 -4575 4052 8209 5471 -1755 -7568 -5935 -223
943b23O071J774n543o962l119L773Q684L654l854o006n345J485N832N354K005
$$ -223 5848 7622 2079 -4883 -8002 -4229 4455 8109 4255 -1751 -7096 -5611 221 5575 7580
958G580n646p409j999M056P494L625m033n583m447M31O434N696O05n237p521j004
$$ 7580 1934 -5475 -7474 -3418 4076 7701 3668 -1915 -6362 -5931 503 6199 6804 1567 -5954 -6958
974f958M618O079L610l681o237m100J047O792N208q33m400o684j063M598N729
$$ -6958 -2340 3739 7349 3668 -2569 -6669 -5622 1170 6378 5545 1145 -5539 -6602 -2004 3725
989C725L660l794o892l156J567O189N025j444m121n740k029N328O065K384k986
$$ 3725 7385 3591 -3301 -6457 -4890 1299 6324 4880 759 -4981 -7010 -1682 4383 6767 3781
1004C781p683k418K644M367M958k46m988n345j821N160O637J232l336o185k600
$$ 3781 -3902 -6320 -3676 691 5649 5403 415 -4930 -6751 -1591 5046 6278 2942 -3243 -5843
1019e843K619M537M373j36n712m835p90M544O285K81l065n076l415K646N237M043
$$ -5843 -3224 1313 5686 5550 -162 -4997 -5787 -1243 5042 5323 2258 -2818 -6233 -3587 1650 5693
1035E693o29n836m421K62L628N572J620l944m508l614K863N919K554q76n095m012
$$ 5693 5064 -772 -5193 -4931 -1303 4269 5889 1945 -2563 -6177 -3314 2605 5159 4283 -812 -4824
1051d824o9L448N595J816m092n201k402K916N478K157j131m114m631K84L889N292
$$ -4824 -4893 -1445 4150 5966 1874 -3327 -5729 -2813 2665 4822 3691 -423 -5054 -4770 -881 4411
1067D411J326m373n461q33K362M795K630j094m286m591K53N055M381N66m194m343
$$ 4411 5737 1364 -4097 -4930 -2568 2227 4857 3763 -523 -5114 -4861 194 4575 5141 947 -3396
1083c396j233K085M582K992j641m592l472L37M985L512N04l452m802j089K469
$$ -3396 -4629 -2544 2038 5030 3389 -1203 -4675 -4338 647 4159 4663 1211 -3591 -4680 -2211
1098b211M724K735k607m306k858O74M141M099N6l190m766j419L350M343K159k420
$$ -2211 2513 5248 2641 -1665 -4523 -3849 292 4391 4447 1257 -3509 -4928 -1578 2765 4924 2504
1114B504m214k272K68L874M167k25l323m707o00L231M111J323j570m032k794O60
$$ 2504 -1710 -3982 -3714 160 4327 4102 779 -3928 -4528 -1297 2814 4137 2567 -1465 -4259 -3599
1130c599L771M239m94l897l540q12L166L782J551j760m206k619J494L856L093
$$ -3599 172 4411 3917 20 -3520 -4332 -1166 2616 4167 2407 -1799 -4418 -2924 932 4025
1145D025m69l528l157o93K334M124J589k056m135k385J856L597K612l93l057l568
$$ 4025 3556 28 -3129 -3822 -1488 2636 4225 2169 -1966 -4351 -2495 1102 3714 3321 264 -3304
1161c304m81K546M138J422l022l434j749J263L680K367K81l975l301J22K677L795
$$ -3304 -3785 -1239 2899 4321 1299 -2135 -3884 -2621 1059 3426 3707 -268 -3569 -3447 -770 3025
1177C025J004k745l114j897R32L900K848o32l926l160K81L106L080Q39j920l405
$$ 3025 4029 1284 -1830 -3727 -2795 1105 3953 3321 -605 -3765 -3484 -378 2702 3541 1621 -1784
1193a784k004J416L837K328j138l252k677o3K834L007J029k092l836j205J455
$$ -1784 -3788 -2372 1465 3793 2655 -597 -3274 -3337 -503 2504 3533 1441 -2395 -3600 -2145
1208b145L929J698j184k989k467J92K642L246M16k533l226j009J996L089J505
$$ -2145 1784 3482 2298 -691 -3158 -2966 -324 2922 3338 805 -2421 -3430 -1434 1655 3160
1223C160p21l093k423r7L075K963K86k587k703r27J528L019J765r37l232k194
$$ 3160 2439 -654 -3077 -3174 -99 2864 3150 563 -2140 -3067 -1539 1480 3245 2308 -924 -3118
1239c118L34K884K676K25k587k487j292J892L016J679j084l183j813O81K421K368
$$ -3118 -2784 100 2776 3001 414 -2073 -3365 -1473 1543 3222 2138 -1045 -2858 -2177 244 2612
1255B612l4j950k941p14J765L158J321j318l094j663N19K531K645k4k448k872
$$ 2612 2578 628 -2313 -3027 -1262 1896 3217 1899 -1195 -2858 -2339 192 2837 2813 365 -2507
1271b507n84K148K550J506j441k810j469J88K882K274l7k407k500l35J817K415
$$ -2507 -3091 -943 1607 3113 1672 -1138 -2607 -2419 463 2737 2700 293 -2207 -2542 -725 1690
1287A690J385j547k500k171J001K776J880k94k136k612m3J754K558J170j425k882
$$ 1690 3075 1528 -972 -3143 -2142 634 2514 2220 84 -2528 -2571 -817 1741 2911 1486 -1396
1303a396j473J112K554J823m58k103k439k34K050K844L74j539k306j286P52K507
$$ -1396 -2869 -1757 797 2620 2162 59 -2380 -2614 -564 2280 2654 1115 -1191 -2477 -1725 782
1319G82J838n07j872k725j52K231K227P16j655k365q10O48K469J894p81k292j974
$$ 782 2620 2113 241 -2484 -2636 -405 1822 2538 883 -1482 -2292 -1644 825 2719 1938 -354 -2328
1336b328N7J971K276N77j633k364r32Q06K703J348o90j993j920Q4J950J721O28
$$ -2328 -2271 -300 1976 2553 920 -1444 -2376 -1570 1133 2481 1791 -202 -2122 -2038 -88 1633 2261
1353B261j347k674q61J310K104J522q18j871j352l91J656K426L93j606k092j205
$$ 2261 914 -1760 -2621 -1311 793 2315 1497 -374 -1726 -2117 -461 1965 2358 752 -1340 -2545
1369b545J388K024J346q24k064j293q9J863K241J65j586k061r35J419J940J100
$$ -2545 -1157 867 2213 1389 -675 -1968 -2057 -194 2047 2212 626 -1435 -2370 -951 989 2089
1385B089l95k304j448M9J900J980J90j523j854r80J114K457P78o09j902j630N38
$$ 2089 1694 -610 -2058 -2009 -109 1871 2061 538 -1316 -2296 -1182 1275 2053 1444 -458 -2088 -1550
1402a550J604J816K68j849j553q05J372J887J030j314j328j639L49J650J589P54
$$ -1550 54 1870 2138 289 -1264 -2069 -697 1190 2220 906 -422 -2061 -1712 -62 1527 2281
1418B281j977k005n13J367K346N98j262j476j275J58J961J564k81j154k109k42
$$ 2281 304 -1701 -2214 -847 1499 2097 835 -641 -1916 -1758 203 1767 1486 332 -1777 -2019
1434b019J382J878O71r29j872q97L76J741J367k55j141j996l62J598J684M77p80
$$ -2019 -637 1241 1912 983 -889 -1786 -1410 331 1698 1443 302 -1694 -2056 -458 1226 1703 923
1451I23k006m71j39J900J643n54j015j926l50J789J432N89p85k195l24L00J528
$$ 923 -1083 -1554 -1693 207 1850 1296 281 -1645 -1995 -206 1226 1815 1030 -1165 -1489 -1189 339
1468C39J480n95j385j271n46J727J796k7m86j893p71P30R88J542P1j953j120m14
$$ 339 1819 1224 -161 -1432 -1978 -251 1545 1518 1032 -861 -1632 -902 86 1628 1699 -254 -1374 -1788
1486a788J191K229r3j088j377r89J225J249J008L8j896j476J81J349K014r9j149
$$ -1788 -597 1632 1539 451 -926 -1915 -690 559 1567 1605 -291 -1767 -1586 -237 1777 1678 529
1503E29j062j172R27J514N41L2j639j326M61R02J595k9r22j393p65R14J580R73
$$ 529 -533 -1705 -778 736 1277 1309 -330 -1656 -1195 -293 1302 1273 351 -1042 -1807 -893 687 1660
1521A660m04j553j410L13J391J050O60j366j517k87N47J723O28l52j232j173K29
$$ 1660 1256 -297 -1707 -1394 -3 1047 1707 341 -1176 -1463 -916 807 1435 1083 -149 -1322 -1093
1538a093J443R18K82j175j593j20P40R58R82m42j026j280j69J870J032Q0j160
$$ -1093 350 1268 1550 375 -1218 -1338 -598 360 1342 900 -126 -1406 -1575 295 1327 1407 247
1555B47j386j34N41J204J219p20j223q38l1J232J311l1j247j187l66J005J200
$$ 247 -1139 -1273 -732 472 1691 971 -252 -1090 -1121 111 1422 1391 144 -1043 -1409 -404 796
1572G96Q79q16j365q51K93J070J443l19q88j456k57J408J032K52n03j165o94K63
$$ 796 1675 859 -506 -1357 -1064 6 1449 1130 242 -1214 -1471 -63 969 1221 718 -447 -1141 -878
1590h78J205J122j92j408q86r6Q80J128M17l46j416q05L40J282J060l61j474n72
$$ -878 327 1449 1257 -151 -1037 -1133 -253 875 1292 946 -470 -1275 -935 347 1407 1046 -428 -1000
1608a000k19R81J195K89o57j225j022P73J342P75k64j091r68J10O11J381N39j159
$$ -1000 -1219 -238 957 1246 589 -636 -1658 -885 457 1232 968 -123 -1091 -981 -370 1011 1550 391
1626C91q21q13J002M84P05N2r06j443L19P84J261Q4q70l97o97Q2J096Q60k10j069
$$ 391 -430 -1243 -241 243 948 1000 94 -1349 -1030 -246 1015 1099 229 -168 -865 -783 313 1173 963 -106
1646a06j373K45J223R38j08m95q48p75L40J331P89k16j235q44L60Q22M01P09n94
$$ -106 -1479 -1234 -11 927 819 324 -524 -1299 -959 372 1161 945 -290 -1134 -774 48 449 1158 564
1665E64j439l33N82J248O16p88p75n00m4O61J229L56j071j181j70P63P57N32l89
$$ 564 -875 -1208 -626 622 1238 450 -325 -825 -869 -208 1021 1377 306 -875 -1045 -282 475 1007 618
1684F18o79o03l73J011J088K42j372p55K13J16P58P97l57r47j200M30J411J000
$$ 618 -61 -664 -1037 -26 1062 1304 -68 -823 -610 -494 264 1061 704 -243 -1443 -1013 398 1398
1702A398n48r55k94m41K63Q86J022m90j454p00Q55R05P5K05r1j186p15O70J290
$$ 1398 850 -105 -399 -840 -577 309 1331 841 -613 -1313 -458 447 522 727 636 -550 -1265 -595 695
1721F95N94r23j019k53N93J30P80P76r51j154m90J015R39K2m46l26m90k71N58
$$ 695 1289 366 -653 -906 -313 -183 597 1373 422 -732 -1222 -207 732 754 308 -18 -508 -779 -221
1740b21J142L14j242j161M53Q51L59j2k8n06j047j0J450R82n81j389j27M73J30
$$ -221 921 1235 -7 -1168 -715 136 495 483 455 -51 -1098 -1108 342 1324 743 -646 -773 -300 -170
1759a70K52O83J27j497n64L68J433L30r56Pj28n66o2J135Q76r43j229Q3N63Q00
$$ -170 82 765 892 -605 -1169 -801 632 962 6 13 -115 -681 -743 392 1268 325 -904 -821 -258 542
1779E42m88N04m8j311k44P38J377k9j359q2R6k04L51P84N25q16j467L29J068N91
$$ 542 54 558 510 -801 -1045 -307 1070 1041 -318 -400 -304 -508 -157 627 1152 336 -1131 -802 266 857
1799H57m44j6l46n80n86J285J086m22j383n99R46L41n5J06N46p72j217K90J692
$$ 857 413 397 51 -529 -1115 170 1256 834 -549 -1148 -202 139 84 190 736 -36 -1253 -963 729
1818G29N76r69q52O8L42n00Q34J036m54j562m07J349P43n68m24K86l28p61L63
$$ 729 1305 336 -516 -448 -106 -606 228 1264 810 -752 -1159 190 933 365 -59 227 -101 -862 -499
1837d99J693J37j342j035M75Q50k73l7R81m03j222n48J566R58q24j153M11K49
$$ -499 1194 1331 -11 -1046 -571 279 6 -31 950 547 -675 -1223 343 1301 477 -676 -265 -16
1855a6m33L99Q59J56j483o43M68J425l67k95J76J11p68l81J214J083j312j119
$$ -16 -449 -50 809 965 -518 -1161 -693 732 365 70 246 357 -411 -792 422 1505 193 -926
1873i26K64O91p8J02O07J93j246q25R28J510l95j077k6K36k89k65J013P25p71
$$ -926 -662 29 -49 53 660 853 -393 -1218 -290 1220 825 -252 -278 -42 -331 -596 417 1142 371
1892C71j677M26J416j50p52M17M36p01j095Q48J896q18j017k58O63L00o99M40
$$ 371 -1306 -880 536 386 -366 51 487 -214 -1309 -461 1435 617 -400 -658 5 305 -394 46
1910D6O57n41j391K98J541L51j037m78M51q1l76N00J200n51j177n49J304L67l02
$$ 46 703 162 -1229 -931 610 961 -76 -554 -103 -184 -560 -60 1140 589 -588 -1137 167 534 232
1929B32m21M59kj404M10J616lr91o45M57P02q21N06P70n69j197k32J205J043r08
$$ 232 -189 270 268 -1136 -726 890 887 -104 -749 -292 410 -411 95 865 296 -901 -1133 72 1115 207
1949B07o68M57j93l26K6J402N99k071r17J338Q38m08n35L22M26j401l44J338J104
$$ 207 -461 -4 -197 -523 -497 905 1504 -567 -1484 -146 692 284 -251 71 497 -904 -1248 90 1194
1968A194r43j055L85Q18p92K44R05Kr53j028R33J341o71q38M89K66m96l10O42
$$ 1194 251 -804 -419 399 -393 -149 756 758 -195 -1223 -290 1051 380 -458 31 297 -199 -509 133
1987A33J367j443j108O07Q08P8r43P23P85j364j130J352J246l19j353J40Q58m01
$$ 133 1500 57 -1051 -444 364 442 -501 222 1007 -357 -1487 -135 1111 792 -561 -421 437 36
2005C6o57O70J301j239j627O73J567J4j048L04L48n47n30N04J502n84j547J24
$$ 36 -621 49 1350 111 -1516 -843 724 738 -310 -6 342 -205 -735 -231 1271 687 -860 -736
2023g36Q09K68l53q2N92j37j193L06J234L69j318p11J130q4k71N9Q68j40j390
$$ -736 73 341 -12 -94 498 361 -832 -526 708 1077 -241 -952 178 94 -177 -118 750 610 -780
2042g80k00J676P3p71m83N49N08j532K61J352M07j843j62P64J200j186m10J202
$$ -780 -980 696 769 -2 -485 64 572 -960 -699 653 1060 -783 -945 -181 1019 -167 -577 625
2060F25q1j389p9J109J168j397p08P89N07r49J1Q53M45j354r54J309Q21n18m52
$$ 625 544 -845 -924 185 1353 -44 -752 37 544 -405 -394 459 904 -450 -1404 -95 726 208 -244
2079b44O2L83n84l73J001Q37r24j142N38R41m50o85J081K1q23p45Q80J298l78
$$ -244 -182 201 -383 -756 245 1082 158 -984 -446 495 45 -640 441 462 -361 -1106 -226 1072 694
2098F94j189J97O42n40j78P97P00j171r57M56J269k22j031M22O30o37p97R69J042
$$ 694 -495 -298 344 -196 -374 423 1123 -48 -1005 -549 720 498 -533 -111 519 -118 -915 54 1096
2117A096p02j364K63J103n6p24K68R83o95j259K91J576j12j204J56P29k96n05
$$ 1096 394 -970 -707 396 340 -384 -116 867 172 -1087 -796 780 668 -536 -380 349 53 -452
2135d52K07J551o42j508j18J332L97r65k95R14n16p22M64R78K91j265l92J142
$$ -452 -245 1306 664 -844 -962 370 767 -198 -493 421 -95 -817 -353 625 916 -349 -741 401
2153D01K54q69p6J016l03j243j55J641N07j048p54P34K42p07r4J240j2j298l43
$$ 401 655 -214 -290 726 423 -820 -975 666 1173 125 -629 105 347 -360 -454 786 774 -524 -867
2172h67R58P01p33o39P62J45o90l71J020N16r17p06N29N70m24l30P88K74j022
$$ -867 91 792 59 -580 182 327 -363 -734 286 802 -115 -821 -292 278 -146 -476 312 586 -436
2191d36l21R73P17q74n24L59O04p01l86R42P67j044r96O81O83k83n70L48K35l15
$$ -436 -757 216 933 59 -465 -106 498 -203 -589 353 1120 76 -920 -239 444 161 -409 -61 174 -141
2211a41q41J004R38m83j080L74N69j60m05L05O63o44r23O45R02k15p16k45R42
$$ -141 -982 22 960 477 -603 -229 340 180 -225 80 743 99 -824 -179 723 508 -208 -453 489
2230D89n10n07O11R70p86j399P07Q11K02q97K01N87m34j043O75J449m53r93k53
$$ 489 -21 -528 83 1053 267 -1132 -425 386 588 -309 -108 479 45 -998 -323 1126 673 -320 -573
2249e73O60J48p30L64P38l45r55L2J001K76j036o9O03K57j047N62P25J20j235
$$ -573 87 235 -495 -131 607 262 -693 -661 340 616 -420 -489 114 371 -676 -114 611 731 -504
2268e04m5Q64K0n84m9N56p6q27J23J009L33p11p35P80K90p05N7O49M10j379k90
$$ -504 -549 315 335 -249 -298 258 182 -645 -522 487 820 109 -626 154 444 -261 -204 445 855 -524 -814
2289h14P68Q72q64j00K44q7k07m08J269q2m31p54M03N47o61K8N89M1o44n76J016
$$ -814 -46 826 -38 -138 106 19 -188 -596 673 591 160 -594 -191 356 -305 -277 312 353 -291 -867 149
2310A49M21m34p39N73L17n28r2M22M14m58o25M19R09l53o85K84K99m12m50P37
$$ 149 570 136 -603 -30 287 -241 -333 89 503 45 -580 -161 748 395 -290 -6 293 -119 -569 168
2330A68N38n24n06r0M38K45n50K77K22k77m32K98N88l7q65L08K60j27K4j84R44
$$ 168 706 182 -324 -414 24 269 -281 -4 218 -59 -491 -193 395 358 -507 -199 61 -66 -42 -226 718
2351G18l46j087K89N87L39n42j87K56j9n47L46P97k45p30NL94K21j25j12M57k11
$$ 718 372 -715 -426 161 500 -42 -229 27 8 -539 -193 604 359 -371 -366 28 249 124 12 469 258
2372B58p23j13J148J8n64l03M0Q3j12K59K21L48q71j73M97M40k08l20k9K62n53
$$ 258 -465 -578 570 588 24 -279 -239 -156 -268 -9 212 560 -311 -484 13 453 245 -75 -104 158 -395
2393c95j05J092k21l13o49M13L17j22j05K47K8k62k77M88L68r0p38K33J91l42
$$ -395 -500 592 371 58 -591 -178 139 17 -88 159 187 -75 -352 136 504 414 -324 -91 100 -242
2413b42J9L50L40n12l29Q7N69j90k57J33K80l89l63Q18N0q2p23K92N75m19j24
$$ -242 -223 127 467 -45 -374 -287 282 92 -165 -32 248 -141 -504 314 364 282 -441 -149 426 7 -117
2434a17p2K19j16m08K90O13k49j80j6j37L65m93K23O42n33n26K7N44M5n3R7k13
$$ -117 -189 30 -86 -494 -204 409 160 -20 -36 -173 192 -301 -78 564 31 -495 -468 76 121 68 165 -48
2456d8J28k88K21L97Om70k39L47J83j52k75L33k39k04Q5M89O5l04J05k71L32m18
$$ -48 80 -208 13 410 416 -54 -293 54 237 85 -190 143 -96 -300 -215 274 339 35 140 -131 201 -217
2478b17J72L58K7n97M4M29K41m73j6K40k11r9k34N42J15j83j73q3O0J50l4j03
$$ -217 -45 313 340 -257 -213 216 457 -16 -32 208 -3 -102 -336 206 321 138 -35 -118 -58 92 58 -45
2500d5K22j62l82L61M02m26o6r3K78k28r7O11k57m33J67l2K53O8k44J36J01k25
$$ -45 177 15 -367 -6 396 -30 -96 -189 89 -139 -236 375 118 -315 -148 -180 73 141 -103 33 134 -91
2522i1p3K75L15k18o38L31R6L9J25J62o3k77j47J72K24J0l38j16K58r7l45M45
$$ -91 -164 111 426 208 -430 -99 -3 36 161 323 260 -17 -164 8 232 242 -96 -212 46 -51 -396 49
2544D9R8n0k3l10N46j13l5Lp1j49j41j1M84m0k04m6o8RJ47k4P2J06l51k37L33
$$ 49 147 97 74 -236 310 197 162 165 94 -55 -196 -207 277 237 33 -13 -81 -72 75 51 123 229 -122 -359 -26
2569b6K97j78o3p1N2j50K19K46n24M6l3j52K59P4Q7R3k06k72J84k4K46l02j21
$$ -26 271 93 30 -41 11 -139 80 326 -198 -152 -185 -337 -78 -4 83 176 -30 -302 -118 -142 104 -198 -319
2592c19M62l53J12K32J32j19l16J1j7N14j78K9o3J2j84J7Q3J47j05l27L31M3k5
$$ -319 143 -210 -98 134 266 147 -169 -158 -175 339 161 190 127 139 -45 -28 55 202 97 -230 101 144 119
2615A19J16k50j36K22k80M7L22j12r1J12j19K4p1k7J87l00Pk8L99k05M25m03P5
$$ 119 235 -15 -151 71 -209 -162 160 48 -43 69 -50 -26 -97 -124 63 -237 -230 -258 141 -64 361 -42 33
2638C3k50K96R0J70l60j98K0j54M42m9l4K27k95L8L4O0L8k65JO4J99k80L16R8
$$ 33 -217 79 169 339 -21 -219 -199 -353 89 40 6 233 -62 -24 10 70 108 -157 -156 -92 107 -173 143 241
2662B41j76n05L42J63j30PJ43N5J2l47J56J16O5j67k33P0K72n1J02l24J62J28
$$ 241 65 -440 -98 65 -65 -58 85 140 152 -195 -39 77 142 -25 -258 -188 84 33 135 -189 -27 101
2684A01k05J84M5o6J16k11k19J06K89j4m05J14o1J77K03j83K04N5l61j25K23J07
$$ 101 -104 80 125 59 175 -36 -255 -149 140 126 -279 -165 -226 -49 154 -29 175 230 -131 -256 -33 74
2706G4M9j46j01Q8k7QK27q1l78L15l1j4M1o7J15k22LL98l76R5J44j85K67l46J20
$$ 74 123 -23 -124 -36 -63 -55 172 91 -287 28 -3 -17 24 -43 72 -150 -147 251 -125 -30 114 -71 196 -150 -30
2731c0K30K5j41q4k20J83L4J55J7k42J50J62k04K68k14j97J11m5j19L37k19M5
$$ -30 200 225 84 0 -220 -37 -3 152 169 -73 77 239 35 303 89 -108 3 -42 -161 176 -43 2
2753Bj84R1LK8K73k13J39j10j88J35M1j59M38k97j07J86j96Q6L38k13j06j14J91
$$ 2 -182 -91 -88 -60 213 0 139 29 -159 -24 17 -142 296 -1 -108 78 -118 -32 306 93 -13 -127 64
$$ [...]
8191i4
##END NTUPLES=NMR FID
##END=
