##TITLE=1H_PR192_R
 D2O, 8 sc, 
 1.10.2020
##JCAMPDX= 6.0         $$ Bruker NMR JCAMP-DX V2.0
##DATA TYPE= NMR FID
##DATA CLASS= NTUPLES
##ORIGIN= UXNMR, Bruker Analytische Messtechnik GmbH
##OWNER= root
$$ XWIN-NMR		Version 3.5
$$ Thu Oct  1 10:03:05 2020 Russian Standard Time (UT+4h)  she@DPX200
##.OBSERVE FREQUENCY= 200.1315066352
##.OBSERVE NUCLEUS= ^1H
##.DELAY= (6, 6)
##.ACQUISITION MODE= SIMULTANEOUS
##.ACQUISITION SCHEME= undefined
##.AVERAGES= 8
##.DIGITISER RES= 18
##SPECTROMETER/DATA SYSTEM= spect
##.PULSE SEQUENCE= zg30
##.SOLVENT NAME= MeOD
##.SHIFT REFERENCE= (INTERNAL, MeOD, 0, 15.7039)
##AUDIT TRAIL= $$ (NUMBER, WHEN, WHO, WHERE, WHAT)
$$ ##TITLE= Audit trail, XWIN-NMR		Version 3.5
$$ ##JCAMPDX= 5.01
$$ ##ORIGIN= Bruker BioSpin GmbH
$$ ##OWNER= she
$$ F:/spectra/data/she/nmr/H-F/1/audita.txt
$$ ##AUDIT TRAIL=  $$ (NUMBER, WHEN, WHO, WHERE, WHAT)
(   1,<2020-10-01 10:01:50.40 +0400>,<she>,<DPX200>,
      <created by zg, POWCHK disabled, PULCHK disabled
       configuration hash MD5:
       00 E9 B6 7A A2 85 ED C7 34 08 36 98 17 FE 4E 26
       data hash MD5: 16K
       9F 3A 5F 53 CD 61 F9 9F A9 FC 99 A8 41 3D 1F 0B>)
$$ ##END=
$$ 
$$ hash MD5
$$ 3E 6C B4 42 C3 AE 91 20 77 21 C0 22 4A 34 7C 9A
##$RELAX= 
##$RELAX= 
##$RELAX= 
##$RELAX= 
##$RELAX= 
##$RELAX= 
$$ Bruker specific parameters
$$ --------------------------
##$DU= <F:/spectra>
##$EXPNO= 1
##$NAME= <H-F>
##$PROCNO= 1
##$TYPE= <nmr>
##$USER= <she>
##$AMP= (0..31)
100 100 100 100 100 100 100 100 100 100 100 100 100 100 100 100 100 100 
100 100 100 100 100 100 100 100 100 100 100 100 100 100 
##$AQSEQ= 0
##$AQ_mod= 1
##$AUNM= <au_zg>
##$AUTOPOS= <>
##$BF1= 200.13
##$BF2= 200.13
##$BF3= 200.13
##$BF4= 200.13
##$BF5= 200.13
##$BF6= 200.13
##$BF7= 200.13
##$BF8= 200.13
##$BYTORDA= 1
##$CFDGTYP= 0
##$CFRGTYP= 5
##$CHEMSTR= <none>
##$CNST= (0..31)
1 1 145 1 1 1 1 1 1 1 1 1 1 1 1 1 1 1 1 1 1 1 1 1 1 1 1 1 1 1 1 1 
##$CPDPRG= <>
##$CPDPRG1= <>
##$CPDPRG2= <>
##$CPDPRG3= <>
##$CPDPRG4= <mlev>
##$CPDPRG5= <mlev>
##$CPDPRG6= <mlev>
##$CPDPRG7= <mlev>
##$CPDPRG8= <mlev>
##$CPDPRGB= <>
##$CPDPRGT= <>
##$D= (0..31)
0 1.2 0 0 0 0 0 0 0 0.06 0 0.03 0 0 0 0 0.0002 0 0 0 0 0 0 0 0 0 0 0 0 
0 0 0 
##$DATE= 1601532109
##$DBL= (0..7)
120 120 120 120 120 120 120 120 
##$DBP= (0..7)
150 150 150 150 150 150 150 150 
##$DBP07= 0
##$DBPNAM0= <>
##$DBPNAM1= <>
##$DBPNAM2= <>
##$DBPNAM3= <>
##$DBPNAM4= <>
##$DBPNAM5= <>
##$DBPNAM6= <>
##$DBPNAM7= <>
##$DBPOAL= (0..7)
0.5 0.5 0.5 0.5 0.5 0.5 0.5 0.5 
##$DBPOFFS= (0..7)
0 0 0 0 0 0 0 0 
##$DE= 6
##$DECBNUC= <off>
##$DECIM= 32
##$DECNUC= <off>
##$DECSTAT= 4
##$DIGMOD= 1
##$DIGTYP= 9
##$DL= (0..7)
0 120 120 120 120 120 120 120 
##$DP= (0..7)
150 150 150 150 150 150 150 150 
##$DP07= 0
##$DPNAME0= <>
##$DPNAME1= <>
##$DPNAME2= <>
##$DPNAME3= <>
##$DPNAME4= <>
##$DPNAME5= <>
##$DPNAME6= <>
##$DPNAME7= <>
##$DPOAL= (0..7)
0.5 0.5 0.5 0.5 0.5 0.5 0.5 0.5 
##$DPOFFS= (0..7)
0 0 0 0 0 0 0 0 
##$DQDMODE= 0
##$DR= 18
##$DS= 0
##$DSLIST= <SSSSSSSSSSSSSSS>
$$ [...]
##$SUBNAM2= <"">
##$SUBNAM3= <"">
##$SUBNAM4= <"">
##$SUBNAM5= <"">
##$SUBNAM6= <"">
##$SUBNAM7= <"">
##$SUBNAM8= <"">
##$SUBNAM9= <"">
##$SW= 16.880792210976
##$SWIBOX= (0..15)
0 0 2 0 0 0 0 0 0 0 0 0 0 0 0 0 
##$SW_h= 3378.37837837838
##$TD= 16384
##$TD0= 1
##$TE= 0
##$TE2= 300
##$TE3= 300
##$TEG= 300
##$TL= (0..7)
0 120 120 120 120 120 120 120 
##$TP= (0..7)
150 150 150 150 150 150 150 150 
##$TP07= 0
##$TPNAME0= <>
##$TPNAME1= <>
##$TPNAME2= <>
##$TPNAME3= <>
##$TPNAME4= <>
##$TPNAME5= <>
##$TPNAME6= <>
##$TPNAME7= <>
##$TPOAL= (0..7)
0.5 0.5 0.5 0.5 0.5 0.5 0.5 0.5 
##$TPOFFS= (0..7)
0 0 0 0 0 0 0 0 
##$TUNHIN= 0
##$TUNHOUT= 0
##$TUNXOUT= 0
##$USERA1= <user>
##$USERA2= <user>
##$USERA3= <user>
##$USERA4= <user>
##$USERA5= <user>
##$V9= 5
##$VALIST= <valist>
##$VCLIST= <CCCCCCCCCCCCCCC>
##$VD= 0
##$VDLIST= <DDDDDDDDDDDDDDD>
##$VPLIST= <PPPPPPPPPPPPPPP>
##$VTLIST= <TTTTTTTTTTTTTTT>
##$WBST= 1024
##$WBSW= 4
##$XGAIN= (0..3)
0 0 0 0 
##$XL= 0
##$YL= 0
##$YMAX_a= 153962
##$YMIN_a= -143783
##$ZGOPTNS= <>
##$ZL1= 120
##$ZL2= 120
##$ZL3= 120
##$ZL4= 120
##$ABSF1= 10
##$ABSF2= 0
##$ABSG= 5
##$ABSL= 3
##$ALPHA= 0
##$AQORDER= 0
##$ASSFAC= 0
##$ASSFACI= 0
##$ASSFACX= 0
##$ASSWID= 0
##$AUNMP= <proc_1d>
##$AZFE= 0.1
##$AZFW= 0.1
##$BCFW= 1
##$BC_mod= 2
##$BYTORDP= 1
##$COROFFS= 0
##$CY= 11.3945322036743
##$DATMOD= 1
##$DC= 2
##$DFILT= <>
##$DTYPP= 0
##$F1P= 16.9975609425685
##$F2P= -3.02152046262296
##$FCOR= 0.5
##$FTSIZE= 0
##$FT_mod= 4
##$GAMMA= 1
##$GB= 0.15
##$INTBC= 1
##$INTSCL= 1
##$ISEN= 128
##$LB= 0.24
##$LEV0= 0
##$LPBIN= 0
##$MAXI= 10000
##$MC2= 0
##$MEAN= 0
##$ME_mod= 0
##$MI= 1.114404
##$NCOEF= 0
##$NC_proc= 0
##$NLEV= 6
##$NOISF1= 3.799351
##$NOISF2= 2.8
##$NSP= 1
##$NTH_PI= 0
##$NZP= 0
##$OFFSET= 15.70392
##$PC= 1
##$PHC0= -9974.371
##$PHC1= 16.20089
##$PH_mod= 1
##$PKNL= yes
##$PPARMOD= 0
##$PSCAL= 0
##$PSIGN= 0
##$REVERSE= no
##$SF= 200.130013532006
##$SI= 16384
##$SIGF1= 3
##$SIGF2= 2
##$SINO= 400
##$SIOLD= 16384
##$SREGLST= <1H.CDCl3>
##$SSB= 0
##$STSI= 0
##$STSR= 0
##$SW_p= 3612.71676300578
##$SYMM= 0
##$S_DEV= 0
##$TDeff= 0
##$TDoff= 0
##$TI= <>
##$TILT= no
##$TM1= 0
##$TM2= 0
##$TOPLEV= 0
##$USERP1= <user>
##$USERP2= <user>
##$USERP3= <user>
##$USERP4= <user>
##$USERP5= <user>
##$WDW= 1
##$XDIM= 8192
##$YMAX_p= 0
##$YMIN_p= 0
$$ End of Bruker specific parameters
$$ ---------------------------------
##NTUPLES= NMR FID
##VAR_NAME=  TIME,          FID/REAL,        FID/IMAG
##SYMBOL=    X,             R,               I
##VAR_TYPE=  INDEPENDENT,   DEPENDENT,       DEPENDENT
##VAR_FORM=  AFFN,          ASDF,            ASDF
##VAR_DIM=   8192,          8192,            8192
##UNITS=     SECONDS,       ARBITRARY UNITS, ARBITRARY UNITS
##FACTOR=    0.000296,      1,               1
##FIRST=     0,             0,               0
##LAST=      2.424536,      0,               0
##MIN=       0,             -143783,         0
##MAX=       2.424536,      153962,          0
$$ Real data points
##PAGE= N=1
##DATA TABLE= (X++(R..R)), XYDATA
$$ plain form
0 0 0 0 0 0 0 0 0 0 0 0 0 0 0 0 0 0 8 -8 8 -8 8 -8 16 -16 16 -24 24 -31 32 -40 46 -53 58 -67 77 -86 95 -109
38 -109 121 -134 150 -168 186 -207 229 -254 280 -309 339 -374 413 -455 501 -550 608 -671 744
57 744 -826 921 -1032 1161 -1319 1513 -1758 2080 -2524 3182 -4278 6547 -24692 84555 123015
72 123015 55188 -56724 -143783 -39642 49565 127678 80090 -75182 -101478 -63957 44979
83 44979 153962 52219 -58587 -110103 -66826 73269 102684 60948 -36605 -134692 -45025
94 -45025 57230 100077 78269 -57722 -104925 -46561 47542 125206 49314 -39421 -78411 -71625
106 -71625 54275 113701 58980 -27518 -110705 -55892 48470 96224 72232 -52883 -100286
117 -100286 -45228 21377 100011 66541 -38631 -94949 -74189 43907 102442 52409 -25298
$$ packed form
0@%%%%%%%%%%%%%%%%Qj6J6j6J6j6K4l2L2m0M8n5O3p2Q6r9J11j25J44j63J81k04
38a09K30k55K84l18L54l93M36m83N34n89O48p13P87q68R56j051J158j279J415
57G44j570J747j953K193k480K832l271L838m604N706p460J0825l1239J09247L8460
72A23015o7827j11912q7059J04141Q9207P8113m7588j55272k6296L7521J08936
83D4979J08983j01743j10806n1516M3277J40095K9415m1736r7553r8087Q9667
94d5025J02255M2847k1808j35991m7203N8364R4103P7664p5892q8735l8990O786
106g1625J25900N9426n4721q6498q3187N4813J04362M7754k3992j25115m7403
117a00286N5058O6605P8634l3470j05172n6318K0760J18096N8535n0033p7707
$$ plain form
128 -25298 -103682 -61973 44954 86285 64452 -34107 -97032 -58005 24468 101884 58849 -46290
140 -46290 -84835 -63613 30556 93654 50145 -29288 -95011 -58933 36100 79410 63329 -32393
152 -32393 -97956 -48941 29828 86957 54982 -35262 -76057 -57590 28074 88949 49275 -19309
164 -19309 -81018 -60700 34609 80294 56612 -25692 -82845 -45117 19165 75847 61062 -28828
176 -28828 -73928 -54483 19073 82069 49614 -19290 -72754 -56723 28360 71181 53932 -12391
188 -12391 -77603 -50412 21074 72239 58146 -24023 -70616 -51596 14295 75994 49323 -21300
200 -21300 -67953 -57382 18384 68848 50414 -13871 -74515 -52358 18615 65820 55369 -17993
212 -17993 -69448 -49205 11939 67808 51640 -15943 -64474 -56554 13837 66905 47687 -12748
$$ packed form
128b5298p8384M1709J06927M1331k1833r8559o2925L9027Q2473P7416m3035j05139
140d6290l8545K1222R4169O3098m3509p9433o5723L6078R5033M3310j6081r5722
152c2393o5563M9015P8769N7129l1975r0244m0795J8467Q5664O0875l9674o8584
164a9309o1709K0318R5309M5685k3682q2304n7153L7728O4282N6682j4785q9890
176b8828m5100J9445P3556O2996l2455o8904n3464J6031Q5083M2821j7249o6323
188a2391o5212K7191P1486N1165j4093q2169m6593J9020O5891O1699k6671p0623
200b1300m6653J0571P5766N0464j8434o4285o0644K2157P0973M7205j0451p3362
212a7993n1455K0243O1144N5869j6168o7583m8531P920P0391N3068j9218o0435
$$ plain form
224 -12748 -65914 -52115 13693 60953 52443 -12154 -65200 -49934 10323 63085 51329 -13956
236 -13956 -60968 -51249 10512 62283 48861 -10545 -61877 -51552 12018 59912 50235 -9521
248 -9521 -60878 -49363 9500 60283 51217 -10259 -58947 -49807 8314 58781 49104 -7858 -57721
261 -57721 -51056 7568 57049 49641 -7274 -56741 -48277 6803 55181 49914 -5228 -53926 -48840
274 -48840 5670 55230 48674 -5152 -53081 -48202 4981 52805 48185 -4138 -52496 -48088 4940
287 4940 52390 48525 -3360 -50838 -47253 3662 51911 49280 -2293 -50500 -47618 3284 50804
300 50804 47766 -1640 -49398 -48049 1472 49538 48257 -1112 -49066 -46798 1113 48156 47740
313 47740 228 -46705 -47067 102 46900 46834 143 -46279 -46883 -1124 44554 45560 892 -45829
$$ packed form
224a2748n3166J3799O5808M7260q510o4597n3046J5266O0257N2762j1756o5285
236a3956m7012R719O1761N1771j3422n9406n1332J0325O3570M7894r677n9756
248i521n1357J1515N8863N0783r066o1476m8688R140N8121N0467r677n6962m9863
261e7721O665N8624M9481p408n6915m9467Q464N5080M8378n267n5142m8698N086
274d8840N4510M9560o556n3826m7929M879N3183M7824m620n2323m8358M408N3028
287D940M7450l865n1885m7478L585N0915M8249k631n1573m8207K882N0902M7520
300E0804l038m9406m7758J349M9521M8066j281m9369m7954K268M7911M7043m16
313D7740m7512m6933l62M7169M6798o6m6691m6422o04M5759M5678J006m4668m6721
$$ plain form
327 -45829 -46382 -1682 44348 45636 664 -44041 -45857 -2303 43542 45317 1946 -43879 -46484
340 -46484 -2018 42134 44332 2277 -43854 -45366 -3644 41167 45595 2424 -42059 -45414 -4007
353 -4007 42421 43992 3759 -39884 -45318 -3577 40128 43868 4718 -41170 -43595 -4135 38120
366 38120 44461 3639 -39160 -42574 -5154 39131 42710 4863 -36162 -42992 -3397 38030 41441
379 41441 7265 -37337 -41980 -3892 35772 42390 4683 -36072 -40350 -8354 36177 42789 5047
392 5047 -34305 -42541 -6283 35831 40308 8098 -34636 -41057 -5335 31830 42255 9153 -34956
405 -34956 -40560 -8390 33288 41148 6367 -31399 -41847 -9354 33787 38827 8316 -31705 -41902
418 -41902 -7941 30747 40607 7846 -33885 -37841 -8776 30038 40426 7122 -30642 -39554 -9342
$$ packed form
327d5829n53M4700M6030J288m4972m4705j816M3554M5845J775m3371m5825k605
340d6484M4466M4152K198m2055m6131j512M1722M4811M428m3171m4483l355M1407
353d007M6428J571m0233m3643n434M1741M3705L740l9150m5888k425L9460M2255
366C8120O341m0822m2799l414L7420M4285L579l7847m1025o830L9595M1427L411
379D1441l4176m4602m643L8088L9664O618l7707m0755m278L1996M4531O612l7742
392E047l9352q236L6258M2114M477l2210m2734o421L5722L7165J0425l3102m4109
405c4956n604L2170M1678P860l4781l7766j0448L2493M3141N040l0511m0021j0197
418d1902L3961L8688R860l2761m1731l956K9065L8814J0388l3304l7764q912L0212
$$ plain form
431 -9342 31825 38811 9696 -31126 -41446 -5747 30448 37101 8739 -29830 -37223 -10858 28241
444 28241 39307 7283 -28218 -38881 -11737 30609 37180 8968 -27573 -37096 -8093 25215
456 25215 38335 13398 -28584 -36034 -9378 26027 38560 9561 -25546 -36328 -11593 27244
468 27244 33262 11159 -22532 -40076 -11813 26099 36989 12209 -27906 -34539 -9737 23602
480 23602 38329 9560 -23364 -32128 -14446 24441 37915 13057 -23510 -39829 -9768 25559
492 25559 32581 13973 -24685 -36084 -10473 20520 35944 12958 -23154 -33965 -15023 25122
504 25122 36438 8519 -19511 -33233 -13345 22264 32726 15121 -21075 -35817 -11021 20358
516 20358 35938 13937 -24896 -31651 -10212 19804 32415 12161 -17299 -33238 -15746 21253
$$ packed form
431i342M1167O986k9115m0822j0320L5699L6195O653k8362l8569p393K6365L9099
444B8241J1066l2024l5501j0663K7144M2346O571k8212l6541r523K9003L3308
456B5215J3120k4937m1982p450K6656L5405J2533k8999l5107j0782K4735L8837
468B7244O018k2103l3691j7544K8263L7912J0890k4780m0115o633K4802L3339
480B3602J4727k8769l2924q764J7682L8887J3474k4858l6567j6319L0061L5327
492B5559P022j8608l8658j1399K5611L0993J5424k2986l6112j0811J8942M0145
504B5122J1316k7919k8030j3722J9888L5609J0462j7605l6196j4742K4796L1379
516B0358J5580k2001l8833o755K1439L0016J2611k0254k9460j5939J7492L6999
$$ plain form
528 21253 32637 13684 -19382 -35895 -12342 21143 32135 12566 -19482 -30401 -14149 16894
540 16894 35083 15005 -19143 -32091 -13779 19591 32181 13496 -18214 -31662 -13442 15422
552 15422 29921 15961 -17233 -33817 -15700 18802 31701 12010 -17161 -30438 -13624 16835
564 16835 29439 14885 -14928 -30193 -15934 15110 32802 14914 -18656 -30196 -13985 15348
576 15348 29035 12976 -14482 -30373 -16200 14781 28917 16376 -14862 -32244 -13834 15239
588 15239 29017 14841 -14415 -27614 -16153 12518 30373 15539 -13083 -29413 -17047 15313
600 15313 29051 14310 -13464 -28773 -13714 11902 26654 17476 -12946 -28634 -15735 12058
612 12058 29610 14905 -13793 -27459 -15411 13525 26766 14403 -10393 -27576 -15998 11979
$$ packed form
528B1253J1384j8953l3066j6513K3553L3485J0992j9569l2048j0919J6252L1043
540A6894J8189k0078l4148j2948J8312L3370J2590j8685l1710j3448J8220K8864
552A5422J4499j3960l3194j6584J8117L4502J2899j9691k9171j3277J6814L0459
564A6835J2604j4554k9813j5265J4259L1044J7692j7888l3570j1540J6211K9333
576A5348J3687j6059k7458j5891J4173L0981J4136j2541l1238j7382J8410K9073
588A5239J3778j4176k9256j3199J1461K8671J7855j4834k8622j6330J2366L2360
600A5313J3738j4741k7774j5309J5059K5616J4752r178l0422j5688J2899K7793
612A2058J7552j4705k8698j3666J2048K8936J3241j2363k4796j7183J1578K7977
$$ plain form
624 11979 27415 16690 -12236 -27685 -14642 11306 27011 15298 -11325 -25501 -16507 9823
636 9823 27054 16242 -10199 -27715 -16076 11341 25755 15782 -9833 -25224 -15235 9172 25895
649 25895 16880 -9103 -25708 -16897 9955 26464 15571 -9652 -25715 -15491 9127 24445
661 24445 16318 -9220 -25035 -16168 8495 25922 16380 -9079 -24729 -16238 9437 24541 15855
674 15855 -7711 -24698 -16333 8270 24314 16912 -8455 -24633 -15975 7549 24217 16069 -7465
687 -7465 -22718 -16073 7375 23966 16167 -6683 -23638 -16415 7309 22744 16297 -6959 -23219
700 -23219 -15572 6018 22583 16137 -6698 -22210 -16157 6094 23004 16262 -6053 -22153 -16164
713 -16164 6444 22101 16467 -5411 -22202 -16192 5563 21907 16524 -5628 -21647 -16437 5198
$$ packed form
624A1979J5436j0725k8926j5449J3043K5948J5705j1713k6623j4176Q994K6330
636I823J7231j0812k6441j7516J1639K7417J4414r973k5615j5391R989K4407J6723
649B5895r015k5983j6605Q811K6852J6509j0893k5223j6063J0224K4618J5318
661B4445q127k5538j5815Q867K4663J7427r542k5459j5650Q491K5675J5104q686
674A5855k3566j6987Q365K4603J6044p402k5367j6178Q658K3524J6668q148k3534
687g465j5253O645K3448J6591p799k2850j6955P223K3724J5435o447k3256j6260
700b3219P647K1590J6565o446k2835j5512O053K2251J6910o742k2315j6100N989
713a6164K2608J5657n634k1878j6791O010K1755J6344n383k2152j6019N210K1635
$$ plain form
726 5198 21993 16491 -5218 -21387 -16851 4694 21404 16558 -4439 -21158 -16568 4261 20818
739 20818 16653 -4671 -20844 -16458 3980 20578 16235 -4064 -20421 -16716 4354 20258 16101
752 16101 -3579 -19928 -16073 3813 19948 16221 -3799 -19727 -16609 3309 19689 16165 -3252
765 -3252 -19522 -16251 3315 19328 16226 -2848 -19383 -16249 2776 19429 16421 -2659 -18987
778 -18987 -16465 2543 18848 16169 -2137 -18982 -16488 2374 18103 16232 -2098 -18213 -15404
791 -15404 1842 18296 16355 -1861 -17396 -15919 2065 18167 15725 -1744 -17630 -15956 1965
804 1965 17292 15733 -1733 -17666 -15792 1387 17297 16048 -1436 -16651 -15662 1070 17719
817 17719 15708 -1027 -16460 -16152 1023 16647 15721 -631 -17080 -15939 638 15920 15884 -627
$$ packed form
726E198J6795n502k1709j6169M536K1545J6710m846k0997j6719M590K0829J6557
739B0818m165k1324j6173M386K0438J6598m343k0299j6357L705K1070J5904m157
752A6101j9680j6349L855J9886J6135l727k0020j5928L118J9918J6380l524j9417
765c252j6270L271J9566J6013l102j9074j6535L134J9025J6653l008j9080j6328
778a8987K522J9008J6305k679j8306j6845K494J8862J5729j871j8330j6115K809
791a5404J7246J6454j941j8216j5535J477J7984J6102k442j7469j5886J674J7921
804A965J5327j559j7466j5933J874J7179J5910j249j7484j5215R89J6732J6649
817A7719k011j6735j5433L08J7175J5624r26j6352j6449J141J6577J5282l6j6511
$$ plain form
831 -627 -16418 -15438 14 16298 15671 -265 -15305 -16220 233 16044 14845 242 -15769 -15710
845 -15710 196 14900 15567 -69 -15896 -14917 -806 14913 15900 -640 -14863 -15297 -324 15682
859 15682 15049 750 -14477 -16075 194 13955 15368 1335 -15351 -15073 -809 14162 15797
872 15797 472 -14052 -14908 -2140 14857 15009 1050 -13104 -15841 -724 13811 14258 1900
885 1900 -14234 -14638 -1309 12114 15693 1456 -13568 -14372 -2520 14149 15078 1062 -12331 -15239
899 -15239 -1597 13717 13518 2589 -13041 -15384 -1295 11916 15213 1728 -13578 -13936 -2509
912 -2509 12452 15038 1644 -11396 -14784 -2656 12818 14186 3761 -12545 -15009 -848 11308
925 11308 14259 2713 -12357 -13304 -3819 11037 14930 1833 -10909 -14856 -3622 12962 13419 2743
$$ packed form
831f27j5791R80J5452J6284o27j5936j5040r15J6453J5811j199j4603j6011N9
845a5710J5906J4704O67j5636j5827R79J4111J5719R87j6540j4223m34J4973J6006
859A5682o33j4299j5227j598J6269J3761J413j4033j6686K78J4264J4971J635
872A5797j5325j4524q56J2768J6997J52j3959j4154k737J5117J4535M47j2358
885A900j6134m04J3329J3423L579j4237j5024q04J1852J6669R29j4016j3393k908
899a5239J3642J5314j99j0929j5630k343J4089J3211L297j3485j5306l58J1427
912b509J4961K586j3394j3040l388J2128J5474J368j0425j6306k464J4161J2156
925A1308K951j1546j5070r47R485J4856L893j3097j2742l947J1234J6584M57j0676
$$ plain form
939 2743 -10944 -14359 -1667 10087 13976 4135 -11974 -13459 -3049 10540 15599 2077 -10974
952 -10974 -13727 -3642 11770 12557 3221 -9498 -15658 -2532 10597 13540 4669 -12187 -13123 -2645
966 -2645 9292 14743 2056 -9139 -12197 -5977 10493 13922 3632 -8778 -15621 -2594 10996
979 10996 11887 5071 -10492 -12878 -2292 7379 14331 4094 -10003 -12246 -5685 10418 13928 1755
993 1755 -7683 -13427 -3922 10132 11124 5747 -8628 -14195 -3034 7745 14388 5035 -10926 -11256
1007 -11256 -4378 7939 13849 3015 -6960 -12871 -6531 9431 11882 5413 -8192 -14929 -2974
1020 -2974 8156 11968 5140 -9065 -10932 -4918 6082 14352 4391 -7476 -12446 -6220 9363 12041
1034 12041 3837 -6811 -13611 -3809 7029 11321 6476 -8043 -12571 -4557 6772 13845 4115 -7860
$$ packed form
939B743j3687l415J2692J1754L889r841j6109j485J0410J3589N059j3522j3051
952a0974k753J0085J5412P87r336j2719o160J3126J3129K943q871j6856r36J0478
966b645J1937N451j2687j1195l058O220J6470L429j0290j2410o843J3027J3590
979A0996Q91o816j5563k386J0586R671O952j0237j4097k243O561J6103L510j2173
993A755r438n744R505J4054R92n377j4375n567J1161J0779O643r353j5961l30
1007a1256O878J2317N910j0834r975n911O340J5962K451o469j3605o737J1955
1020b974J1130L812o828j4205j867O014J1000Q270r961j1867m970O226J5583K678
1034A2041q204j0648o800R802J0838M292m845j4519m528Q014J1329P073r730j1975
$$ plain form
1048 -7860 -11081 -5587 8093 11139 4745 -5407 -12954 -5492 7019 11908 6209 -7974 -12379 -4176
1062 -4176 6137 12664 4623 -6609 -10423 -6453 6346 11921 5303 -5282 -12982 -5307 7158 10847
1076 10847 5782 -6965 -11285 -4747 4628 12070 5876 -6427 -11023 -6752 6542 12491 4564 -5296
1090 -5296 -11444 -5381 6526 10069 6480 -5399 -12171 -5507 4806 11966 6392 -6632 -10513 -6023
1104 -6023 5513 11735 5003 -4125 -11056 -6575 5832 10786 6552 -4940 -12050 -5114 4572 10741
1118 10741 6408 -5559 -9899 -6264 3947 11617 5839 -4270 -10449 -6541 5442 10427 5708 -4295
1132 -4295 -11215 -5580 4272 9854 6958 -4862 -10551 -6221 3683 11293 5696 -4297 -9822 -6562 4572
1147 4572 10276 6079 -3394 -10772 -6323 4199 9808 6987 -4158 -10595 -5936 3356 10130 6277
$$ packed form
1048g860l221N494J3680L046o394j0152p547P462J2511M889n699j4183m405Q203
1062d176J0313O527q041j1232l814L970J2799N575o618j0585p700P675J2465L689
1076A0847n065j2747m320O538R375P442o194j2303m596M271J3294N949p927r860
1090e296o148O063J1907L543l589j1879o772O664J0313P160n574j3024l881M490
1104f023J1536O222o732r128o931M481J2407M954m234j1492p110O936R686O169
1118A0741m333j1967m340L635J0211P670n778j0109o179L908J1983M985m719j0003
1132d295o920N635R852N582k896j1820n689M330R904P610n597r993n525L260J1134
1147D572N704m197r473p378M449J0522N609k821j1145o437M659R292O774l853
$$ plain form
1161 6277 -3831 -9561 -6764 3450 10175 6183 -2975 -10261 -6199 4037 9636 6588 -3267 -9871
1175 -9871 -6035 2969 9582 6747 -3319 -9574 -6669 3076 9804 6255 -2956 -9615 -6365 3281 9327
1190 9327 6865 -3037 -9731 -6368 2903 9568 6807 -2807 -9222 -6756 2509 9315 6460 -2316 -9246
1205 -9246 -6808 2631 9142 6782 -2339 -9172 -6641 2156 9087 6696 -2328 -8849 -6676 2031 8835
1220 8835 6293 -2165 -8973 -7014 2109 8659 6538 -2037 -8677 -6538 1931 8501 6530 -2100 -8625
1235 -8625 -6857 1923 8850 6818 -1910 -8366 -6731 1477 8476 6613 -1785 -8368 -6689 1824 8264
1250 8264 6945 -1334 -8302 -6649 1368 8214 6864 -1326 -8029 -6670 1131 8043 6536 -895 -7908
1265 -7908 -6805 1212 7711 6640 -1036 -8052 -6626 1011 7799 7070 -967 -7541 -6531 1329 8088
$$ packed form
1161F277j0108n730K797J0214O725l992r158p286M062J0236N599l048r855o604
1175i871L836R004O613k835j0066o255K905R745O728l549r211o659L250R646O046
1190I327k462r902o694L363R271O665k761r614o415K466R265O806k855q776o930
1205i246K438R439O511k360r121o833K531Q797O931k391r024o521K173Q707O804
1220H835k542q458o808J959R123O550k121q575o640K139Q469O570j971q630o525
1235h625J768Q780O927k032q728o456J635Q208O999j863q398o583J679Q513O440
1250H264j319q279o968J653Q017O846j350q190o703J359P801O912j507p431p013
1265g908J103Q017O499j071p676p016J426P637O788p29q037o574J010P860O759
$$ plain form
1280 8088 6650 -866 -7492 -6948 834 7467 6838 -759 -7577 -6581 459 7304 7076 -557 -7317 -6619
1296 -6619 329 7754 6849 -293 -6986 -7111 633 7037 6496 -18 -7280 -6562 448 6738 6891 -601
1312 -601 -6902 -6457 -132 7003 6507 -402 -6331 -6852 417 6927 6467 261 -7048 -6832 37 6563
1328 6563 7018 -113 -6449 -6506 -308 6756 6554 198 -6338 -6898 -218 6791 6514 545 -6927 -6565 -28
1345 -28 6156 6725 395 -6303 -6219 -612 6502 6947 200 -5654 -6709 -133 6385 6121 635 -5913 -6593
1362 -6593 -33 5727 6759 805 -6052 -6112 -1291 6074 6729 281 -5646 -6936 -1029 5762 6012 1135
1378 1135 -5983 -7075 -395 5323 6772 959 -6085 -6023 -1295 5359 6707 687 -4935 -6809 -1496
1393 -1496 5788 6110 1108 -5323 -6858 -496 4904 6174 1371 -5888 -6102 -1674 4842 7088 690
$$ packed form
1280H088j438p516o626N44P782O633o29p597o818R96P040O845k28p633o760O98
1296f619O948P425r05p142o693j25P744O404n41o514p262P18P010O290J53p492
1312f01o301M45O325P135m96o909n929n21P269O510m60o206p309K16O869O526
1328F563M55p131o336n7O198P064k02o356o536n60O680P009k77n969p472L62O537
1345b8O184N69o330o698Q4N607P114M45o747n854j055O576O518k64n486o548o80
1362f593O560N760J032n954o857o0M821P365O55o448n927j290N907O791K50m877
1378A135p118j092O680N718J449n813p044O2M728O654J348o020n622j874N313
1393a496P284L22n002o431j535O362N400J270m803p259k14M428O516K246o398
$$ plain form
1408 690 -4969 -6438 -1637 5721 5419 1082 -4717 -7064 -986 4403 6069 2228 -5932 -6286 -1314 4629
1424 4629 7002 608 -5219 -5823 -2030 5144 5875 1212 -4069 -7010 -1503 5084 6040 2177 -5512 -6349
1440 -6349 -979 3918 6637 1617 -4391 -5528 -2429 4574 6682 1087 -4291 -6692 -1363 4913 5312
1455 5312 2123 -4418 -5987 -1566 3386 6656 2255 -4773 -5856 -2024 4831 6267 867 -3750 -5915
1470 -5915 -1906 4282 5492 2368 -4271 -6554 -1765 4073 6559 2231 -4548 -5434 -2104 3660 6133
1485 6133 1838 -3185 -6340 -2538 4171 5699 2348 -4141 -6330 -1699 3235 5686 2248 -3868 -5124
1500 -5124 -2632 3341 6500 1923 -3391 -6478 -2365 4462 5169 1955 -3383 -6106 -1692 2672 5674
1515 5674 2994 -4178 -5671 -2777 3359 6578 1587 -3303 -5507 -2662 3837 5272 2631 -2614 -6541
$$ packed form
1408F90n659j469M801P358l02m337n799k347O078N389J666l841q160l54M972N943
1424D629K373o394n827o04L793P174P31m663n281k941N507O587R56l863p689q37
1440f349N370M897K719n020o008j137L099P003K108n595n378k401N329O276L99
1455E312l189o541j569M421M952L270m401p028j083L832O855J436n400m617k165
1470e915M009O188J210l124o639k283M789N838K486m328o779q86L330N764K473
1485F133m295n023l155L802O709J528l351o489k189M631M934K451l438o116j256
1500e124K492N973L159m577n314l087M113O827P07l214n338k723M414M364L002
1515E674k680p172j493K894O136L219m991m890k204K845O499J435k641n245l927
$$ plain form
1530 -6541 -2345 3210 5582 2985 -3881 -5394 -2204 2593 5743 2085 -2762 -5130 -3405 3297 5629
1545 5629 2528 -2670 -6129 -2012 3254 4912 2708 -3203 -5051 -2189 2199 5910 2946 -2770 -5445
1560 -5445 -3176 3154 5586 2098 -2573 -5410 -2465 3036 4972 3540 -2480 -5688 -2433 2630 5776
1575 5776 2932 -3077 -5117 -2937 2413 4975 2421 -1950 -5365 -3102 2479 5257 3010 -2612 -5456
1590 -5456 -2312 2051 4935 3059 -2281 -4794 -3257 1945 5654 2976 -2165 -5408 -2854 2498 5034
1605 5034 2840 -2286 -5024 -2762 1943 5133 3200 -2271 -4777 -2902 2311 5232 2648 -2070 -5021
1620 -5021 -3191 1986 4649 2882 -1780 -5236 -2939 1758 4977 3128 -2085 -4539 -2946 1893 5098
1635 5098 2834 -1766 -4694 -3277 1899 5017 2961 -1740 -4857 -2830 1831 4473 3293 -1895 -4600
$$ packed form
1530f541M196N555K372k597o866j513L190M797L150l658m847k368J725O702K332
1545E629l101n198l459M117N266J658k204n911j848K862M388L711k964n716k675
1560e445K269O330K432l488m671k837K945N501J936j432o020l208L255N063L146
1575E776k844o009k040K180N350K562k554m371l415K263N581K778k247n622k844
1590e456L144M363K884j876n340k513J537N202L709k678n141l243K554N352K536
1605E034k194n126k738K262M705L190j933n471k506J875N213K921k584m718k951
1620e021J830N177K663j767m662l456K297M697L219j849n213k454J593M839L205
1635E098k264m600k928J417N176L118k056m701l117K027M661K642j180n188k705
$$ plain form
1650 -4600 -3035 1609 4907 3056 -1655 -4670 -3179 1838 4651 3104 -1351 -4519 -3093 1623 4619
1665 4619 3266 -1464 -4796 -3162 1251 4703 3135 -1417 -4400 -3253 1438 4548 3339 -1266 -4475
1680 -4475 -3473 1416 4576 3085 -1215 -4507 -3454 1371 4395 3327 -1316 -4137 -3091 1182 4380
1695 4380 3630 -1224 -4314 -3340 1187 4452 3233 -1031 -4404 -3172 881 4555 3156 -1102 -4354
1710 -4354 -3078 801 4236 3563 -885 -4167 -3293 588 4072 3452 -813 -4058 -3320 906 4120 3312
1726 3312 -880 -4215 -3316 704 4184 3237 -898 -4242 -3376 861 4404 3426 -966 -3940 -3262 678
1742 678 4102 3310 -774 -3995 -3485 685 3940 3259 -609 -4204 -3156 785 4038 3312 -909 -3790
1758 -3790 -3268 418 4128 3355 -478 -3712 -3621 374 3637 3237 -311 -3938 -3356 389 3769 3396 -501
$$ packed form
1650d600J565M644L298j851m711l015J491N017K813j547m455l168J426M716K996
1665D619j353m730l332J634M413L452j568m552k983J147M691L110j209m605l209
1680d475J002M889L160j491m300l292J053M825L024j068m643k821J046M273L198
1695D380p50m854l090R74M527L265j219m264l373J232M053L674j399m258l252
1710d354J276L879L435o73m448l282Q74L881L484o20m265l245P38M226L214q08
1726C312m192l335Q99M020L480r47m135l344Q66M237L543r78m392k974O78L940
1742F78L424p92m084l221N10M170L255o81l868l595J048L941L253p26m221k881
1758c790N22L686L710p73l833l234R1L995L263m00l548l627N82L745L380l73l897
$$ plain form
1775 -501 -3876 -3415 254 3815 3501 -501 -3584 -3330 384 4046 3231 -519 -3770 -3151 242 3583
1791 3583 3371 -237 -3617 -3238 271 3814 3453 -409 -3452 -3348 22 3533 3362 -265 -3518 -3435 152
1808 152 3523 3109 92 -3405 -3707 247 3363 3529 -91 -3538 -3096 -18 3430 3462 -109 -3245 -3459
1825 -3459 -186 3499 3343 128 -3203 -3410 320 2943 3319 116 -3648 -3132 -102 3122 3562 -229
1841 -229 -3179 -3220 -26 3507 3274 -45 -3017 -3246 -105 2886 3314 274 -3231 -3170 -372 3356 3840
1858 3840 85 -3410 -3202 -560 3065 3322 262 -2895 -3572 -346 3100 3251 489 -3226 -3273 -132
1874 -132 3007 3286 360 -2857 -3439 -495 3030 3345 402 -2885 -3721 -389 2901 2969 503 -2899 -3339
1891 -3339 -269 2645 3472 519 -3001 -3337 -710 2982 3471 334 -2452 -3526 -387 2742 3083 966
$$ packed form
1775e01l375M61L669L561l14m002l083K54L714L662q15l750l251O19L393L341
1791C583k12l608l380L79L509L543l61l862l043J04L370L511j71l627l253Q3L587
1808A52L371m14l017l497l02L954L116J66l620l447M42L078L448L2l571l136k14
1825c459L273L685j56l215l331k07L730K623L76l203l764N16L030L224M40l791
1841b29k950m1L194L533k33l319k972k29L141K991M28l040l505O1K798L728M84
1858C840l755l495K08K642L625K57l060l157o77L226L446J51k762l715m7L141
1874a32L139K79k926l217n82K944L525L15k943l287q36L332L290O8k466l402m40
1891c339L070K914Q27k953l520l36K627L692M89l137k786j074L139L129L41k117
$$ plain form
1907 966 -2855 -3475 -505 2694 3457 387 -3191 -2784 -849 2704 3337 260 -1959 -3646 -780 3224
1923 3224 2801 879 -2802 -3382 -65 2217 3001 777 -2772 -2953 -762 2091 3676 306 -2615 -3287
1939 -3287 -1009 3195 2846 619 -2113 -3230 -530 2103 3180 1260 -3015 -3135 -1010 2394 3552
1954 3552 380 -2451 -2752 -1079 2585 2701 753 -1956 -3777 -783 2680 3090 837 -2669 -3060 -435
1970 -435 1738 3268 662 -2209 -3065 -1524 2656 3456 633 -2489 -3480 -565 2388 2605 1216 -2118
1986 -2118 -3100 -868 1803 3513 1082 -2375 -2902 -1255 2527 3143 654 -1790 -3281 -1012 2231 2846
2002 2846 1529 -1935 -3398 -902 1919 3228 994 -2474 -2559 -1121 1999 2791 846 -1226 -3277 -1316
2018 -1316 2529 2963 944 -2158 -3327 -456 1891 2917 1426 -1826 -2570 -1497 1864 3516 839
$$ packed form
1907I66l821o20K970L199P63l070l578M07J935L553O33l077k219j687K866M004
1923C224m23j922l681n80L317K282P84k224l549j81K191K853J585l370k921o72
1939c287K278M204l49k227k732j117K700K633J077j920m275j20K125L404J158
1954C552l172k831l01J673L664J16j948k709j821K994L463M10k253l506l91K625
1970d35K173J530k606k871q56J541M180Q00k823l122r91K915K953K17j389l334
1986b118r82K232K671J710k431l457n27J647L782O16k489k444j491K269L243O15
2002B846j317l464j463K496K821J309k234l468q5J438L120P92j945k072k051J961
2018a316L845M34k019l102j169K871K347J026j491l252p44J073L361J652k677
$$ plain form
2033 839 -1780 -3175 -1162 2691 2880 868 -1837 -2990 -785 1752 2881 1340 -2226 -2895 -1076 1714
2049 1714 3307 736 -1957 -2893 -1461 2045 2740 1133 -1332 -2936 -921 1703 2925 1385 -2107
2064 -2107 -3004 -980 1534 2844 1204 -1493 -2663 -1666 1755 2987 1248 -1503 -3016 -1217 1614
2079 1614 2676 1400 -1563 -3001 -1159 1540 3007 1360 -1729 -2729 -1335 1533 2899 1176 -1648
2094 -1648 -2926 -1321 1778 2514 1452 -1574 -3059 -1187 1328 3038 1595 -1764 -2893 -1590 1144
2109 1144 2473 1120 -1053 -2702 -1504 1431 2927 1329 -1649 -3168 -1238 1302 2525 1393 -1381
2124 -1381 -2701 -1846 1200 2850 1130 -1408 -2594 -1464 1404 2853 1565 -979 -2813 -1610 1440
2139 1440 2687 1523 -1287 -2747 -1621 1226 2569 1688 -1066 -2834 -1725 1344 2752 1654 -897
$$ packed form
2033H39k619j395K013L853J89k012k705j153K205K537J129j541l566o69J819K790
2049A714J593k571k693r36J432L506O95j607k465j604K015K624J222j540l492
2064b107q97K024K514J310j640k697j170R97L421J232j739k751j513J799K831
2079A614J062j276k963j438J842K699J467j647l089j000J394K868J366j723k824
2094a648j278J605L099P36j062l026j485J872K515J710j443l359j129J303K734
2109A144J329j353k173j649J198K935J496j598k978j519J930K540J223j132k774
2124a381j320Q55L046J650j720k538j186J130K868J449j288k544j834J203L050
2139A440J247j164k810j460J126K847J343q81k754j768J109L069J408j098k551
$$ plain form
2154 -897 -2555 -1155 1262 2621 1383 -1205 -2688 -1393 1022 2530 1214 -1290 -2619 -1461 916
2169 916 2679 1352 -1149 -2666 -1697 1328 2532 1577 -838 -2560 -1525 1015 2581 1633 -1399 -2427
2185 -2427 -1562 957 2466 1303 -846 -2568 -1554 1259 2562 1460 -966 -2697 -1579 1135 2352
2200 2352 1482 -755 -2377 -1694 1061 2309 1359 -844 -2349 -1840 993 2449 1673 -767 -2515 -1560
2216 -1560 1043 2402 1655 -920 -2082 -1673 797 2289 1240 -694 -2394 -1266 1143 2512 1579 -462
2232 -462 -2294 -1606 926 2341 1778 -939 -2452 -1346 575 2413 1620 -730 -2176 -1534 1081 2123
2248 2123 1453 -869 -2476 -1657 587 2392 1811 -760 -2296 -1616 746 2180 1400 -789 -2085 -1720
2264 -1720 634 2220 1754 -406 -2401 -1531 660 2182 1715 -781 -1978 -1682 505 2253 1682 -608
$$ packed form
2154h97j658J400K417J359j238k588j483J295K415J508j316k504j329J158K377
2169I16J763j327k501j517R69L025J204r55k415j722J035K540J566r48l032j028
2185b427Q65K519J509j163k149j722J014K813J303j102k426j731J118K714J217
2200B352q70k237j622O83K755J248r50k203j505N09K833J456p76k440j748R55
2216a560K603J359p47k575j162M09K470J492j049j934j700J128K409J369r33k041
2232d62j832O88K532J415n63k717j513J106J921J838p93k350j446O42K615J042
2248B123o70k322j607Q19K244J805n81k571j536O80K362J434p80k189j296L65
2264a720K354J586m66k160j995Q70K191J522m67k496j197K96K187J748n71k290
$$ plain form
2280 -608 -2111 -1548 475 2318 1471 -276 -2324 -1561 666 1885 1697 -721 -1957 -1461 385 1924
2296 1924 1762 -431 -1932 -1737 348 2103 1640 -692 -1977 -1656 737 1986 1756 -413 -2042 -1399
2312 -1399 314 2197 1671 -734 -1837 -1651 357 2119 1397 -465 -2098 -1777 542 1862 1754 -143
2328 -143 -2288 -1496 388 1947 1806 -567 -1820 -1666 215 2082 1784 -70 -1941 -2071 262 2040
2344 2040 1612 -450 -2308 -1351 406 2001 1950 -419 -1828 -1793 121 2293 1640 -433 -1846 -1732 741
2361 741 2092 1512 -5 -1888 -1588 313 1803 1839 -265 -1955 -1837 177 2212 1601 -251 -1620 -1688
2378 -1688 485 1681 1506 -50 -2210 -1589 389 1881 1920 -250 -1691 -1057 157 2053 1892 -30
2394 -30 -1685 -2126 238 2164 1568 -146 -1955 -1238 587 1276 1717 -124 -1691 -1521 -61 2012 1749
$$ packed form
2280f08j503N63K023J843q47j747k048P63K227J219j88k418j236M96J846J539
2296A924j62k193j501J95K085J755m63k332j285L21K393J249k30k169j629O43
2312a399J713J883n26k405j103J86K008J762p22j862j633L21K319J320j08j897
2328a43k145P92J884J559j41k373j253J54J881J867k98j854j871j30K333J778
2344B040m28k062j858R57J757J595n1k369j409L5J914K172o53k073j413J14K473
2361G41J351n80j517j883L00J901J490L6k104j690J18K014K035o11j852j369o8
2378a688K173J196j75j556k160O21J978J492L9k170j441O34J214J896j61j922
2394c0j655m41K364J926n96j714j809P17J825O89M41j841j567J70J460K073k63
$$ plain form
2411 1749 -356 -1856 -1795 47 2108 1309 52 -1712 -1580 129 1634 1739 -11 -1990 -1426 7
2427 7 1698 1628 -202 -1404 -1576 61 1807 1433 193 -1546 -1968 350 1360 1822 112 -1771 -1385
2444 -1385 44 1441 1644 -201 -1468 -1630 -102 2119 1481 69 -1662 -2281 428 1321 1618 235
2460 235 -1855 -1265 -172 1395 1944 -246 -1828 -1455 -78 1853 1373 -4 -1440 -1789 -31 1371
2476 1371 1561 386 -1549 -1666 -202 1370 1783 -159 -1612 -1353 -434 1480 1482 104 -1396 -1823 -254
2493 -254 1664 1490 16 -1562 -1523 397 1358 1630 182 -1638 -1480 -268 1592 1785 -12 -1407 -1561
2510 -1561 -218 1612 1349 336 -1474 -1802 -41 1104 1965 202 -1504 -1465 -258 1300 1675 -88
2526 -88 -1201 -1527 -385 1343 1579 582 -1495 -1686 -179 1254 1651 351 -1563 -1216 -207 930 1482
$$ packed form
2411A749k105j500O1J842K061p99j257j764J32J709J505J05j750j979N64J433
2427GJ691p0j830j202j72J637J746l74j240j739m22K318J010M62j710j883L86
2444a385J429J397K03j845j267j62J528K221o38j412j731o19K709Q93K97j383
2460B35k090N90J093J567N49k190j582L73J377J931m80j377j436l49J758J402
2476A371J90j175j935j17J464J572M13j942j453K59R19J914Kj378j500m27J569
2493b54J918j74j474j578L9J920R61K72j448j820J58J212J860J93j797j395j54
2510a561J343J830k63j013j810l28J761J145Q61j763j706L9J207J558L75j763
2526h8j113l26J142J728K36r97k077j91J507J433L97j300j914L47J009J137N52
$$ plain form
2543 1482 62 -1116 -1554 -391 1467 1455 209 -1615 -1527 -166 1155 1297 458 -1440 -1538 -358 1123
2560 1123 1833 251 -1154 -1380 -374 1425 1545 89 -1004 -1409 -308 1191 1426 389 -1315 -1476
2576 -1476 -199 1136 1612 258 -1437 -1648 -253 1348 1540 414 -1274 -1654 -42 1280 1271 389 -1308
2593 -1308 -1437 -294 1342 1277 332 -1214 -1310 -282 1050 1370 504 -1021 -1638 -102 1337 1365 351 -1210
2611 -1210 -1642 -182 1001 1344 247 -1393 -1621 -545 1318 1574 556 -1069 -1461 -601 1285 1278 438
2628 438 -1171 -1713 -228 1234 1578 311 -996 -1486 -345 1076 1519 334 -977 -1466 -401 1212
2644 1212 1570 365 -1062 -1440 -173 1054 1511 377 -1049 -1359 -494 971 1230 231 -1010 -1410 -490
2661 -490 987 1469 381 -805 -1264 -587 1036 1348 288 -963 -1438 -424 981 1236 325 -973 -1440
$$ packed form
2543A482j420j178m38J163J858j2j246j824Q8J361J321J42q39j898r8J180J481
2560A123P10j582j405k26J006J799J20j456j093m05J101J499K35j037j704j61
2576a476J277J335M76j354j695k11J395J601J92j126j688l80J612J322rq82j697
2593a308j29J143J636o5r45j546r6J028J332L20q66j525o17J536J439K8j014j561
2611a210m32J460J183L43j097j640k28J076J863K56j018j625l92Q60J886pq40
2628D38j609n42J485J462L44j267j307m90J141J421M43j185j311m89J065J613
2644A212L58j205j427l78J267J227M57j134j426l10Q65J465K59r99j241m00R20
2661d90J477M82j088j186m59O77J623L12j060j251m75J014J405K55r11j298m67
$$ plain form
2678 -1440 -246 909 1340 244 -776 -1121 -455 917 1216 449 -1066 -1425 -425 938 1523 292 -890
2695 -890 -1711 -588 1101 1370 616 -1064 -1337 -410 850 1354 603 -732 -1248 -493 803 1379 501 -914
2713 -914 -1413 -233 1105 1264 268 -750 -1408 -546 883 1301 586 -829 -1299 -762 874 1492 480 -812
2731 -812 -1400 -650 941 1311 432 -598 -1461 -612 888 1234 734 -759 -1250 -796 800 1403 621 -687
2749 -687 -1157 -627 691 1306 658 -757 -1166 -446 846 1315 505 -701 -1321 -567 822 1418 428 -915
2767 -915 -1248 -398 764 1391 457 -776 -1144 -410 707 1312 584 -838 -1317 -453 926 1531 663 -621
2785 -621 -1273 -549 375 1409 440 -666 -1016 -523 766 1521 439 -483 -1130 -645 817 1172 610 -1098
2803 -1098 -1374 -267 776 1059 676 -927 -1235 -409 521 1069 507 -662 -1307 -310 963 1180 610 -679
$$ packed form
2678a440J194J155M31j096j020l45O66J372K99p67j515l59J000J363N85j231j182
2695h90q21J123J689K69p54j680k73R27J260N04p51j335n16P55J296N76q78j415
2713i14m99J180J338J59r96j018o58Q62J429M18p15j415m70N37J636O18j012j292
2731h12n88P50J591L70q79j030q63Q49J500L46n00j493m91M54J596O03p82j308
2749f87m70N30J318O15o48j415m09P20J292M69q10j206o20P54J389N96r90j343
2767i15l33Q50J162O27r34j233l68P34J117O05p28j422m79Q64J379O05q68j284
2785f21o52P24R24J034r69j106l50M93J289P55j082r22o47M85J462L55n62j708
2803a098k76J107J043K83l83j603l08Q26R30N48n62j169o45R97J273K17n70j289
$$ plain form
2821 -679 -1103 -560 387 1374 695 -699 -1099 -876 900 1356 453 -587 -1500 -325 670 1362 482 -651
2839 -651 -1093 -726 407 1310 838 -945 -1341 -602 693 1315 251 -445 -1229 -625 741 1338 698 -630
2857 -630 -1182 -640 435 1133 707 -706 -1163 -616 257 1412 537 -395 -1416 -942 691 1055 676 -584
2875 -584 -1316 -342 532 1269 660 -664 -1135 -853 557 1472 518 -548 -1108 -789 693 1092 723 -454
2893 -454 -1120 -599 278 1058 1032 -600 -1362 -333 199 1172 603 -498 -810 -940 484 1028 704 -328 -1059
2912 -1059 -622 621 1048 944 -633 -1217 -267 446 948 641 -382 -1162 -967 540 1381 285 -417 -1304
2930 -1304 -636 830 719 814 -323 -937 -457 219 1304 779 -520 -959 -755 676 1019 353 -170 -1034
2948 -1034 -882 515 696 1189 -265 -1304 -631 247 1074 655 -640 -683 -603 226 812 558 -94 -1182 -719
$$ packed form
2821f79m24N43R47R87o79j394m00K23J776M56r03j040r13J175R95O92q80j133
2839f51m42L67J133R03m72j783l96P39J295O22j064o96p84O04J366N97o40j328
2857f30n52N42J075O98m26j413m57N47Q73J155q75r32j021M74J633L64l79j260
2875e84p32R74Q74P37o09j324m71K82J410R15r54j066n60L19J482L99l69j177
2893d54o66N21Q77P80k6j632p62J029N32R73n69j101l12j30J424N44l24j032p31
2912a059M37J243M27j04j577n84R50P13N02l07j023p80J95J507Q41j096p02q87
2930a304O68J466j11R5j137o14M80O76J085n25j299m39K04J431L43o66n23q64
2948a034J52J397J81M93j454j039O73Q78Q27m19j295m3Q0Q29N86k54o52j088M63
$$ plain form
2967 -719 681 958 542 -456 -1163 -490 193 803 763 -311 -823 -842 297 1114 719 -503 -996 -742 452
2986 452 814 682 -202 -842 -746 42 1143 826 -519 -940 -644 270 1107 476 -420 -747 -694 385 1048 548
3006 548 -178 -985 -664 399 1074 881 -374 -1126 -417 126 925 785 -140 -964 -760 326 1010 784 -193
3025 -193 -1107 -642 385 816 784 -44 -1091 -563 346 772 642 -486 -896 -451 402 1057 575 -179 -757
3044 -757 -739 194 705 587 -214 -1005 -654 77 979 834 -380 -972 -716 212 798 757 -114 -807 -597 385
3064 385 1053 754 -161 -880 -470 101 606 801 -335 -893 -887 362 814 598 -138 -1003 -541 158 1081 646
3084 646 -86 -808 -738 159 1165 808 -349 -996 -764 276 1142 565 -167 -1002 -849 269 918 718 -6
3103 -6 -659 -658 267 898 809 -388 -991 -886 136 862 579 -28 -1084 -571 329 901 831 -360 -1148 -745 -79
$$ packed form
2967g19J400K77m16r98p07O73O83O10m0j074n12j9J139Q17l95j222m93K54J194
2986D52L62j32q84o40R6P88J101l17j345m21K96R14Q37o31q96l27N3J079O63n00
3006E48p26q07L21J063O75j93j255p52P09N43P99j40r25q24K04J086O84k26r77
3025a93r14M65J027M31l2q28j047N28R09M26j30j128m10M45Q53O55m82p54n78
3044g57J8R33N11j18q01p91L51P31R02j45j214n92K56R28N86m1q71o93K10R82
3064C85O68k99r15p19M10N71N05J95j136n58OJ249M52k16p36q65M62O99R23m35
3084F46p32p22P0Q97J006l57j157o47K32J040Q66n77p32q35J53J118O49k00p24
3103fo53JR25O31q9j197o03J05J022P26k83o07j056N13R00N72p0j191p88M03O66
$$ plain form
3124 -79 950 542 -61 -683 -660 46 805 513 -165 -897 -795 218 741 780 -123 -838 -721 -223 872 501
3144 501 65 -787 -828 -56 756 681 -350 -803 -649 88 1085 921 -87 -548 -720 154 802 940 -187 -779
3164 -779 -874 222 756 597 -77 -885 -631 95 702 653 -198 -970 -909 77 908 692 98 -733 -815 -72 960
3185 960 562 19 -902 -632 228 886 784 -166 -826 -784 59 809 789 -128 -719 -595 -111 527 950 -190
3205 -190 -913 -891 -77 705 440 -294 -664 -711 206 860 595 66 -893 -913 88 754 624 -163 -525 -468 116
3226 116 765 639 130 -704 -894 -150 923 689 -127 -766 -752 185 699 682 -39 -835 -871 -181 632 566 94
3247 94 -686 -837 -39 810 592 65 -791 -761 244 744 772 339 -705 -484 -72 714 861 233 -620 -586 145
3268 145 869 588 149 -693 -773 173 820 701 -30 -612 -533 24 472 720 -28 -532 -689 -269 551 685 152
$$ packed form
3124g9J029m08o03o22K3P06P59k92o78p32J02J013N23L9r03p15J17M98J095l71
3144E01m36q52m1P72Q12p5j031m53J54P37R97j64j008m61j72Q74O48J38j127n92
3164g79r5J096N34j59o74q08K54P26O07m9q51p72O1R86Q31k16n94q31q2P43J032
3185I60l98n43r21K70Q60O58j02r50o60M2Q43P50k0r17n91J24M84O38M23j140
3205a90p23K2Q14P82k65p34l70m7R17O54k65n29r59k0J001O66j30p87l62N7N84
3226A16O49j26n09q34j90P44J073k34q16o39J4R37N14j7p21p96l6O90Q13o6m72
3247I4p80j51P98Q49k18n27q56L0J005N00K8m33j044K21M12P86J47o28q53L4P31
3268A45P24k81m39q42q0R46O47j19p31n82P9N57M48K48p48n04j57M20Q20J34n33
$$ plain form
3289 152 -827 -481 8 532 729 -50 -763 -562 -136 690 957 -34 -507 -897 -202 864 814 113 -807 -1002
3309 -1002 -33 634 592 125 -764 -748 -67 634 652 -25 -718 -905 -240 687 377 -95 -501 -903 48 761 548
3330 548 391 -742 -725 6 570 948 107 -333 -640 -397 512 890 26 -642 -658 -198 584 621 275 -707 -584
3351 -584 -110 465 656 193 -655 -810 -247 744 829 -46 -561 -903 64 714 275 300 -570 -701 -301 770
3371 770 638 256 -859 -394 -239 614 691 14 4 -520 -222 358 657 241 -475 -790 108 525 849 10
3391 10 -724 -610 55 555 827 -145 -495 -350 -547 695 509 50 -502 -630 -145 484 633 432 -507 -758
3411 -758 -94 404 969 274 -473 -542 -229 705 575 92 -390 -670 -9 406 539 327 -386 -613 -49 338
3431 338 928 102 -511 -611 -282 522 773 185 -448 -799 -208 407 351 183 -488 -670 -233 365 501 288
$$ packed form
3289A52r79L46M89N24J97p79p13K01M26Q26K67r91m73l90O95J066n0p01r20j95
3309a002R69O67m2m67q89J6O81P01J8o77o93j87O65R27l10m72m06m02R51P13k13
3330E48j57j133J7P31N64L78q41m40l07K43R09L78q64o68j6M60P82L7l46r82J23
3351e84M74N75J91m63q48j55N63R91Q5q75n15l42R67O50m39K5q70j31M00J071
3371G70j32l82j115M65J55Q53P7o77j0n24K98N80K99m16p16l15Q98M17L24q39
3391A0p34J14O65N00K72r72l50J45j97J242j86m59n52j28M85O29J49k01r39k51
3411g58O64M98N65o95p47o9L13R34j30m83m82k80O61M15J33k12p13k27N64L87
3431C38N90q26o13j00L29Q04K51n88o33l51N91O15n6j68o71j82M37N98J36k13
$$ plain form
3451 288 -484 -375 -323 430 968 148 -600 -961 -449 600 517 385 -544 -708 -79 400 534 414 -461 -294
3471 -294 -178 456 801 127 -452 -627 -312 496 788 216 -361 -816 -105 249 701 391 -702 -453 -179 130
3491 130 649 120 -414 -824 -433 484 458 378 -291 -732 -82 355 479 345 -337 -920 -186 494 726 -39 -211
3512 -211 -492 -199 276 611 336 -169 -646 -359 490 567 363 -634 -624 -223 449 983 210 -193 -746 -173 511
3533 511 468 440 -314 -776 -594 491 563 198 -511 -619 -574 321 776 421 -340 -930 -290 380 365 87 -97
3554 -97 -652 -430 198 688 258 -376 -575 -22 399 738 279 -287 -663 -342 150 794 95 -59 -634 -260
3574 -260 219 624 463 -382 -757 -305 90 608 229 -298 -614 -342 242 753 128 -374 -652 -467 327 780
3594 780 345 -333 -665 -347 281 635 272 -108 -563 -413 112 759 633 -266 -618 -422 214 532 301 -303
$$ packed form
3451B88p72J09N2P53N38q20p48l61N12J049q3j32r29j64O29M79J34j20q75J67
3471b94J16O34L45o74n79j75L15Q08K92n72n77m55P11L54M52l10j093K49K74L09
3491A30N19n29n34m10L91R17k6q0o69m41O50M37J24j34o82n83P34O80K32p65j72
3512b11k81K93M75L35k75n05m77K87Q49P7k04r97J0M01O72N34p73m03n53N73O84
3533E11m3k8p54m62J82J085P2l65p09j08M5Q95M55l55p61n90O40O70j5k78j84
3554i7n55K22O28M90m30o34j99N53M21L39m59n66l76L21M92O44o99j54n75L74
3574b60M79M05j61q45l75M52L95N18l79n27l16K72N84N11o25n02k78J85P94M53
3594G80m35o78l32L18O28L54l63l80m55J50N25O47j26q99l52J96O36L18k31o04
$$ plain form
3614 -303 -655 -82 326 378 523 65 -578 -311 317 481 328 -374 -434 -280 127 733 242 -288 -600 -317 198
3635 198 512 331 -364 -649 -398 249 742 339 -247 -719 -211 278 546 418 -67 -443 -348 124 359 248
3655 248 -292 -561 -163 -61 681 422 25 -603 -440 187 488 378 -308 -478 -393 346 627 167 -293 -575
3675 -575 -414 298 566 407 -250 -443 -478 -39 644 339 35 -468 -449 61 495 399 -403 -772 -258 178 424
3696 424 341 -285 -316 -403 164 596 313 -102 -468 -460 139 629 360 -315 -700 -392 -46 467 646 -28 -530 -356
3718 -356 -65 587 546 -90 -508 -458 239 624 554 -54 -320 -654 202 861 250 -50 -350 -376 99 476 78
3739 78 -109 -485 -515 176 512 108 186 -415 -514 65 541 363 -203 -442 -128 -175 356 103 158 -470 -529 59
3761 59 750 271 -2 -517 -528 305 506 639 -63 -458 -237 55 417 602 -160 -475 -621 353 502 497 -107
$$ packed form
3614c03l52N73M08N2J45m58o43K67O28J64j53p02o0J54M07O06m91n30l12K83N15
3635A98L14j81o95k85K51O47M93m03n86m72N08M89K68j28m85l76R5M72K35j11
3655B48n40k69L98J02P42k59l97o28J63O27L01j10o86j70Q5P39K81m60m60k82
3675e75J61P12K68j59o57j93l5M39O83l05l04n03J9N10M34r6q02l69N14M36K46
3696D24q3o26l1q7N67M32k83m15l66QN99M90k69o75l85L08L46N13J79o74n02J74
3718c56K91O52m1o36m18N0O97L85p0o08k66l34Q56O59o11l00l00k6M75L77l98
3739G8j87l76l0O91L36m04P8o01r9N79M76j78n66k39L14m7N31k53N5o28n9N88
3761E9O91m79k73n15j1Q33K01J33p02l95K21K92L62J85p62l15j46R74J49no04
$$ plain form
3782 -107 -443 -455 89 453 666 -7 -296 -762 71 546 308 -358 -544 -281 24 550 308 73 -332 -452
3802 -452 56 443 323 223 -777 -596 12 557 247 -241 -293 -380 -25 320 364 69 -665 -353 123 516 470
3823 470 -47 -414 -470 -70 439 444 -78 -476 -381 79 654 203 -50 -507 -547 298 521 348 219 -492 -625 165
3845 165 393 480 90 -330 -274 -25 264 407 66 -306 -217 307 354 220 97 -373 -494 90 232 367 -61
3866 -61 -394 -263 -164 450 447 42 -427 -495 228 666 437 194 -369 -324 88 185 586 31 -458 -689 -112 590
3888 590 636 84 -287 -450 194 426 205 77 -365 -302 -222 341 319 398 -564 -457 95 377 466 -201 -116 -551
3910 -551 -351 440 375 117 -504 -574 131 353 236 -67 -413 -241 -61 169 608 -177 -383 -557 -131 471 338
3931 338 22 -266 -358 60 140 223 134 -390 -154 -159 280 631 169 -660 -419 -197 490 330 -17 -358 -393 -108
$$ packed form
3782a07l36j2N44L64K13o73k89m66Q33M75k38o66j86K63L05N26k42k35m05j20
3802d52N08L87j20j00j000J81O08N45l10m88n2q7L55L45M4k95p34L12M76L93m6
3823D70n17l67n6M00N09Nn22l98R5M60N75m51k53m57m0Q45K23j73j29p11j33P90
3845A65K28Q7l90m20N6K49K89J43l41l72Q9N24M7j34j23m70j21N84J42J35m28
3866f1l33J31R9O14lm05m69o8P23M38k29k43n63M5M12R7M01n55m89k31N77P02
3888E90M6n52l71j63O44K32k21j28m42O3Q0N63k2P9r62J07N52K82Q9o67Q5m35
3910e51K00P91o5k58o21p0P05K22j17l03l46J72J80K30M39p85k06j74M26O02j33
3931C38l16k88r2M18Q0Q3q9n24K36nM39L51m62q29K41K22O87j60l47l41l5K85
$$ plain form
3953 -108 415 244 55 -183 -457 -226 213 575 87 -193 -489 15 670 632 190 -190 -697 -120 523 309
3973 309 366 -288 -344 -3 273 264 174 -488 -374 -242 370 423 -29 -649 -455 -155 331 559 257 -439 -499 -27
3995 -27 138 414 -8 -408 -573 -149 261 444 178 -448 -267 -263 215 473 367 -156 -730 -211 400 363 396 -144
4017 -144 -319 -15 444 569 142 -307 -533 -62 575 186 262 -228 -367 -139 409 410 41 -232 -462 159 369
4038 369 287 106 -389 -778 -345 191 523 118 -345 -466 -171 377 624 172 -321 -553 -113 135 495 218
4058 218 -345 -577 -79 246 428 145 -365 -314 -145 20 545 385 -233 -364 -79 90 520 -87 -250 -407
4078 -407 67 232 392 378 -198 -419 -344 61 304 178 15 -395 -98 238 173 137 -503 -531 -226 312 342 208
4100 208 -212 -504 -238 192 305 352 -334 -362 -206 313 302 178 -140 -447 -214 19 409 16 -275 -443 -291
$$ packed form
3953a08N23j71j89k38k74K31M39L62m88k80k96N04O55l8m42l80n07N77O43k14
3973C09N7o54n6L41K76rr0o62J14J32O12N3m52o20J94L00M86K28l02o96o0M72
3995b7J65K76m22m00j65M24M10J83k66o26J81MM78K58j06n23n74N19O11l7L3n40
4017a44j75L04M59J25m27m49k26M71O37l89P6m90j39K28N48Jl69k73k30O21K10
4038C69q2j81m95l89M33N36L32m05m63j21K95N48K47m52m93k32M40K48L60k77
4058B18n63k32M98L25J82k83n10N1J69J65N25j60o18j31K85J69M30o07j63j57
4078d07M74J65J60j4n76k21P5M05K43j26j63m10K97L36o5l6o40k8L05N38L0j34
4100B08m20k92K66M30J13M7o86k8J56N19j1j24l18l07K33K33L90l93k91j68J52
$$ plain form
4121 -291 84 544 184 -226 -401 -275 118 364 -88 -150 -198 -184 76 318 264 -154 -533 -240 -77 424 135
4142 135 -314 -517 -32 61 681 -19 -256 -519 -379 205 669 251 -35 -491 -400 76 517 74 -212 -291 -295 338
4164 338 434 275 53 -312 -208 166 338 426 -11 -456 -86 44 493 429 -64 -452 -449 164 335 190 -45 -720
4186 -720 -124 254 400 266 -412 -430 -96 184 454 367 -322 -520 -317 197 221 85 -157 -356 -312 -56 371
4207 371 -31 -139 -82 -307 66 300 246 -157 -472 -454 -5 383 0 -163 -300 -379 126 514 417 21 -382 -241
4229 -241 41 593 137 -4 -133 -322 240 526 228 -43 -512 -413 51 375 513 -145 -408 -73 -35 549 217
4250 217 -104 -202 -145 5 595 393 -59 -436 -181 -131 250 373 -133 -339 -185 256 412 345 -145 -108 -299 45
4272 45 332 331 -54 -429 -369 69 423 322 -142 -331 -95 93 383 483 -145 -608 -101 31 498 371 1
$$ packed form
4121b91L75M60l60m10j75J26L93K46m52o2m8J4K60K42n4m18l79K93J63N01k89
4142A35m49k03M85R3O20p00k37k63J40N84M64m18k86m56R1M76M41m43k86p9mO33
4164C38R6j59k22l65J04L74J72Q8m37m45L70J30M49o4m93l88LO13J71j45k35o75
4186g20N96L78J46j34o78j8L34K80K70q7o89j98K03N14K4j36k42j99M4K56M27
4207C71m02j08N7k25L73K34n4m03l15J8M49L88l83j63j37p9N05L88r7l96m03J41
4229b41K82N52m56j41j29j89N62K86k98k71m69R9M64L24J38o58k63L35L8N84l32
4250B17l21r8N7J50N90k02m52l77K55N0L81J23n06k06J54M41J56o7m90L7j91L44
4272D5K87jl85l75O0M38L54j01m64j89K36J88K90J00o28m63N07J32M67j27l70
$$ plain form
4293 1 -186 -227 367 215 318 -44 -345 -174 -145 480 351 -75 -227 -314 2 446 377 -49 -389 -396 247 208 347
4316 347 29 -213 -320 -99 445 497 -180 -436 -400 88 628 228 195 -323 -360 95 364 316 -21 -220 -24 35
4338 35 254 439 86 -544 -479 19 216 178 41 -513 -256 5 291 170 14 -410 -266 143 386 343 5
4359 5 -261 -536 60 520 178 -63 19 -235 -58 309 237 59 -255 -552 -309 381 355 -29 -329 -347 259 467
4381 467 132 41 -112 -354 -227 215 328 -196 -314 -134 235 340 439 -8 -162 -294 -144 326 412 -341 -417
4402 -417 -326 -113 287 255 158 -229 -397 -83 286 232 -81 -362 -171 16 216 487 -128 -135 -64 93 328 341 205
4425 205 -142 -694 -46 146 291 128 -351 -334 -322 164 329 58 -225 -394 -93 27 298 -34 -292 -436 -55
4446 -55 324 208 -231 -474 -325 263 422 637 48 -280 -269 -46 340 447 -85 -240 -251 -191 397 409 -87 -389
$$ packed form
4293Aj87m1N94j52J03l62l01J71K9O25j29m26j52q7L16M44o9m26l40pO43l9J39
4316C47l18k42j07K21N44N2o77k56L6M88N40m00l3n18l7M55K69m8l37j99J96N9
4338C5K19J85l53o30O5M98J97l8j37n54K57K61K86j21j56m24J44M09K43m3l38
4359Ek66k75N96M60l42k41Q2k54J77L67p2j78l14k97K43O90k6l84l00j8O06K08
4381D67l35r1j53k42J27M42J13n24j18J80L69J05R9m47j54j32J50M70Q6p53p6
4402d17R1K13M00l2r7l87j68L14L69n4l13k81J91J87K00K71o15pP1J57K35J3j36
4425B05l47n52O48J92J45j63m79J7J2M86J65k71k83j69L01J20K71l32k58j44L81
4446e5L79j16m39k43J49N88J59K15n89l28J1K23L86J07n32j55j1O0N88J2m96l02
$$ plain form
4468 -389 -174 101 348 382 -109 -404 -75 -386 609 472 97 -68 -397 62 283 123 321 -56 -122 149 408
4489 408 240 128 -172 -464 21 198 648 88 -261 -393 -106 282 356 40 -455 -386 -17 289 321 165 -549
4510 -549 -106 -126 327 298 149 -170 -248 -22 335 316 224 -59 -294 91 228 232 -148 -214 -319 0 61 424 223
4533 223 -152 -349 -180 349 402 45 -350 -476 163 224 286 329 -343 -514 -181 296 197 112 -233 -264 -193 279 574
4556 574 -20 -259 -317 -300 157 358 136 -141 84 -82 4 379 -13 -146 -427 17 177 136 87 -218 -454 -180
4578 -180 11 575 82 -249 -476 -202 227 302 8 -312 -370 -62 -56 233 117 -158 -324 -129 44 267 52
4599 52 -100 -147 -220 263 315 121 -155 -40 -211 276 419 334 -306 -271 -290 74 276 228 -222 -374 -288 146 214
4622 214 184 11 -444 -234 88 325 361 -427 -252 -242 223 309 220 -176 -285 -165 28 548 313 -292 -141 -171
$$ packed form
4468c89K15K75K47L4m91k95L29l11R95j37l75j65l29M59K21j60J98l77o6K71K59
4489D08j68j12l00k92M85J77M50n60l49j32K87L88P4l16m95O9L69L06L2j56p14
4510e49M43k0M53k9j49l19p8K26L57j9r2k83k35L85J37Ml80o6j05L19O1L63k01
4533B23l75j97J69N29N3l57l95j26O39O1O2M3o72j71L33M77r9q5l45l1P1M72K95
4556E74n94k39n8J7M57K01k22k77K25j66Q6L75l92j33k81M44J60m1m9l05k36K74
4578a80J91N64m93l31k27K74M29P5k94l20n8L08OK89j16k75j66J95J73K23k15
4599E2j52m7p3M83N2j94k76J15j71M87J43q5o40L5j9L64K02m8m50j52Q6M34O8
4622B14l0j73m55K10L22K37L6p88J75J0M65Q6q9l96j09J20J93N20k35o05J51l0
$$ plain form
4644 -171 121 288 -185 -41 -242 -59 -39 284 212 -191 -267 -175 -39 350 133 -43 -163 -44 222 398 246
4665 246 -152 -303 -52 56 173 164 -166 -535 -213 117 312 173 -74 -239 -9 112 239 212 -369 -366 -120 225
4687 225 141 53 33 -418 -109 -42 6 230 -172 -258 -284 -103 484 55 -142 -202 -350 240 290 350 -36 -435 -308
4710 -308 465 52 129 -18 -393 -159 7 218 303 -268 -91 -56 -9 286 353 -89 -292 -123 25 335 156 -211
4732 -211 -168 -75 271 228 238 -77 -372 -383 99 338 295 -346 -167 -334 224 144 60 -252 -309 -207 19 101 303
4755 303 -242 -342 -172 -184 333 121 -89 -305 -292 251 420 123 -134 -281 -59 78 259 126 78 -192 -395
4776 -395 13 159 272 98 -194 -166 28 340 71 6 -382 -188 125 460 425 -95 -180 -80 -37 354 157 -47
4798 -47 -131 81 45 97 95 -104 -22 -127 115 151 413 62 -468 -164 128 620 125 -132 -85 -291 -159 121 164
$$ packed form
4644a71K92J67m73J44k01J83K0L23p2m03p6R2J36L89k17j76j20J19K66J76j52
4665B46l98j51K51J08J17rl30l69L22L30J95j39k47j65K30J21J27k7n81LK46L45
4687B25q4q8k0m51L09O7M8K24m02q6k6J81N87m29j97o0j48N90N0O0l86l99J27
4710c08P73m13P7j47l75K34J66K11Q5n71J77L5M7K95O7m42k03J69J48L10j79l67
4732b11M3R3L46m3J0l15k95j1M82K39m3o41J79j67N58q0q4l12n7J02K26Q2K02
4755C03n45j00J70j2N17k12k10k16J3N43J69k97k57j47K22J37J81j33m8k70k03
4776c95M08J46J13j74k92K8J94L12k69o5l88J94L13L35l5n20q5J00M3L91j97k04
4798d7q4K12l6N2kj99Q2j05K42L6K62l51n30L04K92M92m95k57M7k06J32K80M3
$$ plain form
4821 164 -295 -209 -169 352 300 200 -119 -184 -161 16 299 399 -149 -104 -290 91 253 133 -119 -128 -259 42 68
4844 68 130 -50 -289 -293 23 132 352 -387 -252 -135 -163 97 -20 134 -232 -420 50 153 155 -40 -505 101
4866 101 -19 34 481 -182 -456 -214 39 263 314 -79 -140 -91 44 513 174 -33 -467 -289 -217 164 -153 -127
4888 -127 -16 -4 -69 286 151 -251 -265 -370 131 255 85 76 -402 -351 -164 178 294 -229 -151 -194 28 81 247
4911 247 35 121 -273 66 257 222 2 -389 -477 26 6 43 -111 -250 -372 -244 352 -13 -271 -295 -293 -84 281
4934 281 202 -60 -54 -286 264 474 162 163 -351 -52 -53 374 405 -59 -213 -318 63 177 166 10 -173 -166 198 215
4958 215 203 140 -151 -361 130 240 315 -128 -232 6 208 88 124 -169 -386 -235 -94 185 134 -312 -170 -185
4980 -185 -49 272 300 83 -402 -114 22 422 178 -29 -169 -336 -32 238 113 -38 -393 -43 -116 246 232
$$ packed form
4821A64m59Q6M0N21n2j00l19o5K3J77K83J00n48M5j86L81J62j20k52rj31L01K6
4844F8O2j80k39mL16J09K20p39J35J17k8K60j17J54l66j88M70J03Kj95m65O06
4866A01j20N3M47o63k74K42K53K24N1l93o1M9J35M69l39k07m34J78P2L81l17K6
4888a27J11J2o5L55j35m02j4j05N01J24j70rm78N1J87L42J16n23P8m3K22N3J66
4911B47k12Q6l94L39J91l5k20l91q8N03k0L7j54j39j22J28N96l65k58k4KK09L65
4934B81p9k62Ok32N50K10l12Jn14K99jM27L1m64j54j05L81J14j1j56j83PL64J7
4958B15j2o3k91k10M91J10P5m43j04K38K02j20L6k93k17J51J41K79n1m46J42j5
4980a85J36L21K8k17m85K88J36M00k44k07j40j67L04K70j25j51l55L50p3L62j4
$$ plain form
5001 232 92 -397 -488 -63 184 83 98 -249 -447 41 92 260 102 -171 -272 55 120 165 155 76 -76 163
5023 163 21 288 235 -359 -157 -21 124 215 60 -302 -331 19 281 158 -132 -155 -395 270 352 170 98 -157
5045 -157 -282 83 100 267 -98 107 -77 -37 228 233 94 -216 -281 -56 362 93 129 -192 -242 4 182 182 -112
5068 -112 -164 -178 137 57 252 3 -94 -169 -41 79 344 -22 -36 -389 215 252 346 102 -413 -38 -258 142 172
5091 172 -52 -150 -388 20 307 300 -126 81 -248 -362 133 136 108 -10 -191 92 127 310 2 -208 -218 -163 65
5114 65 322 23 -141 -259 -88 236 237 -2 -269 -138 -130 213 88 169 -17 -197 -229 31 223 -158 -10 -346
5136 -346 313 22 223 18 -169 -308 -126 121 330 147 -125 -183 -141 64 150 62 -281 -114 94 283 239 -15
5158 -15 -190 -363 -16 52 138 130 -106 -301 62 154 28 75 -413 -44 -100 108 250 113 -62 84 -260 130 185
$$ packed form
5001B32j40m89r1M25K47j01J5l47j98M88N1J68j58k73j01L27O5M5j0p9j52K39
5023A63j42K67n3n94K02J36J45R1j55l62k9L50K62j23k90k3k40O65Q2j82p2k55
5045a57j25L65J7J67l65K05j84M0K65Nj39l10o5K25M18k69L6l21n0K46J78%k94
5068a12n2j4L15q0J95k49r7p5J28J20K65l66j4l53O04L7R4k44n15L75k20M00L0
5091A72k24r8k38M08K87pm26K07l29j14M95Lk8j18j81K83L5J83l08k10j0N5K28
5114F5K57k99j64j18J71L24Jk39k67J31QL43j25Q1j86j80l2K60J92l81J48l36
5136c46O59k91K01k05j87j39J82K47K09j83k72n8M2K05Q6q8l43J67K08J89m4k54
5158a5j75j73L47O8Q6qk36j95L63R2j26M7m88L69n6K08J42j37j75J46l44L90N5
$$ plain form
5181 185 163 -61 -173 193 353 218 -133 50 -408 34 -41 219 232 -317 -257 -195 177 91 90 -172 -158 10 -20
5204 -20 189 128 -335 -464 11 -36 73 203 -54 -359 162 -27 -5 159 -255 83 -11 81 -54 -291 -112 -143
5226 -143 4 -104 154 -11 -96 -176 -95 -29 455 26 -233 -153 -141 119 149 41 -52 -270 -197 67 150 -197 -118 -27
5250 -27 82 271 138 34 -54 -67 -109 82 229 84 -3 -142 -83 -163 -16 318 -193 -240 28 200 187 -229 -178
5273 -178 54 -302 -82 31 18 -53 -22 -248 291 243 128 -272 -21 -34 -30 -174 -201 -10 49 -104 10 178 159
5296 159 -94 -427 -157 125 379 135 -137 -305 -171 -17 180 175 -123 -188 -297 51 133 -90 -27 -255 -294 238
5318 238 284 5 -128 -208 -1 -52 222 199 -157 -227 -36 -236 183 0 -44 -70 -99 311 -81 147 69 -399 -110
5341 -110 -169 142 -31 -177 69 -283 97 348 166 -89 -66 -285 158 156 -12 56 -170 -159 -58 107 170 -54
$$ packed form
5181A85k2k24j12L66J60j35l51J83m58M42p5K60J3n49O0O2L72q6jk62J4J68l0
5204b0K09o1m63j29M75m7J09J30k57l05N21j89K2J64m14L38r4R2j35k37J79l1
5226a43J47j08K58j65q5q0Q1O6M84m29k59Q0J2K60L0j08r3k18P3K64Q3l47P9R1
5250b7J09J89j33j04q8j3m2J91J47j45q7j39N9q0J47L34n11m7K68J72j3m16N1
5273a78K32l56K20J13j3p1L1k26N39m8j15m00K51j3Mj44k7J91N9j53J14J68j9
5296A59k53l33K70K82K54k44k72j68J34J54J97nk98o5j09L48Q2k23O3k28l9N32
5318B38M6k79j33q0K07n1K74k3l56p0J91k00M19j83m4k6k9M10l92K28p8m68K89
5341a10n9L11j73j46K46l52L80K51j82k55K3k19M43kj68O8k26J1J01J65O3k24
$$ plain form
5363 -54 -120 -65 139 77 -47 32 -95 -96 149 293 -3 -69 -243 -128 -82 255 -110 -46 -170 -236 -10 352 177 -178
5387 -178 -225 -179 58 234 219 -87 -549 -134 -218 94 -54 343 -31 43 -45 44 297 -104 -93 -75 29 23 104 -110
5411 -110 -34 31 -97 357 -24 -99 -124 40 -43 270 112 54 -25 -354 -86 251 50 20 12 -225 167 19 38 127
5435 127 3 -164 -38 -214 36 -209 -127 -216 251 142 149 -96 -172 -2 136 181 43 -76 -139 -170 16 204 68
5458 68 33 48 -211 118 171 345 -28 -148 107 -76 148 -4 102 -309 -97 -40 313 160 128 -40 -223 -246
5480 -246 97 44 -54 -15 -192 99 111 59 95 -121 -212 -95 142 158 -76 -26 -81 -95 238 193 -49 20 90 -8 -13 -74
5506 -74 -84 -85 -150 -48 165 320 -84 32 -157 50 121 140 -64 -200 59 -23 22 -158 107 -128 -75 35 181
5529 181 -56 105 -239 -38 -39 100 79 -91 -52 -206 150 -54 244 -141 -15 -171 -189 64 118 -342 30 -196
$$ packed form
5363e4o6N5K04o2j24P9j27jK45J44k96o6j74J15M6L37l65O4j24o6K26L62j75l55
5387a78m7M6K37J76j5l06m62M15q4L12j48L97l74P4q8Q9K53m01J1J8J04oQ1k14
5411a10P6O5j28M54l81p5k5J64q3L13j58n8p9l29K68L37k01l0qk37L92j48J9Q9
5435A27j24j67J26j76K50k45Q2q9M67j09Pk45p6J70J38M5j38j19o3l1J86J88j36
5458F8l5J5k59L29N3J74l73j20K55j83K24j52J06m11K12N7L53j53l2j68j83k3
5480b46L43n3r8L9j77K91J2n2L6k16r1J17K37J6k34N0n5j4L33m5k42O9P0r8no1
5506g4j0jo5J02K13J55m04J16j89K07P1J9k04j36K59q2M5j80K65k35N3J10J46
5529A81k37J61l44K01jJ39k1j70L9j54L56k04K98l85J26j56j8K53N4m60L72k26
$$ plain form
5551 -196 10 81 232 143 -81 -110 223 113 281 0 -235 -92 137 120 79 109 -172 -6 142 87 251 -16
5573 -16 -143 -315 -68 301 81 -13 2 -31 204 47 48 31 -140 -208 -162 69 80 119 -249 -246 42 227 93 14 -70
5598 -70 -80 -73 -102 -141 -185 -4 -213 21 146 284 -109 -171 -63 -183 271 59 18 -163 -106 33 -34 258 136 -34
5622 -34 -92 39 206 346 116 -224 137 -73 216 125 -126 -104 -325 -21 87 221 115 169 -22 -2 248 5
5644 5 -102 -272 117 -75 140 150 162 83 -16 34 98 236 112 54 -149 30 154 357 -38 -88 282 -74 27
5667 27 193 19 -251 -116 -59 176 224 148 -129 -211 33 169 229 164 18 -45 -132 291 -80 -173 -172 -54 144 125
5691 125 36 -115 -56 -162 -78 144 122 -16 -37 -21 -39 -6 172 43 65 -92 44 208 246 55 11 -186 5 225
5715 225 333 -19 -105 -110 -51 92 31 -98 54 3 -82 225 27 -60 -221 -156 245 -68 65 65 -63 -63 65 270
$$ packed form
5551a96K06P1J51q9k24k9L33j10J68k81k35J43K29j7m1L0k81J66J48n5J64k67
5573a6j27j72K47L69k20r4J5l3K35j57Jj7j71o8M6K31J1L9l68LK88J85j34p9q4
5598g0j0Pk9l9m4J81k09K34J25J38l93o2J08j20M54k12m1j81N7J39o7K92j22j70
5622c4n8J31J67J40k30l40L61k10K89r1k51K2k21L04J08J34j06N4j91K0K50k43
5644Ej07j70L89j92K15J0J2p9r9N0O4J38j24n8k03J79J24K03l95n0L70l56J01
5667B7J66j74k70J35N7K35M8p6k77q2K44J36O0o5j46o3q7M23l71r3JJ18J98j9
5691A25q9j51N9j06Q4K22k2j38k1J6j8L3J78j29K2j57J36J64L8j91m4j97J91K20
5715B25J08l52q6nN9J43o1j29J52n1q5L07j98q7j61O5M01l13J33%j28%J28K05
$$ plain form
5739 270 65 13 -322 40 -200 137 313 95 -63 -102 -225 73 20 25 -121 -214 -21 -9 61 -147 89 -56 66
5762 66 224 121 45 -35 -366 53 -17 -30 47 -99 -251 14 21 217 -23 37 123 -260 -238 33 -48 -95 -93 -68 180
5787 180 116 109 75 89 125 -89 -7 176 -27 -68 114 199 132 34 -140 -16 -35 125 -11 121 -333 56 175 155
5811 155 176 128 -45 -57 45 19 -262 -75 -137 -108 -62 43 56 -91 -56 -125 168 -138 5 -89 154 -157 4 -81
5835 -81 33 96 -63 -86 5 53 10 -121 -16 -290 -63 96 28 -136 248 -216 126 -51 173 33 -175 -50
5857 -50 214 -44 28 136 117 -116 -67 -3 164 139 -239 103 -98 -50 -32 -80 92 -7 187 66 166 24 119 215
5881 215 35 192 55 134 -74 -7 -113 191 18 -27 -60 -192 23 110 122 -52 -90 -77 -55 0 -1 -14 23 -168 91
5906 91 48 445 157 -192 -91 -26 -285 160 -79 -58 175 -124 106 10 54 188 -178 109 226 101 9 -96
$$ packed form
5739B70k05n2l35L62k40L37J76k18j58l9j23K98n3Nj46r3J93J2P0k08K36j45J22
5762F6J58j03p6q0l31M19p0j3P7j46j52K65PJ96k40O0Q6l83K2K71q1m7KK5K48
5787A80o4pl4J4L6k14Q2J83k03m1J82Q5o7r8j74J24j9J60j36J32m54L89J19k0
5811A55K1m8j73j2J02k6k81J87o2K9M6J05J3j47L5o9K93l06J43r4K43l11J61q5
5835h1J14O3j59k3R1M8m3j31J05k74K27J59o8j64L84m64L42j77K24j40k08J25
5857e0K64k58P2J08j9k33M9O4J67k5l78L42k01M8J8m8J72r9J94j21J00j42R5R6
5881B15j80J57j37P9k08O7j06L04j73m5l3j32K15Q7J2j74l8J3K2N5jj3L7j91K59
5906I1m3L97k88l49J01O5k59M45k39K1K33k99K30r6M4J34l66K87J17j25r2j05
$$ plain form
5928 -96 40 -31 -71 -115 64 -166 -229 -93 -52 189 273 -112 -63 -172 278 -48 49 -221 -80 22 51 40 -52 -42
5952 -42 -210 -118 -231 -90 4 181 132 -149 -161 119 -105 -170 -183 118 267 234 76 -38 -214 -283 0 -104 184
5975 184 140 -35 180 -3 36 -96 -68 -34 -280 -149 -94 155 -42 -128 -132 -122 163 185 -250 148 -7 78 128 190
5999 190 3 -216 -39 -172 -103 226 -44 63 -99 150 151 -12 122 -240 27 -103 -9 133 19 159 122 -40
6021 -40 -68 274 -62 -66 -222 28 151 -3 94 82 45 233 -25 197 -40 -298 -235 -54 -63 125 197 -58 -154 168
6045 168 -97 213 -178 -38 -165 -62 228 154 -164 41 -137 170 113 127 24 -76 -104 -171 338 214 104 149
6067 149 163 110 43 231 46 -42 -141 -161 -40 161 28 75 215 -343 408 -276 -152 -87 -30 97 230 -83 -57
6090 -57 -114 -52 69 209 153 26 -12 -106 70 114 1 -106 -32 45 -140 -10 130 -174 -173 54 -73 80 43 8
$$ packed form
5928i6J36p1m0m4J79k30o3J36M1K41Q4l85M9j09M50l26R7k70J41J02K9j1r2J0
5952d2j68R2j13J41R4J77m9k81j2K80k24o5j3L01J49l3j58j14j76o9K83j04K88
5975A84m4j75K15j83L9j32K8L4k46J31N5K49j97q6mJ0K85K2m35L98j55Q5N0O2
5999A90j87k19J77j33O9L29k70J07j62K49Jj63J34l62K67j30R4J42j14J40l7j62
6021d0k8L42l36mj56K50J23j54R7j2l7J88k58K22k37k58O3J81rJ88P2k55r6L22
6045A68k65L10l91J40j27J03K90p4l18K05j78L07n7J4j03j00k8o7N09j24j10M5
6067A49J4n3o7J88j85q8r9k0J21K01j33M7J40n58P51o84J24O5N7J27J33l13K6
6090e7n7O2J21J40n6j27l8r4J76M4j13j07P4P7j85J30J40l04JK27j27J53l7l5
$$ plain form
6114 8 3 -160 -49 -75 -196 6 -153 -36 61 -99 -64 -29 -137 -176 452 20 27 13 85 -25 100 104 -86 209 -172
6139 -172 16 132 94 31 -216 -82 -107 -151 151 140 49 44 -72 -9 -40 261 258 -22 3 143 114 162 -125 -63 -98 -167
6165 -167 306 136 84 85 -138 -143 -207 186 85 -47 43 155 -106 -41 68 -57 -68 12 170 91 27 -52 43 81 172
6190 172 -79 -70 34 71 227 -40 157 135 68 -148 377 -35 63 -225 -159 -373 -126 163 -55 -65 -57 70 77 201
6214 201 150 -41 19 90 -48 -115 -50 -136 0 -125 26 80 -200 156 -147 -91 295 18 -71 -2 7 1 -20 69 31 -73
6240 -73 -164 160 -192 166 34 217 -206 -30 -112 -200 -224 -162 -107 -152 121 252 -195 11 234 -30 111 -60 9
6263 9 -153 -125 -12 -55 -106 -26 2 -402 -148 94 -164 43 129 -257 -65 31 57 121 163 55 -216 -105 -33 190
6287 190 138 -14 200 123 108 2 35 -85 225 111 -32 327 15 181 -222 -51 228 -64 -9 -79 77 30
$$ packed form
6114Hnj63J11k6j21K02j59J17R7j60L5L5j08l9O28m32Pj4P2j10J25Mj90K95l81
6139a72J88J16l8o3k47J34k5m4L02j1r1nj16O3l1L01lk80K5J40k9M8k87O2l5o9
6165a67M73j70n2Jk23no4L93j01j32R0J12k61O5J09j25j1Q0J58p9o4p9R5L8R1
6190A72k51RJ04L7J56k67J97k2o7k16N25m12R8k88O6k14K47K89k18j0QJ27PJ24
6214B01n1j91O0P1j38o7O5q6J36j25J51N4k80L56l03N6L86k77q9O9Rok1Q9l8j04
6240g3r1L24l52L58j32J83m23J76q2q8k4O2N5m5K73J31m47K06K23k64J41j71O9
6263Ij62K8J13m3n1Q0K8m04K54K42k58K07Q6l86J92R6K6O4M2j08k71J11P2K23
6287A90n2j52K14p7j5j06L3j20L10j14j43L59l12J66m03J71K79k92N5p0J56m7
$$ plain form
6309 30 176 301 -159 -215 -53 -87 -211 -68 -163 -132 -54 190 -137 129 -357 -54 99 99 40 197 227 -289 -8
6332 -8 185 -129 -84 147 37 10 -143 2 80 32 -154 -89 96 -19 22 128 34 -30 43 251 2 142 -219 45
6356 45 47 113 -355 53 -401 110 170 90 -215 120 -202 18 7 67 130 -107 -58 -91 130 65 267 -13 -105 23
6380 23 -52 -227 99 -145 99 95 -25 6 131 44 -21 14 -20 36 170 -109 70 -33 21 -93 -177 -7 -103 -61 102
6405 102 216 2 161 -150 45 -304 -8 255 211 -91 -12 36 -112 31 12 139 42 -82 56 -29 135 118
6427 118 -271 43 303 4 140 -53 -160 -32 -10 183 -137 39 -28 108 5 31 122 -95 -76 107 -50 64
6449 64 -125 -69 -145 -94 198 -108 -197 -45 -220 -223 168 -127 226 -110 -115 -7 -98 -95 -142 23 -39 -51 2 86 126 -216
6475 -216 -188 91 64 179 79 -17 -256 16 112 -80 15 41 116 -56 -208 189 36 -274 -58 31 -252 51 12
$$ packed form
6309C0J46J25m60n6J62l4j24J43r5L1P8K44l27K66m86L03J53%n9J57L0n16K81
6332hJ93l14M5K31j10k7j53J45P8m8j86O5J85j15M1J06r4o4P3K08k49J40l61K64
6356D5KO6m68M08m54N11O0q0l05L35l22K20j1O0O3k37M9l3K21o5K02k80r2J28
6380B3p5j75L26k44K44mj20L1J25q7o5L5l4N6J34k79J79j03N4j14q4J70r6M2J63
6405A02J14k14J59l11J95l49K96K63m4l02P9M8j48J43j9J27r7j24J38q5J64j7
6427A18l89L14K60k99J36j93j07J28K2J93l20J76o7J36j03K6R1k17J9J83j57J14
6449F4j89N6p6N1K92l06q9J52j75lL91k95L53l36nJ08r1Lm7J65o2j2N3Q4M0l42
6475b16K8K79k7J15j00r6k39K72R6j92R5K6P5j72j52L97j53l10K16Q9k83L03l9
$$ plain form
6498 12 189 -45 18 81 -23 -99 -73 -133 -209 -133 309 -104 -303 -42 41 119 -74 -38 -174 103 108 -49 56 106 -225
6523 -225 -286 -33 -50 91 153 52 -101 -8 -6 -105 11 77 -45 -185 -144 -17 242 -47 212 212 30 173 149 -39
6547 -39 127 -15 157 -83 -8 69 -266 -85 107 -39 88 -19 126 250 -39 -74 -39 343 209 91 182 206
6569 206 74 -135 8 234 32 186 -54 -132 33 -185 105 -27 119 -145 274 52 218 134 80 112 -148
6590 -148 -102 133 -75 -27 -66 13 33 -90 112 16 73 162 94 48 83 -165 402 -271 128 237 57 125 69 77 50
6615 50 92 -95 -101 112 34 -71 -187 -84 -7 127 -138 -64 120 35 -89 -75 219 -98 118 115 -78 27 -178 -138
6639 -138 -15 -118 277 -6 46 95 -6 73 58 -87 241 154 -13 -109 -149 22 -92 107 -72 -30 -122 50 -137
6662 -137 -194 -62 69 103 -143 62 189 44 166 30 22 26 -49 -39 -28 314 -6 100 39 -57 212 13 3 22
$$ packed form
6498A2J77k34O3O3j04p6K6o0p6P6M42m13j99K61Q3P8j93L6j36K77Nj57J05N0l31
6523b25o1K53j7J41O2j01j53R3Kr9J16O6j22j40M1J27K59k89K59%j82J43k4j88
6547c9J66j42J72k40P5P7l35J81J92j46J27j07J45J24k89l5L5L82j34j18R1K4
6569B06j32k09J43K26k02J54k40p8J65k18K90j32J46k64M19k22J66q4n4L2k60
6590a48M6K35k08M8l9P9K0j23K02r6N7Q9o8m6L5k48N67o73L99J09j80O8n6Qk7
6615E0M2j87oK13p8j05j16J03P7J34k65P4J84q5j24J4K94l17K16lj93J05k05M0
6639a38J23j03L95k83N2M9j01P9j5j45L28q7j67r6m0J71j14J99j79M2r2J72j87
6662a37n7J32J31L4k46K05J27j45J22j36qMp5J0J1L42l20J06o1r6K69j99j0J9
$$ plain form
6686 22 54 -88 417 69 -21 -114 -126 101 93 87 -46 141 -88 12 135 -195 0 -155 -140 -33 262 -13 -42 -151
6710 -151 -65 82 -63 76 88 213 -22 106 -130 -44 8 -241 65 194 -91 101 -48 52 88 35 118 -84
6732 -84 -94 -133 69 -3 258 -136 -67 -170 126 24 -59 21 -57 -227 -176 212 10 42 206 -91 42 -77 -13 14
6756 14 -129 15 182 -217 -224 248 -61 -278 -163 -12 92 -88 6 -197 57 240 107 16 -105 174 -19 23
6778 23 32 150 -99 -24 -27 34 143 -193 27 -33 -69 50 252 -11 19 -17 -16 -83 -35 95 -67 200 125 208 -146 -21
6804 -21 177 -222 -25 67 120 -68 -104 -304 17 -28 40 -10 239 -115 -15 25 62 202 127 91 -120 217 -29 102
6828 102 63 48 -198 -66 -130 -151 -184 -30 -215 98 -185 27 47 -98 -238 -6 159 -137 42 39 -129 -359 87
6851 87 24 -313 -62 147 -59 -58 121 -87 -186 -117 0 -31 -72 -3 16 45 150 99 192 135 132 -147 23 272 -95
$$ packed form
6686B2L2j42N05l48r0r3j2K27qoj33J87k29J00J23l30J95j55J5J07K95k75k9j09
6710a51Q6J47j45J39J2J25k35J28k36Q6N2k49L06J29k85J92j49J00L6n3Q3k02
6732h4j0l9K02p2K61l94O9j03K96j02q3Q0p8j70N1L88k02L2J64k97J33j19O4K7
6756A4j43J44J67l99pM72l09k17J15J51J04j80R4k03K54J83j33r1j21K79j93M2
6778B3RJ18k49P5lO1J09l36K20o0l6J19K02k63L0l6Jo7M8J30j62K67p5Q3l54J25
6804b1J98l99J97R2N3j88l6k00L21m5O8n0K49l54J00M0L7J40p5l6k11L37k46J31
6828A02l9j5k46J32o4k1l3J54j85L13k83K12K0j45j40K32J65k96J79lj68k30M46
6851H7o3l37K51K09k06JJ79k08r9O9J17l1m1O9J9K9J05n1R3n7lk79J70K49l67
$$ plain form
6876 -95 2 -275 -45 154 91 73 -98 -14 109 -226 116 -179 20 18 -293 178 188 -52 -25 -48 -331 220 -17
6899 -17 -154 -58 139 -166 -36 301 -16 -8 -180 28 -158 113 32 -68 -27 74 -10 281 -112 62 -114 246
6921 246 -15 36 253 104 37 -230 52 -39 82 190 14 -366 -35 201 -32 -100 -144 3 -64 -266 -205 -166 -96
6944 -96 -349 -51 -18 -2 67 51 -131 -12 117 -38 121 -41 -247 -12 -87 9 -69 78 -36 -27 -8 7 -13 125
6968 125 -170 197 -166 161 100 49 -99 -17 -46 -301 23 -29 -377 -117 26 -35 232 -116 -46 57 17 -12 227
6991 227 -13 111 -68 -207 -71 161 52 -19 -50 -114 91 -59 59 80 126 29 -40 -51 -291 62 -133 160 39
7014 39 291 -2 13 -3 0 -40 115 101 -68 200 -171 -96 18 -96 70 145 61 194 109 133 106 -124 -197 -104 -157
7039 -157 113 123 -136 6 182 -99 58 -79 233 -28 44 154 -11 -102 -23 73 128 95 -254 -18 173 56
$$ packed form
6876i5R7k77K30J99o3j8j71Q4J23l35L42k95J99kl11M71J0k40K7k3k83N51k37
6899a7j37R6J97l05J30L37l17Qj72K08j86K71q1j00M1J01q4K91l93J74j76L60
6921B46k61N1K17j49o7k67K82r1J21J08j76l80L31K36k33o8m4J47o7k02O1L9P0
6944i6k53K98L3J6O9j6j82J19J29j55J59j62k06K35p5R6p8J47j14RJ9J5k0J38
6968A25k95L67l63L27o1n1j48Q2k9k55L24n2l48K60J43o1K67l48P0J03m0k9K39
6991B27k40J24j79j39J36K32j09p1l1o4K05j50J18K1M6r7o9j1k40L53j95K93j21
7014C9K52k93J5j6Lm0J55j4j69K68l71P5J14j14J66P5q4J33q5K4k7k30p3R3n3
7039a57K70J0k59J42J76k81J57j37L12k61P2J10j65r1P9R6N5l3l49K36J91j17
$$ plain form
7061 56 1 148 -93 -12 29 134 84 -121 -134 -239 21 -66 19 -92 132 -262 49 -31 28 -83 -145 -38 -81 178
7085 178 -90 -197 172 -200 -43 104 90 92 -195 -132 -75 -21 80 28 -156 -107 119 -66 -166 56 24 -30 -169
7108 -169 -27 303 98 54 -124 -221 219 72 115 64 -52 -139 -11 -23 51 -422 -78 7 46 133 126 122 0 -233 41
7133 41 -12 6 -23 -162 -81 -226 193 132 -61 -6 77 16 209 -111 57 -64 127 166 124 -79 -51 -2 -33 58 -117
7158 -117 9 200 -1 -62 27 -88 -126 -52 -30 -39 82 -155 -349 68 27 -58 -80 101 -11 -158 -21 -105 46 137
7182 137 124 10 -77 -320 35 131 -7 175 -55 81 118 124 -119 -276 98 54 -103 -246 -21 -166 121 287
7204 287 77 242 -137 -54 275 -19 -206 198 -164 -52 29 -130 -295 -172 24 -87 -138 -210 167 64 11 57
7226 57 -189 -18 295 -265 -81 47 -91 102 62 1 212 47 154 -243 273 161 102 187 74 24 -1 159
$$ packed form
7061E6n5J47k41Q1M1J05n0k05j3j05K60q7Q5j11K24l94L11q0N9j11o2J07m3K59
7085A78k68j07L69l72J57J47j4Kk87O3N7N4J01n2j84M9K26j85j00K22l2n4j39
7108a69J42L30k05m4j78r7M40j47M3n1j16q7J28j2P4m73L44Q5L9Q7pmj22k33K74
7133D1n3J8k9j39Q1j45M19o1j93N5Q3o1J93l20J68j21J91L9m2k03K8M9l1R1j75
7158a17J26J91k01o1Q9j15l8P4K2rJ21k37j94M17m1q5k2J81j12j47J37q4J51R1
7182A37j3j14q7k43L55R6j38J82k30J36L7Ok43j57L74m4j57j43K25j45K87J66
7204B87k10J65l79Q3L29k94j87M04l62J12Q1j59j65J23J96j11n1p2L77j03n3M6
7226E7k46J71L13n60J84J28j38J93m0o1K11j65J07l97N16j12n9Q5j13n0k5J60
$$ plain form
7248 159 190 229 69 -293 31 -45 260 -103 -71 35 27 175 146 14 -145 185 -113 -14 58 -71 -120 -221 85
7271 85 -138 -4 23 -116 128 248 -81 266 -27 -7 19 33 -17 228 16 -59 104 -29 230 -77 -48 -229 29
7294 29 -9 250 -5 -20 -197 61 383 -47 52 -376 146 1 147 -34 -144 134 -135 2 162 315 137
7315 137 183 -242 33 87 156 -238 -86 -90 174 -105 123 -141 -237 -58 -118 169 129 3 -20 238 -49 63 -13
7338 -13 -15 -89 63 -31 15 -68 -28 -102 81 76 -207 -132 -113 11 -101 8 -31 114 252 27 157 -121 37 114 88
7363 88 -29 -27 -108 205 39 147 -16 -31 24 -52 57 120 34 -155 96 -167 188 -165 -110 -28 -12 -81 -88 53 -145
7388 -145 52 -46 -254 -24 -124 -297 -11 -213 47 -214 14 17 -157 22 106 196 -278 27 211 96 4 -16
7410 -16 105 -86 -312 -347 -167 51 166 -56 -188 17 -119 106 30 -92 6 -31 -48 132 -100 -1 158 -201
$$ packed form
7248A59L1L9j60l62L24p6L05l63L2J06qJ48k9j32j59L30k98R9P2j29m9j01L06
7271H5k23J34K7j39K44J20l29L47k93K0K6J4n0K45k12p5J63j33K59l07K9j81K58
7294B9l8K59k55j5j77K58L22m30R9m28N22j45J46j81j10K78k69J37J60J53j78
7315A37M6m25K75N4O9l94J52mK64k79K28k64r6J79o0K87m0j26k3K58k87J12p6
7338a3kp4J52r4M6q3M0p4J83nk83P5J9J24j12J09l9J45J38k25J30k78J58P7k6
7363H8j17Kq1L13j66J08j63j5N5p6J09O3q6j89K51k63L55l53N5Q2J6o9pJ41j98
7388a45J97r8k08K30j00j73K86k02K60k61K28Lj74J79Q4R0m74L05J84j15r2k0
7410a6J21j91k26l5J80K18J15k22j32K05j36K25p6j22R8l7j7J80k32R9J59l59
$$ plain form
7432 -201 -127 296 -124 -140 45 19 -91 4 -62 15 96 77 45 146 10 -128 -193 41 -243 24 2 174 -184 -6
7456 -6 257 -180 125 71 -155 68 503 159 176 -37 -62 -148 -87 -60 -50 266 -196 -292 -25 -20 71 27 -6 97 130
7481 130 -150 -208 115 104 45 -93 78 168 34 37 76 -207 137 70 -29 213 -224 294 9 -37 10 93 -117 140
7505 140 -152 -103 163 -242 -148 -187 148 70 108 87 -146 -110 -49 -28 9 80 9 141 277 79 6 -118 -179 -33 -127
7530 -127 114 35 154 63 -26 195 -19 -33 97 -345 102 208 40 120 -70 -100 -282 -125 -64 26 -13 -272 77
7553 77 152 40 135 -120 91 1 25 71 52 -87 90 2 -41 -149 28 -94 93 77 191 -91 -254 -43 -99 120
7577 120 241 83 38 352 32 -98 96 177 -128 118 47 -116 40 -162 165 0 -216 -45 113 61 62 -16
7599 -16 160 121 -142 -60 -49 104 -60 101 136 -10 77 -81 -89 239 -266 50 144 254 72 -338 -20 295 111
$$ packed form
7432b01P4M23m20j6J85k6j10R5o6P7Q1j9l2J01j36j38o5K34k84K67k2J72l58J78
7456fK63m37L05n4k26K23M35l44J7k13k5q6O1K7J0L16m62r6K67NR1m4l3J03L3
7481A30k80n8L23j1n9j38J71R0j34LL9k83L44o7r9K42m37N18k85m6M7Q3k10K57
7505A40k92M9K66m05R4l9L35p8L8k1k33L6O1K1L7P1p1J32J36j98p3j24o1J46r4
7530a27K41p9J19r1q9K21k14j4J30m42M47J06j68Q0j90l0j82J57O1R0l9k59L49
7553G7P5j12R5k55K11r0K4M6j9j39J77q8m3j08J77j22J87j6J14k82j63K11n6K19
7577A20J21j58m5L14l20j30J94Q1l05K46p1j63J56k02L27j65k16J71J58n2Jp8
7599a6J76l9k63Q2J1J53j64J61L5j46Q7j58qL28n05L16R4J10j82m10L18L15j84
$$ plain form
7622 111 -45 5 375 245 65 -157 -14 99 174 124 -250 -30 -43 -204 -167 146 149 10 33 -68 27 -101 0
7645 0 30 -114 -41 73 13 92 -92 -96 101 101 -130 75 126 -38 -46 67 -230 -93 284 50 8 -237 52 -51 120
7670 120 -210 241 -23 141 115 130 12 -63 -140 -34 46 -177 -18 33 51 -162 198 -122 52 -187 -42 148
7692 148 53 -215 46 144 5 41 -82 -199 -254 -84 -66 -163 -130 59 -108 -209 -134 178 -75 108 -20 -30 100
7715 100 -84 97 -105 -16 -80 -135 334 157 114 8 -46 24 -121 138 63 -198 43 100 195 80 -2 204 -264
7738 -264 24 166 -156 -110 62 22 -5 169 132 -5 46 -101 251 22 15 42 116 -113 -10 140 79 10 11 -89
7762 -89 -122 104 -135 -46 -82 57 -56 123 33 -216 50 -20 -173 168 36 198 -61 15 120 9 -23 13 30
7785 30 -1 34 216 229 55 -58 -87 75 125 -77 27 32 263 -141 155 -53 15 -274 -110 -111 -199 166 -77 -44
$$ packed form
7622A11j56N0L70j30j80k22J43J13P5n0l74K20j3j61L7L13Lj39K3j01R5j28J01
7645@L0j44P3J14o0P9j84mJ97%k31K05N1j64qJ13k97J37L77k34m2k45K89j03J71
7670A20l30M51k64J64k6J5j18p5p7J06Q0k23J59N1J8k13L60l20J74k39J45J90
7692A48r5k68K61R8j39L6j23j17n5J70J8r7L3J89j67j01P5L12k53J83j28j0J30
7715A00j84J81k02Q9o4n5M69j77m3j06n4P0j45K59p5k61K41N7R5j15q2K06m68
7738b64K88J42l22M6J72m0k7J74l7j37N1j47L52k29pK7P4k29J03J50o1o9Jj00
7762h9l3K26k39Q9l6J39j13J79r0k49K66p0j53L41j32J62k59P6J05j11l2L6J7
7785C0l1L5J82J3j74j13k9J62N0k02J04NK31m04K96k08O8k89J64jq8L65k43L3
$$ plain form
7809 -44 -18 -37 -81 -73 -12 -172 126 -193 15 -9 107 -44 -95 -124 -87 149 -66 -201 57 -161 -134 -153 -132 33 -46
7834 -46 26 302 198 172 -35 -113 -79 -106 86 -120 -46 -83 -185 8 119 -18 -73 19 -165 -154 -162 -110 -29 33 -222
7859 -222 -203 9 33 -27 -195 132 -246 231 68 -165 -12 -58 72 236 -256 -63 -83 -230 -217 -31 38 -108
7881 -108 110 -119 80 -301 2 -21 -61 182 -89 -80 117 25 73 -60 -179 -212 162 -95 70 -81 96 -301
7903 -301 -11 -61 169 87 53 -103 -90 150 21 94 9 85 75 -32 91 -204 228 117 -43 -21 16 -116 -176 52
7927 52 1 62 -125 -133 -118 71 24 -96 131 -38 -149 151 -15 81 -57 123 6 -153 -151 124 -64 -163 -101 -94 95
7952 95 -75 -44 87 7 -94 159 -113 194 -98 -57 6 109 26 -26 -163 -14 85 138 -42 -34 42 -136 -41 -62 19
7977 19 -135 -140 70 -273 58 -19 -278 204 57 -85 -171 -10 -25 -37 -167 54 252 142 -229 53 197 158 46
$$ packed form
7809d4K6j9m4QO1j60K98l19K08k4J16j51n1k9L7K36k15j35K58k18K7j9K1J65p9
7834d6P2K76j04k6k07p8L4k7J92k06P4l7j02J93J11j37n5R2j84J1qN2Q1O2k55
7859b22J9K12K4o0j68L27l78M77j63k33J53m6J30J64m92J93k0j47J3J86O9j46
7881a08K18k29J99l81L03k3m0K43k71RJ97r2M8j33j19l3L74k57J65j51J77l97
7903c01K90n0K30q2l4j56J3K40j29P3q5P6j0j07J23k95M32j11j60K2L7j32o0K28
7927E2n1O1j87qJ5J89m7j20K27j69j11L00j66R6j38J80j17j59KK75j88r9O2PJ89
7952I5j70L1J31q0j01K53k72L07k92M1O3J03q3n2j37J49R9N3j80QP6j78R5k1Q1
7977A9j54nK10l43L31p7k59M82j47j42q6J61j5j2j30K21J98j10l71K82J44l9j12
$$ plain form
8000 46 68 111 -96 -629 -2 249 171 -46 29 95 103 -46 -33 13 -107 216 -6 -72 175 139 78 -60 47 -220
8024 -220 -14 100 41 140 -6 77 -140 210 40 -284 29 115 -26 -56 148 -41 3 179 -78 -114 10 134
8046 134 250 -70 -6 -175 2 -36 236 61 194 10 -138 -67 309 73 -154 152 4 110 108 33 -37 118
8068 118 -118 -183 262 -203 11 -67 -350 -121 -48 -87 124 -100 -218 64 -5 112 -63 39 208 140 -48 101
8090 101 82 107 126 -136 137 1 -105 100 247 255 6 114 -143 136 85 172 74 137 -199 111 -158 -205 123
8113 123 -49 69 -79 -233 -118 267 60 83 -90 -116 73 153 -195 19 -113 202 -140 225 20 -40 34 -93
8135 -93 -4 -237 127 91 27 -51 -20 5 -205 118 -111 -71 -84 234 21 11 -160 -376 -45 100 31 -109 -45 -114
8159 -114 57 -4 -58 249 -74 -21 -6 61 -98 196 78 74 68 0 87 83 91 -254 148 140 8 -290 78 -248 16 -1
$$ packed form
8000D6K2M3k07n33O27K51p8k17P5O6Qj49J3M6j20L23k22o6K47l6o1j38J07k67
8024b20K06J14n9R9j46Q3k17L50j70l24L13Q6j41l0K04j89M4J76k57l6J24J24
8046A34J16l20O4j69J77l8K72j75J33j84j48P1L76k36k27L06j48J06kp5p0J55
8068A18k36o5M45m65K14p8k83K29P3l9K11k24j18K82o9J17j75J02J69o8j88J49
8090A01j9K5J9k62K73j36j06K05J47Qk49J08k57K79n1Q7r8O3l36L10k69m7L28
8113A23j72J18j48j54J15L85k07K3j73k6J89Q0l48K14j32L15l42L65k05o0P4j27
8135i3Q9k33L64l6o4p8L1K5k10L23k29M0j3L18k13j0j71k16L31J45o9j40O4o9
8159a14J71o1n4L07l23N3J5O7j59K94j18moo8Q7mQl45M02qj32k98L68l26K64j7
$$ plain form
8185 -1 199 -113 -180 207 43 134
$$ packed form
8185aK00l12o7L87j64R1
8191A34
$$ Imaginary data points
##PAGE= N=2
##DATA TABLE= (X++(I..I)), XYDATA
$$ plain form
0 0 0 0 0 0 0 0 0 0 0 0 0 0 0 8 -8 8 -8 8 -16 16 -16 24 -25 32 -40 43 -49 58 -67 79 -89 101 -114 130 -146
35 -146 165 -186 207 -231 258 -287 319 -353 392 -432 480 -528 582 -643 707 -778 858 -945
53 -945 1043 -1154 1277 -1418 1581 -1770 1995 -2265 2597 -3017 3569 -4327 5441 -7236 10609
68 10609 -19176 90133 144296 -22447 -81113 -119494 23387 116435 102551 25564 -113192
79 -113192 -103178 15625 81958 133144 5002 -119624 -87366 -6884 109586 104634 -8081
90 -8081 -72776 -112426 -1377 116036 83777 18189 -88526 -105477 12034 85288 102711 4144
102 4144 -98015 -72194 -20579 76446 107867 -2237 -80726 -101114 -21003 91832 82005 12534
114 12534 -87884 -106174 2765 65787 82006 24659 -85937 -92995 -22747 77286 102603
$$ packed form
0@%%%%%%%%%%%%%Qj6J6j6J6k4L2l2M0m9N7p2Q3r2J07j25J46j68J90k15K44k76
35a46L11l51L93m38M89n45O06o72P45q24R12j008J110j225J350j485J636j803
53i45J988k197K431k695K999l351L765m260M862n614O586p896R768j2677J7845
68A0609k9785J09309N4163j66743n8666l8381J42881R3048j3884p6987j38756
79a13192J0014J18803O6333N1186j28142j24626L2258Q0482J16470m952j12715
90h081o4695l9650J11049J17413l2259o5588j06715j6951J17511P3254J7423r8567
102D144j02159K5821N1615R7025L1421j10104p8489k0388Q0111J12835r827o9471
114A2534j00418j8290J08939O3022J6219n7347j10596p058P0248J00033K5317
$$ plain form
125 102603 2032 -73086 -90872 -24076 87151 83337 11550 -69355 -96671 -12832 68002 89415
137 89415 19847 -88536 -83417 -12036 63772 91708 8824 -70907 -83075 -18378 78309 80667
149 80667 17395 -61320 -92308 -5948 74690 79093 18577 -70558 -74546 -12021 59450 86975
161 86975 11210 -63197 -74167 -25690 67378 81026 12436 -59161 -82217 -10813 59566 69473
173 69473 25951 -61259 -77829 -13736 52162 80177 17201 -59406 -70180 -23621 58118 73612
185 73612 13130 -48168 -77724 -22830 56978 68712 21822 -56393 -75936 -15752 46955 73230
197 73230 19439 -58186 -67750 -22933 48852 72558 16613 -47866 -73116 -23378 53975 67278
209 67278 21912 -48219 -72606 -17096 46670 67833 23827 -48914 -66707 -23664 44688 71533
$$ packed form
125A02603j00571p5118j7786O6796J11227l814p1787q0905k7316Q3839Q0834K1413
137H9415o9568j08383N119P1381P5808K7936q2884p9731j2168O4697R6687K358
149H0667o3272p8715l0988Q6360Q0638M403o0516q9135l988O2525P1471K7525
161H6975p5765p4407j0970M8477R3068J3648o8590p1597k3056P1404P0379R907
173F9473m3522q7210j6570O4093O5898K8015o2976p6607j0774M6559Q1739J5494
185G3612o0482o1298k9556N4894P9808J1734m6890p8215j9543O0184O2707K6275
197G3230n3791p7625r564M4817P1785K3706n5945o4479k5250M9738P7353J3303
209F7278m5366p0131k4387N5510O3766K1163m4006p2741j7793M3043O8352K6845
$$ plain form
221 71533 18790 -46275 -66372 -24001 45971 64722 22287 -41784 -68048 -20976 43937 65871
233 65871 24760 -44099 -63771 -20739 42013 66541 22678 -41312 -63569 -24059 42900 64400
245 64400 21831 -40139 -64761 -23007 40830 63626 24534 -40412 -62889 -22254 39441 63877
257 63877 24336 -37661 -61126 -24759 38052 62901 24472 -36945 -61898 -23942 36828 60006
269 60006 24922 -34493 -59708 -24797 35020 60829 25573 -34207 -58435 -24308 34362 58885
281 58885 25081 -32535 -58390 -25600 32955 57607 25229 -32527 -57681 -25608 31287 57442
293 57442 26445 -31128 -57409 -25912 31370 56984 25956 -30096 -56538 -27296 29164 55643
305 55643 26608 -29950 -56984 -27718 27909 54453 26294 -28398 -55139 -27698 26493 54355
$$ packed form
221G1533n2743o5065k0097M2371O9972J8751m2435o4071k6264M7072O4913K1934
233F5871m1111o8859j9672M3032O2752K4528m3863o3990k2257L9510O6959K1500
245F4400m2569o1970k4622M1754O3837K2796l9092o4946k2477M0635O1695K4436
257F3877l9541o1997k3465L6367O2811K4849l8429o1417k4953L7956O0770K3178
269F0006l5084n9415k5215L4911N9817K5809l5256n9780k4228L4127N8670K4523
281E8885l3804n7616k5855L2790N8555K4652l2378n7756k5154L2073N6895K6155
293E7442l0997n7573k6281L1497N7282K5614l1028n6052k6442K9242N6460K6479
305E5643k9035n6558k7034K9266N5627K6544k8159n4692k6741K7441N4191K7862
$$ plain form
317 54355 26778 -27193 -54016 -27373 25962 52254 26519 -25711 -53774 -27864 24693 51604
329 51604 26817 -25938 -52469 -27254 23716 51659 27599 -24120 -51022 -27991 24317 51493
341 51493 26979 -22694 -50954 -27513 23209 49944 28520 -22732 -50792 -27735 21589 50802
353 50802 27896 -22330 -47973 -27976 21172 50109 27891 -19883 -48808 -27655 21806 47357
365 47357 28874 -19516 -48121 -26130 19350 47337 28025 -20019 -45144 -27727 18532 47349
377 47349 26200 -17588 -45054 -28227 19677 45012 27247 -17536 -45960 -25942 15853 43559
389 43559 29124 -18583 -44652 -27828 15653 45489 26612 -16092 -42991 -28779 17154 42144
401 42144 27496 -12778 -44657 -28602 15145 42402 28902 -16393 -42470 -28325 11569 43590
$$ packed form
317E4355k7577n3971k6823K6643N3335K6292k5735n2230k8063K5910N2557K6911
329E1604k4787n2755k6531K5215N0970K7943k4060n1719k6902K3031N2308K7176
341E1493k4514m9673k8260K3441N0722K6735k1424n1252k8060K3057M9324K9213
353E0802k2906n0226k5643J9997M9148K8937k2218m7774k8925K1153M9461K5551
365D7357j8483m8390k8605K1991M5480K7987j9312m8044k5125J7417M6259K8817
377D7349k1149m3788k7466J6827M7904K5335j7765m4783k8424K0018M1795K7706
389D3559j4435m7707k6069J6824M3481K9836j8877m2704k6899J4212M5933K4990
401D2144j4648m0274l1879J6055M3747K7257j3500m5295k6077J4145L9894L2021
$$ plain form
413 43590 27164 -15393 -40723 -29557 14065 41897 28086 -12410 -42781 -25976 15148 39620
425 39620 29396 -12930 -40696 -26611 12327 41376 27422 -13111 -40131 -30169 14123 41043
437 41043 24311 -12186 -39218 -26473 11723 38102 29965 -11525 -38397 -25615 9885 40939
449 40939 28561 -12022 -36452 -26742 11453 36365 26454 -6476 -38702 -28581 11330 35268
461 35268 28028 -9354 -37158 -25940 7572 36858 26561 -9582 -31785 -29810 6455 37927
473 37927 27422 -7297 -37272 -27342 10798 33068 28442 -7609 -35911 -23568 5343 33119
485 33119 30859 -7187 -34544 -30124 7318 38108 23889 -6794 -33393 -29668 8504 31940 26494
498 26494 -4146 -34977 -26744 4944 33901 30664 -9367 -32031 -23909 3183 33044 26727 -4041
$$ packed form
413D3590j6426m2557k5330J1166M3622K7832j3811m0496l0371J6805M1124K4472
425C9620j0224m2326k7766J4085L8938K9049j3954m0533k7020R962M4292K6920
437D1043j6732l6497k7032J2745L8196K6379q137m1490k6872J2782L5500L1054
449D0939j2378m0583k4430R710L8195K4912r911l2930l2226J0121L9911K3938
461C5268p240l7382k7804J1218L3512K9286j0297l6143k2203J975L6265L1472
473C7927j0505l4719k9975R930L8140K2270m626l6051k8302J2343K8911K7776
485C3119k260l8046k7357M420L7442L0790j4219l0683k6599L725L8172K3436n446
498B6494l0640l0831Q233L1688K8957l237m0031k2664Q122K7092K9861o317l0768
$$ plain form
511 -4041 -30766 -29931 6151 32060 26203 -3463 -35692 -26620 7889 28808 25154 -4938 -29260
524 -29260 -26075 686 31846 28143 -4627 -29600 -28589 4118 32965 25684 -4344 -30043 -25338
537 -25338 2948 26839 28094 -1878 -31889 -27145 2547 29491 26196 -3843 -29117 -26680 2290
550 2290 27471 25183 -31 -27517 -28817 891 29865 27284 -3801 -28482 -24582 1563 27249
563 27249 24954 -1091 -25304 -26102 -68 26101 27774 47 -29929 -26254 2247 26178 25345
576 25345 -1464 -25575 -25587 -993 26109 25866 688 -25108 -28033 848 27678 25225 618
589 618 -25012 -24150 -193 23355 27431 1819 -25544 -25316 -2380 25681 26611 -627 -24435 -25209
603 -25209 -184 23376 23214 3262 -22896 -26416 -1075 23729 26674 2042 -24805 -23927 -1168
$$ packed form
511d041k6725Q35L6082K5909n857k9666l2229R072L4509K0919l654l0092k4322
524b9260L185K6761L1160l703l2770k4973J011L2707K8847p281l0028k5699M705
537b5338K8286K3891J255k9972l0011M744K9692K6944l295l0039k5274K437K8970
550B290K5181k288k5214k7486j300K9708K8974k581l1085k4681L900K6145K5686
563B7249k295k6045k4213p98K6034K6169J673k7727k9976L675K8501K3931q33
576B5345k6809k4111j2K4594K7102k43k5178k5796k925K8881K6830k453k4607
589F18k5630Q62K3957K3548M076k5612k7363K28K2936K8061R30k7238k3808p74
603b5209K5025K3560j62j9952k6158l520K5341K4804K945k4632k6847Q78K2759
$$ plain form
616 -1168 23760 24957 214 -21202 -24544 -3557 22904 24752 2497 -23147 -25857 -1353 22264
629 22264 24442 2593 -22232 -23690 -2712 20757 25430 3668 -21259 -25218 -3368 22419 24179
642 24179 2507 -20551 -23992 -3357 20075 23831 4386 -20047 -24400 -4401 20360 24892 3598
655 3598 -20349 -23650 -3528 20096 23347 4211 -19438 -24363 -4228 19011 23880 4426 -20140
668 -20140 -23913 -4099 19515 23964 4072 -18590 -23221 -4775 19179 23513 4977 -18797 -24111
681 -24111 -4169 18493 23367 4824 -18751 -22531 -5205 17150 23416 4816 -17394 -22912 -5820
694 -5820 18271 22782 5386 -17026 -22914 -5046 16869 22005 5751 -17236 -22336 -5769 16192
707 16192 22717 5473 -16570 -21705 -5842 16575 22364 5945 -15537 -22413 -6038 16303 22063
$$ packed form
616a168K4928J197k4743k1416l342K0987K6461J848k2255k5644k710K4504K3617
629B2264K178k1849k4825j458K0978K3469M673k1762k4927l959K1850K5787J760
642B4179k1672k3058l441K0635K3432L756j9445k4433m353J9999K4761M532k1294
655C598k3947l301K0122K3624L251j9136k3649m925K0135K3239M869j9454k4566
668b0140l773J9814K3614M449j9892k2662m631J8446K3954M334j8536k3774n314
681b4111J9942K2662M874j8543k3575l780J7326K2355O266j8600k2210n518J7092
694e820K4091M511j7396k2412n888J7868K1915N136j6254k2987n100J6567K1961
707A6192O525j7244k2043n135J5863K2417N789j6419k1482o876J6375K2341N760
$$ plain form
720 22063 6578 -16072 -22447 -6413 15365 22114 6479 -15797 -21995 -6944 15173 22106 6858
733 6858 -14689 -21635 -6982 15126 21762 7071 -14380 -21418 -6594 14293 21133 6847 -14234
746 -14234 -21496 -7344 14043 21015 6933 -13924 -21288 -6911 13868 20943 7329 -13480 -20487
759 -20487 -7197 13594 20940 7316 -13281 -20411 -7357 13132 20538 7475 -12924 -20465 -7681
772 -7681 12677 20455 8041 -12728 -20303 -7901 12310 20434 7955 -12116 -20226 -7833 12325
785 12325 19991 7968 -11535 -19940 -8002 11580 19740 8449 -11778 -19524 -7808 11291 19466
798 19466 8143 -11146 -19185 -8246 11311 19352 8072 -10875 -19419 -8413 10994 18929 8483
811 8483 -11057 -19088 -8291 10382 19304 8766 -10840 -18686 -8439 10280 19032 8319 -9855
$$ packed form
720B2063j5485k2650o375J6034K1778O749j5635k2276o198J5051K2117O933j5248
733F858k1547o946J4653K2108O636j4691k1451p038J4824K0887O840j4286k1081
746a4234p262J4152K1387O972j4082k0857p364J4377K0779P075j3614k0809p007
759b0487J3290K0791P346j3624k0597p130J3054K0489P406j3063k0399p541J2784
772g681K0358P778j2414k0769p575J2402K0211Q124j2479k0071q110J2393K0158
785A2325P666j2023j9503q405J1938J9582Q160j1291k0227p746J1716J9099Q175
798A9466j1323j9289q039J0939J9557Q041j1280j8947q544J1006J9407P935j0446
811H483j9540q031J0797J8673Q922j0538j9606p846J0247J8719Q752j0713j8174
$$ plain form
824 -9855 -18983 -8945 10438 17996 8899 -9525 -19047 -8612 8947 18235 9352 -9658 -17872 -8905
838 -8905 9111 18698 8251 -9020 -17741 -9216 9432 17630 8959 -8444 -18445 -8903 8505
851 8505 17355 9542 -9218 -17743 -8516 8076 18209 8781 -8456 -17070 -9764 8524 17794 8720
865 8720 -7352 -17733 -9454 8595 16697 9741 -8059 -17260 -8692 6601 17115 10060 -8061
878 -8061 -16246 -9931 7245 17606 9046 -6398 -16307 -9580 7811 15171 9762 -5889 -17106 -9135
892 -9135 6318 16196 9948 -7700 -16076 -9670 6350 16713 8633 -6103 -15022 -10698 6722 15630
906 15630 9875 -5799 -17034 -8844 6110 14934 10480 -6515 -15231 -9279 4670 16201 9670
919 9670 -5514 -15322 -11117 6595 15398 8727 -4535 -15525 -9301 4947 14029 11058 -5490 -15162
$$ packed form
824i855r128J0038J9383P558r097j8424r522J0435J7559R288q883j9010q214Q967
838h905J8016R587j0447j7271q721Q525J8648Q198q671j7403j0001R542J7408
851H505Q850p813j8760q525R227J6592J0133r428j7237q614P306J8288R270r074
865H720j6072j0381Q279J8049Q102o956j7800r201Q568J5293J0514p055j8121
878h061q185O315J7176J0361q560j5444r909O727J7391P360n409j5651j1217P971
892i135J5453R878o248j7648q376O406J6020J0363q080j4736q919M324J7420Q908
906A5630n755j5674j1235Q190J4954Q824m454j6995q716N952J3949J1531o531
919I670j5184r808M205J7712Q803o671j3262j0990O224J4248R082k971j6548r672
$$ plain form
933 -15162 -9711 3916 16230 9676 -6141 -13690 -9934 5309 14284 9163 -2950 -15247 -9838
946 -9838 5449 13347 10946 -5239 -15285 -8740 3543 14874 9350 -5397 -12418 -11277 3807
959 3807 15348 9176 -3105 -15049 -10246 5943 12772 10412 -3921 -14109 -7845 2005 13170
972 13170 11888 -4541 -12986 -11068 3220 15345 7832 -3316 -13105 -10963 5076 11361 9638 -1556
986 -1556 -14362 -9076 2506 12817 11779 -5351 -12138 -8738 1574 14182 8434 -2646 -11507
999 -11507 -11968 3285 12525 9826 -1280 -14979 -9400 4038 11014 11100 -3414 -11824 -8836 -176
1013 -176 13124 10660 -2688 -11316 -12317 2770 13554 8554 -1090 -12667 -9743 2607 9615 11285
1027 11285 -1158 -12544 -9113 445 12809 10476 -3476 -10518 -10176 1970 11756 8227 -145 -11344
$$ packed form
933a5162N451J3627J2314o554j5817p549L756J5243Q975n121j2113j2297N409
946i838J5287P898k401j6185j0046O545J2283J1331n524j4747p021J141J5084
959C807J1541o172j2281j1944M803J6189O829k360j4333j0188O264R850J1165
972A3170j282j6429q445J918J4288J2125p513j1148r789K142J6039O285j723j1194
986a556j2806N286J1582J0311j038j7130o787L400J0312J2608n748j1080q861
999a1507m61J5253R240k699j1106j3699N579J3438O976Q6j4514q410K988Q660
1013a76J3300k464j3348q628j001J5087J0784n000r644j1577K924J2350P008J670
1027A1285j2443j1386L431R558J2364k333j3952p042L42J2146R786l529q372j1199
$$ plain form
1041 -11344 -11198 2267 11163 10708 -1444 -12448 -8537 1328 11056 10269 -1974 -9281 -10182 39
1055 39 11826 9717 -601 -11496 -10862 2360 10234 9663 -675 -11184 -8807 85 9577 11010
1069 11010 -748 -9909 -10118 10 11795 8968 -535 -9916 -10413 1337 8991 9560 459 -10917
1083 -10917 -9220 -358 9863 11192 -1382 -9959 -9112 -166 10787 9186 53 -9009 -10931 251
1097 251 9504 9900 1052 -11129 -9388 290 9155 10372 -627 -9220 -9059 -1403 9889 9792 452
1112 452 -8582 -11239 -38 9562 8899 1220 -9697 -9338 -326 7745 10191 740 -9328 -9277 -1486
1127 -1486 9434 9839 66 -8021 -9963 -866 8955 8628 1645 -8552 -10196 -584 8270 10148 1179
1142 1179 -9222 -9151 -1546 8590 9904 772 -7655 -9724 -1584 8576 9397 1752 -8204 -9854 -823
$$ packed form
1041a1344J46J3465Q896m55j2152j1004L911R865R728p87j2243p307r01J0221
1055C9J1787k109j0318j0895O34J3222P874n71j0338j0509K377Q892R492J433
1069A1010j1758r161k09J0128J1785k827r503r381m97J1750P654N69r101j1376
1083a0917J697Q862J0221J329j2574q577Q47Q946J0953j601r133r062j922J1182
1097B51R253L96q848j2181J741R678Q865J217j0999q593J61P656J1292r7r340
1112D52r034k657J1201R600o63p679j0917L59R012Q071K446r451j0068N1P791
1127a486J0920M05r773q087j942R097R821l27o983j0197j644R612Q854J878q969
1142A179j0401P1P605J0136J314r132q427k069Q140J0160Q21p645r956j650R031
$$ plain form
1157 -823 7770 9368 1760 -8243 -9067 -1963 7349 9777 1552 -7491 -9472 -2151 8065 9148 1792
1172 1792 -7355 -9479 -1558 7407 9393 2252 -7631 -9536 -2013 7133 9655 1770 -7495 -9166 -2163
1187 -2163 7266 9126 2194 -7061 -9603 -2151 7068 9255 2483 -7218 -9263 -2157 6769 9439 2200
1202 2200 -6806 -9259 -2701 6881 9048 2303 -6406 -9403 -2376 6702 8616 2657 -6835 -9134 -2236
1217 -2236 6034 9049 2513 -6356 -8716 -2690 6246 8870 2300 -6195 -9052 -2715 6306 8530 2633
1232 2633 -6007 -8754 -2587 5785 8754 2947 -6094 -8521 -2883 5660 8879 2862 -5544 -8654 -3212
1247 -3212 5857 8766 2947 -5291 -8770 -2983 5487 8686 3291 -5262 -8491 -2949 5234 8560 3315
1262 3315 -5145 -8281 -3400 5417 8281 2967 -5048 -8604 -3212 5215 8233 3454 -5113 -8198 -3064
$$ packed form
1157h23Q593J598p608j0003q24P104R312K428q225r043j981P321J0216J083p356
1172A792r147k124P921Q965J986p141r883j905P523R146K522p885r265j671P003
1187b163R429J860o932r255k542P452R219K187o772r701k045P106Q926K670p239
1202B200r006k453O558R582K167o745q709k997P027R078J914n959r492k299O898
1217b236Q270L015o536q869k360O026Q936K624o570q495k857O337R021K224n897
1232B633q640k747O167Q372K969n807r041k427N638Q543L219o017q406l110N442
1247c212R069K909n819q238l479N787Q470L199n395q553l229N542Q183L326n245
1262C315q460l136M881Q817K864n314q015l556N392Q427L018m779q567l085N134
$$ plain form
1277 -3064 5058 8551 3313 -4947 -8100 -3522 5058 8455 3436 -4843 -8501 -3655 4888 8110 3833
1292 3833 -4699 -8149 -3254 4085 8205 3562 -4372 -7717 -4019 4536 8527 3303 -4096 -7903 -3782
1307 -3782 4625 7458 3734 -4213 -8083 -3479 3909 7744 3564 -4485 -7453 -4032 4021 8099 3439
1322 3439 -3645 -8052 -3957 3969 7608 4155 -4079 -8007 -3512 3816 7667 4142 -4014 -7572 -3942
1337 -3942 3362 8025 3749 -3494 -7628 -4354 3814 7383 4047 -3283 -7599 -3876 3197 7175 4422
1352 4422 -3703 -7242 -4327 3162 7403 3723 -3154 -7484 -4391 3364 6974 4210 -2949 -7712 -3859
1367 -3859 3095 6924 4336 -3600 -6986 -4035 2476 7222 4075 -2983 -6933 -4932 3043 6954 4183
1382 4183 -2419 -7606 -3968 2904 6446 4870 -3122 -6826 -4341 1612 7381 4380 -2870 -6822 -5102
$$ packed form
1277c064Q122L493n238q260l153M578Q580L397n019q279l658M846Q543L222m277
1292C833q532l450M895P339M120m643p934l345L698Q555L991n224p399l807M121
1307c782Q407K833l724p947l870M604P388L835m180q049k968L421Q053M078m660
1322C439p084m407M095P926L639l453q234l928M495P328L851l525q156l558L630
1337c942P304M663m276p243m134L274Q168L569l336p330m316L723P073L978k753
1352D422q125l539K915P489M241l680o877m330L093P755L610k764p159m763L853
1367c859O954L829k588p936l386K951O511M746l147p058l950K001P975L911k771
1382D183o602n187L638O872L542j576p992l704K485N953N769l001p250l952J720
$$ plain form
1397 -5102 3071 6760 3570 -1662 -7039 -4202 2643 6165 5008 -2397 -7151 -3865 1989 7262 4196
1412 4196 -3111 -5837 -4680 2148 6527 3989 -1233 -7025 -5124 2837 6390 5146 -2211 -6898 -3402
1427 -3402 1905 6319 4833 -2571 -5447 -4929 1301 7140 4423 -1465 -6486 -4927 2588 5637 4278
1442 4278 -1284 -6591 -4091 988 6138 5135 -2221 -6150 -4583 1515 6649 3865 -1493 -5442 -4795
1457 -4795 1496 5570 4614 -752 -6614 -4353 1446 5982 4916 -2120 -5933 -3878 1077 6092 4322
1472 4322 -879 -5486 -5267 1096 5920 4934 -1163 -6855 -4166 1323 5146 4836 -1667 -5354 -4407 406
1488 406 6289 4860 -1311 -5667 -4966 1347 5244 4253 -562 -5664 -4257 499 4997 5244 -935 -5829
1504 -5829 -4526 701 6285 4103 -1636 -4871 -4976 1071 4904 4183 227 -5807 -5072 676 4886 5138
$$ packed form
1397e102Q173L689l190n232n377K837O845L522j157p405m754L286N854N273l066
1412D196p307k726J157O828M379k538n222n792J901P961L553j244p357m687L496
1427c402N307M414j486p404k876N18O230N839k717n888n021J559P515L049j359
1442D278n562n307K500N079N150j003p356l929J567O098N134k784n358l949O47
1457d795O291M074r56n366n862K261N799M536j066p036l813K055M955N015j770
1472D322n201m607K19O363M824r86o097n692K689N489L823l10o503l687R47M813
1488D06N883j429o171m356P01O313L897r91m815n102J407M756M498K47o179m894
1504e829J303N227N584k182n739l235j05O047L833p21l956o034P35N748M210K52
$$ plain form
1520 5138 -1147 -5910 -3908 67 5321 4435 -906 -4328 -5115 466 5480 4446 119 -5738 -4860 1166
1536 1166 4525 4844 -243 -5104 -4270 -410 4813 5013 -480 -4836 -5016 306 5433 3928 -177 -4674
1552 -4674 -4914 651 4243 4437 226 -5345 -4510 -55 4852 4880 -611 -4808 -4245 0 4880 4324 255
1569 255 -4163 -5161 -20 4576 4903 170 -5190 -4299 280 4141 4990 58 -4114 -4597 -603 4614
1585 4614 4795 314 -4371 -4873 329 4301 4403 316 -4076 -4218 -363 4086 4785 284 -4746 -4645
1601 -4645 -297 4755 4671 -120 -4026 -4710 -188 4466 4471 833 -4244 -4545 -341 4056 5081 392 -4245
1618 -4245 -4159 -871 4144 4472 457 -3637 -4756 -492 4101 4703 951 -4089 -4645 -497 3892 4548
1634 4548 751 -3789 -4407 -856 4019 4681 838 -3642 -4630 -667 3946 4345 860 -3761 -4558 -740
$$ packed form
1520E138o285m763K002L975N254q86n341l422p87N581N014j034m327n857Q78O026
1536A166L359L19n087m861Q34L860N223K00n493m356j80N322N127j505m105m497
1552d674k40N565L592J94m211n571Q35M455M907K8n491m197N63M245M880n56m069
1569B55m418r98N141M596L27m733n360Q91M579L861Q49m932m172m83L994N217
1585D614J81m481m685n02N202L972J02m087m392j42L855M449O99m501n030J01
1601d645M348N052q4m791l906o84M522M654Nl638n077l01M204M397J025m689m637
1618d245Q6L288N015L28m015m094j119M264M593O02l752n040n56M148M389O56
1634D548l797m540o18L551M875O62l843m480r88L963M613L99l485m621p97L818
$$ plain form
1650 -740 3460 4450 917 -4110 -4486 -967 3909 4853 682 -3438 -4614 -979 3772 4173 932 -3854
1666 -3854 -4651 -1070 3452 4509 1081 -3880 -4648 -1080 3252 4562 956 -3416 -4527 -1150 3506
1681 3506 4442 1115 -3240 -4422 -1218 3211 4434 993 -3160 -4343 -1293 3017 4508 1414 -3258
1696 -3258 -4322 -1169 3112 4288 1086 -2847 -4330 -1298 3194 4389 1392 -2877 -4471 -1233 3297
1711 3297 4311 1446 -3069 -4445 -1529 3066 4369 1622 -3053 -4263 -1451 2928 4069 1520 -2873
1726 -2873 -4060 -1586 2838 4474 1525 -2937 -4519 -1327 2881 4188 1745 -2983 -4298 -1453 2824
1741 2824 4406 1366 -2797 -4124 -1620 2674 4305 1535 -2644 -4263 -1316 2965 4013 1512 -2869
1756 -2869 -4197 -1754 2688 4350 1700 -2383 -4252 -1706 2509 4174 1765 -2444 -4163 -2055 2397
$$ packed form
1650g40M200R90l533n027l76L519M876R44m171m120j176L635M751M01l241m786
1666c854p97L581M522J057l428m961p68L568M332J310l606m372j111L377M656
1681C506R36l327m355j182L204M429J223l441m153j183L050M310J491l094m672
1696c258j064L153M281J176l202l933j483L032M492J195k997m269j594L238M530
1711C297J014k865m515j376K916M595J303k747m675j210K812M379J141k549m393
1726b873j187K474M424J636k949m462j582L192M208J307k443m728j315K845M277
1741B824J582l040m163j327K504M294J631k770m179j619K947M281J048k501m381
1756b869j328K443M442J662k650m083j869K546M215J665k409m209j719K108M452
$$ plain form
1771 2397 4041 1601 -2239 -4385 -1635 2290 4191 1685 -2487 -3801 -1843 2350 4048 1851 -2316
1786 -2316 -3833 -2003 2373 3939 1648 -2238 -4099 -1720 2232 3973 1800 -2311 -4215 -1861 2192
1801 2192 4078 2060 -2344 -4113 -1810 2210 4007 1654 -2119 -3866 -2088 1991 4151 1836 -2135
1816 -2135 -4129 -1915 2015 3753 2221 -2256 -3813 -1882 1956 4013 1988 -2220 -3624 -2070 1999
1831 1999 3708 1856 -1734 -3778 -1819 1749 3929 2076 -1856 -3875 -2062 1849 4101 1817 -2048
1846 -2048 -3716 -1923 1777 3772 1981 -1708 -3673 -1960 1700 3613 2344 -1736 -3801 -1733 1573
1861 1573 3905 2069 -1501 -3351 -2176 1485 4096 2077 -1548 -3861 -2097 1882 3397 1963 -1385
1876 -1385 -3615 -1879 1104 3670 2300 -1770 -3535 -2160 1748 3865 1800 -1407 -3517 -2208 1315
$$ packed form
1771B397J644k440l840k146K750L925J901k506m172j314J958M193J698k197m167
1786b316j517J830M376J566k291l886j861K379L952J741k173m111j904K354M053
1801B192J886k018m404j769K303M020J797k353l773j747J778M079K160k315l971
1816b135j994K214L930J738j532m477j557J931L838K057k025m208j404J554M069
1831A999J709j852l590k044J959L568K180j853l932k019J813L911K252k284l865
1846b048j668J793L700J995j791l689j965J713L660J913j269m080k065K068L306
1861A573K332j836l570j850J175L661K611k019l625k313J764L979J515j434l348
1876a385k230J736K983K566j370m070j765J375L908K117k065l207k110J309L523
$$ plain form
1891 1315 3404 2285 -1212 -3755 -2205 1343 3541 2223 -2001 -3389 -2062 1510 3588 1820 -1014
1906 -1014 -3192 -2826 1549 3524 2341 -1128 -3794 -1905 1431 3098 2506 -1256 -3054 -1937 666
1921 666 3744 2205 -1247 -3488 -2462 1705 3435 1912 -773 -3372 -2057 1220 3169 2903 -1183
1936 -1183 -3728 -2062 784 3892 2102 -1498 -2848 -2509 1141 3330 1923 -137 -3351 -2702 1254
1951 1254 2929 2694 -1361 -3586 -1519 661 3136 2313 -1110 -2688 -2693 561 3684 2119 -720 -3688
1967 -3688 -2489 1387 2515 2139 -485 -3307 -1716 417 3020 2898 -1034 -3154 -2558 749 3524 1635
$$ packed form
1891A315K089j119l497k543J550L548K198j318m224j388J327L572K078j768k834
1906a014k178L66M375J975j183l469k666J889L336J667n92l762j798J117K603
1921F66L078j539l452k241J026M167J730j523k685k599J315L277J949k66m086
1936a183k545J666K846L108j790l600j350L39L650K189j407k060l214O49L956
1951A254J675k35m055k225K067K180K475q23l423j578nL254L123j565k839k968
1967c688J199L876J128l76k624k822J591K133K603j22l932k120N96L307K775j889
$$ [...]
8191d5
##END NTUPLES=NMR FID
##END=
