##TITLE=1H_PR192_M_pH7
 D2O, 8 sc, 
 22.10.2020
##JCAMPDX= 6.0         $$ Bruker NMR JCAMP-DX V2.0
##DATA TYPE= NMR FID
##DATA CLASS= NTUPLES
##ORIGIN= UXNMR, Bruker Analytische Messtechnik GmbH
##OWNER= root
$$ XWIN-NMR		Version 3.5
$$ Thu Oct 22 13:22:15 2020 Russian Standard Time (UT+4h)  she@DPX200
##.OBSERVE FREQUENCY= 200.1315066352
##.OBSERVE NUCLEUS= ^1H
##.DELAY= (6, 6)
##.ACQUISITION MODE= SIMULTANEOUS
##.ACQUISITION SCHEME= undefined
##.AVERAGES= 8
##.DIGITISER RES= 18
##SPECTROMETER/DATA SYSTEM= spect
##.PULSE SEQUENCE= zg30
##.SOLVENT NAME= D2O
##.SHIFT REFERENCE= (INTERNAL, D2O, 0, 15.7039)
##AUDIT TRAIL= $$ (NUMBER, WHEN, WHO, WHERE, WHAT)
$$ ##TITLE= Audit trail, XWIN-NMR		Version 3.5
$$ ##JCAMPDX= 5.01
$$ ##ORIGIN= Bruker BioSpin GmbH
$$ ##OWNER= she
$$ F:/spectra/data/she/nmr/H-F/1/audita.txt
$$ ##AUDIT TRAIL=  $$ (NUMBER, WHEN, WHO, WHERE, WHAT)
(   1,<2020-10-22 13:21:07.67 +0400>,<she>,<DPX200>,
      <created by zg, POWCHK disabled, PULCHK disabled
       configuration hash MD5:
       00 E9 B6 7A A2 85 ED C7 34 08 36 98 17 FE 4E 26
       data hash MD5: 16K
       07 A2 81 86 48 90 C2 80 BD 0B 80 A1 94 AF F7 52>)
$$ ##END=
$$ 
$$ hash MD5
$$ 67 C8 56 39 CD 5B 7B 93 0A 0C 4B 34 B1 68 59 95
##$RELAX= 
##$RELAX= 
##$RELAX= 
##$RELAX= 
##$RELAX= 
##$RELAX= 
$$ Bruker specific parameters
$$ --------------------------
##$DU= <F:/spectra>
##$EXPNO= 1
##$NAME= <H-F>
##$PROCNO= 1
##$TYPE= <nmr>
##$USER= <she>
##$AMP= (0..31)
100 100 100 100 100 100 100 100 100 100 100 100 100 100 100 100 100 100 
100 100 100 100 100 100 100 100 100 100 100 100 100 100 
##$AQSEQ= 0
##$AQ_mod= 1
##$AUNM= <au_zg>
##$AUTOPOS= <>
##$BF1= 200.13
##$BF2= 200.13
##$BF3= 200.13
##$BF4= 200.13
##$BF5= 200.13
##$BF6= 200.13
##$BF7= 200.13
##$BF8= 200.13
##$BYTORDA= 1
##$CFDGTYP= 0
##$CFRGTYP= 5
##$CHEMSTR= <none>
##$CNST= (0..31)
1 1 145 1 1 1 1 1 1 1 1 1 1 1 1 1 1 1 1 1 1 1 1 1 1 1 1 1 1 1 1 1 
##$CPDPRG= <>
##$CPDPRG1= <>
##$CPDPRG2= <>
##$CPDPRG3= <>
##$CPDPRG4= <mlev>
##$CPDPRG5= <mlev>
##$CPDPRG6= <mlev>
##$CPDPRG7= <mlev>
##$CPDPRG8= <mlev>
##$CPDPRGB= <>
##$CPDPRGT= <>
##$D= (0..31)
0 1.2 0 0 0 0 0 0 0 0.06 0 0.03 0 0 0 0 0.0002 0 0 0 0 0 0 0 0 0 0 0 0 
0 0 0 
##$DATE= 1603358467
##$DBL= (0..7)
120 120 120 120 120 120 120 120 
##$DBP= (0..7)
150 150 150 150 150 150 150 150 
##$DBP07= 0
##$DBPNAM0= <>
##$DBPNAM1= <>
##$DBPNAM2= <>
##$DBPNAM3= <>
##$DBPNAM4= <>
##$DBPNAM5= <>
##$DBPNAM6= <>
##$DBPNAM7= <>
##$DBPOAL= (0..7)
0.5 0.5 0.5 0.5 0.5 0.5 0.5 0.5 
##$DBPOFFS= (0..7)
0 0 0 0 0 0 0 0 
##$DE= 6
##$DECBNUC= <off>
##$DECIM= 32
##$DECNUC= <off>
##$DECSTAT= 4
##$DIGMOD= 1
##$DIGTYP= 9
##$DL= (0..7)
0 120 120 120 120 120 120 120 
##$DP= (0..7)
150 150 150 150 150 150 150 150 
##$DP07= 0
##$DPNAME0= <>
##$DPNAME1= <>
##$DPNAME2= <>
##$DPNAME3= <>
##$DPNAME4= <>
##$DPNAME5= <>
##$DPNAME6= <>
##$DPNAME7= <>
##$DPOAL= (0..7)
0.5 0.5 0.5 0.5 0.5 0.5 0.5 0.5 
##$DPOFFS= (0..7)
0 0 0 0 0 0 0 0 
##$DQDMODE= 0
##$DR= 18
##$DS= 0
##$DSLIST= <SSSSSSSSSSSSSSS>
$$ [...]
##$SUBNAM2= <"">
##$SUBNAM3= <"">
##$SUBNAM4= <"">
##$SUBNAM5= <"">
##$SUBNAM6= <"">
##$SUBNAM7= <"">
##$SUBNAM8= <"">
##$SUBNAM9= <"">
##$SW= 16.880792210976
##$SWIBOX= (0..15)
0 0 2 0 0 0 0 0 0 0 0 0 0 0 0 0 
##$SW_h= 3378.37837837838
##$TD= 16384
##$TD0= 1
##$TE= 0
##$TE2= 300
##$TE3= 300
##$TEG= 300
##$TL= (0..7)
0 120 120 120 120 120 120 120 
##$TP= (0..7)
150 150 150 150 150 150 150 150 
##$TP07= 0
##$TPNAME0= <>
##$TPNAME1= <>
##$TPNAME2= <>
##$TPNAME3= <>
##$TPNAME4= <>
##$TPNAME5= <>
##$TPNAME6= <>
##$TPNAME7= <>
##$TPOAL= (0..7)
0.5 0.5 0.5 0.5 0.5 0.5 0.5 0.5 
##$TPOFFS= (0..7)
0 0 0 0 0 0 0 0 
##$TUNHIN= 0
##$TUNHOUT= 0
##$TUNXOUT= 0
##$USERA1= <user>
##$USERA2= <user>
##$USERA3= <user>
##$USERA4= <user>
##$USERA5= <user>
##$V9= 5
##$VALIST= <valist>
##$VCLIST= <CCCCCCCCCCCCCCC>
##$VD= 0
##$VDLIST= <DDDDDDDDDDDDDDD>
##$VPLIST= <PPPPPPPPPPPPPPP>
##$VTLIST= <TTTTTTTTTTTTTTT>
##$WBST= 1024
##$WBSW= 4
##$XGAIN= (0..3)
0 0 0 0 
##$XL= 0
##$YL= 0
##$YMAX_a= 352721
##$YMIN_a= -338026
##$ZGOPTNS= <>
##$ZL1= 120
##$ZL2= 120
##$ZL3= 120
##$ZL4= 120
##$ABSF1= 10
##$ABSF2= 0
##$ABSG= 5
##$ABSL= 3
##$ALPHA= 0
##$AQORDER= 0
##$ASSFAC= 0
##$ASSFACI= 0
##$ASSFACX= 0
##$ASSWID= 0
##$AUNMP= <proc_1d>
##$AZFE= 0.1
##$AZFW= 0.1
##$BCFW= 1
##$BC_mod= 2
##$BYTORDP= 1
##$COROFFS= 0
##$CY= 11.3945322036743
##$DATMOD= 1
##$DC= 2
##$DFILT= <>
##$DTYPP= 0
##$F1P= 16.9975609425685
##$F2P= -3.02152046262296
##$FCOR= 0.5
##$FTSIZE= 0
##$FT_mod= 4
##$GAMMA= 1
##$GB= 0.15
##$INTBC= 1
##$INTSCL= 1
##$ISEN= 128
##$LB= 0.24
##$LEV0= 0
##$LPBIN= 0
##$MAXI= 10000
##$MC2= 0
##$MEAN= 0
##$ME_mod= 0
##$MI= 1.114404
##$NCOEF= 0
##$NC_proc= 0
##$NLEV= 6
##$NOISF1= 3.799351
##$NOISF2= 2.8
##$NSP= 1
##$NTH_PI= 0
##$NZP= 0
##$OFFSET= 15.70392
##$PC= 1
##$PHC0= -10703.93
##$PHC1= 28.00089
##$PH_mod= 1
##$PKNL= yes
##$PPARMOD= 0
##$PSCAL= 0
##$PSIGN= 0
##$REVERSE= no
##$SF= 200.130013532006
##$SI= 16384
##$SIGF1= 3
##$SIGF2= 2
##$SINO= 400
##$SIOLD= 16384
##$SREGLST= <1H.CDCl3>
##$SSB= 0
##$STSI= 0
##$STSR= 0
##$SW_p= 3612.71676300578
##$SYMM= 0
##$S_DEV= 0
##$TDeff= 0
##$TDoff= 0
##$TI= <>
##$TILT= no
##$TM1= 0
##$TM2= 0
##$TOPLEV= 0
##$USERP1= <user>
##$USERP2= <user>
##$USERP3= <user>
##$USERP4= <user>
##$USERP5= <user>
##$WDW= 1
##$XDIM= 8192
##$YMAX_p= 0
##$YMIN_p= 0
$$ End of Bruker specific parameters
$$ ---------------------------------
##NTUPLES= NMR FID
##VAR_NAME=  TIME,          FID/REAL,        FID/IMAG
##SYMBOL=    X,             R,               I
##VAR_TYPE=  INDEPENDENT,   DEPENDENT,       DEPENDENT
##VAR_FORM=  AFFN,          ASDF,            ASDF
##VAR_DIM=   8192,          8192,            8192
##UNITS=     SECONDS,       ARBITRARY UNITS, ARBITRARY UNITS
##FACTOR=    0.000296,      1,               1
##FIRST=     0,             0,               0
##LAST=      2.424536,      0,               0
##MIN=       0,             -338026,         0
##MAX=       2.424536,      352721,          0
$$ Real data points
##PAGE= N=1
##DATA TABLE= (X++(R..R)), XYDATA
0@%%%%%%%%%%%%%qJ6j6J6j6K4l2L6m4N6o4P2q8J04j20J40j62J86k15K44k77L12
35A64l52M00m48N02n62O26o95P71q59R54j054J165j286J417j562J719j894K090
53A096k301K537k804L102l441L829m276M802n432O199p157Q396j0070J2478j6290
68i332K3511o2917K48795R2194j69016k59328k01933K31575K39421J66814j36964
79A62820l38501m3403R8408K09475K27724j95770k50113r0703R5641K74843P0782
90B21203j01029j86472j82351J71059K09771N2603l3011k30628j24998J04398
100i9455J78118J55378j20271j99122p7050J1137K24672J44876j18039j58003
110e7759j33656O0505J93095J01089j8639k07302j38610J03008J35214J30039
$$ y = [0, 0, 0, 0, 0, 0, 0, 0, 0, 0, 0, 0, 0, 0, -8, 8, -8, 8, -8, 16, -16, 20, -24, 32, -32, 40, -48, 56, -64, 76, -86, 100, -115, 129, -148, 164, -188, 212, -236, 266, -296, 330, -365, 406, -453, 501, -553, 612, -674, 743, -819, 900, -994, 1096, -1205, 1332, -1472, 1630, -1811, 2018, -2258, 2544, -2888, 3311, -3846, 4550, -5520, 6958, -9332, 14179, -48738, 200057, 292251, 123235, -136093, -338026, -106451, 132970, 299784, 162820, -175681, -219084, -120676, 88799, 316523, 120753, -129360, -220063, -124422, 150421, 221203, 120174, -66298, -248649, -77590, 132181, 184784, 151773, -78855, -203853, -99455, 78663, 234041, 113770, -85352, -162402, -151265, 73407, 218283, 100244, -57759, -191415, -130910, 62185, 163274, 144635, -62667, -201277, -98269, 36945, 166984]
120A66984k9495k02310r9298M8148J76206J18985q4722j27341j16500L3109J96074
131G9840P8857n8646j38233j13841O4065J33622J00909l8420j73366p0176M6131
142h9258J12967J16205m9355j33264q2828K6789J38611P7173k7780r8843j12605
153a22188L7462J20136O9928p943j12580q7938K2683R3459R9842k8380j08754
164b4273o6371K20J02847R2045k8795r1456q6980J7003J02906P0930l087j00862
176a5873r0982K9885Q6733P9357p149r9085p2356P644Q9351Q4007k0109p7218
188e795p4234k41R1360O9547q822p4478p4451J1660P1233O6052K02p9134o1623
201f8724P085O3137O8955n944o8534o1882m73P0825O1030n073o0153o7806K387
$$ y = [166984, 137489, -64821, -164119, -115971, 60235, 179220, 94498, -32843, -149343, -116234, 79840, 158697, 100051, -38182, -152023, -87958, 45664, 146573, 108153, -65213, -135389, -89258, 23709, 139914, 90559, -42705, -125533, -98744, 39867, 117040, 89260, -9583, -122188, -84726, 35410, 105338, 97395, -15185, -103123, -80440, 13019, 112861, 84481, -24273, -90644, -90424, 12423, 104468, 75673, -15783, -102763, -85760, 17146, 88076, 84989, -15873, -106855, -76970, 9763, 89120, 81971, -17114, -89470, -81826, 7525, 91532, 71423, -5795, -80029, -80270, 11090, 80637, 71815, -2663, -77114, -65454, 5779, 71831, 72033, -7101, -68724, -61639, 1498, 70453, 64509, -4025, -65907, -66380, 4445, 65475, 60402, 249, -67557, -65170]
214f5170O6502N9361L035o3524o3585R96N8021O5960K258o1716n7939n117N7728
227c190O1804R28n3429n9262l761N4882N3398N088n2519n6335j428M9327N2494
240D7997L283n1134n0156l489M7705N1774J797m5927m9516m741M7254M9202N326
253D9375m3626n0388m571M2819M8833P627m1483m7936p288L8546M8418Q366l7868
266A0824m6692r983L7212M5601Q445l5725m5023q898L5434M2570Q893l5008m2948
279c5298p403L3814M2386Q318l4629m1372p650L4083M1489P835l2626m0392p805
292c9250L2128L9638R159l0214l8937r546K8744L8251R802k7997l7329r976K6284
305i243L5543R356k4931l4770j0445K4026L3648J0397k3362l4049j0223K3379
$$ y = [-65170, 1332, 60693, 63728, 204, -63381, -62385, -4364, 61596, 63854, 2138, -55801, -60918, -3190, 58614, 59542, 6113, -53149, -56910, -2028, 51370, 56458, 3939, -52396, -53824, -4497, 47997, 51280, 146, -50010, -53499, -5794, 45980, 47777, 1850, -47666, -52407, -5153, 44049, 49375, 5749, -44639, -49210, -6391, 42442, 50069, 8586, -39350, -46638, -8092, 40326, 48692, 10824, -35868, -45851, -8639, 36962, 45407, 9682, -35341, -44239, -8805, 33765, 42658, 7650, -35298, -42701, -8887, 33499, 41817, 7188, -34184, -41834, -7751, 33738, 41573, 8947, -31445, -39250, -7122, 32516, 41675, 11461, -27476, -37022, -8278, 29973, 39775, 11778, -25551, -35527, -9243, 26300, 35656, 10725, -24045, -34490, -10464, 23184, 33581, 10219, -23830, -34053, -10674]
317a0674L3209J0271k2768l2401j0341K2078L3052J0597k1848l2123j1813K1377
329a1384L2583J1215j9775l2692j1914J9848L0888J2317j8972l0780j1778J6970
341a3474K9960J2037j7626k8001j2492J6442K8758J0394j5649k7243j1116J6640
353a1370K5722J1666j5155k6804r921J4679K5903J2366j5896k5274j1147J3684
365a1547K6486J0681j3217k4504j3320J3970K3976J1193j0668k5452j1773J1863
377a2312K1998J3158j1848k2460j0556Q923K2697J1614j1058j9613j2265J0240
389a1482K0917J0292p702k1654j1087J0952J8568J1862q889k1061r664P803K0036
402H891J1756r868j7296j2730O964K0878R790o880j8095j2932Q446J6747J1381
$$ y = [-10674, 22535, 32806, 10038, -22363, -32704, -10626, 22426, 33023, 11175, -20948, -32761, -11384, 21199, 32414, 12639, -20053, -31967, -12119, 18769, 31086, 12114, -18666, -30444, -13474, 16486, 28523, 10897, -17104, -29596, -13154, 15604, 25998, 10349, -16894, -28010, -11370, 14352, 26018, 10863, -15941, -25862, -11183, 14720, 27086, 11190, -14084, -25231, -11547, 14939, 25620, 12403, -12101, -25421, -11451, 12525, 23718, 13050, -12402, -24175, -12312, 9686, 22844, 10996, -11464, -22020, -13097, 9600, 21214, 10156, -9457, -21722, -11482, 9435, 19727, 12025, -9629, -20716, -9764, 8804, 20666, 11777, -9284, -18948, -11145, 8891, 20647, 10779, -6517, -19247, -12283, 8595, 18385, 11505, -6590, -19522, -11076, 5671, 17052]
415A7052n405j8940r733N821J5833J2843p198j6106r798M573J7820R093n915j4021
429d081j2216P038J5967Q493m018j6427r701N708J4041J1499o283j5192q610K804
443a0978J5184J0497n550j2796j0894L958J4176Q685j715j4703j0385N377J1268
456B124J0181k668j3344p717K110J2655R353m367j0287r363J815J3305P858k694
470H961j1425r602L600J0761R114j780j3179p493K121J0280J0382l036j0649q587
484a0532O14J2268Q059j921q965j0361K521J0089P572o5j0652q143K204P880R791
499A0359j968r929o498j72R464Q613k488p898q599J202R889O127N6q979q813K276
515g358P535P959k19r127o532m87P896Q574j448p131p059q87Q504O727M48o846
$$ y = [17052, 11647, -7293, -17026, -11205, 4628, 17471, 10273, -5833, -15631, -11058, 6762, 15855, 9940, -4081, -16297, -9259, 6708, 15201, 11183, -5244, -14945, -9237, 4804, 16303, 10020, -5172, -13782, -10978, 4206, 14703, 9153, -3643, -14537, -10579, 3597, 12282, 10567, -4136, -14521, -9144, 2124, 12305, 9637, -3707, -11424, -9314, 3341, 12694, 8327, -1960, -11323, -9508, 3797, 11655, 8961, -2464, -12066, -8466, 2295, 11409, 9629, -3550, -11043, -8922, 1358, 11740, 8704, -1945, -10532, -9918, 2350, 10409, 8488, -477, -10838, -8317, 1772, 9344, 9279, -1373, -9516, -7312, 568, 10359, 8391, -1538, -8036, -8208, 1256, 9869, 7381, -517, -9116, -7914, 1975, 8102, 8158, -821, -9634, -7358, 177, 8136, 7917, -1210, -7742, -8229, -333, 8241, 6793, -338, -7397, -8284, 220, 6947, 7395, 549]
531E49q017R81O571O894P80p483o761L36N808P565m89o703o059j211P617O024
547F402k49n509p435k76O648N946J081o752o654O12M642P410P43o197n607r00
563f095N234O813L5m776o386o65N741M544J257m760n928m17M416N714P05n106
579C26n057m11M221N631L34m584m692j152M528N089P87m031n730m79M182M778
595C740J735m584m771q27L341N253R64l739m316j543L763M626R61k955m999r31
611d282L307M337J188l678m155q42K965M672O61l151m381j097L338M196R61k876
627A163m362j088L220L948J057k710m096r08K621M006J188k845l447j210K103
642a360L847J206k561l609j267K446L374J040j836l522j247K264L343J091k177
$$ y = [549, -7468, -6487, 84, 6978, 7758, 275, -6486, -6150, -342, 7223, 6734, 31, -6028, -7239, 378, 6402, 6153, 644, -6791, -7067, -419, 5527, 6608, -144, -6798, -6186, -1544, 5866, 6609, 412, -5195, -6095, -861, 5952, 5987, 1211, -5175, -5840, -99, 4445, 5702, 942, -4986, -5403, -987, 4727, 5432, 326, -4731, -5142, -921, 4710, 5044, 460, -4232, -5384, -856, 4233, 5020, 989, -4741, -5220, -1038, 3740, 5475, 891, -3880, -4707, -1366, 3887, 4851, 1112, -3204, -4747, -984, 3642, 4603, 1648, -3351, -4282, -975, 3362, 4550, 872, -3283, -4125, -1160, 3512, 4173, 1022, -3359, -4456, -1118, 3078, 4039, 1163, -3199, -4287, -1067, 2881, 3938, 1228, -2868, -3776, -1155, 2851, 4039, 1194, -2253, -3463, -1360, 2487, 3693, 1132, -2477, -3744, -1298, 2076, 3116, 1280, -2242, -3489, -1225, 2118, 3209, 1032]
657A032l424r91K008L447J316k247l064j466K379L077J030j899l248j049J984
672a115K707J714j813l222j074J593K846J363j854k917j097J789K691P11j139
687A183l140q19J847K600Q91j645k440j175J640K439J246j614k570p37J281K497
703A484J102j205k459j450J535K456Q89j448k149j219J307K154J202j302k234
718a337j042R81K575J078j385k072j102J208K287J013j329j980j025J115K205
733A190Q59j159j906j214J253K056J109j182j846j271J080J978Q48o79j999q73
749a756P65J784J205j003k006q29Q69J659J053n45j944j066P30J591R72n33j522
766e76j159L76K249R29o62j958p79O56J606J114p82j771j153P68J864Q97o78j542
$$ y = [1032, -2392, -3383, -1375, 2072, 3388, 1141, -1923, -3389, -1010, 2067, 3097, 1198, -2050, -3099, -1115, 1592, 3306, 1493, -1729, -2803, -1210, 1636, 2999, 1145, -1772, -2869, -1080, 1611, 2322, 1183, -1957, -2776, -929, 1671, 2562, 917, -1523, -2698, -1058, 1381, 2627, 1013, -1557, -2294, -1013, 1484, 2586, 1381, -1078, -2528, -993, 1463, 2352, 904, -1245, -2464, -1157, 997, 2199, 897, -1337, -2379, -1398, 1177, 2255, 870, -1202, -2304, -1096, 1191, 2204, 875, -1105, -2130, -1015, 1190, 2049, 890, -1016, -2230, -977, 1079, 2188, 1006, -840, -2111, -1031, 947, 1795, 1116, -883, -1756, -991, 793, 1998, 995, -1011, -1840, -971, 688, 1741, 1196, -748, -1814, -1084, 507, 1479, 946, -576, -1735, -1359, 890, 1819, 1157, -801, -1580, -924, 682, 1796, 1014, -757, -1910, -1142, 722, 1619, 941, -601]
784f01j058O53J712P06n48j414j132Q02J328Q08n27r65q91L13J107R71l07j437
802d80p97M67J189J130o28j549o74M71J270Q14l32j239q88J87J224J224n01j275
820c87r75N59R76J217m47j280q38J96J392Q02m68j069p16J10J087J042l83j285
838d67q44M82J453O50l53j322n93J76R47J029l59r60p81P9J067Q96p7j370p35
857a082L96P28Q74k8j041r70L79O03R55K16j147r83J94Q71Q60J50j071q86J18
876h64R40J072k71j029r09j6J331O70J3r65q82j71J283N67J52r95j072K79P88
895g9O84J64o24r60J62L58J025K15q07q15o6O31J015j39p72p22n8O92Q36l2p93
916h5o32j25Q12P24j7m70r33n5P46P21J55r25n98n4O75Q51N6o43j138L80M61O28
$$ y = [-601, -1659, -1006, 706, 1412, 864, -550, -1682, -880, 448, 1256, 729, -236, -1127, -814, 293, 1264, 957, -480, -1277, -810, 379, 1509, 881, -668, -1342, -871, 399, 1213, 881, -358, -1246, -1059, 165, 1389, 888, -387, -1362, -803, 173, 1390, 943, -337, -1175, -979, 413, 1215, 747, -322, -1038, -928, 159, 1201, 818, -467, -1311, -829, 624, 1274, 921, -401, -994, -818, 129, 1158, 799, -161, -942, -863, 204, 1100, 1023, -347, -1082, -686, 42, 916, 888, -153, -1123, -744, -141, 814, 1030, -117, -1100, -906, -35, 825, 975, -96, -982, -864, 76, 1148, 877, -152, -1061, -1077, 254, 924, 937, -28, -910, -1081, 202, 769, 921, -74, -1146, -867, -79, 605, 769, 145, -815, -653, -295, 730, 945, 138, -677, -743, -112, 903, 764, -8, -730, -788, -96, 740, 708, -85, -717, -842, -30, 694, 677, 207, -726, -781, -35, 686, 841, -84, -682, -736, -61, 790, 846, 203, -935, -555, -94, 534]
938E34K00o30o48k00L86Q38K79n46o57n03R98M46P1n01p58J59J71P90J16k89n50
959b94j98K8R94nm22n78l11N93P18Q2l69p16j33O04K14M51o48j02o27L34N63N39
981G17m15r04K5L30P42K1l24n66l11N79N82O0m26q37j07P01M01J59n15m97M0L73
1003a72O23P3k37r73K19L98M37K97n45m47k36M07K41O41n82l21l58L52M16J83
1023D16p0n77l23K70N29J20r8o46J12J81L24K46k85m74k72N15M35J3l50j64l61
1044d59j58R12L8J47p26q7J00N36K13l26k96l55L90J00J90J2m98O2P9M17J3j35
1066A69k01l56J82M50J30R8n42j85J70L08L61n48k3l63R6M78J92l03j78m2p8J64
1088b1K68l05nj59j32O31l2j40k77j14k20M06K86j09l17p5K87NK64n0k96l08M72
$$ y = [534, 734, 104, -544, -744, -358, 480, 759, 213, -444, -947, 51, 497, 568, 67, -691, -532, -361, 429, 545, 256, -294, -492, -464, 530, 525, 103, -475, -786, -193, 525, 607, 238, -478, -611, -7, 207, 658, 10, -92, -719, -385, 178, 717, 302, -602, -577, -247, 495, 516, 192, -374, -685, -106, 476, 536, 110, -727, -834, -133, 268, 427, -88, -585, -545, -172, 451, 524, 287, -686, -467, -69, 368, 665, 120, -327, -563, -156, 85, 726, 144, -177, -535, -183, 233, 416, 346, -231, -554, -284, 245, 365, 267, -379, -267, -86, 238, 484, 199, -275, -547, -32, 403, 416, 66, -98, -459, -617, 295, 333, 480, -246, -333, -233, 303, 516, 190, -106, -461, -71, 29, 219, 231, -267, -205, -126, 291, 304, 169, -32, -388, -206, 244, 374, 472, -70, -255, -85, 223, 584, 36, 13, -350, -254, 224, 416, 113, -65, -107, -185, -21, 247, -58, -63, -222, -354, 277, 245, 105, -172, -286, -506, -100, 186, 77, -240, -315, -28, -23, 241, 191, -105, -413, 59]
1111E9j02M78J28n16l96J36K64J75K8m00m8p9K49M61j63n97oR9K99J55K09m67
1133c4l50q1N36j87L63r3l57PJ88L19N0rp71L04Q4K92O2k98j63j63O12j98J21
1156B34j89l28R7K5M60J27l35k22p6L1L50M0j8n33k48O43K91O7m03k89k57L69
1178a64L69k5M6m40Q4J84J33R5l32k04l38P78rK91l23o47K32J14L26Q5k55j18
1200a18m7K33N5K2k84j5P7j18L48L2p6l87o6M16K55l32N6k7k48J68K19j26k15
1223a78l03K57K20K34J99m09k44P7K25J95l6j87L3j06J19K0O8q9j48j96J87K91
1245B29jp6j01m9n1J84J34m35J98j15J0L90k61k68n5K28J18J87k0k89l01R9K22
1268b3K16N7l36K08k24K6J70Q4Rk49k3J18K06L10l28l48pL1R3K44n3o9j30P6l2
$$ y = [59, -43, 435, 563, 47, -349, -213, 51, 226, 254, -146, -194, -273, -24, 437, 274, -323, -329, -230, 69, 224, 433, -34, -384, -465, 71, -116, 247, 154, -203, -196, -8, 311, 361, 352, -419, -115, -31, 261, 323, 25, -138, -301, 311, 113, 234, 45, -283, -186, -161, 299, 426, 91, -131, -207, -176, 174, 214, 196, -337, -585, 58, 349, 416, 13, -276, -533, -164, 205, 180, 226, -214, -130, 54, 187, 282, -50, -254, -592, 186, 177, 468, 145, -502, -270, -156, 170, 255, 0, -118, -165, 68, 123, 145, -139, -154, -77, -195, 153, 185, 109, -278, -344, 72, 327, -5, 51, 24, -224, -56, 163, 37, -178, -481, -224, -4, 230, 429, 20, -224, -147, 78, 273, 237, 50, 83, -23, 96, 116, 184, 95, -53, -249, -62, 229, 228, 152, 51, 2, -49, 135, 269, -166, 32, -83, -73, 317, 56, -212, -267, -39, 79, 266, 246, -43, -344, -245, -23, 193, 250, -86, 122, -102, -76, 94, 178, 187, -62, -85, 33, 239, 549, 221, -127, -134, -103, -10, 234, 181, 112, -18, 58, 26]
1293B6K28j33l59K02J56J59j70o6l02K19q4M00r3M9l75P4qJ28P5j65K0k22N32
1316B91Ol13J04n5QP2j19K03r1k05j32n4M48j24ql69J24K01P7k5n8p1j25K66k
1341D9k64J12k0n0J45q9L81k72j62L03N9j67K02J82m23l6J07K09p2j90Q2k87K96
1364I5J71j2k78j50K2N4J28R6J05k75j77K86l3L3J71j76j52M1p7L54k45k55K77
1387Cp7K32m0om74R7m2M77K0j78J35j94j3L04j92j58m5K25k29L70j09J06l59k8
1411a75K5K55J29j03j12j37k2K69m2j1L2l24K72r0L92j86j40m53L60P2R2J42m45
1434b00J76q3J94M8m8k38o4K97O3J19j55l1o5k63L22J46k21L5N0k08J38J48k57
1457i7N6o3J66J05J25m7k76P9k62J34J68J17j43j34j66L25J30j37k5j97J24q9
$$ y = [26, 254, 121, -238, -36, 120, 279, 109, 43, -259, -40, -124, 276, 183, 232, -143, -69, -77, 51, 126, -39, -19, -241, 291, 297, -16, 88, 33, 41, 113, -6, 197, 106, -99, -231, -285, 163, 39, 31, -338, -214, -13, 64, 39, -19, -90, -215, 51, 49, -215, -103, -123, -173, -28, -117, 264, -8, -170, 133, 192, 25, 227, 409, -14, -50, 57, 266, 194, 4, 86, -201, 95, 266, 254, -24, -174, -152, -98, 30, 126, 231, -44, -221, 65, 32, 65, 236, 60, -92, -51, -128, 226, -19, -274, 3, -74, 158, 118, 112, -362, -265, -307, 170, 190, 12, 147, -47, -60, 244, 52, -106, -151, 74, -155, 215, 106, 212, -147, -175, -150, 105, 234, 131, 19, -118, -140, 129, 87, 76, 108, -216, 56, -34, 358, 172, 32, -421, -61, 11, 103, 245, -200, -24, -107, 87, 135, 87, -151, -215, 82, 145, 264, 109, 78, 13, -250, 72, 218, -3, 32, 82, -126, 12, 160, -97, -41, -104, 62, 167, 292, 245, -31, 48, -214, -80, 88, 205, 62, -72, -238, 87, 217, 80, 55, -142, -18, -107]
1479a07L11j64%l9Oq4K11n2M2l26J80P6l3K29l59L8r2K53k12K92k73J08Jj08l8
1504a40M18l13nN3Mk5L27k41l20L11r5LK69j64j32N0J40K26l15Q3k09k5L73k44
1528B9o0J74k37k30K86K55R6l06K7J29j21R5n0j57l30M32k69K62m2l36L08L3k9
1551d1M5k07J77m2N3K16j02j83K3J70j18J04j46L42k50Q1j85J32r3L2oj98NK35
1575D4P3Q0j39q2n4m4J85JR8q4J56l22Q0r4J25j93N5j61L16j96K35p1j51Q3J83
1600A23o4m3j12J07p9J43J92l33L75l72j46J73J78k75J70q1j92J08J77R7k57J71
1622F0J4j24J57k05J83l22P9j23M38O0m27J58M1M6r9J75k27K50R3k95K73o7j09
1645B9n0K27k22n2mJ21j85J89j24K81j20kj96K59J2l84L20r4j51O6R3K5Lk9J30
$$ y = [-107, 204, 40, 40, 1, 7, -77, 134, 82, 124, -202, -22, 54, 21, 250, -109, -71, -163, 90, -122, 170, -103, 5, 6, -102, -140, 278, -35, -40, 13, 17, -8, 319, 78, -242, 69, -26, -23, 246, 82, -50, 0, 140, 366, 51, 134, -75, -100, 273, 29, -31, 143, -94, -324, -38, 217, 313, 7, 34, 163, 42, 137, 87, -70, -400, 32, -237, 25, -17, -353, -45, -12, -41, 4, -203, -26, -68, -15, 201, 99, -84, -61, 109, -9, 95, -51, 291, 41, 122, -63, 69, -24, 8, 2, -196, -191, 44, 117, 197, 58, -24, -78, -122, 63, 64, 162, 78, 234, -88, -8, -102, 23, -170, -115, -276, 40, -156, 79, 8, -143, -60, 123, 59, 16, -96, 11, -68, 75, 267, -66, 309, -63, -209, -36, 142, -133, 37, -44, -236, -128, 49, 146, -111, 60, 74, -50, 107, -98, 85, -237, -158, -281, 157, 217, -210, -52, -11, 35, -64, 111, -116, 134, 227, -68, 205, 138, 29, -21, 206, -16, -68, -72, 49, -136, 53, -71, 210, 90, 88, -108, 151, 163, -221, 99, 5, -146, -80, 13, 38, 41, 12, 142]
1670A42j97J5K19p5q6q1J41j35lK35m00J05J87k05o9L27J03l83J34J96j02pK8
1693H9j94J51k86L91j3l04rO2n8L72k39J5J4K04l09O2L60m39J57L8k18q6J71K01
1717A32m79L31p3Q8q2J76Kk10J50n7p9M36n85K41j21J23O9l9N7o9j77J60q1j09
1741a96J24P6J24k10P1oJ42j62K60j06j19j48k4J36O0p3O1J14K2q3L3J80l00J05
1765H1m7q2J61j81O7l57O27j88J9j18R6j92J42n3kR0O5K2k54K6j67J32J13P8k94
1790b16M35k63J3Q6QJ7k77K45nj2j63J19n9J17K04j44j6Ln8l09J84L5J25Lj00
1815b8j6L9k0j08K92l42k1J41n8K20k59K85N0j86n5k39K53K04k31J61M7k33qj0
1839a22j2J48m0J96j30j43M6P5l0J36k53P2J95j68J6r6K37q4p0J30P1k83K77j64
$$ y = [142, -55, -40, 179, 104, 18, -63, 78, -57, -60, 175, -225, -120, 67, -138, -207, 120, 223, -160, -26, 170, 68, 61, 89, -105, 46, -240, 151, 138, -166, -175, -113, -171, 201, -38, -23, -9, 195, -114, -52, 308, -131, 26, 64, -154, -240, -69, 132, -347, -16, -89, -1, -83, 93, 95, -115, 35, -22, -101, 335, -250, -9, -130, -7, 62, 23, 80, 11, -166, -6, -87, -196, -72, 4, 128, -82, -11, -17, 125, -37, 223, 117, -2, -150, -174, -38, 22, -51, 10, 124, 146, 63, 96, 276, -24, 81, 34, -48, 113, -68, -1, -358, 269, 81, 100, -18, 78, -114, 28, -25, -27, 63, 128, 150, -104, -78, -245, -113, 0, 78, -216, 219, -44, -31, 55, 63, 80, -197, 48, 43, 31, -132, -13, -72, 45, 249, 105, 89, 92, 34, -275, -91, -56, 69, 72, -28, -44, -5, -25, -133, 159, -183, -204, -63, -121, 99, -160, 125, 175, -11, -66, -305, -52, 152, -79, 82, 129, -104, -112, -122, -134, 14, -26, 170, 40, -103, -57, 18, -12, 124, -129, -57, 138, -30, -14, -110, 127, 43, -27, 103, 174, -109, 168, 4]
1863Dj29J86j19P8J5J21k26o1N4K07j67kr7L0R1m4J18j63l8J04l7k20J79q2L43
1888A45k20K51j85l7K25k96J62r3L3q3J69l0q2j15L12j94J16n4J05j73n5K34j80
1911d5k3J94k74P6J49lj74P0N2k30N8J76K04l01J98q6n9m9J18l0R2q1j81n1q5
1936b85M33j93j88L3L44m7Lj57k26K50J68p8j62K08J15l81J04P5P0k60N4m6J61
1959ej77J11Q2k9K4j57L39k40L16m07N0p1L94j74O2k68J29LK14q3k28K18k03J85
1983H5j99M81j93M7k84m5L4J40j9k55J83j18n5K60q6J58p1n1P9k27L65j94Ok63
2007b22K09q0J28%j3J77n1j57J38j22K0j18N5o2J35m9mP1Q4mj62J36J05m43L45
2032A16k3n3J8k06N5p1L02l3j40K17l02J90J21j58k0N8k22K03J47l03Q5K30l16
$$ y = [4, -125, 61, -58, 20, 35, 156, -70, -131, -77, 130, -37, -39, -136, -106, -15, -59, 59, -104, -142, -38, -75, -295, -116, -198, 145, -75, 176, -9, -46, 179, -117, 45, -48, -15, -98, 71, 41, -41, -156, 156, -38, 78, 24, 129, -44, -99, 135, -45, -68, 126, -148, -72, 77, 74, -100, -30, 22, -208, -150, 26, 230, -71, 127, 41, -18, -67, 51, 21, 113, 32, -149, -200, -285, 148, -45, -233, -200, 144, 97, 100, -57, -283, -33, 135, 57, -105, 103, 218, -163, -59, 16, 86, -174, -120, -166, -5, -182, -71, 11, -18, 6, -151, 188, -52, 264, -143, -93, -164, 230, 56, 118, -150, -21, -18, 196, 113, -115, 103, -100, 85, -114, 367, 174, 221, -63, -108, -74, 66, 47, -208, -25, -143, -198, 62, -24, 134, 63, 12, 91, -136, 229, 35, 41, -222, -13, -93, 35, 35, 22, 199, 148, -9, 129, 7, 27, -91, -36, -98, 37, -12, -16, 55, 139, 135, -27, 109, 214, -229, 116, 93, 40, 58, -148, -93, -164, 138, 105, -35, 182, -120, 70, 191, 33, 13, 71, -151, 52, 199, -104, -19, 211, -105]
2055a05p1K92k6l06J69Q8n6J25j61N3n3R1J5l8q9J79j03J21l99J01K94k4j55K1
2079c7L2q5K20r1j6J03j01J15k8j14j30q1M89l36K93k54L3j99M12r7j38M9n9J1
2103iJ47k23K69j40k28R1K83j68q3K81k34K02r0l00Q4L22n18J32J04J89k96N01
2125C16l79J01K3k53K82k53K55M8k07k29N12k31J46J45j05j34jj32K25k25K95
2146A99m10J1L52J5m4o3k81L20M4l41J42K56ro9l70K16M8J55k43K80l28N6j3k43
2170c20M47j70%j61K75k11J91k60L93k9j14j13J81l49M11k68J14O7J41k26n8m1
2192a00K6J99m15J45J54j68NJ73J21L0j42J67k15j61p2L39l36L05J71l90J65l0
2214b9P2q5Jj66K36N6l54K23q0K02l9k2mq7O9l8J93k3j69J61R2j87r1L74l28K56
$$ y = [-105, -176, 116, 90, -216, -47, 41, -15, 110, -51, 2, -51, 40, 55, 17, -72, 107, 4, 125, -274, -173, 121, 97, -58, -37, -5, -90, 130, 39, 23, 126, 25, 140, 112, -2, -132, -213, 276, -60, 233, -21, 12, -187, 225, 128, -10, 39, -20, -9, 138, -85, 184, 44, -184, -93, 190, 22, -61, 220, -14, 188, 98, -202, -118, 204, -314, -182, -78, 111, -185, 316, -63, 38, 61, -192, 90, -163, 92, 140, -67, -296, 216, -15, 131, 276, 171, 37, 36, -96, 129, -96, 199, -211, -200, 152, 167, 123, 60, -221, 99, 143, -198, -56, 200, 191, 122, -248, -32, 16, 171, -72, 208, -120, -64, -77, -320, 127, -43, -43, -204, 71, -140, 51, -209, 184, 155, 41, -72, 109, -240, 171, -97, 17, 84, 225, -1, -59, -100, -74, 125, -290, -145, 9, -159, -154, 19, 140, 170, 28, 195, -20, -181, -253, 86, -250, 55, 226, -164, 1, -29, 43, -42, -41, -207, 29, 85, -269, -46, -126, 76, 37, 15, 11, -76, -7, -45, 148, 125, -44, 117, 209, 22, -69, 305, -23, 233]
2240B33j53j84q9J20J97j20J10k72J95l06K66rl18K58n6N7J59j73k10J56K81j3
2262A29q4j10R8rp3q6L85kl13J22nK1k15k03M57k65M44k68j4J79k26k23K01P3
2286A3K00k60j29J01L63n12J40lJ13k2K1m3R3k53R5J28j96O9j44K26m9J02j51
2309i8R5L0o6K32l39p3M5rM64k49o0j5J21k86K54K04nj69q2q0O6Q2j37k0J09m1
2335b7k3J67k67K31k16k17K97l4J65j02Q6j1J86k05j67K21j90n4M1q3K51J34J19
2358C02n12K90k18K73K5j9l34R6K65j30k12L06l3j39J20O1J32l80J94n1l5N6K0
2381G7k71L99l70K34j38J54j65kL14l82J35j8J52Q8k43J97k05j11R6J56nO4j8
2404A38j01J6J82l71J28p9j45M06j49O4k31J52l14K53K38j06r5J44j90j8J6oq5
$$ y = [233, 80, -104, -193, -73, 124, 4, 114, -158, 37, -269, -3, -12, -330, -72, -128, -71, 88, -85, -295, -139, 142, 129, 45, -65, 33, 24, -49, -135, 250, 248, -65, 57, 52, 73, -142, -345, 112, -153, 291, 23, 9, 188, -38, -261, -60, 13, 213, -47, -176, -75, 288, -224, -84, -87, 26, 4, 25, -18, 75, -178, -83, 45, -151, -82, -226, 0, -49, 53, -98, -3, 27, -39, 193, -146, -219, -174, -183, 281, 32, -28, -43, 78, -208, 46, 250, 245, 76, -6, -86, -20, 62, -75, -95, 14, -27, -50, 117, -150, 81, -135, -352, -55, -89, 76, -26, 60, 49, 235, 30, -137, 84, -106, -160, -119, -202, 49, 183, 302, -210, 80, -138, 135, 160, 141, -193, -97, 168, 38, -174, 132, 99, -40, 80, 141, 273, -107, 87, 36, 1, 57, 77, -194, 205, -165, 69, -69, 85, -80, -82, 232, -150, -15, -33, 119, 207, -36, 161, -44, -155, -59, 97, 92, 156, 138, 37, 53, 235, -136, -8, -87, -232, 174, 25, 89, -142, 10, -304, -51, 187, 81, -14, 130, -60, -78, -62, -68, -153]
2427a53K55m7jK41m48N1o4J18J07k8Rj06m7K60ll65J27mj4k5J08K96l44M6J12
2452H1N4l49L92l54K66k44J02j07R9J8q9K36nj90Q5j21J37L7j70R8K5K34l28k5
2476a18J53j4j5k88L06r1j4N7K20m22J03K39J48j05k69K05j62m0K34J08n5j85
2498ej3J14j64Q0R4j72J0J84r6k2j99O3J42j27K02j07Q1j44n4K40q3J4K05j23
2522A20m8j32lm7J76J50o5P9o5k38L4nJ57J28l0k84J6R3q1j45K68Q6j52%j2M1
2548D1k03K12j9J19m58M15k1k84L35K11j21j14q8P8j61J08k04P6J24J14o7m9J00
2571A44k11O6K7j09k48L37M4k76L14o6j60J06O0j16n3K2J38J57k38j0J33m4k17
2594b00L28L4l20K42l8j57K65k71J14J64p6j11K66k43N2m7q9R9P2M9j69K4J96
$$ y = [-153, 102, 55, 54, 295, -153, -102, -166, -48, 59, 31, 40, -66, -113, 147, 144, -221, -94, -98, -112, -137, -29, 267, -77, -31, 81, 135, -214, 178, -176, 90, -154, -52, -159, -60, -42, -131, 105, 100, -90, -5, -126, 11, 48, -122, -24, 1, 235, -93, -118, 35, 21, 6, -282, 24, -67, -81, -24, 196, -226, -123, 116, 264, 159, -110, 95, -67, -107, 127, 235, 180, -5, -18, 96, -68, 12, 106, -66, -56, 128, 32, 10, -189, -126, 16, -111, 91, -16, 65, -79, -133, 107, 24, 38, 243, 120, 72, -60, -63, -110, 66, 216, 151, 230, 165, -73, -39, -44, 113, 241, 211, -73, -57, 36, -45, -190, 78, 164, 12, 12, 0, 41, -162, 50, 31, 150, -308, 107, 86, -198, 137, 348, 227, 113, 25, 103, -58, 50, -154, -78, 46, 160, 93, 44, 144, -67, -1, 26, -83, -331, 6, 50, -226, 88, 22, -138, -32, 28, -88, -141, -119, 19, 176, -62, -72, 61, 17, -200, 128, 162, -158, 84, 46, -111, 154, -117, -3, 161, 85, -26, 240, -3, 49, 2, -87, 12, 84, 133, -36, -12, 184]
2617A84l41J95N3m3O4j97J98o4j3r0l9o1L38j95O6k70K78J42m14K19k37K07O7
2640D7j93j5K73j71J60j41M4N8k39K22k7k55J77o4J28J33k50K29k36k3J07O8N8
2663I0j24J35o6j28J98j73J19P5K1l42M34l51J95j45Q7L7J71j47l3M1K09l26J14
2686I1r6J85j34jk46K92J18l17Q8k58L46k02K6L5J51m8M8j91P9q5J59k06J73l6
2710b9J10K5k69j03L94k69J01J7J33j86J80q6j2j77Q9L59k10O7j02o9j16K36M2
2733A25p9J25k18qJ35k05j28K53J30J5j77q4p6P2K28Q7k66j17J36K36m08L54P4
2756B04j5m0l29J42m7J49q6O3m07K82J17j24j5K98k03J5j27J39rk06J8L17l28
2779a92Q3P9J98j31J71l90K19J41l37M3K36l01O9M3L09j98o5j14J88M7O0J06j81
$$ y = [184, -157, 38, 91, 48, 112, -85, 113, 49, 36, -54, -93, -154, 184, -11, 55, -215, 63, 205, -209, 10, -227, -20, 47, -146, -161, 112, -59, 101, -40, 4, 62, -177, 45, 18, -237, -60, -124, 4, 137, -113, 116, -120, -143, -36, 32, 90, -34, 101, 35, -93, 105, -68, 51, 126, 147, -195, 239, -112, 83, -62, 25, 62, 233, 86, 53, 94, 303, -23, 91, -5, 180, 46, 45, -201, 91, 209, -108, -20, -278, 68, -134, -108, -73, 78, 30, 78, -113, -34, -119, 40, -166, 7, -29, 81, 106, -163, -266, 128, -141, -40, -23, 110, -76, 104, 18, 6, -171, -82, 277, 67, 134, 32, -37, -153, 83, 125, 46, 171, -47, -55, 80, -125, -253, 0, 130, 145, -32, -116, -192, -120, 108, 195, -71, -188, -52, 184, -224, 130, 204, 189, 149, -180, -38, -85, 64, -22, 41, -366, -84, 33, -91, -106, 192, -11, 4, -123, 16, 7, -199, -181, 136, -192, -109, -30, 168, 37, 208, -182, 37, 178, -159, -116, 120, -181, -112, -69, 240, 42, -23, -137, 51, 98, 158, 264, 83]
2802H3j20J5k58K49P7j63r1J62R1qk5j58O6nJ87l70K06oO2K3l8p4P3j13J77K1
2828F3N6N2O8l19J99k45M6K10l55M16k54Q5l12K22J4j2K82l42L4l5J69m8k37L82
2852A39J5r6p3J47o9k67KK68j45R2r4L34j54j59j10J81r3j69J04J99J7R5j92m3
2876g1R6o4P4j66K67j33rj4m2N5o0J61k16J67j61L3L01j76K4j38K1l6J01P2P7
2901A63j94M17m99Q1j36O72m36j91K67j98J75j11j85J94P6k7mk34K26j75J29o4
2923e4J46M2n5k38O6j78M2M41m68L71k72J29q3o5K81j67M6J02k38P1J2J9K45j43
2947E2m9R3l27J74K3Q5q7O7j05N8L55j96k89J58r8J54J57j82m9P7j53J49l50M69
2971A86o0k06L35k18j65rK55j48j89K78k06m3J67j53j31K31P9q4J52l4n1j33K06
$$ y = [83, -37, -22, -280, -31, 46, -117, -208, -46, 45, 37, 12, -146, -80, -85, 102, -268, -62, -68, -6, 17, -21, -95, -22, -135, 42, 63, 119, 171, 239, -80, 119, -126, -80, 130, -225, 191, -63, 22, -290, -68, -54, -66, 216, -126, -92, -127, 42, -6, -243, 139, 154, 58, -15, 132, 63, -204, -202, 66, -79, 13, -81, 253, 99, -60, -170, 11, -82, -251, -147, 52, 69, 164, -28, -71, 25, -39, 35, -131, 136, 3, -6, -20, -62, -7, -67, 94, -122, 45, -116, -83, 218, 42, 66, -72, -51, -87, 14, 86, 163, -31, 386, -113, -32, -168, 504, 68, -123, 144, -54, 121, 10, -175, 19, 95, 68, 64, -170, 56, -119, 10, -54, 92, 134, 79, -159, -93, -271, -229, 212, -256, 115, -157, -28, -111, -176, 105, -62, -16, 86, -152, -81, -69, -50, 195, 52, 3, 96, -231, -57, -34, 51, -36, 31, -74, -16, 339, 143, -146, 12, -86, 68, 225, 43, -6, 71, -82, 67, -283, 186, 126, -80, 255, 37, -128, -137, 118, -30, -219, 59, -147, -190, -23, -176, -307, -76, 3, -81, 71, 37, -14, -147, 59]
2994E9K26l02N5j29L3R8mO6J8j59Q3k31P9K48k60K34j59L10k39j54n8L88n1j01
3018E0l80M24p8j7Q5k51K28l6j63K35j65J88l7pl8o3J6j86J15K12n1J34n10K07
3042h8J0Q1n2q1L9J30J3k36L34q6j87L27r4j10l88K39J84k7n8j44J15L7J75j98
3066f5r2J31j94J42m8l6J68m7J12j94o3J50j44K76p3q7J4M93m40k5j26J38lk73
3090b86M42K2n7k92L16n0j33N2j7J9L7J0j94lJ50J5J39j81k18P5K36j30Oj88n1
3115b81J41L8r2p1J9J4J22K59OQj26M6Q1k54K89k49Q8J78k61K82k41j42O7MJ4
3140f1qK49l33j70K63J42l4J03k23K94k64M8M3lj07J38m7m7J77q4k4r9K51q2J03
3165B25k29j27n8K50r6j99J2JJ32PL3J07oK04m17j9J2J07L5q2j02K45r7O7RL24
$$ y = [59, 285, -17, 38, -91, -58, 40, 36, 102, 120, -39, 44, -187, -108, 140, -120, 114, -45, 265, 26, -128, -186, 202, 151, 50, -330, 94, 16, -1, 84, -167, 61, 25, -138, 97, -68, 120, 83, 76, 38, -25, -9, -195, -80, 132, 81, 215, -295, -88, -78, 3, -49, -130, -91, 39, 52, -184, 150, 64, -123, 204, 110, 0, -388, -149, 35, 8, -50, -194, -79, -42, 133, -65, -157, -26, -220, -78, -126, -162, 6, -41, 71, -123, -186, -36, -180, 96, 23, -64, -50, 443, 3, -22, -148, -10, -13, -286, 156, 178, 121, -171, 145, 95, -38, 14, -3, 16, 53, 63, -131, -134, 16, 31, 170, -11, -229, -154, 82, -48, -42, -230, -281, -140, -102, -194, -265, -246, -232, -110, 149, 155, 163, 37, 83, 164, -90, 199, -50, 38, 216, -45, 237, -4, -146, -79, -75, -61, -69, 180, -153, -323, -60, 82, 48, 151, -72, 222, -42, 6, 49, 46, -61, 77, 30, -17, 160, 76, 52, -47, 204, 122, 225, -4, -131, -189, 61, -35, -234, -222, -221, -89, -82, -49, 58, 52, 256, -161, -180, -168, -61, -26, -108, -210, 35, -62, 5, 14, 338]
3191C38k40L3k10K13p2P4k27l4J06j76J77J09j16R5j34K57k04Q1j29L7l8J24m04
3214c40K28J39K9J00r0M4j00k83J15L18j53k01J32J77j68K49l20J42J0o4j5kk22
3237b75K98L7j1k78J72j33K72j70n8M29o7k23k05L76m22N6n9lJ70L43j54P2k2
3260A45k80K18m9Qj99J7J36J48j05j5j64K82k37J70J2k49oJ82j11q8J12L64l07
3283a6m3q1J2K25M4j20N8n5k2k18K98k48kK14K0m0p3J40m7j01P8K4j11r9J39L0
3309FP9m3J5j49J44j20j7K9J65j51K24l0l10J57J04rp6P3j54P9l5K7L4j6j36O1
3335d9L5r1J40J71l13j2K26j81K21m27P6L38j48r1K12j74J20j90P3J05J68j48
3357F1o0r5J00j63L67R3l97K47k24L63k89P0j8o8j08K04j11k13L25Ro4j26m2K23
$$ y = [338, 98, 131, -79, 134, 62, 136, -91, -125, -19, -195, -18, 91, -25, 70, -64, 193, -11, 70, -59, -22, -60, 64, -340, -112, 27, 56, 156, 66, 110, 10, -273, -158, 160, 7, -194, -62, 115, -53, 196, -124, 18, 28, -36, -51, -53, -275, 23, 60, 49, -229, -57, -190, 82, -88, -146, 283, 216, -7, -212, 164, -258, -202, -261, -264, -94, 249, 95, 167, 145, -135, 83, 34, 42, -157, -140, -4, 144, 39, 24, -140, 142, -95, 75, 87, -162, -168, 14, -97, -185, -73, 291, -16, -59, -140, -128, 97, 141, 21, 79, 24, 2, -216, 82, -166, -168, 46, 66, 26, -47, 93, 46, -55, 23, 47, -64, -163, -24, 6, 85, 42, 57, -92, 52, -68, -85, -56, 109, -42, 182, 152, -158, -1, 103, 94, 18, 91, -63, 16, -19, 8, 42, 26, -110, -49, -14, -105, 35, 206, -107, -119, 107, -74, 147, -280, -204, 134, -14, -105, 107, -67, 53, -137, -64, 41, 209, 61, 1, -94, 6, -157, 210, 303, -94, 153, -71, 292, 3, 73, 55, -13, -121, 83, -28, -241, 84, 93, 29, -97, -139, 84]
3381H4k4j7Q2m2k35j57K60l3r9J00L4l5M0J34Pk05J44P3K25k14k56K69Rr1k4j76
3407a47K11j02K49m85L00p2j36K13J17o9m0j82J37kK0l7r0J53J71q4j34k5J14
3430H0Q4j36J54l19K96k91J07k7J10n4K6p2P4O7p8k5k9k58L38L1M2m4K30j19j87
3455@L8k39R6M16m39lJ66M5l22J51J89j29k2J71l8j72Q0K46k13k87L41l34N26
3478B67k34J8j40J21p2J13j70K82j18Qo9QjJ81j16k05J41k20OJ20j54K11Q2jQ3
3503A41j34k33L9J65j1N5o5M61o17J40o9k99N17k9%j48L21n2j75K80l74J93q4
3526B2K6ol8p1k8J95k07M5k69N34m48K58J4K40l17Q4j19M2K07k25pJ47j5j9N9
3551A04k07J11J01P9l27K8R4L02k71R1l0r8O0r4J59k15J45r3kJ53N6j66J32j78
$$ y = [84, 60, 43, 125, 83, -152, -309, -49, -82, -181, -81, -47, -82, -42, 92, 99, -106, 38, 111, 336, 122, -134, 135, 144, 53, 29, -147, 64, -38, 211, -274, 26, -46, -182, 31, 148, 79, 39, -143, -6, -8, 12, -25, -115, 38, 209, 125, -9, -34, 80, 164, 28, 182, -137, 159, -132, -25, -52, 58, 4, 30, -42, 32, 99, 21, -4, -33, -291, 47, 78, 120, 76, 306, 187, 0, 38, -201, -105, 311, -128, -131, 35, 80, -242, -91, 98, -31, -53, 118, 80, -92, -12, 234, 21, -266, 75, -259, 267, 33, 51, -89, 32, -40, 73, -97, 185, 67, 75, 6, 14, 13, 194, 78, -127, 14, -206, -200, -80, -234, -23, 59, 58, 141, 7, -226, -187, -22, -33, 22, -43, 418, -199, -59, -128, -427, 90, 61, 61, -87, 234, 182, 7, 287, -87, 106, 22, 48, 42, 4, -67, -95, 100, -107, -62, -331, 203, -245, 13, 27, 267, -50, 34, -85, -43, 164, -61, -68, 79, 64, 45, 104, -103, 8, 109, 188, -139, -111, -17, 285, 14, 105, 75, -23, 37, -57, 102, -113, 32, -61, -63, 90, 146, -20, 112, -66]
3575f6Q5p1Jr9J71J14j52J04j41J21J4j47K05J71n07L45pj96J0J2k63K95j51K62
3599A10j6l62K15k2J09L9j05K1k6M4J8K12k14k60M76l27k34L01J55l78K07J64
3621A27o6L7K0o3k94M93j92n7j30j31K38QJ1J39m4j67J03L8K4j41J86j14j24K68
3645A69o8J5P7j77Jl7J54j42K7Km7Q1j74P9j05J96n5N7l2o7j9J43j44j7K02J8
3671A37j67K07j66J68j96K40k79L56k70K36j90q9j42ONN9K32l42K7K51J64j38
3693A09l34J81J83R7m31K41K9m16L94j45n7L5K02q1p6j69L12pLq2j4K36q4j29
3717cL0k06J20K3K66k81m0N3R5M9q4j18M6K05j40L2l91K10J78j83J81j57L8k5
3741a02J31j61J6K76o3n9L6l1k07K71k37K06p6P8J11m32L54o1M7k71J00O4r5L28
$$ y = [-66, 19, -52, -51, -150, 21, 135, -17, 87, -54, 67, 81, -66, 139, 310, -197, 148, 141, -55, -45, -33, -296, -1, -152, 110, 94, -268, -53, -75, 34, 73, -32, -11, -37, 7, 25, 237, 23, -237, 239, -88, -322, -21, 134, -244, -37, 127, 61, 98, 118, 55, -239, 254, 62, 5, -125, -256, -18, -10, 1, 140, 96, -71, 32, 70, 94, -47, 139, 25, -99, 169, 101, 116, 193, 16, 17, -20, 134, -8, 19, 21, -26, 55, -119, -40, -145, 51, -4, 53, 21, -46, -65, 78, -66, -83, 119, 137, -30, 177, 11, 179, -17, 223, -56, 300, 30, 266, 76, -13, -155, -149, -144, -85, 147, -195, -168, 83, 247, 109, -225, -44, 139, 236, -195, 46, 75, -341, 53, -92, -149, -114, 88, 7, -69, -238, 74, 67, 70, -12, -26, 210, 126, -3, 27, -179, -59, -36, 230, -51, -91, -38, 57, 106, 22, -96, -50, 155, 15, 47, -344, -134, 44, -139, 42, -115, -77, -102, 29, -132, -116, 160, 97, 38, 74, 43, -164, 107, -130, 76, 0, 78, 189, -243, 111, 50, 97, -174, -74, -10, -105, 223]
3765B23l72m7K20j7J62n14K84J1K00j11j02OJ27o9rM1J57k53L0KQ4o2P2Q5k46
3790i8L3l32K76J98m4j74P5J64l8o3j81M6K23k76L13j86J21q7M07k20l13M6K18
3813A08J04j09o7J74l45K85rp5l38K57k23Q7J9J31J42k45L5j0J8q5J47j14j16
3836b29K19K73l87M32n98M61m7l4J68j98k05J05n6j16K61l13J66N3M7j12K22M0
3858A52l81K6K31m5l2r4o1L94k51J32P6p6P9j33nP6q3Oj67k71N33q7Q3n7J7j10
3884d8o5Q0L8J71j41m7J49l19K25J01k36L22k7l55k6L13k33K77j43j3n2J41j52
3907d0m5J20j9n0M9J88l29N2J16j03J34P9j24J99k69o7L60k83M4j35J81J45k49
3930d6rK35q9J9K8j90L0j3K24m21K21Q7j81q1J89j07N3J61j71K2N3k06m9K15m0
$$ y = [223, -149, -196, 24, 7, 169, -345, -61, -50, 150, 39, -63, -57, 70, 1, -8, 33, 190, -63, -33, -31, 53, -9, 63, 148, -98, -65, -397, -121, 77, 33, -141, -66, 98, 60, -3, -184, -138, 85, -191, 122, -64, 57, -30, 377, 157, -156, -110, 108, 212, 103, 36, 210, -135, 150, 141, 66, -272, -15, -238, -151, -132, -1, 141, -104, -69, -79, -61, -146, 1, -113, -229, -10, 263, -124, 308, -290, 171, 124, 90, 258, 60, -145, -40, -96, -212, 49, -264, -98, -45, 2, -110, 112, 152, -229, -203, 28, -17, -49, -143, -204, 190, -61, 71, 147, 71, 150, 17, 12, 88, 5, 11, -156, -427, 106, 19, 102, 45, 62, -48, -113, -33, 5, 176, 35, -12, 137, -182, 43, 144, -92, 230, 203, -152, -178, 135, -98, 179, 36, 23, -29, 112, -40, -85, 35, 16, -34, 15, 203, -126, -74, 42, -61, 73, 152, 28, 227, -42, -109, 251, -32, 12, -123, 58, 203, -46, -55, 180, 91, 110, 138, -52, -22, -35, 189, -232, -11, 76, -105, -186, 3, -104, -51, 110, -61, -39, 14, -192, -241, -26, -66]
3955f6n8L9P1K75l70L61J01l42J13k12Q1R6k79O8J10O4M3k9J64m51M8K97k18R6
3979BL6Q7j36l8K3J99j57J72m55J7J85O1k92L16o5J07j65q1K8Q3J04r8L58l82
4003i1Q7p4K29j91K78j88j04j00M9J56p7K60l43K33j75J20j23k09K98l7m7j5J5
4026d9N2P5J7j53J11k6j4j8j5J53J4k03m5J62rp0j51J43L93n41O8K84l29L23k60
4051h8J18R6j42j24J28j17J87k42p8J78J5J68k14ML29k89K12j62K14j60N2k25
4073a40L51J1k98Q1Pr8k32M09l38L28J7l39J90j13K26n4l21J64J70l7M0k28J90
4096a4P9k05L31n1j06j99J76o4m4L23k44Q6O2j91J52m9k43L97k00R0p8q1q5K91
4120A33o2m7jj61K24n0k63L00J9n6J76m73K43N7k22r4K75J18r2r1M4J33j41J06
$$ y = [-66, -124, -85, -14, 261, -109, 252, 353, 11, 124, -88, -7, 89, -190, -122, -12, 52, 95, 66, 230, -221, -173, 124, -94, 2, 38, 125, -11, -49, -26, 173, 16, 188, -267, -250, -65, -4, -296, 20, -45, 62, -103, -184, -156, -73, 31, -67, 291, -91, -4, -78, 151, -40, 238, 50, -54, -154, -105, 51, -26, 234, -109, 124, -51, 69, -54, -263, 35, -2, -49, -64, -49, 3, 78, 95, -58, 53, 27, 13, -5, -20, 133, 147, -56, -101, 61, 52, -18, -169, -26, 367, -174, -106, 178, -151, 172, -88, 30, 126, -16, -140, -12, -129, 58, -184, -262, -84, -69, 99, -115, -111, 218, -71, 141, -21, 193, 33, 85, -140, 211, 222, -76, 5, 12, -86, -318, 91, -247, 81, 98, -241, -51, -164, 62, 8, -313, -149, 21, -16, 24, -204, -14, 65, -140, 191, 140, 34, -165, 11, -53, -97, 226, -18, 68, 130, -61, 91, 42, -201, 196, -4, 86, 8, -73, -158, 133, 71, 24, 23, -138, 86, 36, -227, 73, 92, 36, 212, -261, -18, 39, -183, -277, -2, 116, 24, -67, -23, 110, -31, 75]
4144G5j87R6j12J20J01m4j11k7J27N0k83Q9J25J22l05K94l11J26K5m3K32n2j51
4167d4L9q7lM6n1J27p1O8P5j39n3L41j70j56L26q6k31J16J14k67J43J20k41p3
4191a57J53J27M8n10L10R2P3j14j84K73j92K40k81K18k35N7K56Qk46J35j84J4
4213i9K20k9P2k63J99l8r9L46l78N0M9l32O12k87O3K4k98M8M28j60k65j07Q9q
4237a63N2K35r2J68k62J23j94K34Ok5p8j30j6k9Q7q6O3K25L8j44m6J91j04R0j88
4262d5j90L10k44j2J67J47j49j48L17j00L1j46rR9j55R2k85L72j11o6J89Q6k48
4285i8J03j10R5q3m3K03k60N8Q6J23k48K99k76J78%J21p2l24K53RJ8m4K71k50
4309Ioj04L92k97M7J57j79J53Kn0j76l7J90j30L6Rj59K29l6M0J17r2k93J46J3
$$ y = [75, -112, -16, -128, -8, 93, 49, -62, -89, 38, 88, -195, -106, 19, 141, -164, 130, -181, -55, -30, -73, 159, 107, -44, -5, -92, -95, -49, -100, 27, -44, 24, 99, -40, -93, 248, 78, -78, 248, 162, -69, 47, 161, -106, 37, 157, -84, -157, -4, 123, 171, -339, -29, 63, 136, 22, -162, 111, -81, 159, -122, 96, -139, -82, 174, 182, -64, 71, -113, -99, 121, 92, 164, -99, 100, 62, -37, 309, -69, -19, 30, -302, 310, 23, 86, 110, -188, -140, 288, 128, -137, -244, -155, -163, -111, 124, 32, 200, -62, 61, -133, 101, 107, 82, 4, -126, -142, -171, -84, -170, -107, 118, 156, 12, -34, 157, 53, 143, -45, -235, 75, -169, -181, -14, 133, -16, -164, 153, 53, 84, -62, -71, 28, -127, -35, -320, 52, -59, -125, 64, 150, -98, 5, -105, -10, -93, -136, 67, -193, -135, -49, 74, -174, 125, -151, 27, 27, 148, 76, -248, 5, 14, 32, -12, 259, 9, 3, -101, 291, -6, 41, 198, 19, 172, 174, 124, -52, -89, 101, -29, 7, 16, -143, 86, 50, 90, 207, 115, -178, -32, -19]
4334a9OJ78j00M4O2m05M26q8r3R0L6k29J18M3k25K75j01K2j16L8j9l9K63j23L7
4359H1j23j65L22k32J16m2k23K75j34K2J97q2O7q6k93J88k2J95o4J9j20K9K07
4382A32l44K32R3J61n11R6L82l75J32o2O8j20J67kJ61k53j01L93l73J51q6J41
4404H2j36J89n8m8J97k04N4J37k58O4J4o9l6J18K2j72j4K48l1j59j9Q2k89K62
4428b4j50J83m7o3J3M8J08l5j08J14o9j22K34M3n9k07q0K78j80K26n6J55q1j81
4452f0m1l0M8R3N8m87L46m7L23l78L90l46K80j77p3J44O1k9r7l1J39k06J03M5
4476B8Q5L0j98k7j76K92J83l87J96k12K42n3O6k82K16m9j72L04l00K71q0M1RJ1
4500C8j50K06m7Rk17K91k45L21L3n63N75k82L5k80L04K33k94Q9j21J6j14L95l78
$$ y = [-19, -13, 165, 65, 109, 171, -234, 192, 104, 11, 101, 137, -92, 26, 69, -156, 119, 18, 40, -76, -38, -57, -96, 167, 44, 81, -42, -207, 115, -117, -1, -43, -266, 9, -125, -103, 94, 12, 79, -7, -300, -112, -134, 61, -3, 16, -104, -75, 132, -212, 20, 113, 274, -237, -141, 241, -134, -2, -64, 4, -116, 51, 49, 210, -43, -144, 249, -124, 27, -59, 82, -54, 135, 77, 29, 226, 22, 76, 213, -45, 19, 33, -36, -72, 46, 68, -104, -118, 130, 99, -60, -79, 3, -286, -24, -174, 9, -38, -101, -88, -40, 68, 33, -75, 39, -30, -152, 82, 125, 66, -141, -221, 57, -123, 103, 47, 202, 121, -60, -101, -131, -83, 10, 68, -419, -73, -120, 203, -175, 215, -131, 149, -28, -101, 43, 104, 75, -22, -53, 86, -120, -17, 28, 113, 143, -55, -82, -258, 34, 217, -170, 26, -186, 56, 3, 69, -213, 3, -46, -218, 86, -214, 57, -23, 18, 27, 38, -112, 94, 47, 56, -161, 130, -115, 206, 239, -324, 251, -31, 4, -276, 28, 261, -33, 56, -65, -49, -163, 232, -146]
4523a46K91J8J6k19J02j31J70P7l40R5J59k42P4J2P1J32k48J10K4K5j52j7L15
4546A96j08j22J24J03l89M4J41L94l66k6K84k85OJJj84J67O3k87L29j95j17L90
4569A64j16Q7j92J74J15j75J0M0j0j74L0M5k6l8N8k05L17l18J38O3P2RM5L5k13
4594f5o9P6P7M7J20k56R1N9O2j73K8l8j28L29j22J22p7p7J31R2l28n9R2K01k06
4619g1j16J28J45j45j4j10K04l0k1J76P3j49j18K5rMJ71j97M9l6L67k56q9q9M1
4644f7J82OnO1j51R7k16M0O7q4J29j45N9n2Q1J04k40J77K4K39m10q9k8N5J84Q7
4670A05O4M6p5L5k71J8Q8Q3J29k59J86k14J91m7r7k31J17PK23j3p4O8j04P9k19
4695a65L82j42K8q0j7J34j32N8m1j0%K0j19j12J71j26J48J80k21p8J25m5P5K64
$$ y = [-146, 145, 163, 179, -40, 62, -69, 101, 178, -162, -67, 92, -150, -76, -64, 7, 139, -109, 1, 25, 50, -102, -119, 196, 88, -34, 90, 193, -196, -152, -11, 383, 17, -9, 275, -10, -4, -3, -2, -186, -19, 44, -243, 86, -109, -226, 164, 48, 135, -57, 117, 232, 57, 67, 107, 97, -77, -47, -2, -28, -66, -8, -213, 104, -214, -76, -13, 59, 68, 113, 148, -65, -134, -58, 19, 66, 186, -70, 21, 80, 142, -31, -3, -41, -169, 160, 38, 160, 83, 6, 137, 229, -99, -158, -66, 135, -71, -187, -59, 86, -59, -73, -183, 21, -9, -30, 146, 219, 70, -48, -23, -32, -28, 143, -54, -5, -41, 326, 70, -19, -108, -67, 115, 121, 116, 177, 26, 123, -93, -53, 14, -70, 59, -86, -27, -79, 2, 106, -134, 43, 67, 306, -104, -193, -221, -166, 18, 105, 169, 215, 140, 175, -96, -78, 10, 93, 222, -37, 149, -65, 126, 79, -18, -249, -132, -125, 98, 85, 11, 79, -25, 54, -165, 217, 75, 103, 23, 6, 140, 8, 66, 25, 15, 15, 35, -84, -196, -25, -151, -3, 177, -44, -122, 3, -42, 33, 297]
4719B97n45L02j2k26J51L4P0j90L67l53K57k34J57r5j95J84J62k11J73J13m93
4740b87L38k7R3j42j97N15m18n0J66R8k11P9J3m8O4j37P3K78k39L8K12l92J24
4763e7M9j23L79j8j88L4mm63L92j56q1L34p9q8K13l6l13L38j82J90j29j23J72
4786F1j4J07Jj43j16r1K50P5r5KJ47j92O5k5o9m9K47l32J22K6j45L88j04j11M6
4811E1j24M7J41j17J21k16J45j68J41m2j14j20L03P1j78j61J01Q7j3L6J57L0j41
4834C7l30K52R7q5k3J82l19K09j08k7N8K00j76J2J42pj69J87k27m2P9L37l94J83
4858F8rj58J01k8j1j90K37p9K67j79m9j87J94J20m9k05o8J64J88r0j30j30K44
4881B1R3l27n3L21J66q0J3m9j24p7q7J78J9L12l04l21M00j76J02l93M73k85J68
$$ y = [297, -248, 54, 42, -184, -33, 1, 71, -119, 248, -105, 152, -82, 75, -20, -215, -31, 131, -80, 93, 206, -287, 51, 24, 117, -25, -222, 293, -125, -175, -9, 89, -122, -43, -30, -78, -14, -151, -78, 200, -39, -1, 211, -181, -57, -8, -131, 248, 230, 42, 76, 72, -391, 1, -155, -236, 98, 19, -69, 144, 108, -205, 133, -49, 141, 12, -111, 61, 47, 154, 155, 12, -104, -195, 55, 130, 35, 37, 184, -8, 57, 32, -37, -86, 161, -171, -49, -23, -168, 220, 116, 5, 51, -73, -26, 115, -2, 119, -97, 48, -120, 21, -21, -135, -255, 48, 119, -59, -220, -119, -32, -45, -9, 148, 178, 37, -293, -41, 56, -29, -52, 130, -189, 20, -88, -115, -57, 143, -33, -21, 121, 114, -55, 132, -95, -137, -58, 279, -115, 68, 59, -99, 2, -26, -37, -227, 10, -69, 198, 19, -30, -217, -23, 97, 48, -157, -225, -61, 127, 37, -93, -223, 21, 114, -213, -266, 55, 221, 141, 154, 105, -19, -96, -183, -5, 14, 326, 22, -299, 101, -75, 27, -366, 107, -178, -10]
4904a0n1M3P5q7K22j72p5J68Jk31J29J48j46J5O0K68m49k3J55j24o2M2J77Jq5
4929a1j76K55j58j76K11J42n8r9o3o4K43K4j95L8l1K72k00k3J11K0Jj28J30k20
4953a55J30O2J46j31k20M8J63J06r8m2L2K2O3P0m21L24P1j32J05J8j67j70K35
4976E9K04K1k71Q9j00j84K12k36K92M1j86J91j70j21L89p0k8Q6l23M8J30K64m47
4999a10L32m76j6K55M5L9j39J0J90j96j24M08j94o5R2O4k65J76k19J94l41K32
5021a08j72K28R9k11K43k02L49k27j11R0l0k6K33j50j72L66l03k8K20j34p5J15
5043fr4l2L53p3p2Jl60J89r9J44J93k50J48N4J43k41J30P6j78j04lJ55k93K10
5067iR5ll2J31l36J50k1n3J03j28K39m6j24k26K72j75K48k76L16j04J56k83Q6
$$ y = [-10, -61, -18, 57, -30, 192, 20, -55, 113, 114, -117, 12, 160, 14, 29, 89, 357, -92, -115, 40, -84, -146, -104, 73, 74, -11, -187, 68, -90, -266, -55, 87, 29, -70, -133, -197, 46, 70, -125, -87, -118, 154, -46, -69, 42, 62, 63, -65, 65, -155, -25, 37, 183, 52, -168, -120, 43, 149, 51, 9, 41, 63, 126, 196, -225, 99, 170, 38, 143, 161, -6, -176, 59, 263, 284, 13, 102, 2, -182, 30, -206, 86, 127, -59, 132, -38, -159, 230, 160, 132, 218, -105, -57, 73, 337, -110, 222, -254, -270, -15, 30, 69, -70, -60, 130, -66, -190, 218, 24, -41, 51, 115, -150, 26, -193, 1, -340, -108, -280, -52, 47, -164, 79, -123, 226, -1, -112, -22, -52, -78, 155, 5, -167, 199, -104, -132, 88, -46, -121, -6, -100, -132, 221, 148, 76, 77, -283, -94, -193, -49, 144, -106, 42, 96, 239, -2, 128, 204, 26, -78, -81, 74, -219, -9, 86, 83, 51, 182, -154, -4, -25, -78, 25, -103, 136, 90, -34, -260, 12, -163, 85, -191, 125, 21, 177, -106, -20]
5090b0m7o1K17p3J07q0r2n8P7K6Q2L8q5j69J08rn4J00J43k04J12O2l2r0Q7j20
5116c5r9R1M5j61J6J67O3j52k31M64k30J10m80L1L80k50K08K98k36k7o3j74L75
5139A10q7M3p0J13m3j13R8N0l27J55l6K71j59J23l88K43J37j32J88Q9l51j00J47
5162c9o9Q3k88K92M0k50L83K4j21M1l11r2K39j43R8J12p2JJ12l05N5J78%j58L97
5187B07l03J77J13j20n7l5k3K4j25L35k40J28n2r9J05j10J46p2L16m24J18%jk72
5211b64M61m8k22J08j10P7J7N9j82K31R0k18r1j06Q9J26j18L7n1m1P4K1K0J1L6
5236Fj32K34m9j02K19J60m3l30k28M69j68o4l9J29M0k2o1l5m3Q8j78J42P7J14
5260A84j66j68K03m6j97K41j81J01K27j03j74O4m9j12k8K42k07K6P5j66K70q4
$$ y = [-20, -67, -128, 89, 16, 123, 43, -49, -107, -30, -4, 78, 116, 31, -138, -30, -39, -93, 7, 150, -54, 58, 120, 88, -2, 85, -35, -134, -43, 2, -159, -143, 24, 87, -65, -296, 168, -62, 48, -432, -401, -21, -271, -63, 235, -1, -28, -91, -265, 110, 23, 66, -4, 109, 66, -47, 51, 101, -226, -71, -107, 164, 5, 128, -260, -17, 120, -12, 176, 265, -86, -186, -39, -108, -25, -313, -21, 19, -231, 152, 176, 55, 96, -215, -307, -68, -211, -113, -1, -73, -72, 40, -265, -210, -32, -32, -190, 207, -96, 81, 194, 74, 17, -18, -41, -17, -142, 193, -47, 81, 29, -70, 35, -75, 71, -1, 315, -109, 9, 9, 8, -264, 197, 149, -73, 35, -75, 2, 19, 78, -104, 127, 217, -1, -92, -198, -109, 17, -101, -64, -115, -156, -82, -61, -41, -30, 6, -126, 108, 59, -43, 176, 336, 293, -37, -265, 204, 36, -28, -67, 62, 102, 80, 19, -16, -59, 29, -149, -7, 70, 184, 18, -150, 53, 7, -190, 51, -130, -29, 198, 95, -79, -15, -64, -176, -204, 38, -169, -143, -68, -234, 36, -48]
5282d8K7k18L96k65K65j61n5K42q9j9m1j33R7k01PL59j15j3q8J8k25M06j57J33
5306A22j21O5Rj27P4j43Q0N7O8Q5k11J01k7j77J79j23rJ96R7j36qp9J76l35K97
5331A10k59L21o1l88M15k57L58p5j57R2p6j29M45k27j84j06L69p6k58K47j12l2
5353d0ln5J56O9j45J20o3k05L39k50j0J14J25l67M45O1l69J01m2m7L9J41l05K59
5377F8L2l51L8L6J36O7r8k75M78J22l32J94k43J26R5j09j66p0J77j37M1K87Ml99
5401b79K14j47J75K54j73m3pj6J33%m1%l86L82j34K5N9M3j30j6r9K37J80j45j5
5426G1Q5n2j83J69p7j67L29k98rK56m3J25j78k28J56K36l00J21J44k64J07r2L10
5449B18l94J90p7J99j12J11k85L19l15j9R8M6J2Q0j0k30K58Nj20M8p6RK01j00
$$ y = [-48, -21, -239, 157, -108, 157, -4, -59, 183, 94, 75, 34, -99, -2, -203, -196, 163, 48, 35, -53, -35, -260, 146, -11, 122, 1, 66, 75, -52, 22, -121, -41, 16, 84, 169, -42, 59, 32, -145, 34, -89, -98, 98, 195, 59, 51, -28, 148, -187, 110, -149, 172, 111, -277, 138, -119, 239, 164, 7, 99, 23, -106, 339, 112, -72, -178, 191, 115, -143, 104, -8, -40, -43, -98, 58, 127, -18, 102, 39, -166, 173, -77, -87, 27, 152, -215, 230, 291, -78, 23, -19, -66, -27, 114, -191, 68, 100, -251, -213, -177, -41, 26, -72, -347, 131, 253, -79, 115, -128, -2, 93, -16, -182, -252, -75, -212, -171, 116, 120, -279, -65, -212, -37, 217, 44, 1, -6, -22, 111, 111, 70, 70, -316, 66, -68, -43, 16, 59, -71, -87, -186, 51, 231, 86, 71, 156, 104, -79, 90, 13, -154, 175, -123, -132, 124, 81, 206, 28, -200, -44, 192, -108, 13, 157, -107, 0, -92, 218, -176, 14, -63, 136, 24, 135, -150, 169, -146, -165, -67, -21, -9, 71, 61, -169, 89, 94, -26, 22, -54, -45, 156, 56]
5473E6q1J19k60K47Kl1r7l2N3O9J1j71P5j28J76K83l81J47j60k4J65J40k63J11
5497B6J29j83O1j58K9j33K7L95j05O3j32l4l3J36k66J90nQ4m25K26O5J90k90r4
5521b37L60l43K4L71k37m7jJ43j20J68l5k79J41m3R6o8P8r7K58m03J75o7L85r0
5545A32j44q4L66j59j4j51ML52m99K41J61j15O4l85J3K85j67Q2j46K03M5P0k76
5568a22J69j89J47lO2j05J20J1j24K02k90K68j02O9p2o0L6j21K58l29J94k4P6
5591G1j58Q5R8R8j40M2n6J4j81K02j6o8L7k35j4J97pj16J46J21m1k05K91k10K93
5616B48k67j7j83J71J4j8Q9J06o7n7K45k42r5r1J39j58K01k69J94R6J19q5M6j23
5640dP8r7j14N8j15J39J06p4o1K25n6k59J99j24N7P3l3J60l44J23j24L66k76J83
$$ y = [56, -25, 94, -166, 81, 83, 52, -45, -77, -24, 45, 56, -115, -40, -168, 8, 291, -90, 57, -103, -127, 38, 178, -85, 26, 155, -28, 33, -125, -96, -229, -202, 193, 88, 151, 19, -15, -48, 88, -178, 12, 7, 91, -334, -108, -43, 147, -143, -237, 123, -220, -196, 175, -62, -109, -110, 33, -87, 81, 46, -233, -92, -135, -39, -107, -29, -126, 132, -271, -96, -163, 222, 132, -12, -96, 270, 111, 97, -54, -50, 302, -197, 44, 205, 90, 154, -231, -218, 67, -100, -18, -164, 39, 84, 154, -122, 47, -142, 5, 2, 64, -41, 79, 90, -34, 168, -122, 146, 44, 113, 41, -19, 17, -104, 154, -175, 19, -5, 71, -87, -2, 96, 194, 54, 96, 40, 54, -127, 75, 59, -9, 28, -207, -221, -24, -31, -147, -1, 120, 79, -126, 165, -45, 248, -19, -36, -219, -48, -34, -52, 37, 143, 76, 19, 264, 22, -73, -164, -25, -183, 18, -251, -57, 39, 158, 73, 119, -4, 74, -23, -137, -79, -194, -55, 51, -23, -84, 141, 85, -174, 25, -99, -42, 31, -2, 158, -186, -63, -187, 179, -97, 86]
5664H6k0J8p7k4J36Rl36m6J08J80J7O7k29J5J73n8J25j73m6l4N3J44j38J11j74
5689a13m2J37OQm55N45l6p9J2k1j13J82j38j2l3J84j33L34l14k20K09J36k73K58
5713B9N3o7rR2l16K14j72K27J07k76J13K3k8J21R5k75L8j12k5K25Nk4p2K43J15
5738C24j71n5k21J08N5J86j55j47J06k89L72k33r4M01k50j63N60l85l9M8O0k92
5760b74L35M3J7j27k92J81P3R2r5j26K67p7K7j5j85J56L2R1j77m7KJ18J8j31L59
5785B65n3m05J81J86j99j49J47j31K14m8J54j95Q4k93J07K25l09K10K4j28M4J59
5807I0j26J93J38k39p2k34N79l19l9j16K11k38J86m7J16J54k89Oj39J47M3k8J20
5830I7r6j45L4k3K18J41m20L30m1k93L68k08qJ3J62O9j99L1j3k4l0M2L3k0N8M0
$$ y = [86, 66, 84, 7, -17, 119, 128, -208, -254, -146, 34, 51, 118, -111, -96, 77, 19, 144, -29, -75, -109, -56, 88, -50, 61, -113, -155, -18, -12, -4, -459, 86, 50, -29, -17, -38, -151, 31, -107, -119, -152, 32, -101, 233, -81, -301, -92, 44, -229, 29, 82, 15, 6, 98, -218, -4, -176, 51, 158, -118, -5, 18, -10, 111, 206, -69, -31, -143, -168, 57, 62, 38, -34, 209, 324, 153, 98, -123, -15, 40, 226, 71, -76, 30, -259, 113, -120, -214, 187, -63, -226, 334, -51, -90, -42, 18, -274, 61, 104, 121, -6, -298, -117, -44, 48, -47, -173, 94, 17, 44, 29, -156, 0, 32, 123, -54, -101, -99, 19, 37, -94, 265, 212, -193, -12, 174, -25, -174, -27, -158, 56, 8, 162, -33, 51, -242, -135, 90, -219, -9, 15, -113, -69, 90, -36, 157, 295, 56, -16, -250, 329, 10, -29, -145, 66, -172, 14, -33, 83, 237, -52, -46, -185, -38, 5, -23, 97, 1, -144, -110, -133, 85, 226, -194, 136, 95, -198, 170, -38, -46, -33, 129, 198, -1, 30, 17, -7, -37, 5, 38, 18, 76, 116]
5856A16j52J16j6r2j36J07n8J11P5j23K15k08k4R1n7K7P3j65KK80j76r7NO3J45
5881A22k54O9k21K45rq0NK29j74o1O5J64j74K34rl39K28j23j39L51j23K56m15
5904a53O6K35j45K40j34k75L8J25k61L09l05J79j16O9K69j05M8p4l9K8R2m1j47
5927i7M00l19j6P2J60l35kK56j99j23K04J83j27J20j78n9L05k24O1j3n6K04j81
5950C6q7K04q7k9K10j44J32j15j68M2k18R9K77j26p2J34r6J6Or0J5J23l56K56
5974c8K00l87L46j57N02o83L94l5l16Q8J65J21k81O3j7q7j61L98k47J45K16l57
5996a28J75o2K7K02k05M7K44k56m7K6j00P8Mj96J4J89j6l3l1J11n5J18j68J77
6020A15k15K29j88J42j49J88l25J67K38l01J42N0Mr3m0J39j56J61o2l95M54K1
$$ y = [116, -36, 80, 64, -28, -164, -57, -115, -4, 71, -52, 163, -45, -69, 22, -35, -8, 65, -100, -98, 182, 6, -91, -86, -23, 122, -132, -63, -284, -39, -48, -128, -123, 106, -68, -129, -64, 100, -74, 160, 151, -188, 40, -83, -222, 129, 6, 262, -153, -87, 148, 3, 243, 109, -166, -128, -3, -264, 45, -260, -81, -197, -128, 141, 36, 84, 10, -29, -1, 91, 50, -97, 303, -16, -32, 40, 200, -135, -137, 119, -80, -203, 1, 184, 57, 177, -1, -60, 245, 21, 82, 69, 13, 217, 36, -51, 153, 66, 37, 247, 103, 235, 120, -48, -6, -224, -125, 152, 26, -46, 88, -8, 8, 14, -76, -61, 62, -294, -38, 162, -225, 121, -36, 466, -217, 177, 142, -174, -86, 79, 200, -81, -18, -35, -122, -283, 115, -132, 13, 229, -128, 47, -15, 12, 214, 9, 56, 300, 44, -3, 23, -77, 1, 5, -191, -177, 12, -4, -37, -68, 43, -12, 106, -62, 115, -100, 129, -59, 83, -66, 122, -203, -36, 202, -99, 43, 93, 97, 4, -36, 103, -53, 108, 46, -349, 105, 126]
6042A26j55J7J60j42j56j08J97j8K60j07m1k50K82o9K7nR1j01k48K87J05l47K1
6065a74Q2P7Ro0K3r6K21k00J11J51k92L68j80k12K1K71j67J41N8l23N21l93P9
6088C6Ol11L06p8o0o4K05j09K61k50J02Q9l03L76j52l33L91j75J49K4l67Q5L50
6111A78j28j29m8J80J9p5J75j45Q2l19R5K7LRJ30J60k35J8Q8j02k7Q1j53K31j28
6136a3j33Q1J80l00L01K2k47l4OK41r2nM9j19K5k22K23j59L94l55K64k0p0o7N
6161d5L1n2J8L8J28j27%p0J28J5j69r1o6J99m6K8K22J6j25j15OJ24k36L02k31
6186a18K59r3j37Q2n3o9j30L46o8jj23K8j12K68N0j81K72k78K3M1J64j45m1N2
6210C6j1j20K94k55Pq3J54j82Q8K14o4lk97J61K9P0Q9j39K8j08n9L14m23K62M1
$$ y = [126, -29, -12, 148, 6, -150, -258, -61, -79, 181, 74, 33, -217, 65, -4, 23, 18, 109, 8, -240, 47, 152, -195, -174, -92, -15, -6, -66, -43, -139, 82, -118, -7, 144, -148, 220, 40, -172, -151, 120, -47, 94, 152, -171, 350, -43, 36, 42, -269, 37, -41, -101, -165, 40, -69, 192, -58, 44, 133, -170, 206, 54, -279, 112, -63, 86, 110, -257, -172, 178, 50, -79, -127, 53, 72, -3, 172, 27, 109, -210, -115, -88, -85, -76, 54, 214, -21, -3, 85, -17, -44, 37, -116, 115, -13, -146, -65, 115, -185, 116, 138, -109, -143, -137, 104, 12, 7, 56, -63, -38, -260, -37, -196, 198, -157, 107, 87, 17, -50, -45, -14, -66, -48, -10, 118, -9, -9, -79, 49, 64, -105, -196, -262, -63, -109, -81, 141, 157, 32, -83, -77, 47, -189, 113, -118, 141, 48, -89, -7, -60, -129, -259, 87, 19, 18, -105, -77, -189, 79, 129, -52, 220, -58, -35, 6, 170, 25, -16, 36, 25, -95, 199, -56, -49, -132, 22, -160, -72, 142, 78, 75, -222, -61, -32, 38, 127, -12, 16, -92, -151, 163, -260, 2, 43]
6235D3k01K20k13J55k7l06Q1N36k83P6L2J43m02J30o3Q8O8j62J61j2j39K61j25
6258F1j77M3J80j9r7K24l25K5J58n6j31M5K96K9k71pK91k99m6K22j38k1j60K92
6282A19l35L41j8K3k05l7L44m14L57l75K87r4J62j9Lj4k84M36k02J9o7r0M5P9
6306F1m1l5M5o0J91j58j54R1k7N4p2K48J77k30j32J41m04M68j57J1n3R0m7k22
6330b15K75L8j29k28K76K06j11j36N0j24M7M7J7PJ20m25L04Rq5N3Ol13K70j40
6354a81J19k2N9j20J23L09j87k88K96j8r7RL2l31K96j23L03n04L22n2j76R6R1
6377d4o5J12J37l97L30j08J99k60k2J68o0J04j17K4K8Q4l30K42J17o4k75J48Q3
6400C4J76k38P1M5j38K70m50J32k8M06l52L9J1R9k1r4lrl3k9J60k5J70j51L03
$$ y = [43, -158, 62, -151, 4, -23, -329, -248, 288, 5, 81, 113, 256, -146, -16, -79, 9, 77, -85, 76, 64, -75, 186, 61, -116, -73, 107, 88, -9, 215, -110, -85, 73, 17, -114, -69, 227, 256, -15, -22, 269, -30, -76, 146, 8, -13, -173, 119, -216, 125, 107, 130, -75, -112, 232, -182, 175, -200, 87, -7, 155, 136, 139, 125, -159, 277, 75, 94, 27, -63, -18, 61, 20, -15, 30, -30, 161, 3, -151, -60, -87, -33, -105, 143, 320, 90, -42, 99, -305, 163, 6, 17, -36, 54, 7, -215, 60, 98, -31, -259, 17, 223, 112, -24, 26, -98, -51, -4, 13, 20, 140, -285, 19, 28, -57, -4, 2, -311, -41, -181, -62, -84, -25, -145, -22, 287, 100, -188, 108, 90, -7, 2, 34, -297, -1, -124, 179, -325, -3, -55, -231, -135, -44, -109, 3, 140, -257, 73, -35, 164, -96, -118, 50, -10, 94, -23, 1, 29, 113, -217, 25, 142, 78, -197, -49, 34, 210, -28, 43, 88, -50, 220, -230, -98, -126, 280, -72, -33, -22, 77, 56, -38, -41, -50, -83, -112, 48, 23, 193, 42, 345]
6425C45m50K29l00J86p8k9K24k73L42Q8o5l27m3K19m6j0Lo2K1J06o0p1j21J00
6449g2K05J05q9j7M5k7j34O4l1j39J65o7J30m1o9M3j51o1L18q8l16K03j6k7l5
6474a02J04N6J40j33j59J22l7J25r3j70Q6Q7O0O5M3n9o2Q2k46n2J09m0J84j43
6498c3O5k9J31j04j46J65k70P8J92j56K02Q1k54n0K07p4q2K53p1l38J83l1L5q5
6522a31K88o2K7L6l63K20P1N9n52J56O1L77j82q6K08l15L96k64P6j03K5J89m7
6545H4k7l9j14L04j44P9k61K33l79M9L40m23L51J05j21J73k65j6J74l29M05k07
6567b8K00k49P3m2m7K75k4l7J41j72R9J14l22l23K87j27q1L41j99K41k13K82o2
6590A27J9j1l30N52k88M3j94K75p7p5j09M8j19M00j86k13L39l11Q6N7J11p6j16
$$ y = [345, -105, 124, -176, 10, -68, -97, 127, -146, 196, 284, 219, -108, -151, 68, 22, 12, 15, -47, -26, 80, 20, -51, -172, -72, 133, 238, 149, 132, 177, 150, 16, 80, 49, -90, 75, 8, 138, 97, 28, 71, -80, -141, 177, 89, -227, -24, -40, -67, -102, 2, 58, 198, 65, -94, 28, -9, 116, 23, -147, -61, 26, 86, 151, 194, 135, 73, 155, -91, -143, -34, -74, 110, -33, 32, 3, 134, 30, -116, 49, -221, -143, 49, -107, 95, 176, -78, -128, 79, 5, -77, 176, 105, -233, -50, -81, -46, -131, 157, 95, 122, 158, -205, 15, 86, 145, -407, -251, -190, 187, 5, -81, 127, -188, 208, -56, 20, -83, -58, 131, 84, 57, 18, -96, 208, 64, 143, -118, 115, -264, -215, 125, -298, 53, 158, 37, 210, -55, -71, 103, -226, 179, -28, 172, -77, -4, -46, -93, 182, 158, 121, 262, 90, 189, 303, -19, -342, -55, -182, -263, 78, -121, 120, -93, 189, 127, 146, 135, -195, 357, 69, 112, -82, 193, 116, 41, -68, -20, -139, 261, 75, -138, 201, -110, -24, 33, 144, 68, -48]
6613d8M2K98l10j73J52k7J82m8j92J94n2m8L01l13p9p5J74j06K79Om19M50Ll24
6637a33Q1n1JQ0Q5qj64R8j43P1k7J73j17J18j69J6Q3Q1j27L88l14o5K11k93j96
6662c21M28j01j8K18k08j27J58q0J77P2q7l30J41M9K6n3K91l61M11m52M3P3Q3
6685C2K18j69l7qK55m13K09j16J85l8l4k62J41L2k6n2J69k55K29l6j74n4J00K25
6709A21k36J42j07N1Nj22n1K44l21M94l29P1J43J6p0j30k4M8K11j18j07nJ52m1
6733C7j46l0K50k21J24l8j52J23j27P8J11j10J99mk92L03l62J76L34j94J10k41
6755g2l6J71j94l4j72M29M8k58R6r3K91l47N9K52k29J76j9j21o2K10J08k20k51
6778b68M64j34K4l09K27k6j59J37J25k06n3K02m29L78k9K38l24R0L7m6J17N1m9
$$ y = [-48, -6, 292, -18, -191, -39, -66, 116, 68, -124, 70, 18, -30, 271, -42, -121, -196, -22, -128, 151, 157, -262, 188, 191, -133, -52, -103, -102, -22, 63, 55, -109, -11, -154, -83, -110, 63, -54, 64, -105, -89, -6, 75, -52, 336, 22, -43, 168, -125, -321, 107, 6, -12, 206, -2, -129, 29, -51, 126, 198, 111, -219, -78, -29, -3, -56, 235, -126, 285, -167, -124, -51, 32, 250, 81, 44, 36, 291, -122, 87, -29, 156, 118, 84, -178, -37, -5, -31, -83, 86, -169, 60, 24, -150, -204, -104, 121, -115, 27, -80, -29, -24, -146, -197, 47, -274, 220, -109, -38, 105, 121, 51, -79, -103, -55, 156, 38, -69, -74, 78, 37, -109, -139, 111, -110, 14, -24, -176, -53, -180, -102, 9, -101, 98, 94, -198, 105, -257, -81, 253, 59, 169, -72, -108, 63, -131, -165, -337, 92, 140, -118, -22, -115, 176, -171, -112, 140, -89, 87, 68, -53, -115, 95, 203, -17, -268, 196, 62, 86, -223, 4, -22, -181, -44, 81, -125, -178, 24, -405, -27, -56, 182, -142, -52, -15, -61, 56, 107, 58]
6801E8k35K72j47J53j94R6N4n9j34Q8J0j66j6N0J1K26l07Jk7M50j04j14l2J18
6825E2j9j2P6j00O6k11K38j85J45J96k64R9p8N2q1J2J48J79m74K77j28O7k2Q3
6849A16k00J27l36L11J0J10Lk51Q9L8o8q4K30q3k07P5M1J29J81q8j85j13K12j07
6873e0n0J63p1J17k18k10L42J57k38J33l7jL26l88k53L56J76k95J54k38Q7n4q1
6896a73J62J62K2j09j34q9L19k23J70k5j68j84K65kQ7j53K63r0j72L8N7k28K74
6919F9J02nRj33L7J74m72K09K5L46m38j24K09M9K03j83K9k9oL9L3L4Jn0r5J53
6945A86j6j89k2K87m02J58m3O5J14J03m38J96J6J38l86L83r3K22k40j22j6J63
6967F4N3j51L4o2J14p8N5J8j42K12K25l12j86K42m15L18L7J5r1J02k76M12j93
$$ y = [58, -177, 95, -52, 101, -93, 3, 57, -2, -136, -48, -38, -204, -220, -170, -159, 67, -240, -239, -266, 184, 80, -34, -66, 52, 33, 21, 97, -3, 63, -148, 90, -95, 50, 246, -18, 81, 3, 55, -26, -14, 134, 313, -161, 116, -12, 55, 33, 116, -84, 43, -293, 18, 28, 138, 141, -110, -21, 17, -51, -135, 95, 12, -195, -120, -79, 50, 231, 143, -42, -155, 57, -50, -100, 63, -8, 109, -109, -319, 23, 180, -58, 75, 38, 37, 363, -25, -278, 78, 254, -41, 113, -125, -38, -92, -173, -11, 151, 173, 64, -70, -159, 160, -63, 107, 82, -86, -270, -5, -7, 80, -73, 190, 100, -72, -34, 23, -205, 69, 171, 166, 175, 42, 79, 253, -219, -10, 15, 361, -77, -201, 8, 57, 260, 77, 106, 77, 71, 110, 143, 177, 178, 128, 33, 186, 170, -19, -41, 246, -156, 2, -41, 24, 138, 241, -197, -1, 15, 153, -233, 150, 57, 279, 39, -83, -99, 64, 117, -34, 0, -62, 52, -26, 29, 47, -95, 117, 342, 30, -156, 86, -329, -11, 26, 41, -50, 52, -224, 188, -5]
6990em6J89q3r6l6J3J52k1k48N9N0P4J38j03P4j3j41R1O8q6r4R8j21K84j96K7
7016B8j49K5K98k12l40N52m57L92J9k78L52k06LL6j59J17J8q0O1oQJ91k16q6l3
7041a22N3J65l6O3j34j44K40q2J08q8J1o0k09L1L26k82K69m5l43L56J68j02k63
7064a20J04k38L86k80K67j06J9K58j13m82J93L16l53K17J46j69m7l4K31q9j8J56
7086B44l05J00J60k19K56l84n0L13j11O2l2j05M0J21J0P3M1j72M9q1J7L3j86K88
7110A62l41R9J0R3R2N7k57j59K85k27k08O33j07j64j21O2M23o19K28m6o5J26l6
7133h0Q4mN4n8j27Q1J95Ml56M72j81m38M45k40J59R6m8m1L0j78K23K1l12K41k76
7158b34j1K48J7Qj74M9M06k76q9m1J59j06p7J31M3k17K51r5LN4q0J03r2Nm7J29
$$ y = [-5, -51, 138, 55, -41, -77, -64, 88, 67, -181, -122, -72, 2, 140, 37, 111, 98, -43, 48, 116, 30, -64, 34, -87, 197, 1, 28, -121, -96, 202, -10, -350, 202, -255, 137, 156, -122, 230, 24, 27, 63, -96, 21, 39, -41, 20, 14, 22, 213, -3, -89, -122, -69, 96, 60, 123, -11, -155, 85, 3, 111, 23, 34, -26, -235, -204, 122, -160, 109, 64, -279, 77, 245, 143, -120, -16, -254, 132, -148, 119, 13, 32, 290, 177, -305, -112, 204, -149, 68, 214, 45, -2, -36, 195, 106, 88, 244, -61, 39, 199, -20, 236, -148, -198, 115, 4, 66, 34, -71, -31, 90, 100, 173, 214, 42, 91, 10, 27, 60, -126, 162, -179, -80, -70, 23, 115, 172, -85, -244, 41, -186, -394, 239, 132, -32, -153, -91, 332, -287, -59, -105, -170, -44, -80, 4, 0, 54, -4, -131, -50, 145, 149, -207, 265, 84, -354, 91, -149, 10, 106, 58, 17, 47, -131, 92, 113, -199, 42, -234, -245, 3, 20, 28, -146, -97, 309, 33, -56, -97, 62, -44, -121, 10, 53, -164, 87, -8, -5, 49, -31, 72, -20, -15, -62, 67]
7184F7j73J74j6P4J00k05M0j1q7L22j30j11p9K16p2j84L53k34l37M30m1L7j30
7207CJ19n7r0N0O9l7j24r6M24l53M7j5J94k94K80k04J29n7k52K88P9j05M3j7j51
7232a27L6R5J26k03Q0j66J69k13K47p1L62k63j91MJ9K30r4R4j80P0N6j9j43J34
7256E2l6n6j51LN7K74pJ85n94L00N2jr6%j7R6lp1j47L48k33Q3O0j41J34M8n8j22
7284d1P5J9jR3k57n5K07o3k83L22j24P0OJ09m26M25J42o0k57o6J66j45O1q0J10
7309e3L6j0rQ6l39M85k52J25RNMj42J62r6O1m02M07n1k36L84l5r8J74j44j11P7
7335C7j5O5J42n2k11P0M0L1j19J42J71k51L9j43K23%l58K17j8J44j45j29L00n0
7359A30k0k62K59J4k84L79r2k7j80l4o0p1L60j55k9K52k26j50M3L00j00j45J36
$$ y = [67, -106, 68, 52, 126, 226, 21, 61, 50, -37, 285, 155, 44, -35, 181, 109, -75, 278, 44, -293, 137, 96, 133, 3, 122, 65, -25, 25, 94, 57, -67, -163, 261, -92, -45, -60, 134, -160, 120, -84, 45, -12, -264, 24, 103, -2, 41, 24, -127, -91, 4, 130, -73, 7, -159, 10, -203, 44, -27, 335, 72, -119, -115, -96, 134, 40, 134, -46, 24, 80, 61, -82, 52, 16, -40, -191, -188, -131, 143, 136, 321, -273, 27, 79, 78, -18, -18, -35, 61, 58, -13, -160, 188, -45, 38, 98, -43, 91, 139, 81, -41, 34, 53, 52, 145, -112, -167, 40, -23, -306, 16, -108, -38, -32, 77, -349, 76, 218, 158, -99, -165, 1, -144, -83, -163, -53, -17, -27, -36, 50, -289, 196, -56, 69, 78, 83, 87, -55, 107, 11, 72, -330, 77, 26, -210, 174, 139, 41, 215, 71, -40, 37, 22, 87, 229, 177, -34, 36, 76, 107, -12, 130, 301, 50, 89, -54, 169, 169, -189, 28, 10, 154, 9, -120, 180, 130, 110, -152, 107, 121, -163, 216, 124, 97, -83, -117, -177, -248, 112, -43, -72, 180, -46, -196, -153, 147, 47, -98, 38]
7382C8K9j9l5N5L4K89m30J21j45J03r7J46K9j09j00NP2K47k42k10L58l94M81k43
7406a7m6j5l4Q0m9K02J20k14mn5P1j51J6O7J30p8O5k25Q0Q2K31l79P7P2n9q0P2
7433d1L06j31j33oj88J10LR8K70k93J1m6l9O1N6j9n6k36L16k0j22JJ05K26j55
7458G8l8P2j48J84j88Q3J8n3K15j65M3l55J96k9K12qk62N0K18jJ20l36J17j26
7482a03j08L56j78P8j45K82k09m7j68K85k84N99l22Q7k40K11p1r7J1K36r9r3j56
7505a75M60l2k17k76L91o7J45j64r5K27j26j69q7L82k61K49j09N2n3j5K61m32
7527a11Nq8J99n5r8J27K30k9k59L8m5r8K41k24J61r7M9K61k04l2j70L33p7k25
7551a68K46J73l61l8r6L10k51K19j15NJ56l5l4j70J97MJ23j78j32J07P9M2j23
$$ y = [38, 67, 48, 13, 68, 102, 391, -39, 82, -63, 40, -57, 89, 118, 9, -91, -86, -14, 233, -9, -219, 139, -255, 226, -17, -63, -78, -112, -32, -81, 121, 241, 27, 23, -32, 39, -112, -96, -29, 101, 23, 88, -137, -57, 25, 256, -123, -46, 26, -33, -113, -41, 265, 134, 1, -5, -193, -83, -80, 18, 288, -5, 6, -40, -79, -18, 38, 19, -37, -273, 43, 23, -99, -98, 7, 233, 78, 40, 112, -36, 148, -40, 43, 61, 8, 223, 58, 101, -254, -58, -87, 125, 117, -145, -95, 123, 122, 242, -94, 23, -103, -211, 145, -33, 45, -100, 182, -27, -74, -242, 43, -241, 358, 36, 123, -117, 94, 23, -74, -63, 173, 74, -19, -175, 285, 253, 36, -240, 151, 84, 229, 65, -30, 197, 71, -98, -185, 197, -64, 185, 76, 128, 75, 60, 321, -111, -106, -194, 5, -50, -148, -21, 209, 180, -79, -41, -86, -184, 57, -167, -6, -103, -54, 207, 3, -29, -199, 134, 57, -168, 78, 251, -110, -148, -244, 66, -185, 34, -81, -76, 80, 45, 11, -159, 38, 42, 165, -13, -145, -38, 41, 83, -40]
7574d0J26J8j21K6RL1R8l76K98n3m5m3k02K85j39J24p8l9J68j30K12m72K82L19
7598B58j49j04k4N6j78K91R7k87j01J25O2o3R0O5j37j8M3j13J17l4j42J11K65
7621B30l54LK42O5m27J99J81j39J63j77P6j8j14o8m3R6J21Q6m8r1r5J17j9J31
7645A17q4N6l84M00j12j10L34k57K46o1j4p7m6J42j26k22K73Nk31M18k54J11j15
7668IK74k42j42J66j9o1N4J60n49N52j52n1J22R7k47K02kj24j56Q1l7L36l22K72
7692B21j82J24j20q2k7j57N4J69M8j80J53j11J66k40J23j2J95k45k4K21J21l36
7714a21j44N20r4l30K08j44J23K7K5p6L85n03L30k69m5k6K38m8j19J26k95M51
7736B19r4r5R1k24J5J65p7O8l44L56kj20L37k90J65k72J00l0J18k1k31L12j67
$$ y = [-40, 86, 104, -17, 9, 18, 49, 147, -229, 69, 16, -29, -72, -274, 11, -128, -4, -82, -121, 47, -83, 129, -343, -61, 258, 109, 5, -19, 37, -141, 150, 247, -40, -141, -16, 46, -17, 73, 138, 1, -17, 26, -87, 30, -4, -146, -35, 230, -124, -121, 121, 186, -241, -42, 139, 0, 163, -14, 62, 44, -70, -138, -181, -85, 36, 122, 74, -17, -112, 5, -14, 117, 33, 89, -295, 105, -7, -117, 217, -40, 206, 145, 131, 54, 8, 150, 24, -198, 75, 80, -151, 267, 13, 124, 9, 283, 41, -101, 65, 46, -15, 39, 199, -350, 202, 50, -1, 121, 218, -29, 173, 171, 47, -109, -28, -65, 271, -51, 221, 39, 163, 43, -39, -66, -223, -169, 0, 48, -132, 21, -90, 76, -164, -41, -53, 142, -103, -127, 94, 215, -121, -265, 255, 161, -169, 39, -105, 18, 45, 70, -6, 379, -124, 206, -63, -108, -134, 104, 56, -63, 63, -232, 219, 125, 30, 121, -103, -88, 77, 0, 68, -276, 80, 78, -42, 295, 5, 170, -102, -2, -32, 86, 65, -166, 146, -21]
7759b1M4J51m39K04q4J12K15k15K06j28j70P3O5L6l41L90O1k27n0K84k26Pp7K98
7783A68j50j95Q3J38k12J12O2K2j45J20j09m1J5K06j39J60n3m5k45K91k37J98
7805DL7j01l3n3J64N2J72k70K26l31K94j62J00k41L26q8n7l00L70j18r3K5J04
7828B7j22o1K05k33J30R8p6L4k42L29J89k55J57j31Qqk29J89q5L4J77k56K44K6
7852A49j49M1N4q7j01K47k61J78n6P5j25m2L21m12J01Q2J5j35J79oj76R1m4l0
7876i1K04J63j8l05MK13m40L0L38Q8J54m48L52l88J29r3J61o1P9j76L55j37j09
7899Drk6j13o5J15J09k4L1j29L18m9j59n2j1J25j18J33k38J84J03j82k21O8qJ79
7924c5L0j53J3J14J27k84K59r5k53J75l8j95K68J51J48K4l91j9J25J05M6L9j45
$$ y = [-21, 23, 174, -265, -61, -145, -33, 182, -33, 173, 45, -125, -52, 13, 49, -292, 98, 159, -68, -118, 166, -60, -53, -130, 168, 18, -177, -94, 44, -168, -56, 6, 28, -117, 3, -106, -147, -132, 74, -65, 95, 42, -3, -248, 43, -194, 4, 41, -60, -93, -146, 18, 70, 242, -28, 198, -133, 161, -1, 99, -142, 184, 96, 39, -261, 109, -9, -102, -77, 27, -95, -156, 49, -184, -54, 44, -32, 2, -240, 89, 278, 23, 180, 49, 57, 49, -180, 9, -76, -42, 135, -121, 123, 149, 0, 41, 95, 8, -93, 154, -107, 71, 15, 90, -35, -77, 244, -168, -67, 15, 30, -105, 74, 68, -108, -17, -61, -91, 113, 276, 258, -47, -43, 170, -270, -240, 98, 186, 340, -108, 244, -144, -15, -108, 53, -8, 71, -105, 250, 113, 4, -5, -31, -144, -209, -94, 15, -9, 22, -107, 211, 162, 3, -49, -60, 65, -53, 80, -158, 26, 129, -53, -274, -206, -214, -35, -5, -158, -145, -31, 96, -188, 71, -24, -277, -102, -140, -335, -67, 84, 232, 256, -135, -154, -29, 76, 122, 161, 16]
7947A6j55lK35k09J57j76J36O7q4j99R8J06j42L03k29K09j04q4J16M2k07L0j98
7970b75K6L66j34K69q6r4n3k93O17m43J68n7m6M4J68l11K25K46k90r5r4J82j19
7993g9k8J06Q7N1k5k2k1pM3k43J8J88j49O5Q8l04K1J8K39q7p0p7K50J02j01J94
8019B57l74L15j71j36L9j84L81j56j08K19j13M0K9j62R8J43O7J26k06j22j67R6
8041h9J46k17J31mK92P3j07l16L6J47k09J83Jj12K35o5m15K89J41k07n7R6K2K14
8065B08l25K41P6q4m98L54R7j40J10K2k9O0k03k9J40L3k5J52k93J62J12k73k6
8088a58K2J59j05J81p1K71m78M46k44O2j09p3J0J19j41J88K0M7k59J49J10k23
8110g7J47k38L56k64j79M48j76qK4j69K14J2J83j66rp5q8J73j67J71j73J40n9
$$ y = [16, -139, -142, 93, -116, 41, -135, 1, 68, -16, -215, -117, -11, -153, 150, -79, 130, 26, -58, 58, 100, -107, -77, -275, -249, 117, -17, 252, 166, 72, 19, -274, 343, -100, 68, 11, -35, 9, 177, -134, 91, 337, 47, -48, -142, 40, -79, -107, -1, 86, 137, 112, 90, 69, 62, 105, -138, -120, 68, -81, -16, 72, -232, -211, -193, 46, -41, -111, -188, 62, 164, 63, 257, -117, 198, 27, -109, -70, -254, 127, -29, -137, 82, -31, 9, 38, -124, -26, 117, 184, 310, 104, -18, -185, -89, 57, -160, -29, -33, 259, 332, 225, -91, -55, 92, -117, 66, 67, -45, 190, 125, -290, -1, 140, -67, -124, -28, -6, 208, -117, 124, 200, 116, -382, -28, 69, -71, 39, 61, 32, 92, -111, -140, 0, 33, 8, 160, -133, 29, 141, -132, -158, -136, 23, -82, 99, 28, 299, -179, 267, 23, 85, -24, -97, -87, 32, -109, 79, 99, 146, -113, 36, 146, -77, 70, -168, 188, -76, -255, 193, 17, 9, 33, -136, 78, 90, 273, 107, 98, 23, -65, 108, -59, 112, -61, 79, 20]
8133B0m2m5K4J99k68L22p6o4P6r2j84o4J47L83k79k92J59j47K49j26j03M23l62
8156a42j47L25j82O9j69J54l7K25o1j77L47k55J81R0j30J03k05J24k09J10Qj73
8178a51M76j22j28j54J61J0k31K09J3m2ok95K06
$$ y = [20, -22, -67, -43, 156, -112, 210, 134, 70, 146, 54, -130, -194, -47, 336, 57, -235, -76, -223, 26, -100, -203, 220, -142, -289, 36, -146, -77, -246, -92, -129, 96, 35, -142, 205, -50, 131, 221, 91, 194, -11, 113, -96, 14, 22, -151, 325, 203, 75, -79, 82, 92, -139, 70, 83, 41, 35, -260, -54]
8191e4
$$ Imaginary data points
##PAGE= N=2
##DATA TABLE= (X++(I..I)), XYDATA
0@%%%%%%%%%Qj6J6j6J6k4L2m0M8n6P2q8J04j20J36j60J92k24K57k97L43l91M45
32B37n06N75o50P31q24R23j029J149j280J424j581J750j935K142k366K607k874
49a507L166l487L842m234M670n159N708o330P045p871Q839r999J1412j3176J5455
64H374j8527K2910k9721M1832o9848K54172J43529l95998j43326p9140L20237
75E4494K31978l3294k15313k99506L9321K66503J24914R4365k48191k72141O5482
86a91388J85580K19002l639k30856j32482n8392K08927K33825p4248j33413j68506
97a45590n9628K07665J61823L4214j68818k16354L1199J17848J72553Q3162k08127
108I947j68499j3384J19867J99311J6270j22310j72885p7639J84878J56003J5962
$$ y = [0, 0, 0, 0, 0, 0, 0, 0, 0, 0, 8, -8, 8, -8, 8, -16, 16, -24, 24, -32, 40, -48, 56, -64, 72, -88, 104, -120, 137, -160, 183, -208, 237, -269, 306, -344, 387, -437, 486, -543, 606, -674, 750, -831, 919, -1016, 1126, -1240, 1367, -1507, 1659, -1828, 2014, -2220, 2450, -2709, 2999, -3331, 3714, -4157, 4682, -5317, 6095, -7081, 8374, -10153, 12757, -16964, 24868, -44980, 209192, 352721, -43277, -186603, -265743, 54494, 286472, 253178, 37865, -261641, -222320, 44183, 169097, 263462, 15271, -256870, -191388, -5808, 213194, 209555, -21301, -153783, -212175, -3248, 230577, 156329, 22916, -145590, -205218, 2447, 164270, 198484, 29666, -186688, -155489, -37641, 134912, 218074, 9947, -158552, -171936, -52069, 147242, 163512, 41202, -131683, -209322, -24444, 131559, 147521]
119A47521q8759j98422l4265J44426J53835N0727j53174j42600j4752Q7524J85255
130A37316K4898j47967j20220m0039J19906J44452J6382r4057j61936k0354J28972
141a2647J02986M4472r5780j47061j6059Q6521J30330L2259j00412r9696n2159
152a27246P7445J37070J5935p0590j06673m8967Q2117J02524M5900o7019j22625
163h2129j9035O2370R7981N6106p8517j03348l3351O0260J12663K9155o1467r8001
175e7313n3913P6817J01358K7704n2050j06452l7482O1806R1313M6971o4078r3539
187e8858l0644M3202R7139M0614n7873q0407m0034N0244Q5551L1060l8669q4167
199d2842l6239N0644P1308L6721l9859q0650l1362L8111P6313L5760m5386o9861
$$ y = [147521, 58762, -139660, -173925, -29499, 124336, 175063, 21889, -120711, -135463, -47939, 137316, 162214, 14247, -105973, -146012, -26106, 118346, 134728, 40671, -121265, -141619, -12647, 90339, 134811, 39031, -108030, -124089, -37568, 92762, 125021, 24609, -75087, -127246, -49801, 87269, 103204, 32614, -74059, -123026, -40909, 61615, 107515, 40496, -82129, -101164, -38794, 59187, 115293, 36776, -66572, -99923, -39663, 73000, 102155, 40688, -57313, -111226, -34409, 66949, 94653, 42603, -63849, -101331, -39525, 51788, 98759, 34681, -58858, -89502, -46300, 50839, 91453, 33580, -46827, -86861, -36617, 48934, 79994, 41325, -42842, -79081, -28437, 42871, 79592, 39733, -40917, -72279, -34168, 42145, 77905, 32519, -37342]
211c7342l7394L5603P8112L1705l6652p1407l9334L8061O9854L7961l1607p4263
223c6703l4111L2325O6869M0311l2792o5791l5135K8038O6840L3579k8428o0505
235b5503l6060K9478O0757L0961k5831n9968l0923K7043N5942L2185k6705n6882
247b5506k9663K3032N6242L1434k4831n3526l2522K2494N3999L1084j9798n2315
259a9876l2262J9912N0008L2945j6749m9893l1724J6319M8251L2678j6394m7150
271a3935l0884J5311M6243K9622j5449m4951l0035J5746M4086K8682j5234m4428
283a5226k8925J5220M3251K8597j5231m3065k7572J4017M1960K7825j2982m0220
295a2351k8136J2079L9456K7994j0879l7669k7457J0480L6293K6729r347l5180
$$ y = [-37342, -74736, -39133, 38979, 70684, 34032, -37375, -76709, -38648, 31206, 69167, 37560, -36703, -70814, -38489, 28380, 68691, 35899, -29892, -65027, -36989, 29851, 63430, 35002, -25503, -61563, -32085, 28672, 59633, 33802, -26166, -57089, -30046, 25896, 58081, 31376, -25506, -55169, -32137, 24105, 55539, 30708, -22818, -55340, -32846, 21153, 52237, 32439, -19876, -52138, -32226, 17782, 50727, 33978, -15915, -47639, -31320, 16931, 49609, 33215, -13935, -44819, -29508, 16735, 46357, 30908, -14043, -44078, -28332, 15754, 44436, 29202, -15226, -44151, -28931, 14320, 42917, 27686, -15379, -42951, -28934, 13026, 40851, 27869, -12351, -40487, -28408, 11048, 39042, 28163, -9506, -36963, -26483, 9810, 36539, 27192, -7988]
307g988k6007Q104L3774K5351p965l2955k5938P227L2965K4719p343l2976k5029
320c4061P668L1082K5396o525l1789k4303N794L0834K6389n996l0098k5505M953
333b6161L0760K4641l879k8394k5373M263K7687K4023k505k7536k3511K655K5697
346B367K3822l364k5929k1555J698K5321K1590l412k3178k2381L049K4064K0721
359B2813j089k4198k1461K507K2728K1983j640k2957j9880l73K2422K1766j569
372B1052j9872k1042q75K1200J9456J193j9892k0870O79J7596J9699J700j9868
385A56j8018j098J7004J9560m36j6278j8356k018J9303J7010N80j5615j9160k68
399a7634J6936J6882L012j7284j7380q70J3992J9395J450j5855j6326l672J5151
$$ y = [-7988, -33995, -25891, 7883, 33234, 25269, -7686, -33624, -26397, 6568, 31287, 23944, -9032, -34061, -26393, 4689, 30085, 23560, -8229, -32532, -26738, 4096, 30485, 24489, -5609, -31114, -26161, 4599, 29240, 25361, -3033, -28406, -24143, 3544, 27567, 25062, -2474, -25985, -23330, 2367, 26189, 22825, -3104, -24659, -22961, 2360, 23950, 20538, -2640, -25021, -21972, 2092, 22813, 21724, -2474, -23935, -21428, 1300, 23283, 21643, -1314, -21194, -21567, 855, 22621, 21052, 1180, -19862, -20737, 463, 19919, 21112, 1220, -19650, -18971, -1375, 18324, 20024, 156, -17862, -18960, -1956, 17604, 17168, 890, -17466, -19484, -181, 16829, 17409, 1794, -17366, -17634, -698, 16184, 19196, 1912, -15468, -16338, -2346, 17049, 18499, 2644, -13682, -17354, -2203]
412b203J7327J664j2699j8309k539J4738J4083M273j3416j6709j472J1603J5899
425A2240K925j3995j3180l473J2155J6402Q94j1016j4489l657J3140J3699L312
438A4957j1197j5954j206J0437J3507M734j2450j3194l128R285J5026K364r329
451C852j3125n309J1103J2696K720p856j3658l200R254J1410N004r996j1593k668
465a1366O692J3692L162r082j1026m239R305J2007K606p013j2699l626R357J0126
479G896M915q073j2120l452O274J2513M024q568r631n437O412J2470K296n619
493C900j0708m722P518R120N046n745j1339k477N260R394N252p119r112l588N259
508d061J1133K352n717q263n560O440R425L216m041j0664l796N406Q242N697n961
$$ y = [-2203, 15124, 16788, 4089, -14220, -16759, -2021, 12062, 16335, 2919, -13790, -15262, -3659, 12240, 15165, 1170, -12010, -15483, -3328, 13074, 13968, 2952, -11537, -15194, -2054, 11645, 14957, 3760, -12194, -13400, -2963, 10544, 15278, 2828, -10366, -13494, -4209, 10817, 13181, 3852, -9273, -14582, -3479, 9217, 11937, 4081, -9577, -12777, -3523, 7887, 12891, 2895, -8698, -11366, -4674, 9018, 12180, 3098, -7928, -12167, -2862, 9145, 11751, 4738, -7961, -11587, -2230, 7896, 12811, 4738, -7382, -10834, -4560, 7953, 11977, 3409, -6222, -11659, -5247, 7223, 9519, 3900, -6808, -11530, -4012, 5108, 10154, 4409, -6930, -9407, -4147, 5247, 10499, 3380, -5732, -9320, -4061, 7072, 9424, 3707, -4556, -10116, -3676, 5749, 8965, 4924, -5740, -9536, -4130, 4112, 9809, 3848]
523C848q881l406L162R604M240m902p128n171M464Q625K904k707q514m248M930
538c180O961M288l818q234l175L155Q112M016m741o809l791K968Q221L164l000
553D137p423m829M139O620M271k344q244l262K999O134M601l275o331l634K196
568d245O976L333k717n465l957K725N824L280j754o052l627K578N463L718k594
583C486n801k547J391N694L381k521m995l834K075N477K995j049n293l927J908
598c560M759M016j512n195l047R93M671L775j500m259l601J259M898K687j018
613C366m162l811J931L889L162q03m962l027J336M069L481j504m329k827P20M457
629I86K952j107l586l532J304L763K717k04m330k573Q57L329L207r89l400k766
$$ y = [3848, -5033, -8439, -5277, 4327, 8567, 3665, -3463, -8634, -4170, 4455, 7359, 4652, -3862, -8110, -3180, 3781, 8069, 4251, -3983, -7158, -4003, 4109, 8125, 3384, -3425, -7216, -4248, 3973, 7137, 4137, -3286, -8115, -3976, 2644, 6915, 4571, -3673, -6935, -3936, 2198, 6799, 3524, -2807, -6441, -4245, 2731, 6064, 3347, -2118, -6075, -3350, 2474, 5754, 4000, -2052, -5679, -3101, 2362, 6080, 3486, -2315, -4862, -3471, 2223, 5604, 3083, -1912, -5746, -3671, 1806, 4801, 3752, -1541, -5468, -3560, 1199, 5215, 3703, -1492, -4539, -3546, 1125, 4900, 3400, -859, -4460, -3201, 1697, 4384, 3366, -796, -4607, -2676, 1213, 4375, 3572, -1390, -4417, -3081, 988, 4469, 2965, -1364, -4191, -3471, 986, 3938, 2831, -755, -4287, -2983, 780, 3497, 3293, -1037, -3610, -2753, 576, 3783, 2794, -606, -3372]
645c372N23L606K673r22k932k635O32L068K587p70l372k316P58K934K677m11l453
662g25k307K97L377K450o30k732k864N43L050K365k63k759k848P48K366K708j99
679B577k773k329L42K668K253n92k362k226L22K408K347p81k127k122K21K702
695E28J406J15k382k097K58K156K334j74k476k058J34K284K383k98k187k010p8
712b162J950K397J87k109k122oK054J852j27j852k001QK078J640J10j835k089
729b027J12J861J746J02j972j783K25J797J699Q0j849j778Q9J570K030j49j545
746B08j874n9J724J698L09j720j757J22J233J490M96j593j529k49J176J686Q4
763A445j088j828P9J194J691J39j467j608k08J441J603J61j269j601m2J296J541
$$ y = [-3372, -2849, 757, 3430, 2508, -424, -3059, -2427, 641, 3228, 2458, -914, -3230, -2472, 462, 3139, 2728, -725, -3032, -2735, 642, 3092, 2462, -270, -3134, -2591, 459, 2824, 2561, -198, -3046, -2298, 68, 2776, 2577, -196, -2525, -2183, 485, 2738, 2146, -216, -2442, -2120, 288, 2635, 1854, -273, -2395, -2174, 528, 1934, 2049, -333, -2430, -2172, -16, 2318, 2144, -332, -2390, -2256, 28, 2411, 2113, -74, -2084, -2162, -212, 2185, 2372, 263, -1859, -1865, 189, 2041, 1914, 62, -1939, -1931, 147, 1787, 1897, 62, -2027, -1915, -54, 1692, 1794, -178, -1961, -1736, 61, 1760, 1840, -9, -1787, -1698, -128, 1902, 1753, 208, -1666, -1725, -1, 1697, 2006, 286, -1471, -1349, -116, 1374, 1870, 277, -1252, -1501, -325, 1361, 1445, 357, -1471, -1392, -198, 1493, 1632, 165, -1443, -1651, -210, 1393, 1554, 285, -1316, -1358, -62, 1479]
780A479K51j309j755L7J061J490K41j155j541k71J418J014N77j276j377m75J161
797d30J426K99r61j434k76J053J561J98j242j009k74Q67J184M13j052j384o7Q66
815b62J126K67o69j491j01Q35J042L63p45j194j96P90R71O10q78j310n38Q99J324
834H43L11o53j398k22N56J242K96m12j335r7Q27J144L26j074r32n93P76J348M32
853A385j045j059k50N62J272L40r00j052m14N72J011O61n86j013n08P07Q07N79
871A069p13q55n62Q38J012M99l63j499o02R04J021L80m01j321l52M27R03O06n06
890D85j126m32Q84P90M03n80r17o71O43R11M00l50r42n62P32Q77J58k48p44m13
910g02J91P88N86l38j050n74P28N74O40j58j088l14N99M92N21l14q61q68M42J071
$$ y = [1479, 1730, 421, -1334, -1297, -236, 1254, 1495, 340, -1201, -1472, -54, 960, 1537, 261, -1116, -1591, -430, 996, 1295, 334, -1100, -1376, -323, 1238, 1436, 194, -815, -1089, -222, 962, 1375, 323, -1061, -1128, -262, 864, 1131, 462, -1029, -1130, -295, 747, 1110, 365, -829, -1025, -235, 736, 1346, 468, -842, -1380, -481, 843, 1154, 501, -897, -1119, -563, 679, 975, 563, -772, -869, -42, 1102, 1428, 354, -578, -1171, -395, 953, 1385, 340, -719, -969, -407, 865, 1205, 305, -747, -1161, -589, 422, 1083, 497, -516, -1024, -317, 490, 1069, 356, -499, -1061, -223, 789, 1288, 925, -574, -1176, -272, 749, 1129, 728, -593, -945, -518, 385, 991, 485, -641, -1073, -189, 601, 1004, 424, -493, -1164, -521, 390, 790, 440, -502, -1064, -332, 545, 703, 455, -289, -702, -511, 277, 863, 525, -525, -1099, -371, 203, 843, 685, -403, -717, -118, 374, 895, 581, -280, -1148, -706, 365]
930C65M71o29q44k42L83P52M18k6j133k70J60O45M26n5o22p78L53P49M47k37l97
951f4n98L23M99N54j22o78n14m7O84P31j84q29m28m6J012J30n8m31m64O3L64O48
973E45j51l90n21L5O44M91k92l82k38R6L06O09l19l98o92K2J045Q6Po88n26J46
995e65O80N01p3q64m75M33M38M71j56n74l45j33N17Q89m87k89m76K32M83J74J40
1016E21l99o37n6M34O24N5q67r5J6N72M30k06l84Pl22K54N62j00l05l85p1J79
1038a73M94J66m80m32J20L53L60N4m39m15j68M82M92l47Q0o59J95L17K94ok50
1059C8l30r4K68O23n3m89k86j45M32M40j80m9n04k26M30M38k03j26l79n2M02J64
1081A19M28m26l50Q8o2M27N4l40l44J71J87K15K66k60m57j62L98lN15l28l80m9
$$ y = [365, 836, 207, -637, -879, -496, 256, 674, 648, -485, -755, -595, 50, 476, 421, -201, -979, -626, 123, 570, 333, -64, -662, -339, 160, 714, 592, -86, -600, -647, 37, 768, 584, -245, -673, -719, 293, 423, 365, -66, -530, -467, -103, 545, 394, 4, -517, -482, 162, 653, 361, -21, -259, -163, 143, 752, 433, 35, -657, -635, 410, 496, 503, -185, -711, -565, 115, 616, 543, -321, -796, -363, 75, 546, 390, -184, -529, -662, -145, 744, 257, -32, -508, -276, 207, 381, 521, 122, -515, -571, -137, 487, 542, -325, -420, -404, 168, 598, 392, 8, 15, -307, -53, 509, 409, 104, -281, -352, -173, 321, 487, 7, -425, -305, 48, 408, 462, 23, -392, -560, -78, 414, 67, 147, -512, -317, 0, 294, 288, 38, -292, -386, -118, 505, 452, -37, -323, -468, -36, 404, 224, 175, -329, -555, -125, 313, 110, -16, -395, -447, -45, 119, 547, 121, -229, -141, -203, 224, 278, -62, -406, -235, -48, 167, 433, 173, -284, -446, -48, -51, 464, 136, -244, -293]
1103b93M5N91j93j15n26l5M20L28J17l29k38j05L90J50K00j37l65m80M56M78o2
1124B97k10j27j99J54M39k76K38o68N0L10M86j15k68l28j7R0J73N07l53o89J85
1145c21K90n4M64l40j23j93K59J0J18j13q2k68J14M73J15r6n32k70K43M08r0J24
1167A36l32J14L5J50J05j81j05k21J58N08k7j24l26r7N6L32j3O3j98l39K15K77
1189A86rj2l29j54J00L58nK0k24k38M3J67M23N4k29l95MM32p1n4j79R0k52J09
1213a65L98j35j38k23K12K4N28m48l54J96l3J67J65q7l71R9m2L05N3l3j58l05
1235c45J83J12L19j84l38K21o2K32J72m98m5J63l12L26K26K3k70k52J77K40j13
1256b5J34k34j11K59Q6J24l2m64j6M1M80k86J29k58m5j47L28K37P8l35k6J2J98
$$ y = [-293, -248, 343, 150, 35, -491, -526, -106, 222, 339, 10, -228, -333, 57, 207, 407, 270, -95, -575, -119, 359, 297, 87, -40, -239, -85, 354, 78, 316, -352, -302, 8, 494, 379, 111, -217, -234, -144, 29, 536, 183, -506, -321, -31, -85, 379, 39, -84, -277, -18, -8, 110, -3, -85, -353, -239, 234, 349, 253, -279, -549, -306, 102, 12, 136, -196, -82, -47, 103, 208, 27, -78, -299, -141, 367, 340, 216, -110, -207, -151, 181, 168, 231, 33, -306, -91, 186, 177, 165, -164, -318, -218, 140, 135, 155, -69, -307, -264, -97, 326, 380, 151, -244, -240, 192, 121, 67, -112, -22, -274, -165, 233, 98, -40, -263, -51, -27, 501, 53, -301, -105, -138, 29, 194, 107, -264, -165, -207, 98, 151, 118, -40, -345, -162, -50, 269, 85, -253, -32, -94, 138, 310, -188, -233, -70, -382, -56, 170, 193, -77, -329, -152, 88, -25, 109, -125, -236, 23, 109, 233, 201, -263, -279, -238, 242, -44, 85, -173, -218, -365, -37, 200, 278, -57, -83, -71, 127]
1279A27j20k23K44k99j61N76j63K61m6l85Q8J04n4R2j3l51L56J13O9j09j46j13
1301a53j5L3J55Rkk80J3N07J51m27J09l77J32L68j19j05j57l5n3M92k01k45L44
1324A44k10K73K7j13J47k15j14k35N34j5p9j18l23N00k47L75k48k8qj11J17k9
1346B4J64l31j3K05J12j95K63p2l01Q7N0n6M25l52k3J40k01K50J0l99K63j60K04
1369I4j95L28k12j47M3l4M46j63m71K07k5J44l7R3J19k87J12K1M2J3l64J35J27
1392a1K27n7k48L20m32K09k03M04j93j9m42L04J52L15l7k19m1k53J63L02j2l9
1414A90k72k6o8J60L1rk19N8j08M44J68k87p5k07N8L86j59O3k06M7J22J16p4k10
1438g7Q9o4r1J69J25r6p6k45N00L4j29M5l52p7L48J00nj25o9m8j50J49r5K19j99
$$ y = [127, 7, -216, 28, -271, -432, 144, -19, 242, 196, -189, -101, 3, -51, 41, 28, -323, 33, 146, 215, 106, -40, -153, -168, -135, 20, 29, 27, -253, -240, 267, 418, -9, 100, -277, -145, 223, 104, -1, -158, -193, -246, 246, 45, -200, 144, -66, 207, 234, 121, 268, 53, -61, -296, 238, 223, 144, 26, -297, 203, -44, 331, 83, 55, 47, -64, 53, 24, 188, -143, -156, 49, 161, -34, 229, 157, -144, -57, -7, -63, 362, 10, -13, 127, -74, 176, 186, -213, 50, -110, 94, -101, 227, 15, -132, -89, -123, 323, 160, -311, -104, -129, 15, -22, 71, 190, -97, 15, 36, 78, 91, -273, -138, -11, 216, 159, -89, 231, -201, 8, -195, 209, 16, -3, -445, -141, 11, 326, 289, 70, 29, -224, -61, 241, 229, 190, -82, -108, -176, -16, 15, 6, -213, -155, -263, 181, 349, 62, -13, -220, -162, 224, 65, 128, -78, -31, 91, 207, 133, -77, 12, -52, -143, 26, 151, 55, -21, -266, 234, 268, 139, 184, -168, -245, 103, 203, 198, 73, 4, -44, -194, -45, -140, 79, -120]
1463a20J62j87K28J32m49J37j44K77m6J21j84J0j05n0M45k0j82o5j87L25M5m0
1485A03q6j77Ln7K98J53o9m14Q6K52r8J6l7MJ05k90L78j04Q1l14K7%K79O1j64
1510C6j17K1k02L97r9J35j81k36n8L28j4j09O1Q3N7L2K41j78m67n9K16O2L66k61
1534E4J63nn69N29J14j64o7j07R4R2j75k1R7J40l17J61K60l41K14k22J23j0k52
1557b09J88K88l41J36N3J10n1k80J52J54q2O3J5k07K79o2p4J18j74n7k98P5K22
1580A8j45K04k63Q7J90M8k77J59o1J30l69L94j29J00k99j10N05j07k74M20l10
1601h9N0J68r0L3L45n67K09P9j97M0j89J65m7K32k05J92m3o3j20k7k5L85k62k0
1625d6m7K45p9n5j08P3k75K65J41ok39K13j33K66j70j27J96j54N2m6m1J35r5K8
$$ y = [-120, 42, -145, 83, 215, -234, -97, -241, 36, -10, 111, -73, -63, -168, -218, 227, 207, 25, -40, -227, 98, 143, 103, 17, -160, -157, -214, 84, 237, 168, -246, -160, 92, -6, 10, -27, -23, 82, -208, 170, 66, 147, -167, -140, -140, 139, 200, 36, -81, -60, -262, 135, 36, 171, -10, -246, -304, 24, 10, -99, -38, 45, 102, 134, 375, 197, -270, -329, -113, -51, 315, 54, 217, 212, -357, 172, 286, 122, 55, -52, 42, 134, -41, -62, 35, 175, -142, 19, 279, -62, 152, -70, 53, 43, -209, -21, 267, -74, 62, 115, 225, 174, -106, 46, 200, 118, 181, 196, -11, 268, 206, 132, 250, 76, 19, -279, -204, 18, -127, 77, -186, -99, 91, 139, -138, 21, -40, 90, -279, 115, -14, 86, -213, -323, 182, 75, -199, 221, -89, -39, 129, 39, 72, 417, -150, 59, 138, -59, -19, -208, -43, -90, 142, -63, 129, 86, 23, -97, -124, -149, 236, -26, -46, -93, 152, 73, 18, -90, -17, -292, -27, 114, 108, -131, 82, -51, 215, 45, -82, 114, -40, 12, -34, -75, 60, -35, -7]
1649gK44k87J78L10n85K31Q6q3k6r1J72j4m31L89RL8j8l00K19P8j21k52L36k23
1673a48p8k8L05j75L3L0J95k14M1J25j7mj85nL65j12k19K25k06J7J92K04k76j60
1697i5J77l6o2M4j64J60j07O5J7K03j23j41j87Q5K56j30k3J43j47l2Q3j61L65
1720A90m18K76R8m10qo6L79j03l09L72J96j18kk81K52j23o6K14m3j6J18l24K36
1743D4n4L1K9j88Q0JM4m6J01J4j31J29j78q7R7Q6Q5k88K45QJ0O4m2k75L16l7k39
1770a81J78k20L91J41m62P9j80K15R5P6J31k45k71M26j50k8M7N5r2m0k11P5K73
1793A02j9k03J52J15l73L96j87O4j24J56j05J27M7l37k0K45j82Q7q2K58rj26R7
1816G9N8J1k11k5J65n8m7p8J62j47J89O4n7j9J10j94K47J45m20P4q3p7J92k15
$$ y = [-7, 237, -50, 128, 438, -147, 84, 170, 87, 61, -30, 142, 128, -303, 86, 95, 133, 115, -185, 34, 112, -9, -261, 75, -148, -226, -254, 51, -124, -91, -61, 134, -80, -39, 86, 69, 65, -120, -125, 240, 128, -91, 134, -72, -55, 137, 341, 65, -95, 82, 46, -16, 28, -136, 24, -83, -18, -1, 202, 79, -62, -249, -164, 92, -38, -61, 82, -65, -97, -14, -175, 190, -228, 48, 146, -264, -272, -338, 41, -62, -371, 1, 197, 79, 77, -204, 48, -75, -141, 73, 30, 14, 132, -192, 44, -10, 21, 50, -138, -58, -57, -13, -59, 42, 56, -75, 54, -124, -211, -114, -28, 57, -231, 14, 22, 32, 96, 54, -221, 95, 58, -181, -3, -223, 168, 309, -153, -74, -254, -39, 56, 132, 263, 18, -253, 173, 23, -5, 42, 97, 5, -35, -246, -171, 102, 83, -120, 32, 147, -226, 170, -17, 47, -77, 79, -26, 101, 148, -189, -209, 36, -146, -59, -141, 117, 108, -18, 79, 137, 148, -63, -88, 77, 19, -28, -106, 56, -91, 98, 162, 105, 86, 196, 2, 249, 394, -26, 48, -35, -112, 80, -135]
1840a35K59j03L6l67M13j65K10j08N8j25j09K63M5l14J66p5m1k9L61M7k83M0j57
1863a13K32O0r0q1j82J64J30m00L00K0j34j03K12J62k24l5j58P1K27j14j39J73
1885b2k0J42P0n3j93kJ52j81K57j01J0J49j76qj66Q7K46mj5j11J10k4j29l2n6
1910g0o6Q8J65N9j83K4j13J46J7M5p7k40L51K4k36K10kj35J19l9j45P5j31J09
1934ej99J55K98j85J10l75M19r8k08J08M6k31J61p8QM1J56q5j08O3PP0Q7j23k67
1959b33K77K12j78K23j90%k37K17j75J53j03L2Q5j18q8P5P8J41j91J98k97k9K40
1982I2K8k18J28r0j51J96J60N1k99K24j38p8Q3nM9j61J82k4j10M31k61j94P8J67
2006A40l42M09j64J48k62K64j63J51l13O6r6K33m6L74k30k96m3l8M6L29r1K4q0
$$ y = [-135, 124, 21, 57, -310, 103, -62, 148, 40, 98, -27, -136, 127, 172, -142, 24, -51, -92, -121, 240, 287, 4, 44, -113, 119, 179, 89, 8, -174, -10, 120, -280, 20, 40, -94, -197, 15, 177, -47, -82, -240, -169, 58, -56, -195, -22, -42, 100, 170, 117, -76, -78, 74, -107, 150, 49, 59, 208, 32, 24, -142, -55, 191, 187, 172, 61, 171, 147, 18, -14, -70, -136, -48, 117, 176, -7, 17, -96, 50, 67, 112, 35, -205, 146, 170, -66, 144, 142, 7, 126, 87, -58, 17, -114, -5, -204, -49, 249, 64, 174, -201, 218, 120, -88, 20, 66, -165, -4, -82, -74, -33, 123, 38, -70, -7, 0, 70, 157, 34, -233, 44, 256, 78, 301, 111, 111, -126, 91, -84, 69, -34, -2, 83, -35, -123, -48, 30, 171, -20, 178, -119, -148, 92, 120, -98, 30, -60, -211, -15, 145, 196, -103, 121, -17, -95, -12, -17, 32, -129, 53, 29, -81, 350, 89, -105, -27, 140, -202, 207, 43, 191, -71, 193, 30, 181, -132, -66, -162, 71, 25, 399, 169, -127, -170, -208, -162, 167, 76, 100, 20]
2029B0o0O4j68K64q9l0j2K4OM12m56j7n9J05j51J17J32j70J7O5k51J71n5L38m4
2054A73ok79J46o6P2K0n5j27K29j75M3J23l03K61l9n5m6J73q9J55j16j33L68m07
2078a33J03K53k73N1j56l4K55j77L43m32R3j15J89L9K34q2j01R2k71L74j90m5
2100A7k54K45o4k4j7J70J17k12P4n2r8K50j00J5qJ67k94K55l43K49k03K8J65k79
2124a96L77j25j1p5K48l36K10J2J35j72j86J57j24R5j06J36J4j48RK58k39j65
2146b32M53j22j7j24m0K52m05L51q7j59k3K45K7q0J89k56J24k86J72J14N1j29
2168A8L9L3p7J30p6j65j9k9J59J6l98J89J77j15MJ0k3J00L4L5p7M52j21j26Nj54
2194B1k57K24N2j06J15M4k29L56j71J11k77O8M1M7j31J62R3J6l66K95j75M1l24
$$ y = [20, -40, 24, -144, 120, 31, 1, -11, 13, 19, 431, -25, -42, -101, 4, -147, -30, 102, -68, -51, 14, -237, -66, -121, 217, 173, 167, -112, 34, -32, 40, 60, 5, -122, 107, -68, -25, 98, -205, 56, 17, -38, -84, 89, 0, 155, 39, -94, 274, -133, -30, 223, -50, 1, -155, -189, 66, -111, 232, -200, -107, -222, -33, 6, 240, 158, 57, 149, -122, 252, 62, 17, -237, 8, -56, -80, -97, 73, 190, -22, 52, 0, -98, 152, 52, 67, 59, 226, -68, 187, -156, 93, -110, -82, 83, -196, 181, 56, 45, -30, 218, -118, 92, 104, 239, 67, -119, 38, -86, 9, -97, 39, 53, -95, -86, 172, -67, -232, 221, 99, 82, -42, -82, 170, -235, 116, 29, -130, -153, 92, 119, 39, 228, -28, 96, -190, -18, 96, 147, 18, 57, 90, 13, 143, 67, -98, -117, -146, 13, 29, -369, -180, -3, -118, -114, -104, -127, -27, 7, 42, -35, 417, 296, 170, 175, 21, -236, -12, 40, -66, 49, 93, -136, 220, 49, 160, -117, -49, -8, 39, -92, 70, 163, 179, -187, 108, -67, -26, -350]
2217c50K30k4J36p0J57P1r3M4l34J66K93l15k2R6mJ22k62Q1N5J22P8l19R4L04
2241B56k77m5MP5m0J88p8k32L79j85q2J86r4j94K01M4j46J61k22J89L9k31K70
2264A66q3r3J3J25J7k66J86l8jj19K27j07Lo0J11J85k88o9j00M04k97J97j14J13
2288A12P9J1l72M0K56R2k73J91l42J68O0J59m31J35K54p2k4J36o5k24J44J65R6
2311B95m17K25Rj63J15K61m15J57m9K1K55j50m27J79m5L41j59j45J48K7q0J36
2333A19mJ74k16j46J44m1m8p5L56o02L34K38n25O17n37p8L50k82L58k49k5M06
2355B68%k88L6j3q1R1j8q5J38J24j90m5R9k6J76j74p7j27J49n2R2P1L3n4M6j04
2381a1J28K3J59l53k23L34J37Kj75m0q0J10j38J88L40m01J22N2O5k79P5q2K09
$$ y = [-350, -120, -144, -8, -78, 79, 150, 57, 101, -233, -67, 226, -89, -111, -15, -19, 103, -159, -78, -23, 99, 177, -142, -48, 256, -21, -66, -62, 13, -27, 161, 83, -149, 230, 45, -37, 149, 55, -139, 62, 106, -40, 121, -101, 88, 127, -104, 166, 83, -10, 3, 128, 145, -121, 65, 27, 26, -93, 134, 27, 30, -30, 81, 266, -22, -91, -191, 213, -84, 113, -1, 112, 191, 202, -170, -130, 126, 218, -55, 136, -206, -38, 22, 181, -250, -115, 139, 67, 43, 179, 114, -110, 34, 199, 295, -122, 103, 112, -51, 64, 325, -90, 67, 18, 39, 294, 144, -283, -104, -149, 192, 33, -112, 36, 63, -17, 119, 115, 289, 73, -73, 71, 30, -18, -93, 263, -339, -5, 233, -292, 325, -212, -290, 60, -222, 136, -113, -138, 268, 268, -20, 16, 3, -78, 13, -5, -90, 48, 172, -18, -63, 36, 10, 186, 12, -65, -192, -43, -95, -3, 68, 101, 47, 93, -11, 117, 140, 299, -54, -277, 57, 194, 196, 21, -19, -99, 11, -127, 61, 401, 0, 122, 174, 239, -40, 35, -47, 162]
2404A62l2j31Q3K1LL43l79m1l04K82K59l62K90j98Kn1P0J80l30N6K10M6l26K6
2428a21M34m99Q3J50j56o1J06K23l78K63J70k01M9j18R0O2R9k10r9J18Ln9k8K68
2452A88j15N1r5o3LJ34r4Pk2k7J78nk70K48k05K35j72p7K24j37L0k19Q9J80p5
2477in4J23q5J94k29J50k53J00R9L9Km6J70k65L4j5M6j60K73J2K1J4j36p4j65
2502b14K18o5n0J40j61l0L62m91J30J93j05J37J96k29R3m01K69J83j51j39J48
2523C3J8k32K89%j00k05L33k12J32jm0L0M4k90J14n1K04M2j07n7J85j51N8P0p1
2548C5J95l22L1j21K88j85l0L88j68j05J90k05k01K66j69l1J01k97L50K62m10
2569a38K56k69J18L2j17P5N2R6j98j08R7J46J18k18k9J33N5p8p3J14q0N0K06l34
$$ y = [162, 130, -1, 82, 103, 106, 449, 70, 29, -275, 7, 266, -96, 194, -4, -2, -53, 17, 197, -133, -77, 133, 179, -147, -121, 313, -186, -103, 47, -109, -170, -64, 159, -219, 44, 214, 13, 62, -56, 34, 96, 195, -15, -114, 4, 7, -52, -80, 188, 73, 124, 29, -34, -31, 103, 9, 16, -6, -33, 145, 140, -130, 118, -87, 148, -24, -101, 123, -14, 16, -203, -114, 66, -9, -63, 60, -25, 169, -60, 90, -163, -63, 36, 75, 77, 31, 201, -64, -30, -45, 1, -159, 114, 126, 147, 161, 25, -49, -214, 4, -61, -111, 29, -132, -162, 200, -291, -161, 32, -73, 64, 260, 31, 124, -277, -8, 175, 24, -115, 33, 51, -181, 108, 108, 8, -197, 136, -76, 56, 55, 15, 45, 89, -201, -87, -138, 66, 108, 1, -56, 129, -22, 36, 106, 35, 230, -92, -61, -182, 106, -79, -109, 279, 111, 6, 196, -9, -210, 56, -113, -144, -43, -340, 10, 272, -138, 118, -151, -33, -1, -118, -43, 9, 105, -93, -201, -104, 42, 160, -58, -87, 46, 101, 23, -50, 64, -16, 34, 240, -94]
2593i4m6M40n25K77j59j12J65J98p1J9p6j24K26q2j37J40j07Q0p4j15J76k1J89
2616A67m9n7j32J49j16K02j95j8j50K58P0j66k3K40J98m83J20nJ6j9O2Nj16J24
2640H2J78l54M1J44N4m06J91j04P7Q9k75M26j57n9j91L23M9J47l24Q3O4p2r2M44
2664C58L1l25J22J86m50K07l9k35J38o7n7P3r2QJ77p4j12J35J00q2J02l7q3j02
2688a18J19M3M6k41J79l3Q2J18J3m4M5o0j70J97j33Oj97K2L07k80P9J58j48j16
2712a26L65l63L54k89R0j2k16j4J93k56J32M1j9%R7l0L5plR9q8N5l9OK86l46J85
2739A30l3k05J64n4p5J63k47J61j42J33R6k58j14K96q1o8k35L05m5J54j80K30
2761I5j07k64L17J8q3M8Qj61P1K79j93n6l9L15k43J32m34J07K28pk71J70J83j57
$$ y = [-94, -140, 300, -225, 52, -107, -219, -54, 144, 73, 92, 16, -108, 118, 36, -101, 39, -68, 12, -62, -177, -1, -22, 167, 118, 61, -71, 78, -38, 164, -31, -49, -199, 59, 129, -37, -60, 180, 378, -105, 15, 10, 26, 7, 69, 74, -42, 82, 260, -94, -53, 91, 145, -261, -70, -174, -97, -8, -283, 143, -14, -73, -264, 59, 108, 255, -69, 14, 78, 6, -86, 358, 389, 64, 186, 372, -78, 129, 90, -145, -7, -74, -131, -58, -150, -142, 35, -39, -151, -16, 84, 2, 104, 67, -16, -118, 1, 44, 90, -151, 28, -5, 77, 195, 208, 164, 209, 149, -21, 176, 43, 49, -148, -126, 181, -99, -20, 138, -10, -126, 239, -124, 230, -59, 31, 19, -197, -211, -18, -274, -142, -101, -120, -120, -23, -53, -18, -25, -28, 71, -17, 38, -1, 5, 291, -55, 130, 97, -108, 56, 2, -73, 90, -157, 4, -138, -5, 91, -167, -281, 15, -66, -134, -369, -64, -109, 45, -135, 95, -12, -276, 41, 59, -24, 24, 32, -129, -58, 221, 28, -28, -67, 248, 5, 137, -297, -190, 38, 31, -240, -70, 113, -44]
2785d4q6K28j93J83q7q3Q9k07K55r3p0L9L34k15P7k87Q1J86o9j19K22q9K6j83
2809a05j36J14K0K54l27L68L1k32r0J72n5L05k40j58J97k30L1J7J98j31j16J25
2831A2J46l09m7K30P4j20j58M23j46j52J19j10L2k43L43o0j29J95l11P2R1J8k90
2854c20J41K56k92K67q0J18q4J3K5R1q5k5J62k3o0m0P3m1l19N8J21Q9P6j83K84
2879B22j21k40O0J6K09k04K7p4k0L31j58j3j47J92k16J73%j26M0l8N3q8J85j81
2903a18n6J54R8rj3j2j33K3l3l2K91k7j57r4M0P9J1j31K59k50L12m74K76K45l98
2928a49J82R9k00J52k74K16K4k62o2K24l0J66q9K83l16N7J43m4K13l16K41j31
2950A27M2lk45K3O2M1J27j98J08l3j15R5l16K15K2j05K66j00j0j59M58l80j9L91
$$ y = [-44, -130, 98, -95, 88, 1, -82, 7, -200, 55, -38, -108, -69, 265, 50, 127, -160, -79, 107, 38, -81, 141, 52, 78, -105, -241, -127, -107, 147, -180, 188, 219, -13, -103, 69, 14, 319, 79, -79, 118, -112, -81, -64, 134, 3, -113, 12, 158, -151, -198, 32, 106, -14, -172, 251, 105, -47, 72, -38, -6, -249, 94, 34, -95, 100, -211, -139, -48, -30, -320, -179, 77, -215, 52, -28, 90, 6, 19, 44, 135, 50, 25, 187, 164, 104, 64, 137, 96, -223, -165, -44, 45, 121, -62, 222, 101, -139, -79, -63, 146, -58, -31, -105, -125, 206, 48, 35, -112, 80, -136, 37, 37, -89, -49, -87, -34, -122, 63, -118, -174, -20, 78, 69, 56, 44, -89, -66, -99, -131, 160, 133, -24, -118, -78, 1, 12, -119, 140, -110, 202, -272, 4, 249, -149, 33, 132, -68, 84, -190, 26, 50, -212, -274, -50, -80, 86, -3, 280, -36, 21, 164, 120, 333, 17, 258, 127, 169, 166, -79, -56, 6, 47, 174, -24, 84, 51, -64, 31, -285, -70, -48, -153, 113, 13, 3, -156, 302, -78, -97, 294]
2974B94j81k68O4J27m9J37k07K00n2k30K31J02k39O3M3R2k23Q6j52K18K66l68
2996d6R6K5k54K37R6M5J96n98K54jo6J13j16n6lk9J65q8p0L4M4On6J62N8o5k9
3023E4j12J71l37K57j3M2J12j29j82j33K49k01L20J2j96jK16m4j57K00k13M3J02
3046F0j95R8k05L86k83J44R4j13J8K67k71O6k89J74K8mn5m0J82j00j28J99N9k96
3070b04M25j08n3j0l08N97k58j87l9J68j16J15K6m9j43P2K24k47L4J12j16j21
3092a86K42N3k06o2J58P3Q4k23l5oO4J16m65M36K9n3j7J13j30mJ42j76J2P3N3
3117H5J16K3k19j31j09L38r3j93K6K01p7%o0k0j99L10J43j36qL2n0k00L12j58
3141f7o4J15L3jP8P8k57Q9J79r8j4j56K9J95k74O9J59K5J26k93J06J89l86K85
$$ y = [294, 113, -155, -91, 36, -13, 124, -83, 117, 65, -165, 66, 168, -71, -8, 35, 127, -96, -10, -162, 56, 322, -46, 50, 75, -179, 58, 154, 199, 395, -203, 51, 50, -16, 97, -19, -75, -78, -107, 58, -30, -100, -66, -22, -16, -72, 90, 148, 83, 54, -58, 113, -224, 33, 20, 62, 174, 45, -137, -270, -21, -222, 98, 110, -86, -87, 129, 85, -72, 128, -85, -42, 60, -135, -37, -242, 144, -139, 5, 99, -14, 4, 271, 0, 66, -223, -49, -21, -25, -80, -120, 62, -38, -166, 33, 92, -204, 221, 113, 60, 50, -258, 339, 81, -106, -145, 23, -93, 22, 48, -1, -144, -72, 152, -95, -61, 51, -65, -186, 56, 109, -97, -159, -1, 72, 156, -67, -102, -108, -44, 72, -393, 43, 72, 19, 2, 115, -15, -19, 123, -53, -41, 32, 85, 201, 224, 5, -126, -235, 103, 10, -183, -157, 44, -33, -33, -93, -113, -312, -2, 141, 5, -3, 29, -21, -221, 91, -67, -131, -16, 17, 16, 94, 172, -85, 4, 183, 85, 71, -85, -56, 139, -135, -66, 93, 118, 244, -49, 57, 246, -140, 145]
3165A45k8j85K12p6Mn9M4J6p3J83j23nM7j68J79l5j31o5M9K71k71M44k02n2j52
3190c1P5L0j16l55M35J20k59K1J86o2K6k30L2K86k03k3J0J97j28l9J81j2j42o7
3214f8P6J36j40Oo7K62r9r8J0m8j73M9r1J99R2K0qj58O3p6r1J90M0p7J42m4J32
3241A79k64K20j96J68j2p0J05Lj95Q0r1K6o9K16p7L4j16j4J54K34l52L00l89J94
3265F8j69O8J69j75O7J61l58K12J2j00j59m7K86K31j17Q6l45K39j57j82K41q0
3287d9K2J42Ok55k2Q1k19L34j70J95J75m35M74m83N0J86K5o3j48J11R2o0K33k54
3311c2L2n0J95l28r5J63J75j91J60O8O2j24j71K55j99J50J31k41JN2J24j18r4
3334g5q8M47j17q1J5J9j32q9L9K77j14p3j47K43l6m27K67O3q4k7JJ79o5N8k6j97
$$ y = [145, 117, -68, 144, 68, 72, 13, 57, 73, 0, 183, 60, 55, 102, -66, 113, 78, -53, -118, -69, 202, -69, 375, 173, 121, -31, 44, 74, -42, -397, 38, 158, -101, -80, 106, 44, 70, -160, -128, 158, -45, -68, -58, 139, 11, -28, 153, 141, -1, -68, 8, 144, 4, 10, -57, 205, 106, 8, 18, -30, -203, -154, -245, -46, 46, 66, 58, -100, -37, -113, -204, -14, 26, -51, 91, 47, 179, -85, 135, -61, 107, 95, 25, 130, 133, -62, 18, -73, -47, -116, 100, 23, 57, -59, -73, 81, 315, -37, 263, -126, 68, -101, -33, 136, -39, 28, 189, -169, 43, 55, -45, -204, -251, 35, 266, 149, 235, -110, 129, -28, -210, 31, -49, -27, 115, 121, -134, -156, -75, -294, 40, -130, 65, 240, -195, 279, -204, -154, 32, 57, -6, -154, -43, 49, -11, 222, -32, 0, -50, 145, -183, -278, -115, 60, -131, 29, 97, 159, 35, -136, 119, -80, 70, 201, -40, -39, 13, 137, 19, -75, -163, 284, 167, 86, 101, 120, -12, -101, -62, 215, 101, 28, -119, 124, 88, -339, -72, -9, -93, -120, -119, 60, -5, 53, 27, -170]
3360a70J58k6J66l59N7Q8J69j26J96j07l0J09j21o9J18LJ21o8r1J24j71J85n43
3383c87L39K4j21R7J70K95l69j41k8k50M11M2j34n0J96J21k05J11j23Q6j83K65
3405A66j55p4j82L5Ml0J68O7k01L20j72J36p7J79j71j8J93l2k92J48m4m9J26p6
3429c1J99j84P0k21J39j6J29nj19J19p4K02j73k94N31k29j03r6K78m23L13o2R6
3452D6j0rl7Q4qn2J30j70J77k6j89R4J33o5kL1j43j71%RK95j54Q7N3n6o0j5j0
3480c8P8j22J67j01qP1j15l5m1J40J57j32J77j45j31q2PR1K96k17K72k66K00k93
3504g0J56l10J20L82m99K50K5j67MJ10k4NQ0j77J75j05K4R1j31r4L04r4m4J08
3528A19j60K66l71O3rJ41K62k96O8j83L2O9Q4j38K29k33j40J71J31k16J61J49
$$ y = [-170, -12, -38, 128, -231, -174, -86, 83, -43, 153, 46, 16, 125, 4, -65, 53, 56, 177, 109, 18, 142, -29, 156, -387, -48, -24, -145, -48, 122, 417, 48, -93, -121, -371, 40, 82, -52, -102, 94, 215, 10, 121, -2, 84, -99, 166, 11, -63, -245, -210, -206, -236, -68, -1, -202, 118, -54, 82, 5, 184, 13, -5, 188, 156, -136, 12, -32, -81, 45, -31, 168, -16, 54, -167, -28, -44, 85, 80, -39, 80, 6, 208, 35, -259, 272, 43, -60, -156, 122, -301, 12, -50, 46, 36, 27, -10, 74, 66, 14, 144, -26, 151, 125, -64, 30, 163, 98, 96, 127, -16, -187, -187, -178, 117, -37, 50, 103, 47, -13, -28, -38, 40, -82, 85, -16, -24, 47, -68, -103, -144, -4, 153, 21, 198, 53, -78, -160, -153, -62, 234, 17, 289, 23, 223, -70, 86, -224, -104, 278, -221, 29, 54, -113, -109, 1, -23, -18, 62, -115, 60, -45, -21, 70, -61, -155, 149, 55, 11, 119, -41, 225, -146, -83, -92, 49, 311, 15, 83, -100, -68, 1, 85, -53, 176, -57, -197, -26, 105, -111, 50, 199]
3550A99p7k59J6JL43l11R3j47P3J69p5j31P2K85l06K71M7l96J87M9l33J26K31
3573A27K2k22j91K79J98l28P5k32M60j32q3J58r3j57L47k55j06L7K00k48p2J33
3595h3J70q6K8K5k6lk34J77j70J48L57k32R8R0m32K47K3r0j33m9K59k00J53nj43
3620a11K0P1L19k10j7o3p3k6K87j56n0J16K4k17K93k60L3l6MRRM7o3K58k86L30
3646B52j46l07J55K04J38n08J80Q3KJ38k66J44k30K81m2j37j28R4R2j0L9k06L4
3669a44Kj21K97k6L24p51K70L73J08j55l50ML23j36qL7j15J97k32J98k56r7L22
3692F4j81L44j67p9K3rk4m2K14k77J23N6k12RK28k66O5J68J39j68K67m35L62p2
3716A30J9j30j5M7j65N8J52l9j84Q5J56k24J01O2k69K47j92L46k72r9J39L29k43
$$ y = [199, 122, -137, -121, -120, 223, -88, 5, -142, -69, 100, 25, -106, -34, 251, -55, 216, 263, -133, 54, 103, -230, -104, 127, 149, -73, -264, 15, 213, -115, -40, -272, 188, 56, -27, 131, 38, -119, 228, -27, -133, -96, 104, -144, -216, -83, 87, 1, 29, 54, 28, 25, -209, -32, -202, -54, 303, 71, 169, 259, -173, 74, 97, 7, -126, -175, 84, -116, 37, 32, -111, -91, -20, 299, 89, 72, 9, -64, -90, 197, 41, -9, 107, 131, -86, 207, -53, -20, -56, -52, -43, -34, 13, -50, 208, -78, 252, 106, -201, -46, 158, 296, -212, -32, 51, 53, 191, -75, 69, -161, 120, 78, -59, -187, -93, -1, -11, 28, -178, -144, -142, -263, 34, 8, 332, -419, -149, 224, 332, 177, -173, -169, 154, 18, 10, 47, -68, 129, -103, 95, -161, -258, 64, -117, 227, 60, -19, 4, -5, -29, -71, 143, -134, -11, 45, -167, -158, 70, -196, -131, 37, 176, 8, 275, -160, 202, 130, 149, 19, 4, 51, -114, -56, 96, 57, -127, -42, 114, -110, -9, 53, -216, 31, -161, 185, -87, -186, -47, 282, 39]
3739C9J30k30M6k25K63M5m2q2m4Lj6Q9N4J45k76N4L24j63k39J84J09l44K52j98
3763a22M6q8RKJ96n4QK49j96j51J67N4N4m0j52J12j40K7j32j52M37j25n6J35L6
3788A24Q6n59N19l24J42j37O8J1J25P9j84J87r1J23lj71K15k25K18n4k33J84j41
3811d1n2J09j12J00M9mj3K0k24K17J5j32J31O2r0J29n5j58j36J81l49J66L4P0
3835h3J38q7J59o4O6j03k79L52lj52J37K73l37J49l91M27k75J26r3J7R5j42J1
3858e9J47k3J16j46J20r6K34k97J03p9P9k74l6L09l49K10j58K88J1r1m5o5K46
3881A45j14K2o2L4j62M1J67k38J57R0J02n5j94J21J12j32J18p5n2N0j81m2K86
3904A38L9j15m4k55J24K11l40K79j23J73k92L67j73J4rj6J0L64l34J61k06L4k26
$$ y = [39, 169, -61, -15, -240, 23, 68, 26, -56, -100, -97, -113, -24, 30, 175, -101, -47, 277, 114, -125, 59, 168, -176, 76, -122, -76, -164, -155, -153, 43, -11, -3, 246, 50, -101, 66, 120, 174, 134, -18, 94, -46, -19, -151, -303, 134, 9, -47, 88, 124, 210, -349, 170, -154, -12, -149, -81, -70, 55, 134, -50, 137, 46, 169, 166, -5, 210, -15, 203, 149, -84, 100, -41, -93, 16, -96, 4, 53, 49, 36, 56, -168, 49, 64, -68, 63, 125, 35, 164, 109, -49, -185, -4, -353, -187, -153, -83, 55, -32, 127, 63, 129, 26, -253, 99, 96, -56, 81, 354, 17, 166, -225, 202, -73, 53, -40, -23, 72, -70, -59, 88, 65, 181, 35, 155, 59, 293, -4, 99, 20, 99, -175, -211, 98, -251, -41, -199, 89, 100, 9, -36, -101, 145, 31, 53, -9, 25, -137, -96, 71, -167, -10, 80, 182, 127, -67, 54, 166, 34, 152, 77, 25, 75, -106, -148, 138, 177, 62, 18, -237, -113, 98, -242, 37, -86, 87, -205, 162, -11, 3, -6, -22, -12, 352, 18, 179, -27, 7, -219]
$$ [...]
8191B45
##END NTUPLES=NMR FID
##END=
