##TITLE=1H_PR192_5T
 D2O, 8 sc, 
 28.10.2020
##JCAMPDX= 6.0         $$ Bruker NMR JCAMP-DX V2.0
##DATA TYPE= NMR FID
##DATA CLASS= NTUPLES
##ORIGIN= UXNMR, Bruker Analytische Messtechnik GmbH
##OWNER= root
$$ XWIN-NMR		Version 3.5
$$ Wed Oct 28 13:47:38 2020 Russian Standard Time (UT+4h)  she@DPX200
##.OBSERVE FREQUENCY= 200.1315066352
##.OBSERVE NUCLEUS= ^1H
##.DELAY= (6, 6)
##.ACQUISITION MODE= SIMULTANEOUS
##.ACQUISITION SCHEME= undefined
##.AVERAGES= 8
##.DIGITISER RES= 18
##SPECTROMETER/DATA SYSTEM= spect
##.PULSE SEQUENCE= zg30
##.SOLVENT NAME= CDCl3
##.SHIFT REFERENCE= (INTERNAL, CDCl3, 0, 15.7039)
##AUDIT TRAIL= $$ (NUMBER, WHEN, WHO, WHERE, WHAT)
$$ ##TITLE= Audit trail, XWIN-NMR		Version 3.5
$$ ##JCAMPDX= 5.01
$$ ##ORIGIN= Bruker BioSpin GmbH
$$ ##OWNER= she
$$ F:/spectra/data/she/nmr/H-F/1/audita.txt
$$ ##AUDIT TRAIL=  $$ (NUMBER, WHEN, WHO, WHERE, WHAT)
(   1,<2020-10-28 13:46:45.00 +0400>,<she>,<DPX200>,
      <created by zg, POWCHK disabled, PULCHK disabled
       configuration hash MD5:
       00 E9 B6 7A A2 85 ED C7 34 08 36 98 17 FE 4E 26
       data hash MD5: 16K
       24 4B E2 C9 FC 9B AF 8D 46 A5 43 CA 08 3F AC 4A>)
$$ ##END=
$$ 
$$ hash MD5
$$ B9 4A 42 B8 37 E4 22 36 A4 ED B5 27 2B 1E 5D C4
##$RELAX= 
##$RELAX= 
##$RELAX= 
##$RELAX= 
##$RELAX= 
##$RELAX= 
$$ Bruker specific parameters
$$ --------------------------
##$DU= <F:/spectra>
##$EXPNO= 1
##$NAME= <H-F>
##$PROCNO= 1
##$TYPE= <nmr>
##$USER= <she>
##$AMP= (0..31)
100 100 100 100 100 100 100 100 100 100 100 100 100 100 100 100 100 100 
100 100 100 100 100 100 100 100 100 100 100 100 100 100 
##$AQSEQ= 0
##$AQ_mod= 1
##$AUNM= <au_zg>
##$AUTOPOS= <>
##$BF1= 200.13
##$BF2= 200.13
##$BF3= 200.13
##$BF4= 200.13
##$BF5= 200.13
##$BF6= 200.13
##$BF7= 200.13
##$BF8= 200.13
##$BYTORDA= 1
##$CFDGTYP= 0
##$CFRGTYP= 5
##$CHEMSTR= <none>
##$CNST= (0..31)
1 1 145 1 1 1 1 1 1 1 1 1 1 1 1 1 1 1 1 1 1 1 1 1 1 1 1 1 1 1 1 1 
##$CPDPRG= <>
##$CPDPRG1= <>
##$CPDPRG2= <>
##$CPDPRG3= <>
##$CPDPRG4= <mlev>
##$CPDPRG5= <mlev>
##$CPDPRG6= <mlev>
##$CPDPRG7= <mlev>
##$CPDPRG8= <mlev>
##$CPDPRGB= <>
##$CPDPRGT= <>
##$D= (0..31)
0 1.2 0 0 0 0 0 0 0 0.06 0 0.03 0 0 0 0 0.0002 0 0 0 0 0 0 0 0 0 0 0 0 
0 0 0 
##$DATE= 1603878404
##$DBL= (0..7)
120 120 120 120 120 120 120 120 
##$DBP= (0..7)
150 150 150 150 150 150 150 150 
##$DBP07= 0
##$DBPNAM0= <>
##$DBPNAM1= <>
##$DBPNAM2= <>
##$DBPNAM3= <>
##$DBPNAM4= <>
##$DBPNAM5= <>
##$DBPNAM6= <>
##$DBPNAM7= <>
##$DBPOAL= (0..7)
0.5 0.5 0.5 0.5 0.5 0.5 0.5 0.5 
##$DBPOFFS= (0..7)
0 0 0 0 0 0 0 0 
##$DE= 6
##$DECBNUC= <off>
##$DECIM= 32
##$DECNUC= <off>
##$DECSTAT= 4
##$DIGMOD= 1
##$DIGTYP= 9
##$DL= (0..7)
0 120 120 120 120 120 120 120 
##$DP= (0..7)
150 150 150 150 150 150 150 150 
##$DP07= 0
##$DPNAME0= <>
##$DPNAME1= <>
##$DPNAME2= <>
##$DPNAME3= <>
##$DPNAME4= <>
##$DPNAME5= <>
##$DPNAME6= <>
##$DPNAME7= <>
##$DPOAL= (0..7)
0.5 0.5 0.5 0.5 0.5 0.5 0.5 0.5 
##$DPOFFS= (0..7)
0 0 0 0 0 0 0 0 
##$DQDMODE= 0
##$DR= 18
##$DS= 0
##$DSLIST= <SSSSSSSSSSSSSSS>
$$ [...]
##$SUBNAM2= <"">
##$SUBNAM3= <"">
##$SUBNAM4= <"">
##$SUBNAM5= <"">
##$SUBNAM6= <"">
##$SUBNAM7= <"">
##$SUBNAM8= <"">
##$SUBNAM9= <"">
##$SW= 16.880792210976
##$SWIBOX= (0..15)
0 0 2 0 0 0 0 0 0 0 0 0 0 0 0 0 
##$SW_h= 3378.37837837838
##$TD= 16384
##$TD0= 1
##$TE= 0
##$TE2= 300
##$TE3= 300
##$TEG= 300
##$TL= (0..7)
0 120 120 120 120 120 120 120 
##$TP= (0..7)
150 150 150 150 150 150 150 150 
##$TP07= 0
##$TPNAME0= <>
##$TPNAME1= <>
##$TPNAME2= <>
##$TPNAME3= <>
##$TPNAME4= <>
##$TPNAME5= <>
##$TPNAME6= <>
##$TPNAME7= <>
##$TPOAL= (0..7)
0.5 0.5 0.5 0.5 0.5 0.5 0.5 0.5 
##$TPOFFS= (0..7)
0 0 0 0 0 0 0 0 
##$TUNHIN= 0
##$TUNHOUT= 0
##$TUNXOUT= 0
##$USERA1= <user>
##$USERA2= <user>
##$USERA3= <user>
##$USERA4= <user>
##$USERA5= <user>
##$V9= 5
##$VALIST= <valist>
##$VCLIST= <CCCCCCCCCCCCCCC>
##$VD= 0
##$VDLIST= <DDDDDDDDDDDDDDD>
##$VPLIST= <PPPPPPPPPPPPPPP>
##$VTLIST= <TTTTTTTTTTTTTTT>
##$WBST= 1024
##$WBSW= 4
##$XGAIN= (0..3)
0 0 0 0 
##$XL= 0
##$YL= 0
##$YMAX_a= 138159
##$YMIN_a= -134236
##$ZGOPTNS= <>
##$ZL1= 120
##$ZL2= 120
##$ZL3= 120
##$ZL4= 120
##$ABSF1= 10
##$ABSF2= 0
##$ABSG= 5
##$ABSL= 3
##$ALPHA= 0
##$AQORDER= 0
##$ASSFAC= 0
##$ASSFACI= 0
##$ASSFACX= 0
##$ASSWID= 0
##$AUNMP= <proc_1d>
##$AZFE= 0.1
##$AZFW= 0.1
##$BCFW= 1
##$BC_mod= 2
##$BYTORDP= 1
##$COROFFS= 0
##$CY= 11.3945322036743
##$DATMOD= 1
##$DC= 2
##$DFILT= <>
##$DTYPP= 0
##$F1P= 15.9154993809931
##$F2P= -4.1035820241983
##$FCOR= 0.5
##$FTSIZE= 0
##$FT_mod= 4
##$GAMMA= 1
##$GB= 0.15
##$INTBC= 1
##$INTSCL= 1
##$ISEN= 128
##$LB= 0.24
##$LEV0= 0
##$LPBIN= 0
##$MAXI= 10000
##$MC2= 0
##$MEAN= 0
##$ME_mod= 0
##$MI= 1.114404
##$NCOEF= 0
##$NC_proc= 0
##$NLEV= 6
##$NOISF1= 3.799351
##$NOISF2= 2.8
##$NSP= 1
##$NTH_PI= 0
##$NZP= 0
##$OFFSET= 15.70392
##$PC= 1
##$PHC0= -10694.55
##$PHC1= 14.40088
##$PH_mod= 1
##$PKNL= yes
##$PPARMOD= 0
##$PSCAL= 0
##$PSIGN= 0
##$REVERSE= no
##$SF= 200.130013532006
##$SI= 16384
##$SIGF1= 3
##$SIGF2= 2
##$SINO= 400
##$SIOLD= 16384
##$SREGLST= <1H.CDCl3>
##$SSB= 0
##$STSI= 0
##$STSR= 0
##$SW_p= 3612.71676300578
##$SYMM= 0
##$S_DEV= 0
##$TDeff= 0
##$TDoff= 0
##$TI= <>
##$TILT= no
##$TM1= 0
##$TM2= 0
##$TOPLEV= 0
##$USERP1= <user>
##$USERP2= <user>
##$USERP3= <user>
##$USERP4= <user>
##$USERP5= <user>
##$WDW= 1
##$XDIM= 8192
##$YMAX_p= 0
##$YMIN_p= 0
$$ End of Bruker specific parameters
$$ ---------------------------------
##NTUPLES= NMR FID
##VAR_NAME=  TIME,          FID/REAL,        FID/IMAG
##SYMBOL=    X,             R,               I
##VAR_TYPE=  INDEPENDENT,   DEPENDENT,       DEPENDENT
##VAR_FORM=  AFFN,          ASDF,            ASDF
##VAR_DIM=   8192,          8192,            8192
##UNITS=     SECONDS,       ARBITRARY UNITS, ARBITRARY UNITS
##FACTOR=    0.000296,      1,               1
##FIRST=     0,             0,               0
##LAST=      2.424536,      0,               0
##MIN=       0,             -134236,         0
##MAX=       2.424536,      138159,          0
$$ Real data points
##PAGE= N=1
##DATA TABLE= (X++(R..R)), XYDATA
$$ [...]
1790C68R4k28l63j50j87R53M5J6o54m25M61K75L09k92l12n03N26M04M87o15m79
1811b70j06N0O74L24m00k68m92R4Q19J37j90n46j00p1N63K97l45p3o60J58N81
1832A76J85J28n90n13K88L40K27o0r9o93J64J002j67j63m43l62N21N57P1l20n35
1853b86jj72P05K19j52l30p03M78M55J74j76o01n3L83L52K64k42m35l31M1M20
1874IK45R8m57k85J88L42J89k24k45l24L62K70K09k4m84k76O2M56L47k46k92m54
1896e34J08O97J36j34m10l32L39K49L99j78m68l42J30K43N10l05l22Pk27L96M44
1917D06k33m60K4QO78k43K23n33m49M95J60K47N0l94l49J47K55L49o8l95m27L38
1939a71J81J72q0j34m92J52M84JK91o14r4J08K23L24p7k56k98QP19p0k28l07j53
$$ y = [368, 462, 234, -129, -279, -466, 487, 532, 548, -106, -531, -70, 205, 514, 222, -90, -593, -67, 337, 824, 209, -270, -376, -326, 348, 672, 272, 4, -488, -394, 425, 562, 372, -174, -274, -345, 218, 515, 170, 97, -563, -405, 176, 361, 489, -101, -614, -326, 14, 241, 181, 82, -611, -447, 555, 388, 225, -218, -580, -59, 498, 569, 249, -286, -287, -459, 246, 465, 313, -17, -720, -242, 213, 387, 211, -390, -443, -60, 292, 556, 314, -121, -452, -411, 9, 254, 352, -105, -390, -202, 140, 329, 105, -140, -464, -102, 168, 377, 353, -131, -407, -345, 111, 458, 212, -80, -534, -426, 271, 407, 273, -137, -469, -130, 119, 518, 340, -128, -470, -340, -97, 413, 108, -214, -207, -434, -38, 406, 173, -287, -263, -255, 423, 180, 403, -130, -579, -84, 76, 323, 373, -21, -370, -223, 32, 381, 313, -82, -509, -171, 10, 182, 102, -32, -524, -372, 112, 113, 404, -210, -304, -196, 27, 351, 274, 18, -280, -272, 447, 377, 149, -158, -311]
1962c11J72L71M73m69n66r2J4N50L37q4m98p2j7K00M75k17l11l39K54L74PM1m03
1985a11m15M26L88K4j02l40j08p6L69M12k94l59n1j9L60J61j24j33l65J95J18
2006d4J14N8j13k12R0J45K45o3l66j93M1M43K4R2m64J5n9K39M4K49j34m56L5K36
2030c4M12p4k87j24k82M27K17k6j18n68J71L63J15J48k58l96M1K97N10j11k43
2051A80n09O9L90J58J06n74J7j6K06K18j29k97j81L0K86M27r6k56j25k06N07J20
2073C25k04j43k67K34N7L51P8o84j70K29J82K99j31k57p9p5K79L49j76p6j78L0
2095b7J74J62m5j77j26j05Q6M29j42j54j56P5K8J42J05l24k08j00L35K03J7k88
2117i6J33l08L82q2K65l8l73K2j2J77J61l53j90J68J97O0K54m51p1J18n1N33j36
$$ y = [-311, -139, 232, 705, 236, -330, -422, -408, 142, 479, 395, -103, -175, -192, 8, 483, 266, -45, -384, -130, 244, 251, 292, -111, -526, -100, 288, 312, 210, -130, -238, -314, 55, 467, 173, -186, -237, -256, 104, 265, 141, 8, -357, -162, -44, 70, 128, 15, -197, -107, 38, 283, 220, -146, -339, -298, 145, 169, 261, -203, -188, -247, -8, 36, 285, 151, -305, -270, -34, 378, 304, 17, -107, -389, 38, 255, 229, 111, -457, -286, 77, 192, 340, 82, -314, -273, 24, 534, 423, 180, -329, -260, 130, 288, 394, -180, -163, -179, 27, 245, 116, -181, -362, -332, -46, 381, 285, 29, -96, -302, 205, 325, 121, -22, -289, -55, 2, 353, 431, -253, -423, -194, -12, 287, 156, -101, -180, -255, 24, 373, 197, 121, -57, -27, 147, 309, 264, 87, -39, -144, -58, 371, 229, 75, -81, -6, 22, 164, 269, -55, -263, -363, -28, 175, 192, -96, 37, -271, 111, 29, 294, 256, -117, -95, -107, 70, 231, -122, -312, -144, 53, 113, 367, -84, -155, -37, -88, 445, 309]
2140C09j18m36j01L59QK45p2k54R2j41M25J01o27%M9N7K58j37p7J7O9k78K54o9
2164f7N0l76J20L28J70j87Oj67m9K69J24O9m61J57k59K14mK26m0k54r9K72M25
2187D67m62k0J10l98M99R2k75j91q5N9L84j83K57m38j45J14L53n2Lk47J25j10
2209a43J99k8n1K03k96k4j95M03K78m61j9K39J7L39l90k4m1p8R0K00r7O4j61J8
2233D2qK14j39n1l26J54k50P95l26k39j59M6J85K96P9m19NJ89l6J86j55r0P8l6
2257C5j61M30M5m56j19K3R0L74N2l10j08q9K69m8L5J68k04j77J89j07J80jk87
2280a77o2L11j14J01r4j12j36L29K75Q7l54l16J51L72L9k66j42R0o0k4J27Q7k05
2303i3j20K52j64R4l4J60pj30K59J17m50J48j61k6R9K31J1p9k38n4NJ55J29j06
$$ y = [309, 191, -245, -346, 13, 21, 266, 194, -60, 32, -109, 316, 417, -210, -210, -161, -104, 154, 17, -60, -43, 26, -252, 2, -67, -17, -393, -273, 55, 225, 38, 44, -123, -172, 97, 221, 290, -171, -14, -273, -59, -63, 163, 123, -131, -230, 42, 467, 5, -15, 95, -303, 196, 288, 13, -178, -263, -204, 180, -3, 254, -184, -329, -215, 138, 86, 89, -158, -33, -143, 56, 28, -23, 180, -116, -140, -335, 68, 346, -115, -134, 105, 122, 461, 71, 47, 6, -72, 18, 218, 121, 185, 24, 42, 34, 248, 109, 58, -268, -114, -364, 431, 105, -134, -293, -247, -62, 234, 313, -106, -101, 88, 52, 238, 83, -7, 71, 35, -126, 304, 349, -107, -226, -203, -113, 261, 313, 3, -105, -194, 75, 27, 62, 230, 26, -151, 38, -69, 111, 110, -177, -239, 72, -42, 59, -35, -147, -283, 46, 321, 408, 54, -262, -111, 261, 300, 34, -108, -18, -78, -102, 25, 112, -93, -213, 39, -125, -31, -65, 95, 88, -42, 217, 334, -116, 32, -129, -155, -56, 175, 186, 107, -131, -185, -180, -25, 104, -2]
2327bq0l9J66J18o0k22p3l7N6K18L77n87R0ML31m35M77n05j6L52j14O0l38J26
2351a33p2K35J8j26L16j16j28R2j69J54J8j12m1j18L56K15m16n5J63k05R8K73
2373B47q1j69P3k22J22K10l2j95j13k68M16M6J93r2l22J9l4L37k67P6k46K41j
2396f2R6P3k17J59j37M3RP0K5k14R5J70J67j39l6j67L8R2K47j70k5l33J71p6K84
2421A63O0l07J07k46J84M0J57j41j01j39J83q9K24j11O6j69J39N49m36l39Q6K36
2443A16k37J05QJ01k85J0J2J58K26k02j00J22K3j06J64N1m88N51j10j51K34k65
2465f3r4n6j7M88j89k51j3J61m9K31n4j18j53K02q1J00P4n1j51K6o9K42k30q5
2489b00J84J8j1J5K03o3k67Q3N8J5l5j82J04K6N2M0j81J02l4J04q9J29R8l10J51
$$ y = [-2, -82, -121, 45, 163, 103, -119, -192, -229, -173, 45, 422, -165, -75, -71, 260, -175, 302, -203, -219, 133, 19, 79, -259, -133, -205, 30, 48, -78, 238, 122, -6, 86, -83, 71, 89, -23, -64, -182, 174, 389, -27, -82, 81, -124, -26, 247, 166, -3, 70, -152, -30, 180, 148, -47, -160, -428, -12, 34, 227, 135, -187, -168, -202, 135, -132, -56, -302, -61, -62, 34, 107, -110, 49, -88, -45, -36, 34, 59, -155, -60, 110, 277, 138, 102, -65, -27, 65, 312, 142, 117, -216, -45, -121, 163, 223, -84, 23, -223, -39, 1, 158, 17, -84, -223, -40, -129, 95, -16, 50, -119, 20, 569, 133, -206, -120, 116, -121, -16, -8, 93, -192, -182, -170, -12, 214, 12, -88, 34, 57, -49, 115, 166, -322, 229, 119, -32, 202, -63, -157, -213, -230, 258, 69, -182, -195, -34, -83, 148, 94, -24, -177, 25, -56, 44, 118, 67, -84, -58, -127, 115, -115, -200, -16, 2, -9, 6, 209, 146, -121, -38, 20, 35, 0, -182, -78, -52, 0, 40, -141, -39, -73, 31, -58, 71, 169, -141, 10]
2514A0o9l0P3Jj27Q1lJ75p5m3p9q8j69J04K16p6K0J3K2j04K19O9j93K8k68L96
2540A03k42L34j40j82j53K94J72j90J39m30L3K65j6K27k75RP0l8M0L11k25n3l54
2563c01K78J44J14l59J17q6N5K46j26j2j86Q0J05j76K31j78j19J62J03r4Q3J22
2585B03j14k04K63n9j5Qj76j48J97J67j63J68k42J32K49o0p4k8l21K33K2j01L78
2608C15j89k29j49L39n1J8P3n90N49l80K78Q0p4k5o6J03jK05n5k38Q3k3L2M7J16
2633A68J3m32J72K5q9J72l77K76j52J28J72k1k49j39O1M28r1k8j25j17J39J5M25
2656C74l77j51r1K09j0K42j51nK44k26k80L06M1j05N7n2k96L94j92j09N7L89j92
2679G6J16k71j08J04j24K48J13k12j12n5J00Q0J82J85l44L6Q6Q1k20K93k78j26
$$ y = [10, -59, -89, -16, -15, -142, -61, -64, 111, 36, -7, -86, -174, -343, -239, -23, -99, -79, -66, -44, -148, 71, 140, -53, -25, -293, 103, -139, 195, 55, -127, -280, 14, 186, -4, 135, -295, -262, 3, -13, 214, -61, -52, 18, -20, 20, 331, 106, 53, -301, -23, 121, 235, -124, -7, -93, -38, 208, 82, 70, -116, -36, 69, -107, 124, -54, -173, -11, 92, -2, 81, 203, 89, -115, 148, 89, 74, 82, -94, -242, -45, 122, -41, 127, -115, 17, 266, 206, 132, 104, -217, 16, 38, -63, 315, 126, -103, -252, 87, 36, 54, 127, -463, 86, -294, -16, 64, -10, -35, -101, 2, 1, 206, 151, -87, -4, -27, 5, 52, 168, 181, -251, -79, -54, -143, 29, -348, -72, -224, -96, 76, 55, -194, -333, -272, 156, 65, 37, -88, -205, -66, -51, 374, -3, -154, -245, -36, -46, 196, 45, 40, 284, 58, -222, 84, 125, 20, 77, 25, -271, 123, -69, -178, -121, 268, 76, 192, -79, -187, -83, -207, 41, 154, -58, -170, -225, -125, -45, 137, 322, -22, 14, 100, 181, -39, 254, -24, -150]
2701a50q8K76j12K93j33l86L06j41L16l64J14mj22J68K07o2j54j76L67k31K5L7
2723a4j61r5K88n7J7jq0L1J65J67k66K08k76j01p4L80J01j92J34j87l2o3L3j12
2747a87L09k04O7j53K10J12n6m00K90J72K8k36J49l60L79p3K50l46k18R3n7M06
2769A75k95K29j97j12J11r8L27l04J41j66J37oK05r7N9k16P5N0l39M85Qk04NJ47
2793A20j41j05M00k23j17K53r7n9q9q1O2J52q5K6J24l6ll3j78J99r7q9OL8N0K2
2819A9L9j51NJ03n7m3o1j67J70J23o7L11j9n0l26J70m5P7J5L0k54J72M43k61L2
2844B08l40J31PN8M5m3l35K91R9j95j04N3P4J19j82L16o7l1l52K63O0pJ15n9k81
2869a57pK15n4J96n29Q4K04o6L08j03j99R4j55n2K74j49l6L07j20M7Qj89O7r5
$$ y = [-150, -238, 38, -74, 219, 86, -300, 6, -135, 181, -183, -69, -73, -195, -27, 180, 118, -36, -212, 155, -76, -51, -14, -175, -270, 18, -39, -22, -23, -103, -72, 93, 260, -6, 202, -74, -175, -249, 131, 232, 40, 174, -13, -45, -108, -75, -187, 122, -82, -15, -168, 42, 154, 98, -302, -12, 160, 188, -48, 101, -259, 120, 47, 297, -49, -267, -174, -231, 175, -120, 109, -88, -200, -89, -187, 140, -164, -23, -189, -52, -58, 147, 50, 109, -107, -32, 18, -321, 164, 172, -32, -27, 120, -21, -126, 274, 51, -66, 187, 90, 31, -58, -139, -77, 75, -10, 16, 140, 104, 101, 68, -110, 89, -8, -97, -91, -53, -3, 19, 58, -93, -88, 15, -42, -85, -146, -313, -143, -20, -87, 224, 205, 155, -171, -1, -46, 31, 46, 76, -178, -6, 437, 176, 208, -132, -1, 6, 64, 109, 66, -269, 22, 121, -74, -178, -125, -51, 68, -114, 202, 135, 104, -248, 15, 75, 68, 183, 124, -157, -164, 51, -3, 193, -336, -252, -48, -114, 194, 91, -108, -14, -169, -221, 53, -96, -132, 175, 55, 102, 110, -79, -12, -107]
2893a07J47j10K40j4n2k48R2m1J33Q3k76J88n3J36j08K3J09j32n2j05K15j13Q6
2916D1k50K61l78K82O4p2r8k7K51K8J73k67j44q2J13J39m4M5J14j43p3J45J4j2
2940H0k48j20J70j12J61p9P8p2J25L5K1K9J4k7k5P9j37N5q3j24J43k5j4k79M26
2965G1k09L9K41j4J26j79lP2J53k31j70j01J47K27k67J43L47l13j20n3K68j44
2987C0j46O4Oj49J94l1J82n4j32l6K9M5N4j31r6N2N5K16k07N5j56o9J81Q4j8p4
3013e2j44M12N4j87k20J66k93Q9K38j11n8K18l49K27q0jJ87j57L3m0r1J98K2j10
3037d9k0k4j79M50J14m58L45n17L74K38k44j57J59p9M9L25m52J03k38K43K26j02
3059A07j22m1o8R4M5K61k91Q6K9j85L25j36j56M6l3k60N33J34m54K0j70L18l3
$$ y = [-107, 40, -70, 170, 156, 104, -144, -52, -93, 40, 123, -153, 35, -18, 118, 10, 33, 142, 10, -42, -147, 68, -45, 41, -209, 52, -326, -44, 20, -52, -150, -177, 74, 102, 275, 8, -136, -218, -105, 34, -10, 35, 149, 6, -67, 78, 92, 80, -168, -288, -118, -230, -69, -148, -70, -142, -17, 18, 39, 68, 82, 55, 30, 109, -28, 27, -56, -180, -37, -62, -76, -355, 71, -138, -99, 142, 128, 254, 75, 72, 144, 297, 66, -104, -205, -58, 169, -98, 45, 392, 79, -41, -94, 174, 30, -116, -52, -46, -195, -1, -32, 150, 96, -36, -72, -43, 2, 56, -75, -171, -119, -64, 152, -55, 0, -156, -225, -44, 40, 22, -52, -196, 216, 270, 83, -137, 29, -264, -175, 63, -48, -106, 112, -237, -10, -90, -91, 96, -61, -28, -68, -159, 39, 61, -49, -69, -93, -272, 178, 292, -166, 179, -338, 36, 274, 30, -127, 32, -47, 2, 327, -125, -22, -260, -17, 209, 107, -15, -56, -124, -30, 15, 276, -15, 71, 100, -85, 240, 104, -52, -6, -39, -299, 234, 368, -86, -66, -236, 82, 49]
3082D9P0j34J66l1j16o4n5J34J24m23L14j93J48k31K03K3P3K7j18O6k86L13r4
3105c5M19l27m3M6j33M20l31J17J41k81k8l05M46j55J7K83k79J31N1j58j43J47
3127@k86q5J85K66p7J11j12o8J22q0P6k03k97M60pJ61k46K3K23l59J43J19N8o7
3151F0k49J59j6o9J52n3j13J3K06K76l59j25o1L66k63J92j70K71l6n4k14n6K9
3174a14J1M3k13L38rk18M9K93k16k1J51o5J31m0l6m38L64n2N8Lj61L00j49J64
3198A73l31n2R6L2K1K98j75j98N9P3k1K74k41k16K35K0l7J54j96k2J15O1j66J03
3222E9j05K5k70K23K28j98M0lM9NO1kK4j79K15j78J54k3j70k1R5j16J25J9r4J21
3248H4J7j76k0QJ40k26q5K62J74P2j17k45Q1Q1m2O5J0J43m74M12q4l9p1j63J51
$$ y = [49, 119, -15, 151, 120, 4, -60, -115, 19, 143, -280, 34, -159, -11, -242, -39, -16, 57, 84, -34, 32, -254, 59, -35, 384, 57, 14, 60, -73, 347, 16, 133, 274, -7, -35, -340, 106, -49, -32, 251, -28, 103, 154, -4, -147, 0, -286, -371, -186, 80, 3, 114, 2, -66, 56, -24, 52, -151, -448, 12, 5, 166, -80, -57, 166, -193, -50, 69, 127, 60, -189, -30, -46, -115, 37, -16, -129, -116, 90, 366, 7, -118, -179, 187, -76, 116, -54, 217, 181, 127, -87, -143, -114, -103, -60, -273, 65, 56, -162, -113, 180, -36, -57, 94, 29, 160, 120, 84, -354, 10, -42, 16, 19, -142, 158, 9, 173, -158, -210, -114, -82, -61, 237, 62, -136, -77, -4, -25, 249, 8, -208, 27, 47, 10, 164, -32, -54, 61, 122, -44, 59, -46, -21, -291, -68, 160, -38, 2, -1, 48, 53, 114, 112, 136, -43, 172, -6, 148, 125, -45, -66, 29, -87, 38, 57, -37, 84, 101, -75, -95, -87, 53, -173, -258, 4, 178, 250, 133, -112, -31, 50, 8, 73, 83, 226, -248, 164, 80, 41, -30, -193, -42]
3273d2j18J52j2j95J0J38J50R0m8j13O7j40j8Q8l2J8l7k9J08Q6k58N6K8j30L38
3298A57n1k92M49m65J69J51j7J1o0k95J84K95k43j2l6K2j59L32j79o7Q6o4K01
3321A17k56mJ77k37J33k0p3J22J57J64n38j16J85K31n4l0P2r8K42k00j9P7k27
3344a95K81j71P6J76j90J81k82J52L18j15k91N7N6k13J06P3j37n5Q0J97K55k04
3366A55l06O1l0J47l1k23J18J51p7j02J41J78P6k64K6r0j54K59o3JJ54k44K27
3389A10k40K10J4k16q3K17N8l2j72M75l15j76n0J17l6j1j56M21j3O2l32j21K75
3412FK7L19l65K3J6j54J99K21k26j82L65j46j26J37k41L8J71Lj23J2qL4j25L6
3436h9K62j79j39K25k30O6l7L97l8l10J62N8j60J48J43k46j63L05j4j2m4k02K45
$$ y = [-42, -160, -8, -20, -215, -205, -67, 83, 173, 125, 12, 79, -61, -79, 9, -23, -5, -42, -71, 37, 123, -135, -79, -51, -181, 157, 106, -186, 263, -202, -33, 118, 101, 112, 52, -243, -59, 236, -7, -19, -55, -33, -192, 140, -39, -106, -20, -84, 117, -139, -143, 34, -203, -70, -90, -163, -41, 116, 280, -258, -374, -189, 42, -12, -42, 30, -68, 174, -26, -45, 32, -195, 86, -85, -9, 167, -23, 158, -124, 28, 346, 231, -60, -3, 53, -160, -54, 19, -118, -173, -93, 104, 359, 155, -151, -90, -120, 27, -4, -227, -109, 42, -35, -137, 4, 182, 258, -6, 20, -70, -224, 35, -28, -27, 127, -117, 110, -130, 80, 94, -122, -205, 12, 70, 38, -134, 341, 26, -150, -200, -83, -119, -130, -286, 135, 122, 184, -148, -269, 6, 33, 352, -13, 10, 26, -128, 71, 292, 66, -116, 249, 103, -23, 114, -127, -89, 82, 85, -38, -26, -34, 0, -125, -89, 173, -6, -145, 80, -150, -84, -121, 276, 238, -72, 90, 148, -12, 136, 279, 33, -130, 175, 161, 149, 105, -97, 148]
3459A48o1N6j81K7k37K48k48K06K42j53j36P0n2J63R9j12j72r1J28Q8j87J72j03
3482h6J65j87l7l8J76q3P0l03L40nQ2r8m9j32K80k74J53J27k70J88K46l30J86
3505A21J28k83J26l3j6o7J94j39j90J79R3k01R5m4q6J68J14j91l25L24j03K10
3527G4o6qN6m17L85J9j43J90k03M9k4N2j1K91Q2l87j52L79j20P7%j62J78j25n8
3552d4J14j30k55J86M77m60J8P0k45N48n65L26N5Q0j71R7q4K94k06j65L1PL8R7
3576A13p7J62k06K5j54J67N1n9j43K91O7j26O3k94J94k23N40l10n0j10M5m1J89
3599A14j47L53l75k19L25K7j1K5j31p2LO9l2J37j3k06R6Q9j9J46k72J96k1p3q9
3624a00Q6M0l9Q3j14J62j31J54j47k2n9N8n9p1K6K06j67L23j98rk48M62j38P4
$$ y = [148, 87, 143, -38, -11, -248, 0, -248, -42, 200, 47, -89, -19, -71, 92, 191, 79, -93, -184, -56, 32, -155, 17, -86, 79, -108, -145, -183, -7, -90, -20, -323, 17, 12, 94, -4, -53, -185, 95, -179, -26, 101, -169, 19, 265, -65, 121, 249, -34, 92, 59, 43, -24, 170, 31, -159, 20, 113, -88, 7, -37, -123, 45, 159, -32, -357, -33, -136, 74, 8, 0, 56, -361, 24, 43, -100, 90, -113, -64, -88, -36, -47, 244, 326, -61, -213, 166, 46, 123, 123, -39, 139, 14, -44, 70, -60, -315, -129, 348, -112, -94, -24, -269, 279, -286, 40, 95, 175, 4, 101, 17, 311, 105, -60, -29, -22, 16, 113, 36, 198, -8, 17, -137, 30, 81, 22, -121, 170, 237, 111, 174, -120, 74, -149, 391, 81, 31, -79, -34, -75, 114, -33, 320, -55, -274, 51, 78, 67, 92, -39, -111, -108, -39, -71, 66, 53, -153, -57, 32, 13, 159, -113, 83, 62, -11, -100, -14, 26, -13, 70, -44, 118, -13, 141, -6, -28, -87, -29, -88, -159, -133, 73, -94, 229, 31, 22, -226, 236, 98, 172]
3648A72L12n42k06K28j18J62M2p6L7O7k74J17j80K03P9K99j23J63k56k57J09j16
3670a58K66j16j34J49j27j04M50q3l0k30K83j66n7Q2R3o5o7J90j36K67k00o8o4
3693b5j95J08R2J15l18K24j4m5kk5J22l7QK76k25k25L29o2l36L61k66P2qK65l5
3718A54k41K12l3j44K66n8j99J54j70M1K20q6l35j1L95j06j3r6Q8J37l9Q1l48
3741a31M9J04Qq8p3O7r3K55j78J18r9l2L7l8K2J56K68m38J05K5%L02q1l80L9K5
3767e1j51J88J39j32k06K01J28J25j24M3j02j2n3m5Q8j54K05M1j13J44j37q0j13
3790a71K77k55J61J14r5p7O0j11L58j83N8j14j21Q8p5K18p3j36rN3J08m08L48
3813A5Q7J26l48L2J69r8P5k27K16oj43J72j51j1M3P5QJ00j95K2Q0k35M71j91p5
$$ y = [172, 484, -58, -264, -36, -154, 8, 50, -26, 11, 78, -196, -79, -259, -56, 23, 322, 199, 362, 106, -151, -42, -158, 108, -8, -142, 7, -120, -224, 226, 143, 113, -117, 166, 0, -57, 25, 118, 53, -14, 176, 40, 307, 107, 39, -25, -220, -112, -20, 95, -223, 1, -13, -58, -60, -85, 37, 0, 8, 284, 59, -166, 163, 101, -235, 126, -140, -68, -76, 189, 154, -87, 125, 92, -52, 214, 156, -43, 111, -59, -18, 202, 116, -219, -230, 165, 59, 46, -50, 38, 175, 136, 217, -131, -82, 22, 30, -58, -131, -64, -157, 98, -80, 38, -61, -93, -56, -94, -72, 84, 352, -86, 19, 44, 44, 346, 265, -115, -76, -51, -202, -14, 125, -7, -213, -12, 116, 241, 117, 160, 58, 46, -7, -52, 36, -118, 87, 128, 15, 159, 22, -58, -171, 106, -149, 12, 126, 31, -46, 14, -97, 261, 78, 136, 22, -99, -11, -86, 132, 59, -77, -86, -33, 75, -333, 15, 102, 228, -120, -88, 81, -17, 58, -169, 47, 41, -102, 70, -81, -92, -49, 26, 34, 134, -61, -39, 41, -194, 277, 86, 11]
3838A1j70M14l46L30k08J09l6Q7l40J90o5k23K37j29J47N5nj40mK93j20l1j06
3861e0j1J19L1p2m2j80R3M9J74m7j52K59k60J03J19J60j68k6j38lN4J11n9j89
3885a25K61j80n9J13j10o4J28q5K58j46n5J44o5l1j23J68j20K14j53K0j53J50
3907a3Qj9j22Nj26K47j33J77j55J48K4R8J29k21m01L52Q0k1K2J7M3k74J82nj10
3932f8L80n41J32K5M8J44j17Ol4l2K66j99r5nK08o1k18K32k69L14j27J03m5k3
3956B4J44j43j11O8o1M9k2M69n55K80n8j68J79q6N9J01p0j33J23j8M4k07J76M5
3980A29l49M00n03K14K87k57J00k3Nm0R8j01j81K96l63L65j1k7n3j13JQ3q2K41
4004A16k70J09m9o5M30j77m86M26n2O5R4n6k28M19j53K29j78k60m2J52L5J6j4
$$ y = [11, -159, 255, -91, 239, 31, 140, 104, 191, -149, 41, -24, -247, -10, -139, 8, 63, 58, -82, -86, 207, 87, 56, -50, -61, 58, 89, 17, -25, -205, -112, -63, 111, 64, -88, 171, -89, 14, 133, 293, 125, 99, -39, -42, 12, 123, 64, -125, 136, -44, -103, 10, -100, -164, -36, -121, 137, -9, -64, 80, 15, -16, -139, 29, -91, 123, -30, -10, -163, -13, -5, -24, -146, -141, -267, -20, -153, 24, -131, 17, 41, 139, 268, 47, -354, -2, 78, 57, 79, 96, 139, -135, 47, 42, -68, 312, -229, -97, -72, -24, 120, 3, 9, -25, -57, 209, 10, -85, -90, 118, 57, -161, 71, -198, 116, -11, 92, 47, 24, 168, 25, -86, -18, -79, -30, -52, 417, -138, 142, 84, -84, 95, 9, 68, 169, 99, -34, 89, 71, 115, -92, 84, 129, -220, 180, -323, -109, 178, -79, 21, -2, 3, -37, 61, -40, -221, 75, -288, 77, 66, 39, -14, -127, -126, -43, -125, 116, -154, -45, -94, -159, 271, 94, -392, 34, -18, 47, 141, 85, -143, 276, 123, 352, 174, -86, -128, 24, 59, 75, 61]
4027F1J06k33K5K70k70K52l01J45O3k36L64j91j14O7J77p4k17J68j08l6J67k39
4049a54L23j13J62j72k11J44O7l2L9J31l71k7K88l1n6J18k21J21k8J33j26J04
4071H8K7l8j11J24j5J26J3l49L35k45J29j43J31m1J5j4j03k60L72q5O6J67j60
4094B9p1R0j74J19Kk0j04j38L68OJ02l43K18r7mJ11j09o4K6J35R4k98K12j33Q4
4119D1m82M44k9J44q5J4l95L13n9k9J23P9R8O0m04J57o2K17Q6j52J99J46l99j39
4143a14K37j10o0l3J01J71P6o7k57O1M5k02R8O6j95j4N01l10P2l7k42K56O4k05
4167i8j30J77K08k62l2O9J84k74J24O4K4k18p2K09j94K31J23l70K30P5m1J51l22
4190a44J16P0j9o0P9N9K4Q5l19K80j87K71m85K48j66J99j82j73L19j35J43P4m4
$$ y = [61, 167, -66, -41, 229, -41, 211, -90, 55, 118, -118, 246, 55, -59, 8, 185, 111, -106, 62, -46, -82, 85, -154, 169, 56, 218, 46, -165, -21, 46, 14, 53, 184, -187, -214, 74, 43, -13, 105, -116, 5, -23, 110, -16, 88, 115, 77, -34, 90, 75, 201, 214, -135, 200, -45, 84, -59, 72, 31, 46, 32, -71, -331, 41, -44, 22, 189, 29, -42, 48, -126, -7, -5, -25, -129, -267, 101, 107, 209, -134, 84, -13, -17, 94, -15, -79, -53, 82, 176, -122, 90, -43, 41, -441, 3, -26, 118, 33, 47, -348, -35, -94, -123, 0, 79, 177, 237, -167, -10, -72, 145, 231, 79, 278, 424, 25, -114, 123, 13, -47, -80, 21, 192, 268, 201, -56, 5, 50, -152, -54, 12, -183, -197, 304, -6, 66, 29, -213, 43, 107, -98, -228, -51, 157, -105, -137, -68, 116, -158, -34, 30, 54, -164, -236, -27, -221, 10, 133, -237, -7, 68, 27, 178, -144, -28, 42, 23, -37, 42, 101, 125, 210, -109, 171, -16, 255, -230, 18, -148, 51, -131, -304, 15, -120, 23, 97, 53]
4213E3q2j91k3L14l51J52j9m4L41j88J20L1j61O5j77J12J21J4j9l36p3K07J36
4236BJ5kJ30q4o2L5J11j03P2k08j0K27pp1k38L40j02M9J20l40L14k16O5r2J21
4261F6j38K12j61J91L2j12J1kj24J2j06P8J26m06K15J86k81P3N6N6J43k24Q4p
4285b0L7J07n9j56K61n6q4j94J78k1J88l92L65J19j25n07L27J15N3j18k9k08K13
4308fJ0l1J24%K52l00m6L8n5N7N1k33J71kL5j77K5k6M6J84q2q0O4k97N21l16q
4335h1K05l12R9J59j00J38k43P2K70k94j09j01K67p8N9J29q3J5j02K20l41K09
4357bJ86l99J46o6j4K99j33J25N5j41l62r7M07J62k41j22L84k17l0M15l62k9m0
4380g6P8L7j52J8J58rMj74L5J18n2J57k6k07J2K36K7P4n24N66m11R6K3j1K6k55
$$ y = [53, -29, -220, -243, 71, -280, -128, -147, -191, 150, -38, 82, 113, -48, 17, -160, -48, 73, 87, 68, -268, -341, -134, 2, 17, 15, 145, 61, -1, 34, 145, 42, 114, -94, -104, 123, 116, 45, -193, 147, 45, 94, 214, -126, 188, -28, 37, -55, 66, -72, 140, -21, 170, 202, 90, 101, 99, -25, -13, -119, -41, 85, -321, -106, 80, -201, -128, -72, -16, 127, -97, -13, -20, 17, 124, 65, -91, 170, 114, 30, -164, 14, -7, 181, -211, 154, 273, 148, -359, -32, 83, 136, 18, -11, -219, -6, 4, -27, 97, 97, 349, 49, 3, 41, -14, 43, 94, -139, 32, 30, 65, -112, -87, -113, -67, 117, 35, -45, 19, -278, 243, -73, -81, 124, -188, -89, 70, -30, 108, -135, -63, 207, -87, -196, -297, -30, -108, -49, 80, -3, 12, -90, 130, -211, -2, 184, -215, -69, -135, -149, 150, 17, 142, 197, 56, -306, -403, 4, 166, -75, -197, 187, -30, -60, 355, -7, -36, -76, 2, 39, -113, -95, 63, 54, 58, -116, -81, 37, -15, 142, 116, -91, -79, 157, 184, 258, -266, 300, -111, -15, 8, -3, 23, -232]
4406b32Q3K26J08k69p8J33J00Q0l92K08J03k65L35k31j11J28J9J65l6j12J19l10
4428b29L39KJ07j76j45K31k53J03K93j06n8k23m9K26n6j30o1K00J26m28M07m9
4450G1k7Q6k57K02P3j87jJ70r4o2l8l09M20j20J37J86k27L5j19Q8n24N07M1K28
4474B79l02n2J07l2o3J54j75r5j6L76l46Q7J27l10K51N7J26k93j60N20m35K27
4496C2J2j03N0J01Q9k26K75l2k01k66L47K4j37N6k74K12j8q1%j11J59p4M96j97
4520A33j88m2J7r3K39n2K65m39lJ45J61r9p5r2N2q6L22j90J79l00R3J22k09K81
4544A41k52K49k19J15RRj21J11J2J18m3j16k9O2j83J06K23j8M1j40k39j46K74
4567c6jK23k47l3P5jj20L20q7j00j28J31k5N0J64j78N4rM4no1r2J7j62K16M9J95
$$ y = [-232, -149, 77, 185, -84, -162, -29, 71, 151, -241, -33, 70, -195, 140, -91, -202, -74, -55, 110, 74, -38, 81, -229, 110, 112, 219, 43, -102, 129, -124, -21, 272, 166, 108, -115, -164, 62, 6, -124, -185, 15, 141, -287, 120, 71, 44, 130, -127, 75, 148, -39, -40, 130, 36, -26, -64, -373, 47, -73, 64, 250, 23, 58, -61, 27, -497, 10, 51, 279, -23, -75, 32, 0, -63, 91, -84, -179, -195, 181, -165, -78, 49, -261, -10, 47, 173, -120, -280, 240, -195, 32, 44, -59, -9, 92, 181, -45, 230, 198, -3, -269, 78, 102, -35, 21, -253, -41, -59, -140, -140, -251, -92, -166, 330, 133, -55, -97, -80, -173, 66, 14, 279, -160, -163, -18, 143, 44, -31, -123, -71, -157, 165, -25, 154, -146, -53, 69, -140, 141, -111, 138, -81, 34, 43, 52, -69, 42, 54, 172, 129, 13, -16, 46, -137, -31, 192, 174, 215, 75, -164, -310, -36, -37, 186, -61, -94, -19, -20, -140, 180, 93, -7, -135, -4, -29, 21, 185, 7, 61, 52, 96, 91, 30, -62, -45, -207, 9, 58, 253]
4594B53j67M7j67j36R0O8j15RO6J00q0NO9j8Nj32J39jm1k87L35k38K48j19J20
4619E3k78L16rr8P6j34K08l8P2L8p3j67J05Kl57L32K16m73O8J87p2r0j29N14l52
4644h3L63k81M4m6M8p8MR1k0j83m5K56m5j40K07k20J33k3P1j67J89m1J02k04M6
4669b2p8J72K3r9Mn7J96Q0k98k9J95J55j45O4k22k00L73k02J55%m3o9J50l01M3
4694a55L49k48J15j31J76k01K24j24K70l72J9J83j01J26r8j44O4L44l90k1J59
4715D4j57K52j62l10M55k21J54k24K31K2j25p5J69k9j67L38Q6l03J83m0j23NJ91
4738A94N8j01l37R6p7J76r2j07K04r9L01k94l3l6j0P4O7j79L34k49J84Kl53M30
4762A53k51K18O5k35K20j77q1J57l28J64j5L6L28l01K65m12K49K7j27l2J52p2
$$ y = [253, 86, 133, -34, -170, -80, -12, -127, -118, -52, 48, -32, -27, 42, 24, 29, -103, 36, 35, -6, -293, 42, -196, 52, -67, 53, -225, 91, 82, -16, 60, -74, 134, 96, 168, 206, 133, -34, 71, 73, -284, 48, 264, -209, -141, 46, -26, -116, -245, 269, -83, 280, -1, 43, -3, 45, -33, -29, 62, 42, -141, -186, 70, 25, -115, 92, -128, 5, -18, 53, -114, 75, 34, 136, -68, -22, -100, 72, 95, -4, 0, -57, 139, 219, -79, -108, 87, 242, 97, 161, -61, -261, 112, -90, 65, 65, 22, -47, 103, -198, -155, 194, -54, 61, -70, 106, -95, 129, 5, 275, -97, -78, 105, 4, 130, 32, -112, -48, 296, -94, -115, 44, -113, 139, -23, -333, 122, -99, 55, -169, 62, 84, -41, -116, 53, 24, -143, 195, 281, -22, 161, 121, -2, 3, 194, 252, 151, -186, -90, -167, 9, -83, -190, 14, -85, 216, -78, -111, -147, -157, -83, -16, -195, 139, -110, 74, 76, -277, 153, -98, 120, 185, -50, 170, -7, -88, 69, -259, -95, -110, -74, 254, -47, 218, -194, 55, 82, -45, -77, 75, 3]
4784CJ70j18k3K01j68k17J34K4MJ54mo1k3J07j39k52L96rj53j17Q3l34M24k66
4808a84P1O7j75L37k08j74K88j58j8m2J17N8j62n9K63p4j8j20L08k98q5N30m40
4831a76Q6R3j41N0K19k63r0J68L23l51K16j84j1L84k1l77L34m57K40j82L24j11
4853G3k02K26J85k47l4J9J30k13J59m26L15N0m8m4Q6K02l87J85P4N7k95M5K92
4876B02k32J68n7j29LJ19N2k13J81j16L84l87K9j59K0J54j81J64r3K8n6J88n4
4899A5J26j38N8k13j23K22K31m31L18k8p8J6j6K3j40J22q2J94R0l08K52j24M5
4922C1L12k87j24j24L08J15k57J09J69k58J74j89M8Q3k74j04J09L6L10j44m5k57
4944b59M54k24Mn4K7K67l57J09J55Kj80rr6J73M4J9j1L7j69j0K30p8j81J16JK49
$$ y = [3, 173, 55, 32, 233, 65, -152, -18, 6, 10, 164, 160, 99, 76, 183, 44, -208, 188, 179, 26, -91, -8, -342, 82, -184, -113, -46, -221, 116, -92, -266, 22, -136, -154, -196, -79, -21, -183, -242, 21, -53, -71, -191, 117, -181, -266, 264, -176, -90, 3, -138, -88, 131, -132, -222, -54, 269, -82, 134, -50, -61, 323, 302, -75, 259, -198, 42, -140, 184, 73, -129, 97, 282, 35, 1, 20, 150, -63, 96, -330, -15, 35, -13, -57, 29, 231, -156, 29, 103, 160, -135, -90, 202, -30, 138, 81, -48, -45, 74, 126, -87, 94, -22, 362, -25, 4, -155, -135, 19, -162, 2, -91, -63, -119, 69, 15, 141, 3, 61, -152, -275, -53, 178, -253, 65, 37, -41, -25, -41, -18, -158, -36, -118, 76, 166, -142, 110, -14, 31, 343, 56, -68, -192, 116, 231, -26, 83, 252, -6, 168, -21, 27, 110, -164, -268, -159, -123, 187, 43, -2, -259, 195, -29, -25, -79, -52, 215, -142, -33, 122, 124, -56, -65, -161, 12, 56, 75, 64, 101, -68, -78, 152, 74, -107, 9, 10, 259]
4970B59l57L25j97n2M0m2J8J4l4rm3K30k43K07k00P2K07j18r1l55L34k52K71Q9
4994G3R3k58j44J26L43k95q5K17j19P2k35K14q6j6l0J26j72K2K58j71J88k32k3
5017a34k0K19j79J20p2J16j30k0K01K0l1j92J97K07j55J6j83j62K93j07q8Q1l05
5040c08K04L88m42j79M19k3K3J8j36j04j86K98J07k09M03m16O7l6K18k13l1J17
5062b1P1j38K86O9n35K84r7J55l7o9J65J5j59j22J25j43J26J41r0j3j82J65L4
5085C0K9k85K69l14J35r5J65K37l33K41R6K6l05K26k80LJ83L36j88l86M72j93
5107F9j97M4K58j43L0o5l4j09N1J45k14J64k3j00J33J06P2k06O3oJ14k16K5j33
5131a72J46J49j27o8K05M4J05j57k00O6j08j18K72J40r8l9j49L69l59J42l3j3
$$ y = [259, -98, 227, 30, -22, 18, -24, -6, 8, -26, -35, -78, 152, -91, 116, -84, -12, 195, 77, -14, -369, -35, -287, -16, 73, 166, -92, -236, -110, 233, -62, -147, 70, -49, 23, -212, 2, -84, -100, -130, -4, -176, -154, 104, -67, 121, -111, -134, -154, 65, -114, 6, -66, 50, -80, -100, 101, 121, 90, -102, 95, 302, 147, 163, -20, -182, 111, 4, -84, -3, -308, -104, 284, -158, -337, 82, 59, 82, 100, -36, -140, -326, -28, 79, -130, 273, -143, -76, -112, 106, -107, -138, -21, 50, -88, 198, 267, -268, 16, -81, 74, 37, -32, 133, 148, -11, -133, -8, -151, -25, 116, 26, 13, -169, -4, 30, 59, -226, 43, -271, -136, -231, -66, 171, -162, 79, 175, 201, -104, 122, -158, -155, 28, 364, 176, -210, 262, 69, -128, -84, 174, 31, 61, -4, -38, -147, -96, 49, -165, -1, -24, -124, 9, 115, 187, -19, 44, 38, 152, -64, -39, -172, -26, 123, -4, -72, 133, 177, 282, 125, -75, -9, -117, -235, 37, 177, 79, 40, -109, 260, -99, 43, 10, -3]
5153cO0j0j24j03J10k42L18J18j55N6k7l4M6J5K24k14j50K42l20L1K91N6j49k5
5177A1l8L9L4k14PK82J78k51K3M4j39l2K18q8j48O4K4Lj5J09j76J35J23m05k5
5202b37L03J52l64L67j43j80J13j56L32j62J86l68qK83j81K7j2k21J54J73j32
5223g4k7M8R7k17J41L3q1N9K23j20J21j14J4l07n5M53k20L4j57L23r6r6J97l07
5247a28L56l28P2p4P8R2j14o6M9K9o7q1L54j09m7J77j73lk08K55J39r9j04n1J
5272e0K04k61J45j35J4J11l5l6LK2k01J35K05k64K36r5o2j37R9j94M11j57o3L3
5296g2j81K56J06J39j70J47j58j36J3j2Q5qQ3k80J95l1Nj25J44R5o8j4j21K19
5320A11j34j17J46r4N0n0K21j00m8q9J47N0k61L79l06K34k06P7K7n6K84m78K46
$$ y = [-3, 57, 47, -77, -180, -70, -312, 6, 124, -31, 25, -2, -36, 10, 25, 249, 35, -115, 127, -193, -162, 129, 185, 36, 11, -27, 12, 46, -168, -161, 121, 299, 48, 71, 115, -24, -56, 162, 74, -74, -10, 14, 17, 2, 111, -65, 70, 193, -212, -237, 66, 218, -146, 221, 78, -102, 11, -145, 187, 25, 211, -157, -165, 118, -63, -36, -48, -269, -115, 58, -74, -101, -53, 44, -173, -32, 1, -80, -21, 202, 82, 203, 89, 103, -204, -259, 194, -26, 8, -149, 174, 78, -18, 179, -128, 228, -100, -28, -102, -24, 68, -46, -112, -63, -34, -101, -182, 172, 63, 16, 193, 20, 17, -191, 64, 203, 104, 0, -51, -50, 154, -107, 38, -97, -83, 28, -7, -43, -40, -18, -219, -84, 121, -143, 93, -2, -64, -201, -102, -296, 115, -42, -105, -72, -253, 3, 109, 248, 78, 225, 67, -69, -56, -68, 17, 9, 92, -188, 7, -24, -19, -144, 0, 95, 27, 13, -108, 111, -23, -140, 6, -88, -38, -88, 133, 33, -15, -104, 43, 93, -168, 211, -95, 139, -67, 10, 37, -19, 265, -213, 33]
5343C3N9r7j5P1k85J45j00L12j04j33kl3L96k53K36r6j38J37j85j80J88l2Q2J3
5367A9k93K25pL3N2n2N1n4Q1N8k65O5K57j32n0K2j25J49n3pK8j32L68j89j64M8
5393f7J6J17K36k80K9J02j57Q9o3O5k02J01J16n6k56L05Q9m01K70n6Pm4k14N03
5417B49l04Pl20J93RJ89J82j58J50j27l12p4L20Q8J52m47K52L18m62KK90k1k80
5440a04L44j74o3k70K00L1O9p8r2L80l48L7n0n8J35R5k0K32k23K0qMj12rk10L25
5466E3m9l7J39p7j16J46K1l13M61M3k58l3O8P7k78L30j30J15j13o7J21R0j18k62
5490a87j1L64q6o2o7j75K04L8n0R2l30P6L25r3N2l4p3j3m4p6O8j9K80k80K09j04
5516DJ90k91l4J87M6Q1k21m6pj4%R6N2j2j61K29k49J6o0R1p2J70p9R7l7Q2k1k85
$$ y = [33, 92, -5, -20, 51, -234, -89, -189, 123, 19, -114, -116, -149, 247, -6, 230, 134, -4, 133, -52, -232, -44, -76, 6, 19, -274, -49, -56, -23, 29, -23, 28, -26, 55, 113, -152, -87, 170, 38, -12, 10, -115, 34, -19, -26, 2, -130, 238, 49, -115, -67, -51, 66, 302, 22, 51, 153, -4, 85, 22, 87, -115, -14, 102, 46, -210, 95, 184, -217, 53, -3, 4, -40, -254, 249, -55, -48, -368, -175, -166, 23, 205, 47, 197, 70, -242, -316, 4, 92, 244, -203, 49, 367, -95, -93, 197, 176, -104, 240, 66, 3, -267, -67, -36, 33, -45, -137, 243, -105, -68, -118, -176, -41, 54, 34, 266, 43, 63, 55, 59, -53, -62, -272, 53, 4, -33, 106, 29, -87, 59, 80, -233, 228, 271, 13, -20, 48, 125, -153, 177, 47, 162, 49, -18, 103, 193, 75, -187, -198, 166, 80, 18, -49, -224, -20, 18, -32, 60, -270, -194, 131, 38, 90, 56, -17, -30, -74, -150, -82, -101, 179, -101, 108, 4, 194, -97, -131, 56, 102, 183, -38, -84, -91, -105, -105, -9, 43, 31, -130, 99, -150, -134, -194, -103, -175, -5, -84, 13, -24, 58, 37, -248]
5544b48q1N90j41J2k46J02J05j06j21J94J02k30j10J73p0k00J17J65J77k41k43
5565c00L08J34k66JJ87k3Q2j00O6k94K86k1Q3J29l31j23pM12l88J24q8J53J60
5588A84j76k68M29k13k4J05N0P6l06J6J50j81m1N22m75mn5R2L13j90R3K9m77J3
5612c38K69J48J61j33o7k8k7j69L50k14l48L65j43o6L84l89K47q5J87o6N1k16
5634a27N7N4k0j80L80j31pJ30m4L9k62O3K08l03J34m3K22j58J12j37P0k65J48
5657f0m0R2k6j73J31J03j22R0P9k6p5K7L21m68J42P8J59j29j90j00K80%l14J43
5681g8K06K4k31J01j17K05m0j06J55r3l1j16j13J77j46K58k44K94J1j31K0NK28
5704B38m30M4o6L07j86j47K0K27K9K70k65O0k2j78K37ol0jm7o0L17k16k49Q7J7
$$ y = [-248, -329, 261, 120, 132, -114, -12, 93, -13, -134, 60, 162, -68, -178, -5, -75, -275, -158, 7, 184, -57, -300, 8, 142, -124, -123, 64, 41, 123, 23, 89, -205, 81, 60, 143, 272, -59, -182, -189, 223, -165, -41, -129, 24, 184, 8, -260, 169, -44, -68, 37, 87, 163, -143, -127, 23, -158, -199, 323, -152, -156, -211, -119, 194, 4, 97, 126, -351, -338, -69, 79, 240, 107, 40, 12, -15, -184, 166, -48, -396, -31, -174, -240, 144, -245, 2, -83, 104, 38, 89, -127, -70, -16, -36, -216, 164, 33, 26, 156, 112, 151, -111, -48, 160, -143, -9, -52, 170, 12, 124, -13, 57, -208, -60, -100, -8, -34, -207, -76, 27, -95, -5, 74, 48, -27, 0, 321, -147, -5, 73, 232, 103, -87, -187, 93, 93, -221, -78, 128, 152, -79, 22, -95, 110, 70, -36, 119, 26, -5, -121, -234, -57, -203, 55, -189, 105, 116, -15, 5, 10, 238, -192, -148, -214, 93, -93, -240, -220, 7, 36, 306, 41, 101, 79, -99, 138, 132, 102, 101, 54, -6, 311, 95, -154, -67, -50]
5729e0N5k14L60J73l11M0k5lj08J18r9N0p0jj69K69j51j39M98p7n9R2k7l15P9
5754h4K1m0J24J50k00m0J13J3m2j51k02K87O8k45K39j97K03k46L42r2k29J67J78
5777A37l3k77J69l8J15k06L16j73j1R2j22J44j41J29l15J19m7J59P0k14K08q2
5799aJ39l32K29%r0k5j75L45o1J18l3J8po1j68j96L57Rj33K09j77m8J72j51Q8
5824B6q0n9KkK18l24J95K2k3J52j99L6K25l3m77K68j2k2r2L02l15J28J75j3Lo6
5850C5J73k79P1L5n6n1J39k88K87l48O16j27p7j87j15Q8K28l6j30J96j80J22j99
5873h3J86j6o6k14L38j56R4j13L1m2j63J3K01K06K1l54J42J01j47j22K31q1j62
5896a55J96QR8m21K10j28K11j62J66p8j6J00j78J94o0J94k30J43J01r6j86K36
$$ y = [-50, 5, -209, 151, 324, 13, 53, 28, 25, -83, 35, -64, -14, -84, -85, -254, 15, -136, -275, 223, 146, 87, 179, 152, -163, -84, -63, -103, 21, 171, -29, -69, 44, 57, 15, -136, -338, -51, 17, -228, 11, -186, 17, -229, 113, 21, -208, -41, 137, 104, -173, -4, -42, 73, -133, 183, 10, -1, 91, -31, 113, -28, 101, -214, -95, -142, 17, 87, -127, 81, -1, 138, -194, 35, 35, -55, -80, -255, 90, 29, 147, 114, 132, 125, 64, -104, -300, 57, 66, -67, 142, -35, -83, 89, -62, 26, -54, -113, -111, -113, 105, -219, -24, -2, -25, 127, -72, -36, 189, 156, -321, -53, -65, -87, -179, 123, -192, -64, 111, 98, 101, 35, 208, -71, 0, 35, -21, -72, 67, -221, 66, -282, 334, 207, 130, -57, -172, -84, 144, 108, -22, 174, -6, 116, -83, 103, 87, 21, -193, 145, -11, 83, -30, 1, -41, -204, -191, 10, 216, 237, -117, 25, 126, -21, -143, 88, 7, -155, 41, 49, 147, -274, -64, -192, 19, -143, 23, -55, -71, 29, -149, 45, -15, 179, -51, 92, 193, 97, -89, 147]
5918A47n7L3k39J20K7j0j31R1K14k62m8O1K48l48K63l14K97k32J86Jr4J37O6j51
5942EqJ14j1l72L02o7j04J90m3j6J03L9r5Q9N8l29L2l2O1kJ76q8J76k28j93K71
5968B8r8N1j72Q2J6l5M11k05j51J13j28P4j56J49n3n2K25J04k78O4j17P5j37j1
5992b01J24K42j65O3J93l27R3q1L78l20L1j79M00k24j08K17l56Q9K25Q9p5o1k21
6015a74L67l36p0K07O0R8k18K35l02L61l44R6j25J11r4L26l9j12k47L15k07qj39
6038b39Q4K41q8J79l90L70k10J21j87J80k72J52j23J33J26o3lo8R7J42j33M2j45
6061e4j33oK89j03J01ok88O01n55K43Q0j83nJ03Ll67L59L1j46L8j9R5L7o0J04
6086A59j42M8j12j9J76j24p9J41K52k69j6j40J43Q9j57Q3j87K1L21k80r3J15o4
$$ y = [147, 90, 123, -116, 4, 31, 21, -110, -19, 195, -67, -115, -54, 194, -154, 109, -205, 92, -140, 46, 47, -47, 90, 156, 5, -3, 111, 100, -272, 30, -37, -141, 49, 6, -10, 93, 132, 37, 126, 184, -145, -113, -145, -84, -86, 90, 2, 178, -50, -243, 28, -70, -19, -191, -109, -93, -128, 283, 78, -73, 40, -88, -14, -170, -21, -74, -126, 99, 203, -75, -11, -128, -53, -190, -201, -77, 165, 0, 63, 256, -71, 22, -59, 319, -1, 30, -149, 251, 27, -81, 136, -220, -131, 94, 183, 108, 47, -174, 193, -143, -213, -6, 54, 152, -66, 169, -133, 228, -116, -20, -145, -34, -128, 198, 159, 47, -200, 115, -92, -100, -239, -155, 86, -2, 177, -213, 157, -53, 68, -119, 61, -211, -59, -182, -49, 77, 14, 11, -57, 40, 182, 49, 91, -54, -187, -193, 96, -7, 94, 88, -200, 401, -154, 89, 169, -14, -19, 84, 87, -280, 79, 110, -36, 2, -17, 78, 115, 55, 159, 17, 65, -47, -66, 110, -14, -93, 48, 300, 31, 15, -125, 18, 107, -50, 33, -154, -133, 188, -92, -185, -70, -134]
6109a34K32j20J49q6j00J31j78K94m72K11N8k5j18L08j20K4J28P7l49K58k39j1
6131h2J78k83J8J8K25l68M91j50q9m1K06j3NJ6j09j22j4K08Ok21j7o5K89J5q1
6156B0j21K10n1J00M4j26n8k5Pj68M50m39L93j51L7q2j08J05j59M28j77Q1m85
6179b75J81K40k08O%Q2m4L9J06k06K51q4k78L64l10J15L8j19o8K59J16k13J9J85
6203A96K6k11j08j22K86j71%J73l61L77j66p8K97l47K95R1j08M2j30J02j26j17
6225a60Q6j0J0J87p2J31j60K70l17j27L6K71l6j19n3J6j60J31K45j06r7K86k46
6248Fj34O9J35Q7l30J72m0J25j8mk18J74J03k59l6K42j94j4K66j42J49J40l49
6271g0J92j50N3l51Q7K48m4q5J41j21M67q4j73P0j64K18m7l86J67k24K12J28r6
$$ y = [-134, 98, -22, 127, 41, -59, 72, -106, 188, -284, -73, -15, -40, -158, 150, 30, 54, 182, 259, -90, 168, -71, -82, 96, -187, -169, -151, 74, -294, 197, 47, -42, -83, 123, 110, 115, 131, 22, -100, -114, 94, 100, -121, -138, -203, 86, 101, 20, -101, 109, 58, 158, 202, 76, 18, -7, 0, -168, 282, -157, 236, 85, 122, 40, -68, 37, -122, 306, 129, 210, -275, -94, 146, -62, -56, -56, 26, -18, 21, 127, -79, 172, 88, -190, 174, -136, -21, 17, -102, -170, 89, 205, -8, 11, 196, 222, 11, -97, -219, 67, -104, -104, 69, -292, 85, -81, -159, 138, -209, 86, 177, 69, 111, -19, 83, -43, -160, -74, -84, -74, 113, 41, 172, 12, 282, -35, -162, -126, 145, 109, -10, -63, -47, -207, -76, 169, 63, -34, 252, 6, -128, -59, 76, 163, -167, 5, -35, 90, 72, 68, -150, 24, 127, -132, -168, 74, -120, -134, 132, -10, 139, 279, -70, 122, -28, 25, -326, -239, 9, -35, -120, 21, -100, 367, 283, 110, 180, 16, 234, 187, -199, -32, -256, -44, 84, -12]
6294a2q2J8Q2M7j51J51l0o0J36Op0j36L7J08q1r9K14o7l5J86j85K71l27J47k6
6319D2j8o4M5j1L3J29jO6q4k09k8k6J14j44JJ08R3l84J13J65nJ71l26M17l69K43
6345G1p6n1O9j88L66m1J8j73q2O0J09k7j80k8j22M51J7k1l24L85j95p8K3o0L87
6370C10k21k8j0J31j89j52K40k78J92M6M7j91R8j78MJ43j90L34K7k84J32L08n54
6393b63J96K3K44k31N5R1j81J66Pk90L13k81p2L75p0k01K7Rj18K36k07N0L65j64
6417G9n5k73K00j12M7P9j77K39k26K00k9n1j13J65J24j3j97O1K9K86j06k84K11
6440H4j57K02k35K9O9K8L9p1j86R2K94k91J12J51l49K56Lk31K44k48L16j85Ql1
6464e7Q2j41L5o5J55L3J7Mk25K32m6j04J5K78k89K63j52o1J56j44J26j08N3OR
$$ y = [-12, -94, -76, 6, 53, -98, 53, 23, -37, 99, 105, 35, -101, -64, 44, -37, -136, 78, 11, -24, 162, -23, 248, -79, 68, 42, 24, -40, 5, -6, 27, 156, 155, 221, 137, -72, -100, -126, -12, -156, -155, -47, 46, -338, -225, -60, -65, 106, -220, 197, -172, 71, -5, -56, 13, -175, 191, 150, 168, -5, -87, -27, 82, 55, -125, -153, -275, 176, 193, 172, -152, 233, 38, -40, -17, -77, 310, 89, 61, 51, 182, -7, -159, 81, -197, -5, 41, 88, -103, -5, -183, -179, -36, -226, 108, 135, -149, -17, 291, -263, -67, -44, 200, -31, 24, 115, -66, 100, 107, -183, 130, -151, -223, 152, 82, -119, -92, -83, -201, 35, -172, -122, 243, 79, 24, -249, -49, -161, -114, -35, -212, 27, -199, 1, -28, -79, -192, -27, 97, 84, -113, -52, -23, 263, 157, -127, 84, -73, 129, -106, -77, -8, 20, 59, -12, -198, -106, 188, -103, 9, 160, -189, 67, 70, -161, 83, -165, 151, -34, -26, -57, 25, -116, -81, -146, 9, 42, 59, 63, -162, 70, 24, -80, -65, 213, -76, 187, 35, -26, 130, -14, 112, 4, 57, 63, 72]
6489G2j42K23j62M4j4q2j45J94L11k08J2j77J72M7k19K45k01J22j61J38P7p4J15
6512A87l16L61j66j75Q3M4o0J42M8j52j34O0M8j3J51j89J17n5j73L2J00K4n8L1
6536f3K0j82J86J35o2O7N7k55J17j68L66l38l4L44k43L84k86j24K9N4K4j35J94
6559H7r7l3R1j49J48k84K23j61L3J49l0J06k14K85l73N2K44l19K76K25k25j75
6581a41L78k24o2L11k78J55j9m76K23j03J41N8l2P9Q5j48o9P6mL9N3J91k51J48
6605A30k83J53j64O4L9J09k56J04R1j42K20k00J7J80m7P9k79L7K57q2j60j89L42
6628B0J24j99K71k42R1k3r1J51o8o7J08J6p8o3K3J45j07j70J83J32l6o2p1P5R
6653G1m9N1K4R3m39L04k33j1L01j31J50n3M9k19J98j29j36J68J34j59k3O9o3Q6
$$ y = [72, -70, 153, -9, 35, 21, -61, -206, -12, 299, 91, 103, -74, 98, 145, -74, 171, -30, 92, -69, 69, 146, 72, 187, -129, 232, 66, -109, -26, 18, -42, 100, 148, -4, -138, -78, -30, -43, 108, -81, 36, -19, -192, -160, -60, -36, -94, -63, -43, -225, -39, 96, 34, 101, 158, -97, 20, -148, 218, -120, -154, 190, -53, 331, 45, -79, -50, 4, 28, -107, 87, -10, -43, 48, -101, 47, -237, -14, -175, -142, 7, -23, 83, -131, 154, -219, -167, 77, -242, 34, 259, 34, -141, 237, 13, -49, 262, -16, 139, 120, -356, -133, -236, -95, -37, -69, 10, 95, -53, -122, -46, -50, -11, 42, 233, -18, 130, -153, 0, -164, -100, -61, 48, -208, -104, -13, -155, 65, -135, -118, 62, 15, 94, -185, -148, 109, 27, -133, -322, 20, 144, -55, 216, -26, 65, 42, -49, 102, 34, -33, 75, 91, 13, -50, -27, 118, 11, -159, 24, 156, 120, 58, -13, 62, 71, 22, 73, 97, 190, -249, 55, -178, -189, 112, -19, 131, 78, 127, -92, 106, -23, -159, 9, 143, -16, -39, 30, -33, 53]
6677E3j9J61j81N1j48Q0J1o9l05M11n1j34L7Q5R5QK4k34J5L19m8l22K47K40l52
6702b6j75L41j33K1j43o0J2O9j38O1k2K64J27k58l5J32L6k78K44L8k19J89K10
6725B57l60J02N2j00K42k17K66k64J3J67j50M9j51J34MnJ45l97K04Q2O0j65q8
6748a20L13m22M33k18j02J10%o7L48n30M19j97K31j65n7K39j93j13J52Oj98J02
6770b9J89k19M6Q0j08n7k8O2Q9k9m3p6K16l0J73k93N2O5k54M51k31j48J04L3m5
6795c0J70m6m9J77k78L7k8k05K05L3l3K74j62J78l98Q7K47j67L8j2R5j43%N3l4
6820Ij27K09K6k34n0N8J74k8k02K30r7R9M3k96K19k79L20j07J01K6j24k6K70o1
6844A53k70m5K1J08Q7J2k68K86K54l32j24j43K07K2j88K6J05K78l59J69nj38K05
$$ y = [53, 34, 195, 14, 65, -83, -3, 8, -61, -366, 45, -6, -140, -103, -18, 77, 85, 109, -125, -110, 209, 161, -161, 86, 326, -26, -201, 140, 7, 28, -115, -175, -163, -94, -232, -171, -193, 71, 198, -60, -95, 37, 73, -205, 39, 77, -142, 47, 257, -103, -1, 51, -49, 193, -24, 242, -22, -9, 158, 8, 57, -94, 40, 44, 39, 184, -213, -9, 73, 133, -32, -120, 193, -229, 204, -14, -116, -6, -6, -73, 275, -255, 164, -33, 198, 33, -24, 215, 22, -91, 61, 67, -131, -29, 160, -59, -13, 67, -41, -98, -126, -64, 25, -4, -47, -123, 93, 63, 236, -57, -5, 60, -194, 257, 26, -122, -18, 15, -30, 140, 94, 45, 222, -56, -19, -47, -252, -47, -14, -47, 227, 65, 243, -155, -68, 179, 12, 50, 38, 133, -10, -10, 43, 9, -118, 91, 117, -117, -167, -109, 65, 37, -165, 65, -32, 67, 110, -186, 33, -246, 74, -33, 68, 94, -30, -56, 214, 153, -117, -162, -141, -33, 54, 66, -202, 84, 338, 6, -118, -261, -54, -32, -220, -194, -89, 189, -170, -1, -6, -144, 61]
6867F1j10j36L22N0j96J0L5J0j40J47k40K9K51j84J14p6N4j04j6J77j13M8k32
6890b39K54j56J89J31j47k7J09m0j8j29J66N8Pp2q2o7k22L81r4L5o2k29N6M2L04
6915A48q2Q3L7j1o7l2j58K34k27rJ29k98K74K18k56j32J60p6K86m55K81l73K28
6938i8J59j35O6J42j30j75K13Q5l18J26J31l55J79J53Or0K9o0j37K91k53N00l21
6961Hj99K73J93j91k09J73k06K53k7j06J42J9r4Q2j49Q3R3l19L1J87r0J47j83
6984h9o9J04rM8K40k3j0N9l92L45J7l21J32o1J14j35K04q2j43K29j81J2J87j85
7008iK03k18m5o8L56k83Q6j90J70p1M1M3k17O8J91j4O7k36p5K07lL3j43K1J31
7033D5j76K83k31o0K52k13K66l35J28k00K29j40J94k41J92j05J56M8O7j65j34
$$ y = [61, -49, -185, 137, 187, -9, 1, 36, 46, -94, 53, -187, -158, 93, -91, 23, -53, 1, -103, -119, 58, -55, -7, -239, 15, -141, 48, 179, 32, 5, 114, 74, 56, -73, 93, 151, 158, 86, 4, -63, -285, 96, 2, 37, -25, -254, -198, -156, 148, 66, 149, 186, 175, 108, 76, -82, 152, -75, -84, 45, -253, 21, 239, -17, -149, 11, -65, 221, -234, 47, -326, -98, 61, -74, -8, 134, 4, -171, 42, 127, -191, -65, 66, -289, -110, 43, 49, -41, -12, -72, -209, 82, -171, 329, 8, -191, 82, 275, 84, -125, 48, -158, 95, 68, -38, 104, 123, 29, 111, -38, 45, 138, -181, -150, 37, -53, 94, -89, -158, -54, -63, -15, 225, 202, 192, 251, -141, 204, 221, -100, 32, -29, 85, -50, 154, 72, -71, 158, -23, -11, 176, -9, 194, -24, -69, -137, 219, -64, 22, -168, 2, -69, -28, 15, -202, -134, 57, 43, 110, -126, -201, 6, 3, 36, -107, -86, 45, -131, 152, -79, -139, 113, -100, 166, -169, -41, -241, -12, -152, 42, -199, -7, -112, 44, 92, 159, -6, -140]
7054a40J43M4l1l6J58m46K06P1K1j0o7L80n27K2K08q4Q6k3O6P0J33j84rj85K19
7079H5Kj70M4J97R1k7k94J22m8r9L59k08j77J89j01O4j52L3J35J27k44K44l49
7102a77K04lP4R6q4j78J71k08J77pj61N2JQ2j74P2K19k42J80k34K52j64k11J05
7126a58J72j01j74K68Q0l32K53j03o2K84j11J02l09nM28k93K03r1j16n0J78K68
7148C31k91Q0L3j9m8k52mK05j41p8J65J60q9r0r4J66o6j35K68k16K89j94k4O6
7172B2p6K09j64o3J91k38J11M1j33J51j53j07L47k01J03k34L6L31k86NJ28O6j34
7195d8R2l11L91J39m45Q8K09j79M1O8n1j02r5J85P3N3p8O4r4j37K03N8j79M5J30
7220A20j02k4j40K05m7Q0J66m7l85L16l67L69k95J44j32q4J61R6m6K1j11n6M6
$$ y = [-140, 3, 47, 16, -20, 138, -308, -102, -31, -10, -20, -87, 293, -234, -212, -4, -88, -2, -25, 41, 111, 244, 60, 51, -134, 85, 87, -83, -39, 158, 249, 222, -72, 50, 2, -97, 262, 54, -123, 66, -35, 29, -123, -90, 45, 172, -72, 172, -177, 27, 24, 98, 194, 110, -68, 103, -105, 72, 65, -96, -44, -43, 39, -135, -63, 156, -86, 94, -140, 112, -52, -263, -158, 14, -87, -261, 7, 87, -245, 8, -95, -157, 127, 16, 118, -191, -196, 232, -61, 142, 51, -65, -115, 63, 331, 40, 120, 153, 134, 86, -166, -170, 35, -106, -184, -19, 141, 52, -38, -132, 34, -32, -167, 101, -115, 174, -20, -44, 22, -54, 155, -9, -72, 119, -119, -8, 33, -100, 51, -102, -209, 138, -63, 40, -194, -158, 173, -113, -108, 20, 86, -48, 44, -267, 124, 263, -182, -94, 115, -64, -23, 45, -6, -108, -203, -18, 55, 108, 30, 94, 0, -137, 66, 124, -55, -10, 120, 18, -6, -146, 59, 12, 92, 258, 211, -174, 142, -225, 144, -151, -7, -139, -223, -62, 34, -12, 9, -102, -158, -112]
7243a12M38k20m8J52n25K97J83j94J02J48K20m24M4L4l2j57P4k04L64J18k15j5
7265B8J71m18K31J8r0j3k6J9J39l5j71K6Mm0k6K91j4Q5j42K11k77o0o0o0L01j52
7291f0N7j6J34Pk01J90k6oj48L1J10j28o2j32K43J3n6j39K54j77J11J66j19j8
7315B8n7j3O8k11P5L0j9J93O5k13J21J35l80J71j23J50j08K5J41k53L47m7j56
7338c1O1j74j26N25J07m88K29k56J09j7J6rn4K26l34M67k09j06K00j37o3K83l2
7361A87l16J05k15K07%m2l0O8J56j69l2m1R7K0mj99Q3L6o7K65j77K14k95P8L33
7386B62l73l2j16J45J48L13l59j34J12Q0O1k01L4j21K06l7J11k69K11m5J77j50
7408B3j08j97L37l15K35r0O7K07k01n1j15M0K68L1M0j43l4m8k20K59p1p9K58j71
$$ y = [-112, 326, 106, 58, 210, -315, -18, 165, -29, 73, 221, 441, 17, 61, 95, 63, -94, -20, -224, 140, 258, 43, 28, 199, -219, 12, 30, -60, -73, -99, -80, 59, 24, -147, -121, -117, -157, -183, 108, 94, 179, 37, 248, -29, -89, -149, -209, 92, -60, -3, -19, 115, 122, -79, 111, 85, 79, -69, -38, 72, -56, -118, -250, -7, 6, -50, -189, 65, -112, -1, 165, 46, 28, -29, -42, 26, -185, -110, -80, -99, 94, 159, -54, 67, 202, -178, -7, -130, 20, -88, -63, 78, -175, 172, 125, -31, 30, -144, -270, 255, 362, -126, 103, -153, -44, -61, -45, -54, -108, 118, -216, 251, 42, -64, 136, -1, -64, 219, 187, -129, -24, -239, -32, -32, -74, -104, -36, 120, -49, -81, -122, -25, -5, -9, -208, -125, -89, -156, 109, -68, 146, -149, -71, 262, -111, -143, -259, -114, 34, 347, -12, -146, -34, 46, 107, -94, -60, -181, 25, -12, 99, -170, 41, -4, 173, 23, -85, -282, 55, -260, -25, -115, -48, 159, -42, -93, -208, -168, 100, 131, 171, 28, -6, -54, -274, -15, -86, -165, 93, -78]
7432g8p9K14k74j8J86K77q6j3k66K55k26K71k26P4n4p6J20J17j58M4K14m36k2
7455b40K03J41j18m9j92M99k44l9j37L24M0m45J22J27J52j71j58K10Q1k24L38
7476B20j18k01J25p1o6j17J42M8%J53l26R1K43j46O1N0j48J97k97K34k70L11k68
7499a53L67l74K52l02K12J0p3J66K39k45j87L3k5K24j44n9K3l2L7L84j99j26K90
7522C18l83N6N7l47L69m4J59l8m7o6j56J28k8N3N8p1p1Q9O3l4m07K51K59j24r5
7547e1j76K61l04K53n8L5L68n45M08j14j84j4J31J67K1k83K36J3j90k1j65J68
7569d4J69j64J54Q3j00q7J77j34j02J52O7k25p6J70Q9m3m01L63M2m35J94J40r6
7592a07J05j44p2L54M2k73J75j32J34p4j95K00J62k79k8P0j71L75j22k8j66J77
$$ y = [-78, -157, 57, -217, -235, -49, 228, 142, 129, -137, 118, -108, 163, -63, 11, -43, -119, 1, 118, -40, 4, 218, -218, -240, -37, 104, -14, -63, -255, 244, 0, -39, -176, 148, 188, -257, -135, -8, 144, -27, -185, 25, 106, -118, 220, 102, -99, 26, -45, -111, -228, -86, -38, -38, 115, -211, -120, 123, -23, 38, 88, -60, 137, -160, 74, -196, 115, -153, 214, -160, 92, -210, 2, 12, -61, 105, 344, 99, -88, -55, -80, 144, 0, -59, -36, -68, -31, 353, 154, 28, 318, -65, -9, 48, -299, 70, 26, 185, 147, 100, 34, -122, 6, -22, 31, 89, 18, -53, 36, 99, 65, -342, -91, 168, 44, -51, -227, 34, -270, -17, -75, -40, 328, -217, 191, 77, -107, -121, 10, 177, 198, -85, 151, 164, -26, -47, -212, -44, 125, -39, 115, 198, 98, 11, 188, 54, -48, 104, 171, -54, -130, 40, 129, 86, -315, 48, 90, -345, -151, -11, -107, -2, -146, -218, 136, 178, -95, 80, -52, 82, 8, -187, 13, 175, -104, -132, -62, -233, 142, 20, -8, -174, 3]
7614Cr4p1K04K8k37J20M6O6l3j22KJ51J9J7o5K5j51J7n4R7K82j60k8J46j55K91
7640C44m81k1n7L85j61J5j41K03j25j45L42j33lJ30k96j49K25J61n9K1P0l12K18
7663C1n4m1l3K00j04k54L37l53J28L35k33K1R2q0j58J61J76l3R5j10j2K7Lk19
7687g8R1M2j16P0J62l88K66j35J2k0O0o9R8K85k56J08r4j09J77K66l67m4j03K84
7711A42k43k96L85m3j0N9k4j00MJ84J2p0J78m8n4j55N7J66k0q3l1K42l6j65O5
7736A16j98M9O2Q4oj59j25J75l6J00j1K52o0k6k76j69K94o3O4j68J39m3k39K02
7760d2l3K0J05M5j31o2J19r7R9K80j09j96k40J43j8N8j91R6L60p3m6J27n90K67
7784a09K74l4nk92N2Q9Op0o1O7J01J0m9M9N4r2L05m04J62l6J04q3M7J58l23k5
$$ y = [3, -91, -162, 42, 70, -167, -47, -1, 65, 32, -90, -88, 63, 82, 99, 34, 59, -92, -75, -129, -32, 250, 90, 62, 208, 53, 344, -137, -158, -215, 170, 9, 24, -117, 86, -39, -184, 158, 25, 22, 152, -144, -293, -68, 93, 34, 55, 125, -187, 31, -23, -64, -97, 103, -1, -255, 82, -271, -143, 192, -41, -20, 72, -8, -166, -5, 171, 138, 233, 123, 111, 138, 141, -78, 13, 55, -61, 9, 171, -217, 49, -86, -74, -94, -34, -103, -5, 280, 24, 132, 38, -71, 106, 372, 5, -39, -142, 142, -101, -397, -12, -55, -65, -6, -30, -130, -126, 58, 70, 0, 178, 130, 76, -79, -22, 144, 124, 41, 10, 252, 216, 51, 116, -82, -33, 29, 113, 107, -52, -177, -2, -38, 62, 51, 303, 243, 217, -59, -228, 66, 3, 67, -101, 38, -5, -244, -42, -75, -55, 50, 95, -36, -98, 21, -76, 23, 303, 194, -2, -242, -99, -117, -59, -250, -154, 206, 133, 87, 214, -376, -109, 165, 131, 126, -166, -114, -25, -19, -89, -150, -83, 18, 28, -21, 28, 82, -10, 295, -109, 53, 17, 121, 38, 85, 243, -80, -105]
7810a05K21o4O3q0j09J56k18J72K57k24j31M6J10j16l2j48J24j35q2L50j37K38
7832A56j24Q5j91K1K03rk34L1K1qL0q9K34m5l8J7j36j38J79N9K80n17K63J44m11
7857b17m9J96M9P5k5mj07J58j48Q6n8J37J31k21j59r2Q7J08M9k90K68n1L44k44
7881B3j3j86J14K25K3K2N9l91J11O6j51j27K37N8q9K31l38L40l75J62J48J30k60
7904A9R2j02q0l8R0J52j65M9l0j03J97j00j44L5M0K84O4j02k11J3j17J19L70m17
7928h5J90k56J32nP2J26k19L41l51J83j64O0K73l26Q0L1l38O04l41n9k4J20O8
7951A12j64O8R0j08R8l21J10m2J44q7j1K24r0jR0l18M09j62J25l25K23j60O8m1
7975f9j1J01j48P0J12L7j25J08k4R5k7n0j02k56K87j66J78p3j80M41k46j06K41
$$ y = [-105, 116, 52, 115, 35, -74, 82, -136, 36, 293, 69, -62, -16, 94, -22, -54, -202, -78, -213, -295, 55, -82, 156, 32, 117, -74, -53, 150, 141, -93, -62, -41, -49, -19, -108, 126, 81, 43, 60, -76, -214, -35, 24, 304, -213, 50, 194, -217, -266, -70, -21, 54, 29, 25, -82, 76, -72, 14, -44, 93, 224, 3, -156, -248, -161, -53, -4, -294, -26, -77, 267, 23, 10, -176, -62, 163, 186, 208, 267, -124, -13, 53, -98, -225, 12, 70, -19, 212, -126, 214, -161, 1, 149, 279, 19, 111, 9, -71, -109, -19, 133, -32, 17, -13, -116, 81, -19, -163, -128, -88, 196, 260, 158, -53, -40, -157, -38, 332, -85, 105, -151, -19, -24, 48, 174, -45, 296, -55, 128, -36, 24, 297, -29, 51, 82, -256, 348, 7, -52, -76, 44, 112, -52, 16, 106, -2, 96, -225, -115, -157, -13, -100, -111, 113, 23, 22, 112, -206, 203, 41, 166, -159, 64, -96, -28, -69, -80, 21, -127, -57, 55, 92, -33, 75, 51, 146, 119, 69, -33, -289, -2, -168, 10, -63, -243, 198, -48, -154, 87]
7998H7N3j98O7j10L59Pr6k06J88k8o6K05k42k37Q5J99O1j4k83Q7M9j46K29oJ24
8023A68n4k27K20q8k49O8J34j4NJ01L20p05O05q8k20j04j7L18k42J35j64K55J0
8046A67k14J47J8k79K84k80j2J95J60j41p3j57L05j57J15j94J90j32J7J37j52
8067e6K86l19J4J14Q0j26O7N2K45n04L15j25J21o3j1m9kK01l13K45J26l42RN9
8091B4J0j07K5K00j56J64j80j80L08j06J01rl1m24M70j83Q2m3Q6l7j24L2r5J6
8115a57K06oM6O2j89J35j06r4J18J16j45J47R2r6k77K21o3Q5r7q3L4L02j66Rk31
8140a37L9J58L2j07l01L18J02j61o5J20k02L14p3j11nO0j28K58n5o7k56J31K74
8163A38k34J54j62O9K3j22J09J46O6J14l20P4m7m3pj1N3J6L24l63q2L40m66K54
$$ y = [87, 140, -58, 9, -101, 258, 265, 169, -37, 151, 123, 57, 262, 20, -217, -132, 67, 128, 114, -169, -82, -33, -179, 50, 44, 168, 114, -113, 107, 19, -230, -162, -28, -42, -37, 64, 384, -321, 284, 196, -24, -128, -145, 173, -69, 66, -98, 157, 167, -47, 100, 118, -161, 123, -157, -169, 26, 186, 45, -28, -185, 120, -37, 78, -116, 74, -58, -41, 96, -56, 230, -89, -75, 39, 119, -7, 60, 112, 357, -147, 168, 43, 164, 101, 90, 41, 39, 240, -73, 172, 298, -44, -35, 24, 34, -73, -48, 152, -4, 160, -20, -200, 108, 2, 103, 94, 63, -361, 109, -74, 8, -35, 51, 14, -110, -78, -173, -157, 49, 43, 89, 151, -38, 97, -9, -103, 15, 131, -14, 133, 225, 129, -148, 73, 10, 95, -2, -85, -51, 251, 85, 94, -137, -98, 60, 92, -15, -316, 2, 104, -57, -122, -2, -204, 110, 37, -74, -79, -19, -147, 111, 56, -11, -267, -136, 138, -96, 58, -104, -35, -12, -134, -25, 121, 187, 301, -19, 55, 8, -35, -42, -53, 0, 16, 340, -23, -105, 235, -231, 23]
8187B3K59l89K21j54
$$ y = [23, 282, -107, 114, -40]
8191d0
$$ Imaginary data points
##PAGE= N=2
##DATA TABLE= (X++(I..I)), XYDATA
0@%%%%%%%%%%%%%Qj6J6j6J6k4L2l2M0m8N6o6P4q8J04j20J36j55J79k03K29k58
35a36K91l29L69m14M62n12N68o31P01p77Q57r45J043j151J266j394J539j695J869
54I81k064K283k533K819l149L535m000M567n271O181p410R163j1886J6738k7992
69a8038J04635N1562j58187n5083k8125J21537J04611j1595j04715j14166J9707
80h7857J13980O1688J9304j08782j05055K4297Q5148R1096r505r7729n9320k6648
92i9383R2117J08349l1829o6606p2172k5209R3447Q1238J0630p8213r5551J1727
104g1455O2775Q1133L2492r7289q3233k750O8554R5836l334o8909q0784l0862
116i7826J01276Q0538j2549n3668r1577j0891Q5608P2996J0928q2066p3032O106
$$ y = [0, 0, 0, 0, 0, 0, 0, 0, 0, 0, 0, 0, 0, 0, 8, -8, 8, -8, 8, -16, 16, -16, 24, -24, 32, -34, 40, -48, 56, -64, 72, -83, 96, -107, 122, -136, 155, -174, 195, -219, 243, -269, 299, -332, 369, -408, 449, -496, 547, -604, 662, -732, 807, -888, 981, -1083, 1200, -1333, 1486, -1663, 1872, -2128, 2439, -2832, 3349, -4061, 5102, -6784, 9954, -18038, 86597, 138159, -20028, -75111, -103236, 18301, 122912, 111317, 6602, -107564, -87857, 26123, 87811, 107115, -1667, -106722, -82425, 2723, 93819, 84314, -13415, -72735, -99383, -7266, 101083, 69254, 2648, -69524, -94733, -1286, 79952, 90582, 12369, -83182, -71455, -8680, 72453, 104945, 7656, -75577, -78327, -9773, 86063, 82729, 13820, -66964, -97826, 3450, 83988, 71439, 17771, -73806, -84697, 911, 73907, 84835, 2769, -70263, -64157]
128f4157N2697Q6292P990q2862n9082r767O4369P2789k599m9460p8849j2654P7440
141B147N0536J0613m6528q1648n463N6707O5175J5018o2128n8199j6546M6915
153b3401Q1063N791n4561n9429k0908N8398O4652J3907m5020p6930o397N5959
165f876N3568K4566n3206p0028o302M5222O6112J1818n2087n5894k1121M9803
177a4425O5936N201m2547o0237j6635M8715N4487J8876m5587o3563o191L8081
189a7889N5727K2907m8924n5233j2982L7886O0411J3403l9463n4429k0233M3765
201a5054N5257J4211l5923n7577j4723L7566N3408K0557m2580n2440j3210L1004
213a9504N7304J7813m0745m8723j8087L3840N4733J5485l3944n1417j8105L5211
$$ y = [-64157, -11460, 74832, 82822, -40, -59122, -68889, -4520, 68269, 65670, 16210, -62639, -75293, 2147, 52683, 63296, 16768, -64880, -70343, -13636, 51539, 66557, 4429, -53770, -70316, -23401, 57662, 63453, 8892, -50537, -71445, -13047, 51605, 65512, 20492, -56438, -62835, -6876, 46692, 71258, 18052, -51976, -58278, -13056, 53056, 64874, 12787, -43107, -64228, -14425, 51511, 56712, 14165, -46072, -62707, -13992, 40495, 59371, 13784, -49779, -55970, -17889, 37838, 60745, 11821, -43412, -56394, -18508, 41903, 55306, 15843, -38586, -58819, -15054, 40203, 54414, 18491, -39086, -53809, -16243, 37165, 57722, 15142, -37298, -50508, -19504, 37800, 55613, 14868, -33855, -51942, -18102, 36631, 52116, 18172, -33245, -51350, -16139]
225a6139N0217J8453l4055n0985j5984K9863N2162J8193l5333m5993j9032K8866
237a9767N2866J6072l1965m5839k0655L0250M9644J7055k9216m7182j8768K8465
249a9040M8060J8439k9391m4734j9688K6729M8683J7014k7469m3355k1254K6669
261a9337M7597J6559k5624m3281k1351K6502M5837J7017k4818m2986k0577K5172
273a9290M4791J7057k4180m1671k0838K4604M3570J6359k2155m0622k1043K3948
285a9470M1819J6452k0371l9808k0848K2121M0626J7672j8886l8823k1652K0804
297b0364M0193J8408j7676l9167k2535K0366L9631J9323j7041l9687k2381K0176
309b0754L8735J9987j7396l9686k1262J9011L8444J9662j7374l9010k0594J9516
$$ y = [-16139, 34078, 52531, 18476, -32509, -48493, -18630, 33532, 51725, 16392, -29601, -48633, -19767, 33099, 49171, 17206, -28633, -49288, -19038, 30606, 47661, 18445, -28737, -47505, -19040, 29020, 47459, 18068, -26666, -46354, -19625, 29058, 46072, 18603, -24752, -46006, -19337, 28260, 44819, 19195, -24086, -45437, -18935, 26902, 43919, 19101, -23885, -44462, -19290, 25501, 42558, 18378, -23293, -44131, -19527, 24043, 40402, 18247, -22375, -43418, -19470, 22349, 38801, 18430, -21378, -42226, -20105, 20521, 38193, 19307, -19516, -41168, -20364, 19829, 38237, 20561, -18606, -41141, -20775, 18856, 38179, 21138, -18549, -40930, -20754, 17981, 37968, 20572, -19114, -40376, -21365, 17079, 36741, 19367, -19643, -40237, -20721]
321b0721L7166J8479j6648l7436j9964J9436L4921J8226j5177l6258j8412J7156
333a9232L3296J8908j4416l4082j8519J4081L2966J9250j2477l3172k0473J3776
345b0094L1948K0034j0181l4751k1000J3179L1305K2626j1682l4577k0364J1014
357b2543L3891K2331j3776l2825k1381J2170L4105K0475j2350l4097j9855J4258
369a9597L0538K0602j2122l4256j6252J1927K9575K0255j3253k9472j7267R773
381a9549L1011J6674j0658k5870k0293R816K8816J7795p731k8324j8171P961K5633
394G110K2573r598k8028j7402M475K8449K1943r526k5695k2488P228L0195J7394
407B6630n550k7352k3609J0296K7323J9588p442k8696j7828N972K7886K1369j2210
$$ y = [-20721, 16445, 34924, 18276, -19160, -39124, -19688, 15233, 33459, 18282, -17976, -36388, -19232, 14064, 32972, 18556, -15526, -34045, -19964, 13002, 32252, 19775, -13397, -33870, -20094, 11854, 31888, 21707, -13044, -34044, -20865, 10440, 33066, 21384, -13193, -33557, -22543, 11348, 33679, 19903, -12922, -34303, -22133, 11972, 32447, 20097, -14000, -33855, -19597, 10941, 31543, 19421, -14835, -31087, -19160, 10415, 30670, 17417, -12055, -29322, -19549, 11462, 28136, 17478, -8392, -28685, -18869, 9947, 27742, 20011, -8313, -26484, -18523, 7110, 29683, 20085, -7943, -25345, -20870, 7579, 29522, 19996, -5699, -28187, -20959, 9236, 26630, 21080, -6272, -29881, -19585, 7738, 27326, 19884, -8812, -26640, -20668, 7218, 28587, 16377]
420A6377k4017j7735M593K9459J6548q177k2930k0946R898K4161J4967j979k6555
433f336j8475Q397K1458J8964n775k2633j7564J631K7378J7191p807j7420k2098
446b3089L230K6864J5542k498k3612k0616P728J9505K0029k047k7435j6073M428
459a8044K1128J9675n671k0569k0259L539K6921J2507k754j8534k2819P031K2266
472D417J4862r46k3381j5827M480J7083K1926n155k2183j3569O87K0830J7411
485B0635l385j7992k0610N310K0872J1476L152k0519k0881P050J6488J7230p32
498A8094k1499j4245n38J8802K0125n802j6854j5607o65K0322J5238J62j8555
511a022j8988N877J4799J5345L673k2318j5731M040J4145J7945j675j7237j4901
$$ y = [16377, -7640, -25375, -20782, 8677, 25225, 17048, -5882, -26828, -16930, 7231, 22198, 20219, -6336, -24811, -16414, 5044, 24008, 18233, -4400, -21964, -20333, 7045, 24236, 16429, -991, -23089, -19859, 7005, 22547, 20049, -3563, -24179, -16451, 3054, 23083, 21036, -6399, -22472, -18044, 3084, 22759, 17088, -3481, -23740, -20201, 6720, 19227, 16473, -2061, -24880, -17849, 4417, 19279, 18333, -5048, -20875, -16395, 688, 22614, 17459, -4724, -18293, -17606, 3224, 20635, 17250, -742, -21352, -16042, 4830, 16306, 19458, -1061, -21942, -14892, 1596, 18826, 18094, -3405, -17650, -18188, 614, 20739, 14937, -1917, -17524, -18189, 2133, 17371, 17533, -1022, -20010, -14133, 666, 16011, 19684, -2634, -18365, -14325, -180, 17765, 16090, -1147, -16048]
524a6048k180K0149J5727l591j3648j7509L04J8209J4531J260j8644j5227L258
537a3409J1648J9001Q71k0195j2126n88J4457J7609k016j3880j6414j128J8282
550B112J2535O12j3424j7612J053J4634J4848J559j7603j2586q00J1898J9202
563A6428j965j5199j2059l136J5348J5004O2j2371j6866M74J4884J1923L511j4295
577A743j5855J065J1964J5308P32j4131j1954l569J3553J5826j815j1012j3718
590a1863l300J4507J2908J840j1945j5590K08J1130J3471L895j3928j3598j390
603a3655J1350J4974Q50j1345j3453l388J4138J2404Q33r591j5246j415J2275
616a269J1959L467j2434j3619n40R841J3487K344j1895j1987k488J0828J2524
$$ y = [-16048, -18228, 1921, 17648, 14057, 409, -17100, -16796, 1413, 15944, 17204, -1440, -16667, -13409, -1761, 17240, 18111, -2084, -14210, -14798, -341, 17268, 15252, 1372, -15042, -16170, 2112, 14647, 15259, 1835, -15777, -14724, -90, 14758, 16317, -1286, -13872, -14672, -2774, 16428, 14463, -736, -12795, -15931, -583, 14421, 14483, 2112, -14754, -14280, 604, 12527, 16038, 1743, -14112, -13047, -1083, 14225, 14957, 826, -11128, -14697, -1144, 14682, 12867, 1855, -11863, -15163, -656, 12252, 14092, 2147, -13443, -13235, -2105, 11366, 15261, 1333, -12265, -13655, -2305, 12669, 13519, 2174, -11279, -14667, -529, 11875, 12708, 3117, -12129, -13544, -1269, 10690, 14157, 1723, -11896, -12436, -2595, 10892, 13236, 1341, -10646, -13134, -2306, 10218]
629A0218K073r369j3619k320J1450J0648L445r158j4271j251R421J2138L961j0695
643B671j2280k637R095J3128K892r916j2525l126J0114J1472L882r416j3844j613
657a2103R479J1131M136r920j2829j600Q573J2236L068r976j1281k353Q600J1522
671H683K549q526j1291k457Q277J0607L508q148j1534k047O790J1173M069q561
685C092j0464l102O424J1604L662p664j0894l825P273J1431L953q000j1253l333
699a1096P067J1277M057q067j0928k953O760J1459L608q199j0329l053O770J1359
713G732K781p285j0135k885O408J0619L142p247r577l296O014J0408L062o479
727C262r330l626N897R966L341o062r163l972N591R882L860n798r581m236O030
$$ y = [10218, 12291, 2922, -10697, -13017, -1567, 9081, 12526, 3368, -10903, -12154, -2733, 9405, 13366, 2671, -9609, -12246, -3151, 9977, 12869, 2953, -9572, -12698, -2584, 8888, 12770, 3354, -10490, -12103, -2624, 8507, 12643, 2723, -10106, -11706, -3133, 9103, 12171, 2195, -9086, -11439, -2839, 8683, 11232, 2706, -8585, -11042, -2765, 7842, 11350, 3202, -8332, -10379, -3589, 7584, 11653, 3092, -7372, -10474, -4050, 7554, 11216, 3552, -7342, -11167, -3894, 7537, 11490, 3490, -7763, -11096, -4029, 7248, 11305, 3238, -7690, -10643, -3883, 7576, 11184, 2985, -7344, -10397, -3627, 7732, 10513, 3228, -6907, -9792, -3384, 7235, 10377, 3130, -6447, -9743, -3729, 6679, 9741, 3262, -6068, -9694, -3797, 6169, 9510, 3448, -5715, -9687, -4096, 5786, 9646, 3848, -5733, -9969, -3939]
742c939R771M039n993r765l753N725R781M219o204r199m143N616R924L261n484
757C856r399m124N791R276L788n522r276l875N453Q987L650m662q936m410N471
772c932R060L547m614q890m172N365Q373L985m372q945m115M902Q575M055m549
787D273q626m042M273Q630M004m194q668m591M703Q278M156l908q861m019M463
802d129Q142M524m520q528l642M032P937M504l980q115m269M053Q219L752l427
817D553q217m256M194P286M139l266q310l647L122P421M939m087p619l500K683
832d565P883M304l503p293m493L644O855M470k657q235l485L201O763M923l357
847D455p637l281J996P715M387l827o412m495K425P613M023k659p419m034K993
$$ y = [-3939, 5832, 9871, 3878, -5887, -9640, -3915, 5866, 10085, 3881, -5318, -9461, -3845, 6079, 9340, 3856, -5543, -9667, -3876, 5400, 9188, 3666, -5610, -9485, -4032, 4955, 8605, 3943, -4993, -9403, -3932, 5128, 8675, 4061, -4829, -9001, -3636, 4737, 8722, 4350, -4595, -8710, -3808, 4767, 8822, 4273, -4353, -8395, -4122, 4508, 8512, 4318, -4350, -8941, -4238, 4040, 8196, 4288, -4573, -8592, -4129, 4013, 8537, 4017, -4511, -8153, -4121, 3816, 8320, 4340, -3775, -8044, -3991, 4228, 7980, 4553, -3664, -7920, -3726, 3560, 7699, 4433, -3877, -7524, -4402, 3019, 7958, 3871, -3748, -7248, -4565, 3318, 7622, 4119, -3174, -7667, -4023, 2832, 7302, 4645, -3590, -7075, -3874, 2889, 7812, 4455, -3182, -6463, -4467, 3248, 7635, 3808, -2604, -7099, -4674, 2939, 6962, 4303, -3116, -7150, -4157]
862d157O424M847k746p453l520J949O859N387l528o596l864J853P901L672k915
877D113n899n349L184O800L756k262o672l914K255N792N297l072o454l378Q60
892d943O984M407k875n315m856K043O809L176j068o080m929K598N921M170j904
907D138o228l704J141O872M181k787m937m201Q07P037L458j832n312m897K412
922c852N496L786q49o255l980J893M764M715j887n120l975P98O377L489j806m183
938e89n251J623O089L118n90n671m528K208M562M415q78o351l268Q65N519M257
954E530j737m562m596J191N854K912q36m412m825J778M883L489m98n491l298J188
970c430M054M391j308m831k879n7N052L677q28m169m415Q73M813L172L27n158
$$ y = [-4157, 2267, 7114, 4368, -3085, -6605, -4656, 2203, 7590, 4062, -2534, -6398, -4545, 3356, 7028, 4113, -1786, -7135, -3951, 2849, 6605, 4343, -2329, -6243, -3988, 1804, 7101, 4029, -2425, -5803, -4943, 2041, 6448, 3573, -1742, -6598, -4555, 2254, 5430, 4362, -1718, -6647, -4049, 1872, 6042, 4138, -2090, -5794, -4653, 2219, 6400, 3613, -1324, -5525, -4718, 2319, 5777, 3945, -1367, -6264, -3852, 1644, 5430, 4581, -1674, -5654, -3761, 1003, 5718, 3831, -1289, -5264, -4466, 1911, 5400, 3594, -589, -5840, -4217, 1872, 4990, 4400, -1271, -5799, -3591, 971, 5386, 4508, -1843, -5111, -4246, 1273, 5530, 3793, -769, -5365, -4174, 1680, 4592, 3756, -656, -5481, -3703, 1180, 4669, 4171, -1320, -4618, -3430, 624, 5015, 3707, -1124, -4003, -4060, 992, 4669, 3841, -328, -4743, -3870, 943, 4115, 4442, -716]
986g16m162J372L873M223l58n145l069k48M850M521j728m125l669L66M962L359
1002D306l58m487m055J350L786L648j76m811l500Q84L530M300j127l947k793n46
1018c996M876L484j389l216l517L9M004L393J00m250l316K63L432M132m13m021
1034c95l049l22L939L852p93l303l460o24M689L065k34l135m217O05L445L846
1050C909m37l847k925m81M014L659q05l067l212o10M071L092k20l048l602K79
1066c230L285K861N85l384l441N8L157L234Q8l318k977n29L597L612p64k748l310
1083c224j57L415K959K60l114l267o4L145K924K33l130l037k32L152L071r2k274
1100E68l768k51L255L125K82k733l407j84K984K890M89k899l363j31K917K825
$$ y = [-716, -4878, -3506, 367, 4590, 4232, -913, -3982, -4230, 620, 5141, 3413, -712, -4381, -4015, 947, 4306, 3948, -539, -4594, -3244, 542, 4190, 4014, -797, -4297, -3413, 117, 4417, 3290, -657, -3450, -3996, 880, 4364, 2975, -241, -3758, -3719, 285, 3678, 3778, -472, -3788, -3525, -93, 4039, 3626, -395, -3444, -3766, 173, 4025, 3232, -71, -3531, -4155, 534, 3599, 3365, 230, -3987, -3382, 63, 3909, 3472, -375, -3300, -3781, 233, 3892, 3087, 20, -3192, -3802, 269, 3361, 3141, 93, -3509, -3230, 55, 2916, 3501, 117, -3324, -3266, -109, 3125, 3213, -105, -3082, -3611, -14, 3598, 2834, 86, -3224, -3381, 34, 2993, 3253, 139, -3128, -3192, -47, 2877, 3110, -20, -3057, -3289, -137, 2934, 2842, 568, -3200, -3451, -196, 2929, 3211, 478, -2929, -3113, -129, 2761, 3250, 351, -3012, -3143, -226, 2599]
1116B599L98k721l027n18K932K866M50k563l372j14K954K590M07k367l183k44
1132b913K419K795J078k772l314j5K476K796L88k686k854k52K251L164M25k128
1148H58l399k53K421K701Q86k627l149m6K100K813N21k226k902n35K442K779N65
1165B949k320k804n09K313K599O70k397k912l72K275K430R20k247k666o92J883
1181h80K853R50k374k443q73K061K616N42j709k734o05J983K611O84k087k495
1197a900o56J808K947M53k090k199r61J934K473R09k002k655n80J884K405R96
1213B766k037k455q65J655K912P83k169k145j076J861K547P54j927k216j162K202
1229e72K432M32j390k608n92J505K615L37j350k583p89J730K571N57j454k593
$$ y = [2599, 2997, 276, -2751, -3269, -337, 2529, 2979, 416, -2956, -3070, -116, 2474, 2881, 514, -2669, -2913, -494, 2301, 3379, 607, -2707, -2722, -246, 2550, 2938, 252, -2602, -2854, -603, 2561, 2986, 858, -2541, -2794, -373, 2328, 3214, 587, -2562, -2608, -508, 2305, 2826, 600, -2302, -2837, -395, 2384, 2949, 629, -2175, -2684, -371, 2228, 2898, 501, -2411, -2783, -508, 1922, 2842, 595, -2071, -2763, -880, 1973, 2923, 549, -1894, -2767, -706, 1910, 2452, 743, -1991, -2596, -613, 1998, 2682, 595, -1900, -2556, -748, 2199, 2652, 562, -1637, -2598, -664, 1809, 2718, 716, -1939, -2519, -635, 1770, 2766, 729, -1726, -2591, -936, 1976, 2759, 590, -1555, -2631, -770, 1777, 2531, 604, -1612, -2774, -572, 1860, 2292, 902, -1706, -2298, -793, 1822, 2159, 809, -1774, -2563, -833, 1738, 2295, 841, -1752]
1245a752r43J893K404P76j372k681o55J685K213R55j566k460n52J334K201O57
1261B137r13k688q08J351K494O65j164k468j120J953K062O04j162k574n43J322
1277h52K113J149j745k009q83J211K431P26j241j942j147J421J799J204j029k602
1293a396p44J476J753J167j234k292n97J110J890J092j588j772q50J475J833K09
1309A532l92k203q29J229J831R00j025k555l43R51J877J082j361j672o80P54J801
1326H97J193j041j863j279J424J899L64m27k490n15Q03J843J257j187j924o78
1342a724M45K450Q82j305j489j045O92K341N56p53j928j033J571J144P51m64k136
1359a045o75P96J969N96r39j401j154R50J691O98p36j549j269J070J983M55m19
$$ y = [-1752, -2695, -802, 1602, 2378, 1006, -1675, -2330, -645, 1568, 2523, 957, -1503, -2055, -721, 1480, 2137, 1224, -1464, -2272, -921, 1573, 2238, 1074, -1394, -2514, -561, 1501, 2105, 943, -1631, -2174, -852, 1261, 2410, 665, -1344, -2227, -1016, 1415, 2141, 900, -1042, -2189, -768, 1031, 2235, 1206, -1396, -2140, -664, 1089, 2256, 1022, -1270, -1867, -757, 1133, 2225, 637, -1135, -1985, -510, 1323, 1532, 1140, -1063, -1892, -663, 1168, 2068, 1043, -1512, -1855, -904, 973, 2055, 694, -978, -1658, -904, 897, 2090, 1049, -814, -2093, -669, 1230, 1594, 1167, -1323, -1838, -1035, 808, 2065, 878, -1046, -1724, -1279, 1171, 2053, 748, -741, -1786, -1094, 1247, 1803, 1050, -878, -1911, -340, 804, 1555, 1091, -1045, -1720, -924, 1045, 1641, 702, -699, -1853, -903, 788, 1486, 750, -799, -2068, -998, 985, 1440, 1021]
1376A021j899j063R80J540J045r00j518p20M16K096O92q77j444j165O94J946O53
1393A497l72j973r99J242J258R34o95j645p01M32J737Q09r05j268q65M86J680
1410F52R81p77j387r68O62J310Q10j53j832o81O62J034J219o28j687q25O17J607
1428F16O88o34j071r50M71J373P58l2j733r49Q03J200Q15m82j263p33K15J300
1446C92J046p31j248o16L51J407N02k37j315o59K77J086J033n82j535m19M19R19
1464I0J388q11j247o19N16J060P84k39j252j036N86J082Q48j16j540q44P06J099
1482D55P54j63j300r64N27J236P51n56q75j033M78R75Q34k45j270o95J19J223
1500B51P15j2j423o27L49J091R63n39j149q78M65R81J095o93r81o70R2J352Q48
$$ y = [1021, -878, -1941, -961, 579, 1624, 724, -794, -1514, -1098, 998, 1690, 813, -631, -1796, -1102, 844, 1497, 1125, -848, -1847, -605, 653, 1587, 892, -753, -1454, -1022, 715, 1524, 619, -649, -1514, -1028, 652, 1633, 856, -531, -1499, -837, 473, 1283, 1130, -702, -1383, -721, 313, 1532, 904, -783, -1608, -991, 616, 1304, 670, -401, -1351, -880, 493, 1251, 1219, -514, -1463, -660, 540, 1355, 873, -390, -1123, -908, 392, 1438, 707, -541, -1157, -806, 601, 1103, 866, -449, -1108, -831, 255, 1288, 706, -829, -1248, -829, 90, 1478, 667, -580, -1199, -683, 377, 1161, 922, -330, -1366, -780, 302, 1150, 1034, -506, -1350, -644, 455, 1209, 1046, -254, -1218, -691, 545, 1296, 740, -135, -1168, -690, 285, 1119, 874, -396, -1091, -972, 251, 966, 954, -469, -1096, -747, 344, 1307, 768, -381, -1259, -794, 187, 1282, 589, -392, -1062, -970, 382, 1230]
1519A230m86r76q78N61O72J016l36r61p35M4J294O83n52r34o70K44J231N59k33
1538G73j047o00K49O26Q49j62j145n23K5R65J160m60p49j066L2J209R34k02q85
1557a7q78K9J318M18m5j065p27J30R66R41l06j264m20L38Q79O78l50p26o65J80
1577e86P79N87k76l96q34J48P28O14p0r75m25Q8J037M17P0r90r87K92J344L21
1597H86l2j051p83J97R97O03k71q07o05M89M99P95n1j065o61K58J089M21j02r72
1617a66q52K90P46R18k92p86n20K51O32O60o4o31q87K65M89O06K8o14o70Q0O00
1638H3O71r8q94n27k0J074N32l49p50l37P3P23O09l15n22m76k75Q18L87rn23m93
1660f18j24Q78N81j07o60o56J00M32J223n40m25o54j57P78N64J14q11p26K33M54
$$ y = [1230, 744, -232, -1110, -549, 123, 1139, 803, -158, -893, -849, 445, 1128, 576, -358, -1028, -784, 447, 1006, 773, -274, -874, -625, 1, 850, 688, -457, -980, -955, 10, 1170, 710, -39, -1105, -1073, 136, 1070, 868, -17, -895, -866, 452, 870, 825, -240, -967, -837, 129, 1070, 764, -500, -920, -582, 297, 975, 625, -101, -766, -586, 193, 780, 504, 108, -726, -578, 150, 764, 694, -281, -706, -618, 419, 836, 906, -84, -1071, -779, 565, 886, 854, -197, -980, -783, 214, 817, 546, -261, -866, -377, 122, 917, 866, -199, -860, -602, 487, 908, 806, -166, -1018, -728, 18, 936, 644, -142, -662, -411, 221, 881, 817, 186, -701, -436, 53, 659, 687, 73, -597, -517, 83, 754, 656, -238, -765, -785, 289, 821, 472, -278, -615, -542, 181, 790, 475, -47, -523, -798, 20, 407, 398, -125, -618, -742, 136, 717, 610, -50, -706, -606, -174, 1049, 509, 84, -570, -727, 51, 615, 729, -82, -808, -575, -121]
1680a21P40J05r42l41q7Q19M83n9o32n09j33O21P12J45r63n51RP74M25mo15m95
1702f19J2L98N03L36p50m72J65O18N08j21n74n51k97Q70O02j59l76p82N5P10M54
1723E30J54o87l81j82N54M97L9l99m62j31K89O83n4l51o70j11O43O05nn22o74
1744f35K33N75L28M6n26m54k91O33N20n4k64p98K30M97L98J25n24l43j24O70L37
1765E79r8n11m94J59L11M22N64q30k96k70N62M70l28k62m93r5N98L79J93n95m45
1786d80o8N63N75O0p11l38Q5L2P77l8n17k41k67M73O06j00l04n61j61N01N01K2
1808D09n18l32j82M88O51R4o14m73J42K08N52k48m2k54l90O67J97L78r81l32K75
1829c05K21M73K94n91l84j23O43K71R5k66p25r1L74M60K19k82q36K2M53M44j32
$$ y = [-121, 619, 724, -218, -559, -646, 173, 656, 597, -35, -544, -677, -56, 656, 801, -162, -713, -704, 70, 495, 491, -124, -619, -607, -209, 294, 630, -120, -592, -427, 191, 699, 578, 4, -547, -844, 26, 628, 469, 93, -689, -634, 76, 530, 684, -3, -384, -566, -12, 485, 524, 125, -337, -468, -179, 504, 450, 99, -571, -682, -39, 566, 561, 39, -635, -402, 173, 501, 547, 21, -433, -724, -91, 429, 375, 111, -687, -457, 40, 438, 563, 39, -304, -428, 242, 579, 481, -30, -524, -365, -54, 368, 932, 102, -194, -464, 98, 568, 240, -22, -515, -610, -12, 367, 560, -35, -480, -548, 15, 590, 650, -61, -399, -314, -282, 495, 457, -60, -301, -568, -95, 511, 411, 107, -454, -615, -114, 387, 409, -109, -441, -623, -135, 516, 610, -4, -477, -335, -127, 425, 177, 135, -119, -509, 158, 355, 733, -248, -580, -305, -84, 389, 683, 92, -292, -415, 228, 499, 594, 328, -397, -488, -114, 346, 565, 283, -553, -531, -78, 366, 234]
1850B34J31o68o5J78P43j6l80o44LN08K04P4l66j83l70M76J41M09k55o38Q6L98
1872@N17Q4o13l21k1J86O32j99K7m61n09O68O29m50j27m40p6N61K67j25k53l94
1894d18OL43M20j15j07m33j28N03K00L2k59n00pJ58O18l2k14o48o0O15n6M82k90
1917A10m86O5L46K31J45l00j78l22N13K13j12n1l23l43K43M68j24P4l00O7K0L47
1939C03l73Q5m33J52J77K23L9l59n7k1K40J72Oj32m25O4K19M88Q3o52Q3j11K57
1962B8N7K99n45j52p0K36M92p3k54m41K10N5K8L36nn67J02k2N30Q9j25m04j84
1985c80M68M78m22k7m23KL76O5L66l56j58l86L27M18k60J40l09k94M8N91j96L6
2007A04l07k23K36M13L4k45k78J32k1K16Q5j35j33o5J91J64K55l06l8m27K09K77
$$ y = [234, 365, -303, -368, -190, 553, 537, 157, -487, -484, 24, 228, 302, -64, -247, -617, -141, 0, 409, 154, -484, -398, 0, 517, 601, -12, -333, -354, -168, 464, 265, 292, -169, -678, -10, 619, 169, 42, -398, -474, 87, 354, 229, -24, -418, -412, -69, 351, 236, 129, -304, -432, 71, 271, 303, 44, -456, -463, -305, 313, 281, 67, -581, -641, -26, -82, 400, 110, -376, -311, 35, 266, 411, 111, -67, -389, 124, 337, 225, 174, -149, -492, -249, 219, 95, 169, -131, -64, -44, 303, -70, 15, -418, -266, -89, 134, 173, -186, -243, -264, -24, 148, 154, 22, -403, -339, -120, 368, 451, -201, -118, -229, 28, 85, 384, -161, -313, -383, -147, 345, 272, 18, -423, -213, -158, -130, 206, 201, -366, -264, -286, 244, 333, 208, -196, -380, 88, 566, 144, 117, -306, -304, 72, 137, 503, 147, -11, -397, -70, 348, 88, 228, -81, -375, -327, 264, 68, 104, -203, -426, -190, 223, 257, 12, -266, -134, -155, 61, 146, 11, -122, -187, 4, 168, 423, 117, 79, -348, -139, 138]
2029A38K70n55j94n3L01K14J97j23j46m40K84J80K91m12N0k17M31Mj95op9j05
2051a65l1M80k3k0n92L4N08k58N89l98l20K01J02j21L19k28l59L87j72J29L5O5
2073A62k62k62M09Q7j7Oj16l9k31J27L94j25k23J8ML69Q1k37l17l44K89K04L13
2096B90k43j03o8o4L71K08k90k36j5j18K58J23L8l57q0o0N36r8L9l13r3M7M05
2119A77L16m57J31l40J31L06J55m63p5k26K45l7K86M3j76j21n4K23rj30j4j03
2141a92J53Q8J03J61l09m63L59J93N2L0m52L2K55J24M3Q5k46p7j03K74J47p3m70
2164b86L03j06k9N9J10ll87K22M57k57k77j16L00k03M61o7J72n57j54J17L74R7
2186B30j86L0l88J23K16j7N2j55j18J29L62j62l2l50l4L07m4M73n05ok99L02J6
$$ y = [138, 408, -147, -341, -394, -93, 121, 318, 195, 49, -391, -107, 73, 364, -48, 2, -215, 216, 220, 25, 19, -60, -165, -196, 284, 261, 241, -351, -317, 191, -67, 522, 124, -196, 5, 107, -14, 305, 77, -282, 105, -67, 62, 97, 162, -100, -362, 47, 134, 117, 123, 7, -32, -263, -136, 258, 133, -90, -72, -68, 301, 382, 145, -172, -516, -227, -23, 290, 47, -56, -124, -188, 183, 391, 101, -135, -150, -268, -10, 113, 151, -206, -286, -346, 190, 92, 131, -182, -275, -228, 177, 493, 36, 167, -173, -42, 264, 419, -44, -119, -345, -100, -137, 149, 192, 16, -105, -159, 64, 55, -75, -89, -192, -39, 49, 152, 313, 4, -459, -100, 93, 145, 175, -277, -245, 10, 134, 177, 262, 16, -61, -164, 110, 257, 184, -286, 17, -89, -118, -59, 51, 48, -339, -117, 340, 83, -194, -310, -10, -213, 248, 181, 353, -204, -358, -241, 133, 230, 44, 74, -314, -191, 25, 8, 60, -95, -213, -84, 278, 116, 84, -266, -300, 7, -37, 436, -69, -75, -374, -72, -56]
2209e6K78j09j83N2p0J80j41J07j70j02K00j19K39l0k5j25j31J26L41k93k77j01
2231d09L83k3J18K21o0m44J31Q3K64k08j86J30k43M66q7ll02L0M4J68J50k94j01
2254a72K34r4J92M9l3k53j47K68J05l7J72o04P4K75R7L9j3k63r9J87L23k5j88
2277H7j56k62L71Q1j9L5j60N9l7J17J06l20J1J67l11R1K50J5k49N8p0J37J8Q6
2301A05k73p6K51J30j53J23j45o7o2K2J60J27l02J01O0k6P9j3j66j41MM76M3k16
2325D1K0k31N9K90l5p8k5j72J4K45J15j53j30n4R6n1L41j78k36mM5O4J32j29k12
2350b26K23j72P2L05k01l1mj24L44J74k51l96K08qK02K15k13k68j71J61mO49l12
2373A72k44m8J13JO9K9k15j98J98M2J66qj80j33j44L73O5J04k84K53k37P0n9J53
$$ y = [-56, 222, 113, -70, -18, -88, 92, -49, 58, -112, -214, -14, -133, 106, 76, 51, -74, -205, -79, 262, -31, -308, -409, -26, -49, 69, 290, 230, -214, -83, 0, 264, 56, -130, 0, -243, 223, 136, 133, -169, -139, -95, 73, 223, -71, -172, 62, -32, 160, 209, 176, -77, -224, 44, 149, 112, 284, -320, -246, 29, 126, 165, 152, -111, -210, -23, 300, 275, 87, -69, -331, 40, 121, 102, 137, -23, 36, -1, 116, 222, -98, -87, 80, -231, -140, 110, 125, -124, -66, -136, 1, 19, 105, -168, -244, 7, 137, -16, 107, -38, -105, -167, -145, 15, 142, -160, -59, 1, -25, 54, 41, -125, -266, -262, 214, 257, 41, 61, -170, -111, 179, 144, 66, 41, -131, -117, 128, 243, 90, -40, -94, 2, -49, 292, 114, -122, -126, -81, -17, 115, -14, -226, -3, -175, -103, 202, 1, -30, -34, -158, 186, 360, 109, -287, -79, -87, 115, 330, 117, -151, -322, -161, -165, 484, 172, -72, -120, -7, -6, 63, 92, -123, -321, -123, -81, 85, 77, -103, -236, -380, -7, 58, 162, -122, 131, -106, -36, -95, 58]
2397E8j26j11L54lp0J34m47K54k25L57j97J02k40kP7L19l8k97J09j13L4J11j36
2420i6J36j09J33k62R2K56j73J69k61M5J77j27Q0r7k00J76m1J52p7l1j77M24L7
2443B26j0o4k94K27k75L90k81K06l66K47K8J02j30J50k43pJ38J16n7j44J60k61
2465a42J20J98j45kl4l6j22M26j35k20J52l79J83J33K08k94p4K49K3m0K02l62
2487i1r0K49k99M5L90j50J2k81K80m6k4R4q3R0l07J65J43N6m09K84r0R4O6k49
2511a51L17m96l4P11j99p4Nl34J03J71J01pk6p4q7Q8J5O1Q1k45j87L18L94m02
2535D9j27J7j97n2K85R1k8j68K31q3K53j00j35j68L1N9K5L0j41K5j29L69r9M0
2559G8j15l1n5J25L30j43j27k73K77Q8q6J27l68K02j78L60N5k64j52M0k5J78j6
$$ y = [58, -68, -179, 175, 172, 102, 236, -211, 43, -182, 175, -22, 80, -160, -162, -85, 234, 196, -101, 8, -105, -71, 40, -96, 40, -69, 64, -198, -106, 150, -23, 146, -115, -70, 107, -20, 60, -37, -237, -61, -102, 50, -27, -58, -235, 189, 226, 216, 152, -142, 85, -190, 200, -81, 125, -241, 6, 34, 136, 6, 156, -87, -94, 44, 160, 103, -41, 119, -142, -22, 176, 31, 29, -5, -41, -163, 263, 128, -92, 60, -319, -136, -3, 205, -89, -163, 86, 109, 69, 271, -91, -181, 68, -231, -186, 204, 54, 66, -215, 65, 19, -5, 89, 6, 96, -211, -46, 97, 153, -256, 28, -62, 32, 98, -151, 166, -330, -364, 347, 148, 74, 79, -255, -152, 19, 120, 113, 87, 13, -74, 14, 29, 90, 171, -74, -261, 57, 451, 49, -78, -61, -258, -310, -25, 66, 38, -130, 101, 18, 271, 171, 36, -132, -101, -42, -17, 13, -128, -103, -232, 137, 38, 78, -37, -68, -123, 2, 332, 189, 62, -211, 66, 154, 68, 195, -173, 29, -149, 211, 266, 2, -150, -110, -135, 43, 27]
2582B7K4J10j03k82M05k28L27k10j75K56k06J27J49j92k40J97K66j41k2r2M6l04
2604b61J53K83q5j90R4O7J27j69q5r4j7M47n76N20j49j27K93j29j29l5N9j80k4
2627b07J28K33k46P2p9K28j5q0J55j38j50L5j02K07q8K08l94j33K21K51M5j88
2649c7L4l18K38j29M38k17J40j25J0J39n9J78o51L45l6P7J31O4j91j01k85L87
2671C2rJ36j56j05L4L44j05L5l57J56j66J15R9n4p5j88J39L77k62Q8j5J13o8j61
2695e3l8J42j20j72L9k1j6L37j2k37Q5R4J37j63P2j22L63n1k74K08j38k24k2R5
2719i1l1J58K78j57j98J71Lj58K7Q8k03K55j40m4M2j51Q0L2q8J71j47J5r2l8J11
2744a07Q0K87m66K36j03j26L1K85k46K56m7J2Q6l29N2q8Q7J30K5m6j87Q4m5N84
$$ y = [27, 51, 161, 58, -224, 181, -47, 280, 70, -105, 151, -55, 72, 221, 29, -211, -14, 252, 111, 89, -3, 43, -261, -108, 175, 90, -100, -6, 61, 188, 19, -66, -160, -177, 270, -306, 214, 65, -62, 231, 102, -27, -62, -3, -183, -207, -79, 154, -92, -20, -99, 129, 114, 34, 189, 51, -99, -64, -166, 41, -47, 161, -233, -366, -145, 106, 151, -37, -3, -321, -83, -212, 226, 9, 149, 24, 34, 173, 114, 292, -359, -14, -50, 27, 158, 222, 31, -70, -355, 32, 23, 159, 3, -102, -68, 276, 171, 206, -151, 5, -161, -46, 53, -1, -76, -264, -125, 252, -10, 78, 63, 176, 108, -53, -91, 51, -69, -241, -202, -223, -239, 98, 86, -151, -66, 28, 165, 2, 74, -48, 315, 264, -10, 198, 60, -164, -186, -91, -122, 36, 314, 157, -41, 130, 133, -25, 2, 90, -113, 142, 2, -42, 0, -151, -71, -39, -127, 44, -103, -88, -180, -218, -107, -27, 260, -206, 30, -73, -199, -168, 117, -129, 127, 80, 92, 178, -151, -99, -187, -100, 30, 55, 9, -178, -94, -139, 445]
2768D45k80j17k0n0j88K19R4j31j43N2J44n2J33j1k17k3K4J18l9o5j24N4J94K
2792A9k00L83j52r0r6J69K57m19RQ9K79r3q3k75M6J84k3K17k94Lj8J4j65J47l1
2817a23Q6l4KJ23JQ5o5l38J78j47L94M3j94j71K29k6l42L35J03k00m2J22j31K64
2841A52k85K35j93M2L60k80k4q4L4K11j41k29M4J9K9R5j8J94q6l3j25L3J82K41
2865C73j04k40k55L28j48K51m04M6J52k32K42j09K03Q6k47q1R9J96j74n3j69J2
2887b28L05omO0o0O6q7N5K61m60J42M3o5J37k5l3l52M79j76j23L27j05j97R9J10
2912A63j18nj94J72M4Rk70J73n5r5M00j50j20N36m90n3K86k54m9K69n1l25K56
2935G9M3P9L8l12m0L10K9k00k1J2L5Ol4N9q5N4j72J26K97j26j46J51n29L97k84
$$ y = [445, 165, 48, 28, -22, -210, 9, 103, -28, -171, -119, 25, -27, 106, 95, -122, -145, -121, -3, -42, -107, -231, -177, 17, 19, -181, 202, 50, -40, -136, 33, 290, -129, -120, -31, 248, 155, 72, -203, -157, 27, 4, 221, -73, -70, -88, -74, -239, -92, -123, -37, -71, -69, 54, 55, 140, 75, -263, -85, -232, 162, 205, 11, -160, 69, 43, -299, 36, 139, -61, -103, 19, -112, 152, -133, 102, -91, -49, 311, 31, 7, -77, -43, 168, 27, -202, -158, -139, -110, -15, -33, 161, 75, 42, -83, -50, 132, 373, 269, 29, -226, 102, -46, 205, -199, -153, -1, -233, 9, -100, 103, 189, -58, -139, -40, 156, -18, -71, -240, -228, 77, 71, 67, 127, 67, 133, 46, 101, 362, -98, 44, 87, 22, 159, 134, 101, -251, 228, 52, -71, 256, 151, -46, 53, 163, 45, 40, -154, 18, 62, 71, -199, -26, -81, -176, 224, 74, -46, 490, 0, -53, 233, -21, -70, 199, 148, -177, 79, 122, 201, 239, -73, -113, 197, 226, 26, 5, 17, 52, 58, 24, 83, -2, 52, -120, 6, 303, 177, 31, 182, -347, 50, -234]
2960b34L66r4o5j13J84J64l20J69p7j7k9j5K60j01l57J84K3j36K28j92n4Q1Q1
2983f4K12m4R4j23j6j90K71j60o6Q9MN8j51J85L9j50j97J66J99q8m8P7n4Oq2J55
3009A22n4k16N8K04N3oj76j07K0k82O74l89J41K2m08L28q3O2R3j24P5J16k96K73
3033A00l8ml18N7J20O6lJ43k87K04R0j20J8KJ82l38Q4Q9j9n1P0j08q2Q0J41o3
3059A5j74%J45P4J18k40J50j21K23L2j61j26l27L56L2K14J52m26J0K0m7K15j39
3082eN8j04q6N4J64Q7m00r2J93J19P3Q7n4P7k43L6K54j12Oj12k04L30j2k71O8
3107h9p7J30Q1l10L21n6k26M3P6J93Nk17J17j66K43J37O9l59L6O9J49J60m11R5
3131A3K6J0l79N60j94J21L0k88pK62k17J10K1j82L4p4J09Pn5LJ93j77K51L6l72
$$ y = [-234, 132, 38, -27, -140, 44, 208, -112, 57, -20, -37, -66, -81, 179, 78, -279, -95, -72, -208, 20, -172, -226, -145, -64, 148, 104, 198, 75, 59, -131, 140, -20, -86, 3, 7, 65, -86, 99, 138, -12, -209, -43, 156, 68, 20, 97, 43, 49, -33, 122, 68, -148, -90, 114, 167, 161, -15, -122, -102, -384, 290, -99, 42, 64, -344, -16, -99, -37, 56, -68, 7, 123, -173, 100, 62, 58, -260, -203, -83, -17, -20, 123, -164, 40, 130, 10, 28, 30, 212, -126, -42, 47, 28, -23, 47, -61, -143, -63, 78, 15, -159, -159, -14, 60, 178, -62, 88, -33, 190, 222, 61, -65, -392, -36, -4, 210, 362, -64, -54, -34, -81, 134, -5, 53, -51, -137, -83, 81, 168, -232, -324, -131, -12, 61, 148, 94, 171, -72, -36, 218, 106, 112, 0, -204, 126, 114, -157, -89, -166, -36, 45, -265, 56, 0, -226, -183, -107, 86, 91, -126, -9, -175, 68, 205, 274, -85, -49, 20, 169, 329, -82, 13, 39, 49, -330, 230, 36, 157, 187, -101, -108, 154, -63, 47, 68, -114, -80, -154, -45, -38, -93, -90, 103, -74, 177, 213, -159]
3156a59N5R5M19m50J35L1j34N6q5J55J11k93k12K87L8j85J06P6n4j22j30L46p4
3179A2M7j28p3J75J3j59K56j65j86L81Q9l19J1M6J7M2k6K11l60J32L9n1k1J65
3203A48l8k00n1J62K81k08j22J07j85J83o0k4r8K3r9L5N1L44k97n9J86O3n7l23
3227b38K58l44L22K6J27j59P2m16L45k0J17N2k26m2n3J86r6K20k57p0K97j86J15
3250C0r5JJ17N1Jk20J26ml14K34k79K74J52J1j73k6L9J17j00j96QJ44R4J81K3
3275A96j96l48N44k00J34j10p9K98m59J18J32j18k6j8K87k86J33p3J26j23oJ54
3297H0k84J46m6J82j91J72r2J23lk53K2M3K88m8j01j18k2j64N5L1J73j24qJ97
3321E8q6P0j76P1m5j2L6N3l17K61m1J78L1J90o4l00K62l05L18k36K92l37%pR6
$$ y = [-159, -104, -9, 410, -40, 95, 126, -8, 48, -37, 118, 229, -64, -276, 11, 49, -136, -30, 46, -8, -130, -260, 86, 12, 59, -69, -142, 33, 46, -113, 143, -22, -208, 173, 262, -57, -46, 0, 17, 59, 33, 244, -116, 16, 55, 4, -17, 148, 110, -90, -141, 21, 302, 94, -28, 79, -106, 77, 17, -7, -105, -82, -181, -146, -95, 249, -48, -107, 79, 142, 85, -238, 20, -324, -2, 24, 151, -8, 64, -352, -7, -27, 90, 142, -84, -126, -179, 7, -89, 131, -126, -196, 101, -85, 30, -65, -64, 53, 104, 105, -115, 11, 7, -307, -73, -352, -78, 74, 85, -88, -114, -75, 42, -58, -254, -246, -102, -8, 173, 196, 0, -348, 196, -4, 130, 20, -59, 239, -220, -102, 30, -88, -114, -132, 155, -131, 2, -71, 55, -68, -74, 80, -204, -58, -104, 78, -113, 59, -33, 90, 87, -166, -144, -101, 187, 139, 38, -80, -102, -266, -211, -180, -7, -131, -139, 58, -28, 42, -134, -63, -108, -120, -84, -31, -348, -87, -128, 50, 81, 271, 207, -93, 169, -136, 182, -54, 238, -99, -99, -106, -10]
3346a0k8j5j26J81Q7lJ2l32J1L45j93J36m3j50j34M7K92o9p8k76M63P7k91R9J22
3371A24j77k04K18k1j23L20k47j19J95J24O7q8M4m05L80j63K50n3k3j23l48K53
3393a19K4O8N4Q4j82K84k59k14K29q1L1K40k0k78J43J89j43j1R6Rj32j35J81O6
3417A24m3Rl4j60O8m8J11P2J3j5j23L7K17l17K5L0n1L9q9N2J75k02O3J7J27n7
3443D0j93K89j02k32%L52j93j27N2K99j13K5J45l32J49j01q1N1J34j61L5L81m42
3466a25J28K2j52O1J29k8p5K01l48L61l2j56L19k71m4r0l2K58N5l36l2L07l22
3489b02L37j00rL3n0m8K68k08q8K26o8K18m17J67j5j5j70P9k0j24L25J09m05K91
3513A14O2k35k8l6L64j46k0j15j1j86K62l8j9O2J50k12j88L36J27J7n69M44j66
$$ y = [-10, -38, -53, -179, 2, 89, 86, 98, -234, -223, 122, -71, 65, 22, -128, -262, -215, 77, 8, -70, -346, 117, 194, -97, 2, 124, -53, -257, -39, -60, -183, 137, -110, -229, -34, 90, 157, 69, 113, -292, 88, -75, 175, 122, 99, -24, -372, -119, -95, -27, 27, 111, -71, 213, -46, -260, -31, -112, -81, 159, 139, -139, 4, 193, 50, 39, 135, 144, 12, -123, 58, 124, 81, 90, 56, -104, -36, -84, 27, 99, 112, 97, -26, 11, 228, -89, -64, -34, -85, -46, -135, -83, 92, -110, -47, -30, 97, 40, -153, 136, 34, -198, -198, 154, -39, -166, -114, 185, 72, 97, 242, -90, 59, -42, -123, -72, 62, -99, -64, 317, -125, 3, 25, -127, -66, 63, 35, -40, 161, -187, 174, 142, -14, 305, 34, -10, -100, -132, 126, 181, -155, -187, 120, -202, 135, 35, 26, 59, 9, -39, 229, 21, -67, 159, 91, 309, -108, 59, 44, 29, -141, -62, -82, -206, 119, 228, -177, 114, 176, -59, -87, -123, 241, 95, 75, -40, -51, -237, 25, -13, -32, 30, 180, -32, -220, 116, 243, 260, -309, 135, -31]
3536c1l4K73m0r7j30k41K01JK20j45o8K31j62j50L04k40K74k60Q7R0q6m4K00j88
3560c5j75k3L12j0j46J83l91J71K43k73R4K9N5q3L41j99Q1l10J89N2j09N7j91
3583a38K10q4N7j27J06l3J09k7j55L07n4j70n8J09O7j64M5p7J44p2j4J74k13j26
3607a84K06j06m2KL13j10M9l03K80O8j69Q3j76p2K83n4k3k57J65k6J83r8j64L14
3631A62k44l29M91k08J10J29r0l31K47J22K53j22l88J73N6j07L33O2k91L9n5k9
3653a7J32j49K61j53k09L18j65k20J26K57OJ14n8k16R0R4j47m2K35n38J70J53
3675D2L3r9q3o1N9m5M0K4J50Pk26L72l2k17p9j78J1N5L3L18j23K7L1J96l21P5
3701IJ99j55j82J79k03J97J17r8R9l70K05J60J1k14O1j27k3J72l2kj49L47k56
$$ y = [-31, -65, 208, 168, 71, -59, -300, -99, -98, 122, -23, -91, 140, -22, -172, 132, -108, 166, -94, -7, 83, -3, -47, 153, -35, -210, -233, 79, 69, -77, 106, -285, -114, 129, -144, -50, -21, 34, -49, 292, 93, 174, -136, 53, 105, -4, 53, -138, 72, -12, 45, -82, 24, -9, 100, 73, -82, 225, 171, 1, -57, 52, 119, -45, 0, -77, 67, -5, -19, 155, -58, -184, 22, -84, -126, -124, 189, 79, 128, -175, 105, 173, 4, 87, -89, -161, 122, 68, 45, -212, -47, -73, 110, 12, -152, 162, -82, -411, 80, -128, -18, 111, 21, -310, -63, 59, 312, 190, -198, -25, 31, -76, 257, 319, 28, 67, 12, -17, 115, -34, 227, 74, -135, 183, 18, -202, -76, 181, 187, 301, 243, 27, 117, 211, 64, 22, 257, -281, -111, 42, 75, -24, -107, -168, -109, -154, -114, -90, 60, 67, -159, 213, 181, -36, -115, -293, -282, -227, -194, 124, 1, 28, 59, 255, -66, 9, 208, 53, -129, 50, -153, 44, 161, 63, 162, -208, -3, 157, 168, -46, 15, -112, -135, 37, 5, 3, -146, 201, -55]
3724e5n5J25p5j26K00N0M4L6k53J09J61J50j91l9m8K4k57N13l76j06K75k97j21
3747c12K17K49k03o5l5n7R3K60k09R4j15K59o4K1N3m07K22j84M04l70K02J50j11
3770I2J28k91O7M0J13r1K4l08j56M95j34k08M18M5M0n25P1J00o6L50k18j63K17
3793D0kk2k8J14q6k66M65j42m12J66J69J7M0j69J32K83l59Q9j25N0j49J55q3J08
3817a5m0J7L6j65K85k55J20k4l19M53nj70J39q8Q4p7j42p3k8K16N8J00n6j0j81
3842a40JJ68pK08n7k78J22j53J69%j51k0R5M27m11o3K07J37l16N3R8l86K38J52
3866I3k35J08p3K44l91K39p3J28L9R7j37j52P9K29k20J46r1q0r9J55q9j24L02
3889I5j35J0R5k21K66O6j26r7j18J83l7o7q9J58L32j57k02P7j69L56m7k90J19
$$ y = [-55, -110, 15, -60, -186, 14, 64, 108, 144, -109, 0, 161, 311, 120, 81, 33, 57, -200, 313, -63, -169, 106, -191, -312, -95, 154, -49, -114, -149, -206, -113, 147, -62, 32, -83, 176, 112, 133, 186, -221, 1, -183, 221, -149, 53, 203, 92, 220, -71, -4, 36, 149, 58, 82, -226, -382, 113, -21, -229, 189, 234, 274, -251, -180, -80, -146, 204, -14, -177, 40, 38, 16, -12, 102, 16, -250, 215, 73, -339, -173, -4, 13, 53, -116, 16, 299, -60, 29, -96, -46, -195, -40, -123, -15, -55, -38, -2, -167, 118, -137, -17, -41, -360, 93, 88, -82, 57, -31, 53, -24, -166, -239, -267, -51, 7, 107, 51, 41, -140, -139, 29, 22, 230, 173, -105, 17, -136, 33, 33, -118, -138, -43, 384, -27, -90, 117, 254, -62, -9, 89, -297, -59, 93, -142, -34, -107, 137, -254, -15, -88, 40, 79, 176, 39, -113, -34, 195, -25, 121, 30, -50, -149, 6, -83, -207, 95, -40, -30, 65, -156, 110, 176, 50, -47, -165, 18, -19, -86, -175, -17, 315, 158, -44, 33, -136, 220, 173, -117, 2]
3912BQJ03k19l9L03R6r0k0l11J08J31J00k11j0r0L55l54j0M24l02K19k60J03N4
3936I0J94m39M6J70j04KJ20K3k04n2K12O2k6k0k04J34K20l40m9J36n6J3J65n2
3960D1j39R2k78R3J44J56j57J07R4l05j1P3J89R3k57o6M5K69l44J34k12R8J60
3983A9j53P9J66J74m96J49J49n5K1j00J94j5j31R8l00K17J02k8j84nK20k36J6
4006i9K1M5J02J1k03K70j63J09l6j43K1M3J07n3O4j79OK3Pn7j03j09M69q2q4Q7
4032G4k18m3m1L3J43j32J90j68J56m1jL36j49n2kl24J91L27j65o6L6QJ71k50Q9
4057A02J93l64J76L9r8o9L0ko6P1K13k8j63j02J11k57R6M02k78L71k65k81J18
4080e1J00k26K45P5j16Q8o7M3Q0Q9l92L42j1k81P3M2k23J74O5j15J39k20J61L09
$$ y = [2, 10, 113, -106, -145, 158, 254, 164, 144, -167, -59, 72, 172, -39, -49, -139, 216, -138, -148, 276, -26, 193, -67, 36, 90, 284, -155, -109, 61, -43, -41, 79, 102, -102, -154, 58, 120, 94, 74, -130, 4, 224, -116, -165, -29, -85, -72, 93, 41, -98, -6, -284, -191, -47, 109, -48, 59, 153, -152, -163, -90, 99, 192, -65, -131, -86, 183, -161, -27, -239, -141, 19, -134, -55, 111, 285, -211, -62, 87, 32, 53, -47, 147, 132, 1, 99, -201, 16, 118, 90, -94, -99, 121, -115, -99, -78, -33, 69, 80, -123, 147, -16, 93, 57, -86, -65, -22, 85, 32, 96, -83, -77, -54, -47, -104, -207, -316, 153, 71, -13, 74, -144, -187, -228, -195, -52, -184, 6, -162, -6, -47, -48, 288, 139, 87, 85, -239, -48, 279, 114, 48, 84, 92, 263, 13, 102, 295, -69, 107, 146, 48, -21, 9, 7, -59, 12, 225, 197, 34, -68, 43, -214, -118, 284, 6, 377, 112, -169, -51, 49, -177, 68, 143, 27, 115, 48, 91, 171, 260, -132, 210, 199, -82, -9, 33, -190, -16, 49, -66, 73, -147, 14, 323]
4104C23m6l14Q8k83L89J56k50o8r0mM4K54l02J56L42m27J27r5P4q6J23l06P5L11
4128A91pK07k90k40J36l74L07O1k3N6J69j74j70J34Pj30J02O6j74J03j11M5l6
4151a45J18J16k5j54J40j81j51L14j4O6j00K88k48j71L09j99j44J18K09Jm63M94
4173A78k71K79j6KM9l67J95n0J82j93j65k8P8Q6J81n9oj73q1J23J31j58J82k19
4197a20R4O5p8Q0j34k26K09K70p5q5J9j99K19k31J43J77o5l08J70K58k1j9j09
4220C4j17j15K32k56P2L27l10J72J98j05k9j24r1J95j68k38M43j76K51l55l71
4241e31P71k12l53L81R5k25Q8m9P3J46k06J01K17l20J89k29J12M8O1j34M3M9Q5
4264B00j87R1J05l28J01J53j92R1r9j64J30p8L07j84N1N7O5j88J24j04J9J4J45
$$ y = [323, 277, -37, 51, -232, 157, 313, 63, -5, -95, -99, -55, 199, -103, 53, 395, -32, 95, 0, 74, -12, 111, -195, -120, 191, 184, 391, 101, -139, -3, -377, -70, -9, -32, 24, 193, 19, -151, -17, -10, -140, -38, 28, -146, -43, -154, -109, -145, -27, 89, 64, -90, 50, -131, -282, 32, 18, 84, -16, 272, 24, -147, 162, -37, -181, -63, 146, 147, -316, 178, -93, 186, 170, 172, 221, -146, 49, -1, 181, -12, -177, -205, -127, -41, 140, 81, 75, -98, -179, -56, 75, -83, 99, -120, -26, 39, -39, 41, -93, -319, -110, 160, 85, 0, 19, -180, 39, -192, -49, 128, 63, -245, -75, 183, 162, 143, 34, -83, -198, 34, -222, -150, 177, -133, 39, 237, 132, 103, -21, -112, 83, -85, -323, 120, -56, 195, -160, -531, 240, 28, -325, 56, 151, -74, 14, -35, 38, 184, -22, 79, 296, -24, 165, -64, 48, 96, 157, 23, 66, 115, 200, 13, 104, 209, -119, -18, 135, -57, 34, -65, -229, -99, -177, 130, -54, -3, 54, 119, -69, 55, -49, -30, -16, 129]
4287A29k20L32k90J12J16m14L63k44J43K60l75j21K71J09q7j56o1J93m3j70J83
4308C0J6J90j82k28J50J85P9k57j80J35J56Oj3J02j64J14k03Qj44J24k20P0K26
4331@J44o1j83N7j11J61N0j67K59m6J09J14n4l9k94jj2J75l2q2M5j08K55k85K14
4356A08k48P5M1q5K00k82J68P6j45J78j56J21R8j99j74L25l97M48o7j32J10j2
4378E1N1l67M33j64k24K80k2J75K9l06Q6k01J98j62J62m2K18Q7m83J88R9l14Q5
4401a43K67j79j15J20M2j60P3L5Q8k8j66J15L2k7o2K5J82J48l10J16j76K7J23
4424B7Qj79Q7p7L15q5j11m8J37m7j78KK94j95J8r7K86k32L5j54M4J60J50n5n1
4449E4O9l88L89k62L65j59M9j78q3K86O3l55J29j54M74k04q3j19K16l92J95J48
$$ y = [129, -91, 241, -49, 63, 179, -235, 128, -116, 27, 287, -88, -209, 62, 171, 84, -72, -133, 60, 17, -153, 30, 46, 236, 54, -174, -24, 161, 240, -17, -197, -62, 94, 100, 87, 189, 25, 139, -64, -56, -200, -76, -296, -226, 0, 144, 83, -100, -43, -154, 7, 57, -110, 149, 103, 212, 326, 272, 233, -61, -62, -74, 101, 69, -13, 32, -76, 179, -106, 108, -140, -65, -24, -109, 91, -191, -23, 53, -92, 86, -70, 51, 149, -50, -224, 101, -296, 152, 85, -47, 63, 51, 102, -265, 168, 4, -220, 60, 38, 213, 242, -64, 22, -179, 19, -143, 19, -23, 195, 282, -201, -13, 86, -228, -143, 124, -55, -170, -50, -8, -168, -95, -60, 28, 0, -166, -51, -19, -46, -108, -83, 99, 247, -63, 53, -123, -96, 27, 35, -144, -57, -134, 181, 96, -15, -63, 74, 27, -151, -149, 145, -50, -32, -129, 157, -75, -40, -194, -150, 10, 160, 105, 54, 123, -265, 124, -138, 227, 68, 117, -61, -144, 142, 205, -150, -21, -175, 299, 95, 12, -107, 109, -283, -88, 60]
4471F0JQ0J14k92j97K30M2L8l36K21K13p7l00O2K19j53n9L8O3J02j47l0J61K93
4495C46l02j40P3j46m9K37r6K37m7k53K72p7j02J28P9p48O57k4o1L3j73N6rK37
4519A28j43n0n8K7P5J67l6j55k09L84k04Q3Mj68J13p4k7K00l21K12J40l72K35
4542d9l1J00N5k45K81j27Oj32n1R2K12k22J89L5oj65J62j95j33Q7L36l41M7J58
4566F3l4Q9J16l56N2N2J77oj74J25J8K5l97L93k3j84J52L7k9k83K58j52L8O8K04
4591B29k8l16K22k36K17r9j45J85p5j84L36k62J33K43j41j5q9l1J01j16O2r4R7
4614fp8%K84k26K2J72j16n1Q6k8k09N0J54m1K4R0j9j13j4j22Q2J07M2j46K43k70
4640h3N7J70l81J04p9P4M1k6L42k45J88k40j0R5J50p4r7K84l1q6k90j36M09l9
$$ y = [60, 61, 141, 255, -37, -234, -4, 38, 76, -260, -39, 174, 97, -203, -141, 78, -75, -134, -96, -33, 69, -78, -108, 53, 346, 44, -96, -23, -169, -218, 19, -77, 160, 113, -140, 132, 55, -47, 81, 160, -588, 69, 45, -16, 17, -156, -100, -109, 128, -15, -65, -123, -96, -21, 146, 110, -45, -254, 130, -74, 9, 13, -155, -42, -116, -143, 57, -264, -52, 88, -284, -49, -80, 20, 75, -170, 111, -16, -10, -142, -193, -101, 111, -111, 78, 113, 107, -58, 104, -91, -224, -137, 199, -142, -95, 63, 29, 118, 234, -122, -70, -18, 159, 153, -21, 104, 122, 147, -250, 143, 120, -64, 88, 125, 96, -187, 71, -81, -43, 25, 229, 201, -115, 107, -129, 88, -11, -156, 29, -46, -230, 106, -156, -23, 220, 79, 64, -25, -56, 45, -71, -9, -103, -6, -84, -84, 200, -26, -4, 168, 52, 1, 87, 59, -150, -100, 54, 13, 37, 127, 108, -5, -19, -141, -59, 48, 90, -56, 187, -83, -26, 144, -237, -133, -212, -138, -97, -123, 219, -26, 162, -78, -88, 7, 157, 83, -14, 270, 239, 153, -137, -273, 136, 97]
4664I7j96L5J97j72K27j79op2R2p4L49m34J68R0j77j06L15k8j31O1q9L04l30n7
4688a16o6L89l25M2j16J99j41L21j43j11k8N3M4j90J79j30L01l06K14%j30K61
4710B01m49J44J62n7L5k29J04J12j62M5j4nM8J71j42J05j31R9k44o4P6P5J57j9
4734A8q3N8J3o9Q8J22O2l32K30k02L25l49J11P3k53J14Q0p7O7K15m97j13M36J39
4758A76j85K30m26J54J1J6J11k50n1J50J11j17J66O9l50K52O6r9qJ01l4j07PJ09
4782A02j53K43j35J04j38k64L15o3M6r8j14J55m7J05J40l57J66pJ2j94K50j2P7
4805A33k21K49j28j98j06J39K66k16K46j67j44J41J46p5M6M4k54J88j30j14O1
4826i4l4K01j49r4K92l1L6j75J86l77K98J65l47Q9l5O8j6j87J72o6q0r4L91P9
$$ y = [97, -99, -64, 133, -39, 188, 9, 3, -69, 23, -51, 298, -136, 32, 122, -55, -161, 154, 126, -5, 56, -33, 271, -59, -116, -182, 207, -118, -76, -192, 7, -134, 187, 44, -67, -95, -42, 2, -188, -9, -139, 162, -144, 70, 70, -60, 201, -248, -104, 58, 1, 36, -193, -89, 23, -139, -94, -108, -113, -65, 106, -36, 69, -62, 37, -207, -271, -195, -120, 37, 18, -65, -7, 6, -63, 25, 147, 209, -123, 107, -95, 230, -119, -8, 65, -188, -74, 6, -71, -4, 211, -286, -399, 37, 176, -9, 221, -205, -51, -40, -24, 87, -163, -214, -64, 47, -70, 96, 165, -185, 67, 133, 34, 26, 127, 93, -14, -7, 102, -51, 192, 57, 161, 23, -241, 74, 11, 57, -41, -155, 0, -47, 58, 198, -159, 7, 0, 12, -182, 68, 56, 133, -88, 161, 33, -165, -271, -132, 134, -82, 164, -3, -147, -6, 140, 65, 111, 155, -99, 89, -41, -155, -94, -128, 73, -76, -170, 122, 91, 127, -48, 138, -239, 59, 224, -123, -34, -69, -1, -17, -204, -32, -98, -178, -272, 119, 198]
4850A98Qk69m9K10l26L14r1q8L8j07J71J57l56J71Q1J37l45QL20j6j56J26j18
4873A8J66r5p0Jj9J4Q3K7j74J13r6L63l01j26J62j55j1j25M7p1l9L03Q3j3o6r4
4899g5q3J06lJ42j54n7L85j98P0M6J10l36K0o2k5J57j39j06N0L5K3R9qO0N7r1
4925B3j84R1P2o8M16k40r3p5j9K03N3j46m0K14l95L58l11J11J54l26K15L59j81
4948A91p7j58N5K52l21j19k6J36R7J21j7j07j00J48R7j23k21K66k57M4J8L40j87
4971E2kJ24k31O5m7m9o1o7J22J43J98j80k17q8K33j0K3m9m0m1M0M9J87j84q5P8
4997c7K98k40J14j57j2j38O7K19M1L7j86j70qK70Pk62L63j1m03J73Oq2J45P8j51
5022c9p8K18q3J00k31K47k20p7J62K25k47P6j56OJ80j5n8J33j40J09M7k84J32
$$ y = [198, 206, -63, -112, 98, -228, 86, -5, -93, -55, -162, 9, 166, -190, -19, 62, 199, -146, -138, 182, 166, 10, 136, 18, 184, 89, 19, 20, 1, 15, 98, 125, -49, 64, -32, 331, 30, -96, 66, -89, -100, -225, -178, -249, -288, 15, 98, 85, 19, -75, -158, -52, -55, 87, -67, -124, 261, 63, 133, 179, 289, -47, -27, -89, -114, 43, -96, -202, -152, -117, -94, 5, -3, 57, 114, 23, -161, -70, 2, -66, 350, 110, 17, -58, -77, 126, 179, 33, -7, 207, -188, 170, -141, -30, 124, -202, 13, 372, 191, 114, -44, 11, 263, -58, -177, -203, -67, 30, 151, 134, 27, -73, 75, 172, 49, -172, 94, -163, -119, -101, 239, 52, 50, 174, -57, 8, -39, -88, -149, -216, -94, 49, 247, 67, -150, -238, -5, -15, 8, -41, -81, -122, -82, -33, 154, -30, -115, -37, 261, 21, 135, -22, -34, -172, -105, 114, 155, 192, 6, -164, -172, 98, 105, -157, 206, 195, -208, -35, -29, -111, 34, 112, -39, -117, 101, 18, 118, -113, 134, -86, -163, -1, 224, -23, 53, -103, -97, 83, 68, 10, 143, 3, 112, 159, -125, 7]
5045GJ33j0j12J78P3l17j30L55q1J7Qj83r3L00k92K65k5j01l1J32j0P0N5j25J94
5070B77l34j3J87l40J17p5K3k55M09nn8K9Q9j28j83K04mL30k16j17l2L1J6k32
5094b80J2L13J31l15R1N0k63K73k5J81j18k0n7K77k18M6l5j75O8M6r6N0K24k68
5118a08j31j0J60Q5N5r6k2q2J55q1J41j75J93j32K83j51k61o2L21j03Rj04J03
5141a3M0j92J18K15k34j16J38M12l40L3R0m38J67J40K85k41K9l4J0N4k83K08L1
5164G9j49p4P1j7K37j07j21Q3J11o3K40m08K58l08K85m3j99M4K82l5j32R7p7j59
5188a05J87k71R7J45Rj78K22k02j6j36L77j45j28J31N8m6J93%j66m6k16L62o1
5211F5j08Q5K05k44p7j3R6j11J95j94L7R8j72J99p7pJ46k40J98N1n9J28j41n6
$$ y = [7, 140, 130, 18, 196, 269, -48, -178, 177, 96, 113, 121, -62, -155, 145, -147, 118, 93, -8, -39, 93, 83, 153, 208, 83, 277, -57, -70, 117, -223, -106, -181, -158, -413, -4, -9, -67, -38, 51, -77, -260, -56, -60, 270, 54, -63, -95, -64, -48, -280, -268, 45, 176, -139, -48, 2, -261, 12, -13, 168, 50, 30, -27, 250, 32, 78, 43, -132, -64, -18, -114, -64, 160, -108, -239, -249, -89, -4, 51, -45, -67, -149, 6, -75, 66, -109, 84, -48, 235, 84, -177, -239, 82, -21, -12, -116, -13, 27, -165, -47, 168, -66, -182, -44, 368, 28, 61, 151, -287, -120, 20, 305, 64, 93, 59, 69, 123, -160, 48, 79, -70, -144, -73, -90, 147, 40, -81, 2, 113, 50, 290, -118, 140, -168, 117, 74, -125, -81, 201, 166, 34, 131, 54, -105, 82, -189, -92, 53, 62, -116, 106, -96, -112, -248, 129, -16, -144, -13, 45, -1, 192, 192, 26, -20, -236, 126, 65, -43, 42, 247, 3, -74, -87, 9, -102, 93, -101, -64, 34, -138, 61, -16, -23, 123, -117, 81, 132, 73, 201, 60, 4]
5235DN3Q6R4l40J22J71k54J81j00j32J24nk4j83L09j16O2o7j18J95KNK27l25K7
5260bQ8j51J75r4J27j53j8j56K55j75K48j26q5nO1J4lp2J10m13L66J4k66J70K50
5285A59j19k63K44jK7p8J0J1q3K34j50R0j2jJ36j41kr7j15M43k87J38m0Q1k92
5310a08M11l84J73Rj90Q7j88J48k8K15l1p9mk51J25Q1r7J15J88j80j1N8R5k35
5334h1K14j75k8J49nk03J6N31m84Q9p2Q6M9J34j88l6j28J79k54Q9J72r1M2q9K19
5359A35j63Nl0J52j39O9k35K88j70O6K67m06K06rl6kl0k8J17r8n2J58k60K99j95
5384i1l6J81L3j12n6N8j29L33l5n07M91j77JJ13J46oj20M3M5r4p1j96J12k32M56
5409A50Lj67Q3K10m86K07N6R9r7p1p3RO5j17K14l67L87O2o5J13j02k53K73j64
$$ y = [4, 57, 143, 237, -103, 19, 190, -64, 117, 17, -115, 9, 4, -20, -203, 106, -10, 52, -15, -133, 62, 64, 69, 296, -29, -2, 86, -65, 110, 16, 143, -10, -28, -184, 71, -104, 144, 18, -67, -72, -11, 3, 0, -72, 38, -375, -9, 5, -261, -91, 159, 40, -223, 21, 20, 47, -31, -21, -10, -93, 141, -9, 81, 69, 68, 204, 63, 61, -36, -151, 292, 5, 143, 103, 184, -108, 303, -81, 92, 101, -89, -2, -190, -42, -70, 145, 114, 35, 31, -220, -95, -14, -111, 4, 192, 12, 1, 59, 154, -81, 133, -42, -70, 79, 74, -129, -113, 418, -66, 23, -49, 37, 86, 220, 32, -4, -132, 47, -207, -118, 54, -37, 5, -84, 135, -28, -23, -53, 99, -40, 29, -206, 82, -88, -22, 245, -161, 45, 36, 0, -2, -32, -60, 57, -41, -93, 65, -195, 104, -91, -127, 54, 87, -25, -81, -23, -152, 181, 146, -361, 130, -47, -46, 67, 213, 207, 87, 130, 175, 81, 10, -186, -74, -306, 150, 153, -14, 69, 279, -207, 0, 56, 155, 58, -13, -86, -77, -12, -129, 85, -282, 105, 167, 102, 215, 113, -140, 133, -31]
5433c1J52k15%j38K10j21K54j72P3m7m8O7J03J08l99M2K52q0j24j14J31K98j78
5456B3n9r9rm5l3K86R5l9k61L02j56l1J38j07J78j27l0J50q1j68J51Qp9j79J57
5481a5n1J27k3j1Q3j89j11l5J85m6J29o0JJ36K4r8J12j29L84k46l27K4K15j79
5505a00J45j13R5r9O7o8N7k00L97k36JJ31j79K5O6K11l11Q5J68j12k36L4O1K08
5529I7J28j4k65p4L56j05j5j91J92j01j40R4m1J0K11m9j96J80MM6q8J14k00J60
5553A13j8j35k72L31j67L15o0j28K4j16O8j2P8o3j70J77K39k02J05j52J7j2J78
5576A38l53K70j0j4j53L68k79J86r1n4m2J88o1J7j78K72j84n1K04l40K91k67J46
5599Cj54Q9K25j82N7l25L38M7k33L00p2j54Q1j41K59J59l42n7P4P9j39N7R8k74
$$ y = [-31, 121, -94, -94, -232, -22, -143, 111, -61, 12, -35, -83, -16, 87, 195, -204, -162, 90, 10, -114, -228, -97, 201, 23, -36, -135, -144, -189, -222, 64, 159, 120, -141, 161, 5, -26, 112, 5, 183, 56, 26, 176, 95, -73, 78, 86, 7, -172, -15, -66, 61, 38, 27, 110, -79, -190, -225, -40, -86, 43, -17, -16, 120, 144, 46, 158, 29, 413, 167, -160, -136, 79, -100, 45, -68, 27, -72, -5, -73, -16, -216, 181, -55, -54, 77, -102, -77, -11, 200, -111, -26, 142, 30, -206, -172, -111, 97, 225, 211, -54, -128, 228, 123, 108, -83, 109, 8, -132, -38, -79, -69, 142, 93, -103, 77, 81, 127, 39, 153, -47, 113, 95, -40, -312, 19, -148, 167, 107, -21, 3, -113, -45, -57, 21, -42, -212, -35, 204, 2, 107, -45, -28, -40, 138, -215, 55, 45, 31, -122, 246, -33, 153, 62, 8, -34, 154, 93, 110, -68, 204, 20, -31, 173, -167, 124, -143, 3, -151, -62, 163, -19, 38, -287, 51, 98, -135, 165, 93, -61, 20, -121, 138, 297, -45, -102, -28, 51, -88, -31, 67, -207]
5623b07K91o9J10j54J99j23j98J90J14l35L15l59M7J55P0J72l23m5j38K5L74k00
5645h9K0K8m7k0J89qq8J49j69J87j10k29K93l2n6r0k2n8JK38p1j54L22k44J69
5670A09l91K60J40n7p1K19p2k13M7M8J20j3J24l11P2J41k44J17j3Q9m1j03P8n6
5694b1p1M1R0p7r9K0J52k18J62r1m7R8P9K09k61J55j52J4P4J08k86N8K16p6j27
5719e0J54j54O3o1n8lQ2K73l19%k0J39r7K16l79J36KR8K33k10j19k7nj7J32n7
5745d8j3J43J08j10Q4M2j88K9P8j99J61m6j10J32n8n9M6r0J95l8j06J59k97L4
5769a51l6J22k36K31M3P8J23k14j7L7J18m1J62l44L5Q6R0l3j09m8J96P3r0L6k35
5794a24L4Q2l21J21k6N8P8k4k98K42J28J21k06J8J12p5L8J39j18j2L5j52P0J39
$$ y = [-207, 84, 15, 125, -29, 170, 47, -151, 39, 153, -182, 133, -226, -179, -24, 46, 218, -105, -150, -288, -263, 111, -89, -69, -41, -88, -108, 81, 73, -15, 134, -35, 152, 42, -187, 106, 74, 18, -72, -94, -152, -151, 87, 16, -138, 184, -60, 109, -282, -22, 118, 61, -10, 209, 137, -76, -29, 19, 139, 126, 250, -61, 11, 152, -92, 25, 12, 101, 60, -43, 35, -21, -92, -51, 39, -38, -137, -117, 35, -183, -21, -112, -159, -61, 18, 227, -34, 121, -31, -17, 57, 165, -121, -63, 153, 77, -50, 104, -50, 13, -48, -106, -109, -27, 246, -73, -73, -93, 46, -51, 165, -214, -78, -76, 22, 255, 45, -74, -101, -106, -123, 9, -48, -61, 82, 190, 80, 164, 206, 18, 47, 125, -74, 87, 41, -69, 63, 5, -54, -8, -98, 97, 59, -47, 112, -185, -151, -187, -65, -301, -70, -27, 51, 174, -40, -57, -20, 98, 57, 219, -125, -90, -4, 86, 53, -56, -104, 92, 165, 75, 111, -124, -90, -8, -329, -208, -234, -176, -98, -122, -420, -178, -50, 71, -135, -117, -5, -80, -42, 97, -21, -33, 2, -150, -80, 59]
$$ [...]
8191c1
##END NTUPLES=NMR FID
##END=
