##TITLE=1H_PR192_5NaT
 D2O, 8 sc, 
 27.10.2020
##JCAMPDX= 6.0         $$ Bruker NMR JCAMP-DX V2.0
##DATA TYPE= NMR FID
##DATA CLASS= NTUPLES
##ORIGIN= UXNMR, Bruker Analytische Messtechnik GmbH
##OWNER= root
$$ XWIN-NMR		Version 3.5
$$ Tue Oct 27 10:08:07 2020 Russian Standard Time (UT+4h)  she@DPX200
##.OBSERVE FREQUENCY= 200.1315066352
##.OBSERVE NUCLEUS= ^1H
##.DELAY= (6, 6)
##.ACQUISITION MODE= SIMULTANEOUS
##.ACQUISITION SCHEME= undefined
##.AVERAGES= 8
##.DIGITISER RES= 18
##SPECTROMETER/DATA SYSTEM= spect
##.PULSE SEQUENCE= zg30
##.SOLVENT NAME= D2O
##.SHIFT REFERENCE= (INTERNAL, D2O, 0, 15.7039)
##AUDIT TRAIL= $$ (NUMBER, WHEN, WHO, WHERE, WHAT)
$$ ##TITLE= Audit trail, XWIN-NMR		Version 3.5
$$ ##JCAMPDX= 5.01
$$ ##ORIGIN= Bruker BioSpin GmbH
$$ ##OWNER= she
$$ F:/spectra/data/she/nmr/H-F/1/audita.txt
$$ ##AUDIT TRAIL=  $$ (NUMBER, WHEN, WHO, WHERE, WHAT)
(   1,<2020-10-27 10:06:55.90 +0400>,<she>,<DPX200>,
      <created by zg, POWCHK disabled, PULCHK disabled
       configuration hash MD5:
       00 E9 B6 7A A2 85 ED C7 34 08 36 98 17 FE 4E 26
       data hash MD5: 16K
       27 8B 4D B4 19 EC 82 AA 04 2A E8 8E 7B 88 40 AE>)
$$ ##END=
$$ 
$$ hash MD5
$$ 52 BB 99 B9 05 D9 30 41 BE 2E 02 97 8C DF F0 0B
##$RELAX= 
##$RELAX= 
##$RELAX= 
##$RELAX= 
##$RELAX= 
##$RELAX= 
$$ Bruker specific parameters
$$ --------------------------
##$DU= <F:/spectra>
##$EXPNO= 1
##$NAME= <H-F>
##$PROCNO= 1
##$TYPE= <nmr>
##$USER= <she>
##$AMP= (0..31)
100 100 100 100 100 100 100 100 100 100 100 100 100 100 100 100 100 100 
100 100 100 100 100 100 100 100 100 100 100 100 100 100 
##$AQSEQ= 0
##$AQ_mod= 1
##$AUNM= <au_zg>
##$AUTOPOS= <>
##$BF1= 200.13
##$BF2= 200.13
##$BF3= 200.13
##$BF4= 200.13
##$BF5= 200.13
##$BF6= 200.13
##$BF7= 200.13
##$BF8= 200.13
##$BYTORDA= 1
##$CFDGTYP= 0
##$CFRGTYP= 5
##$CHEMSTR= <none>
##$CNST= (0..31)
1 1 145 1 1 1 1 1 1 1 1 1 1 1 1 1 1 1 1 1 1 1 1 1 1 1 1 1 1 1 1 1 
##$CPDPRG= <>
##$CPDPRG1= <>
##$CPDPRG2= <>
##$CPDPRG3= <>
##$CPDPRG4= <mlev>
##$CPDPRG5= <mlev>
##$CPDPRG6= <mlev>
##$CPDPRG7= <mlev>
##$CPDPRG8= <mlev>
##$CPDPRGB= <>
##$CPDPRGT= <>
##$D= (0..31)
0 1.2 0 0 0 0 0 0 0 0.06 0 0.03 0 0 0 0 0.0002 0 0 0 0 0 0 0 0 0 0 0 0 
0 0 0 
##$DATE= 1603778815
##$DBL= (0..7)
120 120 120 120 120 120 120 120 
##$DBP= (0..7)
150 150 150 150 150 150 150 150 
##$DBP07= 0
##$DBPNAM0= <>
##$DBPNAM1= <>
##$DBPNAM2= <>
##$DBPNAM3= <>
##$DBPNAM4= <>
##$DBPNAM5= <>
##$DBPNAM6= <>
##$DBPNAM7= <>
##$DBPOAL= (0..7)
0.5 0.5 0.5 0.5 0.5 0.5 0.5 0.5 
##$DBPOFFS= (0..7)
0 0 0 0 0 0 0 0 
##$DE= 6
##$DECBNUC= <off>
##$DECIM= 32
##$DECNUC= <off>
##$DECSTAT= 4
##$DIGMOD= 1
##$DIGTYP= 9
##$DL= (0..7)
0 120 120 120 120 120 120 120 
##$DP= (0..7)
150 150 150 150 150 150 150 150 
##$DP07= 0
##$DPNAME0= <>
##$DPNAME1= <>
##$DPNAME2= <>
##$DPNAME3= <>
##$DPNAME4= <>
##$DPNAME5= <>
##$DPNAME6= <>
##$DPNAME7= <>
##$DPOAL= (0..7)
0.5 0.5 0.5 0.5 0.5 0.5 0.5 0.5 
##$DPOFFS= (0..7)
0 0 0 0 0 0 0 0 
##$DQDMODE= 0
##$DR= 18
##$DS= 0
##$DSLIST= <SSSSSSSSSSSSSSS>
$$ [...]
##$SUBNAM2= <"">
##$SUBNAM3= <"">
##$SUBNAM4= <"">
##$SUBNAM5= <"">
##$SUBNAM6= <"">
##$SUBNAM7= <"">
##$SUBNAM8= <"">
##$SUBNAM9= <"">
##$SW= 16.880792210976
##$SWIBOX= (0..15)
0 0 2 0 0 0 0 0 0 0 0 0 0 0 0 0 
##$SW_h= 3378.37837837838
##$TD= 16384
##$TD0= 1
##$TE= 0
##$TE2= 300
##$TE3= 300
##$TEG= 300
##$TL= (0..7)
0 120 120 120 120 120 120 120 
##$TP= (0..7)
150 150 150 150 150 150 150 150 
##$TP07= 0
##$TPNAME0= <>
##$TPNAME1= <>
##$TPNAME2= <>
##$TPNAME3= <>
##$TPNAME4= <>
##$TPNAME5= <>
##$TPNAME6= <>
##$TPNAME7= <>
##$TPOAL= (0..7)
0.5 0.5 0.5 0.5 0.5 0.5 0.5 0.5 
##$TPOFFS= (0..7)
0 0 0 0 0 0 0 0 
##$TUNHIN= 0
##$TUNHOUT= 0
##$TUNXOUT= 0
##$USERA1= <user>
##$USERA2= <user>
##$USERA3= <user>
##$USERA4= <user>
##$USERA5= <user>
##$V9= 5
##$VALIST= <valist>
##$VCLIST= <CCCCCCCCCCCCCCC>
##$VD= 0
##$VDLIST= <DDDDDDDDDDDDDDD>
##$VPLIST= <PPPPPPPPPPPPPPP>
##$VTLIST= <TTTTTTTTTTTTTTT>
##$WBST= 1024
##$WBSW= 4
##$XGAIN= (0..3)
0 0 0 0 
##$XL= 0
##$YL= 0
##$YMAX_a= 132155
##$YMIN_a= -129567
##$ZGOPTNS= <>
##$ZL1= 120
##$ZL2= 120
##$ZL3= 120
##$ZL4= 120
##$ABSF1= 10
##$ABSF2= 0
##$ABSG= 5
##$ABSL= 3
##$ALPHA= 0
##$AQORDER= 0
##$ASSFAC= 0
##$ASSFACI= 0
##$ASSFACX= 0
##$ASSWID= 0
##$AUNMP= <proc_1d>
##$AZFE= 0.1
##$AZFW= 0.1
##$BCFW= 1
##$BC_mod= 2
##$BYTORDP= 1
##$COROFFS= 0
##$CY= 11.3945322036743
##$DATMOD= 1
##$DC= 2
##$DFILT= <>
##$DTYPP= 0
##$F1P= 16.9975609425685
##$F2P= -3.02152046262296
##$FCOR= 0.5
##$FTSIZE= 0
##$FT_mod= 4
##$GAMMA= 1
##$GB= 0.15
##$INTBC= 1
##$INTSCL= 1
##$ISEN= 128
##$LB= 0.24
##$LEV0= 0
##$LPBIN= 0
##$MAXI= 10000
##$MC2= 0
##$MEAN= 0
##$ME_mod= 0
##$MI= 1.114404
##$NCOEF= 0
##$NC_proc= 0
##$NLEV= 6
##$NOISF1= 3.799351
##$NOISF2= 2.8
##$NSP= 1
##$NTH_PI= 0
##$NZP= 0
##$OFFSET= 15.70392
##$PC= 1
##$PHC0= -10697.44
##$PHC1= 21.20088
##$PH_mod= 1
##$PKNL= yes
##$PPARMOD= 0
##$PSCAL= 0
##$PSIGN= 0
##$REVERSE= no
##$SF= 200.130013532006
##$SI= 16384
##$SIGF1= 3
##$SIGF2= 2
##$SINO= 400
##$SIOLD= 16384
##$SREGLST= <1H.CDCl3>
##$SSB= 0
##$STSI= 0
##$STSR= 0
##$SW_p= 3612.71676300578
##$SYMM= 0
##$S_DEV= 0
##$TDeff= 0
##$TDoff= 0
##$TI= <>
##$TILT= no
##$TM1= 0
##$TM2= 0
##$TOPLEV= 0
##$USERP1= <user>
##$USERP2= <user>
##$USERP3= <user>
##$USERP4= <user>
##$USERP5= <user>
##$WDW= 1
##$XDIM= 8192
##$YMAX_p= 0
##$YMIN_p= 0
$$ End of Bruker specific parameters
$$ ---------------------------------
##NTUPLES= NMR FID
##VAR_NAME=  TIME,          FID/REAL,        FID/IMAG
##SYMBOL=    X,             R,               I
##VAR_TYPE=  INDEPENDENT,   DEPENDENT,       DEPENDENT
##VAR_FORM=  AFFN,          ASDF,            ASDF
##VAR_DIM=   8192,          8192,            8192
##UNITS=     SECONDS,       ARBITRARY UNITS, ARBITRARY UNITS
##FACTOR=    0.000296,      1,               1
##FIRST=     0,             0,               0
##LAST=      2.424536,      0,               0
##MIN=       0,             -129567,         0
##MAX=       2.424536,      132155,          0
$$ Real data points
##PAGE= N=1
##DATA TABLE= (X++(R..R)), XYDATA
$$ [...]
2423a109k132J314L101J740r27l094j741J169K702J651q68l059j710J094L136
2438A267J457j219k437k146J470K763J392n89k791j995J095K589J913p53l083
2453a067j765R72K712K023j242k526k016J149K701J766j110k514j813J073K641
2468I84J992j076k920j697J177K298K214r28k760k073R30K593K059r35k612j723
2484b477N00K792J809r05k663j804J159K201K109r25k662j599N08K791J766q08
2500A792k666j628P11K425K146j066k478j782O63K559K143o48k905j672P21K363
2516F78K022j075k336j930R12K337K012q06k483j717N35K632J717p79k462j659
2532b402O00K390J857m41l054j324M40K794J532p00k216j962K40L105J751p96
$$ y = [-1109, -3241, -1927, 1174, 2914, 1987, -1107, -2848, -1679, 1023, 2674, 1806, -1253, -2963, -1869, 1267, 2724, 1505, -932, -3078, -1608, 1155, 2547, 1958, -833, -2828, -1733, 856, 2769, 2016, -1067, -2832, -1860, 852, 2875, 1633, -893, -2909, -1760, 941, 2707, 1597, -917, -2730, -1657, 984, 2976, 1900, -1020, -2717, -1540, 758, 2972, 2044, -716, -2789, -1859, 734, 2793, 1858, -754, -2477, -1977, 815, 2624, 1719, -944, -2748, -1589, 612, 2721, 1796, -866, -2465, -1957, 834, 2600, 1792, -874, -2502, -1791, 634, 2780, 1714, -764, -2546, -1883, 676, 2819, 2171, -734, -2406, -1685, 678, 2700, 1625, -711, -2641, -1729, 608, 2620, 1814, -669, -2386, -1851, 781, 2498, 1719, -743, -2402, -1802, 588, 2445, 2004, -1050, -2374, -1934, 860, 2392, 1692, -524, -2486, -2246, 859, 2610, 1814]
2548A814k406j851N40K446J901n63k462j854M89K731J493n69k318j933P39K478
2564F75J798q90k036j829M95K288J798m25k500j894J128J864K176q02k477j644
2580b275L92K404J838p14k298j839N41K447J893n92k145k009P84J928J788k37
2596A906k184j929J96K379J851k88k555j750O06K530J425k70k238j778M00K279
2612E80J522j15k492j584K96K034J996m98k191j831K52K341J816k60k266j716
2628b116L71J859K102j95k389j983N64J871K025n15k050j613K21K142J933o02
2644A625j957k084M97K096K061l42k195j779M22K014J785m04k103j647J78J894
2660F1J974k23k151j697j30K495J424p2j946j550J87J934J575j22k205j586L95
$$ y = [1814, -592, -2443, -1903, 543, 2444, 1881, -581, -2435, -1946, 785, 2278, 1709, -609, -2542, -1803, 675, 2473, 1583, -453, -2282, -1787, 501, 2299, 1874, -626, -2520, -1392, 472, 2648, 1846, -631, -2275, -1883, 521, 2359, 1645, -653, -2492, -1951, 496, 2389, 1797, -348, -2357, -1573, 355, 2143, 1906, -278, -2207, -2011, 368, 2219, 1931, -624, -2374, -1768, 762, 2187, 1917, -321, -2099, -1699, 580, 2102, 1987, -505, -2089, -1793, 241, 2237, 1739, -452, -2283, -2031, 310, 2126, 1866, -400, -2116, -1745, 114, 2216, 2021, -368, -2351, -1787, 84, 2109, 1594, -456, -2069, -1848, 294, 2227, 1625, -332, -2416, -1919, 177, 2238, 1896, -299, -2078, -1656, 358, 2143, 1739, -364, -2011, -1833, 61, 2035, 1812, -339, -2036, -2166, 329, 1753, 1681, -265, -1815, -1628, 306, 1881, 1759, -446, -2032, -1637]
2677a637J653J970L2k244j678R5J999J928o12j598k067L15K171J465j62j570k187
2694b127L66J807K066l19k035j699N0J932J999j39j951j871jK440J398k92j509
2711A15k121N01J545J864k98j808j734J21J873J956j29j814j842k18K156J896
2727B063l76j683j967J39K081J480K7j964j783J45J901J625R4j813j643k05J972
2744I3J684qj750j926j14K246J257L56j914j804J94J563J624K09j797j494k78
2761a859J820J894j38j583j913r1J984J719j26j774j921K07J912J550Q6j671j719
2778a623j51J696J782r4j688j592M4J614J755j50j639j637k22K024J475Rj476
2795A27j899K07J604J341M90j930j573j36J624J833q8j427j778k0J636J595J31
$$ y = [-1637, 16, 1986, 2018, -226, -1904, -1809, 190, 2118, 1506, -92, -2159, -1844, 327, 1792, 1630, 60, -2127, -1761, 46, 2112, 1793, -242, -1941, -1891, 41, 2040, 1901, -50, -1921, -1922, 518, 1916, 1624, 115, -2006, -1505, 40, 1904, 1606, -202, -1936, -1815, 58, 2014, 1885, 71, -1771, -1989, 167, 2063, 1687, 4, -1963, -1824, 257, 1737, 1764, -200, -1983, -1838, 63, 1688, 1782, -31, -1674, -1879, 93, 1777, 1769, 19, -1907, -2021, 225, 1482, 1838, -76, -1880, -1686, -123, 1501, 1710, -87, -1581, -1859, -39, 1855, 1717, 134, -1779, -1870, 114, 1833, 1707, -67, -1988, -1781, 131, 1681, 1767, 96, -1623, -1774, -78, 1704, 1610, -78, -1670, -1626, -12, 1743, 1593, -46, -1683, -1905, 119, 1594, 1603, 127, -1772, -1565, 39, 1380, 1870, -60, -1633, -1769, -145, 1688, 1600, 173, -1605, -1625, 11, 1606, 1737]
2812A737j592j901P9J477J691L33j832j852J29J617J664M8j740j317k28J740J498
2829A551R2j449j750m54J911J888j37j396j842L1J306J736K03j661j427j38J349
2846a87J708P6j530j597p7J373J815j1j326j870P9J485J547Q7j476j685Q0J413
2864i6J648p3j279j616j85J351J725K10j612j588k09J722J513K78j742j498j03
2881a554J487J450J29j189j880L1J270J747k4j030j925mJ447J348M99j395j749
2898a342m10J523J353N68j425j876o3J421J860N4j549j275l36J453J247M87j640
2915E0j538J72R44J578N25j535j730J05J229J577J44j197j661k71J439J600J48
2932A579j370j409k42J087J640O42j645j439q1R37J777M5j162j718j78J155J551
$$ y = [1737, 145, -1756, -1677, -200, 1491, 1824, -8, -1860, -1731, -114, 1550, 1598, -142, -1459, -1687, 53, 1551, 1643, 194, -1556, -2010, -99, 1789, 1652, 256, -1586, -1555, -249, 1487, 1690, 29, -1398, -1536, -187, 1521, 1597, 67, -1530, -1607, -234, 1581, 1570, 244, -1626, -1547, -62, 1485, 1572, 96, -1589, -1509, -96, 1552, 1479, 200, -1416, -1601, -250, 1475, 1685, 73, -1515, -1724, -2, 1511, 1789, 47, -1451, -1554, -67, 1383, 1512, 323, -1557, -1526, -256, 1491, 1467, 437, -1488, -1492, -45, 1303, 1802, 407, -1342, -1752, -229, 1124, 1692, 267, -1609, -1672, -251, 1609, 1663, 114, -1161, -1497, -44, 1203, 1690, 50, -1488, -1316, -372, 1206, 1731, 196, -1534, -1429, -200, 1377, 1521, 324, -1337, -1608, -169, 1431, 1579, 209, -1200, -1442, -355, 1285, 1927, 282, -1157, -1238, -301, 1476, 1521, 359, -1359, -1537, -382, 1169]
2949A169N92j356j625m49J448J552L77j595j280l49R46J857L47j356j606l33J263
2966c98J492M73j297j601j31R94J782K63r22j740m75J189J502K85j215j337l68
2983a504J100J466K93q37j544l21P86J722M90j209j584o63J417J650J98j086j402
3000a028n07R54J791K41j172j071o61J101J423L99j123j350m80Q93J652R3q45
3017C10j209o94J345J424L19j154j426k02Q96J576J61q83j509m48J109J606K23
3034A444j163j475m88J482J545K9j009j463j73Q30J469P09j386j608j98J209J366
3051A120J99r91j223k55P45J497M25j046j420r4N41J264P67j477r42m41R78J199
3069H46N11r49j319n21R68J700J63r05j348n12J031J256N71j101j468o4P42J501
$$ y = [1169, 1761, 405, -1220, -1669, -221, 1331, 1708, 113, -1167, -1516, -570, 1287, 1634, 278, -1328, -1661, -398, 1094, 1567, 270, -1331, -1462, -468, 1314, 1577, 655, -1085, -1560, -371, 1131, 1416, 201, -1136, -1504, -404, 1062, 1355, 518, -1026, -1347, -561, 1161, 1651, 442, -1142, -1805, -388, 1262, 1460, 374, -1028, -1535, -581, 1210, 1451, 279, -792, -1453, -352, 1071, 1470, 347, -1003, -1483, -590, 1062, 1155, 310, -899, -1593, -248, 1176, 1495, 341, -1085, -1287, -391, 1185, 1346, 463, -1046, -1494, -385, 1221, 1444, 281, -1194, -1682, -200, 1345, 1374, 365, -1098, -1271, -441, 1028, 1737, 351, -1257, -1455, -246, 1120, 1319, 328, -895, -1150, -405, 1092, 1517, 471, -949, -1043, -502, 762, 1529, 52, -890, -1331, -353, 846, 1357, 408, -911, -1432, -464, 1236, 1399, 494, -854, -1366, -335, 921, 1492, 391, -1077, -1141, -399, 1102]
3087A102L39q64j208p92R20J682J25q53j329m17M87J847J55o83j300p01R44J448
3105I02L97r40j222k37P17J374J65o74j506k71Q45J489K35p44j426k20P54J137
3123G75N87r53j019m24N32J299O68j254j112k93O77J511M38r12j282m35O60J325
3141G88K60l96j699k21Q17J075N35p94r73p28P40J323M56n98j206p96J026J129
3159G38M55n50j377q19J237J162M97p09j452o33R48J341K50o50j196n36P32J192
3177F30P11r13j106n90O44J361M73p00j348m79Q22J319L17q31q30o60P41J262
3195H23M03p69j052o16P04J034P40q20j086o62Q95J040M67o76j311J4M89J249
3213H66L58p10j345k64M83J436L73q55r86p01Q05J253M63q43r67k98M06Q30Q27
$$ y = [1102, 1441, 577, -631, -1423, -503, 1179, 1304, 451, -878, -1295, -808, 1039, 1194, 511, -789, -1490, -546, 902, 1299, 359, -863, -1100, -383, 991, 1156, 482, -1024, -1295, -450, 1039, 1274, 530, -896, -1116, -362, 775, 1362, 409, -610, -1034, -502, 797, 1465, 211, -901, -1194, -517, 994, 1432, 520, -762, -1197, -537, 788, 1048, 652, -1047, -1268, -451, 624, 1159, 365, -608, -1336, -596, 727, 1183, 585, -621, -1417, -391, 738, 1193, 643, -734, -1553, -316, 846, 1343, 634, -818, -1451, -503, 838, 1088, 438, -758, -1294, -562, 630, 1341, 428, -678, -1268, -624, 737, 1210, 510, -838, -1317, -495, 824, 1141, 310, -520, -1180, -439, 823, 1226, 457, -595, -1211, -507, 527, 1267, 447, -639, -1301, -406, 634, 1101, 425, -886, -872, -383, 866, 1224, 514, -831, -1095, -612, 824, 1197, 342, -644, -1345, -540, 713, 1176, 333, -634, -932, -526, 304, 1131]
3232A131p63r33p15Q88J166L00l81j530m27N87J306P24n84j572l61N42J370L60
3250A108n69j279m31N62J278L54n02j081p25P10J379K44p02r97p29J056Q50O96
3268A222q96j013n57O80J326K62m69j238m24N31J207M18n50r44o74O62J162N74
3286A279p68j087n35N43J184N28p16r36p48M52J235Q85n53j213p99P72J087J44
3304G54N5j336m82O53J101L13j52j492n77M47J368L14m85r53q72Q58J045M33o29
3323C63q57q53R22R76M67n98j101k38L24J235P97r39j114n03O91J183L54n44j109
3342e44n28L70J155P21n64j142m40L03J050O75o98q17n87O61Q78N26n58q18p78
3361a135P19Q58N14o70q17n37O07R01P19p77j054m84O87J155M94n84r91n16R9
$$ y = [1131, 368, -565, -1280, -392, 774, 1074, 693, -837, -1264, -677, 629, 1353, 769, -803, -1164, -622, 748, 1108, 539, -740, -1171, -609, 669, 1023, 521, -560, -1285, -575, 804, 1048, 346, -651, -1380, -324, 526, 1222, 326, -687, -1244, -564, 762, 1024, 555, -683, -1107, -576, 631, 1049, 499, -445, -1119, -457, 705, 1279, 511, -576, -1111, -568, 616, 1144, 428, -508, -1256, -804, 431, 1316, 763, -450, -1249, -477, 610, 754, 809, -527, -1009, -356, 745, 1058, 906, -586, -1163, -716, 652, 966, 481, -472, -1344, -486, 559, 992, 363, -494, -1347, -425, 551, 1018, 420, -681, -919, -595, 640, 1437, 498, -616, -1119, -428, 755, 1109, 565, -544, -1072, -702, 453, 1174, 610, -532, -972, -669, 381, 1056, 358, -459, -1046, -385, 493, 1019, 461, -357, -1135, -416, 442, 956, 286, -531, -1068, -461, 440, 1159, 382, -672, -1156, -469, 686, 1180, 596, -395, -911, -812]
3380h12J454L24m57j197l07M42P81R17p85p87o19M06J369J99m98q00m78KJ167
3399C21O58l63j148m50N14R53L84l82j136l58L98R70P47p35q46n68M96J209K47
3418I11k37j204l61M82Q08N62n13r94n05N09O86Q06l35j130o16J028P13N50p16
3437D44r03n93L65J038Q50n10j405m13N54R67M70j07j230o75P09R72N20l33j277
3456e57m63M78R31N50n07j008o82P57R37L27j95j119m25O50O14N93m29p33o92
3475i73M28J081O30n43j174l36L33O44Q11j05j395k57K70R39R97q10r37n01L22
3494e76R95O30o06q58p71N84J147M31j87j303m72M62R40O34n30j131l20M15Q49
3513C33Q64q88o47m49L67Q67M77j39j233m45M44Q70M91k02j161m37N60O29N91
$$ y = [-812, 642, 966, 509, -688, -995, -553, 228, 1145, 360, -427, -1046, -640, 729, 928, 430, -370, -848, -846, 321, 979, 616, -532, -982, -468, 485, 869, 487, -649, -1007, -609, 361, 1108, 373, -473, -1041, -545, 664, 911, 674, -530, -891, -409, 399, 961, 448, -546, -1051, -542, 144, 950, 615, -515, -1131, -103, 610, 1160, 444, -459, -1052, -687, 351, 1201, 691, -714, -1127, -573, 394, 864, 757, -473, -1148, -439, 533, 1053, 720, -557, -1020, -542, 389, 939, 432, -576, -1258, -501, 436, 763, 568, -551, -976, -326, 288, 881, 452, -281, -973, -545, 536, 1166, 623, -551, -887, -554, 90, 901, 796, -599, -856, -586, 353, 1350, 540, -397, -898, -576, 419, 1049, 443, -415, -1186, -602, 545, 976, 789, -514, -986, -524, 416, 1050, 520, -611, -931, -516, 333, 1197, 309, -338, -787, -420, 447, 924, 785, -448, -893, -449, 421, 912, 710, -451, -888, -328, 301, 892]
3532H92k73j131j24k3Q79P52n51q19m11K23R50K04K37j243k80m0J040O38m58q20
3552c58o53K58J158L31j95r32k84M7O99P14r3j277k77mJ042O09l04q28l95M69
3572b73L89P78l43p40o88M00J043M60n98q91l82M18O74P86p27o52m98J58J174
3591D88L17j41j042m11K81P29O16k57p69q43M17J058K70l02o27n60L06R12M64
3610I06k42r68n60M78Q88L50j35r84o72N27P46L81l74n67p61L89P68Q33m13q93
3630c03n49L6Q62R16k37j090l34J14R71J94j38n49p27L51O48O42l67p21o04L97
3650d88M08R58l37p04n56J25Q24O35J1j050p86M68N60Q01l7j167m23K53P71O77
3670I43j57r50o44L22Q81N60m79o38l73k15R01N33j63m73q21J33Q73N23j82q34
$$ y = [892, 619, -512, -636, -659, 220, 972, 421, -398, -809, -586, 364, 568, 805, -438, -718, -758, 282, 920, 462, -358, -1011, -753, 405, 736, 541, -391, -675, -628, 71, 785, 692, -585, -862, -866, 176, 785, 481, -347, -742, -273, 116, 894, 551, -189, -877, -477, 566, 1026, 428, -463, -845, -427, 247, 1033, 306, -346, -844, -686, 488, 805, 664, -378, -789, -508, 221, 837, 580, -189, -1032, -615, 443, 713, 411, -216, -776, -470, 442, 906, 664, -304, -864, -386, 502, 852, 717, -267, -939, -412, 334, 715, 341, -226, -987, -598, 170, 1003, 590, -303, -852, -816, 46, 962, 725, -365, -699, -585, 386, 580, 442, -107, -834, -483, 165, 807, 440, -281, -885, -488, -80, 878, 541, -163, -719, -594, 230, 865, 876, -174, -960, -492, 68, 869, 832, -335, -758, -505, 266, 943, 786, -164, -808, -486, 395, 955, 476, -162, -535, -750, 151, 684, 521, 48, -773, -640, 233, 756, 574, -260]
3690b60m83J76P70O95k60r98m93K38P36O55k64p42m82Q4P08N48j38p46n36K82
3710e10Q26M19k48o55n97N3R33N12%p89q12K03Q78N07N3q21m81P6R00L23k39q34
3732c03m87J69J071N00o55n49m10J40P72N99j92r28m63L77P23L92j69o46q05J32
3752g32Q25M91Jr53l33J49P29M28M0p23m42J12M50N76j38o80p87M76M67Q08j33
3773F31p91m43M4R18N12j2j076o43M52L82P52Kq73p38M01P71M74k23r21l60J57
3794e84P27N47n2p58n86L29M59O78k56m97o55l4Q48M87j50n97n82jN35O70N0m15
3816A63q41K64O04P68m39o84o96K45P81N56n3p77n89mR08M58K8r51k32j82R37
3837B64L30n8n32o58r2O78O46R0q32m12l1O99N62k79k96o79QR50L04R7p07j009
$$ y = [-260, -743, -567, 203, 898, 638, -360, -853, -615, 121, 776, 512, -230, -712, -628, 80, 628, 490, -256, -792, -510, 316, 735, 487, -168, -765, -712, 221, 733, 733, -56, -868, -665, 213, 720, 773, -48, -529, -453, 447, 770, 531, -303, -790, -621, 450, 950, 295, -254, -664, -524, 248, 847, 655, -273, -736, -359, 364, 756, 587, -59, -864, -732, 93, 584, 585, -368, -701, -552, 177, 605, 645, -78, -520, -408, 42, 618, 480, -200, -987, -511, -44, 764, 631, -160, -603, -559, 359, 871, 859, -217, -860, -408, -26, 726, 728, -145, -883, -482, 289, 763, 540, -381, -741, -584, 143, 690, 638, -120, -706, -377, 82, 760, 504, 7, -648, -682, 166, 653, 503, -94, -676, -677, -142, 528, 578, 163, -678, -414, 190, 958, 519, -165, -861, -616, 165, 721, 668, -109, -698, -702, 206, 664, 692, -259, -491, -673, 264, 594, 536, 4, -654, -746, -68, 578, 668, -164, -576, -607, 92, 654, 375, 79, -600, -592, 358, 662, 759, 52, -957]
3859i57K62N58J008j89o67p34L41O47N22k40l39q56J74M60P38P9p41p07j04Q63
3879A18P94l46o12m73m01J023L65N1m08q54K59O23P31l86l74p27n5N82M83q7n54
3900b48m97K26N90O48m8q19n13L06K52P08P4p43n69O5N97O74l25m89m90L9P52
3921A90M17K00o88r47K17Q08L63R1o52p31O2O17N03J72p55l51q2O79L03K80p71
3942g5m09k1M93N16K9m35o99j43O99M53O0m57o82J20M65P20k67l01o12J20M44
3963A8P95K02j169m00k25O25O12J49q39m35q3R59N19m3p26p68J20P44N74m4q41
3984b56m29J10M56O94k20l08l42l5K67P37Q9p80n52R2J57R17k44m78l28k14P89
4005A22L97K27o15p29k21P15P38L19j032p00P6R74N56L7p40p65K8O49M76Q5o73
$$ y = [-957, -695, -137, 871, 682, 15, -719, -378, 269, 791, 551, 212, -644, -470, -10, 728, 807, 66, -641, -745, 118, 912, 566, -46, -519, -920, 103, 468, 519, 111, -743, -484, 139, 870, 484, 110, -617, -672, -90, 393, 306, -248, -745, -519, 71, 719, 671, -148, -661, -355, -103, 605, 679, -64, -633, -568, 29, 703, 378, -111, -601, -562, 190, 607, 807, 119, -828, -611, 197, 560, 651, -1, -732, -670, -53, 450, 622, -133, -484, -566, 113, 416, 696, -75, -484, -505, -12, 504, 533, 98, -601, -744, -45, 408, 468, 11, -671, -551, -86, 634, 367, 66, -546, -426, 18, 813, 1015, -154, -554, -779, -154, 458, 607, -232, -667, -750, 209, 728, 685, -41, -809, -689, 55, 629, 585, -256, -685, -575, -119, 575, 355, 47, -295, -330, -63, 674, 763, -17, -569, -477, -320, 597, 353, -125, -453, -667, 122, 519, 746, 131, -598, -819, -104, 634, 953, -79, -779, -703, 271, 827, 864, 124, -641, -613, 36, 512, 597, -76]
4026g6n62nP75L54O3n67n43J49K07Q89j11n45o42Q6M74N02J00o14p12L37N41N18
4048F18l0o59o75R2Q23K01P2m19m72j1M35Q55L3o59q32J42M01O35k14k74o07J34
4070d11K15O99K76p91l70k96O59P07J2o40o68qJ85J010M5q03l58Q5O17P02n45
4091C22l3p64l3N01M44K8k33n76j4R1O16K66o94n72R9N11N88P8o35p07J27O25
4113C5M73J7l11n24N6K21M06J94l69p31R2M19Q71j73n84p24K83L51M04K58o58
4134Fl88j06L53O51J58m51m80n28O61J83M79m96o15q6O12L82J68n42l28LL77N60
4156E73j50k57n95m9K45Q87N2m73m83j84O34K37K57m98n79n07Q70L32J85l21n75
4177c99KK74P44j38k20n61k10M94N40o9m02m43k98O66O00k22m66l83q7M07N41
$$ y = [-76, -638, -643, 132, 486, 549, -18, -561, -412, -205, 684, 573, 28, -614, -528, -54, 448, 548, -66, -778, -441, 100, 618, 588, -71, -746, -654, 169, 370, 442, 23, -449, -460, -25, 830, 863, 204, -628, -486, -85, 550, 336, 62, -545, -411, -196, 503, 779, -12, -382, -678, -19, 688, 700, 60, -608, -616, -431, 579, 624, -179, -537, -452, 165, 867, 322, 289, -475, -508, -7, 437, 465, 232, -344, -358, -267, 349, 615, -79, -651, -552, -41, 547, 625, -10, -717, -590, 35, 508, 525, 214, -310, -254, -33, 373, 567, 198, -533, -441, -22, 849, 676, 92, -632, -349, 2, 406, 664, 6, -382, -488, -135, 516, 674, 223, -257, -785, -124, 59, 538, 42, -573, -659, -47, 335, 503, -39, -367, -364, 13, 573, 423, 166, -429, -478, -233, 654, 706, 233, -250, -434, 200, 437, 694, 196, -383, -890, -20, 312, 497, 176, -399, -397, -123, 621, 483, 263, -298, -508, -14, 526, 457, 55, -388, -686, -20, 580, 358, -108, -491, -578, -171, 370]
4198C70N1k13n21j76O45M19J65p05o45M7K55N29K90l13q17J64N13M87j55m52n02
4219e64l8K66O01K70m70m00J1L83L19K07p01l87k48O11N56J56n88m24k29O47N46
4240E24N3o42n49P8M72K73J75k04p14l6L65O90m2k42n26k91N18N29l2m76m17m4
4262e38L20N91L46m09p82r4L08N80qk54n50j30N80N06j23j66m32j89L90P15j16
4283E45m55n49R4R1Q69j33n14k50k84K32P88p9j55p61j95O12O75J22n33q09M03
4304b86K54M10M01m79p38l00N52P19K09o03p31o1O18M40L08o71m88o3L18P41%
4325E50l69n49n3M62P15k93k64o48LJ07M84M68o94j86j57K97M50K4r7p29j37N24
4347i2L72r4K4o09m65Q72L27o0K06p89j48L30L15N02n61o25K1Q1Q61R9m26n56
$$ y = [370, 421, 208, -313, -489, 156, 575, 740, 35, -610, -563, -308, 221, 511, 198, -619, -455, 58, 545, 390, -62, -564, -602, -336, 265, 535, 65, -335, -324, 59, 378, 585, -116, -503, -751, -140, 416, 572, -16, -440, -669, -22, 524, 577, -65, -614, -536, -64, 209, 384, 180, -534, -570, -205, 485, 443, 201, -325, -616, -98, 431, 399, -77, -494, -538, -218, 373, 719, 310, -472, -566, -258, 322, 314, 60, -490, -620, -40, 466, 343, 177, -255, -444, -54, 661, 545, 90, -459, -365, -274, 595, 462, -52, -302, -586, -354, 434, 355, 200, -561, -756, -144, 531, 653, 120, -689, -286, -32, 378, 779, 300, -438, -738, -186, 533, 742, 139, -592, -653, -35, 405, 713, 42, -446, -509, -191, 550, 550, 181, -368, -421, 41, 756, 463, 199, -449, -446, -339, 145, 613, -81, -267, -424, -127, 323, 347, 250, -479, -616, -92, 280, 186, 210, -399, -864, 8, 335, 275, 481, -308, -456, -126, 189, 691, 130, -495, -474, -393, 468, 567, 141, -415]
4369d15j91L43N35J94k93n58k33M73N64Q2k23n32m01N59K70M19l47o92J55J63
4389a28L88K57k86o24r6N8P07N04o71n76l5M89M32ml64k40k96J39P65L0k30m54
4411b35L0k84N33Q20p65k68k69M39L15Ql43n14J17L09N80J80m73m09k86J53P36
4432C74L52p19l82j85L23O33j81q9l98l14M33N63K27o12l28j34L16K94J73k54
4452I2m09OR2N62L30m21o88l46N41O81J70o0o62l56K20N72L46n17m57j64K21N88
4474C41K00m16l40l44K57K99L56k39m25l72L35P87Q5r8q09j84K35P38J34m25j65
4495e0l77M09K44O2r0m90k75M27O97l1j89n27k56P0P63J04l89n10k56P25K73N6
4517C90k22l20m18m2R56K61l76q26R4L14M90qj25n73k38M10M66K37m59j75m73
$$ y = [-415, -606, -263, 272, 466, 173, -385, -618, -145, 419, 501, 278, -254, -655, -96, 174, 593, 246, -446, -291, -128, 260, 517, 231, -393, -489, -431, 276, 780, 109, -467, -502, -13, 419, 415, 51, -189, -485, -346, 419, 449, 219, -235, -205, -489, 44, 864, 99, -169, -438, 1, 316, 324, -19, -533, -416, -107, 473, 653, 180, -229, -515, -362, 374, 726, 7, -375, -560, -237, 396, 215, 126, -272, -586, -153, 410, 637, 25, -303, -437, -121, 173, 346, 92, -317, -311, -219, 343, 673, 252, -436, -782, -241, 440, 610, 550, -112, -468, -248, 324, 670, 153, -304, -468, -247, 341, 541, 125, -215, -559, -302, -3, 353, 114, -311, -683, -348, 439, 524, 426, -383, -567, -332, 406, 540, 115, -50, -427, -18, 226, 288, 198, -292, -567, -140, 557, 526, 337, -190, -446, -376, 387, 491, 102, -408, -664, 61, 334, 390, 168, -152, -570, -612, 344, 605, 229, -597, -503, -189, 301, 293, 168, -405, -643, -233, 233, 470, 11, -164, -637]
4538f37M41M94J92r9p04k09L47L90K28j38p82KL02L79L07k50m21q1m0Q03k2n90
4560h8l79j6J92N43K16k76l50m23J37O82K87k30n53j54N9N01M08k03m28n64K51
4581c88N86M70l80m79k73J45N73M00m53n23k16q2Q17K55p5o04k77L25N64K5r0
4602C20n52k69L94L15N08l96o97j2%M79N76n29l41k84M09M91Ok97m47j04K18L40
4624A28L55l26k94l59K00P14L29m02o00k16K19N59Q3j68j94m44J39N12L49n27
4644E7k67n24P21K70J22l41l81J40J52K02N06m61l26l89K97O71L8k70l39n05M00
4665b27L96N18l12m31m34L23N84P9j09o81j25O1N09L51n25j99k93K75N37L71k31
4686D37n85r9J69M44L0J99r09j12K72L90K79k13m15k15k3M36L19j08n78k51K54
$$ y = [-637, -196, 298, 490, 391, -313, -522, -175, 215, 443, 305, -477, -475, -173, 206, 513, 263, -158, -239, -279, 524, 502, -88, -467, -483, -291, 252, 468, 192, -158, -581, -444, 238, 525, 295, -258, -412, -353, 148, 556, 353, -75, -639, -388, 198, 668, 288, -191, -464, -319, 254, 654, 201, -322, -538, -620, 197, 452, 377, -227, -504, -179, 385, 410, 320, -232, -501, -107, 208, 716, 320, -377, -389, -389, 90, 666, 137, -204, -488, -79, 412, 418, 121, -326, -430, -212, 128, 483, 157, -137, -496, -296, 418, 747, 345, -255, -471, -252, 307, 390, 222, 28, -416, -277, 235, 584, 57, -210, -734, -13, 257, 379, 38, -343, -203, -51, 151, 657, 196, -130, -519, -222, 449, 487, 217, -122, -627, -227, 169, 687, 375, -56, -490, -167, 417, 496, 387, -294, -419, -358, 151, 502, -23, -222, -515, -240, 297, 668, 437, -148, -247, -78, 366, 396, 595, -314, -426, -154, 236, 515, 302, -113, -328, -351, 85, 404, 296, -282, -533, -279]
4707b79M54L75l03n15l93L85M53L76k51n16k39l3N69J66j14l13n57L30N76L00
4727D71k48k32m51K21L73K81l6m23n92N33L26K47P7n18o05J59O60K15j29m26l49
4748d46J99L30N38k77p27j4K66J03N82k65m27l94J88M59M43k15r10J64Q9K49M06
4769C41j75j90m42K89K66N17l26l89l23P2N70J92l09l71j06m9P27qj98k32k88
4790d32O9N53N64l71o95l15K49N98J5N6m84k20J82M76K38k08l59o44M35M43K02
4811C52pm74l82j16P13N19k41k67m60J3M19L47K6m92o05L12M85L76k84k88n14
4832e68O5O72K57j16l27l49K11L63J36l9m86j35J81l3N64qn56j81L7M61J45l60
4854f6l5k65k96R48R7p7n60j31L44J10K44K02o52l47R9O52K7j55k11o2o3K89K33
$$ y = [-279, 175, 550, 247, -268, -661, -276, 177, 553, 302, -214, -453, -486, 83, 249, 135, -178, -735, -405, 171, 471, 223, -9, -460, -239, 134, 415, 379, -44, -636, -103, 223, 470, 547, 29, -576, -417, 243, 458, 329, -97, -446, -247, 83, 621, 344, -383, -397, -131, -28, 554, 289, -138, -532, -344, 115, 558, 343, -567, -403, -314, -65, 341, 166, -24, -466, -177, 89, 606, 280, -109, -432, -360, 210, 402, 93, -278, -384, -433, 294, 286, 88, -144, -432, -363, 190, 754, 383, -312, -627, -378, 220, 235, 291, -193, -413, -231, 245, 483, 275, -84, -728, -293, 150, 352, 345, -129, -511, -627, 86, 605, 364, 97, -363, -350, 69, 416, 442, -50, -655, -343, 142, 518, 234, -54, -568, -503, 169, 426, 310, -17, -366, -155, 208, 344, 305, -181, -316, -135, -168, 396, 388, -168, -349, -312, 149, 294, -66, -101, -366, -662, 286, 383, 306, -254, -385, -41, 69, 313, 515, -137, -484, -385, 267, 294, 139, -72, -134, -197, 92, 325]
4877C25J89m48m25r1Q82j51N7n35J15J56j2M25j24m84j54r7L74M25l07j55l04
4898c39l0M49M54k10m91k10q8P98j02j87o5l21J15N01J32j15l74l05O7K71N69
4919E19n05K9o22J95L30L28K45k94o86J61L78L52J76p03n7k26N20Q3K12n29k68
4940c62J38K58K95J54n10l33J27M45L85m90j32m58M7N76J97m8o52l7K46K68K85
4961C99j46j51p43K65M68M7K88n17l17r9N73K95Rj83o39K97K74M11l03m65pJ20
4983a24J34J12J17j54l15J61J17M35p3o17k44J36K03N98j31l79m54J04L97J82
5003B05j72J38o12L01K49K80j36m33k20K9M58L87j43l42n85n5N29M22rk23n56
5024d88R7L34L69K41o27m18K05L68K25k5j95k82J9J28K97L00n78j79qK10M08K1
$$ y = [325, 514, 66, -359, -450, 432, 281, 338, -197, -82, 74, 62, 487, 363, -121, -275, -372, 2, 427, 120, -35, -339, -369, 80, 534, 324, -167, -377, -465, 333, 231, 44, -21, -342, -227, 274, 406, 291, -83, -388, -321, -50, 519, 14, 43, -579, -384, -54, 274, 519, 225, -461, -300, 78, 430, 606, -97, -154, -380, 140, 223, 435, -94, -362, -224, 34, 329, 483, -27, -360, -233, 212, 597, 107, -25, -483, -436, 140, 337, 289, -363, -400, -154, 114, 399, 253, 102, -641, -376, 92, 139, 427, -90, -407, -506, 67, 362, 371, 188, -451, -154, 120, 531, 228, -237, -244, -124, 10, 122, 239, 85, -230, -69, 48, 483, 410, -207, -451, -315, -112, 486, 355, -24, -478, -374, 23, 205, 33, 171, -441, -140, 109, 389, 253, -180, -400, -371, 87, 474, 331, -11, -596, -651, -122, 300, 291, 68, -488, -391, -57, 312, 553, -74, -492, -287, 81, 306, 281, 86, -196, -177, -49, 248, 548, -30, -209, -217, -7, 401, 422]
5046D22n28j60j75N81j27L57r3l74j83L87L70P0m99l61O0j0P01R9o86k20pL88
5068A2L39j97j38n03J53L37M04k44j40m98K52J79M36O8o49k28J54J29L91j88M5
5089A14j62j51K44J19L09m64l24j40O30kK17m27n35M40P5O44l52m0m60K19j12
5110a58R0M35l11l84J03L95K33J73n29k60j00L80K60q8q6n27o2L99M30p6k36m66
5132c85q5M65L62J16p68K01l43N15J65N7j84o38J04L89N59l31m28N3o6J52L73
5153B83k3q6n18R2J03L44L73n65j12k02K93M44m58o5k53o4M41K53R5j93l98j11
5175c27K47J93K48l63j22j56K65K65P6j59l78k23O58R9j2j06l56k16L18K51N5
5196B57j91m04M4K65J18L37l41l24j79M40K17ll11l95J55M11J37j7j94k61q0N36
$$ y = [422, -106, -266, -441, 140, 13, 370, 277, -97, -280, 107, 477, 547, 48, -313, -253, -263, 438, 537, -149, -369, -376, 12, 351, 154, 16, -487, -334, 3, 407, 163, 23, -475, -223, -44, 392, 460, -189, -417, -263, -134, 257, 69, 114, -48, -199, 45, 164, 473, 9, -315, -455, 175, 173, 390, -37, -572, -132, -57, 587, 235, 195, -265, -46, -158, -68, 367, 56, -328, -225, 170, 403, 576, 47, -213, -313, 67, 327, 239, 153, -374, -436, -37, 393, 317, 81, -385, -470, -5, 357, 473, -295, -94, -437, 78, 243, 300, 116, -522, -418, -29, 530, 199, -229, -176, -242, -90, 283, 260, 174, -344, -252, -149, 195, 568, 3, -109, -311, -18, 426, -32, -97, -350, -414, 27, 280, 375, 182, -216, -327, -80, 113, 361, -2, -124, -280, -15, 250, 326, 167, -211, -434, 224, 323, 311, 205, -151, -367, -49, 202, 257, 66, -338, -294, -29, 89, 426, 85, -239, -418, 22, 239, 236, -75, -470, -315, 96, 233, 216, 22, -239, -319, 217]
5218B17m3M06m72l74j26K76M49m4o9m81l0J6P14j78l28l25mL34L75J01l64l08
5240b58j44M71NPJ45m13N7n3O89Pl00m15j46L70J27K53m18l36K83K13n3K76m67
5263a00p0m2L45L66j24l9o78K9RP34l71k97Q9k53K30M97j97k1l52k5K24L30N5
5286C39l39k67q7K86M11Q1l26l98j8L89L21k35k18k13L0L02j9L59m19l6j39l1
5308b27P45r6m05k39l13L72K43K30q1o24K08J79J76P3N3n52j76M30J15M7J3l08
5330a37j02J06K16K29j79l73j56L37L47R6o9l19l02J52L97n4M8l18j13K26K69
5351C01O6j08p64N4J28N79M4l39Lk63J10L91K11l18l02l41M23M23P3l44j88j83
5373c44J79L71K84m26n52K35J80L46k12J49l86L4j13L43K02j58k11m50L05L22
$$ y = [217, 174, 580, 108, -266, -392, -116, 333, 289, 220, -261, -291, -275, 439, 261, -67, -392, -396, -62, 313, 414, 50, -258, -402, 69, 74, 81, 226, -187, -130, -183, 506, 513, 213, -202, -348, 22, 149, 402, -16, -352, -69, 144, 91, 367, -100, -170, -212, 133, 499, 375, 336, -342, -313, -304, 430, 59, -238, -149, -402, -172, 325, 128, 107, -245, -270, -46, 284, 339, 0, -267, -354, -68, 343, 424, 98, -300, -318, 71, 392, 157, -61, -274, -244, 58, 39, 398, -21, -57, -196, -227, 518, 422, 17, -222, -535, -163, 80, 310, 229, -395, -187, -8, 168, 241, 294, -258, -434, -4, 111, 158, 171, -137, -239, -133, 83, 312, 133, -240, -396, -59, 288, 384, 315, -4, -306, -154, 243, 189, 237, -81, -194, 32, 301, 367, 259, -505, -451, -323, 256, 300, -39, -36, -299, -189, 202, 413, 95, -207, -548, -125, 298, 371, 27, -161, -344, -165, 206, 490, 64, -488, -253, -73, 273, 61, 210, -176, -142, -255, 88, 290, 132, -79, -529, -224, 98]
5393I8L45l00l55k5l4N43K05l21l68k58O14n5L03j53m72p5J22O67k31k14l37j67
5415d68N14K10J54o2o68qJ64L46M5j34m93K19N9P21n9m17l28j02K31K44n0n8k20
5438a60O4j71M20J21j78k07j83J78K25K95l33k62j87J67L39J63j36m09j52L1O56
5459B81p8J26o14O4J75J55K15q9m46j84J79M42Q7m15r8Q3N3O0L98k85k10j08p3
5482b82K80K41j07n13J21Q1K26J42O2l09l16K71J70K43k06m11j93K41O97k75p2
5503I1l48r8M2N11K0O3k63l96Q7L78J54j63j11k91L03J0L42j86l60k32K82L25
5525A60R8l34O6l48K01N37O6k93k25k76L94QK36K63o04l67J05M58J86j19k88k06
5547b82Q1L98J01j45n08L68k03K31L35k42k31j99J86J03K17j38q0k66L30J89n5
$$ y = [98, 443, 143, -212, -237, -271, 272, 477, 156, -212, -470, 144, 89, 392, 239, -233, -308, -186, 481, 250, 36, -301, -468, 46, 256, 410, 348, -320, -328, -164, 182, 227, 93, -400, -181, -122, 599, 540, 123, -205, -307, -76, 168, 118, 60, -160, -96, -267, 153, 274, 96, -111, -294, -116, 109, 404, 71, -191, -378, -211, 128, 291, 155, -254, -406, -375, 281, 203, 329, -285, -221, -46, 109, 324, 235, -211, -395, -216, 226, 313, -102, -200, -117, -64, -4, 394, 109, -101, -209, -282, -2, 239, 132, -381, -260, -179, 47, 189, 251, -58, -374, -103, 67, 310, 104, -307, -500, -259, 438, 163, 91, -257, -355, -313, 198, 218, 281, 18, -378, -291, 87, 241, 78, -33, -324, -21, -11, 331, 145, -215, -447, -165, 160, 258, -76, -10, -358, -157, 380, 446, 153, -72, -348, 46, 54, 290, 553, -51, -418, -313, 145, 331, 212, -76, -282, -201, 197, 298, 153, -355, 13, -190, 41, 376, 134, -97, -296, -110, -7, 210, 72, -8, -274, 56, 245, 190]
5568A90J13n71j88K06J29N57l80n63J6j0N29K89l89n4J27k8k3L63j52k83k36J40
5590b18L83P1O8l01j37K10j55J83K47m95j50j7L66J48j09K2m91J02M62J82k05
5611A66k45K2K0P6L79m12k00j67K54L20J72L0p26k7L3M46M2m8j79l21L73L26j66
5634A68o1l38M3mK65K44r9l14l77L84M15j82k56K12l96J3N73q4j70k36L7L0K69
5657A36N6Qj37l07J53J70L52m31K33o96K44L13J24Mm31k27K20L08J14q8n24J84
5679b22j73O87J09j57m99o1R3K14K48N6q58K50j1N58J56k92m74P2J40%L26n6k02
5702i6l65K47K26R1M5k91l96P0N93J15J24m78k00M1K76L21j11k19l48N1J58K90
5724A44n5k49q8j79N64L27k08l29k69K65K04K43k50j82j2l00L79J14K38m28j14
$$ y = [190, 303, -268, -456, -250, -121, 436, 56, -507, -491, -501, 28, 317, -72, -126, 1, -27, -50, 313, 161, -122, -358, -218, 165, 236, 304, 3, -134, 76, -79, 104, 351, -144, -294, -311, 55, 203, 94, 116, -375, -273, 189, 371, 166, -79, -57, -37, 39, 418, 6, -194, -361, -107, 213, 385, 415, -311, -338, -305, 141, 183, 135, -44, -365, 8, 334, 168, 107, -231, -188, -192, 73, 317, 218, -96, -473, -89, 326, 144, -112, 100, -296, -283, 290, 206, 36, -200, -163, -133, 136, 192, 200, 63, -244, -91, 79, 431, 0, 233, -463, -219, 94, 218, 222, -209, -436, -216, 92, 206, 118, -406, -222, -395, 292, 401, 244, -255, -316, -223, -9, 239, 295, -563, -313, -324, 234, 390, 98, -376, -304, -164, -164, 162, 106, -96, -461, -214, 12, 103, 148, -143, -539, -469, 124, 239, 363, -115, -315, -274, 2, 323, 212, -7, -355, -304, -146, 144, 89, -160, -248, -427, 137, 464, 256, -73, -342, -77, 127, 370, 120, -62, -74, -374, 5, 119, 357, -71, -185]
5745a85J61L16M3j28k28j95J02J68K53p6k54l69K09L94J62O4n56k46J92Q8N45
5766D60l73M3n07J82J27M54j26lm82q4L67L92l04k23o2J37O5OR5j31l35q6N27
5789A39K83j31k01l26L54r6L0J03l56j39J14L55J54p7j85j60k5pM48j0j88j92
5811a13Mk3L37R9l49n27M68K84J28j42o9k72l34N91K65j23k23p6O4J44J02N7k62
5834C0j68p1L87J51k00r1k69p7N5N12P7n01L0j87N11L47j31k77m00JK53K59Q8
5857C29m60O6k49L90J10j08k44J47P7N7o0K55l39n9o7K34J49l36L00m00j3M59
5879B38O9j8l45j41M7P2K44q1j80j79M5K71K55k78l0k64J51K08K00j27j3j53j78
5902a87L72r1R1l37m6L9j51O33j96j49k02L9L23K53l46r0k33J29J42J81j19l10
$$ y = [-185, -24, 292, 335, 207, -21, -216, -114, 54, 307, 231, -23, -392, -183, 211, 373, 437, -119, -365, -173, -85, 460, 87, 130, -377, -195, -68, 386, 260, 257, -225, -309, 58, 450, 146, -77, -139, -2, 63, 69, 164, 33, -302, -388, 139, 422, 291, 90, -236, 118, 22, 52, 155, -201, -340, -226, 129, 283, 206, 21, -139, -164, -171, 277, 267, 79, -113, -109, -132, 205, 304, -45, -572, -104, 180, 308, 166, 97, -175, -509, 82, 347, 224, 1, -75, -11, 133, 235, 292, 30, -138, -209, 178, 329, 129, 38, -231, -308, -253, 259, 336, -165, -135, -322, 189, 536, 405, 128, -272, -271, -18, 241, 329, -131, -65, -314, 76, 186, 78, -166, -19, 58, 115, 55, 310, -29, -88, -155, 79, 228, -108, 192, -208, -221, 238, 307, 289, -56, -197, -150, -78, 166, 85, -95, -274, -229, 42, 297, 19, -11, -275, -124, 84, 284, 157, 144, -9, -187, 185, 94, 185, -152, -198, -159, -310, 323, 127, -22, -224, -185, 138, 391, 45, -45, -278, -149, -7, 174, 55, -255]
5924b55OJ0K77L10j78k86o4RL87m0K02l10j32j1L8J35J36j27o40K23M59n3q1j20
5948a05j25N0J09L52k4k43j12K23jL74k79l45O0J7p8L55L2k73j57J07l2N9L78
5971C42k80l00n3M25L43l12p0l38Q7L4L50J06n25n7qJ88L53L5m06l11J48M72j5
5994B08J44l39m17L43K63M6Nk87l45J18M99K3j21r5j40j6lK74mk8l86L55o7j24
6018i4L07nn07J4N02O9j10j30o9q7K12J59K07m78l40J41R2L27O8k24j44j03J17
6041g6L95J30l51k53J75pJ83J99n94M0M1J04K40Q8l39k49L1J88K97j1j18j96Q
6064g5M0J99q7j18j64M5KL00n2k46k70J56L09R8k39L32l12m9l2M40k29R9K6k66
6088i3m0N19j03j51k47j05J16MJ50q1k88L6K84Q8K04k72k79J28K03Nj2ol83R9
$$ y = [-255, -249, -239, 38, 348, 170, -116, -180, -171, 216, 176, 378, 68, -64, -75, -37, 98, 234, 107, -533, -310, 149, 96, 15, -105, -230, -180, -71, 281, 257, 14, -98, 125, 124, 498, 219, -126, -66, -49, -127, 228, 260, -13, -170, -63, -95, -36, 342, 62, -238, -291, 134, 477, 165, 95, -243, -156, -122, 228, 334, -191, -248, -256, -68, 285, 320, -86, -397, -249, 223, 208, 352, 13, -404, -61, 202, 248, 253, -34, -379, -261, 238, 261, 140, 45, -95, -111, -114, 160, 156, 128, -258, 97, 30, -94, 213, 208, -299, -285, 217, 286, 176, 46, -23, -110, 102, 261, 468, -10, -350, -209, -117, 210, 278, 54, -90, -193, -76, 319, 449, 98, -155, 20, 13, 196, 395, -199, -159, -118, -14, 226, 314, -25, -274, -243, -55, 242, 231, 113, -83, -75, -35, 164, 77, -41, -205, -160, -158, 142, 90, -156, -426, -270, 39, 137, -102, 230, -82, -131, -163, 277, 48, 147, 173, -93, -133, 386, 283, 132, -115, -220, -104, -100, 50, -31, -319, -283, 1, 89, 293, 21, -258, -130, 73, 78, 66, 60, -323, -224]
6112b24L07R5N4k36j69J03L9Q6L50l24j56j35K22J72q7k49j4K26j31K74K16m32
6134a3q1K4L14Q5n2j1m85L4K21M4K16j65k33J26k22N62l42r3j45Jj03M16J72j84
6158H6j65l14K31M70r5j43j39Rm0L71J71m63j02rp0M62j95n1l29L63r3J00L74
6181D29m08k97k5L20J41j29L5N1m72J57L72J72m73J33j31K37R9r0M8m28L3N4L76
6204B04J23m03j07j07L05J52n2O6n13J09L26j15K82J36m43k80L98M25l34j00k03
6225a31K24J76p5O1k66k12J36m9M17j16k20m38K38L44L5J44k89K4p1J45L8P5j11
6248G9l60J87K45r7J18j99%M9j54P7K45j69J55l85m1L62K06m48J53k13Q4J41J86
6271B21r7m18J91q5K50L60n75J05L9k16L66R4J6m76N9J4L91K23l49j55j36j3J85
$$ y = [-224, 83, 178, 232, -4, -173, -70, -31, 55, 405, 81, -75, -210, 12, 184, 97, -152, -166, 60, -71, 203, 419, -13, -94, -70, 244, 329, 277, 266, -219, -185, 36, 80, 296, 131, -102, 24, -198, 364, 22, -71, -216, -215, -318, 98, 270, 86, -79, -393, -162, 308, 213, 70, -69, -60, -100, 271, 442, -21, -123, -132, -202, 260, 65, 14, -315, 48, -45, 55, 429, 21, -276, -301, 19, 160, 31, 66, 117, -355, -198, 174, 346, -127, 6, -125, 112, 211, 121, 169, -259, -226, -172, 204, 327, -76, -183, -290, 15, 167, 115, 181, -332, -223, 103, -12, 270, 406, -37, -317, 81, 506, 172, 72, -131, 93, 269, 194, 255, -11, -223, -87, -136, 281, 165, -55, -493, -255, 89, 124, 268, -21, 3, -68, 77, 115, 190, 79, -281, -94, 151, 54, 172, -27, -27, 22, -132, -55, 190, 21, 176, -209, -250, 112, 318, -130, 23, -190, -106, 35, 221, 124, -294, -103, -188, 62, 422, -153, -48, -9, -225, 141, 235, 251, -225, -166, -152, 239, 462, 113, -42, -178, -191, -6]
6294fJ83k20l4J9j68K99K4J17m03L7Q7K68n7k68k32L9J83L23j80J31m01j62L95
6317b6J11J0Q1m57Q7R1J07J92j47j29o1Q9J86j8O5k00m86M26J97J38l18n7r0K75
6341F6J68j22k07k42l1K02K10J04k5j69o0k4Q8K25K1l30O5r8J85M7p9J04q4J14
6365A28j91L37k20j35q5n5K25J02N7l92l2K73J53r6Qj33l29K24M85j86j91N1l0
6388c2j09K30K55k63j56k01J32K89O8J8k67k14J61K56J89m46j0o9J63J35l0j14
6410a5j54j64k0N42K05j84k61L6j68J55L28l29L1k32N13l09K92n7n14K17N1m7
6432h4P3J21k57k01J32L07L1K11l49J0j58M44j13k60j42p4M47j76L8P6k85k15
6454d24M12J98k38K77k01k57J05L14j48L78m76o0N0J73j61o3J10l31J87J40K41
$$ y = [-6, 177, -43, -77, -58, -226, 73, 97, 214, -189, -152, -65, 203, 146, -122, -354, -315, -132, 191, 11, 142, -259, -421, -26, 85, 95, 176, -281, -194, -103, 4, 196, 49, -80, -141, -52, 134, 116, 181, -19, -505, -79, 118, 256, -62, -119, -209, 66, 234, 112, -95, -337, -368, -166, 44, 148, 123, -46, -106, -130, -42, 183, 204, -126, -61, -159, 26, 73, -6, 98, 14, 128, -63, 274, 54, -81, -166, -221, 4, 106, 163, -229, -261, 12, 165, 69, 77, -56, -385, -161, 324, 138, -53, -2, -32, -141, 89, 344, 81, -75, -276, -144, 145, 213, 231, -36, -250, -89, 167, 356, -90, -100, -169, -6, 129, 99, -15, -169, -333, -353, 189, 394, 210, -51, -15, -183, -28, 300, -29, 2, -230, 283, -26, 266, 209, -305, -88, -37, -84, -11, 110, -147, -348, -216, 91, 122, 333, -16, -6, -164, 280, 167, -93, -235, -309, 138, -38, 0, 76, -209, -424, -12, 186, -52, 225, 24, -233, -128, 186, 38, 416, -60, -120, -70, 103, -58, -121, -11, -342, -155, -15, 226]
6475B26k80K33k09l40M41K38k10k33k5p1M26J35k95p1j02m2K51K41l47n8k5N1
6497f6K46K02k08l8j88L6p4L43k13l30q3L01J37K4K72m26k64J52L85j42K04n06
6519b36MQ4L88o8j14j24j22J19Q4K29Q3n70L20j19J63n4N7j12P6j90R2J82l1m61
6543c20J29K73M0k6P9m63J51J82R4J21j64l32K65k78J99K14k23j06N7J56N2J37
6565B37k97j31j10L27l4K09K30n16j09O2N8K57j1k64j14M46k04J71o14N22k27
6586a12j5J89k1K94j1l95Q2j82K92J37n42K0K71J94j54q1l9r6J37Q7j53R7J08
6609A07k41K0K78n0j4k33J99k03O0L96l22J4j34k02K54J44n2J37l52L13k29L52
6631B42j66l03J74k81J78J90J92m18q1n7L39M00l50l7k31k46N74J41R2n43jJ39
$$ y = [226, -54, 179, -30, -370, 71, 309, 99, -134, -159, -230, 196, 331, 36, -35, -137, -179, 72, 313, -34, -92, -117, -66, 180, 382, 174, 136, -52, -16, -90, 253, 40, -290, -373, -72, 65, 89, 361, -65, -329, -177, 208, 66, 270, -236, -232, -148, 240, 172, 58, -66, -188, -69, 15, 244, 327, -243, 77, -42, 121, 67, 124, 12, 88, -102, -10, 172, 141, -320, -191, 82, 122, 96, 175, -288, -137, 45, 139, 260, 96, -236, 29, -249, -50, 164, -59, -165, -108, 48, 100, 237, -60, -191, -301, 26, -8, 201, 431, -85, -194, -132, -74, 183, 172, -92, -206, 240, 36, 207, -407, 115, -112, -127, 62, 41, 335, 324, -71, 11, -171, 121, 258, -284, -264, 7, 201, 47, -34, -73, -169, -32, 55, -98, -1, 107, -134, -114, 164, 114, 100, -133, 66, -137, -77, 319, -3, 11, -123, -325, -71, 73, 21, 158, -194, 119, -110, 242, 76, -227, -53, -334, -156, 34, 226, -192, -273, -330, 9, 409, 59, 22, -209, -455, 119, 260, 352, -191, -192, -53]
6653e3J20R1j40l1P5K2N7R3k75q0k91M81o6K93l68k41J28K41k4J88j78k61j99
6676d18M47K4L09k85j15k35J56o0J68L26p6k62l8L5K18m7j56k20K36K92k27K02
6698B74l15L0j79J16L59k58r2j81J53M0J2K07q3m75K36L73j12O8m6k13J87m0K17
6721B78l72j09J13J15k66L58o7j52k66K75L14j42K5m07J96j10K09L62n03J54p4
6742f9L4Q1K64p2j86m26K93J18K8o1k13m1O9J15N7J58J63l14j63K46K30k58R3
6765A46l31J27Q8J68o5p8l54K86K1K26J29m54J05j20r8L46r3j46P0k68L65qol04
6789b48O1k04M02J54J19l68k45J76P7J69k36N0K37k35J52J9J07k19l03J16LJ14
6811a02L53l4j67p7j59K89N7k59l72K05K64l1L3R8l48N3J62L06J61l63m46N3M76
$$ y = [-53, 67, 158, 18, -13, 62, 84, 141, 234, -41, -121, -412, 69, 3, 296, -72, -313, -185, 56, 32, 220, 42, -219, -418, 29, 53, 362, 77, -38, -273, -117, -177, -9, 317, 241, -21, -59, -24, 194, 147, -9, -229, 7, 299, 72, 274, -41, -11, -190, -74, 285, 27, -65, -246, -93, -53, -41, 166, 83, -392, -156, 217, 105, 173, 127, -86, 101, 61, 278, -94, -203, -90, 25, -241, 117, 50, -102, -368, -93, 221, 79, 104, -303, -107, -217, -8, 354, -149, 5, -69, -35, 46, 310, 238, 52, -374, -81, 37, 65, 4, -209, -250, -181, -66, -9, 149, 312, -2, -165, 81, 311, 53, 146, -185, -58, 30, 198, 133, 55, -299, -13, 8, 234, 363, -91, 14, -106, -204, 142, 49, -97, -27, -295, 70, 62, 56, -248, -187, -391, 11, 165, 284, -84, -329, -153, -76, 93, -143, -93, 144, -91, 61, 80, 187, -32, -335, -219, -216, -102, 251, 217, 50, -27, -186, 103, 160, -99, -471, -266, -2, -33, 0, 98, -250, -197, -35, 271, 432, 69, -377, -324, 152]
6834A52l3k21K79k37J37J72j89J1j37k51K41J37J6m5Mj67k01M72Pk9k26J65o5
6857hn9M41k37j80K0n9r1K90j19J49l31J74k14M35J28n88J02J24R4l9L16m66j2
6880a30N0J60o2J19j52j2K22j79K37k0k25R7k91J23l4K69k19o3J25k22L18J40
6902B51k30j1R2k68J83J02j93q6j73M87l01K53O2k53m7R7q0M60j90r6l24J61L99
6925B95j10k54n6J15J5K97j19k57j1j92K34K58j12j4k88J10N2O1k7K79n89J50
6947a63P3K20k34p7J96k91L42Ll8o0j84m2L02Q8J12j72j03j30K5pJ03j64J02r
6971a08j57M58k90J04l4n3J3J46K9j75o0QK67k07R5l8k23Q0L38J22q2j95k26P0
6995a18J92PP5k62l7mJ72N1q0k8J93j20k37K01j08K14J0j25J71j67K32r2j81M0
$$ y = [152, 119, -102, 177, -60, 77, 249, 60, 71, -66, -317, -76, 61, 77, 32, 36, -131, -332, 140, 147, 118, -108, 57, -8, -67, 374, 137, -43, -23, -82, -173, 117, -2, 147, -184, -10, -224, 211, 339, -249, -147, -23, 71, 32, 348, -118, -130, -80, 80, 18, 137, -15, -27, 195, 16, 253, 233, 8, 105, -186, -63, -97, 172, -47, -110, 15, -207, 111, 251, 21, 10, 102, -166, 17, 119, -74, -160, -333, 154, -147, 106, 168, -85, -132, -35, -115, 345, 155, 59, -265, -104, 295, 185, -69, -125, -10, 5, 302, 183, -74, -85, -277, -43, 215, 103, 89, -199, -89, -37, 24, -3, 276, -313, -163, -90, 130, -104, -181, 15, -276, 66, 69, 31, -29, -213, -255, 47, 135, 247, 75, -28, -158, -133, -140, -37, -201, -99, -108, -265, 193, -97, 7, -27, -80, -67, 79, 108, -67, -127, -119, 148, -59, 36, -2, -225, -145, 193, 315, 233, 38, -188, -118, 74, 81, 156, -106, -143, -147, 25, 76, -4, -32, 161, 41, -196, 5, -103, 111, 121, -4, 167, 0, 232, 140, -41, -1]
7019aj42mL18o8k50j65K29J08K69n53R6j47K66K2L96m18k91J41J65L4n9K39k83
7042i8K15k04K03k66J83k06m8J82R0m8j15L9l18J27L14j66j7J29L9j23l8K72j95
7065d9m1l3Q5K09J2j13l5j36J42mn0J93q9J47j87K0K39j01l37M6J31J2l8m4mk21
7091b46K97K71k92K66m22O0J35J22k88J31L5j7J67o5k15n5R4J09k16N3K38j95
7113c3J43k00K9L87k2k94k24J29L3K35k01J25r3k26K11K45k08L4k97n1L43j78
7135a13J47K4q6j63J55N45l66k07n5r4K20m6J90o4J1k03k1J83L7n7o8j61J16P4
7159bJ28l03o7J34J46K66O4l08j07Mm2J72L1j10J5j9O0K28j67K9j77j19O6J73
7183I5J00k61N8k23K65P8m3r5k87R2M10O4k82K9L4no2L40l84j32K67j63P4r9J51
$$ y = [-1, -143, -147, 171, 103, -147, -312, -83, 25, 294, -259, -163, -310, -44, -22, 374, -44, -335, -194, -29, 5, -54, 185, -98, 117, -87, 116, -150, 33, -173, -221, -39, 51, 3, -112, -73, -391, -264, 50, -116, -133, -4, 35, -88, -126, 146, -49, -90, -123, -38, 171, 183, 70, 35, -101, 41, 37, -13, 180, 91, 238, 51, 71, 310, 209, -128, -82, 49, 61, 23, -21, -25, -246, 51, 322, 30, 296, -126, -66, 69, 191, -97, 34, 69, 52, 219, 154, -61, -116, -22, 87, -129, -76, 162, -33, 110, -90, -61, 326, 304, 10, -214, -85, -52, 183, -18, 107, 14, -212, -1, 244, 36, 70, -227, -278, 65, -113, 34, 58, -28, -191, -36, 509, 143, -64, -119, -213, 7, -39, 151, 87, 98, -105, -126, 57, 94, 37, -31, -192, -76, -2, 126, -177, -244, -110, 36, 302, 366, 58, -49, -45, -87, 85, 116, 6, 21, 2, 62, 290, 123, 152, -25, -144, -78, 95, 195, -66, -8, -231, 34, 112, 69, -26, -313, -221, 189, 253, -29, 0, 34, 29, -33, 307, -77, -209, 58, -105, -31, -130, 21]
7208B1P0K6m79l7M54J50j73j79J50R4J04l01O1l2j37M38k12J45m1r5j36M85l62
7231A4QJ52j60J49k79M39k06N9m27O7P8J35L60j63m11j79K85L48j73j24m3j7N6
7254c2J2R6l7r7R4k38K61O2J00m82J88M3K7q9P8j46j96N39k30J71k76M41j16q0
7278I3J4j02J86m92Q3J43K05r2p9n8l6J3K65o3N2k19P2Q3J36l8m3j71k57L12J0
7303A7L21j2m91K3K01M8J85k79j71mL6J49p6R4K8j23m4M60j75j45j64Q8J25J1
7327A02J30k62r9K22k5L1J53k02k21j57N6M12j01N6r0j90J03N8K36k28q0L04k62
7350e4J67J4o4o9j57J07K0K1J35K03n24J39N26l32j68k24L00j54J35l6J19l26
7372b22QK04o3K52l12J51k5O2o6K37j64n7l6j99K01L99n32J54j98l1J8L13j47
$$ y = [21, 91, 117, -362, -399, 55, 205, 32, -147, 3, 97, 201, -100, -39, -71, -208, 230, 18, 163, 122, 27, -109, 376, 14, 22, 174, 14, 163, -116, 323, 117, 176, -251, -184, -106, 29, 389, 226, -185, -364, -79, 269, 96, -28, -71, -88, -32, -20, 76, 39, -58, 36, -202, 59, 121, 221, -261, -73, -30, -3, -92, -14, -160, -356, 183, -47, 124, -152, 289, 173, 93, 107, 5, 191, -301, -218, -75, 130, 38, -41, -99, -135, -122, 143, 80, 132, -87, -15, 68, 204, 166, 123, -48, -305, 7, 17, 338, 326, -165, -142, 59, 107, 292, 13, -158, -162, -126, 23, -53, 41, 69, -54, -98, 362, 187, 42, -122, -34, 91, 102, 232, -30, -129, 93, 68, 99, 252, 50, -171, -328, -272, 140, 39, 95, 5, -185, -82, -24, 212, -16, -96, 208, -54, 113, 127, 63, -6, -163, -56, -36, -15, 120, 323, -201, -62, 464, 132, -36, -260, 40, -114, 21, -15, 104, -222, -214, -10, -73, 179, -133, 18, -7, 55, -11, 226, 62, 5, -31, -230, -29, 370, -162, -8, -206, -237, -219, 94, -53]
7395e3J44j02J91JL8m1j01k34M6K57k77J49K9j70K25j59L40k66K37j83k3n3L11
7418C06n78K54j41N8J96j73L02k64k3j5J15J6R9k11P3k14K98L9Mq0j08L3qo4j59
7443b45M29k16l3J11O7o6J13k67P7J22j36J76k10J25J41k85n4L79n25J23J79k09
7465b04M51j40l42K43K76k50J07n5l17L89j37K8N0k06j27J40J32o5J43M1k35l08
7487c86L0N39j00J43l21j0J01l78M69%k09J7j3J92J42l92K44j13o8L3O9L25l86
7510g2j12K93n7l0J11k52K08l03K79J38j89J9j26J18Q8p1k48J90R8l43M55l19
7532a25m8K17J6j73K67J2J7k91p4N1M75k7k84k14L23j73P8q4n4J08R2k07K87k
7556A87m86Q9J12J65M0Jq2j30p9K35J00K04l06J44j43N9l2l0j37M5j49K87l25
$$ y = [-53, 91, -11, 180, 181, 219, 178, 77, -157, -111, 146, -131, 18, 47, -123, 102, -57, 283, 17, 254, 71, 48, -5, 306, -272, -18, -159, -101, 95, -78, 224, -40, -63, -78, 37, 53, 152, -59, 14, -200, 98, 137, 141, 61, -47, -14, -22, -86, -245, 184, -32, -65, 46, 113, 47, 160, -107, -30, 92, -44, 132, -78, 47, 188, -97, -151, 228, -297, -174, 5, -204, 247, 107, -235, 8, 284, 34, 141, 86, -231, 158, 21, 49, 99, -107, -234, -94, 38, -27, 116, 157, -78, -386, -356, 183, 83, 226, -95, -105, -4, -382, 87, 87, -122, -105, -118, 74, 216, -176, 68, -45, -113, -80, -11, 314, -72, -184, 109, 52, 22, 133, -119, 89, -214, 65, 203, 14, 33, -93, 25, 113, 42, -206, -16, 82, -261, 194, -125, -173, 44, 60, -113, 154, 166, 183, -108, -182, -131, 344, 317, 33, -181, 142, -31, 47, -37, -91, 17, 109, -98, 189, 187, -299, -210, -98, 67, 107, 108, 26, -104, -183, 52, 152, 356, 50, 194, 51, 110, 78, 48, -89, -44, -193, 94, -231]
7579b31L23R3k59j69K12q1J71J68l90k4L14q3P2N0k88K2J54p5J3K06k43K87k45
7602cJ5l9Lk02J79r3K42K37l68J21k70K72q2n5J12m9j38L5L17j25m5j27l0M2M5
7627fL4M8j82o1mK32j94O7J64j49J89k42L20r3j55m8J30j9r9J96r1k29P4Q7J78
7652A47p7p3J46j72J59J16k28lk57K28K35m7n4k85J16K92n2k24J75k35k8M0K22
7675A41M2j57k52J75kK6Q3r0j99L16J30k47J97J9l21J77k36J04O4J09j16j28K12
7698D7j17J87nR7k52O1j10pM04j15k59Q3o9O9ml0n3j38K63j34L59j90j49R0Lk7
7724DK31j4j66j75J24K48k88K26k44j9O4K24m4m08K41J08j02K05K9k56jP7r7J45
7748A12K0p0j01PnK86j94K39m6m78L73o6m1j94N1J19L9kp9n3K17j05J4k74K55
$$ y = [-231, 92, 185, -74, -243, -31, -112, 59, 227, -163, -187, 127, 44, 116, 166, -122, -100, 54, -21, -8, 198, -45, 242, -3, 12, -27, -24, -226, -47, -140, 102, 339, -29, 92, -178, 94, 12, -43, 69, 20, -118, -83, 234, 109, 64, -63, -93, -51, -6, 28, 76, -106, -167, -171, 61, -133, -66, 98, -51, 138, -104, 216, 123, -32, -80, 50, 31, -68, 128, 37, -192, -118, -31, 147, 70, -3, 143, -29, 130, 246, 18, 15, -242, -14, 221, 174, 120, -165, -49, 243, 191, -33, 142, -93, -121, -81, 141, 183, 26, -226, -51, -53, -27, 56, -34, -233, 83, 213, -34, 163, 182, -139, 38, -198, -94, -30, 79, -37, -165, 47, -70, 117, 112, 209, -43, 18, -92, -99, 305, 190, -69, 14, -55, 14, 10, -20, -73, -211, 52, -82, 277, 87, -62, 28, 31, 4, 235, 221, 55, -120, 4, 252, -36, 190, -54, -73, -9, 215, 171, -237, 4, 112, 10, 215, 244, -12, -13, 64, -33, 112, 132, 62, -39, -32, -37, 249, 55, 294, 248, -230, 143, 77, 36, -158, -107, 12, 51, 49, -30, -83, 134, 29, 43, -231, 24]
7773B4k4j63j15L79j20J04K1l82K78j46K64k3l14K33p4j37O4J5O1R0j76K5K70
7796A54j39j47K64j01k91L75j30n9J03j21J63r1m6j95L88k52J78j03o3q8J57L8
7818fj72oJ75j65kL72j32m1O2q2k35L73m7Lk07J61j38j03P3j25K49J22k00L48
7842B77k01j15J2R0l0l17K48J84m5o4j21J84O1l81L31j89J48j74K50k28k8J21
7864A3m0K95k23L2k9N5o8k66J69M6l8L8O6l21L25J6j01n8qJ64j91Q8m3O5N1R2
7890A29j85J14J25l54n6R3K23j64K78O1k98J22j19J32j12l1r8N7K9p9J78j19k1
7913i5j46L00k5K49j79k59J16k03J36J1J7oO7O4%K5k62L47j97K5K48m47K07m9
7937e6J92j56J41K9l7l00K80j01j95L31q9r6j34K77K3m8j25o3J51l39N19ok64
$$ y = [24, 0, -163, -278, 101, -19, 85, 106, -276, 2, -144, 120, 97, -217, 16, -58, -195, -131, -116, -55, 35, -141, -116, 154, 15, -132, 132, 31, -260, 115, -15, -74, 29, -92, 71, -20, -66, -261, 127, -125, 53, -50, -113, -201, -44, -6, -178, -184, -9, -174, -176, 196, 64, 23, 85, 3, -232, 141, 94, 97, -110, 51, -87, -190, -117, -242, 7, 129, -71, 277, 76, -39, -27, 63, 33, -284, -36, 148, 103, 39, -82, 102, 163, -218, 113, -76, 72, -102, 148, -80, -108, 13, -27, 268, 45, 77, 48, 103, 35, -231, -62, -16, -54, -16, 50, -271, 54, 70, -31, -89, -97, 67, -124, -36, -79, -14, 37, 129, -56, 58, 183, -171, -227, -134, 89, -75, 203, 264, -34, 88, -31, 101, -11, -42, -140, -83, -54, -133, 45, -74, -95, -241, 59, 34, 283, 104, -155, -39, -242, -106, -95, -78, -84, -17, 47, 47, 72, -190, 157, -40, -15, 233, -214, -7, -56, 136, -20, 121, 150, 113, -187, 93, -8, -203, 128, 39, -57, -191, 86, 109, 61, -64, -127, 24, -315, 204, 198, -66]
7960f6o8J3P0K6L8J4j77J48K00K72m31k63nJ87K10Ql00J12j7J7K0Mk0k7qj21R6
7987f8O0J21kk86P1K28j25J61j55r0J4j05M05k31r3LM73r5k85j43J09o1J80N2
8011A38j21N0j64K43j53o3J5jM7l46O6K61O3O6r0j87J67J52q6Pn8L9o0J10K24
8036C19l16k59K47j80J3K54J85j68N9j89p2L32k82K34l81J42K7O2qk16J20o1J64
8059B6J71r2J74l80mJ31nr0k6K93l16q6R1J75j29K5o9K6R5N6l00J25r4L29k78
8084a52l31N79l02J56Q4j79J66j46m8N0O5J61l78K16r6L9J44j5p7j58P4L18pk87
8108a24M20N9k92q0j36J90l3Q8j39j01j47J96J40J00l33M60m21N7L45k26n8q8
8130a23J92R0J2l16J85r8J23k03J31Rk48J48L72k70J47P6k54k12P2J72q2j10K00
$$ y = [-66, -134, -121, -51, -25, 13, 27, -150, -2, 198, 470, 39, -224, -229, -42, 168, 176, -124, -12, -29, -12, 8, 12, -8, -35, -43, -164, -68, -8, 113, 111, -175, -104, 124, -1, 160, 5, -85, -71, -176, 229, -2, -95, -92, 381, 286, 1, -142, -33, -94, 86, 138, 17, 67, -97, 146, -7, -70, -55, -56, -9, -355, -289, -28, 35, 101, 11, -176, -9, 143, 57, 64, 6, 45, -15, 95, 319, 3, -256, -9, -189, -176, 78, 263, 95, 154, -35, -107, 225, -57, 177, -204, -62, -35, 27, 19, -197, -77, -138, 26, 197, 105, 279, -101, -105, 26, 21, -69, -95, 198, -118, -204, -113, 62, -67, -42, -111, -85, 10, 66, -234, -109, -203, 126, -152, -483, 96, -206, -50, 34, -145, 21, -125, -173, -123, -58, 103, -275, -59, -155, -116, 28, 13, -64, -222, -148, 170, 163, -124, 296, 355, 63, -17, -153, 37, 4, 92, -47, -148, -295, -99, 41, 141, -192, 268, -153, -96, 249, 23, -35, -123, 69, 159, 171, -145, 40, -58, 65, -138, -7, 2, -246, -98, 274, 4, 151, 227, -27, -239, -167, 5, -77, -187, 13]
8153A3l7rR2L5j4k38K43l86L37k12M78l21p4J46N9R7l4k57M5J3K8L46k50k31L42
8178B11k00r2R9O1j11J20O0j08nj43K49k9m78
$$ y = [13, -24, -33, 59, 94, 80, -158, 85, -301, 36, -176, 302, -19, -93, 53, 112, 209, 175, -82, -37, -24, 4, 350, 100, -131, 211, 11, -81, 18, 79, -32, 88, 148, 40, 35, -108, 141, 112, -366]
8191c66
$$ Imaginary data points
##PAGE= N=2
##DATA TABLE= (X++(I..I)), XYDATA
0@%%%%%%%%%%%%%%qJ6j6J6j6K4l2L2m0M8n6O5p3Q8j04J20j36J53j77K01k25K56
36A36k88L21l59M01m46M96n51O11o76P48q26R10j003J106j219J342j478J631j802
55i46J994k211K460k750L088l491L984m601N400o477Q013j0406J4683k4669R3932
70G8003N4152j45238o8441k3636J15960J03551l680j03055j12260J0309J09564
81A5229P4752J8071j05997j06040J3752Q8079R5940k275r6135p4506k3367R4107
93h390J06440j7770p2779q3927k2070R3638Q7869J3553q2802r8762L661O8723
105a2616R0964K7709r6774q8578q300P4439R9688K854p3678r0465k6661R9527
117a891Q5267j779o3054r7516j1111Q4882Q2667J3636q4911p8943l254O0620R5041
$$ y = [0, 0, 0, 0, 0, 0, 0, 0, 0, 0, 0, 0, 0, 0, 0, -8, 8, -8, 8, -8, 16, -16, 16, -24, 24, -32, 33, -40, 48, -56, 64, -72, 81, -96, 105, -120, 136, -152, 169, -190, 211, -235, 261, -290, 321, -355, 393, -433, 477, -526, 580, -639, 703, -775, 856, -946, 1048, -1163, 1297, -1453, 1635, -1856, 2128, -2473, 2927, -3550, 4463, -5943, 8740, -15929, 78003, 132155, -13083, -81524, -105160, 10800, 114351, 110671, 7616, -104644, -94335, 15229, 89981, 108052, 2055, -103985, -90233, -2154, 93786, 91511, -4624, -79130, -102497, -8390, 98050, 80280, 7501, -76426, -98496, -4858, 83011, 96564, 13762, -85000, -81339, -12616, 78348, 106057, 9283, -79295, -87595, -13156, 86532, 89386, 15708, -74757, -101418, -1891, 83376, 81597, 18543, -78973, -90084, -5202, 77465, 91101, 6190, -72753, -76007, -15387, 79654]
130G9654Q000q3155o9982j4853P0500Q1047M869n9054q8361j1979P7216O3693
142E7595J7811n9181q7907q515O1945P8042J6257o7435o9010k1719N9464Q8517
154F5864P569n9309p2152k2612O6073P4677J8152n7187q4560p864N8423O9364
166E6438K4904o3832p6425j2059N3598P7509J2748n7341o9024k3752O0612P3599
178E6975J0237m9569p3430j8096N6097O7545K1439n5971p0807j2241M5880P2204
190E0263K1140n6168o5216j9021M9248P0963J5745m6806o8751k1615N3649O4838
202D8269J8544m5606o9978j7700M6791O7338K0587n0347o2977j9908M3099P0322
214D8434J7406m6978o2111k2531M6130O5851J8370m2697o5595k0869M4973O2698
$$ y = [79654, 87654, 4499, -65483, -80336, -9836, 71211, 76080, 17026, -71335, -83314, -6098, 57595, 75406, 16225, -71682, -80197, -18252, 59790, 76047, 8612, -60398, -82117, -22653, 65864, 73433, 14124, -58028, -80640, -14567, 60110, 78262, 21075, -63485, -71349, -12926, 56438, 81342, 17510, -58915, -70974, -17376, 60133, 72881, 15540, -53484, -77236, -16624, 56975, 67212, 17643, -55787, -73883, -17786, 49759, 71198, 15227, -55580, -67821, -21941, 50263, 71403, 15235, -49981, -69002, -19754, 51209, 66954, 20148, -48603, -70218, -16569, 48269, 66813, 21207, -48771, -66471, -19680, 47658, 68245, 17898, -45079, -64987, -21888, 48434, 65840, 18862, -43249, -65780, -19650, 46201, 64571, 21874, -43721, -64590, -19617, 43081]
226D3081K1776m4020o3486k0835M1347O5546J9376m3371o0180k3874M2181O4793
238D2334J8125l9837o1482k3158M2467O1657K0417l9421o1387k1782L9999O1365
250C9297K1040l8992n9570k3241L8818O1696K0019l6612n9491k4298L9082N9498
262C7246K0671l5345n9866k3338L7951N8257K1748l5027n9001k3609L6933N7557
274C4177K1890l4109n8174k3383L6266N6385K1603l2271n7331k3683L5267N5500
286C2137K2508l1120n7115k3701L3500N4924K3217k9913n6181k4961L2630N4505
298C0430K4138k9352n6392k5257L2081N3905K4959k9522n6722k4744L1644N3945
310B9113K4968l0025n5591k4205L0979N3792K4303k9444n4561k3774L0676N2031
$$ y = [43081, 64857, 20837, -42649, -63484, -22137, 43409, 62785, 19414, -40766, -64640, -22459, 42334, 60459, 20622, -40860, -64018, -21551, 40106, 60523, 21102, -40285, -62067, -22068, 39297, 60337, 21345, -38225, -61466, -22648, 39048, 59067, 22455, -37036, -61334, -22252, 37246, 57917, 22572, -37294, -60632, -22681, 35576, 57324, 22297, -36704, -60313, -23380, 34177, 56067, 21958, -36216, -59599, -23333, 33052, 54655, 22384, -34947, -58630, -23363, 32137, 54645, 23525, -33590, -57291, -23791, 31133, 54350, 24437, -31744, -56705, -24075, 30430, 54568, 25216, -31176, -56433, -24352, 29553, 54512, 24990, -31732, -56476, -24832, 29113, 54081, 24056, -31535, -55740, -24761, 29031, 53334, 23890, -30671, -54445, -23769, 28262]
322B8262K4019k7946n3434k2902K8752N0348K4798k6942n1899k3058K6032N0290
334B6320K5011k5499m9969k5230K4531N0094K5588k3146n1084k6525K4450M9214
346B3755K7774k3282n2110k5999K2974N0388K8713k5045n0686k7105K3593N2166
358B5136K5798k3836n0200k7918K5610M9974K5389k3744n0549k3767K3446M7648
370B2987K7022k5166m7244k2936K0272M7897K4747k2077m4181k7099K1543M5883
382B1648K3368j6350m6532k7355K1059M2621K7958j7579m6336k6501J5882M6905
394A8788K8405k0274m2935k9874J6419M8962K5817j6767m6551k9905K1403M3468
406A6956K7778j5317m9933k5439J9482M3153K8769j9328m3982k6619J6662M7400
$$ y = [28262, 52281, 24335, -29099, -52001, -23249, 27099, 51897, 24955, -26944, -50002, -23970, 26320, 51331, 25832, -24137, -49367, -24836, 25258, 50846, 27700, -23384, -49909, -25459, 23755, 51529, 28247, -23863, -49862, -26888, 23500, 52213, 27168, -23518, -50623, -27030, 25136, 50934, 27098, -23102, -51020, -25410, 24564, 49953, 26209, -24340, -48107, -24661, 22987, 50009, 24843, -22401, -45337, -25065, 22832, 47579, 25502, -18679, -45778, -24235, 21648, 45016, 28666, -17866, -45221, -24162, 18459, 46417, 28838, -17498, -43999, -28117, 18788, 47193, 26919, -16016, -45890, -29471, 19491, 45308, 28541, -18010, -47915, -26512, 16956, 44734, 29417, -20516, -45955, -26473, 16680, 45449, 26121, -17861, -44480, -27818, 19582]
418A9582K2846j7410l9874k9792J9271M2876K3455j3147m4278k4971J7311L7108
430A2977L0441j5487m4072k2347J1531M0809K8343j4691l9656l0273J5477M2161
442A5213K3181q557m2306l1977J8593L8087K7937j1308m4746k4484J1102M0673
454A1408L1816j8425l8708k5494R972M2926K6188j2516m0179k8659J7684L5644
466A1657K5814o891m4551k5175J5625L4136K9592j3231l8139k4560P310M1556
478A3143K5847j4253l3046k9122R834L9120K5460q677m0331k4963J2650L0489
490F151L2744r695m2933k0783P786L5071K9897j2528l4059k8857R020M0727K1571
503C4112p643l3994l0517J2092L4982K6648q473l8552k2202O502L2762L3064j4202
$$ y = [19582, 42428, 25018, -14856, -44648, -25377, 17499, 40954, 27807, -16471, -41442, -24131, 12977, 43418, 27931, -16141, -38488, -26957, 13852, 42195, 27504, -12152, -42425, -26948, 15213, 38394, 29837, -12469, -44446, -25853, 12234, 40171, 28863, -15883, -40367, -29265, 11408, 43224, 24799, -13909, -39403, -29431, 13495, 39683, 27167, -13012, -41671, -23987, 11657, 37471, 30580, -13971, -39146, -23521, 10615, 40207, 26976, -11163, -35723, -28413, 13143, 38990, 24737, -8309, -37431, -27597, 11523, 36983, 28306, -12025, -36988, -24338, 6151, 38895, 29200, -13733, -34516, -26730, 8341, 38238, 25710, -8349, -37206, -28186, 12541, 34112, 26469, -7525, -38042, -25950, 9032, 35680, 27207, -11345, -33547, -27045, 5717, 38781, 24579]
516B4579l4889k1747L490L7095K6884r272l2744k9382J1299L3936K3058l161l6802
529g656k7483J0749L1426K8193r482l3588k3540K332L6695K7895j2860k8775k7291
542c3385M563L6091K3996m929l3969k7235J0184K8449K7497l271l6583k3511O061
555b6042L0678K8458q377k9204k6985K706L7221K2633o466k7970k9626O832L2078
568E936K4373l255l3782k3959N370K7713K9776o411l2583k2794K561L0903K6297
581C0145n406k7998k8514N727L1502K2373j076k9895k8135O509K7850K6708l659
594B6131l1070k3048J482K9041K8199o213k8078k4935J886L0025K4568k306k8814
607c132k7097O072K6515K5034m35l1013k3848L492K6367K6954m159k7420k3522
$$ y = [24579, -10310, -32057, -28567, 8528, 35412, 26140, -6604, -35986, -24687, 9249, 32307, 29146, -7656, -35139, -24390, 7036, 35229, 25747, -7841, -31381, -29049, 7646, 35541, 22681, -6094, -33385, -28822, 7269, 31265, 26336, -7633, -34868, -24684, 3765, 31262, 27991, -8592, -32103, -26042, 4636, 33094, 24717, -4487, -31472, -28766, 8455, 31088, 24622, -3348, -32974, -26142, 5936, 30309, 27054, -6728, -30687, -25317, 2396, 32172, 25761, -6822, -29616, -27055, 3848, 30145, 24739, -3259, -31773, -26046, 5456, 27829, 26753, -3142, -31277, -24768, 3082, 29790, 26131, -4939, -27987, -26505, 2536, 30735, 24522, -3556, -28491, -26605, 3420, 27988, 25682, -3132, -30229, -24157, 2358, 27392, 26957, -4056, -27904, -24412, 1955, 28909, 24750, -2670, -26192]
620b6192J85K9240K4918l734k5258k6194K326K6870K4564m86k8339k4607K364
633b4343K4387K7317j652k8165k3234k38K6495K6528k629k5055k5588K84K7392
646A499K4997j052k6069k5492J338K5778K5564j373k6880k2958k31K5579K6220
659B6920k959k4756k3177j043K6192K4087j548k3733k4254q2K4439K3822L87k3962
673C33k4023p54K3373K5036l8k3163k3805k194K4444K4844k33k2123k4990k099
687b5392K4568K4342J176k2980k4981j741K4141K4687L85k3111k4015j837K3940
700h18K4305J65k2299k4290j442K3710K3253M59k1639k4075j181K2768K2308J482
714B2706k0874k3614j631K1567K3049K014k0731k3637k450K1646K2788K494k0207
$$ y = [-26192, -26007, 3233, 28151, 24417, -841, -27035, -24709, 2161, 26725, 26239, -2100, -26707, -24343, 44, 27361, 25709, -2456, -25690, -25928, 567, 27095, 24466, -589, -26177, -25893, 1499, 26496, 25444, -625, -26117, -24779, 999, 26563, 25190, -1690, -24648, -24879, 700, 26920, 23961, -795, -23972, -25015, 1177, 25264, 23716, -17, -24271, -24353, 86, 23908, 24295, 333, -23690, -24444, -1071, 23965, 23927, 764, -23041, -25235, -791, 24053, 23820, 1697, -23293, -25392, -824, 23518, 24694, 1714, -23267, -25008, -867, 23820, 24205, 1094, -22921, -24758, -818, 23487, 23652, 1353, -22937, -24379, -669, 22584, 23043, 1404, -22671, -23852, -1084, 21224, 22706, 1832, -21782, -23413, -1846, 21203, 23217, 2486, -21151, -23601, -1955, 20833, 23327, 3120]
727C120k3846k617K0945K3091L083k0398k4454k692K0980K3173K998k0320k4128
740b1065k807K0929K3340K630k0180k3669k646K1051K2704L169k0375k3575k178
753b2672K0143K2802K729j9637k2832k767J9574K2071L256j9409k2065l946J9392
766c361K1643M121j8734k2758l329J8409K1986M264j8870k2066l723J8025K2899
779A8506M033j8324k2124m774J8692K2561L680j7596k2792l970J8250K1893M472
792B2507j8333k1884l883J7362K1936M195j7968k1489m775J7471K2305L534j6935
805D043k1097n560J7945K1483M474j6604k1726m478J6868K1131N346j7161k1036
818a6372m701J5930K2196M302j6277k0739o059J7375K0445M218j4534k2410n233
$$ y = [3120, -20726, -23343, -2398, 20693, 23776, 3378, -21076, -23768, -2788, 20385, 23383, 3063, -21065, -23872, -2943, 20397, 23027, 2847, -20822, -23468, -2417, 20287, 23456, 3081, -20494, -22672, -2529, 20273, 23002, 3365, -19467, -22234, -2660, 19411, 22667, 3258, -18807, -22753, -3361, 18282, 22403, 3669, -19089, -22418, -4009, 17977, 22241, 3371, -18695, -22418, -4393, 18506, 22539, 4215, -17909, -22683, -3991, 18570, 22250, 4654, -18138, -22108, -3858, 18035, 22507, 4174, -17710, -21593, -4231, 17705, 21900, 3932, -17557, -22332, -4861, 17444, 20978, 4043, -17054, -22614, -4669, 16814, 21288, 4684, -17042, -21520, -4652, 16479, 21825, 4664, -16372, -21073, -5143, 17053, 21355, 5078, -15661, -21720, -4345, 16100, 20318, 5784, -16626, -21859]
831b1859J7077J9858N414j5482k1117m798J4833K1799M745j5708j9700o338J5654
844e622K1571M364j3818k1530n882J6446J9164O511j4440k2273m519J4560J9627
857A4159O895j5313k0323o304J4735K1125M467j3298k0155p664J6363J9455N576
870A9718j3007k1735m779J4055J9134P896j5152k0601m469J2250K0687O249j3804
883F442j9356p675J5147J9149N218j1393k1316o750J5250J7504P615j3028k0953
896a4146m611J1463J9968P495j4554j7868o649J1723K0238O232j1942k0142o708
909a9501J3945J7240P938j1439k1827m752J1881J7906Q828j3688j8934o225J0349
922h279K1059N902j2547j7667q368J2692J9396O346j1049k0330n852J2098J7157
$$ y = [-21859, -4782, 15076, 20490, 5008, -16109, -20907, -6074, 15725, 20470, 4762, -14938, -21276, -5622, 15949, 20313, 6495, -15035, -20917, -4471, 14693, 21204, 6764, -15509, -20028, -5468, 14159, 21054, 5741, -14582, -20886, -6151, 14974, 19441, 6143, -14012, -21676, -5313, 14142, 19718, 6711, -15024, -19803, -5748, 13386, 21282, 6130, -14471, -18940, -6690, 13997, 20246, 6442, -12914, -20589, -5442, 13707, 18925, 7532, -13784, -20534, -5284, 12220, 19835, 6807, -14146, -18757, -7294, 12674, 20169, 5615, -12253, -18902, -7179, 13059, 19291, 7349, -12793, -19501, -5556, 11684, 19622, 8183, -13644, -18396, -6515, 11391, 20219, 6531, -12403, -18628, -8279, 12780, 18682, 6135, -11532, -19900, -7208, 12188, 18534, 7485, -12845, -18697, -6599, 10558]
935A0558R646j2925j9952m931R812J9225P872j2648j7257q497J1925J9389N201
948A7418r634j8641q415J2908J6973P803j1019j9017n503R319J8249Q886j3261
961F066j6344p187Q942J9536O624j0193j7393q831J1542J7467P068q370j9764
974a0837p122J0644J6859Q881j1276j7291p331Q780J9327P378j1178j5496r669
987a8331J0462J8444O644q780j8756p431J0881J5538R119r364j8919n918Q443
1000g968J7125Q173r800j5964q553Q735J7906O357p749j6211r616J0145J5121
1013G701Q853p299j8820o744Q143J5676J0173r626j7049p683P611J7720Q298q868
1027H086j6091r660R934J6005P980p395j7664q088R308J5314R034q400j7324o378
$$ y = [10558, 20204, 7279, -12673, -17604, -7792, 11433, 19305, 6657, -10600, -19097, -7172, 12217, 17418, 7784, -10857, -19272, -6364, 10609, 18412, 7393, -11624, -17127, -7808, 10441, 19327, 6066, -10278, -17465, -8523, 11013, 17637, 7444, -9949, -18780, -7238, 10229, 17297, 8927, -10837, -17959, -7315, 9544, 18425, 7149, -10142, -17473, -8693, 10634, 18012, 6834, -8662, -18331, -7869, 10575, 17219, 8439, -10317, -17748, -6867, 8671, 17790, 8426, -10493, -16411, -7968, 9157, 17330, 7530, -8434, -16987, -8252, 9654, 16011, 8262, -7949, -17565, -7420, 7701, 16554, 9255, -9565, -16309, -8166, 7510, 17683, 8057, -8992, -16675, -9064, 8656, 16954, 8086, -8005, -17665, -7731, 8274, 16254, 8859, -8805, -16893, -7585, 7729, 16763, 8363, -8961, -15339]
1041a5339O661J6548Q756r187j5294q135P441J6431P533p289j5989q203Q124J4656
1055F714Q912o886j7010p048O581J5400R721q541j5197q071O141J6801Q249p445
1069H321j5113q906P130J5475Q618o959j6205p612O516J5196R783q041j5797p244
1083a4838N919J5850Q746p643j4559q733O638J5446Q290o495j5113q612O604J4862
1097F362Q933o826j5096p884N422J5465Q908p043j4261q463N804J5315Q019o051
1111H604j4273r157O299J4804Q770o170j4614q641N567J4845Q648o047j4127q511
1125a4003N088J4921Q459n912j3500r380N722J4305Q371n281j4128q936N827J4101
1139E654Q252m917j4134q761M867J4716Q631n699j3536r005M953J4652Q178m906
$$ y = [-15339, -8678, 7870, 16626, 7439, -7855, -15990, -8549, 7882, 15415, 8126, -7863, -16066, -7942, 6714, 15626, 8740, -8270, -15318, -8737, 6663, 16384, 7843, -7354, -15425, -9284, 7517, 15766, 8321, -6792, -15698, -8568, 6907, 15525, 8566, -7639, -15251, -8735, 6461, 16244, 8203, -7594, -14838, -8919, 6931, 15677, 8034, -6525, -15258, -8620, 6826, 15116, 8621, -6492, -15104, -8500, 6362, 15295, 8469, -6627, -14511, -9089, 6376, 15284, 8241, -6020, -14483, -8679, 6636, 14655, 8604, -5669, -14826, -8527, 6277, 15047, 8877, -5737, -14378, -8811, 6034, 14682, 8635, -5492, -14003, -8915, 6006, 14465, 8553, -4947, -14327, -8605, 5700, 14071, 8790, -5338, -14274, -8447, 5654, 13906, 8989, -5145, -13906, -9039, 5677, 14308, 8609, -4927, -13932, -8979, 5673, 13851, 8945]
1153H945j3652r166N302J3626Q731m724j4262q337M817J3630R003n141j3484q647
1167a3359M567J3447Q814m840j3209r116M911J3209Q727m098j3461q646M173J3254
1181D373Q914m397j3450q507L933J3060R075m234j2927r073M560J2755Q786l825
1195I043j3087r075M391J2541Q866l824j3066q492L650J2638R189m148j2420q722
1209a2516L647J2782Q914m037j2364q469L294J2540Q937l889j2349q636L464J1999
1223C317R487m253j1873q668K569J2490R009l666j1812q912L008J2522Q814l245
1237H787j1955q639K771J1713R485l348j1712q551K279J2260Q937l376j1042r120
1251a1511K381J2363Q412k789j1331r246K662J1681Q790k430j1737q740K358J1744
$$ y = [8945, -4707, -13873, -8571, 5055, 13786, 9062, -5200, -13537, -8720, 4910, 13913, 8772, -4712, -13359, -8792, 4655, 13469, 8629, -4580, -13696, -8785, 4424, 13151, 9053, -4408, -13054, -8881, 4373, 13287, 8890, -4560, -13067, -9134, 3926, 13001, 8767, -4160, -13233, -8673, 4082, 12868, 9043, -4044, -13119, -8728, 3813, 12679, 8855, -4211, -12703, -9053, 3585, 12774, 8626, -3794, -12516, -8869, 3913, 12827, 8790, -3574, -12043, -8749, 3791, 12728, 8839, -3510, -12146, -8682, 3317, 12804, 8551, -3322, -11990, -9421, 3069, 12078, 8412, -3400, -12312, -9304, 3218, 12032, 8787, -3168, -11807, -9036, 2677, 12162, 8814, -2898, -11449, -9170, 3090, 12027, 8651, -2391, -11511, -9130, 3233, 11645, 8856, -2475, -11721, -9059, 2622, 11412, 8982, -2755, -11495, -9137, 2607]
1265B607R193l429j0570r248K380J2072Q259k374j0668r857K860J1555Q328k067
1279I041j1332r003K328J1059R145k840j0623q799J707J1632Q465k476j0139r547
1293a1382K461J1341P797j205j0877r432K859J0304Q801j564j1106q632J956J0681
1307B002R065k737r878r324J776J1207Q340j411j0436r570K404R837Q820r70j1258
1322b133q782K033R918R394j870j0768q227J343J0769Q034j157r612r676K092
1336h642J0613P436j85j0710q722J937R328R088j306j0331q027Q04R460R190j541
1351H392r269r180J176J0315P861n21r677r414K034R027Q670l97j0680p946R74
1366h635R326R256j715r079q300j36J0277Q495q04r162r508J693Q987Q317k15
$$ y = [2607, 11800, 8371, -2199, -11447, -9067, 3005, 11264, 8890, -1778, -11635, -8775, 2780, 11108, 9041, -2291, -11294, -8966, 2093, 11238, 8398, -2225, -11024, -9317, 2315, 10780, 8304, -1835, -11382, -8921, 2420, 10217, 9012, -1865, -11297, -8438, 1866, 10667, 9103, -2003, -10635, -8679, 2002, 11067, 8330, -1548, -10872, -9096, 2111, 10451, 9040, -1396, -10966, -8562, 1275, 10095, 9125, -2133, -10915, -8882, 1036, 10430, 8560, -2208, -10435, -9092, 1677, 9711, 8554, -1058, -10734, -8642, 1971, 9407, 9222, -1488, -10210, -8273, 1055, 10143, 8837, -1494, -9521, -8717, 743, 9933, 8392, -877, -10057, -8881, 1434, 9295, 8774, -903, -10317, -8283, 744, 9414, 9017, -1663, -9609, -8635, 691, 9947, 8232, -847, -9147, -9283, 994, 9489, 8685, -477, -9985, -8292, 695, 9012, 8797]
1381H797j0015q184R71Q626R192q40r548p741k62R823Q674j437p779r329L76R344
1397F68P868J60q949q763R51Q218R136l01r531q027J46Q557R249j091q168q875
1413h752j95R570P686J72q267r453R68Q713P993M98r124q165K73P788R354q41
1429H218q157q023o18R130P781k90p536r252M14Q978P214J016q764q978R14P657
1445b96Q369N24q634q019n39Q405Q065K2p296q676l86Q682P290J105q359q546
1461h289L16P453Q339Q45q733p703L7P237Q579k88p289q368o08Q262P723R01p488
1478I26r076J16P638P726J080q316p780k52O743R014M81p997p680o76P441Q484
1494G872J03o983q531l11P246P532J447q008p842J23O214Q359J061q222p094q04
$$ y = [8797, -1218, -9402, -8431, 195, 9387, 8547, -1001, -8742, -9004, 819, 9493, 8056, 277, -9052, -8676, 668, 8536, 8696, -253, -9016, -8065, 153, 9289, 8988, -543, -8570, -8424, 133, 9382, 8291, 123, -8752, -8947, 623, 8309, 8481, 214, -9239, -8271, 442, 8435, 8933, -191, -8356, -8083, -295, 9059, 8218, 61, -7962, -8580, 550, 8331, 8041, 505, -8747, -8333, 645, 7859, 8875, 111, -8867, -7953, -296, 8073, 8597, -37, -8056, -8595, -190, 7875, 7897, 601, -8075, -8461, 221, 7511, 8616, 257, -8289, -7973, -520, 7819, 8664, -69, -7772, -7735, -498, 8081, 7793, 504, -7864, -8472, -210, 7513, 8414, 926, -8150, -8034, -396, 7330, 8410, 94, -7686, -7938, -1195, 7819, 8300, 303, -7377, -8053, -612, 7872, 7975, 992, -7539, -7850, -604, 6928, 8375, 367, -7475, -7352, -1138, 7221, 8282, 60, -7034, -7838]
1510g838O788Q535N43p472p496j120P235P735J331p266q127n71O785P798J388
1525H248p555p303j026O287Q537R73p201p344j591P054Q049O44o592p785j025
1540g630O762P458J163o858p619q13O161Q095P85o726p099j339O294Q078P95o300
1556A207p673j494P023P284J288o228p695j202O236P845J232o453p621j403O262
1571a392P517J501o261p516j616O490P216J184n509q242r75O028P428J580n976
1586A457p537j477N918P686J507o120p370j686O263P135J499n863p182j813O046
1601a537P002J749n631p627j347N542P459J837n879p379j558N438P691J793n659
1616A894p777j585N717P556J430n631p331j269N217P310J736n900o940j841N418
$$ y = [-7838, -1050, 7485, 8028, 556, -6940, -8060, -825, 6910, 8241, 975, -7152, -7723, -938, 6860, 8248, 693, -6610, -7636, -1349, 7188, 8161, 960, -6384, -7975, -921, 7128, 7772, 1180, -6605, -7630, -868, 6590, 7753, 895, -6724, -7537, -1376, 6719, 7504, 778, -6321, -7660, -1366, 6712, 7507, 1207, -6466, -7960, -937, 6347, 7635, 1407, -6288, -7490, -1254, 6591, 7823, 1370, -6251, -7654, -1392, 6125, 7626, 1365, -6151, -7767, -1277, 5939, 7123, 1614, -6628, -7603, -1575, 5853, 7433, 1457, -6080, -7557, -1639, 6047, 7554, 1434, -5936, -7622, -1359, 5776, 7275, 1412, -5770, -7583, -1537, 5465, 7214, 1583, -6044, -7391, -1849, 5610, 7447, 1568, -5811, -7369, -1931, 5760, 7553, 1894, -5883, -7468, -1751, 5805, 7235, 1604, -5727, -6996, -1779, 5531, 7267, 1367, -5573, -7414, -1996]
1631a996P406J694n871o597j891N344P119K350n735o977j988N199O993K284n584
1646A750p022j624M804P299K086n610o521k324N064P424J933n343o959j868M839
1661b072P171J839n021o904j801M759P086J854m872p017k048M932P338J886n140
1676A990o570k586N008P021J847m407p081k116M670P017K180n025o450k399M699
1691b202P254J742m735o427k647M675P474J293l997o747k388M533O649K358m746
1706B089o708j992M133O937K290m517o432k631M577O678K041m022o472l254N111
1721b172O856J721l702p234k001M192O604K527m470o385k186L684O923J942m019
1736B280o231k948M654O281K030l433p081k290M471O086K568l762o542k370L648
$$ y = [-1996, 5410, 7104, 1233, -5364, -7255, -1911, 5208, 7558, 1823, -5154, -7142, -1943, 5050, 7334, 1750, -5272, -6896, -2092, 5207, 7293, 1683, -4838, -7162, -2098, 5326, 7259, 1916, -5043, -6911, -2072, 5099, 6938, 1917, -4987, -6788, -2029, 5057, 6911, 2039, -4978, -7026, -2094, 5244, 7130, 1990, -4580, -7166, -2158, 4863, 6710, 2303, -4778, -6894, -2224, 4793, 6973, 1948, -4502, -6901, -2202, 5052, 6794, 2059, -4368, -7015, -2340, 5134, 6427, 2430, -4317, -6705, -2172, 4477, 6835, 2089, -4619, -6611, -2478, 4459, 6749, 2232, -4200, -6831, -2254, 4424, 6465, 2443, -4029, -7283, -2172, 4684, 6405, 2703, -4531, -6532, -2340, 4264, 6791, 2321, -4064, -6250, -2566, 4357, 6299, 2280, -3951, -6899, -2245, 4036, 6066, 2633, -4448, -6738, -2267, 3819, 6387, 2625, -3917, -6287, -2639]
1751b639O938K142m182n860k910M004O620K043l600o409k625M287N786K490l362
1766B723o746k168L672O418K703m142o232k479L558O358K441l582o111k793M021
1781b359O323K245l419o622k259L609N924K893l897n927k636L631O265K421l945
1796B247n495l017L657O278K270l261o204k602L664N809K830l700n955k423K894
1811c008O480K731l807n309l251L306O553K120k999n740l570L725N947K626k965
1826B839o174k295L089N597L181l622n720k716K889O580K175l178n482l435L366
1841b906O242K207k706n913k629L080N521K950l123n789k382K456N948K948l417
1856B487n403k753K743O157K236k360n890l264L447N441K895k631o101k612K882
$$ y = [-2639, 4299, 6441, 2259, -3601, -6511, -2507, 4113, 6156, 2556, -3853, -6478, -2191, 3595, 6085, 2723, -4023, -6191, -2519, 3899, 6602, 2460, -3772, -6251, -2693, 3665, 6106, 2524, -3587, -6380, -2359, 3964, 6209, 2790, -3832, -6091, -2482, 3442, 6335, 2438, -3489, -6125, -2494, 3771, 6192, 2247, -3248, -6265, -2608, 3670, 5940, 2679, -3525, -6127, -2463, 3346, 6176, 2476, -3479, -5902, -3008, 3472, 6203, 2396, -2913, -6164, -2858, 3695, 5815, 2816, -2924, -6494, -2769, 3178, 5804, 2839, -3335, -5630, -2541, 3056, 6237, 2615, -3105, -5821, -2932, 3648, 5823, 2645, -2837, -6272, -2906, 3336, 5543, 2837, -3076, -5705, -2625, 2896, 5846, 2723, -3066, -5448, -2992, 2956, 5904, 2487, -2916, -5669, -2926, 3231, 5467, 3107, -2783, -6047, -2600, 2841, 5736, 3105, -2996, -5608, -2726]
1871b726N544L051k999n601k773K512O163K132k655n179l343L296N411K538k078
1886C293n834l292L097N080L138k493n845k547K420N531L148k914n404k870K546
1901b946N765K272k082n384l339L043M753L284k324n862k706K863M897L337k684
1916B887n464k658K388N416K493j813n412l092K652M559L152j838n806k437K157
1931b816M799L615k301n710k742K019N159L400k433m940l442K471N038K944k020
1946C041n314k878K215M973L370k580m973k652J645N094L254k101n108k781J808
1961b987N190K665j759n090l163K116M824L141j908n160k666J674N005L008j931
1976B959m995k831J706N127K936k115m569l035J987M634K909j565n004l104K120
$$ y = [-2726, 2818, 5869, 2870, -2731, -5504, -2992, 3171, 5303, 2648, -2531, -5874, -2578, 2833, 5371, 3293, -2541, -5833, -2736, 2344, 5482, 2989, -2856, -5403, -2983, 2548, 5696, 2782, -2622, -5492, -2946, 2819, 5091, 3009, -2375, -5714, -2671, 2082, 5366, 3042, -2820, -5526, -2663, 2234, 5571, 2887, -2577, -5235, -2847, 2569, 5062, 3249, -2163, -5255, -2603, 1956, 5108, 3270, -2536, -4973, -2816, 1983, 5598, 3297, -2413, -5155, -3136, 2023, 5423, 2990, -1950, -5392, -2921, 2117, 5061, 3041, -2273, -5151, -2936, 2037, 5407, 2827, -2146, -4798, -3153, 1941, 5195, 3094, -2014, -4795, -2987, 2203, 4868, 3109, -1981, -5144, -3028, 1796, 4937, 3029, -2131, -4797, -3123, 1882, 4890, 2959, -2036, -4867, -3161, 1966, 4902, 2787, -1782, -4817, -2830, 1804, 4713, 3148, -1856, -4960, -2840]
1991b840M456L224j813m541l299J532N311K530j638m712k925J834M728K771j330
2006C288m781l283J731M604L102j482m926l000J619M652K951j446m565l155J372
2021c319N197K814j523m778l124J686M351L311j497m629l174J617M592L094j808
2036B810m361k846J146M555L045j178m661l234J777M447K868j219m495k962J473
2051b835M194K914j077m198l291J308M197L136j512m199k774Q89M443L254j114
2066C335m713l037J556L982L297j210m345l093J197M179L143j146m185k936P38
2081c238M388L121j281m216k814Q18M306L151j078m371k836R99L907L139j096
2096B899m186k838Q62M165L433j433l928l018R44L865L210p76m351k793P21L980
$$ y = [-2840, 1616, 4840, 3027, -1514, -4813, -3281, 2030, 4560, 2922, -1790, -4715, -2881, 1847, 4618, 3288, -1493, -4776, -3045, 1559, 4661, 3179, -1747, -4747, -3128, 1524, 4475, 3029, -1536, -4691, -3319, 1878, 4692, 3169, -1609, -4733, -3047, 1304, 4615, 3118, -1511, -4685, -3068, 1524, 4618, 2810, -1551, -4397, -3251, 1304, 4349, 3171, -1490, -4724, -2947, 1500, 4368, 3149, -1346, -4308, -2835, 1359, 4273, 3196, -1002, -4293, -2985, 1212, 4348, 2836, -1363, -4137, -3248, 1195, 4449, 3335, -1378, -4415, -2859, 1123, 4420, 3210, -1135, -4228, -3031, 1148, 4291, 3145, -1040, -3976, -3238, 1150, 4271, 2990, -1226, -4040, -3222, 1084, 4235, 3157, -1214, -4050, -3051, 856, 3995, 2899, -1287, -4125, -3263, 902, 4335, 2902, -1026, -4044, -3100, 765, 3975, 3199, -1152, -3945, -3224, 756]
2112G56L247j029l876l066O04M131L560j285l843l041N89M017L231r00m123k810
2128c838P69L729L165r55l685k774M66L778L264p86m059k835P51L855K913o09
2144C149l912l205Q61L556L253n26l817l332N38M057L274r39l511l235Q66L721
2160G98K820m98l639l141L72M129K720p40l451k977O71L661K892m75l697k942
2176c497M92L472L254n94l780k977K52M081L010p80l393l490P97L768K966o07
2192B974l642k884O78L116L155m77l541k485j38L709L265q83l127l116L66L274
2208B44L234k21l491l163N62K900L337l48l497k858K88L374K972k14l247l247
2224c375M34L358K990n26l097l389N85L253L022q7l532k916L37L047L428n47l234
$$ y = [756, 4003, 2974, -902, -3968, -3364, 767, 4327, 3042, -801, -3842, -3253, 764, 3995, 3095, -1028, -3838, -3069, 660, 3825, 2870, -815, -3589, -3123, 655, 3919, 3133, -926, -3761, -3010, 845, 3758, 3149, -763, -3968, -3107, 449, 3702, 3176, -641, -3973, -3435, 622, 3896, 2957, -554, -3789, -2923, 798, 3618, 3120, -519, -3660, -3288, 841, 3561, 2821, -630, -3607, -2936, 725, 3617, 3142, -555, -3497, -3005, 467, 3721, 3127, -653, -3630, -3378, 703, 3713, 2933, -460, -3950, -3153, 615, 3581, 2974, -668, -3552, -2874, 242, 3397, 2920, -621, -3106, -3244, 465, 3730, 2847, -280, -3396, -3030, 244, 3478, 3257, -234, -3397, -2835, 65, 3402, 3054, -443, -3301, -3013, 361, 3333, 3119, -128, -3375, -2941, 417, 3407, 2881, -216, -3605, -3020, 233, 3255, 3168, -364, -3280, -2943, 104, 3532, 2985, -249]
2241b49k670k98L655K853m05l136k903O4L424K756m5l561k496K60K644L262p9
2258C076l456k546k00L322L065o84k384l217L0L289K668j61k955k639K12K419
2274a61L153M2l174k672j75K976L413k80l192k686m26L327K871L2k806l139p3
2291b970L083K915o6k769l017j43K941K859M7l021k467l24K784L044l30k279l172
2308b885k79L263K711L11l141k884P7K910K692J61l098k573k86L045K838jk792
2325F9k737j0K638K813R3k607l236K30K721K612N68k904k950k50K707L067J09
2342B933k808k754l18K947K549K93k643l045j08K918K422M03k518k862k39K517
2358c13K883L19k748k855J77K357K912J13k506k947k29K688K609L42k544k615
$$ y = [-249, -2919, -3217, 438, 3291, 2886, -250, -3153, -3089, 335, 3091, 3046, -515, -3011, -2751, -107, 3155, 3076, -380, -2926, -3126, 196, 3261, 2577, 193, -3024, -2994, 295, 2963, 2802, -153, -2792, -2580, -161, 2992, 3034, -140, -2812, -2987, -11, 3402, 3122, -70, -2756, -3182, 145, 3016, 3048, 242, -2897, -2970, 113, 3028, 2962, 193, -2824, -2967, -26, 2833, 2880, -141, -2608, -2932, -148, 2896, 2566, 287, -2885, -3164, 99, 2810, 3121, -20, -2904, -2827, 83, 2775, 2936, -162, -2735, -3021, 24, 2862, 2861, 69, -2668, -2678, -40, 2773, 2866, 259, -2977, -2747, -26, 2586, 3154, 250, -2700, -2950, -243, 2824, 2933, 125, -2629, -2947, 0, 2549, 2842, 199, -2846, -2954, -36, 2386, 2789, 271, -2591, -2830, -313, 2570, 2889, 141, -2714, -2537, -180, 2732, 2845, 339, -2608, -2837, -149, 2460, 2802, 258, -2357]
2374b357l99K490K497O85k647k797l71K515K937K67k612k869j26K403K844L43
2390B803k463l055o9K416K715O05k763k590l74K401K853L07k615k539m13K513
2406b68K558L83k390k700l98K430K716N55k420k581m68K027K814L83k175k618
2422b152m49K144K595M76k126k654o34K352K694M13k099l018KJ886K719O12k082
2439F79k993k42J997K647O18k172k810n95K433K771L07k039k811n48K545K266
2455B053N69k014k879l56K069K588O72k207k682p04K497K613M33j882l015l47
2471b592K219K329M70j714k935k11J890K559P19k208k617m53J905K888L71j912
2487G08k907k55K252K280N82k104k600n83K207K201R28k320k313n40J648K860
$$ y = [-2357, -2756, -266, 2231, 2916, 269, -2528, -2899, -384, 2553, 2820, 208, -2661, -2787, -384, 2460, 2803, 340, -2715, -2784, -368, 2347, 2952, 189, -2401, -2775, -374, 2479, 2786, 171, -2368, -2781, -268, 2290, 2673, 283, -2417, -2815, -385, 2331, 2886, 466, -2115, -2583, -556, 2258, 2641, 466, -2152, -2601, -457, 2138, 2614, 488, -2166, -2800, -448, 2246, 2659, 560, -2458, -2456, -570, 2149, 2761, 679, -2314, -2556, -559, 2088, 2706, 534, -2276, -2871, -438, 2333, 2640, 601, -2210, -2758, -213, 2053, 2622, 608, -2271, -2627, -558, 2030, 2702, 495, -2187, -2891, -394, 2219, 2652, 770, -2245, -2592, -373, 1956, 2426, 712, -2223, -2434, -544, 2015, 2734, 526, -2091, -2544, -639, 2249, 2620, 708, -2199, -2454, -202, 2078, 2660, 556, -2044, -2627, -420, 1781, 2709, 389, -1924, -2464, -816, 2044]
2503B044M98k041k633n22K079K693N12j938k466o33J832K217J107k087k675k62
2519b275J659K453J021k234k530m91J819K633P48k278k516o03K004K408R95k093
2535G20k988j06J530K520J063j918k809m11J727K569N90j826k264r01J782K232
2551A510Q08j401k756o28J692K573N71j549k525q76J812K552O03j812k244p60
2567b430J521K646O16j611k352q43J678K489N46j478k422q96J770K444Q15j823
2583F70k437o04J447K328O74j418k056j127J544K814L94j476k523m03J381K405
2599A613Q52j754k259o82J489K295N50j324k240q96J622K267Q13j113k614r19
2615b300J604K255Q34j618k519n50J322K378R93j607j951j075J368K448N70j230
$$ y = [2044, 2542, 501, -2132, -2654, -575, 2118, 2630, 692, -1774, -2407, -575, 1642, 2749, 662, -2013, -2275, -616, 1837, 2858, 624, -1906, -2397, -578, 2055, 2803, 525, -1991, -2594, -590, 1818, 2813, 720, -2268, -2374, -844, 1676, 2739, 821, -1988, -2399, -672, 1897, 2487, 661, -1603, -2504, -722, 1510, 2318, 917, -1839, -2467, -775, 1798, 2369, 820, -1705, -2581, -769, 1783, 2386, 574, -1670, -2430, -909, 1737, 2353, 742, -1610, -2453, -775, 1714, 2260, 782, -1640, -2536, -766, 1678, 2493, 670, -1767, -2371, -924, 1404, 2078, 660, -1396, -2523, -979, 1835, 2229, 753, -1770, -2173, -792, 1613, 2465, 711, -1548, -2230, -741, 1554, 2104, 780, -1460, -2356, -734, 1533, 2346, 1233, -1381, -2300, -696, 1559, 2393, 775, -1744, -2294, -972, 1406, 2399, 792, -1159, -2234, -866, 1582, 2152, 922]
2631I22k119j231J766K055R32j656k039r21J495K030J092j374k213q00J175K367
2647A481Q83j321k381q18J303K353P41j278k546n54J209K195J029j557k238q11
2663b310J336K289Q76j748j597j216J373K500Q94j400k324o51J240J929R56j262
2679H85k086q40J189K177J149j421k293j145J361K466P02j602j838q13J163K466
2695A520O96j363j813j137J214K128J128j382k189p43R91K476P28j223k103j162
2711b234J441K008Q26j061j984j044J236J887J027r60k207j103J315K041R27j191
2727I24j727j220R13K300Q94j118k227j007J234K241P03o98k220r74R14K178Q38
2744A948j091j869j063J220J999Q97j125j756j418J441J761J025q35j944j282
$$ y = [922, -1197, -2428, -662, 1393, 2325, 669, -1370, -2291, -796, 1234, 2326, 952, -1261, -2061, -886, 1481, 2364, 1043, -1338, -2156, -853, 1500, 2241, 963, -1583, -2137, -928, 1267, 2296, 739, -1499, -2310, -974, 1315, 2191, 443, -1154, -2370, -997, 1503, 2397, 997, -1327, -1978, -738, 1191, 2147, 885, -1201, -2041, -852, 1325, 2474, 1053, -1240, -2385, -1024, 1442, 2144, 542, -1296, -2109, -946, 1520, 2216, 853, -960, -2097, -883, 1245, 2373, 991, -1198, -1941, -950, 1526, 2254, 1031, -1072, -2234, -793, 1215, 2041, 980, -1004, -2048, -812, 1075, 2102, 1142, -1065, -2168, -853, 1188, 2115, 924, -803, -2023, -1110, 1190, 2084, 966, -1261, -2268, -1034, 1207, 1910, 1212, -1008, -1982, -1068, 1110, 1948, 857, -1012, -2075, -855, 1144, 2041, 916, -840, -2258, -817, 944, 1969, 1134, -810, -2092]
2759b092J132J612J445j150j767j103P26K229Q46r98j926r78R55K310O71o57k518
2776a263j094J363J780J057n74k386q10P20K170R36j131j762q85Q35K090J048
2792B094j324j441j380J283J968N34o68j981r03O90J997J023o96j917j063P09
2808a075K105Q68p96j745j454Q17K289O75o91j791j109Q67J740J324j143j799
2824i18p81M65K236P82q72j613j155Q67J773J358j080j723j120Q09J647J307r81
2841A001j740r76O88J765J175q59j751j027O54K007P85q41j460j026N29J921J016
2858A861q06j822j150R29J779J248j142j589j181P14J856J039j073j265j074O59
2874a017J921P34m06j857j493J263J643Q05k58j865j145P18J727R74p01j645j101
$$ y = [-2092, -960, 652, 2097, 947, -820, -1923, -1197, 1032, 1878, 880, -1046, -2024, -1069, 1241, 1912, 1255, -1263, -2357, -994, 786, 1843, 1269, -1117, -1927, -1207, 963, 1899, 768, -994, -1879, -1044, 1046, 2094, 770, -671, -2051, -768, 1200, 1734, 1066, -915, -1818, -1128, 869, 1892, 1196, -721, -1784, -1075, 1030, 1898, 1102, -643, -2097, -1280, 1009, 1684, 993, -798, -1907, -1040, 700, 2024, 881, -918, -1699, -1234, 1002, 1784, 912, -701, -1856, -989, 784, 2142, 1062, -661, -1781, -972, 675, 1982, 1001, -739, -1715, -1027, 738, 1913, 1054, -697, -1724, -1070, 937, 1722, 881, -579, -1605, -1076, 845, 1861, 1055, -767, -1917, -988, 791, 2039, 897, -692, -1873, -1159, 697, 1736, 663, -602, -1676, -1017, 904, 1638, 1232, -625, -2118, -855, 788, 1593, 1335, -530, -1675, -957, 770, 1744, 1043, -602, -1703]
2891a703O54J751Q09l79j717q31L69J783Q58o90j220j440N01J720J215n57j823
2908g00j022P01J560J147o42j577j232P10J922Q14o18j609j143O24J828J073o98
2925A138j635j242P80J623Q17n41j512j096O28J416J138l02j460j565O84J857
2941G28Q81o37j645q81N82J525J134o53j710r88M32J572J148m90j377j245N24
2958a100J410J434n58j818j114Q74J419J090m95j786p35L68J491J347r49j695
2974h17r29N14J676J215o01j544j104O67J304J440p71j703q27L68J767P18j86
2991A187j532r85L28J447J162m69j669j007M40J584J261l64j711j220M53J477
3007C82J158l71j430j166K58J635J105n48j546j029M61J621J071n35j374j237
$$ y = [-1703, -1049, 702, 1511, 1132, -585, -1416, -1047, 736, 1594, 904, -316, -1756, -1255, 465, 1680, 1123, -700, -1722, -1021, 539, 1686, 1044, -533, -1765, -1055, 867, 1681, 1063, -546, -1689, -1065, 763, 1836, 1138, -497, -1739, -959, 664, 1481, 940, -572, -1668, -1040, 376, 1514, 1212, -248, -1813, -1129, 728, 1609, 972, -673, -1554, -972, 553, 1687, 1034, -676, -1664, -1232, 340, 1488, 998, -379, -1624, -1100, 310, 1744, 1186, -632, -1746, -872, 547, 1637, 1142, -644, -1379, -1011, 480, 1827, 878, -817, -1746, -1232, 444, 1659, 1058, -486, -1590, -923, 381, 1821, 1050, -653, -1480, -1112, 655, 1373, 1187, -345, -1330, -1002, 445, 1607, 1138, -531, -1538, -1098, 486, 1747, 1383, -328, -1548, -1095, 382, 1540, 1169, -261, -1427, -1169, 466, 1571, 1023, -523, -1552, -1091, 530, 1601, 1066, -308, -1545]
3023a545N80J342R59J7j840j037O02J411R72m73j426j019K90J667R00l75j308
3040b83j181O22J289J180m36j500j434P50J419R13l65j380p84L33J375P92k72
3057A038j253j334K51J732Q40j07j471r87J90J150J286n28j088j238N62J067J229
3074A339m46j271j090N48J261J036o5j646j061L77J242J276k11j803n94K22J065
3091A79J285m42j517o93K56J051J067k71j325j016K53J215J062J98j700r35O00
3108g33J261P63l05j399p10k8J408J075l20j305j109L78J126J343l82j631m60
3125a028p9J539P25q2j361r35K27J322R49l16r75j382M52J291J142n10j239p22
3143i82O4J069R87j16j386r72J29J403Q58K3j319q84Q9J400Q20k84j305q40R2
$$ y = [-1545, -965, 377, 1336, 1353, -487, -1524, -922, 489, 1461, 988, -438, -1457, -1167, 500, 1400, 1025, -283, -1464, -842, 447, 1627, 1191, -309, -1743, -993, 426, 1339, 974, -406, -1190, -857, 518, 1310, 1038, -215, -1549, -1298, 434, 1274, 1167, -304, -1291, -1101, 49, 1335, 807, -281, -1519, -957, 110, 1339, 893, -378, -1468, -920, 341, 1377, 1312, -334, -1395, -1018, 224, 1500, 1289, -514, -1108, -886, 179, 1464, 1022, -495, -1188, -932, 119, 1186, 915, -410, -1426, -1173, 42, 1104, 1302, -398, -1333, -733, 528, 1291, 986, -413, -1123, -1151, 257, 1332, 1012, -293, -1402, -1024, 102, 1445, 1063, -568, -1028, -1107, 432, 1157, 1075, -286, -1221, -994, 328, 1277, 961, -14, -1396, -944, 347, 1489, 979, -260, -982, -918, 151, 1138, 1022, -364, -1336, -1207, 196, 1054, 1077, -242, -1126, -1037, 363, 1183, 899, -406, -1246, -1154]
3162a154J387P50p2j154p36L8J068J088q0j150j023j77J309J178m84p38j075j1
3180a036J163R00Lj090j174L59R48J306j11j324j083M2J162Q45q0j090j065K42
3198a083J417N50j4j086j147K91J371Q71j97j149j073L46Q12R71K11j181r89J10
3216i69J278P95m5r69j118k5R97R88J87j155r40J42P86J197k14j392o21q4J204
3235D2J026j35q26j284Q1J110J013j1j417p27J27J170R57k75j027q84J72P10J344
3254A166j24j034j009L56M83J299j54j159r10K73Q30J055k09r67q66J74R28N17
3272F49L94j293p47j48Q71J430k0j242r40J7R97J260j06r46r91MQ01R07j05q31
3292c9p87m11J054J102l7r41r25J23J015R68j73r52q32p5J062Q26n4q82p73k32
$$ y = [-1154, 233, 983, 911, -243, -979, -941, 127, 1215, 1135, -15, -1038, -1215, 94, 1272, 788, 50, -1025, -1036, 127, 1027, 1030, -60, -1234, -875, 73, 1379, 1268, -56, -1139, -1097, 65, 910, 830, -260, -1325, -1083, 334, 884, 870, -216, -1363, -1072, 299, 1170, 973, -176, -1249, -903, -91, 880, 1091, -90, -1079, -969, 309, 1104, 1059, 90, -1028, -1053, -56, 932, 1119, -36, -976, -834, -48, 1149, 935, -457, -1078, -1162, 42, 1068, 933, 107, -1177, -1096, 14, 1027, 1016, -401, -1128, -1001, 169, 1126, 851, -176, -1060, -888, -178, 1166, 1042, 8, -1001, -645, -162, 1137, 983, -176, -1086, -813, 17, 1072, 863, -104, -970, -796, 132, 649, 1043, -250, -997, -1145, -274, 1156, 1136, -106, -1046, -1029, -32, 1228, 1122, 176, -815, -811, -10, 897, 792, -39, -826, -1237, -183, 919, 882, -59, -984, -861, 154, 1122, 949, -3, -835, -910, 152, 978, 924, 42, -731, -963]
3312i63Q53R66K41j200r79J99R06J065j09j184o97j65J028P88R6r97r24K1J322
3331B67N48J70r81p65l3R22Q54J35j110j221q0J318P28J09q84p69PQ62J020l03
3351G94p71j087n4J102Q79R7o89j260R2J014N86K35q49q49j77J053P61J18j009
3370a4o99j0N85R43Q2j177m75k59J191P44p0n40j123J19R87L37K43q45q40j50
3390i71Q49Q62J33r98r09K37Q33R20M7r27o99l18O13J059J64p48q78j89J126P39
3410I45k36p34q92p4Q96R28k04n81q88j2R75P64J1r86p28k76R36J061Pq08j017
3431i13P2O68R53M3o16r00j92Q10P40L01q22q60k11Q22J132k66n49r51l92J136
3451EP52J3p15q97J69N55R12J54q91p84j49P80Q79J42p39q57N1N60P69K36p51
$$ y = [-963, -110, 856, 1097, -103, -1082, -883, 23, 1088, 979, -205, -902, -1067, -39, 749, 845, -152, -1076, -1055, 267, 815, 985, 4, -761, -794, 128, 982, 1117, 7, -1214, -1294, 24, 752, 861, -23, -792, -785, 77, 1097, 794, 23, -1064, -1118, -16, 863, 960, 271, -989, -897, 117, 703, 938, 89, -760, -937, 116, 877, 995, -14, -713, -723, -138, 805, 887, -290, -765, -1024, 167, 911, 841, 301, -822, -703, 284, 621, 864, 19, -821, -971, -122, 740, 873, -125, -1034, -797, 36, 956, 1003, 76, -623, -941, -328, 731, 895, 147, -731, -920, 206, 945, 709, -25, -917, -991, -95, 833, 629, 48, -840, -852, 123, 887, 898, -88, -816, -1092, -156, 905, 912, 104, -913, -841, -173, 780, 823, 207, -693, -885, -75, 665, 966, 144, -716, -927, -105, 1027, 761, 212, -739, -1131, 5, 757, 770, 55, -842, -673, -118, 794, 948, 57, -727, -876, -96, 783, 925, 186, -671, -620, -60, 709, 945, 194]
3472A94r07p1Q03Q82m9p44q59r4N64J085j98l40j149J47P15O70K86r13p22j70
3492h70Q43P14On47o87l26P62R01nn50j003n2Q74P98N2o30j137n0P22J015L5r52
3514h7p01o0P02R43R8o67q74k1M68R36J89p57q96l3N59J065r8p48j006K13P20
3535e5N86L56q15r60J24Q08O84P4l00j289r3R52O30J01m97j208j53P68P10N34
3555I57r16p03RM99Q78J27r21p49MO26R86J51r44p03l12R20Q73K20p81q56k59
3576h94O70J071Op92q65j2P35Q42j31k47p97m83P01P11J79o86o56k88O87R55K97
3597A003r32o69k56N51J145l4o13o75m65P31R44l2m49q77k84O56M90Q20p48j028
3617g22o5O48J095j10p00q16j50M26J015K11o30p68m21P48Q59J22p16n13m16O87
$$ y = [194, -713, -784, 19, 901, 852, 108, -751, -845, -281, 804, 606, 266, -883, -736, -21, 649, 935, 22, -700, -870, -27, 687, 693, 146, -541, -867, -105, 796, 791, 241, -762, -814, 60, 858, 910, 280, -857, -907, -185, 830, 865, -87, -788, -848, -146, 797, 895, 228, -646, -667, -199, 737, 926, 169, -727, -760, -201, 864, 766, 18, -988, -775, -55, 531, 887, 72, -888, -764, 44, 728, 802, 502, -787, -880, 72, 702, 803, 306, -902, -1055, -287, 423, 957, 41, -662, -653, -154, 724, 851, -70, -819, -815, -189, 797, 948, 4, -699, -1011, -91, 782, 1002, 221, -635, -894, -224, 847, 853, 61, -804, -816, -81, 761, 630, 383, -414, -897, -196, 515, 694, 8, -648, -936, -249, 706, 1003, 71, -598, -854, -303, 842, 808, 195, -480, -945, -214, 730, 698, 249, -628, -912, -256, 234, 1054, 306, -722, -787, -139, 956, 846, 146, -670, -820, -394, 621, 832, 202, -566, -987, -239, 620, 742, 26, -487, -903, -216]
3637b16R30O6n22q39l20Q59O76K31n03q44n68R79N89J74o36r44K9K53J010N71
3657I75p81o79J64J07J002K9o93p67l44R68Q05J35p24r13j80P78O37N18p55p72
3677d90m16P27P89J39n12p49m90O63Q93L01m68j064l5L63P84L12m51r01q7N71
3697a21O33K82m66o23o70O37J123M0p75n82k47M23R34J26o81o33k34O80N96L45
3717G87p47o46p6L64Q17J92l19q91m6J69R82K43l94q26k53O60M50M12o05o28n15
3738h70N93P92L11n58p12l05L89J001L05p01o99o64Q07Q01L65l71j036l25M23
3757d54J007L36m98r43j05K98Q45M49p26r34j95O19P61N31o97q69J3M17P39K24
3777H18n09o61n18Q43L65L73o27n78j27N14Q92j88m01q31j32M32J008%m30n11
$$ y = [-216, 714, 780, 258, -581, -901, -42, 634, 865, 362, -482, -1050, -71, 518, 692, 56, -888, -859, -606, 404, 975, 194, -485, -321, -214, 788, 817, 124, -643, -987, -19, 786, 921, 197, -716, -896, -118, 519, 1037, 282, -490, -906, -179, 610, 749, 237, -512, -1002, -339, 554, 855, 387, -677, -712, -349, 435, 747, 296, -605, -692, -121, 512, 794, 328, -295, -965, -328, 795, 835, 60, -522, -769, -346, 588, 714, 33, -600, -834, -154, 442, 787, 40, -606, -682, -318, 499, 691, 372, -519, -565, -396, 586, 829, 435, -391, -644, 16, 466, 878, 273, -355, -870, -277, 515, 826, 268, -444, -749, -360, 641, 946, 245, -454, -1118, -311, 490, 855, 484, -552, -877, -454, 553, 889, 391, -552, -657, -359, 486, 935, 209, -725, -920, -301, 460, 991, 294, -575, -562, -145, 594, 818, 309, -352, -870, -27, 338, 711, 84, -494, -621, -107, 785, 597, 196, -635, -767, -335, 673, 673, 243, -268]
3797b68m53N22O00M98n74o99m40N73Q25r4o1q20l55M53P50N08o98r70J5L38R44
3818E94J82m46r29j87N27N65M72o31n38l78N71O83L38n68p34l09L82P52J70k92
3838B24p01k39L59R43J63l80o73l47K79R34J49m55o83k67L30Q92M9l06p13k33
3858f75L43O56N37l89p11o15K23J181R5l99m62l96L81N92M64m40q66l82O79N90
3878D06K58m59p42l19M70J036Lk80p16j34K82O72N5J3q58m13M09N88N42l06q66
3899c59l03M98P31n5o0p82n62N48O42L82n11n25l38N48N83L11o74m48k35K99M51
3920A41N76m97m66l84J47Q65L36l61p84k12K65R24j9k97o12k37N46M98L31n31
3940B29o33n06O36O99K32k31q24m27O76M24L34m23p47j21L65O00K79j59r15l05
$$ y = [-268, -721, -199, 401, 899, 325, -374, -814, -241, 584, 490, 429, -391, -746, -293, 457, 965, 267, -703, -688, -350, 594, 776, 330, -599, -786, -259, 306, 778, 147, -391, -769, -198, 485, 823, 255, -479, -788, -406, 346, 516, 224, -477, -716, -357, 586, 749, 369, -304, -651, -372, 562, 711, 256, -427, -694, -364, 528, 577, 271, -442, -675, -332, 324, 861, 472, -239, -854, -631, 550, 645, 246, -216, -612, -231, 361, 825, 385, -481, -863, -184, 406, 664, 205, -537, -856, -386, 650, 653, 373, -343, -477, -195, 477, 532, 545, -313, -726, -317, 271, 813, 507, -359, -662, -164, 567, 512, 452, -330, -892, -344, 298, 680, 169, -356, -694, -146, 437, 748, 74, -374, -609, -310, 141, 717, 220, -246, -630, -483, 382, 718, 357, -427, -639, -374, 550, 531, 234, -378, -615, -69, 429, 760, 229, -404, -910, -274, 425, 657, 426, -398, -825, -149, 275, 609, 186, -561, -682, -317, 283, 562, 403, -512, -817]
3960h17N77M23M11j23p99l42J97Q50M41l49p33l43N25L94O70p56n62kJ52N36L34
3981F84m00p66q5K03P17K64m81k13p91M03P33O09l39o33n83K51P92J39j79p89
4001d64k81O00M26M70l65p13l25L84N17M04l51o21n97O56P78K7j00p83j98J55
4021c81M04P82o48n41j02M5P64K12j81n18m33L11O70K11l42o17l71O22K35N61
4041F83l58o10k98M50M20L20k69n82n60N40O84K14j65q39k87L59O51K36k59r76
4061f46k14Q06K99M30m14n30l85M3J060p1o0p20q0J65P99n0m16l4p74N99M83M28
4083G18m11l25n50M00P09J8j22q38l21L46O82L59J41j021j66N1N90L68j84n59
4103a15m01l2P50M16j90o98k86L05O39L15k00p28l50K25O19L39r7r09l25N63L39
$$ y = [-817, -240, 183, 594, 471, -328, -670, -473, 377, 818, 469, -264, -607, -82, 312, 982, 226, -336, -338, -186, 350, 684, 284, -482, -567, -364, 353, 617, 136, -77, -868, -465, 268, 877, 538, -95, -678, -427, 365, 504, 325, -464, -745, -145, 281, 751, 386, -327, -652, -268, 249, 653, 302, -319, -916, -260, 518, 545, 445, -338, -536, -381, 23, 805, 157, -384, -486, -441, 323, 535, 354, -164, -597, -286, 384, 595, 253, -364, -735, -113, 122, 683, 325, -285, -583, -133, 287, 607, 338, -244, -804, -264, 420, 634, 469, -370, -657, -298, 353, 589, 330, -646, -860, -54, 245, 675, 261, -269, -654, -611, 449, 378, 318, -402, -482, -317, 482, 432, 16, -18, -792, -193, 290, 718, 307, -18, -568, -168, 541, 559, 437, -401, -722, -376, 306, 665, 806, -215, -381, -330, 260, 628, 444, -115, -516, -548, 202, 618, 428, -270, -556, -251, 388, 703, 503, -225, -575, -350, 269, 608, 511, -398, -723, -160, 179]
4124A79M25j42o10n75L40O70L6J76n76o36M47L57O19k50p22k20Q8P24L23k85o87
4145c19l35M00M82M46l67n87r3j54Q61L63m35m04n91L00P51K95k89n42l22R6M19
4166b5N06p5p15l53K65O66N40l29n46m02K92K35N96j87o92m58M09M41M43p3j154
4187f16n1J86M16P88k09n51o82L67N33M07n1p84l34J0P56K96K10q65n05P88J27
4208B36L50j65q57j32J4R11K26l87m36l52K1N46P11l64o69k02N0Q25M11k29p80
4229b72l36L72M59L39l17m23l43L36K64L91k99l39n00J94O98K42j61o97k83L82
4249b93K09N75j43n03l52j73Q90M67j62p61l81M86K95M39j88m99n49K18M55N02
4269E32k03n03l64N9Q00M29k96n11n21J69N09M45q6m31p67L42M24O56k58o57l89
$$ y = [179, 604, 462, -148, -723, -383, 287, 323, 499, -77, -713, -266, 91, 710, 460, -262, -482, -394, 330, 653, 368, -319, -654, -254, 228, 674, 307, -280, -373, -527, 334, 697, 262, -142, -733, -433, 318, 613, 324, -218, -540, -444, -25, 481, 406, -309, -662, -397, 269, 809, 480, -66, -468, -176, 59, 655, 468, -224, -682, -273, 168, 611, 538, -616, -667, -481, -65, 723, 514, -37, -719, -352, 181, 588, 537, -247, -581, -571, 185, 481, 691, -174, -679, 109, 236, 586, 421, -436, -568, -554, 357, 583, 196, -240, -592, -571, -25, 686, 322, -347, -549, -499, 326, 737, 508, -272, -608, -236, 223, 562, 245, -178, -521, -185, 79, 470, 171, -168, -668, -474, 224, 466, 305, -392, -675, -293, -84, 491, 348, -155, -507, -680, 210, 677, 515, -246, -627, -141, 154, 593, 405, -94, -643, -425, 30, 532, 329, -174, -538, -479, 321, 750, 454, -57, -578, -409, 100, 545, 459, 28, -739, -397, 27, 683, 425, -232, -621]
4290f21K61O11K76m9m98n48M24N04N8P0n41l98M3L65P93k81n97m34M94J87M74
4311E93k78k82p91L93O48J46O2p22k54M4N98O89k32o95l10l3O83J35J16o53o16
4332g59J61Q93K16jo58o8j27O78K79k70p52j20J6Q09L49j83m22n41M09M62K34
4353F05k25k48p80J50M79L99K04o34l40p3O51J62J22n11o48K57N71L82l26l92
4373a95k11j92O66N32k08m35n78J09N39N96k41o07l89J82O31L74k76n59k79n4
4393e95M10O35m2n16k14L89J85L44j24m79n25J18L04N69J65m18p95J85N65J79
4413C40L2m05l70J06L74M37L5n14o75K21P14M71j10p86m56L09J75M58j44l26n39
4434f53N9P63L14J24p58j74j55P41J02j02m33l45L45J69M95k30l36m84J6N52N32
$$ y = [-621, -360, 251, 527, 478, -20, -568, -144, 360, 418, 488, -53, -451, -408, -43, 750, 469, -128, -562, -68, 119, 593, 315, 33, -758, -365, 283, 429, 491, -231, -485, -441, 157, 846, 614, -81, -391, -424, 259, 394, 510, -143, -759, -598, 295, 511, 510, -148, -216, -343, 335, 614, 344, -408, -528, -512, 297, 646, 463, 41, -500, -91, 371, 605, 380, 132, -648, -498, -19, 380, 584, -50, -390, -463, 188, 350, 472, -39, -687, -430, 141, 523, 197, -195, -406, -598, 68, 600, 392, -43, -621, -512, 27, 623, 382, -225, -614, -432, 199, 573, 297, -262, -541, -595, -185, 450, 408, -108, -322, 67, 252, 596, 472, -7, -532, -414, -110, 459, 624, 206, -589, -404, 161, 340, 372, -33, -403, -297, 77, 514, 549, 35, -640, -419, 295, 766, 656, -130, -586, -277, -102, 356, 212, -114, -653, -594, 169, 483, 607, -151, -325, -480, 261, 363, 261, -172, -517, -172, -3, 492, 262, -74, -558, -542, 10, 542]
4455E42j69k67p10L67L90J76K68o09m44J14M26K06J82l21o47J3M78O25k96m68
4475a44l03K1L55P73l40l90o86J13O36R00m62m97l35m9J70O90K48q07k80m0K84
4496a43P57o6n02p26M78M46m4j4k99m41K7N48M76pq59j25o1M57M19L26p13l62
4518d28n9N40L24l11N3q65O8R37J74k4l96n53M1M52L26jm33q3j8M01J51J04k46
4541A54p13M1O12L82j30l20m52P6L11M92p1n65o1j64O30J75p0l95o56J58M75L77
4563B86L24o58k09j14M67L09m4l04k81m08P67M28m3n36k99r3L63L82K25m43n98
4584d79J81J04N44J35m32n95J94K65P06m30j62l51j99M08M58m3k76n36q9M95O23
4605E21J74p71k69o5L64L85K49p71k53J09J09N62K40n12n25q9M00L56K39l90l80
$$ y = [542, 373, 106, -604, -237, 153, 329, 597, -12, -456, -342, 84, 290, 472, 151, -496, -483, -5, 620, 324, -144, -447, -426, -71, 702, 362, -28, -714, -601, 35, 935, 473, -24, -359, -408, -238, 452, 700, -107, -387, -427, -143, 614, 548, 46, -680, -202, 244, 200, 186, -113, -554, -527, 21, 497, 490, -369, -494, -555, -98, 321, 647, -66, -428, -487, 53, 377, 66, 119, -746, -678, 259, 433, 409, 13, -540, -499, -47, 279, 278, -155, -238, -256, 145, 296, 400, 154, -559, -518, 94, 476, 346, 26, -426, -350, -39, 453, 382, -183, -244, -408, 222, 397, 327, -68, -724, -566, -91, 286, 610, -48, -257, -371, 96, 405, 361, 57, -224, -632, 135, 563, 520, -16, -315, -408, -45, 337, 562, 119, -479, -298, -194, 350, 485, 53, -542, -348, -83, 623, 193, 31, -320, -519, -111, 347, 304, 28, -508, -597, -102, 521, 695, -76, -345, -410, -46, 339, 588, -183, -436, -327, -218, 344, 584, 72, -453, -542, -142, 214, 453, 63, -317]
4626c17K3L21K56K20o36k05k06M39M93J33n26m46Q0L15P58j31n11l17k26N48M47
4647E12j28m37k20k78L68L97K50l59n09j43O15L56j29l60k74j72M51L99j5j80
4667A44m41l0M34K65R7l38n00j7L32L91R0o56j11p7M81M84k49k13n59J51L01J48
4689A27J28j82l13k26M17M21O1n30k94L4L10L47J41n14n17L1M49M53n7k43n13
4710d70L77K63J86K72n88l84K30k08O97J10l35n57m5J91P91r2k98k27m68L82L73
4731B00K43k21n45l3Q4N74M61q06m25rL92N55j47l71p5n46O20L75K33l31n28O0
4753b40J11L09L15k87n34o6L71J93K14n78k51m0L78N44k6k64o36pM37N16M8l33
$$ y = [-317, -294, 27, 283, 503, -133, -338, -544, -105, 388, 521, -5, -451, -371, -56, 702, 571, 60, -257, -483, 65, 512, 384, -53, -273, -551, -183, 214, 464, 105, -404, -547, 68, 424, 295, -65, -339, -511, -60, 339, 324, 144, -297, -327, 107, 372, 469, 131, -369, -386, -54, 337, 427, -229, -340, -417, 64, 548, 299, 86, -473, -322, -21, 127, 255, 73, -240, -466, -49, 372, 433, -97, -391, -357, -47, 300, 441, -73, -590, -559, -110, 343, 286, 43, -470, -93, 170, 356, 628, 40, -344, -114, -322, 375, 485, 150, -407, -452, -261, 530, 438, 140, -87, -555, -173, 200, 443, 222, -323, -356, -272, 302, 763, -43, -468, -477, -85, 470, 323, -48, -123, -669, -49, 326, 559, 228, -300, -240, -129, 180, 495, 208, -326, -392, -21, 172, 386, -192, -443, -483, -105, 439, 413, 149, -487, -494, -57, 459, 507, 174]
$$ [...]
8191B82
##END NTUPLES=NMR FID
##END=
