##TITLE=1H_PR192_5Na
 D2O, 8 sc, 
 20.10.2020
##JCAMPDX= 6.0         $$ Bruker NMR JCAMP-DX V2.0
##DATA TYPE= NMR FID
##DATA CLASS= NTUPLES
##ORIGIN= UXNMR, Bruker Analytische Messtechnik GmbH
##OWNER= root
$$ XWIN-NMR		Version 3.5
$$ Tue Oct 20 11:13:21 2020 Russian Standard Time (UT+4h)  she@DPX200
##.OBSERVE FREQUENCY= 200.1315066352
##.OBSERVE NUCLEUS= ^1H
##.DELAY= (6, 6)
##.ACQUISITION MODE= SIMULTANEOUS
##.ACQUISITION SCHEME= undefined
##.AVERAGES= 8
##.DIGITISER RES= 18
##SPECTROMETER/DATA SYSTEM= spect
##.PULSE SEQUENCE= zg30
##.SOLVENT NAME= D2O
##.SHIFT REFERENCE= (INTERNAL, D2O, 0, 15.7039)
##AUDIT TRAIL= $$ (NUMBER, WHEN, WHO, WHERE, WHAT)
$$ ##TITLE= Audit trail, XWIN-NMR		Version 3.5
$$ ##JCAMPDX= 5.01
$$ ##ORIGIN= Bruker BioSpin GmbH
$$ ##OWNER= she
$$ F:/spectra/data/she/nmr/H-F/1/audita.txt
$$ ##AUDIT TRAIL=  $$ (NUMBER, WHEN, WHO, WHERE, WHAT)
(   1,<2020-10-20 11:12:11.82 +0400>,<she>,<DPX200>,
      <created by zg, POWCHK disabled, PULCHK disabled
       configuration hash MD5:
       00 E9 B6 7A A2 85 ED C7 34 08 36 98 17 FE 4E 26
       data hash MD5: 16K
       46 C5 33 E2 54 B8 47 84 24 8A 8D 1D 1D 18 9D CD>)
$$ ##END=
$$ 
$$ hash MD5
$$ BE 85 5D 94 21 AC 41 DD 2D 46 E3 F0 67 DE 10 FB
##$RELAX= 
##$RELAX= 
##$RELAX= 
##$RELAX= 
##$RELAX= 
##$RELAX= 
$$ Bruker specific parameters
$$ --------------------------
##$DU= <F:/spectra>
##$EXPNO= 1
##$NAME= <H-F>
##$PROCNO= 1
##$TYPE= <nmr>
##$USER= <she>
##$AMP= (0..31)
100 100 100 100 100 100 100 100 100 100 100 100 100 100 100 100 100 100 
100 100 100 100 100 100 100 100 100 100 100 100 100 100 
##$AQSEQ= 0
##$AQ_mod= 1
##$AUNM= <au_zg>
##$AUTOPOS= <>
##$BF1= 200.13
##$BF2= 200.13
##$BF3= 200.13
##$BF4= 200.13
##$BF5= 200.13
##$BF6= 200.13
##$BF7= 200.13
##$BF8= 200.13
##$BYTORDA= 1
##$CFDGTYP= 0
##$CFRGTYP= 5
##$CHEMSTR= <none>
##$CNST= (0..31)
1 1 145 1 1 1 1 1 1 1 1 1 1 1 1 1 1 1 1 1 1 1 1 1 1 1 1 1 1 1 1 1 
##$CPDPRG= <>
##$CPDPRG1= <>
##$CPDPRG2= <>
##$CPDPRG3= <>
##$CPDPRG4= <mlev>
##$CPDPRG5= <mlev>
##$CPDPRG6= <mlev>
##$CPDPRG7= <mlev>
##$CPDPRG8= <mlev>
##$CPDPRGB= <>
##$CPDPRGT= <>
##$D= (0..31)
0 1.2 0 0 0 0 0 0 0 0.06 0 0.03 0 0 0 0 0.0002 0 0 0 0 0 0 0 0 0 0 0 0 
0 0 0 
##$DATE= 1603177931
##$DBL= (0..7)
120 120 120 120 120 120 120 120 
##$DBP= (0..7)
150 150 150 150 150 150 150 150 
##$DBP07= 0
##$DBPNAM0= <>
##$DBPNAM1= <>
##$DBPNAM2= <>
##$DBPNAM3= <>
##$DBPNAM4= <>
##$DBPNAM5= <>
##$DBPNAM6= <>
##$DBPNAM7= <>
##$DBPOAL= (0..7)
0.5 0.5 0.5 0.5 0.5 0.5 0.5 0.5 
##$DBPOFFS= (0..7)
0 0 0 0 0 0 0 0 
##$DE= 6
##$DECBNUC= <off>
##$DECIM= 32
##$DECNUC= <off>
##$DECSTAT= 4
##$DIGMOD= 1
##$DIGTYP= 9
##$DL= (0..7)
0 120 120 120 120 120 120 120 
##$DP= (0..7)
150 150 150 150 150 150 150 150 
##$DP07= 0
##$DPNAME0= <>
##$DPNAME1= <>
##$DPNAME2= <>
##$DPNAME3= <>
##$DPNAME4= <>
##$DPNAME5= <>
##$DPNAME6= <>
##$DPNAME7= <>
##$DPOAL= (0..7)
0.5 0.5 0.5 0.5 0.5 0.5 0.5 0.5 
##$DPOFFS= (0..7)
0 0 0 0 0 0 0 0 
##$DQDMODE= 0
##$DR= 18
##$DS= 0
##$DSLIST= <SSSSSSSSSSSSSSS>
$$ [...]
##$SUBNAM2= <"">
##$SUBNAM3= <"">
##$SUBNAM4= <"">
##$SUBNAM5= <"">
##$SUBNAM6= <"">
##$SUBNAM7= <"">
##$SUBNAM8= <"">
##$SUBNAM9= <"">
##$SW= 16.880792210976
##$SWIBOX= (0..15)
0 0 2 0 0 0 0 0 0 0 0 0 0 0 0 0 
##$SW_h= 3378.37837837838
##$TD= 16384
##$TD0= 1
##$TE= 0
##$TE2= 300
##$TE3= 300
##$TEG= 300
##$TL= (0..7)
0 120 120 120 120 120 120 120 
##$TP= (0..7)
150 150 150 150 150 150 150 150 
##$TP07= 0
##$TPNAME0= <>
##$TPNAME1= <>
##$TPNAME2= <>
##$TPNAME3= <>
##$TPNAME4= <>
##$TPNAME5= <>
##$TPNAME6= <>
##$TPNAME7= <>
##$TPOAL= (0..7)
0.5 0.5 0.5 0.5 0.5 0.5 0.5 0.5 
##$TPOFFS= (0..7)
0 0 0 0 0 0 0 0 
##$TUNHIN= 0
##$TUNHOUT= 0
##$TUNXOUT= 0
##$USERA1= <user>
##$USERA2= <user>
##$USERA3= <user>
##$USERA4= <user>
##$USERA5= <user>
##$V9= 5
##$VALIST= <valist>
##$VCLIST= <CCCCCCCCCCCCCCC>
##$VD= 0
##$VDLIST= <DDDDDDDDDDDDDDD>
##$VPLIST= <PPPPPPPPPPPPPPP>
##$VTLIST= <TTTTTTTTTTTTTTT>
##$WBST= 1024
##$WBSW= 4
##$XGAIN= (0..3)
0 0 0 0 
##$XL= 0
##$YL= 0
##$YMAX_a= 9063
##$YMIN_a= -9513
##$ZGOPTNS= <>
##$ZL1= 120
##$ZL2= 120
##$ZL3= 120
##$ZL4= 120
##$ABSF1= 10
##$ABSF2= 0
##$ABSG= 5
##$ABSL= 3
##$ALPHA= 0
##$AQORDER= 0
##$ASSFAC= 0
##$ASSFACI= 0
##$ASSFACX= 0
##$ASSWID= 0
##$AUNMP= <proc_1d>
##$AZFE= 0.1
##$AZFW= 0.1
##$BCFW= 1
##$BC_mod= 2
##$BYTORDP= 1
##$COROFFS= 0
##$CY= 11.3945322036743
##$DATMOD= 1
##$DC= 2
##$DFILT= <>
##$DTYPP= 0
##$F1P= 16.9975609425685
##$F2P= -3.02152046262296
##$FCOR= 0.5
##$FTSIZE= 0
##$FT_mod= 4
##$GAMMA= 1
##$GB= 0.15
##$INTBC= 1
##$INTSCL= 1
##$ISEN= 128
##$LB= 0.24
##$LEV0= 0
##$LPBIN= 0
##$MAXI= 10000
##$MC2= 0
##$MEAN= 0
##$ME_mod= 0
##$MI= 1.114404
##$NCOEF= 0
##$NC_proc= 0
##$NLEV= 6
##$NOISF1= 3.799351
##$NOISF2= 2.8
##$NSP= 1
##$NTH_PI= 0
##$NZP= 0
##$OFFSET= 15.70392
##$PC= 1
##$PHC0= -10608.27
##$PHC1= 17.80089
##$PH_mod= 1
##$PKNL= yes
##$PPARMOD= 0
##$PSCAL= 0
##$PSIGN= 0
##$REVERSE= no
##$SF= 200.130013532006
##$SI= 16384
##$SIGF1= 3
##$SIGF2= 2
##$SINO= 400
##$SIOLD= 16384
##$SREGLST= <1H.CDCl3>
##$SSB= 0
##$STSI= 0
##$STSR= 0
##$SW_p= 3612.71676300578
##$SYMM= 0
##$S_DEV= 0
##$TDeff= 0
##$TDoff= 0
##$TI= <>
##$TILT= no
##$TM1= 0
##$TM2= 0
##$TOPLEV= 0
##$USERP1= <user>
##$USERP2= <user>
##$USERP3= <user>
##$USERP4= <user>
##$USERP5= <user>
##$WDW= 1
##$XDIM= 8192
##$YMAX_p= 0
##$YMIN_p= 0
$$ End of Bruker specific parameters
$$ ---------------------------------
##NTUPLES= NMR FID
##VAR_NAME=  TIME,          FID/REAL,        FID/IMAG
##SYMBOL=    X,             R,               I
##VAR_TYPE=  INDEPENDENT,   DEPENDENT,       DEPENDENT
##VAR_FORM=  AFFN,          ASDF,            ASDF
##VAR_DIM=   8192,          8192,            8192
##UNITS=     SECONDS,       ARBITRARY UNITS, ARBITRARY UNITS
##FACTOR=    0.000296,      1,               1
##FIRST=     0,             0,               0
##LAST=      2.424536,      0,               0
##MIN=       0,             -9513,           0
##MAX=       2.424536,      9063,            0
$$ Real data points
##PAGE= N=1
##DATA TABLE= (X++(R..R)), XYDATA
$$ [...]
639A664j764j912L98J887J486m9j896j749L27J896J531j87j805j721K96J964J391
656A757j73j696j788L85J844J300K5j781j686L38J712J411l0j713j648K08J699
673A64J446mj611j783K07J691J470J16j705j796K76J636J502Q5j742j730K19J658
691I9J504O1j715j695K19J693J452M6j708j690K74J575J411J02j692j603K35J490
709E8J442P4j583j607J27J494J438J63j602j641J47J451J468J67j550j635J28
726a461J414J541J58j603j602N1J459J557J15j597j566N1J445J504J27j564j576
743a547P8J398J493J65j550j511RJ363J514J49j497j513j3J372J453J64j395j561
761a429kJ317J467K06j421j553j7J296J474K19j423j534n8J315J447K21j390j540
$$ y = [1664, -100, -2012, -1614, 273, 1759, 1710, -186, -1935, -1608, 288, 1819, 1632, -173, -1894, -1598, 366, 1757, 1584, -112, -1900, -1515, 329, 1629, 1654, -127, -1813, -1475, 237, 1648, 1618, -95, -1743, -1535, 164, 1610, 1606, -5, -1788, -1581, 110, 1580, 1696, -9, -1805, -1529, 107, 1609, 1694, -48, -1778, -1559, 99, 1603, 1664, -51, -1746, -1527, 166, 1618, 1664, -44, -1734, -1460, 115, 1526, 1628, -64, -1667, -1432, 58, 1500, 1574, -9, -1616, -1489, 5, 1443, 1606, 4, -1637, -1490, -39, 1429, 1596, 46, -1589, -1461, -47, 1494, 1652, 49, -1553, -1502, -43, 1514, 1629, 32, -1534, -1483, -38, 1466, 1593, 29, -1547, -1469, -71, 1422, 1587, 37, -1474, -1465, -102, 1412, 1561, 64, -1449, -1462, -90, 1363, 1527, 132, -1429, -1431, -114, 1353, 1559, 138, -1415, -1432, -136, 1338, 1557, 134, -1400, -1458, -143, 1304, 1525, 135, -1405]
779a405p0J320J454K52j400j518m8J233J464K57j380j487o3J227J474K20j354
796A76j479r5J229J403K90j362j465p0J151J396L28j324j499m0J077J468K91j301
814A74j432j82J205J427K94j236j508j09J158J368L94j302j480p5J022J456L73
831A547j340j370j85J023J477L11j218j430k14J121J369L63j208j484j07J001
847c44J398M12j275j326j69R13J515L37j234j287k90R98J438L62j152j394k03
864a301R43J390M88j239j388j57Q54J466L96j228j235l46R71J487K65j078j325
881a037l11R97J361L95j122j328j95Q21J411M68j216j186l25P95J512K93j024
898C09j224m24R75J346L31r49j345l16Q84J344M93j156j171l23P33J518L33j080
$$ y = [-1405, -1475, -155, 1299, 1551, 151, -1367, -1415, -182, 1282, 1539, 159, -1328, -1391, -164, 1310, 1530, 176, -1303, -1398, -169, 1234, 1524, 162, -1303, -1373, -222, 1174, 1502, 178, -1321, -1361, -284, 1184, 1475, 174, -1258, -1440, -235, 1192, 1486, 250, -1258, -1367, -209, 1159, 1553, 251, -1229, -1304, -282, 1174, 1547, 207, -1163, -1348, -325, 1152, 1463, 245, -1185, -1399, -278, 1091, 1454, 246, -1238, -1345, -344, 1054, 1466, 191, -1135, -1304, -391, 1124, 1461, 227, -1060, -1350, -352, 1086, 1448, 296, -1098, -1301, -358, 1032, 1520, 281, -1107, -1264, -410, 1056, 1452, 224, -1011, -1357, -386, 1101, 1366, 288, -1037, -1348, -351, 1010, 1405, 283, -1045, -1240, -419, 992, 1460, 244, -942, -1267, -472, 1040, 1333, 309, -915, -1339, -364, 982, 1313, 364, -981, -1297, -413, 931, 1424, 268, -903, -1226, -493, 1025, 1358, 278]
916B78j155m37Q88J450L10r78j294l62R53J243M26r44j294k80P37J366L78r91
934B94j082m78P80J443K53q63j101n46Q59J277M37q78j263k97O89J252N60r57
952C79j174m16P06J408L52q50j149n81Q64J359K86p44j236m39P87J225M95q98
970C74j168l30N74J352M47r26j008m82O71J288L78p05j179n18Q26J108M97p18
988D81j208l98O00J252N13q70j031m88N86J374L59p67j050n49O87J254M25o84
1006D86j215m23O78J156N22q02j095m34N80J289M07p50r45o15O67J266L32o28
1024D76j079n39O49J172M91p12j074m49N22J189N42p72r87n54N52J265L82n88
1042D86j029o38O51J213L74n63j097n09O00J145M99o77r85n22M98J239L89o27
$$ y = [278, -877, -1314, -426, 1024, 1334, 356, -938, -1300, -347, 896, 1322, 378, -916, -1196, -459, 907, 1285, 294, -788, -1266, -486, 957, 1210, 347, -754, -1300, -441, 836, 1273, 395, -868, -1165, -476, 776, 1336, 379, -795, -1211, -505, 903, 1255, 405, -744, -1325, -461, 898, 1184, 440, -796, -1235, -448, 777, 1272, 374, -794, -1124, -550, 802, 1249, 323, -685, -1167, -496, 792, 1170, 465, -714, -1232, -406, 702, 1199, 481, -727, -1125, -525, 727, 1240, 370, -661, -1149, -563, 811, 1170, 403, -647, -1196, -509, 745, 1170, 486, -729, -1152, -474, 682, 1204, 402, -693, -1127, -547, 742, 1149, 399, -546, -1161, -494, 772, 1104, 476, -603, -1142, -493, 679, 1170, 458, -616, -1065, -543, 646, 1188, 416, -571, -1125, -573, 692, 1074, 486, -543, -1181, -530, 683, 1057, 494, -603, -1112, -512, 633, 1132, 455, -530, -1052, -554, 685, 1074, 447]
1060D47r15o33N79J173M08n57j022n53N81J089M49n52j007n51N32J117M71n66
1078D90r48o31N58J131L90m89r70o20N46J108M22m67j013n73N65J051M63n02r72
1097d61n99N24J095M12m31r60o63N68J059M16m24r72o14N39R92M89m47r44o14
1116a035M80J063M52m23r59o26M87J053M41l91r84o03N27R82M62l52j002n76M44
1135e60J026N08m08r27o16M22J006N02l86r44o10M64R73M53l12r64o09M39R37
1154C94N13l46r20o34M37R60N02l64r33n93M10R67M86l07r41o13M28R23N41l39
1174E71r31n94M16R34N11l55q54o35L71R78M81k95r18o24M07R20M82l13q77o01
1194i26L73Q99N18l11q39o34L72R13M68k70q30o44L33R11M84k43q50o22L55Q38
$$ y = [447, -468, -1101, -522, 651, 1059, 502, -520, -1073, -492, 597, 1046, 494, -513, -1064, -532, 585, 1056, 490, -458, -1089, -531, 600, 990, 501, -469, -1089, -543, 565, 987, 520, -493, -1066, -501, 550, 1013, 511, -461, -1060, -536, 559, 971, 540, -420, -1083, -515, 544, 960, 536, -436, -1050, -511, 481, 970, 523, -421, -1035, -555, 508, 960, 537, -422, -1048, -561, 492, 933, 542, -442, -1045, -518, 464, 926, 574, -428, -1004, -560, 466, 974, 566, -361, -977, -555, 451, 953, 567, -377, -987, -523, 450, 903, 591, -373, -982, -543, 394, 907, 561, -359, -993, -556, 404, 906, 542, -391, -984, -574, 393, 879, 572, -369, -982, -554, 369, 910, 571, -360, -954, -538, 396, 907, 552, -302, -937, -566, 412, 893, 598, -320, -944, -537, 383, 865, 552, -325, -926, -553, 346, 864, 553, -286, -920, -548, 365, 833, 563, -267, -911, -578, 333, 817, 574, -276, -898, -543, 295]
1214B95N29k52q77n84L08Q89N20k41q30o69L64Q90M72k01q74o43L95Q13N33k26
1234F11q76n91L37P76N59k23q50n86K89Q10N26k20p83o60L46P65N22j53q44o25
1254h70L55P37N48j94q13n89K77P85N50j77q18o18L31P54N04j41q18o16L16P39
1274B42N20j44q42n92K85P16N80k05p98n84K84P35M98r5q02o09L02O75N52j16
1294F02p94n62K36O73O07j72p96n34K04P03N61j27p99n87K64O86N56o7q65n56
1314g67K52O24N97q7q22n16J73O76N90j59p26n48J66O94N41q5p44n66K19O07N66
1335F85m6q24n03J62O27O11j63o78n37J12P03N43j35o56n99J79O42N42n2p38n45
1356f70J78N71O41j15p51m74Q0O22O05j06o99n47J40O40N26m3o81o06J72N85N69
$$ y = [295, 824, 572, -305, -889, -581, 308, 828, 587, -243, -912, -548, 342, 814, 613, -261, -904, -509, 304, 837, 611, -265, -856, -519, 257, 816, 593, -257, -843, -554, 256, 782, 562, -221, -881, -535, 230, 752, 599, -245, -870, -515, 222, 770, 576, -237, -826, -549, 236, 786, 609, -209, -827, -496, 258, 762, 621, -197, -813, -497, 242, 762, 618, -224, -816, -531, 185, 765, 560, -238, -822, -538, 197, 695, 600, -202, -811, -509, 166, 718, 602, -192, -754, -518, 155, 762, 590, -206, -740, -536, 167, 728, 601, -198, -785, -521, 165, 721, 654, -211, -767, -515, 109, 706, 619, -203, -719, -546, 130, 720, 561, -165, -713, -547, 147, 688, 603, -141, -707, -488, 119, 685, 639, -185, -688, -526, 101, 712, 549, -129, -666, -554, 149, 692, 557, -99, -698, -519, 123, 665, 613, -125, -670, -492, 79, 720, 605, -146, -620, -540, 82, 687, 581, -118, -665, -525, 115, 641, 598, -83, -689, -517, 68, 637]
1377F37p0o90n05Q9N89O17j15o51n08O7O36N38l3o46o18J73N57N53Lp29n35J35
1399e06N59N70m1o87m84P2N66N67r0o06n58J03O01N45j9o98m98J41M79O04l2o82
1421i4m51N6N32N85o5o12n21O4N98M71j2n76n70J25M92N69j3o83m54O3M72O31
1443F07p8o22m58mN71N43l3n90n09N3N32N55J4o26n26Q7M45O19j2o28m43j5N11
1466gN76m5n48m48m2M93N80Ln90n05L1N00N50ko05m25j3M46O15o9n09m85k1M96
1490b4N56j6n20m92m6N14N81k0n45m54l3M51O16o4n29m15o1M88N31J1n16m69n0
1513e06M73N55k0m89m67m2M20N72jn14m22n7M45N80o6m41m52o6M46N48%m97m28
1536d29r6M70N47Pm77m61m8M53M99J5m62m19q9M45N22J6m47m57j06M91N06Mm48
$$ y = [637, 567, -123, -628, -539, 50, 667, 552, -99, -607, -540, 96, 634, 601, -45, -663, -490, 67, 620, 623, -106, -641, -506, 53, 623, 582, -105, -589, -517, 49, 616, 526, -80, -638, -535, 66, 611, 592, -106, -604, -463, 16, 620, 588, -94, -545, -489, 43, 628, 563, -49, -570, -506, 92, 563, 551, -25, -595, -470, 22, 591, 578, -105, -559, -496, -24, 607, 529, -93, -551, -555, 16, 559, 526, -64, -573, -520, 12, 567, 581, -45, -571, -484, -39, 580, 568, -60, -503, -518, -7, 569, 524, -24, -472, -514, -21, 559, 562, -28, -533, -502, -2, 548, 546, -59, -484, -497, -51, 564, 495, -14, -499, -520, -24, 532, 516, -4, -496, -542, -28, 553, 533, -12, -466, -499, -48, 568, 504, -25, -440, -501, -13, 518, 529, 13, -456, -506, -33, 522, 502, 13, -454, -496, -76, 496, 495, -19, -441, -498, -53, 527, 461, 20, -432, -498, -52, 496, 496, -1, -429, -525, -55, 492, 499, 22, -439, -487, -34, 465, 480, 18, -401, -490, -45, 477, 493, 46, -411, -517, -26, 480, 484, 36]
1559C6m50m7L88N36J5m44m27p6L78N25L8m04m85j12M72N15J1m26m65o4M16N16
1581D46J1m11m30j07M56M77K9m20m37n9M02M90Kl66m39j07M01M69M7l98m41j02
1603d87L96N08J8l77m43r5L84N00L4l75m59q3M05M82M4l95m10j18L67M89Q1m01
1625F5m14j37L97M96O4m00m07j03L60M80L4l46m38j21L76M62N8l36m08j61L48
1646a31N12L6l29m12j57L39M79R1l26m49j17L56M86L6l11m50j34L62M71P1l32
1667I1m13j68M07M45L4k91m02j74L84M30O3k88m31j41L73M34M3k90m29j35L49
1688a09M52K8k68m14j50L49M51O1k79m13j69L71L92J10k93l99j46L16M47O0k96
1709A01l83j63L50M17J02k77m19j40L16M13Q8k66m40j24L31M03R6k88m17j26L08
$$ y = [36, -414, -461, -73, 463, 478, 34, -393, -469, -91, 434, 472, 68, -417, -529, -57, 458, 469, 43, -422, -486, -70, 446, 457, 46, -384, -491, -35, 442, 471, 51, -386, -445, -43, 447, 449, 83, -356, -463, -62, 407, 454, 56, -385, -487, -91, 417, 435, 58, -385, -480, -96, 404, 438, 63, -396, -479, -74, 408, 452, 57, -353, -471, -104, 385, 466, 65, -349, -486, -89, 407, 471, 71, -336, -439, -79, 401, 435, 89, -349, -470, -94, 368, 426, 90, -318, -479, -131, 381, 417, 88, -324, -481, -142, 337, 428, 102, -347, -464, -108, 378, 414, 103, -347, -481, -119, 352, 423, 91, -322, -490, -83, 362, 396, 105, -297, -471, -87, 343, 406, 118, -313, -454, -81, 353, 396, 106, -323, -458, -109, 343, 371, 103, -311, -461, -112, 339, 400, 121, -292, -461, -90, 302, 412, 119, -280, -426, -110, 337, 397, 101, -282, -445, -95, 322, 424, 147, -272, -412, -96, 317, 405, 139, -301, -425, -94, 309, 405, 117, -300, -426, -118]
1730a18M05R1k45l94j80L32L82J16k22m47j34L04L87J22k93l70j30K88L86J29
1750D09k56m18j54L09L99P6k14m12j50L09L43J54k46m38j03K85L62J30k45l89
1770b49j71K96L96Q3k28l93j61L13L74J01k14m11j28K81L57J17k27l70j42K46
1790a30L88J25k34l57j77K62L72J01j68m35j41K51L64J53k27m11q9K08L75J48
1810C78k24l84j68K51L56J33j66m18j36K66L35J25j89l75j37K09L59J59k26l21
1830a73j73K15L33J66k01l79j35K43K97J66j70m09j19K27L02J50j67l72j40J93
1850a46L65J28j98l33k07K42L40J30j43l96j21K14L17J49j67l64j47K14L18J88
1870C83k13l62j48K14L25J24j15l87j69K10L05J72j46m04j08J76K89J96k03l51
$$ y = [-118, 287, 378, 133, -261, -441, -109, 273, 389, 167, -280, -414, -110, 277, 399, 106, -264, -394, -106, 280, 409, 153, -265, -419, -110, 289, 365, 151, -261, -411, -102, 241, 395, 149, -289, -392, -107, 255, 385, 140, -249, -420, -124, 272, 355, 127, -266, -427, -114, 260, 361, 147, -264, -392, -111, 246, 363, 136, -234, -376, -130, 258, 383, 149, -208, -385, -123, 249, 350, 182, -253, -394, -143, 221, 374, 147, -264, -353, -145, 230, 378, 154, -230, -398, -147, 209, 342, 176, -242, -378, -112, 223, 348, 159, -216, -353, -144, 215, 374, 148, -173, -346, -131, 202, 368, 167, -212, -347, -104, 193, 359, 189, -220, -339, -112, 190, 340, 173, -199, -339, -146, 219, 347, 149, -184, -391, -149, 191, 321, 178, -218, -339, -125, 192, 341, 174, -190, -337, -123, 195, 383, 170, -192, -340, -126, 199, 323, 208, -179, -348, -138, 167, 339, 193, -211, -319, -143, 146, 342, 139, -212]
1890b12j20J55L39J59j46l64j56K27K75J70j70l25j29J80K83J86j65l65j18J43
1910a53K90K04j78l17j63J81K91K03k18k96j69J62L04J82j62l27j28J35K86J93
1930C20j52l30j27J30L30J39j57l16j45J45L00J81j56l08j47J68K64J85j64l21
1950a61j39J44L02J76j50l05j60J15L09J72j24l24j55J47K86J77j57l19j14J28
1970a52K44J78j38k62j67J20L25J80j56l13j26Q2K74K18j43k76j52J05K76J78
1990B95j06l39j14J15K88J61j16k99j42Q6L05J57j46k61j57R9K62J85j01k95j38
2011b61P6K77J80j02k83j70J19K50J73q9k95j36J23K32J91j23k64j29Q6K21K29
2032C05j32k71j59R9K53J80r0k89j25R3K11K11j29k71j28O6K65J84j05k90j41
$$ y = [-212, -332, -177, 162, 321, 175, -189, -345, -118, 157, 327, 157, -168, -297, -117, 166, 352, 187, -178, -296, -153, 137, 341, 163, -154, -317, -136, 155, 358, 140, -156, -325, -163, 141, 323, 161, -166, -294, -159, 127, 320, 168, -162, -289, -159, 171, 310, 153, -163, -308, -163, 137, 318, 162, -146, -293, -125, 139, 324, 160, -161, -300, -156, 146, 322, 172, -133, -293, -178, 131, 303, 179, -145, -300, -153, 133, 310, 153, -166, -280, -152, 92, 270, 132, -130, -297, -177, 148, 328, 172, -141, -267, -185, 89, 307, 164, -112, -264, -159, 117, 295, 189, -150, -264, -149, 139, 300, 184, -115, -257, -171, 134, 291, 145, -116, -273, -174, 88, 273, 172, -123, -261, -185, 92, 272, 170, -113, -283, -164, 86, 259, 170, -125, -261, -138, 94, 285, 162, -102, -231, -145, 76, 305, 173, -98, -257, -158, 95, 275, 185, -104, -229, -136, 75, 286, 157, -114, -242, -176, 89, 273, 168, -122, -263]
2053b63Q4K50J93j25k46j64Q2K94J44j00k42j17O7K28J98q0k89j40P8K17J89p9
2075A79k54j39O7K08K05j13k47j30L2K76J87j13k56j22O1K29J75r7k81r1M4K46
2097F6J63q2j89j58L5K28J64o8j99j59M2K19J94r7k21j30L7K38J94j18k14j37
2119a92M5K05J83r8k22j34L4K25J80m6k47j54O1K29J85q7k09j57K6K17J58n2j76
2142b6j93N5K19J58o8j95j45K2K24J90r6j91j41J8K24J76r0j86j62M1K22J54n2
2165A58k14j47N1J92J63o5k02j42K8J99J85m8j94j57K5K16J56o4j79j49pK47J48
2188B00k7j92j47%K17J69k5k13j49J0K10J83j04j49j73J1K09J43n1j56j39pK05
2211B5J84r0j53j61N7J35J80l5j53j76J6K18J28k6j83j50M9J85J50m4j83j50J8
$$ y = [-263, -179, 71, 264, 139, -107, -271, -189, 105, 249, 149, -93, -210, -143, 85, 283, 203, -86, -226, -148, 69, 258, 179, -75, -214, -147, 61, 266, 153, -94, -224, -192, 84, 271, 158, -98, -220, -159, 70, 245, 148, -133, -224, -180, 66, 229, 147, -42, -200, -165, 63, 227, 159, -40, -199, -157, 62, 256, 159, -62, -192, -155, 83, 277, 159, -55, -192, -147, 58, 241, 143, -79, -213, -179, 46, 226, 180, -67, -221, -160, 69, 254, 167, -42, -199, -173, 44, 202, 150, -26, -219, -164, 55, 213, 145, -50, -195, -173, 51, 241, 145, -46, -187, -169, 55, 231, 141, -45, -207, -166, 56, 210, 158, -56, -203, -152, 40, 203, 138, -64, -206, -178, 21, 206, 158, -36, -193, -168, 48, 204, 140, -39, -188, -195, 52, 200, 173, -19, -166, -166, 51, 220, 195, -18, -167, -157, 53, 236, 132, -17, -190, -179, 30, 173, 122, -34, -173, -180, 25, 209, 119, -34, -195, -138, -3, 177, 142, -11, -187, -171, 47, 175, 149, -34, -184, -135, 50, 200, 156, -27, -177, -159]
2234a59J75J92n4j68j45OJ88J55n9j50j69K1J89J41k6j31j79NJ79J41l2j57j04
2257a41l2J79J50m4j12j73K0J81J22kj36j79J2J77J68m1j59j47KJ81J36m5j30
2280a3j34m0J89J34kr7j62j6J52J31mj35j25k4J51J69m2j59j28j1J59J44Lj45
2304ej43%J50J63k5j28j62L7J24J54k0j34j48NJ53J11K0j44j46j3J56J40Pj60
2328hj45K4J34J30lj19j45J2R0J40L7j28j58jJ38J43Rj05j63j2J20J51lj31j11
2353a04j9J41J22J3j29j55j1J59Q9L4j36j41KJ57Q4K1j14j44%J45P8M7j40j42
2377a43LJ39J38Mj13j46j7J36J36J1j32j20k5J15J39Lr0j76J8J09J33J4j17j20
2401a01m0J38J32j5j02j33j3J35J14Rj05j34j5J24J27j2j13j05k3J15J34K0j00
$$ y = [-159, 16, 208, 154, -14, -159, -153, 35, 190, 131, -19, -188, -167, 22, 163, 137, 6, -173, -168, 11, 152, 120, -37, -141, -173, 6, 156, 112, 0, -173, -153, 28, 150, 148, 12, -167, -155, 22, 190, 149, -10, -157, -155, 26, 162, 117, -13, -147, -187, 2, 136, 134, 37, -125, -141, 11, 142, 138, 3, -122, -146, 5, 174, 132, -27, -155, -166, -7, 137, 140, -5, -148, -148, 2, 165, 140, 12, -150, -113, 11, 165, 145, 11, -137, -132, 21, 132, 152, 8, -138, -151, 5, 145, 152, -8, -153, -129, 5, 135, 132, 13, -132, -120, -30, 110, 147, 19, -139, -140, -2, 141, 150, 45, -118, -130, -10, 141, 138, 7, -104, -123, 18, 140, 153, 24, -131, -142, 17, 106, 140, 4, -137, -135, 22, 106, 127, 13, -131, -131, 14, 92, 139, -1, -143, -140, -1, 137, 141, 28, -118, -135, 1, 137, 148, 16, -104, -129, -14, 125, 128, 38, -138, -120, -11, 122, 136, 19, -101, -141, -3, 129, 114, 12, -121, -134, 1, 115, 124, 19, -115, -130, -6, 121, 109, -4, -109, -132, -17, 117, 137, 37]
2424C7j35l1J44Q1M3j39j30K3J02J21M1j36j35nJ00J54Rj07j43j3J22J17j7j13
2448a0j02k9J42Q7K0o5j61JQ0J19M8j23j18j4J07J25%o7j38j6J23O5N6q7j38J9
2474g6N7R7M6q9j55J7P8J15K1r9j26nJ17Q2L7q6j30k0R4J13M1q9j33l3Q0J14M9
2501A17q7j26mP1J15L4j14r0lP1R8M6q6j28j4P8R4L9j04r6JR5Q7L3p0j64QP5Q8
2530F4J5o9r4n0R8J10K9q8j13QP6Q5L5r0j18MO1J25L9p9j32%P0J16J7q8j08MM8
2559b5J09L1o7j05n0R0Q0N1q6j02j6N0J03K6o0j17k5Q9P6N6p6j20qQ0P1O0r8p8
2587f1j2N3Q4N3o7j52K6M5O9R2j19r1k7N8J06O0o3r5k9J4J29K9q9o5j7L7P8N4
2615A00n3j29k5O8J10L5j00p7m3P1J15K1o9q0k3N6R2K4n5p6m4P6O8N1q8r2j8P3
$$ y = [37, -98, -129, 15, 96, 139, 0, -130, -107, -5, 116, 157, 21, -114, -119, -19, 135, 144, 37, -106, -119, 3, 120, 103, -10, -112, -141, 1, 88, 108, 43, -118, -117, -37, 82, 130, 7, -111, -125, -18, 107, 107, 40, -98, -114, 9, 74, 130, 43, -95, -76, -19, 78, 124, 35, -120, -103, -25, 90, 111, 12, -114, -119, -2, 80, 117, 31, -99, -119, -25, 88, 129, 40, -93, -126, -46, 68, 117, 30, -96, -100, -29, 86, 120, 6, -84, -87, -16, 82, 128, 42, -86, -100, -22, 72, 111, 7, -89, -88, 7, 94, 127, 57, -107, -99, -24, 64, 79, 10, -84, -134, -36, 74, 103, 15, -98, -90, -14, 71, 106, 16, -102, -98, -37, 88, 127, 48, -84, -84, -14, 102, 119, 31, -77, -73, -25, 84, 115, 48, -57, -107, -17, 63, 114, 28, -74, -90, -40, 63, 89, 29, -88, -113, -24, 52, 108, 32, -88, -96, -16, 55, 115, 17, -61, -73, -20, 64, 117, 50, -102, -76, -31, 38, 130, 11, -80, -107, -49, 57, 117, 54, -41, -70, -56, 73, 102, 13, -52, -69, -32, 46, 100, 47, -82, -107, -39, 71, 106, 6, -71, -114, -43, 72, 93, 24, -56, -79, -23, 69, 93, 38, -38, -82, -6, 62, 113, 25, -67, -85, -12]
2643a2P7K4o8o2m3O1J06om6q4l5M9P7K9p1o2k4M1J13K2o4j06l3O7R3L1m2q3j3
2672f4L0J03N1r2r2%M3P0K8o3m2l0KJ09M4n2q8m4K7J07K4k5p1o2O3Q6Kj4r3m7
2702i0N4R5M5r6k7o5L7J08K1o4n0m4L1R2M1m0p2o1N0O7O4n2o6n0L9O5O6n8o5n7
2732h2N0P6K6m7p3k5M6O7K7l5o5j4K7L6M3k1o4l1J5Q0K3j8m8o2N2Q9Po7l0k3K4
2763a7P7K3j3j08k7M1O6K3m5m1o6N7O6L1j9p0l1%P4O4j7r5l2K0Q2K1l0o4k7J6
2793d1O8M3n3k0l7LO2L2no0m3J9O6L0l7n1j5J3K7N4jp3o7L6Q8K4k6p0Oj1N2O6
2825G9o4m9k9L0O1K4k9l0m2L4L5L8no0l1j5R2J0k4n2l7K9O6J7jo6m3K9P6j2Km9
2857a6q0M6Q9J2j4p1k6J7L9O0m1j4n4K4N8L3rn6n7N5K7K6l6j9m2PQ9qj8l4n2L2
$$ y = [-12, 65, 89, 21, -41, -84, -23, 83, 77, 31, -53, -88, -39, 38, 67, -4, -66, -90, -49, 64, 86, 22, -84, -117, -50, 43, 74, 32, -51, -64, -34, 69, 120, 28, -64, -64, -21, 49, 77, 14, -28, -58, -56, 53, 97, 45, -43, -87, -60, 47, 71, 46, -25, -87, -24, 62, 64, 50, -43, -90, -36, 59, 104, 8, -19, -84, -47, 61, 82, 18, -32, -76, -45, 47, 88, 48, -24, -85, -35, 32, 96, 44, -22, -72, -33, 32, 98, 40, -25, -82, -32, 44, 70, 23, -50, -75, -29, 38, 65, 30, -35, -49, -22, 14, 57, 36, -28, -59, -44, 36, 59, 41, -7, -69, -17, 72, 79, 12, -18, -41, -17, 60, 83, 70, -38, -65, -24, 42, 65, 20, -21, -87, -30, 36, 67, 48, -22, -53, -53, 21, 85, 68, -27, -59, -39, 43, 64, 34, -30, -57, -41, 27, 70, 17, -3, -40, -37, 25, 57, 52, -8, -51, -32, 34, 64, 27, -24, -39, -26, 1, 55, 54, -19, -86, -50, 38, 62, 36, -34, -28, -39, 13, 79, 15, -34, -63, -33, 28, 52, 23, -7, -49, -15, 20, 58, 53, -7, -38, -53, 39, 49, 25, -27, -64, -35, 31, 48, 47, -19, -62, -33, 43, 31, 33, -16, -96, -50, 39, 51, 37, -34, -60, -43, -4, 56, 15, 1, -53, -29, 29, 62, 53, -3, -60, -5, 22, 48, 12, -7, -49, -42, 47, 39, 21, -13, -65, -33]
2889c3N3L8j9m5m4LN9M4m2k4l1J3M5J8j2k7n4QN0L3rk1rm1N9oL6k1q8O2K5K3j5
2922B8j5m1kL6M9ro7k5J3N3J8Jn4l2K6M7nNp3qK9L6L1j0o0j4K2K7mM6l7m0J7L3
2956B1L7j7m1k8KL6K5k1k7k4K5K0K6%k1n1J4L9kJ3n9J0k5L9K9rk3k7QK9M2l3j6
2989il3j0N5K3nj5l0L1J1J7J0j3p2K0P1l3J8l2k6JM2K6j8l1m4L6K4QJ8p7j2K7
3021b2L2J1J3m4k4nN2K4j4Km5j7M4N9m6om1L2J4J1J9m3l7J5J7J9J2mn6PK8Rj1
3054EK1o1J5K6K2nk8j0j5L8K1nl5pJ9j1K7J0k1j2NJ9J5J1rl7MNJ1qQj9j7KK8J2
3090B4k9j2k2M6J2J4k6j8k5M8j4mPj9rJ6L3ol0KmLK6J1j4j0mk2N9%k2Lm4OL8L
3126A7Lk5lmK4J3k3l8K2k0O4K4k6n6kJ8J6MJ0m5K3J3RJ8m2oQJ4J7OQj0k2OJ8q
$$ y = [-33, 20, 58, 39, -6, -50, -47, 12, 56, 14, -10, -41, -28, 17, 35, 23, -4, -58, -50, 0, 33, 24, 3, -6, -47, 12, 6, 42, 21, -67, -5, 20, 43, 28, 13, -28, -30, 6, 55, 46, -21, -46, -33, 20, 38, 39, -15, -47, -21, 26, 21, 26, -47, -55, -26, 10, 41, 31, -29, -43, -21, 6, 2, 48, 11, -29, -12, 21, 58, 41, 0, -28, -26, 10, 35, 14, -13, -37, -12, 8, 34, 34, 13, -38, -24, 15, 13, 26, -33, -23, -48, -9, 20, 11, -12, -39, -31, -2, 40, 7, -9, -42, -52, 3, 26, 21, 6, -24, 7, 18, 35, 45, 32, -40, -20, 51, 18, 36, 4, -22, -21, 21, 47, 29, -2, -46, -10, 14, 22, 40, -37, -49, -22, 10, 21, 34, -10, -34, -39, 13, 37, 23, 25, -20, -37, 7, 66, 20, 14, -27, 5, 19, 30, 49, 6, -31, -16, 1, 20, 32, 28, -28, -21, 7, 16, 5, 26, -35, -20, 6, 28, 23, -5, -15, -30, 8, 29, 24, -11, -18, 1, -10, 17, 27, 6, -6, -1, 18, 33, 44, 35, -2, 2, 7, 18, 10, 18, -1, -18, -16, 12, 24, -5, -17, -39, 7, 19, 33, 7, -11, -36, 12, -2, -6, 1, -18, -27, -11, 22, 16, -14, -12, -16, -13, 13, 24, 10, 0, -4, -26, 33, 33, 11, 14, -30, -24, 14, 17, 20, -5, -8, -12, 12, 25, 2, -36, -14, -34, 30, 54, 28, -28, -30, -12, 4, 8, 18, -27, -4, 9, 18, 36, -6, -12, -4, 10, 27, 33, 41, 31, 9, 15, 33, 25]
3162B5J0j2j8l1N9k4moqJ1J7J6k4Jrk2J9L7nn4J7rJ4J9mpj5j3M3mK3m7l4L4%K6
3198B1j2j4J0j2NJ8Rj3%k2K6j2Kk2j4K3OK1k6K2k5JL1J6k7j4j9j8L2%K6k1k8J3
3232a7J9J0J5j4j5jj3M0K5k8k1Rj1K0mK5o6ON1k3mLMk9N7k4Mk7kj2J9J3JMk5J2
3268Aj7J8j6nJOL4j0L0k5lk4L3ppM2l0j9j7K8j2M3o4llM7j0j8J8k1mRJ0Rlk3K1
3305Ik2L8j0pj7lL4j5MqoJ2j8MK6nk1PJ0j3M3k8l0M1j8K5l9k0J3LJ7J4m4pK1k1
3341c1J4J5J0k0J8j9K8lJ3k8j1nK2Qj5j7OoQK7jk0nJ1K4J1Llk3rRmJ6k7pNQk%
3380@j9mnJ1L2k3L1o9M0PJ5j0jk2KJ4JPJ1j2j9J0J8k3K7k5onK4K2k9j2nJ7K0M
3416B4j9k2k9M6K1j3k6k4K1jL7j5J4k3j7K2J9JonlRJJ3j1j5k3L8QJ5m2pKJ3K0
$$ y = [25, 35, 23, 5, -26, 33, 9, 5, -1, -9, 2, 19, 35, 11, 12, 3, -19, 0, 37, 32, -22, -5, -14, 0, 19, 15, 8, -7, -20, 23, 19, 42, -5, -39, -5, -5, 21, 9, -5, 5, -7, -2, 16, 25, 12, 12, -10, 16, 4, 6, -16, -30, -7, -1, 20, -6, 16, -9, -8, 23, 39, 12, -2, -21, -39, -7, -7, 19, -2, -30, -17, 2, 12, 27, 13, -2, -3, -16, 24, 49, 21, 0, 9, -2, 18, 14, 39, -27, -21, 30, 7, 3, 6, 10, -19, 38, 14, 18, -9, -11, -23, -4, 9, 10, 14, -11, 1, -16, 2, -14, -19, -18, -12, 22, 12, 42, 17, 14, -10, 23, 16, 9, 51, 21, 2, -15, 13, 1, 44, -20, -23, -26, 21, 11, -7, 11, -10, -14, -5, 5, 14, 11, -12, 9, -13, 25, 15, 8, -9, -12, 22, 7, 11, 3, -3, 9, -9, -5, 21, 16, -5, 2, 12, -1, 42, 14, -16, 25, 7, 32, -7, -27, -14, -11, 6, 20, -24, -31, -10, -31, -17, -2, 8, -12, 6, -13, 15, 12, 25, -3, -14, -19, 3, 11, -4, -21, -15, -21, -13, 14, 13, -7, -12, -1, 23, 34, 37, 34, 11, 2, 11, 7, 23, -4, -11, -6, 2, 0, 0, -19, -23, -28, -17, 15, -8, 23, -46, -6, 1, 16, 6, 5, -17, -15, -1, 0, 7, 18, 6, -13, -3, 15, -8, 19, -6, -12, -17, 7, 29, 0, -12, -17, 0, 20, 24, 5, -17, -46, 0, 21, 8, -18, -42, -21, -22, 15, 0, 14, -9, -26, -4, 15, 16, 10, 5, 2, 11, 12, 25, 14, -1, -24, 14, 22, 37, -5, -12, -10, 3, 23]
3451B3mKl3k9L9J8Qj9l7K5kJ4QJl4LK6pJ8qm2MJ6J2K6j8l0QNK1NNm6L9j2LL0k1
3489A7l2k9N1j7M1j3m2J1nL9j7nlOj9K3J5l8J6j3MRN1m4j2l3PN6l0L5k6k2J3K0
3523A4K8j0m5L0j4QlL4m4l7NK1K5j8rpj2J1J7Nj3k0J1K8J4j6qk3RJ7J3J1m8jK4
3558cL6J0l3jk2K4j0N1l9lmnON7k1m2k9LO0j5Ol7k9L1j4L7l0K8m5J5L5jJ2m2l1
3593d5L1L0Pj3k4RlL4rJ2n0PJ6NK3j2l5pJJ8L3j5ml7K4ON3l0l5rl1O2NOo4Rj6
3630d8M2J4j0qoj0L6J8J0j1m6K5J5J2n%l6k4K6N6m1Jjl0J0M5j4j4n5K0K7M3j4
3663B7m5oJ6mL6mm4jlJ2N1ol8lrK3M7j0k3k0kN1Nj2k2j0rk1Q9Mo9m3NN7lNj9k3
3701b1JPM3J%o8J1L6N1l2on0l1O4RJ4k3m4k6Q1K8j5j8p2L8N9j1J9n4K0n6M2M4
$$ y = [23, 19, 21, -12, -41, -2, 16, 24, 5, -32, -7, -9, 5, 13, 14, -20, -17, 9, 2, 20, 12, -30, -26, -10, 2, 28, 10, -20, -12, -7, 14, 19, 24, -22, 17, 5, 8, 38, 17, -15, -44, 7, -10, 31, 18, -24, -13, -18, 21, 4, -1, -4, 2, -17, 6, 21, -17, -1, -14, -10, -1, 50, 6, -6, -39, -32, 24, -6, 29, 3, -19, -6, 14, 42, 32, -13, 17, 3, 11, 8, 42, -2, -39, -34, -13, 12, -6, -15, -22, -34, -23, -6, -1, -14, -34, -23, 5, 19, 3, -5, -28, -19, -2, 11, 22, -26, -27, -3, 33, 43, 10, 9, -13, 11, 1, 52, 13, 10, 6, 1, 7, 64, 43, 1, -28, -25, 35, 20, 26, -11, -40, -9, -23, 14, -16, 12, -33, -18, 17, 16, 28, -14, -45, -14, 16, 23, 10, -14, -5, -8, 26, 17, 29, -21, -14, 2, 7, 30, 18, -17, -24, -23, -5, 28, 13, 9, -28, -4, 2, 55, 25, -10, -19, -50, 12, 17, 23, -41, -32, -48, -6, 8, -2, -10, -16, -26, 10, 28, 38, 27, -19, 6, 21, 33, 28, 28, -8, -32, -6, 50, 9, 10, 9, -21, -11, 34, 20, 6, -49, -29, -2, 41, 27, -18, -24, -8, -12, 24, 20, -24, -25, -28, -16, 35, 29, -9, -12, -21, 2, 49, 39, 16, -4, -6, 45, 50, 38, 16, 6, -3, -24, 65, 69, 0, -43, -38, 19, 16, 21, 2, -21, -20, -13, 30, 31, 31, -37, -26, 10, 61, 29, 23, -27, -58, 6, 15, 29, 6, -38, -64, 17, 45, 30, 12, -60, -22, 37, 26, 45, -9, 11, -45, -3, 41]
3734D1Rk2n7J5M0K0jm9l3J0J6M7l3jj6MJ4J3K3j6l5Nl0N7K9l0m0j7L4M4Lj5k8
3767Ak4K8K0J5k8m0J5J3L3J1l1m5kJ5L7J3k8k8oK8K8K9o9k5kM9K1L6m1l8k5J9
3799b1L9K3j0l9j5K4L4j6Lm1nJ4K2L6l3l6k5N6K1K2m4m4NJ3P2k5n3QOl1Q8k3k2
3832Ck1j3J0K8O0q0j4j8M2M5Qj3o0K0oN9Jk4n1j0N2M4k6Lp6j2N1M7j8k3k9l4L5
3865b0L9jj2l5l4K4O7J3m5j3k9L1N2J0l0l8nJ7N1J2k6m6m7M3O3jl8j7k9M3M7r
3897C7l3k9m1Q2mL3j6p2QPM8L4l9m9j6M2M1J3n9k9nK2N9L0o4j5n1M2O9K0l8m0
3929a3LJ0M8Mj9p8nL5M3Rl0n3nK6L0M0l5m9m4O3M2K5k7o7K3J1M5K6m6n0mK2N3
3962C3J4j5m2KnK6N0m6k2l6L8M1Plo5k4RN3M4l2n3m4N2O1j6k4l1l0L2M3K2l2n8
$$ y = [41, 50, 28, -29, -14, 26, 46, 45, -4, -37, -27, -11, 36, 3, 2, -14, -10, 4, 17, 40, 24, -11, -6, -36, 21, 50, 20, -20, -37, -3, 41, 44, 29, 1, -23, 5, 25, 40, 12, -28, -13, 0, 33, 44, 13, -32, -34, -19, 18, 31, 3, -25, -31, -3, 25, 54, -15, -40, -42, 7, 28, 64, 23, -15, -40, -21, 18, 41, 31, -8, -23, 1, 35, 19, 22, -19, -24, -10, 12, 48, 15, -21, -46, 10, 31, 53, 9, -35, -30, -17, 55, 30, -23, -15, -9, -40, 48, 25, 3, -18, -31, -21, 7, 67, -13, -27, -45, -3, 42, 50, 37, -23, -3, -9, 50, 51, 27, -24, -34, 18, 62, 36, 39, -37, -49, 2, 49, 31, 8, -21, -55, -20, 19, 18, 6, -29, -63, -39, 28, 41, -4, -17, -46, -15, 37, 47, 17, -21, -26, -9, 42, 54, 28, -18, -65, -22, 41, 40, 2, -15, -44, -1, 46, 37, 4, -25, -66, 16, 12, 45, 29, -43, -35, -28, 20, 54, 15, -34, -50, -8, 33, 46, -13, -42, -47, -25, 34, 64, 0, -15, -66, -24, 45, 65, 27, -13, -10, 0, 48, 52, 33, -45, -50, -15, 28, 37, 7, -46, -51, -25, 5, 45, 10, -39, -83, -20, 22, 47, 20, -47, -24, -13, 32, 58, 12, -38, -42, -20, 33, 47, 32, -10, -8, -13, 13, 63, 17, -5, -41, -3, 38, 45, 42, -23, -47, -38, 15, 59, 27, -26, -70, -18, 43, 27, 3, -28, -58, -26, 17, 39, 7, -51]
3995e1J0kN3M7k8n8j2M5K6QLo2j6M0L8Pk1m8l2M2K3L1k0l2o7N0O2J3j4n6k2J4
4027b9L6N1k9q0j1K8M6L6l0l5j5QK9O4m0m4J0rM1M4n2j8k9M8%N0k4p3%K3K6L2
4059E4k9m7l9J5N2K9j9l8k7K7N5J6k3o3NoO5L0k1m0k7l0P1R2p2k7m2K4L2L9Ko0
4091bl4LO1N8n3o1QrN3Lj8j7n4M3J1P6l5n5k9lO9M6l1p2j7K7N5L7j1q7j7L2N6
4124C3M0l3n4k2NM8M0jq2OMM5N1m4o2Mk1N0M1k2n6k1J8L9J5l7Pk9K0M2L1k3n9
4157b7j2rN1O2m3l4k6J5L7NMl6k9%O1O0o6k6m3MQ6N1o0n2j4rO0K3qm2n2K9N1J0
4191B1k7j7o9L3P8J5j1m3j9J0M8N3j4p0k6mN7M6k9l5m5K0M8M7m0j5o6LO1M3j0
4222D3o1j2j0M4N8l2o7n%N3L3j7o3k6J2P9K1Kp3m8N3K7N1k2l2j4j0O5%L3p1q2
$$ y = [-51, -41, -43, 10, 57, 29, -29, -41, 4, 30, 38, 41, -21, -37, 3, 41, 48, 27, -21, -53, -11, 12, 43, 23, -9, -76, -26, 36, 49, 35, -21, -43, -29, 7, 58, 29, -51, -62, -34, 12, 48, 18, -17, -32, -24, 5, 69, 29, -15, -5, -14, 27, 71, 19, 1, -28, 20, 20, 70, 46, -27, -27, -4, 22, 54, 25, -22, -61, -46, 6, 35, 16, -22, -49, -22, 33, 49, 26, -37, -32, -38, 27, 57, 36, -4, -31, -61, 10, 102, 30, 3, -39, -15, 17, 56, 58, -2, -36, -33, 28, 86, 33, -28, -20, -29, 24, 27, 9, -8, -62, -19, -8, 68, 33, -22, -51, -54, 15, 61, 30, -42, -59, -32, 23, 60, 49, -38, -55, -23, 33, 73, 40, -14, -36, -31, 17, 57, 56, -26, -20, -16, 29, 80, 36, -26, -22, -43, 7, 48, 26, -30, -51, -33, 6, 21, -16, -9, -38, -18, 24, 55, 32, -27, -39, -48, 3, 65, 22, -12, -38, -23, 14, 19, 23, -13, -42, -42, 19, 79, 13, -13, -56, -52, 34, 85, 25, -27, -41, -50, 10, 33, 25, -17, -69, -40, 11, 21, -6, -23, -92, -59, 19, 34, 23, -20, -39, -29, 19, 72, 58, -12, -38, -42, 15, 61, 32, -3, -48, -28, 20, 67, 27, 12, -54, -51, 10, 53, 43, -18, -30, -40, 4, 62, 30, -37, -42, -42, 11, 44, 27, -36, -62, -50, 29, 50, 52, -21, -69, -16, 11, 62, 40, 8, -6, -16, 49, 49, 82, 11, -71]
4254g1P4L3L3k9n1l3mM5O6j9n8m7NQ0L7j7n5l8ML4R0m8o0j8lO1L6jm0m7J2M2L5
4287D8qm4n7K5O4L8k6n2m3L3K6M8j3k8o6J8L4P8k0p2l9K0L7O0l5l0n3k1J06K3
4317E1K2n9p7J1M9N6l9k3m1rP2K6lj8p8nR1K9Lm4n6nP4JK3l8p5J2N9N6l0l8m2
4350d5RK4K6L4o3k7nN0O1j6l5m4K1L1K2j3m1m8KQ0L5j1n7n5L3K6O1J9n3o4j4P4
4382A7M7j0o0m1j4O8N9k3o0m1K4M2JK1k7m3j8Q1L8l3j4o1QM6Q6n0m7k8j4N3L4
4413D1L8o0p1ON0Q6l4n8n3J0N7N6k0n5l7j9N4M8Mn3n1NM1L8J5n4n3KN9L8K0l2
4445A8n5j3O6M4Nm1p4J1L5N5jm0l3k1M3O4m3ko3nN3L1J7m8n4j0O8L3j7k5l7k2
4477f1P4J9k4jn7j7N4O2rm0o3mP2L4kj7p4oN4N0L0m6p1kL8K5N1n7n9JL8K8L2p0
$$ y = [-71, 3, 36, 69, 40, -11, -44, -48, -3, 63, 44, -14, -61, -56, 24, 61, 44, -11, -49, -45, -11, 79, 31, -29, -47, -50, 11, 47, 46, 6, -41, -29, 13, 48, 40, -4, -61, -36, 28, 66, 40, -12, -55, -22, 4, 52, 39, 11, -55, -37, -3, 75, 55, -17, -56, -36, 1, 61, 26, -4, -57, -78, 28, 51, 73, 14, -63, -52, -3, 53, 14, -9, -50, -59, 13, 39, 36, 18, -60, -65, 26, 55, 58, 14, -42, -47, 27, 28, 51, 13, -62, -50, 9, 65, 35, -3, -45, -36, -12, 14, 48, -15, -42, -47, 3, 64, 48, 13, -31, -10, 21, 43, 30, -11, -59, -57, 23, 58, 47, -10, -65, -32, -6, 55, 74, 21, -43, -57, 17, 64, 54, -6, -47, -61, 7, 66, 43, -17, -58, -34, 8, 9, 30, 3, -40, -58, 23, 61, 28, 14, -47, -39, 7, 93, 43, -4, -32, -46, 7, 41, 79, 19, -52, -46, 4, 90, 56, -2, -55, -45, 12, 68, 48, -7, -44, -63, -9, 39, 43, -10, -61, -56, -15, 23, 38, -16, -69, -67, -8, 30, 50, 18, -37, -50, 16, 60, 65, 24, -50, -39, -4, 51, 50, 10, -23, -44, -1, 63, 20, 18, -45, -50, 3, 34, 51, 3, -51, -61, 7, 40, 23, -2, -39, -61, 13, 32, 8, 7, -50, -67, -13, 49, 40, 0, -63, -67, 5, 39, 37, 20, -54, -60, -6, 44, 74, 28, -43, -45, -7, 18, 69, 12, -47, -46, -8, 20, 52, -18]
4511a8k5JL4L4Kj5p7L2NM8L5l2p6j0O4J9L0o2l4j4O2L7K3m7m0j6L1O4J2n2n7k8
4543g0K9P1mk4l5l7O8M5j7k4o1j7M3O5nl2k4k6M3M6J3qq1J1K7M8J6m4n8KK6N2
4575C8Jj2m7n4P4N2J2l7r2L5K1M7J9m7o2j2L1Q4L0o3o9KM3K1M5m9o3kN6L5L3k0
4607E0r0J1K1M0lJ1q6LL6O2L1n8o6j9M5O4j3k4n0k2L6L9Rj4n6oK6M7K6m3m8rL7
4640a3K3M6l6o2J1K8P0K6q2m7pNP4M3k8o7l8O0M2Oj7o6rJ3L4M2l8q1L6%N9M1p2
4673dn9L1JO4K7k0p3k6L7K4N0k2p4j8M7K7M1j2q4NKJ09Mk3q2k5K5P5J9n4l8n8
4705h4O3M6M1o2m3mJ8N8L2n5l3l8M4M9Lj7m1l3K3P4K1rn3m7K9L4P0o0p3qJ8P6
4737C9L6o1m4l1M4N1K4l7m3l1PR2J5l8o6j9LR4K9k8o6lLO0K4m5n3nLR9M2o3m5
$$ y = [-18, -43, -42, -8, 26, 28, 13, -64, -32, -27, 21, 56, 24, -52, -62, 2, 21, 51, -11, -45, -59, 3, 40, 63, 16, -24, -40, -9, 55, 67, 15, -42, -70, -41, 30, 26, 2, -33, -70, -2, 43, 26, 2, -59, -76, -33, 32, 27, -5, -29, -55, -12, 34, 47, 39, -42, -31, -4, 44, 60, 16, -42, -40, -14, 38, 39, 27, -20, -74, 0, 52, 64, 27, -65, -30, -9, 38, 57, 10, -52, -64, -33, 51, 81, 18, -51, -49, -6, 15, 60, 11, -52, -54, 2, 37, 70, 50, -40, -29, -8, 32, 29, 40, -46, -43, -7, 55, 86, 28, -38, -57, -12, 52, 39, 15, -35, -57, -21, 18, 27, 13, -43, -49, -23, 24, 50, 7, -41, -50, -13, 10, 56, 20, -42, -31, -3, 67, 93, 11, -36, -43, -38, 36, 79, 51, -16, -54, 6, 48, 54, 37, -29, -38, -25, 9, 51, 13, -68, -32, -32, 27, 68, -4, -63, -32, -31, 33, 60, 40, -33, -59, -22, 2, 52, 30, -44, -62, -15, 12, 53, 41, -43, -38, -36, 73, 77, 54, -28, -53, -28, 47, 66, 12, -26, -84, -21, 25, 66, 4, -39, -43, -25, 33, 65, 10, -23, -61, -17, 32, 35, 18, -23, -56, -33, 41, 62, 53, 0, -47, -18, 16, 86, 26, -47, -55, -37, 39, 75, 14, -30, -61, -17, 34, 58, 21, -22, -53, -46, 46, 61, 23, -43, -62, -59, 35, 64, 36, -30, -33, -30, 30, 54, 9, -44, -49, -46, 53, 95, 32, -13]
4770a3k9L5L5N1m3n0l5M0L8K9j1q7QK3N4J1k3n7n1K9N8N8k7n6l6J8O7O3j05l9
4800d5j4M7J6L5J1m9l5RP0L6l3n6j9QO5Lno1l5J8P5K6m7m3k2J5K7M9k4l9o1M9
4832b9M6N1m2m9j7k0M9O3l4m3l8N2L8L8k9q0lM5M3K9k6p3j3J7N6L7m1k9l7J9L0
4863A0M9m3k0n2M5K3N2k3n2n1L3P4Kk2m2k1mO5M0rp4l1KP0K9k0m0n1L6P1J3j5
4895D4l1o3J2P4K3K1q1j8jM6J9k4m4j5jN9J7l0k5p3O4N4L0l2m6l2K6O1Rpm0m5
4927d9NM5N6jn1l6%M9N7j4p9m5PJ03J1Nq1l6J9O7M5l0l9n1qO8J1j3l6n5L7K4M4
4960B9nn5l8J5P7L7qq2k9L9N4J8k2m2k4J8N4PK1o4m5j4O0M7K3o9m9K0K7N3j3n8
4992a8n2K6M1Q6m7q2Jj2Q0N6l7p0j8L8L2M2l5j6o2J8M5M0j8m3l2NN8J7J6l8o2
$$ y = [-13, -42, -7, 28, 79, 36, -14, -49, -9, 29, 58, 47, -40, -32, -9, 45, 56, 33, -24, -75, -46, 12, 70, 43, -13, -49, -31, 36, 99, -6, -45, -59, -12, 4, 39, 50, 1, -34, -25, 45, 81, 48, -8, -27, -19, 46, 49, 44, -17, -52, -34, 41, 67, 20, -23, -45, -30, -3, 46, 22, -17, -78, -29, 17, 68, 26, -23, -40, -60, -11, 52, 18, -25, -63, -11, 27, 65, 36, -44, -47, -2, 41, 70, 44, -29, -42, -25, 31, 68, 27, -2, -39, -20, 10, 59, 16, -4, -56, -11, 12, 64, 41, -11, -62, -29, 45, 47, 25, -17, -38, -42, 23, 63, 54, -20, -51, -49, 21, 50, 30, -10, -61, -25, 46, 59, 44, 13, -50, -38, 36, 59, 80, -1, -19, -20, 26, 45, 21, -23, -38, -39, 20, 37, 7, -18, -91, -27, 27, 57, 25, -21, -53, -27, 34, 43, 36, -4, -49, -44, 1, 57, 56, 5, -31, -31, 18, 75, 61, -18, -63, -56, 47, 58, 63, -18, -54, -35, 32, 77, 47, 8, -43, -51, 17, 28, 15, -21, -76, -39, -15, 29, 24, -31, -69, -54, 23, 60, 52, -30, -59, -20, 34, 52, 30, -12, -36, -18, 36, 43, 64, 0, -45, -59, 1, 48, 71, 2, -47, -27, 0, 53, 40, -18, -70, -44, -3, 83, 36, -46, -45, -57, 23, 79, 42, -28, -46, -8, 24, 66, 31, 15, -47, -29, 16, 56, 38, -5, -37, -32, 26, 43, 59, 21, -41]
5023d1J5M6L1mn7o3L1N1L8k4l8k6l1O9P0l7o6j8PK2O4Nm7m5PO8L4j7m4o3L7L8
5055A2L8qJ1r8RM3N2Po7j9j4N7N3m3l9n8PO1M6%r3l7K5M1M6K0n9l8%M9M7k4j3
5088A4o0L4J3N5k9j0m2JM2M2J1o2m7QM3K0K4n7n4%L8N1K3o6n0%O6M0Kp0k3RM5
5121A1L1Mk3q7LP5K9K1n5n7oN6M5K6p6k8j9N3M1J0l4l1k3K9K5Rl0l8K4LN2Rm8
5154An8QPJ01k6n8k5J4M4K7Qo3jl5P5L7ql5l9PL8M6j5n6l0K0ON6Jk5n6j6O2NL8
5189E5l6o5mK0O5L1o7m3pK1P2Pp4j4mM8RK5l6o2LL3N1K9m9m7rL3P7J3o1l6J6K
5223dN2Pl5o0OL0L8Ll8m6nJ0P1K3o1k6oM7M3K3q3n7J1O6K7J3l4n1oK0O9Jl5m2
5257b9OK3K4K5l5n2RN0K8J4q3l2NM3L6jl8l5oL3L6Om5l5j2L6O2K7n6o7J7M8L1
$$ y = [-41, -26, 20, 51, 47, -10, -73, -42, 9, 47, 23, -15, -41, -72, -3, 67, 30, -36, -54, -47, -25, 39, 44, -3, -48, -41, 27, 61, 44, 0, -63, -26, 12, 50, 42, 53, -45, -36, 7, 59, 66, -1, -20, -34, 23, 76, 33, -6, -64, -57, 4, 50, 50, -43, -80, -55, -14, 32, 52, -7, -45, -45, 4, 51, 27, 14, -46, -12, 1, 56, 27, 17, -25, -24, 18, 60, 71, 9, -38, -30, 13, 33, 57, 0, -54, -54, -16, 35, 58, -8, -58, -58, 8, 48, 50, -20, -43, -34, 11, 42, 46, 23, -64, -61, 14, 43, 64, 9, -48, -54, 2, 47, 73, -3, -31, -50, 3, 44, 54, 20, -11, -34, -5, 20, 29, -1, -39, -15, -12, 40, 49, 1, -57, -49, -42, 59, 33, -25, -50, -36, 8, 35, 43, -20, -21, -56, 19, 56, 48, 13, -26, -19, 19, 65, 50, -6, -36, -16, -10, 46, 47, 22, -34, -50, 12, 17, 55, 19, -46, -50, -30, 35, 66, -1, -44, -51, -30, 42, 49, -25, -39, -43, 5, 14, 39, 3, -59, -56, -23, 28, 57, 8, -39, -48, -15, 62, 75, 14, -22, -6, -4, 48, 55, 20, -40, -34, -4, 34, 37, -1, -47, -52, -42, 29, 52, -9, -35, -41, 6, 49, 72, -11, -68, -57, 9, 36, 49, 15, -36, -42, -22, 47, 48, 13, -29, -23, 0, 24, 49, 14, -38, -29, 21, 49, 63, -20, -52, -47, -4, 32, 31, -7, -42, -48, -15, 21, 27, -18, -53, -65, -29, 33, 60, 4, -63, -46, 2, 33]
5290C3Lj2n5l2O7N4j0k8m1j3L1O8Kp8m3OO5J2L0o1m4jM0L6Pk1n8k8M1R2pm5n8
5323d8RRP0Lk7m8lM2K2K6m1p0M1PP7j7k7l7m3M2N0J2k7o9J4L5N4j0k9k0m5QQ0
5356D0Pl6m2n0M7P2K0n2l7m8O0M7J3m0j9k8K9O8L9k7q8m0O7K9J1m6k3QL7K4L4
5387G6q1om5L1P3j3km3l7K7M2j0ol5k7K6P3K9o0m5k3M9J6K7k7n9OK9M8Ok5J2p5
5420d9M3N0kj6m1k7L7L9K3m9l6l0M3N2%m4l4QJ6L0K1l4k1m0N8J5Nom8k6L2P8p
5453D0j9n3k4L5N8%k5m2lKO1L8m2l3k5J0Q4k4l9j4m3K1N1Rl5m0l1L2R8j9om2j2
5486c2j8P9Pk4m2lML7L5j3m7l8M6J6M3k3n4QrL3L6j1l5k7J3M5Jj9m1k8L8L2K6
5519C5l0qo7J9N5L7k2k2m8L3M5Rl6j5k9J7N3K6m2k1J2l4N7O%n5j9L3K5M8m1m8
$$ y = [33, 36, 24, -31, -63, 4, 58, 48, 20, -21, -34, -3, 65, 67, -11, -54, -48, 17, 29, 59, -2, -46, -47, -7, 29, 36, 15, -43, -71, -30, 62, 55, 10, -48, -39, -30, 40, 43, 16, -32, -35, 7, 29, 55, 14, -56, -15, -8, 69, 52, 25, -12, -55, -13, 37, 49, 22, -47, -33, 2, 56, 46, 17, -3, -48, -40, 40, 47, 11, -31, -81, -34, 38, 58, 6, -31, -79, -19, 28, 41, 1, -18, -46, -17, 51, 90, 63, -25, -65, 2, 31, 42, -4, -27, -19, 18, 42, 76, -5, -11, -56, -25, 48, 35, 33, -10, -47, -20, 22, 12, 6, -29, -56, -30, 43, 72, 12, -33, -56, -7, 9, 36, 9, -50, -44, -15, 33, 39, 14, 26, -49, -6, 44, 42, 26, -15, -42, -5, 34, 57, 8, -28, -58, -15, 37, 37, -7, -41, -33, -17, 13, 34, 0, -21, -61, -3, 12, 17, 11, -37, -63, -31, 47, 40, 21, -32, -56, -21, 37, 37, 12, -30, -33, -31, 30, 68, 26, -7, -32, -22, 62, 38, -1, -15, -58, -37, 14, 23, -12, -52, -83, -51, 47, 28, 22, -20, -32, -50, 29, 36, 12, -30, -33, -29, 8, 43, 30, -17, -55, -9, 7, 50, 27, -27, -19, -28, 5, 41, 30, -5, -32, -19, 26, 27, 8, -33, -61, -23, 9, 35, 5, -3, -70, -51, 4, 41, 19, -3, -51, -18, 27, 36, 0, -15, -44, -27, 26, 52, 10, -11, 1, -33, 24, 30, 30, -25, -44, -11, 14, 62, 21, -27]
5551b7l5L0M6L4k9o9LoO1K9j8m9KPL0K5kp3j1M8L4J1Qo9pNO0M8p0k5k5KO5L2l2
5586C3n2k2J6N0J7l1k1pK4J4Pm3nl3L4L4K8k2j5n7K7N4J3l1k0l1J3M1K1j9k5j6
5618b4KL6M4j3k7o7L1L2J2K9l0m3k3N7QKl2l6J2K6L0Rk6o5OP9Oj0j3q3M7K8K2
5651B6Ok7m0K4J7N9n3j5l9K4M9PJ4k4m9pN5J9Kq2Qj6P4J7qm7k7oL3L7j1n9k0J7
5685d2M4M3j4l7k4PK5K5M7q8k8O4J2J2Po2rRL5L0ko2J4m0P3K1l0l8o6M9N3j9Q
5718A7j9p0L9M2K9j2l0l8L0J2M9on5j1j7P6K2j4k8m9J6N0K2j8m1l2LL1N1ln4k0
5750b8QK7L2J6q0rj0M6L1j5n1lJ2J4L7k6jl1J7L3L7k5p1j0J7M8L4J5o0l1K7J9
5782A9L2lm1m1L2lL8Jn5j1oL8L6Kn6l1J1M9K8j0l4j9MK8N5m2m6l2L6L3J8Ql3l2
$$ y = [-27, -62, -32, 14, 48, 19, -50, -47, -53, 8, 37, 19, -30, -28, -21, 9, 34, 32, -41, -52, -4, 30, 41, 49, -20, -27, -22, 38, 86, 16, -9, -34, -32, 33, 65, 33, -19, -41, -25, 25, 42, 11, -10, -17, 7, 21, 28, -15, -20, -53, -19, 15, 43, 21, 6, -51, -24, 30, 43, 12, -8, -39, -26, 15, 36, 17, -8, -24, -22, 14, 58, 45, 18, -49, -18, 14, 26, 55, 25, -18, -41, 16, 24, 26, -6, -42, -30, -4, 26, 35, 9, -56, -50, 29, 35, 25, 12, -71, -24, 4, 26, 32, 5, -35, -11, 6, 65, 12, -3, -42, -18, 31, 38, 52, 28, -21, -28, 27, 46, 48, -34, -26, -42, 32, 49, 41, -6, -33, -39, -6, 31, 20, -39, -59, -42, 2, 45, 31, -6, -30, -23, 2, 27, 74, -14, -42, 22, 34, 46, 53, -9, -18, -9, 26, 56, 54, -8, 6, -34, 39, 60, 30, -8, -74, -25, 28, 9, 17, -2, -72, -33, 9, 38, 26, -4, -42, -12, 0, 49, 43, -12, -23, -40, 36, 58, 44, 16, -33, -17, 33, 55, 37, -4, -36, -33, -2, 49, 46, -8, -28, -20, 7, 39, 55, -25, -34, -44, 2, 33, 18, -33, -36, -24, -10, 27, 1, 0, -31, -14, 19, 56, 31, -40, -50, -33, 15, 49, 64, 4, -27, 0, 19, 51, 48, 7, -34, -2, -5, 33, 34, -21, -32, -38, 0, 36, 38, -18, -49, -38, 11, 39, 29, -5, -24, -20, 8, 63, 21, -25, -57, -21, 12, 30, 38, 5, -27]
5816b7OJ5O4j5o4j4J6J7M6ml4k2j3L3M4j3n6ppK8QJ0k4l2j1O5K1Kn0m5N1OK8R
5850C1m5k5KM0RK6l2k3pL6J3K0k3j7k1K7J5K3j4n5J1ON5m0m3J6j6J4L4j2j5k9
5882c9KK5M3j4m2rJ0K8O0l9l7k4lO5j5L8l0n2L1J3M1k2k7j3k0L8L5K4m1n5mN0
5914A7QJ6l3j6k5K6M0Ro2k6LK2L7J3l2m4K3PO4pl0m3OL7L3j3n6nJ2M5J2pl6l4
5948c9M3j7K4K4k8k5k0N6QJ0l3k3k3M5K8Nl7m8J4N1%J9k0m7pPP3km7lk3M1L9P
5982E2k9k9j2J7M6k1No5j4M4N7l7k0m1J0J5O2lm3n0K0L8K4lm6j1j5K5N0Kk5l3
6014c0j6L1M3j6l5J0k6M8J2K6k9n0jL5M5J2n6k4oM7K0k0k4k2qK4K8J7m1k7MJ4
6046a5M3Kn3lj1N0MKJ1n8lL1RKNl0j1M3kK9l6k6RlL0Lj0k5k4M1L3%l5m9jN5Rk6
$$ y = [-27, -21, -6, 58, 43, -21, -35, -19, -2, 44, 40, 6, -16, -29, 4, 48, 35, -21, -28, -35, -7, 1, 11, -13, -45, -56, 9, 30, 32, -18, -63, -12, -6, 22, 31, -14, -39, -37, 3, 12, 38, 6, -17, -24, 12, 25, 45, 22, 5, -16, 11, 26, 49, 35, -20, -9, -3, 52, 12, -31, -15, -31, -17, 17, 5, -10, -39, -37, -12, 31, 17, -25, -34, -24, 4, 64, 25, -12, -36, -39, 26, 11, 49, 19, -33, -2, 11, 52, 30, 3, -10, -30, 8, 43, 67, 26, -29, -33, 17, 25, 41, 8, -8, -33, -7, 33, 42, -20, -46, -43, -21, 16, 29, -3, -47, -24, -17, 47, 40, 10, -33, -27, 10, 43, 30, -26, -31, -19, 26, 38, 31, -5, -39, 4, -13, 11, 35, 7, -18, -38, 18, 26, 36, 3, -20, -43, 2, 30, 35, -2, -50, -36, 15, 15, 34, 14, -33, -40, -33, 40, 38, -9, -12, -35, 6, 45, 52, 23, -6, -18, -1, 45, 24, 29, -36, -50, -6, 51, 14, -6, -47, -37, -22, 40, 37, -6, -56, -36, 2, 26, 23, -23, -34, -49, -24, 26, 28, 3, -30, -46, -15, 28, 12, -23, -13, -39, 9, 21, 47, 18, -32, -33, 2, 47, 59, 3, -21, -27, 20, 40, 20, -4, -26, -34, -10, 18, 35, -6, -33, -29, -15, 28, 30, -23, -26, -37, 13, 17, 19, 30, -28, -31, 0, 9, 11, 16, -14, -25, 18, 16, 45, 9, -17, -8, -11, 19, 22, 12, -13, -37, 4, 37, 37, 2, -47, -48, 7, 16, -10]
6084a0Lk9j8L7J5K5nm7pL0M4j8J2m6j0J8L4ljm5rM1L2Jj3m0l0N4J2Mk6k7j9M3
6118BL1l9j4j5JON5j0j4o2J9N0j3Rjk1Jj0O6Pj5m0kM6L5l9%l6j3N1Mpm9nj2L6
6154BK3j4k2Lj7J4K0J2j7m5K0OJ1K9j6l8PJ7K2K5k8k5mJ4K3Qk7k3Rj1P9k1m4l
6188a1rK3K8N%n3j0K1J8Ll0Jk4K2K1MKp3LM3L5Krm7QK2QJ7k7K2o3J8P3k1j6m0
6224c4J8%M7j1k5J2l7K8MK1Qn0l9O2L6k7j2j8l4L6K6mj3j1m7L7L8Oj3m5RK6J1
6257Ek%l8QJ9M6l4K3l0k5K7L6Nj8n5J9K0J7M0n4m4J8lK7J3rl7j9K0L5J9m3J1k1
6291b4J9L8Jj4o0L1K7J3P%l8j5ML0J3k4Ok6qJ4M0k2oo1M1K7J7m0l3QL4L5j7k4
6325gql3L3K1Rnpl6L8J3%j3j4j4J8J5K1j2jj3MK0J4j3ql8QK1P%l7j9L4J4M0l5
$$ y = [-10, -7, -36, -54, -17, -2, 23, 18, -29, -36, -6, 38, 20, 32, -14, -24, -6, 28, 25, 24, -21, -30, 11, 43, 44, 31, -9, -39, 15, 27, 31, 5, -22, -41, 2, 33, -6, -20, -35, -34, -28, 27, 17, 3, -59, -40, 10, -3, 6, 5, -16, -15, -25, 41, 48, 33, -7, -9, 37, 72, 33, 33, -3, -16, 35, 39, 32, -17, -22, -34, 2, 25, 11, -11, -8, -25, -11, 9, 21, 4, -41, -21, -15, -4, 25, 9, -29, -22, -5, 17, 42, 14, -11, -15, -1, 22, 30, 3, -20, -11, -22, 57, 36, -8, -11, -20, 3, 31, 36, 36, -17, -27, -6, 12, 15, -15, -14, -38, -16, 5, 9, 11, -62, -59, -16, 19, 21, 12, -35, -27, -5, 3, 20, -7, 15, -48, -30, 43, 22, 6, -34, -16, -16, 31, 20, -5, 7, -30, -2, 2, 23, 31, -19, -58, 4, 40, 13, 1, -17, -51, -15, 11, 7, -6, -17, -64, -27, 11, 17, 4, -41, -32, -6, 5, 3, 3, -35, -27, -8, 38, 4, 27, -3, -28, -1, 35, 40, 22, -33, -14, 6, 23, 63, 9, -35, -17, -20, 7, 20, 11, -26, -45, -25, 10, 29, -14, -3, -24, -5, 33, 34, 20, -40, -9, 18, 31, 38, 38, 0, -15, -11, 19, 32, 8, 14, -12, -20, -6, 34, 12, 6, -55, -14, 13, 30, -10, -43, -35, -1, 34, 17, -7, -15, -48, -15, 6, 15, 10, 3, -33, 5, 18, 18, 5, -9, -23, -5, 10, 31, 19, 18, 5, 9, 29, 43, 30, 22, -16, -8, 13, 20, 20, -17, -36, -2, 12, 52, 17]
6361A7m1J8l3M7Nk0n1%L4K4pkk2kK5L5k6J2l3m5M8L0L6j3p0K6PK4%J4m2j5K3%
6395CL1j8n8J0J8MK5pl0j0J2L8rk1k2k3M8J2J5J9m8QoMK9Ok5m1QL6J8%j5k4K3
6430A0J9L9m1k4m3M4PK2k3m2J5qJ8K3m1j6K6k5O3lKn9jJ2J1N0k9k1OoJO0k8k6
6464hkj3L5lQj8j2K9NM4m9m0OK9pK9j6k0l0K8MM2l0m8j0K9OKL5n0K3j8J8K7jn
6500A9m2K8K5J3k5l2K5%OmK4j4n3L5J0Oj2j3k5mL8K3l8Jj6%J4O0j2p4pK7J0J2
6534Ej1pj5MK2N3l7k2J5LJ9rj8j4J6K3l2N5k3n3J7rL1%k5lKj7K6M0l1%l2QL6k1
6570dK2m0nmL4L5n4j1%J9K4K2l3J7l4j0L9K2j3k5NQoK8m0qJ0j5J5J8j8k8j2J1
6604c1L3K1k5j4j2mK4L0k7k5L4K2mJ1j9k9m5N2L3mJ3k0l9J3J9M1k1n0J9PjK0J1
$$ y = [17, -24, -6, -39, 8, 13, -7, -58, -58, -24, 0, -7, -9, -31, -33, -8, 27, 1, 13, -20, -65, -17, 13, 49, 36, -34, -8, -1, 23, 23, 37, -5, -20, 3, 3, 34, 16, -42, -32, -14, -10, 15, 8, -22, -32, -20, 18, 9, -12, -34, -57, -9, 3, 18, 37, -11, -3, -9, -5, 24, 30, 5, -36, -28, 8, 26, 26, 11, -13, 10, 29, 68, 27, 3, -40, 4, 11, 33, 10, -32, -17, -25, -7, 16, -25, -41, -15, -40, 23, 20, 22, -37, -38, -26, -15, 35, 6, -15, -9, -15, -14, 46, 18, -8, -10, -23, 12, 9, 17, -1, -13, 16, 21, 65, 16, -24, -18, 11, 4, 33, 17, -3, -33, -5, -1, 41, 11, -37, -47, -18, -12, -10, 25, -25, -2, -20, -2, 25, 24, 19, -23, 5, 30, 43, 18, -14, 11, 11, 17, 13, 37, 23, -30, 5, 15, 21, 9, -4, -29, -33, 5, 28, -10, -9, -25, -25, -11, 49, 37, -37, -44, -17, -7, 5, -6, -13, -28, -24, -2, 51, 14, -8, 7, 10, 29, 20, 2, -12, 4, 27, -5, 50, 27, -26, -9, -18, 13, 13, -12, -15, -13, -30, -4, 36, 5, 5, -27, -19, 17, -4, 18, -22, -27, -31, 3, 38, -16, -27, -27, -8, 16, 38, 5, 22, -12, -22, 17, 39, 26, 1, 6, 14, 8, 36, -4, -12, -2, -17, -2, 16, -2, -30, -42, -31, 2, 23, -2, -16, -28, -32, -8, 22, -5, -30, 4, 26, 22, 33, 14, -15, -60, -8, 25, 21, 34, 14, -25, -12, 7, 48, 27, -23, -4, 3, 2, 22, 33]
6637C3n0QOj1L7j7k1j0J5jK1Mj3k6J0LK8J0l1k7J1M0kKpl6LK2M0j4k0j0NK5K4
6672E1k5j6pkqM7j7k6j5KM1Lk4Jm9L2OJ2J2m1k8M9OkJ9l0j7J6K7K0j9j1j6J1L0
6707C2jk5pJ2j0K6K0k4j7j7%K5J6k4%k7k1P6pml0j2rK5J1Rl6J1qlM4k1kk1L3q
6743Fk1N4k5l3KL6NJ2k0j6j5L3kj2J1k1Nj3K0KJ5n6K7%L0l1Kk2pK4K3l2Lj9RL
6779b3M4K2l8j5k4N1J7l2ll2K8kL5nj1k7J0jL5mm2K0j8QJ2Nk3l5J5K2L2k8J3j7
6813a1l3M2J2K0m8j6J1L9j1R%l0k0M2K2j8j3j3J9J5j6M3jl4j6M9j2k1pjk3MM9
6846C2l3qJ4l1nJ4mK1l4KL4nK1m6J7lL2qJ8j6k7K8j4J4L5l4l3PK0K7j0nm8M4j1
6881EJ3LLm7JL2K6j5l6j3LK2J6J8k8m2L2J3lkolpL7J7kk4j2l1K0N2j3l8J8oJ1
$$ y = [33, -17, -9, -3, -14, 23, 6, -15, -25, -10, -11, 10, 14, 1, -25, -15, -12, 16, 26, -5, -32, -21, 19, 17, 19, 12, -24, -21, 1, 41, 27, 7, -3, 2, 27, 51, 26, 10, 3, 1, -7, 40, 23, -3, -18, -16, 25, 28, 4, 5, -44, -12, -6, 6, 18, -23, -51, -2, 4, 2, 21, -9, -26, -10, 17, 37, 18, 7, -9, 2, 32, 31, 6, -1, 11, 1, 27, 47, 23, 6, -11, -11, 14, 30, 6, 6, -21, -42, 34, 27, 23, -7, -19, -28, -3, 8, 17, -19, -8, -16, -19, 25, 4, 2, -19, 14, 6, -15, 39, 14, -19, -17, 19, 24, 36, 16, 0, -15, 18, 16, 4, 15, -6, -1, -14, 6, 8, 23, -33, -6, -6, 24, -7, -5, -27, -34, -10, 13, -19, -16, -35, -26, -23, 21, 43, 5, -10, -34, 17, 34, 2, -1, -33, -5, -7, 28, 23, 12, -15, -5, -6, 29, 25, -17, 3, -15, -7, 5, 10, -13, -48, -33, -11, 21, -7, 6, -11, -44, -2, 10, 30, -18, -34, -23, 16, 5, 14, 14, -16, -36, 6, 28, 10, -3, -16, 3, 18, 2, 45, 44, 10, -6, 43, 31, 10, 3, 2, -21, -17, 32, -1, -9, 5, -26, -31, -17, -21, 0, -34, -32, 2, -3, 18, -28, -11, -14, 18, 10, 28, 12, -15, 13, -1, 13, 48, 14, -19, -12, 8, 35, 25, 20, -28, 16, 5, 18, 21, 24, -23, -22, 10, 36, 21, -15, -28, -25, -3, 13, 31, 3, -39, -7, 6, 3, 1, -5, -8, -15, 22, 39, 37, 13, 1, -30, -10, 42, 29, -9, 9, 3, 14]
6917A4J1k3jJ1m2J8L6k4jk3J6mJ2MLj8QJ1lJ1m4Mj0M7j0M1n1O%JJ4J9k5k9M4J
6953B4jkjk2oOJ8j3Pj7j0QOL4m2jMJ3K1j2Rl8nQK9mj1k6k3M4J2K1k6Qk8K3N5k2
6991D0k4j5qJ1N9j6l0j6lL1%J9n4j5QJ2PJ7k1rrK3k3K4nk6M1k2L6nln1K6j6M2
7026B5nj0j6QkJ9Jj2rJ5j1L6J1n0j8pM1oK6m2rJ1k4J5JnqJ5J2K5pm9J2nQLL1M
7064B4j5k0kP6l2k4J9m9J4K1J9km2QK4N%j7k1j5RK5K0l1j9L2l4L6L0l1l2J2K0
7097Hj2J6Jj0k9J5L3LJ1n6oL3K5j2j8J9k2J9JPj1k7NK1K1k5j4J8l0J3KL5m9J3
7131bk9J5M0l0ojK0k0J2mqJ2n%j2M0j3l9J3J5K6J2k1J1k8L6j1Qpj1j1jQL2l4l0
7167b3j4K3K4J8m9J3Nj2J3Mmj4J1J1J7lj0Ll7K0NJ3rj8RQJ3j%%j0L6j6j2j0kL
$$ y = [14, 25, 2, 1, 12, -30, -12, 24, 0, -1, -24, -8, -12, 0, 4, 7, -11, -3, 8, 5, 16, -28, -24, -34, 13, 3, 44, -7, -1, -1, 0, 14, 33, 8, -21, 23, 24, 23, 21, 20, -2, -8, -2, 16, 3, 10, -7, -17, -9, -3, 31, -11, -12, -8, 5, 26, 14, 23, -15, -20, -12, 17, 13, 2, -24, -47, -3, 9, 30, 4, 12, -16, 7, 62, 40, 16, 1, -7, 4, 63, 47, 17, 1, -2, 29, 29, 48, -6, -21, -13, -1, 6, 23, 2, -7, -16, 7, -16, 8, 3, -23, 18, -4, 32, 27, 24, -27, -1, -17, 25, 20, 10, -6, 2, 0, 19, 20, 8, -1, 14, 3, 39, 50, 0, -18, -25, 16, 10, 36, -6, -15, -4, -28, -13, -12, -17, -25, -10, 2, 27, 20, -29, -17, -22, -14, -11, 20, 24, 9, -11, -13, 63, 31, 7, 26, -23, -9, 12, 31, 29, -13, -5, 19, 24, 24, 7, -14, -29, -20, 5, 25, -6, -25, 7, -27, 9, 39, 8, -24, -12, 8, -4, 12, 13, 3, -26, -11, 22, 25, 36, -20, -26, 7, 32, 20, 2, 21, -1, 18, 19, 26, 15, -12, -7, 14, 35, 10, -4, 14, -16, -3, -1, 34, -15, -2, -31, -16, 24, -6, -12, -13, 7, -13, -1, -5, -13, -1, -6, -6, -18, 22, 9, -30, -17, -2, 24, 36, 15, 26, -2, 34, 23, 31, 24, 13, 2, 1, 9, 41, 7, -23, -37, -14, 10, 28, -21, -8, -3, -15, -2, 2, -2, -16, -5, 6, 23, 20, 10, 13, -24, -4, 1, 14, 5, -13, -4, 4, 17, 16, 16, 16, 6, 42, 26, 14, 4, 2, 5]
7204ErJ5j3Nj4lj5L6%Oj7k4RKNKj3L0j6J2qK7k1j0NL8k1Qj4j7K1K2l4%L3n4PK1
7242FK5j2k5qJ7j3J8j6J4j1l3L1k2J0k5L3j1MN3m8Qk5M4j0oL3jJ%%lll4J6pOK6
7279C2j8nl3L3J6Mj2l2J0k2L4qrkj0j3J6K5j1p%J4PK%k7K4jMK7k7j2J8j0J9mr
7316A3J0l5J7J1OKk4kj1K2j2K0j1j9NL0rJj2j7K3ol1K6Ol9K4M1l1Qpj0j5L1QR
7352B2k1QLjK6j5oj0JNK4l0j0LJ6l2PJ3j1j5oN9l5Oj1k3RO9j8m3L2k7lJ7KM2l0
7389A7k4NJ5K8Op4J6J3L1jkOl8%K0j4J3j5j4J8j2J0j1j3K4m7N5Rok5Pl8L0J3j5
7424a3K4k7L7mMj3Rj7pL6Kk7Kj2J1J9Nj2K3n2j3O2k4j2Pm1J0L6Nl6j9K4qJ1j3
7459b3K5j4j5J3K5K7m3j0K6KlL1J1l2k3K2rJ7k6K9l4k2L7K8k5%k3J7pJ0J4k2R
$$ y = [5, -4, 11, -2, 3, -11, -14, -29, 7, 7, 13, -4, -28, -19, -17, -12, -10, -23, 7, -9, 3, -5, 22, 1, -9, -4, 34, 13, 21, 7, -10, 11, 33, -1, -1, 32, -22, -15, 6, 31, 19, -6, -14, 3, -10, 8, -8, 6, -5, -38, -7, -29, -19, -44, -11, -22, -18, 35, -13, -5, -30, 14, 4, -2, 31, 30, 31, 31, 31, 28, 25, -9, 7, 0, 6, 32, 14, 9, -24, 9, 25, 29, 17, -15, -5, -27, 7, -1, -10, -12, -22, -35, -19, 6, -5, -12, -12, 2, 9, 11, 11, -16, 8, 7, 11, 38, 11, -1, 17, 7, 26, 22, 13, 23, -12, 5, 16, 22, 24, 0, -2, -13, 9, -3, 17, 6, -13, -8, 22, 13, 14, 2, -15, 8, 2, -29, -3, 3, -36, -12, 29, -2, 6, -1, -11, -26, 5, 13, 22, 1, 9, 12, 11, 37, 22, 16, 6, 7, 12, 36, 6, -4, -1, 15, -17, -10, 3, -8, -23, -29, 30, -5, 1, -10, -33, -24, 45, 27, -16, 16, -11, -14, 3, 5, 47, 17, -7, -2, 13, 41, 47, -27, -11, 2, 33, 32, 30, 36, -2, -2, 18, 4, 17, 2, -12, 6, -6, 4, -7, -20, 4, -43, 12, 21, 15, -10, -3, -41, -11, 2, -13, 11, -16, 21, 17, 21, 8, 17, 0, -7, 29, 31, 4, 6, -6, 5, 24, 29, 17, 40, -12, -25, 37, 13, 1, 8, -33, -23, 13, 18, -18, -37, -13, -21, -10, -23, 2, -12, -27, -14, 11, 38, -5, -15, 11, 13, 10, 41, 52, 20, -3, 19, 10, 27, 1, 30, -4, -26, 11, 39, 14, 14, -9, 8, 1, 11, 25, 3, 12]
7492A2l0L2jppk8QK0K6l2J5l8L7KKpj1MjM5j9LnlLj3KRj5J1l3K4%Pj2k8L8J0k6
7531fJLj1rL2j7J9k2J8k2nJ5OkpkJ2L3j9j0Mk3L2lj0J8nLjJ8mj4k1L3k7J8k5J2
7569A2k9L2k3j3mJ2P%K3%rnj9JJ8L6k1j2rPJ4jJ5m1lK0%J9Oj6j0oL4Mll9K9k5
7607AJ6j1Rk3KpqJ5J5J3l3KjL5l6k8L3OJ3J6Qj8l6J9LJ7rJ1k6jK9qk8L1k6OK4
7644B5Mk0j3L1j8J7nj6Rl0rQL2j8J7k1mPj1Pj2Nj1K1M2l6%L6m2M0k0oj3kj4K3
7680CL1j6q%nK4l3L8k9j6L2k4J5%Om3MRmJ0J2l0J2KJ6mJ0k0j9L6rJ2Pj4jK1Km
7718B3k8OK2j4J7J4l3Lk3K5j6J5j0j7NK4Pj0l4J3K7k1J5j1nj6L1NQj0rk4NL3j6
7753AK5j2Pj2RJlj7K4j1%PpQJ4k0l2%J7j4Rk6MK4pooOJ8J2pJ2l3jJ2K2j7J2Kl7
$$ y = [12, -18, 14, 13, 6, -1, -29, -21, -1, 25, -7, 8, -30, 7, 9, 11, 4, -7, -3, -4, 41, 22, 25, 20, 17, 20, 7, 9, 18, 3, 14, -19, 5, 5, 12, 0, -28, 10, 20, -6, -5, -2, -13, -22, 10, -7, 12, -10, 8, -14, -19, -4, 2, 0, -7, -9, 3, 36, 17, 7, 11, -12, 20, 17, 7, 25, 20, 23, 22, 40, 36, 22, 1, 34, 7, 25, 0, 12, -17, 15, -8, -21, -25, -13, -6, -6, 17, 17, 8, 3, -16, -15, 3, 39, 18, 6, -3, 4, 18, 17, 32, -9, -12, 8, 8, 27, 33, 17, 7, 1, 35, 39, 36, -3, 26, 1, 17, 6, 15, -8, -6, -13, -21, -6, 9, 22, -11, -9, -10, 25, -11, -39, -6, 0, 13, 29, 37, 19, -17, 2, 5, 22, 13, 24, -2, -3, 26, 18, -10, 21, -5, 1, 25, 29, 9, -4, 27, 9, 26, 21, 5, 14, -16, -25, -17, 15, -3, 14, -7, -11, -4, -15, -8, -20, -15, -26, -5, 37, 1, 1, 37, -5, 35, 15, 9, -4, -6, -20, 3, 34, 18, 10, 10, 5, 29, -4, 34, 5, -11, 21, -3, 12, 12, 18, -25, -21, -12, -16, -6, 6, -24, -12, -10, 6, 2, 12, -8, -27, 9, 0, 12, 19, 5, 4, 25, 27, 23, -5, 1, 23, 9, 26, 40, 7, 10, -13, 12, -4, 11, 1, -16, -11, 13, 20, 10, -24, -11, 16, -5, 10, -1, -6, -22, 9, 14, 22, 12, 3, -21, -16, 17, 1, 26, 14, 21, 9, 18, 19, 16, -1, 23, 12, 12, 19, 12, 20, 34, 14, -18, -18, -1, -15, -6, -32, -28, -4, -11, -17, -23, -17, 1, 13, 6, 18, -15, -16, -4, 18, 1, 13, 15, -22]
7793b2L1%%k1K4j2L0j2Npj9jPL8j5j5j6J4l0L2k6j5L0lk9L7j3mj%J8KLk4kPJ9
7830A0Qj5J0j2lJ1lJ9l1K8k1kK6j9Qrj6PL0jrj8mJ8rQj2JMrMQpj7lK3j0LKj2K5
7871A1MnoJ5j9oML3j9J0l9K2J3k7K1j0l4M6j4oQRl9L8%ok5K3k0MJ0OK0k8Oj0J2
7908BQjL4n4K1J2k0Jj5L6k7pJ6J1Ol6K8QJ1l9K7m0MK3KMj4Kk2RL8l9J7l1MK5k3
7945a9N1k8kj1j0J9K2j2j7J4mK2rjj2LJ6k8N6k8k9J9J7m7K0J0Kj3NLm6K8MJ7p
7980Ej2pOJ1lJ2Kk0J4j8j3L9j4K6l6J8LJ3jnnMl1J9L4k4j3joOJ3j8Lj6J4JK7q
8018A9m4J0J%kJ1KJ7j9K2jk0K2j5QRnJJ5k3J1kj7J7j2j9LL0j0Qj6noK6K1l8Pl0
8056b4qJ7J4rmKlJ9j4jnj7J6JK5nJ5k3qK9Njj2JJ1j4QJ0noj0KlK9jl8J7Mrj4P
$$ y = [-22, 9, 9, 9, -12, 12, 0, 30, 18, 23, 16, -3, -4, 3, 41, 26, 11, -5, 9, -21, 11, -15, -30, 0, -3, -32, 5, -8, -12, -13, -13, 5, 7, 10, -14, -16, -9, 10, 18, 3, 13, 1, -2, 9, 6, 25, -6, 22, 1, -1, 25, 6, 14, 5, -11, -4, 26, 25, 16, -2, -6, 12, 3, 11, -1, 0, 4, -5, -1, 7, 0, -17, -20, 3, -7, -4, -2, -14, 11, 15, 10, 4, 19, 0, -6, -2, 31, 12, 22, -17, 5, 18, -9, 12, 2, -32, 14, 0, -6, 2, 11, -28, 10, 10, 4, -21, 2, -18, -14, -4, 2, 22, -6, 0, -10, 2, 10, 9, 43, -11, 10, 22, 2, 3, -12, 24, -3, -10, 6, 17, 23, -13, 15, 23, 34, -5, 22, -18, -14, 9, 11, 15, 1, 3, -19, -10, 28, -11, 6, -25, -21, 4, -19, 32, 4, 2, -9, -19, 0, 22, 10, -7, 7, 3, 25, 16, 15, 3, 6, 22, -6, 50, 22, -7, 12, 29, -18, 2, 12, 14, 1, 6, 9, -37, -9, -5, 12, 5, -7, -14, -8, 3, 0, 12, 14, -6, 8, -10, -23, 16, 2, 28, -8, 10, 13, 26, 25, 20, 15, 19, -12, 7, 41, 17, 4, 3, -3, 3, 16, -2, 1, -15, -1, 0, 27, 19, -25, -15, -14, -14, -16, -5, -3, 14, -5, 17, 16, -4, 18, 3, 11, 20, 15, 16, 31, 8, 19, 17, 0, 17, 5, -14, -11, 19, 9, 17, 1, -4, -10, 16, 37, -1, 6, -24, -32, -15, -1, -10, -14, -12, -15, 4, -10, -11, -16, -33, -17, -16, 9, 4, 19, -4, -12, 17, 22, 21, 9, 10, 21, 7, 15, 25, 20, 14, 4, 6, 3, 32, 31, -7, 10, 14, 5, -9, -2]
8097blj6J0J7KKl4L0nJ2k0J8Pl8M1Jk2j2OJ7J3J3j8jOOj2Lj6Qj9RJ4pj5K6k4r
8135a2qL6m3K0%J9k5oM2rj9j4K7KrJk4%lL7k7J1K1Qj1L1l9Qj2lL0j7lM%j4L0l1
8173bOMnrJ8k7J2j1m%KJ3LoJ1rJ1Q
$$ y = [-2, -5, -21, -11, 6, 8, 10, -24, 6, 1, 13, -7, 11, 18, -20, 21, 22, 0, -12, -6, 11, 24, 37, 19, 18, 24, 30, 18, 21, 5, 13, -6, 3, 17, 10, -5, 21, -3, -12, -20, 16, -27, -7, -7, 12, -13, -19, 23, 14, -5, -19, 8, 10, 1, 2, -22, -22, -25, 12, -15, -4, 17, 25, 14, 45, 6, 14, 2, -1, 29, 12, 9, 13, 13, -1, 29, -2, 4, 8, 3, -6, 12, -15, -3, -14, -18, -18, -16, -3, 0, -6, 5, -4, 7, 15]
8191A5
$$ Imaginary data points
##PAGE= N=2
##DATA TABLE= (X++(I..I)), XYDATA
0@%%%%%%%%%%%%%%%%%%%%%%%%%%%%%%%%%lJ1j6J6j6J6j6J6j6J7k1K7l1L2l3L6
49A9m1M6n0N5o2O8p4Q2r1J02j14J28j46J66j93K27k72L40m47O58k232P364L040
72H573n163p148n775N879Q654M033m902q882k821M096P829M690n474p437l726
87g574L765Q560K297l236o588n850N007P749K155k100p356m720L738P300M283
102G430l828o816l671K072Q286M120l971o281m752L465P638K923k072p507m689
117g653M700O179L302k310p302l655L170O910L255l468n354m066K365P473K522
132F068k630n457m240L098N865L240j688o727l317K723N214L971k186o046l675
147e787K074O304L012k063n159m729K592O293K631j529n659m050K565N415L635
$$ y = [0, 0, 0, 0, 0, 0, 0, 0, 0, 0, 0, 0, 0, 0, 0, 0, 0, 0, 0, 0, 0, 0, 0, 0, 0, 0, 0, 0, 0, 0, 0, 0, 0, 0, -3, 8, -8, 8, -8, 8, -8, 8, -8, 9, -12, 15, -16, 16, -17, 19, -22, 24, -26, 29, -33, 35, -39, 43, -48, 54, -60, 68, -78, 88, -105, 122, -150, 190, -257, 401, -1831, 5533, 8573, 3410, -3738, -9513, -3634, 5020, 9053, 4151, -4731, -7552, -3456, 4373, 9063, 3589, -3848, -7574, -3809, 4751, 7048, 3812, -2776, -8626, -3619, 4130, 6285, 4185, -3171, -7891, -4153, 3147, 7430, 3602, -3214, -6885, -4813, 3473, 7593, 3622, -2659, -7411, -3946, 3692, 6615, 4543, -2964, -7653, -2953, 3226, 6528, 4218, -3084, -6739, -3569, 3341, 6596, 3128, -2226, -6292, -3927, 3546, 6068, 3438, -2019, -6259, -3161, 2704, 5944, 4256, -2471, -5788, -3065, 2149, 6120, 3934, -2112, -5787, -3713, 2591, 5603, 3540, -1619, -6348, -3756, 2537, 5168, 3639, -2020, -6070, -3505, 1910, 5545]
162E545k016n769l108J775N526L610k165n073l704K010N678K730j283n107m118
177e469K472N020K920j186n312l573J808N039L360j773m786l506J347N367L032
192D760j500m608l844J808M945K923r93m964l603J867M587L181j144m765l457
207d807J448M873L020j284m289l715J452M826K808r48m444l664J585M429L018
222D308q83m573l375J371M351L094r36m331l492J288M444K850p84m175l634J428
238c049M183K890o23m283l458J313M042K994o62m211l362J174M042K924o05m081
254g72l437J236L931K871m87m059l370J206L770K881m12m043l252J107L660K930
270C760m44l906l256J003L575K898k60l905l284R50L468K980k17l918l231Q92
$$ y = [5545, 3529, -2240, -5348, -3573, 1953, 5563, 3398, -1675, -5379, -3369, 2309, 5039, 3756, -1351, -5469, -2997, 2023, 4943, 3757, -1555, -5128, -3320, 1719, 5079, 3306, -1480, -4986, -3639, 1728, 4760, 3260, -1348, -5192, -3384, 1561, 4484, 3491, -1473, -5076, -3209, 1378, 4559, 3415, -1350, -4807, -3359, 1514, 4534, 3250, -1039, -4754, -3302, 1524, 4332, 3384, -1060, -4724, -3139, 1290, 4308, 3425, -1148, -4523, -3152, 1199, 4293, 3357, -974, -4466, -3178, 1266, 4116, 3332, -843, -4477, -3049, 1134, 4024, 3401, -882, -4340, -3027, 1015, 4009, 3347, -864, -4226, -3052, 990, 3914, 3309, -772, -4209, -2973, 958, 3829, 3342, -717, -4087, -2881, 889, 3770, 3358, -685, -3937, -2830, 830, 3760, 3316, -590, -3846, -2843, 732, 3630, 3370, -535, -3819, -2869, 599, 3579, 3362, -556, -3787, -2895]
286b895L443L040k48l877l227Q82L442K977k59l818l158Q70L382K915k37l753
302e21l041Q39L230K898k44l623k954P06L120K886k01l430k972N64L010K869j3
319C123l463k939M58K904L024L6l450k978L75K923L116l7l404k990L60L063K995
336C116k0l398k996M66L012K935o3l393k784M24K867K886j36l220k685L07K788
353A06K777n3k996k764K60K672K671J61k929k824J81K529K859K45l018k717j0
370b850K561L039Q2k880k824m6K718K891K40k972k940K67K572K818K80l103k698
387b845K47K499K832O5k881k569k0K642K663K0k554k747N2K449K586L56k743k607
405b555P5K054K858L95k865k378k06K145K898K80k474k783j75K441K573N10k576
$$ y = [-2895, 548, 3588, 3340, -537, -3764, -2882, 560, 3537, 3278, -540, -3698, -2828, 554, 3469, 3232, -521, -3562, -2723, 507, 3405, 3161, -462, -3416, -2710, 410, 3296, 3095, -335, -3307, -2743, 267, 3136, 3123, -340, -3279, -2821, 83, 3107, 3143, -307, -3285, -2910, 13, 3129, 3092, -312, -3302, -2942, 121, 3116, 3096, -302, -3298, -2832, 180, 3115, 3052, -341, -3125, -2701, 166, 3052, 2916, -304, -2989, -2682, 106, 2883, 2830, -166, -2930, -2670, 2, 2673, 2834, -95, -2919, -2738, -209, 2650, 2895, -123, -2840, -2850, -289, 2750, 2832, -48, -2872, -2918, -200, 2691, 2931, -41, -2981, -2714, -142, 2676, 2956, -147, -2845, -2598, -99, 2733, 2798, -83, -2652, -2672, -30, 2633, 2653, 99, -2648, -2596, -147, 2439, 2795, 52, -2555, -2480, -426, 2432, 2827, -38, -2416, -2622, -477, 2421, 2701, 227, -2556, -2731, -290, 2283, 2793, 217]
422B17k840M9K203K723M90k809k392j59K079L013J24k614k300l40K248K695K69
439B656k370k652L8K004K415P20k613k510nJ795K766L97k471k196n91K127K794
456B304R6k042k444n17K133K584N21k393k453j14J645K736O98k651k171l32J737
473f63K825K77k116k267o49K195K466L04j852k515l95J899K504N78k329k075m42
490b255J455L008L07k319j886p67J829K636L36j827k496m67J918K237P05j959
506D55k437l63J626K621M49k061j902q53J715K829J24j753k033q45J847K408N32
523B359j780k411l21J487K329Q32k046k134n65J467K622L60j689k041r68J894
539f05K396K98j431k280p40J720K262O89j775k131m95J243K552O54j905j918q03
$$ y = [217, -2623, -2574, -371, 2352, 2842, 33, -2359, -2518, -439, 2574, 2698, 84, -2216, -2556, -308, 2387, 2656, 286, -2366, -2328, -324, 2091, 2811, 198, -2312, -2317, -522, 2244, 2641, 170, -2026, -2617, -490, 2304, 2400, 358, -2086, -2603, -470, 2114, 2635, 242, -2211, -2325, -680, 2056, 2754, 103, -2068, -2400, -663, 2162, 2439, 323, -1944, -2593, -398, 2068, 2372, 520, -1995, -2390, -491, 2013, 2591, 262, -1813, -2255, -800, 2208, 2515, 196, -1690, -2457, -628, 2008, 2344, 517, -1979, -2446, -528, 1709, 2414, 455, -1982, -2345, -719, 1902, 2351, 290, -1612, -2465, -750, 2079, 2203, 450, -1583, -2428, -581, 1827, 2359, 579, -1832, -2153, -666, 1663, 2495, 449, -1685, -2250, -783, 1839, 2199, 510, -1531, -2499, -605, 1791, 2089, 658, -1622, -2362, -642, 1620, 2309, 534, -1597, -2092, -849, 1703, 2357, 452, -1466, -2269]
556b269J542K484L74j433k233q40J822K105N92j426k340n83J498K294O17j737
572D67j874p62J339K522L99j544j835r17J558K204N95j378k213o10J376K096Q19
589B242j543k092o68J254K363N65j493j889r95J445K394M27j312k036q65J450
605g53K173P04j469k041o39J235K223O93j501j870p96J270K242M99j274j853r74
622b131J452K063N47j157j943q22J165K105P17j287j837q81J103K234O34j196
638G66j809j055J241K200N96j087j974r74J341K059O63j175j952q56J182K137
654A303O18j209j763r77J229K106N26j040j835r84J232J952O62j007j839r28J133
671h21J926P13r74j790j028J111J999O49q89j797j102J107J975P25q74j869j048
$$ y = [-2269, -727, 1757, 2131, 698, -1535, -2375, -553, 1552, 2144, 718, -1622, -2205, -707, 1587, 2204, 467, -1407, -2169, -830, 1692, 2091, 547, -1288, -2205, -647, 1557, 2152, 774, -1439, -2049, -673, 1423, 2242, 699, -1393, -2061, -807, 1556, 2121, 628, -1261, -2256, -811, 1583, 2010, 698, -1338, -2203, -753, 1420, 2124, 655, -1386, -2025, -790, 1433, 2126, 625, -1245, -2041, -771, 1471, 1970, 696, -1157, -2131, -679, 1384, 1931, 774, -1169, -1991, -826, 1279, 1996, 709, -1128, -2009, -906, 1328, 1962, 766, -1043, -2098, -857, 1343, 1939, 852, -1122, -2096, -755, 1304, 1967, 792, -1160, -2016, -834, 1303, 1921, 712, -1051, -2028, -799, 1307, 1833, 793, -1042, -2026, -794, 1158, 1820, 813, -1026, -1954, -821, 1105, 1818, 844, -946, -1974, -863, 1136, 1785, 896, -901, -2003, -896, 1079, 1804, 930, -939, -1987]
688a987J124J932P70r37j856j038J134J934P22r35j809r94J096J901O67q59j788
705i23r96J085J830P02p99j798r64J014J794P48p56j780r97R87J766Q09p34j801
723h13j034J019J750P94p11j847j017R79J739Q61p60j812r84R29J759Q33p55j748
741h18j010R80J696Q18p40j732r73Q91J702Q25o64j738r61Q58J671Q38o55j695
759g07j015Q29J680Q24o22j697j049Q74J605Q72o20j699j019Q16J639Q78o23j677
777g11j004P57J691Q45n92j635j034P75J628Q49n62j658r92P63J537R15n61j668
795f57r56O97J558Q93n51j577j065P27J570Q55n02j602j057P45J508R14m82j616
813e98r89O75J524Q88m77j582j008O50J535Q45m52j539j064P17J426Q68l75j613
$$ y = [-1987, -863, 1069, 1839, 902, -954, -1992, -858, 1076, 1798, 863, -946, -1940, -844, 1057, 1724, 865, -923, -1919, -834, 996, 1698, 899, -899, -1863, -849, 945, 1693, 937, -843, -1840, -853, 913, 1722, 988, -813, -1847, -828, 922, 1716, 1005, -842, -1859, -880, 859, 1720, 960, -852, -1836, -907, 852, 1685, 930, -818, -1828, -848, 848, 1666, 926, -806, -1779, -888, 814, 1639, 975, -763, -1724, -866, 805, 1643, 988, -707, -1722, -893, 787, 1611, 989, -708, -1757, -883, 722, 1594, 974, -725, -1744, -928, 711, 1589, 966, -711, -1715, -958, 733, 1578, 986, -649, -1683, -908, 720, 1569, 1007, -651, -1643, -880, 657, 1572, 1011, -657, -1613, -916, 642, 1535, 984, -593, -1658, -931, 639, 1494, 992, -610, -1667, -922, 586, 1500, 1018, -598, -1587, -912, 612, 1500, 1023, -559, -1567, -917, 618, 1463, 1011, -528, -1592, -875, 551, 1419, 1044, -569]
831e69r73O57J354R82m17j573r86N54J470R10m09j453j104O42J452Q61l09j576
849d87j017O50J258J010l27j578r50N29J321J006l90j464j029N38J378Q81k82
866A047j480j066N88J309R60k59j574r14M88J231J094l95j493q60L95J328R76
883A375l05j469j028N77J227Q86j66j544r58N59J104J076l05j478q70L47J254
900B82J033l42j326r82L68J294R40j80j446r79M66J118J067k10j530q32L61J149
918B51J108l58j346r28L20J286R23k97j249j029M10J167R42j99j408q07L25J018
936A29J134k94j329p82J74J148J051k59j203j013K98J170R30j20j292r95L51J048
954A46J098k06j345q25J42J143J133l44j213q49J37J198R39j76j208r88L39J030
$$ y = [-569, -1542, -885, 469, 1451, 1034, -539, -1525, -971, 499, 1409, 1000, -453, -1557, -915, 537, 1398, 1089, -487, -1504, -854, 404, 1414, 1087, -491, -1441, -912, 409, 1415, 1025, -439, -1468, -930, 448, 1329, 1047, -433, -1499, -911, 398, 1358, 1099, -475, -1389, -901, 330, 1424, 1029, -464, -1324, -929, 399, 1375, 1070, -399, -1427, -850, 377, 1263, 1097, -447, -1405, -846, 258, 1334, 1029, -449, -1319, -972, 282, 1315, 973, -353, -1335, -967, 327, 1267, 1087, -359, -1338, -872, 246, 1313, 1103, -427, -1259, -898, 251, 1359, 1001, -345, -1273, -953, 333, 1256, 959, -290, -1319, -909, 258, 1200, 1001, -407, -1214, -889, 129, 1263, 969, -360, -1142, -968, 180, 1231, 972, -231, -1244, -946, 224, 1154, 1034, -258, -1253, -902, 146, 1244, 1038, -307, -1132, -990, 153, 1286, 942, -271, -1120, -983, 215, 1154, 978, -230, -1218, -879, 151]
972A51R59o9j343q45K55R93J049k26j163q29Q4J149R70j99j070j003J91J073R36
991A063k2j252q91K13R29J111j02j299p94J26R88J061j86j076r61J39J093R28
1009A068p5j121r76K28R63R83q5j243p50J08R13J087j81j103p95M8R83R60r5j022
1029a05r45J77R50R34Lj148q92J64Q57J085r2j122p94l5R88J029j43r91q84M1
1049i23R53R64l3j081q78J27Q30J036n0j090p85NQ91J045j36r44q23m5R40R56
1069I59p5r58q35j4Q88R93k3j036p90l4Q52J048p9r67p82q5Q91R92q5q58q81n9
1091i38R27R19j8q99q52o5Q57R75m6q82q01j36Q60J017p8q47p73j61Q71R66m4
1112H52q58q21q9Q15R74Qq70q13j21Q50R82p9p96q00j46Q48R11Nq13q19j37Q37
$$ y = [151, 1110, 1041, -302, -1147, -892, 101, 1150, 924, -239, -1068, -984, 165, 1135, 936, -134, -1137, -946, 127, 1063, 1041, -211, -1102, -889, 40, 1151, 1049, -250, -1044, -918, 70, 1131, 945, -131, -1092, -953, 140, 1068, 993, -128, -1104, -876, 87, 1070, 985, -258, -1008, -900, 13, 1100, 919, -184, -979, -931, 52, 1012, 917, -105, -1050, -873, 77, 1011, 1014, -134, -1026, -862, -5, 1080, 988, -134, -928, -963, 25, 1054, 911, -80, -964, -923, 30, 994, 961, -120, -998, -871, -41, 995, 945, -145, -930, -925, -34, 1011, 875, -69, -892, -937, 3, 959, 884, -74, -909, -923, -35, 958, 935, -101, -891, -925, -73, 975, 896, -71, -853, -938, -47, 945, 860, 2, -879, -938, -11, 908, 890, -9, -861, -926, -69, 906, 860, -22, -823, -959, -99, 918, 840, -7, -780, -941, -70, 896, 852, -6, -827, -916, -101, 873, 881, 11, -802, -923, -73, 909, 830, 34, -766, -912, -64, 847, 852, 39, -780, -917, -80]
1134h0R08Op77q35j14Q26R19k8p84q01j39P89R40kp79q18j43Q28Q86L6p53q31
1156g46j40P89R07L2p54q05j49P47R31K7p19q15k02P92Q86N5o93q56j80P81Q68
1177G56P7p06q21j91P42Q90N8o96q08j60P41Q46Q3o99q08j65P48Q43O5o65p90
1198f60j74O93R00N8o68p75k50P50Q73K9o19p86k65P24Q73Q5o41p91k34P02Q82
1219G06P8o36q02j87O64Q90O7n94p77k64P07Q63K5n90q07j77O79Q09J06n91p90
1240f21j97O68Q01J03o06p39k82O88Q23J02n43p67k97O94P86J26n00q10k42O19
1260a94Q18J37n54p85k50O39Q22J02m85p96l18O85P59J32m61q29k42O52P40J40
1280G12n15p69k08N84Q03J25n00p61k74O18P43J49m65p72k65O24O97J97m69q28
$$ y = [-80, 828, 834, 57, -778, -892, -66, 853, 825, 41, -760, -899, -110, 830, 828, 49, -769, -912, -84, 802, 838, 85, -746, -886, -97, 810, 842, 88, -717, -866, -119, 812, 839, 120, -695, -897, -105, 781, 836, 143, -713, -893, -112, 756, 833, 127, -694, -885, -143, 747, 805, 109, -699, -859, -118, 728, 811, 112, -696, -861, -113, 730, 795, 130, -660, -834, -141, 759, 817, 149, -626, -876, -126, 747, 776, 157, -629, -894, -170, 703, 788, 147, -644, -878, -176, 706, 784, 148, -654, -841, -177, 713, 780, 186, -591, -855, -148, 715, 740, 150, -657, -834, -155, 654, 760, 169, -621, -818, -150, 651, 754, 148, -591, -873, -185, 638, 740, 197, -570, -867, -173, 613, 739, 239, -571, -813, -194, 624, 761, 207, -578, -828, -189, 633, 735, 250, -546, -864, -179, 580, 712, 251, -578, -820, -168, 572, 712, 197, -572, -780, -196, 607, 732, 232, -529, -803, -185, 558, 707, 242, -530, -795, -171, 526, 723, 254, -574]
1300e74j98N53P39J97n15p26k89O05P45J58m51p56k97O40O90J78m15q27k11N63
1320a91P11K36m82p63k60N38P48J69m39p71k71N91O70J89l78q20k51N57O52K57
1340F92m22p82k19M88O85K69m68p07k81M91P26K05l82p56k67N53O29K53m11p91
1360d95k02M63O53K85m30p32k57M68P24K12m33p17k56M67O62K47l79p43k47M89
1380b21O02L36m58p13k43M37O66K80l93p08l01M62O64K57l50p50k74M99N92K61
1400F45l49p49k16L84O52L00m13o62k83M35O52K27l16p07k89M63N70K66k99p17
1420d06k58M14N80K97l23p21k57M13O04K77l43o40l43M47O10K40k73p08k51L94
1440b47N46L32l11p19k12L27N87L23l35o45k87L65N89K95k95o72l05M00N27L21
$$ y = [-574, -772, -219, 520, 717, 202, -524, -813, -208, 537, 695, 244, -512, -809, -169, 521, 699, 284, -543, -754, -191, 520, 756, 274, -489, -749, -211, 537, 706, 267, -504, -775, -184, 486, 675, 297, -523, -774, -217, 435, 692, 270, -512, -731, -243, 442, 711, 243, -464, -745, -254, 472, 677, 295, -461, -728, -175, 454, 707, 296, -495, -697, -234, 419, 704, 274, -458, -715, -247, 477, 689, 256, -461, -717, -250, 412, 659, 280, -463, -710, -221, 381, 717, 259, -454, -697, -260, 406, 686, 293, -415, -716, -254, 410, 667, 317, -433, -707, -208, 384, 645, 296, -453, -669, -285, 367, 667, 254, -408, -691, -256, 396, 623, 307, -400, -689, -226, 344, 610, 311, -406, -664, -250, 330, 627, 304, -417, -674, -261, 343, 620, 277, -363, -706, -259, 351, 591, 318, -390, -641, -247, 299, 631, 320, -399, -611, -284, 303, 626, 291, -354, -641, -276, 313, 608, 313, -359, -664, -264, 263, 584]
1460E84k60p14k14L31N11L69l12o61k50L22N83K89k51o56l02L72N32L17k57o76
1480c43k72L78M75L72k83o55k42K65N71L25k90n75l19L23N40K91k41o28k71K79
1500c00N07L89k77o59k40K66N42L59l08n77k38K21N56L11k45n86k81K82N08L37
1520E67k47o15k54K59N07L73k69o01k53K18N35L81l00n61k88K23N35L16k26n87
1540b87k66K47M89L73k73o00k08K09N26L65l04n42k47J93N15L52k45n36k80K04
1560c15N09L45k26n45k85K09N05L42k25n44k61J59N16L35k46n03k91K03N24K93
1580D99k14n27k82K18M82L33k29n21k95K11M82L91k65m84k98J81N01L16j98n11
1600b10l00J90N01L16j70n28k73J57M68L59k20m99k79J62M48L89j93n25k73J35
$$ y = [584, 324, -390, -604, -273, 238, 607, 295, -366, -616, -294, 289, 578, 327, -329, -631, -259, 273, 590, 333, -343, -615, -237, 238, 610, 327, -328, -570, -305, 266, 591, 301, -274, -593, -270, 270, 561, 320, -308, -579, -300, 207, 596, 319, -340, -580, -314, 228, 587, 279, -298, -536, -315, 241, 552, 307, -279, -560, -278, 230, 567, 320, -295, -549, -290, 217, 590, 321, -280, -533, -315, 220, 601, 301, -260, -548, -325, 210, 526, 300, -287, -553, -306, 183, 556, 283, -317, -525, -316, 210, 575, 271, -271, -518, -325, 190, 542, 297, -239, -519, -315, 194, 539, 313, -232, -517, -308, 197, 539, 314, -230, -491, -332, 184, 519, 273, -230, -521, -318, 206, 499, 285, -242, -524, -306, 176, 509, 280, -241, -536, -325, 157, 548, 283, -201, -499, -318, 183, 499, 301, -210, -510, -320, 181, 497, 327, -201, -474, -317, 151, 510, 290, -209, -488, -326, 122, 511, 318, -207, -480, -345]
1620c45M79L58j97m88k78J67M45L37j85m79k75J37M42L77j75m86k97J54M40L62
1640D93j90m59l00J50M53L47k06m38k75R9M69L48j97m42k69R1M70L17j28m91k68
1661d26R6M34L66j70m56k59Q2M45L60j92m36k49Q7M47L21j61m42k45P5M58L09
1682D44j37m13k94P7M47L30j55m24k79O8M58L26j80l85k81O1M53K93j01m20k99
1703d11N0M65L53j63m09k76M7M47L32j68l46l21Q5M40L08j57l62l21O9M40L17
1724D19j28l72l13P0M20L25j49l65k76N6M20K89j14l57l07L9M42L00j15l67l38
1745d21J05L68L17q5l90k61M2M16K99j02l42l29P3M22K70j07l14l48O8M11K92
1766C84j04l78k73P9L35L56j31l41k67JM40K82j03l55k85L1M02K61o5l64k71O7
$$ y = [-345, 134, 492, 295, -193, -471, -304, 141, 478, 293, -186, -461, -324, 118, 495, 320, -166, -463, -309, 131, 493, 303, -156, -456, -306, 147, 494, 288, -150, -425, -326, 143, 491, 294, -148, -417, -326, 144, 461, 333, -158, -426, -330, 104, 470, 300, -156, -415, -333, 112, 472, 280, -156, -405, -318, 129, 450, 289, -153, -398, -323, 135, 444, 307, -106, -400, -323, 124, 454, 299, -125, -404, -336, 122, 448, 268, -117, -398, -337, 116, 409, 308, -112, -411, -361, 104, 457, 294, -115, -391, -344, 103, 435, 267, -79, -400, -315, 125, 433, 276, -86, -407, -338, 102, 419, 291, -81, -394, -324, 96, 421, 272, -93, -369, -313, 107, 396, 282, -75, -382, -343, 99, 399, 284, -83, -421, -316, 52, 369, 284, -106, -367, -325, 91, 390, 288, -54, -383, -310, 112, 382, 275, -39, -387, -319, 92, 384, 280, -98, -371, -292, 43, 399, 268, -73, -340, -339, 101, 383, 280, -75, -360, -329, 73, 334, 269, -95, -366, -299]
1788b99L33L36j04l42k81L2L99K87p5l27l05L4M09K59q3k86l33N8L52K93p6l43
1810f2k99M8L77K91r8k82k89KL84K85r5k91l21K1L79K68l9l18l00K3L74K75p0
1833B63l07l00L3L64K88q2k81k99QL86K68n4k84l28K8L52K66l4l26k76kL72K59
1856C14n3k63l03KL41K36qk80l25K5L62K22K4l24l11N5L08K72o4k03l51J2L67
1879E5K29m9k33l01K1L28K41qk88l32M0L38K50Qk82l26K4K96K83j6k86k88lL31
1903C2K25nk43l36K4L13K50rk46k82j0K94K47K8k61l09rL09K28Nk31l17K0K88
1927EK56M0k58l31J6K86K62K1k70k84j3K73K45jk43k63jK49K46O1k66l08J7K59
1951bK34L8k62k87nK61K88j4k24k91j3K55K67K6k37l10J1K48K42M9k45k76J2K14
$$ y = [-299, 34, 370, 266, -76, -357, -325, 74, 361, 286, -41, -346, -312, 97, 356, 273, -13, -346, -288, 64, 357, 281, -62, -361, -313, 64, 355, 257, -25, -314, -312, 72, 357, 262, -29, -350, -329, 50, 318, 279, -39, -339, -316, 58, 333, 263, -44, -344, -311, 53, 341, 259, -22, -321, -313, 73, 341, 287, 3, -325, -297, 55, 321, 287, -39, -315, -317, 55, 314, 261, -2, -305, -303, 38, 274, 266, -14, -339, -314, 48, 270, 294, -30, -341, -286, 22, 294, 230, 27, -324, -312, 55, 284, 235, 2, -299, -278, 50, 291, 283, -5, -337, -297, 41, 291, 299, 17, -309, -285, 11, 294, 278, -8, -296, -299, 32, 257, 252, 9, -327, -303, 10, 260, 251, 5, -277, -287, 7, 254, 282, 21, -288, -297, 12, 240, 245, 14, -303, -283, 5, 261, 301, 43, -288, -272, 14, 276, 297, 27, -257, -270, 3, 248, 247, 4, -259, -260, -11, 235, 296, 30, -278, -261, -2, 232, 270, 8, -279, -284, -23, 265, 251, 27, -264, -277, -22, 245, 271, 34, -276, -265, -17, 225, 274, 29, -247, -235, -21]
1975b1K46L9k60k52j0K45K38J2k24k95K4K25K30L9k05k76k1K44K59L5k57k50k4
1998b59K30K62L0k40k52j1K26K16P0k42k72j7K19K35P2k44k65j1K22K44Oj82k75
2021b38l2K47K28M1k00k79J3J66K69N6k37k65m0K29K21P7k15k64rK21J86R5k33
2044C7k48l2K06K20P9j88l09KK21K12Q4k42k81J3J75K49M7k14k14k4J59K29P5
2067B56k20k42m0J98K16Q1k16k73L7J60K18Q0k11k48k8J91K23O6j78k51m3K03
2089b1J94N7j78k59NJ50K16Q7k33k20k5J52K50O3k03k35j8J27K34J05j81k45p5
2112b53K04K05P5j78k51l2J67K15N6j39k09p2J57K13O8j55k60k7J52K12Q7j92
2134D3k06m6J44K07O6j40k44m6J59K06P3j76j94p9J63J98J00j70k06n7R4K24Q7
$$ y = [-21, 225, 264, 4, -248, -258, -13, 225, 237, 13, -282, -258, -33, 197, 236, 31, -245, -266, -22, 237, 272, 15, -235, -259, -29, 233, 263, 23, -229, -240, -14, 202, 272, 30, -242, -259, -40, 195, 267, 23, -242, -253, -31, 213, 219, 37, -238, -270, -23, 205, 246, 46, -233, -220, -54, 215, 271, 34, -231, -271, -42, 179, 256, 41, -223, -232, -11, 175, 270, 37, -211, -243, -37, 183, 262, 74, -235, -233, -12, 200, 284, 42, -239, -226, -51, 198, 245, 31, -183, -207, -48, 181, 256, 36, -206, -246, -48, 168, 249, 33, -240, -203, -43, 175, 255, 44, -204, -232, -41, 182, 248, 70, -181, -224, -21, 173, 230, 52, -207, -202, -52, 164, 251, 18, -202, -227, -75, 175, 238, 35, -200, -218, -91, 143, 248, 67, -178, -253, -49, 156, 231, 53, -198, -230, -63, 152, 208, 69, -140, -212, -55, 158, 226, 71, -189, -216, -64, 148, 235, 43, -163, -209, -65, 142, 208, 68, -176, -222, -63, 143, 216, 40, -154, -233, -70, 128, 228, 58, -148, -205, -111, 113, 200]
2157B00j64j81o5J18K40Q2j83k09m2J53J90O6j40k05l9J10J92J04j40k13o8Q2
2179a12K53Q4j57k11o2J22K17O4j60k01k4Q8K26O9j09k34n8J17K04R2j53j66j04
2202b15J60J66R0j31j88q9J34J91Q0j24k10k9P3K40Q0j62k02m3P4K22O3j14j94
2225a28r6J17J96O9r1j85q8J25J82Q4j31j67q3J14J78R3j44j39q0N9K35P5j32
2248F3j72m9P1J91J16j42j82q7J16J80R5j60j44o7P4J90R1j39j64q4R4J97P9j28
2272C9j43j09J13J66J07j18j58n9O6K10N3j14j39q6N4K44K5p2j63q4J00K02L8
2295A72q8j87n4Q4J81N0j22j23q5J08J39O7j09q8j19O7J92Q9p9j99p0Q5J89M7
2319A47p2j55n1M4J91O1r7j32r4O1J84P5q9j32j06Q1J64P7r2j29q4N6J67P6q2
$$ y = [200, 36, -145, -210, -92, 148, 230, 47, -162, -204, -51, 139, 205, 65, -140, -179, -69, 123, 227, 87, -126, -194, -112, 141, 225, 68, -143, -205, -83, 134, 198, 38, -163, -187, -99, 127, 196, 87, -147, -205, -88, 116, 208, 55, -111, -215, -55, 111, 201, 70, -118, -207, -73, 118, 198, 74, -136, -165, -92, 148, 228, 66, -136, -179, -105, 117, 180, 66, -128, -224, -107, 89, 158, 67, -118, -206, -81, 101, 185, 54, -113, -196, -82, 96, 189, 45, -94, -174, -115, 120, 195, 63, -109, -158, -87, 104, 220, 78, -104, -191, -75, 105, 200, 40, -104, -171, -97, 93, 184, 45, -119, -203, -109, 88, 167, 39, -104, -213, -100, 66, 173, 55, -103, -162, -96, 114, 167, 53, -86, -172, -118, 126, 151, 79, -84, -168, -68, 134, 172, 84, -103, -157, -73, 108, 158, 36, -87, -172, -64, 75, 142, 33, -55, -174, -107, 85, 174, 95, -104, -174, -89, 100, 147, 75, -80, -131, -87, 104, 165, 68, -64, -158, -97, 87, 162, 73, -59, -165, -84, 80, 157, 65, -64, -148, -92, 75, 151, 69]
2344F9j40j05P4K06M5q2j49r2R0J76M2m3j91m9N7J57O1n2j59o6M4J71Q4p7j23
2369e2j01P0J67P4q0j39j02R6J53Q4j16j33p9R5J39O2q8j13r1P4J49N5p3j16j13
2394a78O6K01L9m6j57p3O4J53N5n4j32j00P3J49J12p2j72o0N1J46O6n1j40p2N7
2419g5J30Q6m9j25r8M9J36Q2p4j09r5L3J86N7m8j42q9N1J40P6n8j11r9P8J17N4
2445A03k2j23p5J6J89N5o6j07j02N2J37N5n1j32o4N3J15Q9m0j13j10P0J16O1l5
2470G1j36n3K5J30R1p3q9r7M8J29M2j4j17p2J7J24Q2k6j02j18M4J29J06j01n5
2495a5j16O4R7Q1j8j13q2K5J20N4k9j04o8NJ45N9j4j35r3M5J24P1j6j53o4M6R4
2522A0R3l9r9q4L7J18R7j1j32q4L6P9Q6j9j14q1L5J02P8k3j09r2M8Q6P4j6j28
$$ y = [69, -71, -176, -102, 104, 149, 67, -82, -174, -84, 92, 134, 91, -100, -149, -92, 65, 126, 74, -85, -151, -107, 64, 148, 71, -52, -153, -83, 84, 158, 78, -61, -163, -67, 86, 170, 54, -79, -158, -63, 76, 138, 50, -63, -154, -80, 69, 124, 51, -65, -178, -112, 89, 128, 82, -75, -148, -84, 69, 124, 70, -62, -162, -89, 60, 172, 100, -72, -132, -81, 65, 131, 80, -60, -132, -75, 55, 141, 92, -33, -131, -82, 54, 136, 62, -47, -142, -109, 77, 134, 86, -56, -145, -94, 46, 122, 64, -47, -146, -68, 49, 103, 81, -42, -117, -101, 88, 143, 77, -30, -132, -80, 57, 112, 61, -71, -135, -82, 33, 122, 82, -31, -141, -71, 45, 106, 71, -65, -118, -93, 37, 128, 55, -34, -131, -83, 46, 88, 74, -43, -115, -98, 26, 108, 82, -20, -138, -94, 35, 141, 40, -15, -131, -67, 30, 111, 93, -20, -102, -77, 43, 97, 68, -36, -104, -99, 46, 105, 91, -44, -137, -92, 32, 103, 87, -66, -130, -84, 10, 103, 64, -35, -119, -82, 36, 133, 122, -10, -94, -58, 21, 107, 88, -26, -107, -72, 30, 108, 85, -24, -116, -68, 18, 92, 76, -52]
2549e2o7L0J18J03n8r9r2M9Q2O5Rj06j03M9J01N5Oq9r9K6Q9R9m0j07o0J1P2J21
2577A13l3r7q8L0J19N1m1p4r2K4R2Q7l2r3p1J0J25K8%p8q9K2R4P2mj10o3J7R5
2606A4Q1k8j00m8KR6O7k3p5q3M4Q0L5oq9m8M4L3R2Mj48k5J5Q0O1k7j10m4M4Q4
2636B2Q4k6q1q7K4L1R8kq3o6K2O3J06n3o1m0qO8J03k8q4r2J7Q6P9j2o5j14N4N8
2666A3M8Or7l6k5P9Q2%r4p5M9N4L8J8q3m5JQ1N6j5n6q5J2N4R6ko4r2K1P2P0j2
2698F9q5q0L6M0N4L2q5n5J0N1R1pq7m0k8P4Q2j6n7p5kP5O8Mp5q6K1P0O6ko6n7
2730f0mM8J11k0o5m3l2P1P5j2q5n8L1M6N4K3q3m3j4O2O8k8o0n8lO3R1qp6n9MM3
2762b1P6K4r4l7PK1J15l2n1l9j7O2L3K7o9p0L9QP1J1p2n2J0N9L2K9q2l7k3L5R1
$$ y = [-52, -119, -89, 29, 132, 74, -25, -117, -68, 14, 79, 88, -18, -121, -72, 29, 84, 90, 1, -98, -72, 17, 116, 76, -31, -91, -80, -8, 113, 80, -17, -105, -75, 44, 95, 54, -20, -112, -88, 4, 91, 59, -34, -105, -95, 30, 58, 58, -20, -109, -87, 7, 79, 75, -35, -98, -81, 14, 95, 67, -33, -81, -79, 17, 84, 61, -14, -97, -53, 27, 62, 56, -33, -81, -37, -4, 88, 92, -56, -81, -66, 14, 75, 48, -62, -106, -62, 22, 106, 80, -1, -88, -64, -33, 65, 63, -20, -86, -64, -1, 105, 52, -9, -49, -57, 11, 114, 86, 2, -90, -73, 13, 92, 80, 15, -99, -45, 13, 61, 67, -30, -66, -91, -12, 70, 70, -24, -99, -50, 4, 42, 60, -23, -68, -67, 14, 70, 55, -1, -86, -74, -20, 76, 74, 10, -82, -61, 11, 81, 69, -16, -96, -60, -20, 34, 66, -19, -74, -64, -13, 78, 71, -16, -56, -84, -10, 72, 56, -1, -76, -78, -3, 65, 69, -6, -92, -71, -1, 65, 63, -3, -60, -64, -16, 95, 75, 10, -33, -65, 6, 81, 69, -16, -74, -43, 3, 57, 80, -3, -46, -60, 2, 70, 42, -18, -76, -79, -16, 75, 67, -9, -68, -64, -21, 55, 79, -15, -52, -45, -24, 91, 59, 8, -31, -48, 14, 47, 74, 5, -65, -26, -18, 53, 64, -8, -60, -50, 9, 41, 70, -12, -49, -72, -37, 54]
2793E4j6m1m9QM1Q0j7p4l2l4O2M4M5p3j6o0P5O4kp6k2k0O3M1Km1m4rM8N1jk5n8
2826c2k4J3P4M2q6k5j5K4L2Kl6ok2L4M2nj1m2J3PN0M6o9l6pL5O2l3k2k8nJ7P2
2859F1l4po6j3P3K5ln9pmQP0Nl0o2pM0K9L4p2k8MM0N4k8l1l5PJ9Q0pp2j4j3N0
2894GM0km5l1mK4O0Jm3l1k5L8K9M0p4mk4K7N4j0l1l7k2M8M7j9J5p3jJ0Q9pl1l0
2928a5rNN7j0Mm9j4L9M1L2l6o3n4Q7L3k2qm5j1K2M5J2k7m5lj2N1Rj1o5jM6M9J8
2962E0l1k8n6N1O8ok5k3m0L2K4M5l0l9ppM2J2l6k3rJ8N3oJm8m7L9M6J2k3l4Jj4
2996c8O0Qj5l4k6kM9J2qo1J8RN8j8Jk8l4L2L9j0rMn3N4JkLk6k5M6PM7l8l2l5K1
3032b5O5j4Rn9l0K1N1PJ2m0k6J2K3kORo2L4OK7j2k8j5M1N2k1j3m8J7QJ2nJ2l1
$$ y = [54, 38, -3, -52, -44, -3, 77, 60, -14, -46, -80, -18, 26, 71, -2, -18, -78, -3, 61, 59, -17, -39, -59, 4, 45, 47, 6, -38, -47, 1, 52, 51, 26, -32, -56, -43, 31, 73, -13, -38, -53, -29, 3, 5, -31, -37, -59, -25, 17, 12, 1, -41, -28, -21, 29, 75, 6, -30, -37, -2, 60, 27, 5, -23, -28, -11, 61, 27, 20, -46, -59, 14, 39, 36, -23, -30, -34, -26, 44, 49, 19, -43, -50, -10, 19, 53, -19, -47, -43, -3, 51, 23, -8, -43, -36, -17, 63, 56, -16, -30, -43, 7, 47, 45, 0, -31, -35, -11, 49, 50, 7, -24, -49, -11, 18, 58, -16, -20, -44, -17, 37, 27, -4, -41, -63, -15, 32, 13, 28, -45, -46, -36, 53, 46, 15, -15, -24, -19, 38, 28, 32, -17, -31, 8, 49, 81, 45, -18, -72, 15, 48, 26, 18, -27, -38, -16, 29, 41, 14, -31, -34, -46, 5, 14, 3, -62, -63, -17, 32, 50, 19, -9, -65, -14, 54, 48, 23, 0, -40, -8, 16, 61, 31, -8, -15, -22, 20, 32, -4, -27, -36, -18, 35, 29, 30, -18, -65, -26, 20, 32, 9, -25, -24, -38, 22, 30, 15, -19, -45, -47, 2, 14, 6, -55, -37, -28, 30, 12, 13, -15, -49, -17, 22, 12, 3, 7, -46, 8, 9, 7, 10, -16, -41, 5, 12, 59, 21, -11, -46, -25, 40, 26, 35, -24, -54, -33, 18, 25, 37, -3, -29, -17, 6, 4, 10, 19, -43, -9, -3, 24, 12, -16, -31, 10, 62, 41, 28, -20, -3, 5, 17, 12, 24, -7]
3066gl5QM7k4J5mm5L4%K3Lk4j2J9QKJ2o3J6LJ7MJ1k4KM1J0l5rJ7k3J5%PqLj0j4
3104b0K4K1j3l6j0j0N5JqJ0k6k2M8j6k0K5j0Lj5L3%j7k3kJ8ML4k5K0l4nN5Ol9
3138Fk9J0K7qK8k1l9NlL9pk2l0J3K1L0k2j8j2J5J6Prok3J3J6K8j6ml8JK6J8J7
3173B9jl9K3l0K1K0l3nL0nk2L9k8mKknL3j8j5mkM7k5k6j7J0J7K5rnn1L0j2K6K6
3209B0k0k0lK8J6j6j4K1k5L0lK0k9l8K1j5L9okk5QoJ7J3ll3j9J9J6mL3k5l9L0
3243a4K0%j8K2k4J9mKj8Nk1K5J6j3J2j1J5k2K4k5jmNMJ9J4j4jl4J2pJ5j2lPk0
3279c0J0K4rNk0j1K2K3Mm2RKoL6k4Mk0J5L1j2j5j4KoJ6j9K3nPJj8J6rJ1k9Rj4
3316c3K6Jllj5J3jJ7rpj4PJ5KJ9l7oK5K9qk5j1J1J2j4K7j9pkk1PL6rj4pnlM9k6
$$ y = [-7, -42, -34, 13, -11, 4, 0, -45, -11, -11, 12, 15, -9, -21, -2, 6, 8, 20, -43, -27, -24, -7, -3, 8, -16, -14, 27, 37, 2, -7, 10, -13, 2, 2, 9, 1, 4, -6, -20, 4, 25, 12, -24, -34, -44, 11, 12, 4, 14, -12, -34, 14, -2, -22, 3, -7, -4, -19, 14, 14, -3, -26, -28, -10, -6, 28, 3, 23, -11, -16, 39, 45, 6, -23, -13, 14, 6, 34, 13, -26, -21, -24, 15, 8, -14, -44, -31, -10, 20, -2, -20, -32, -17, -1, 6, -3, -9, -32, -19, -3, 25, 9, 5, -33, -32, -6, 12, 29, 28, -11, 12, -18, 3, 23, -10, -15, 15, 10, -12, 27, -1, -5, -3, -5, -10, 23, 5, -10, -14, -16, 31, 6, -20, -37, -27, -10, 15, 6, 1, -50, -20, -32, -6, 20, 0, -20, -23, 5, 21, 5, -9, 12, -13, 17, 14, 34, 5, -33, -12, -27, 12, 6, 4, -21, -13, -19, -2, 11, 8, -25, -44, -25, -9, -13, 20, -5, -44, -14, 6, 6, -12, 10, -14, 5, 1, 3, -15, -10, -31, -6, 10, -3, 9, -2, 13, -9, 15, -10, -11, -15, -10, -6, 13, 27, 13, 12, -22, -10, -17, -2, -14, -17, -10, -30, -20, 4, -5, 0, -20, -31, -9, 14, 18, -24, -15, -13, -19, 17, -7, -3, -23, -8, 23, 11, -4, -18, -16, -22, -6, -25, -2, -7, 0, 1, -17, -1, -10, 1, -28, -19, -33, -7, -6, -9, -12, -27, -14, -15, 2, -7, -14, -28, -21, -6, -4, 15, -22, -28, -3, 26, 18, -7, -18, -7, 5, -9, 18, -1, -8, -10, -31, -24, 12, 3, -11, -18, -23, -26, 23, -3]
3355clk5j2M1J0j7k4J8J1LlKj4oJ8J6oK8l9k7RJ0Rkk0N5m9L6j1Kk6j8JK8J9%k0
3392ikk5L7qPjk7J0K3J1k9j2J1L4k4NkMj9J1rN3j8k7Pk3J4M1k8K1l5MK3qJ1k3
3428bk4LK4lOJ4m8oK3L0k2j3nk6M5Rkk1jRK9Ql7QoJ4J2kJ0%n9K3jM6l6J2k7oN
3467a7J6K6k1l0J6k4K3L8m4MrOJ7lj1qpK4L3k3j7oj6L6J5J5l0%l7M0L1k3j2k2
3501b0j2L9J2K0o9k2M2J8Rnj1k3KQLK6j9j4j9K7%K0qpk9L3RK1j8l9PK1L6nj6j7
3537@o%K3J2k1m9k2K7M1J8k9lnk1O1k2k9kK9j3J8J7l2j6l0M3RL2l3l1qM3J1K2
3571C4m7j2jrM4J0k0lj1PJ1N2m3k8l7M5K6K3j5o6L1J0KK3j7k6j7M3j5L2l0k1o
3604c1j3L5N4l6k6j6K4M6kj7m5%M2j4K8lm1j5J4M2oNo4j3N5nK7j0m5k2M4j4P1
$$ y = [-3, -6, -31, -43, -2, 8, -9, -33, -15, -4, -1, -4, -2, -16, -22, -4, 12, 6, 34, -5, -32, -23, -13, -4, -6, -26, 29, -20, 16, 5, 7, -19, -37, -36, -8, 11, 11, -9, -11, -36, 1, -7, 0, -1, -28, -18, 5, 16, -13, -25, -14, 20, -4, 1, -1, 3, -16, -5, -14, 39, 21, -6, 1, -22, -8, 33, 5, 26, -9, -5, 18, 10, 21, -2, -26, -23, 1, -2, 4, 18, -30, -36, -13, 17, -5, -18, -23, -49, -4, 5, 3, -18, -19, -10, 19, 27, -10, -2, -8, 6, 18, 16, 26, 26, -33, -10, -11, 35, -1, 11, -16, -22, -17, -1, 25, 4, -26, -10, -34, -11, 27, -17, -13, -22, -16, 1, -2, -13, -21, -28, -4, 29, 6, -11, -17, -33, 3, 18, 33, 3, 3, -34, 6, 37, 14, 2, -20, -32, 7, 19, 39, -30, -52, -10, 8, 17, 12, 1, -22, -20, -12, -9, 17, -2, -16, -35, -8, -8, 12, 4, -3, -32, 1, 10, 31, 13, -26, -19, 2, 38, 33, 17, 0, -6, -6, 17, 29, 8, -41, -63, -36, 5, 23, -6, -9, -14, -35, 26, 4, -25, -27, 2, -11, 7, 24, -8, -24, -54, -11, -2, 30, -3, -34, -42, 1, 12, 34, -13, -25, -26, -35, 9, 19, -1, -4, -15, -8, 3, 55, 12, -16, -53, -8, 18, 41, 26, -40, -9, 1, 3, 26, 9, -17, -34, 9, -6, 26, -4, -25, -31, -44, -9, 45, 9, -17, -33, -9, 37, 35, 18, -27, -27, 15, 1, 29, 26, -15, -30, -16, 26, 20, 25, -39, -52, 3, -2, 25, 15, -30, -52, -8, -22, 49]
3637D9l6o0J6K4OJ4K2n1k7J3N1Ok3j1j7mK7J2qj7%qK2L0lj0m8M3K1K3l1l4j3J5
3671gM9nj3k6l5RM2k3K4k8opJ9K5nl4k6K9L5Oj0k9j1K4rM4k6l5oK0L0J7nm1j7
3706c1L0M1k0k3j3j8J5K7J9k3l1KNPK6j7jm0L1L6J0k2m1k3QN1J9j9j3k4J3J7N8
3739E6j6o2PJ0M0J9k7l4j4QK7K8nl9j2jJ8L3l9j3kjK6jJ7l9m8K5N2J4k2l0j8K8
3773a5K2L2nm2m2M4L9K5o1j4mMJ2O7l2n0LJ1J7Lj0k8k6K1K6L0jo2k1J5N4K4l5
3806Aj5m6M4K2N7l6o2J1lN0L0m9j8J1m3O5L9l8n4Rj3N5M7l6m4m7K2M2L8j0n1j3
3838c5j0L4M8m9j8pPpM0K8l5m0j2O4N6j5o5l6K1N4K9om0m4QM8K0j3m5j8ML4O6
3871F6l7k1o4J9N7J1J3o4m2L5K8K2Kk7o5L2K3L5j5l3k9M7K4L0k0l6l8L0M5J4M
$$ y = [49, 13, -47, -31, -7, -1, 13, 35, -16, -43, -30, 21, 27, 4, -7, -24, -28, -1, 11, 3, -14, -14, -22, 0, 30, 27, 17, -31, 12, 33, 56, 25, -9, -22, -7, 42, 37, 24, -2, -37, -28, 14, -9, 15, -13, -19, -26, -7, 18, 13, -21, -47, -18, 17, 23, 13, -16, -27, -3, -12, 32, 6, -29, -35, -15, 15, 32, 27, -14, -31, -1, 40, 20, -3, -16, -34, -19, 8, 27, 4, -27, -25, -20, -13, 13, -4, -5, -45, -14, 22, 32, 10, -31, -54, -46, 5, 24, 5, -8, -32, -19, -2, 56, 40, -22, -15, -5, 35, 54, 27, -7, -21, -13, 14, 42, 37, -2, -14, -15, 3, 36, -3, -16, -18, -19, 7, 6, 23, -16, -64, -39, 13, 27, 5, -25, -43, -15, 7, 39, 34, -8, -50, -6, 33, 58, -3, -17, -21, -17, -5, 62, 30, -20, -17, -6, 11, 14, 4, -24, -50, -29, -3, 27, 26, -36, -57, -42, 12, 36, 1, -14, -60, -16, 6, 63, 27, -35, -24, -27, 23, 53, 4, -14, -3, -46, 19, 58, 20, -34, -25, -38, 17, 64, 28, -16, -63, -41, 1, 39, 29, -22, -35, -45, -11, 37, -12, -30, -37, -30, -37, 3, 31, -4, -44, -56, 8, 64, 49, -16, -52, -31, 23, 52, 46, 6, -38, -30, 18, 38, 25, -20, -38, -34, 0, 66, 29, 8, -56, -37, 20, 31, 44, -20, -62, -27, 1, 23, 25, -2, -67, -35, -12, 23, 8, -25, -54, -7, 17, 47, 27, -9, -47, -17, 28, 42, 46]
3902D6n6m1MO4L2j3l6m6j1O1K2j0k5j9k6O6M4j3l8n2jM4L2Jm4l8rL8O3l7mk5k1
3935d8P7qQn0k3pN8J2J8po1JM2JRm3k5QN2J4lm0n4j1Q0L1kn3qLK2N1l2J9p0j9
3971e8Q1qJ1l3n6K2L6M2km2m8J2M6M2Kn7l3K6L0rJ%o0J0M1RNjn7J4L3J3K0l0l8
4006c6l4O8K0K6m8j6k2L3M5k1k0n9L7J4O7j1l4n8J6N9K2J1m1n5kM3M8l3ql8NK0
4038bK4J1j8m6k8L9M3lm2m0L1M1MJ9m8j0k6N3L2K0n8k3j1K3N2J1m5m6m0R5L9l0
4070B1Kj05L9N2K7Kl8o0lN4K0K2k9l6o9J03L7k7j4m5JL4N7j0m2k5k5M0L6L8n9
4101bn5J7M2L4J2m3n6J9N4K6J5l8n9kJ8L4J4l1n5J4K1M4N1p7n4j3M7P7j3m9m7
4132e5QON0L6k8o6ON1M3K1n5m9k1O7J7K6m5p4lN0N0mm3m9J5N1L0Jl6n5K1L8L1
$$ y = [46, -10, -51, -47, 17, 49, 36, 0, -46, -57, 4, 26, 16, -9, -28, -54, 12, 56, 43, 5, -47, -48, -4, 28, 29, -15, -53, -62, -24, 39, 2, -2, -27, -48, 29, 21, 29, -21, -44, -51, 7, 19, 37, 30, -31, -30, 12, 13, 22, -21, -46, -38, 14, 28, 25, -15, -69, -80, 0, 31, 29, -24, -32, -29, -7, 44, 12, 31, -39, -58, 23, 15, 26, -7, -63, -41, -5, 37, 35, -7, -55, -43, 3, 45, 47, -10, -43, -17, 13, 4, 5, 5, -55, -45, -4, 5, 10, 9, -48, -34, -1, 12, 32, 2, -36, -70, -2, 18, 44, -4, -20, -42, -9, 36, 15, -5, -64, -27, -13, 54, 43, 9, -49, -33, 26, 48, 59, 18, -37, -39, 4, 52, 19, 11, -27, -22, -2, 22, 33, 15, -31, -59, -20, 23, 20, -22, -62, -31, 10, 14, 33, -15, -25, -51, 2, 34, 54, -4, -27, -38, -15, 37, 48, 3, -43, -83, 12, 51, 21, 23, -82, -43, 9, 36, 38, 0, -60, -63, -9, 11, 33, 4, -32, -101, 2, 39, 12, -2, -47, -46, -12, 45, 35, -7, -32, -57, -17, 19, 57, -2, -57, -40, 2, 36, 48, 5, -51, -32, 22, 48, 63, 25, -34, -36, -18, 16, 30, -1, -56, -42, -21, 23, 74, -3, -57, -70, -23, 54, 41, -8, -55, -47, -41, 9, 45, 17, -49, -43, 8, 51, 72, 17, -32, -53, 14, 31, 57, 12, -62, -65, -15, 35, 31, -12, -61, -46, 5, 35, 36, 0, -55, -34, 4, 35]
4165C5j0m6k9OQO1J2j9p9K4J6P6Pn0m9k8O5L3L3l2p4JM7M5Ol5p5j1P5J2K1l0n9
4198d3qM6M3Rm8n2pL3M8L3l5n4j9K8M2M0k4q0KJ8N3J8k4m1l3N5M9J6n3l2k4K4
4230b0M1L0k6n9MjM1K9k2n2k3M9M5J3n2l8pJ4O7J2l1m7l7N1M9L6n4n3l4O8L5K0
4262D8l1m9m4M7N0K1k9l8m1M5N3N1n7o4j1J3M3N5l3p1j5K7L4M1o7j4kJ9M2K3m6
4293@m4l0O7N6ol0o2J1J0O7K4l8o7j7J9P2K3l9o3QJ1O3Ol2n4j0K5M7M8p0l3l5
4325g3L5N7M6l0o1o4M6O7L6m6l8m9N2N2L0m7m6KJ2O6J6n0j8o3L1P0K4l0n8m5L5
4356d1O2K9l8m4k6L0L3N8n7k4n8K6O3M3k1n4m0K4N3L6l0o5klR0J6k8o5rMP8Lj5
4389B8l6n6M1O3J9l2l1n2nP6L4k7n4k2PL1N9m3m1j6K3M2M9j7n8n7J8P0L9lq4m1
$$ y = [35, 25, -21, -50, -44, -36, 25, 37, 18, -61, -37, -21, 55, 62, 12, -37, -65, 0, 33, 66, 34, -40, -39, 8, 53, 59, 24, -51, -62, 13, 25, 46, 16, -43, -51, -5, 38, 47, -1, -53, -60, -27, 21, 54, 19, -35, -54, -26, 16, 56, 32, -48, -46, -28, 25, 43, 19, -22, -55, 0, 49, 65, 12, -20, -44, -20, 21, 51, 25, -34, -30, -31, 10, 39, 17, -35, -58, -9, 36, 49, -3, -41, -48, -34, 33, 45, 14, -33, -70, -19, 30, 66, 12, -41, -75, -7, 28, 48, 17, -32, -76, -29, 21, 42, 13, -25, -66, -21, 32, 83, 26, -38, -49, -36, 7, 62, 29, -42, -57, -30, 4, 45, -22, -36, -38, -19, 23, 46, 0, -44, -74, -7, 49, 43, 13, -49, -38, -28, 39, 63, 25, -42, -59, -40, 32, 55, 16, -47, -39, -28, 35, 41, 9, -45, -55, -30, 17, 65, -5, -38, -73, -38, 19, 65, 35, -26, -90, -44, 23, 59, 13, -25, -74, -22, 30, 60, 13, -33, -31, -19, 47, 63, 13, -5, -68, -37, 33, 57, 27, -31, -76, -41, 21, 50, 12, -32, -58, -28, 5, 63, 6, -18, -76, -50, 13, 56, 35, -19, -59, -35, 18, 54, 24, -41, -43, -46, 44, 60, 32, -33, -42, -38, 40, 43, 28, -8, -64, -23, 40, 59, 27, -4, -56, -61, 15, 49, 22, -32, -54, -47, -16, 43, 0, -41, -57, -34, 8, 57, 40, -18, -75, -57, 13, 52, 49, -35, -76]
4421g6K3Q6N0o3m9k8K3P1jQm5m4KQ1L0m1o4rmP7K5k9n6k2J3Q5K2m9p0j7J7O3N1
4454F0m2m2k8j1Q3M5j9o3k7J0Q0j4Ro8l0J8N7M3k1n1n8L5O4K4k2m3n7L9M9M5k2
4485D3m3q2L3P8K9k8m1l7j1P9K8ro6k4J1P0J8l6k9k2rQ4J7qo1n8M5N5J1k9%o6
4517e8J1J00Pl7l4p0M8O0J0rn9l5L4L2K6Nj6j19N0P2K8k3l4n4K3O0L4j6n0l9K7
4548b6L3L4jo6k8J9Q9Rk7n7j7%L8N1k3m9k9j0M7M8K5q7l4J2O6L3qm8o8MQ0M5m4
4581A1J5p7K0L7L5On5n4K2O7N5l6n6o4L0P3M3m8l9k8j0N4O7l0o0m1K9N3L6l0k9
4612dn6jO7L0lm2m8K2O3L4k2l8o1KQ4K4ln9m8K8L4O2j1k5q6L7M2K6Rn4m3j4P7
4645B3K2%l7p0J3L2N2Ro3l7RN2L3Jm2l3k0P3N1j9q8k5K7L4K2N9o1q4J6M6N1pm0
$$ y = [-76, -53, 33, 83, 20, -29, -57, -34, 37, 36, 44, -1, -45, -43, 38, 68, 27, -37, -46, -50, 27, 52, 23, -33, -55, -42, 43, 65, 16, -54, -71, -54, 9, 60, 18, -24, -52, -63, 20, 65, 46, -17, -44, -34, 46, 32, 41, -27, -57, -39, 18, 61, 40, -11, -69, -34, 30, 54, 32, -11, -68, -29, 20, 65, 43, 0, -82, -49, 29, 58, 30, -11, -48, -59, 20, 48, 39, -27, -51, -40, 30, 48, 12, -17, -39, -48, 36, 53, 45, -16, -74, -29, 26, 37, 8, 8, -58, -47, 53, 60, 23, -11, -81, -33, 27, 37, 28, -31, -66, -32, 0, 26, 31, 15, -104, -54, 18, 46, 23, -11, -65, -42, 18, 52, 36, -14, -53, -26, 7, 41, 40, -26, -54, -35, 54, 63, 36, -21, -38, -38, 0, 51, 28, -21, -50, -60, -13, 35, 60, -27, -61, -49, 17, 50, 42, -6, -74, -70, 10, 55, 11, 26, -51, -31, 6, 41, 47, -8, -62, -40, 27, 82, 46, -10, -74, -44, 29, 72, 24, -15, -43, -53, 1, 68, 38, -22, -63, -34, 19, 55, 25, -4, -60, -61, 6, 36, 33, -9, -57, -35, 28, 62, 40, 2, -59, -57, 27, 51, 48, -11, -59, -31, 3, 65, 54, 29, -57, -20, 22, 48, 57, 3, -40, -54, 23, 45, 45, 8, -62, -49, -17, 35, 44, -19, -56, -47, 5, 38, 39, -3, -36, -56, 17, 68, 49, -39, -64, -37, -3, 19, 78, 17, -67, -51, -5, 46, 39, -1]
4678ap9L2P2JPl6p3L5N7J6J0o0j6l2N6N5j0k8o6j0N9M7L6p2p9N3K2M8L2j02j6
4709d2PL5M7On3n9J0N9M0Lm9p4L4L0K8Qm3n5L1M9J3j1l2n3K8J2O6Kn4m1mP7K2
4742C7K0q0k9K0M4M2J4l1r5L7J6M9Qo4k2l6P0J7K4m5n5j2N2N0MKr3K6%Q2J4q3
4774a7l6qO9L0J7n0o9KN1N0K0o4m8pK8O2L0n0n8L1RL0M4q1k1j1N1M0%o4k9k3O8
4807dO1l5k1o6lN1N8oj5p8nO3N1ml5n9%K4O0J3n6o0K4O2M1J3q5l9j7M1Q1j0l6
4840In2j2M0N3J3n7m1j2K6P8Pp1l0%K0M3M7o7m4qN2M0Ol4l4j6L9K2L8o3j5lJ9
4873gL9L3n2o7j0O9M0K9o8n5j8L2R1j7m0o0J4L9L8K6o7k7jL3J4K8k5l9l4N0N0
4904C8L3n8m7j9L7M5K4n7l2%L2O4jl8o3%J9O6Pn6l7l6O7L5K9m3q4QM3O9%m9l3
$$ y = [-1, -80, -48, 24, 25, 32, -4, -77, -42, 15, 31, 41, -19, -35, -67, -11, 44, 34, 6, -60, -70, -11, 36, 72, 0, -79, -26, -4, 44, 76, -26, -42, -35, 0, 47, 53, 0, -59, -49, 10, 50, 53, 4, -70, -36, -6, 22, 30, -13, -68, -37, 12, 25, 14, -18, -71, -43, -31, 35, 37, -17, -58, -62, 15, 37, 57, -23, -52, -32, 12, 54, 68, 37, -58, -21, -5, 44, 52, -12, -34, -70, 0, 17, 41, -4, -59, -71, -19, 31, 35, 37, -56, -30, -30, 52, 66, -17, -53, -61, 8, 38, 55, 5, -64, -62, -11, 39, 59, -5, -53, -60, -32, 30, 60, 10, -48, -17, -8, 22, 66, -15, -36, -47, 4, 44, 44, -20, -49, -72, -4, 57, 22, 1, -65, -68, -17, 41, 35, 20, -58, -63, 0, 51, 47, 12, -47, -47, -23, 37, 50, -6, -66, -42, 20, 61, 74, -11, -50, -67, -26, 55, 45, 9, -43, -55, -15, 38, 51, -6, -47, -59, -33, 45, 52, -19, -49, -49, -29, 14, 61, -6, -50, -58, -6, 34, 40, 6, -28, -44, -5, 17, 55, -8, -23, -26, -7, 32, 65, 13, -54, -64, 5, 45, 74, 6, -49, -67, -35, 56, 39, -1, -61, -47, -8, 30, 56, -11, -38, -39, -6, 8, 36, 11, -28, -62, -12, 38, 71, 13, -34, -53, -16, 29, 53, -4, -36, -36, -4, 60, 59, 21, -42, -42, -23, 43, 50, -6, -43, -79, -12, 23, 52, 9, -75, -67, -24, 45, 45, -4, -37]
4937c7k3L3M4N0p3l6QK7M1J5m1n3j3L3N0L0n9l7KKP2K4m2n8nK1O2Lo1j7j0K2M0
4970A4O0p4k3m9N2O3J5n1m9lL1L5M7o1n1jJ9O3L6p0m0QK6N8ll2o7j3K5P5ql1m4
5003d3oL6R6j1p4k3j9K1N3J5l5l4m2L9O3L0o6k9l6J9R1qlm2o0P1K5K2m7m3j5K8
5035b7O1K9j9p2k7K4M1J8J8p9j4RP4L0m8l6n0J5P9Km4j2k1L2L1N7n8l4k6jQ4J
5067C7Jo7j8QQ8Rl6m0k2K3M7QJn8n9N3M9J0k9pn6K9O2rk4k7n2N9O1ml1n6k5K1
5101e4P4L6l5m0l2K6O8Ll0m0k5M0L1J7Ko3pRP6J2o9j4m7N0L7oj2m0l7N1P5k4m5
5134a3j4n0M7M3K4k7l6m5N4L1K6K4q1k3M2K4J4K6q7j6j3Q1M7n6m1j9j2P6K3j0
5164C9p1l4K7O1K4pq3k6M7L8K0nm4n1M8L6J5Ko7n0M6O2K3Rq6m2N4L6M3l6k5o1
$$ y = [-37, -60, -27, 17, 67, -6, -42, -34, -7, 34, 49, 8, -45, -58, -25, 25, 55, -4, -41, -39, -37, 35, 59, 17, -41, -46, -25, 37, 40, -21, -38, -48, -26, 14, 74, 0, -23, -72, -20, 43, 58, 7, -42, -45, -14, 21, 68, 7, -44, -45, -26, 37, 73, 3, -37, -29, -3, 55, 52, 20, -47, -60, -35, 40, 32, 1, -43, -49, -13, 83, 72, -2, -25, -44, -23, 30, 45, 10, -24, -66, -27, 36, 66, 0, -29, -65, -46, 45, 37, 34, -8, -68, 3, 28, 50, 3, -40, -55, -27, 34, 63, 44, -28, -55, -31, 10, 28, 46, -33, -47, -38, 36, 66, 18, -18, -68, -53, 26, 28, -16, -28, -49, -17, 14, 71, 13, -21, -47, -48, 36, 37, 38, -29, -47, -39, 49, 58, 22, -18, -40, -17, 30, 38, 39, -19, -78, -25, 24, 34, 5, -2, -58, -29, 33, 24, 0, -27, -79, -20, 41, 37, 6, -50, -75, -54, 20, 56, 21, -19, -51, -25, 43, 46, 16, -24, -49, -9, 22, 39, 41, -22, -29, -20, 56, 68, -1, -15, -62, -12, 25, 19, 7, -33, -70, -19, 56, 32, -13, -27, -77, -30, 13, 37, 10, -26, -71, -17, 14, 40, 64, -17, -40, 2, 26, 40, 66, -21, -37, -50, 31, 78, 22, -19, -38, -50, 26, 49, 39, -32, -66, -39, 22, 46, 39, -44, -70, -23, 15, 35, 30, -14, -65, -17, 19, 34, 36, -31, -81, -35, 27, 50, 59, -27, -69, -15, 21, 64, 28, 3, -58]
5196e8M6M1L7l2n7k8L1M3L6m3l1p0L7P6L1k2o4n1M0P2Onp9rL1L6J7%p1l6M6N7
5228B7QJ9k8m3j8N1L3j1l2m1NM5K9k0n7j4M3K7N2m5m4n4J2Q2K4j5n1m8K2M3K7
5259B8Qm7o7M2O0MK2n1l9J0O0K1rm9p0N3N3K0kp2j8J0J7M2Jm9n5N8K7K3j7n3o
5292d5J7N7J1Mn1m0j1O9L5ro6nL2J7K7on9l0K6M1M1j3n6n0L4N3L5j8o4k3K7J4
5324fO7k4p1j0L2J6K4Mo3m3L2O9L5m4l1n6L3M9J9nn2j4K5J8L7Mn3l4J1L0L9j0
5356B8jn5j2L7M4nn5l9KO3L7k2m5n4L9J7L6om9k8L7K2O5l0m9j4KN0MJ2m8m4J2
5389d9N6M1lp6kk9N1O5j4n3m1J1L7K5Rk8o7L9L6L8k5m4l9K8K0M3om4n2K5N3K7
5421C2j1o2k0PO2N0qp5j7NM1O5n3k7m7M5K6J6J3o3Ol1M1P9l5m9k7nM9L5j4l6m7
$$ y = [-58, -12, 29, 66, 34, -23, -51, -20, 23, 59, 16, -15, -85, -48, 28, 59, 37, -27, -78, -38, 34, 40, 35, -44, -53, -22, 14, 31, 31, -40, -76, -30, 27, 35, 54, 26, -17, -35, 16, 49, 38, 6, -35, -30, 15, 44, 24, -33, -47, -4, 23, 75, 30, -14, -68, -56, 26, 50, 35, -16, -64, -42, 1, 28, 36, -11, -78, -36, 24, 28, 50, -1, -40, -30, 30, 51, 42, -7, -77, -24, 29, 49, 47, -25, -43, -33, -16, 26, 27, -22, -77, -19, 8, 31, 14, -39, -45, -28, 29, 40, 44, -7, -47, -58, 11, 46, 37, -29, -34, -2, 15, 42, 36, -23, -53, -27, 14, 55, 42, -14, -64, -30, 23, 58, 40, -24, -47, -20, -6, 61, 37, -34, -44, -12, 4, 28, 32, -31, -74, -42, 27, 62, 18, -13, -69, -36, 13, 32, 27, -25, -39, -14, 4, 41, 45, -8, -42, -31, -1, 38, 28, 27, -28, -40, -3, 41, 36, -19, -58, -56, 7, 44, 22, -23, -77, -38, -21, 15, 9, -40, -68, -31, -9, 56, 26, -23, -37, -35, 15, 19, 31, -17, -61, -49, 7, 48, 45, -31, -33, -62, -11, 54, 40, -13, -54, -43, -6, 19, 28, 0, -67, -28, 8, 46, 21, -23, -62, -34, -14, 29, 23, -21, -73, -48, 5, 32, 21, -41, -61, -54, 8, 58, 50, -25, -42, -37, 4, 69, 16, -11, -58, -13, 13, 29, 42, -21, -15, -46, -5, 74, 39, -10, -37, -42, 7, 42, 28, -8, -55]
5454e5nO4M7l3k9l8jM5M7Op7%nK3L8Rl9l2mN4L7k1m8k3%J2Q4%o0m4K7K5K5J9o0
5489a2km2O4L7kn6m7J5N2J9j9k2k1oK1N7j1l9l7kN1K9Lm0k2j4M0O8j6l6l7k5O0
5522HN1j4k0o7J8J3Q0l6n6pj9M5L1J9n4k7rK8M0J2m1m1QN1K5k5lo4pO3N5Kl7n9
5556c7MRN9km2j9qJ9P2j2m5n4KO5KK4n5n2K4L0N4j1k2o3J8K4M0L3n9l2J1K9K9
5589C5J6l9j6l5N9K1j8kk8j6PO5j5k2m6rL4M1Qm1ronN0qk1l8k3K7N5Pn2k0lL8
5624iO0m7pl2MM3L1Ko5j7kM8N1j2l8p2M2K4M5nn3rl6O3M6k6m3j5j0L7M0j2o0j1
5658d5m2P3M3l1J1o4J3L8K5j2j0l2nK7P3k7l0m0j1M4M0L4o4l2%%N9ll8j2l7L5
5690b0N7j0l4nl5PN7Lj3n6j0L5L3L6n7l2jM3L8j8nl2j2J2O5nj2n4j9L5K9L2l9
$$ y = [-55, -60, 4, 51, 18, -11, -49, -50, -5, 42, 48, -29, -29, -34, -11, 27, 36, -3, -35, -39, 15, 52, 31, -17, -40, -40, -28, 56, 56, -4, -48, -21, 4, 29, 48, -12, -14, -56, 8, 45, 43, -13, -60, -45, 7, 26, 7, -15, -36, -42, -21, 36, 25, -14, -51, -53, -2, 27, 30, -10, -32, -46, -6, 62, 46, 10, -27, -52, 8, 59, 45, 25, -42, -24, -11, 69, 33, -23, -30, -49, -4, 27, 46, -8, -35, -44, -16, 24, 36, -5, -46, -38, 13, 38, 13, 10, -54, -61, 2, 57, 59, 22, -37, -33, -24, 35, 33, -9, -28, -36, -17, 55, 43, -2, -56, -54, 11, 13, 37, -18, -70, -46, -16, 38, 27, 5, -58, -40, -16, 24, 57, -2, -34, -23, 6, 35, 51, 12, -4, -39, 20, 41, 23, 21, -7, -23, -16, 49, 34, 12, -34, -43, -9, 32, 40, -1, -10, -16, -21, 29, 21, 0, -38, -61, -34, 21, 28, -24, -44, -47, -9, 51, 4, -3, -35, -31, 12, 43, 45, -20, -37, -39, 9, 60, 48, 10, -62, -20, 4, 49, 44, -9, -18, -54, 9, 55, 29, -14, -29, -39, -2, 38, 26, -34, -45, -87, -14, 29, -2, 9, -55, -42, -4, 21, 9, -1, -33, -38, -11, 62, 35, 5, -35, -46, -2, 38, 72, 8, -24, -24, -24, 35, 32, -6, -18, -55, -20, 37, 27, -7, -12, -47, -40, 17, 20, 7, -49, -59, -24, 9, 45, -12, -44, -45, -2, 36, 18, 13, -19, -31, -19, 46, 41, 29, -25, -44, -9, 20, 52, 13]
5723A3m3LL4K8J2j6p4JK0K9Nk2k3k8M0L7J8k2n1pN0M2l6k1k7J0jM1Ql5mk4L8L8
5757C3lj8k1l0L6L4L1m1m3PnO6l1J0p2RL7J2J8j5n1KJ2O0J2n2l4j1M3K5J0mm6
5790b0j6L6N1kk9o1OM0L0KKq6K0K8RM3k1n2k1M2J9K1k1l9m6L5O4qj1n1lL2K5O
5824B4Ro8QjN7J6k8l3k0N2LQj6k0p0P2L1J4k3k3pOJ4K5k4k4joL0K0k0n2qK7L5
5859GJ4j2o0kK1L7K2K9j00QJ3K0P0n9j9l8K8O4k5m1Rm1N4rN5rm2k9J0L9P%o5J
5893d3K1N2qk3om4K1J3M5k3j1n1K2J9L3On9j0M0K0L4m3m0J1J6N0J2j6m8j9M5l
5925A3J3lm9oPM0K7l2l3k8K1L3L4j8l2j1J1K7rJ5n6J4NJ9K1l0j5lNM7K2k4o2J8
5959a9K2L1J0j8k9n5N4J9J9Lm8j7L1J6J8ln2m2M5K6L2k4n0J4J0J3J9k6m3pM2L2
$$ y = [13, -30, -27, 7, 35, 47, 31, -43, -42, -22, 7, 12, -10, -33, -61, -21, 16, 34, 12, -39, -46, 4, 46, 10, -11, -38, -28, -29, 12, 20, -15, -19, -43, -5, 33, 30, 12, -9, -39, -3, 31, 62, 21, -22, -15, -20, 46, 15, 25, -47, -38, -1, 11, 29, 14, -37, -35, -23, 37, 49, -3, -37, -48, -5, 20, 30, 26, -20, -36, 0, 51, 49, 20, -41, -35, 5, 35, 37, 39, -47, -27, 1, 10, 53, 32, -20, -41, 1, 20, 41, 20, -19, -65, -30, 34, 26, 15, -36, -39, -7, 18, 24, 33, -35, -27, -28, 29, 45, 17, -16, -36, 16, 19, 27, 11, -9, -79, -7, 24, 38, 15, -8, -15, -9, 5, 30, 6, -18, -19, -25, 5, 25, 5, -47, -55, -28, 7, 21, 9, -51, -53, -32, 5, 27, 56, -44, -36, -23, -3, 67, 8, -11, -49, -21, 43, 18, -23, -14, -55, -1, -10, 45, 36, -6, -35, -25, 14, 21, 21, -44, -43, -22, 30, 22, -1, -7, -51, -30, -17, 28, 5, -6, -57, -35, -16, 17, 23, -36, -46, -6, 14, 48, 5, -35, -24, -8, 42, 54, 38, -10, -29, 16, 13, 26, 23, -26, -32, -25, 15, 42, 10, -23, -51, -30, 3, 37, 19, -13, -24, -13, 14, 5, 20, -36, -22, -17, 2, 23, -7, -22, -25, -20, 27, 49, 25, -37, -19, 3, 34, 44, 26, -3, -58, -4, 15, 34, 37, -11, -28, 3, 19, 37, 34, -18, -60, -15, 11, 43, 19, -31, -17, -7, 6, 25, -1, -44, -51, -9, 23]
5991B3K8k2k4m5OM7L6j5m0k9K0M0L2l3l1l2LO2K9k8l9k6J9K2J1K4p8rJ1K7Rjk2
6024b5J8lLL1j4k9nJ0J1O3l7l3k0J9L6KJl4mMOK6km3JmO0j1j4k4l3L0J0L7m1j8
6060b6k1J9K2M1Qn7j7j3K5O2k6l4RnK7J4qj3l7K5jM4k1rl9K0NO4l9j6l8K1K7M0
6094E3k5o2Kj6M2L4rJn7J1K4L1j7k2j3mM8J1k9k1QrK8L1l0j7k4QL1N3l1k4nj3
6128a2rQ0j2m4l2K5PK4Nn3nk2M5N0Jn3m0K2K2J1pMk8RNL5J5n2l0J9J8L9k1j5j1
6163a0k6O3j3J7l7jj8L1K5l4j5k9K8L0L5m6j7ok7O4lLj3m5K5J5L5k9J2k9nK4J6
6196B0Ll9pJ6jM1kn0rK4J7L2k3k9l4PM5jlrl1QK9J7ok4m4NL9M7l2k9Lj5J8P0l1
6233B2k7l2K0K4Qj0k6nj3N9J4Jj2j6moM2k8J2o0J6L1K1pk4j9rL4K5l4j3m1K1J9
$$ y = [23, 51, 29, 5, -40, -34, 13, 49, 34, -6, -35, -15, 25, 57, 24, -7, -39, -36, 26, 55, 27, -12, -38, -19, 3, 14, 38, -40, -49, -38, -11, -2, -3, -25, -7, -10, -7, 24, 10, -19, -24, -14, -3, 60, 23, -10, -30, -11, 25, 27, 28, -6, -10, -6, 0, 26, 24, -19, -18, -22, 38, 27, 13, -11, -44, -14, -4, 33, -8, -26, -47, -28, -6, 35, 43, -14, -31, -44, -19, 43, 17, -17, -8, -13, 14, 28, 20, 7, -30, -5, -6, 38, 17, 8, -31, -11, -6, 58, 19, 3, -35, -14, 13, 53, 28, -34, -32, -48, -6, 28, 19, 20, -37, -26, -2, 29, 12, -10, -23, -27, 21, 32, 3, -18, -10, -19, 9, 40, 10, -7, -31, -23, 8, 61, 30, 6, 1, -12, -21, 59, 47, 3, -29, -4, 3, 27, 32, -21, -26, -48, -3, 47, 48, -5, -45, -23, -1, 10, 3, 7, -21, -12, -7, 28, 43, -9, -39, -20, -2, 37, 16, 1, -10, -36, 27, 14, 31, -6, -7, -25, 6, 31, -3, -18, -47, -19, 11, 46, 0, -17, -23, -50, 14, 11, 14, 1, -44, -19, -4, 31, 2, 14, -15, -20, 4, 20, 23, -16, -23, -7, -8, 33, 31, -19, -28, -4, 13, 45, 22, -7, -41, -34, 11, 10, 7, -2, -33, -25, 4, 21, 15, -9, -53, -48, -9, 38, 6, -23, -20, -35, -17, 53, 22, -5, -37, -17, 7, 15, 5, -21, -26, -39, 20, 34, 35, 23, 7, 3, -3, 39, 11, 23, -37, -21, 10, 31, 24, 0, -19, -28, 6, 31, -3, -16, -57, -36, -17]
6267a7N3ol2j7k0N7mKk8j9kM4J6j0k6k3M3QQjk4l0j1N7J2J1n9l7K7N0mOk9m0K2
6302b3L6J6k7qlk6N1lJ9k8l8J4K7L4j0l7k8M1oM4l9Kl1k2N6RNk2l7J6M8kJ2q4
6336d4nL0M7J3m0Ok7j6K7PJ9k3j6LL4lLRl7k0L9L0j8mn2L8mJ8K8n0k7K7M1K0j6
6371C7n1qj2M8J8om2j2MK8J0J1l7l7K2RK3PJ8n3JRM0k1K4n7%J9M3j0Oo2KM5OJ
6407B3l2k0rN7j7J4l7K2qNj3L5l7j7k2N6J3K5m5l6J3J5L6j1jl9L5qPLJm1J5J4
6441dPK6l7k8J4L8OJ2l0k0J3%L5j3j4j3m0P5j0Rk8k4RK6l1L8%n3L4kK5MJ4q0J5
6476b7K7L9k5j3n2O1MJ6mj9k1k6L0OM1m0k4J5JM9rm2Ok2K2J7J4j1l3mqN7oj1j7
6511ij8J9K6J0l4j7K4j5PL5k6k2NNJ0L7n7K0oj1L8km6J3Nj6M8j2k3jk3M4MMm1
$$ y = [-17, 36, 30, -2, -19, -39, 18, 14, 16, -12, -31, -33, 11, 27, 17, -9, -32, 11, 19, 27, 26, 2, -28, -39, 18, 30, 41, -18, -55, -28, 22, 18, 24, -5, -45, -23, 13, 29, 2, -6, -9, -35, 16, 13, 32, 4, -34, -20, 7, 41, 31, -6, -34, 7, 1, 45, 6, 8, -23, -45, 11, 20, 25, 3, -34, -18, 30, 28, 40, -44, -49, -19, 28, 41, 1, 7, -20, -36, -9, -2, 17, -6, -22, -19, 15, 12, 15, 24, -13, -33, 6, 36, 18, 14, -38, 0, -4, 14, 42, -8, -35, -8, 33, 53, 37, -14, -22, -34, 14, 32, 26, -16, -28, -24, 4, 14, 25, -12, -49, -27, -18, 5, 12, 30, -23, -22, -13, 27, 6, 30, -27, -27, -8, 35, 25, 31, -31, -29, 16, 22, 23, -9, -29, -38, 19, 2, 16, -21, 1, -7, -2, -15, 20, -17, -34, -56, 0, 13, 38, -7, -43, -30, -15, 21, 10, 9, -30, 5, -3, 4, 7, 8, -33, -18, -4, 3, 29, -8, -36, -22, 16, 22, 34, 4, -16, -3, -3, 32, 19, 5, -8, -48, 27, 17, 26, -2, -26, -17, 9, -22, 16, 16, -37, -3, -5, 20, 24, 38, -42, -27, 0, 39, 14, 1, -51, 10, 14, 30, 26, 7, -14, -40, -10, -4, 37, -3, -27, -12, -11, 38, 29, -13, -7, -29, -7, 10, 24, 13, -20, -24, -32, 25, 19, 8, -9, -27, -8, 18, 28, -6, -23, 1, -14, -7, 28, 2, -20, -15, -10, 0, 37, -20, 0, -6, -17, 21, 19, -27, -14, -9, -25, 23, 11, -12, -13, -36, 8, 12, 16, -25]
6546b5j1K1K4J9j7%m5K1MK0J5om3oK1J6J4j0j1k3L6OKj8Jm1L9j5K1j1j8j2J9K4
6580A1K8m8pNJL9Mn9j9j7M0J6M2k3m1K1Rj1K0ok7j5M8RpOj6k1JM7k8lol7QM0K8
6617C2l1j3k1M8j1j1Pk6j4NL9K3l8j9NpN0J8m6j6PL3okLl2PlM0k3K2k4j7J1K9
6652A9pLj8l6L1J9Qj8j1l0J0K8J4%n7M5l9M5K2m2nmlM7qll0nL3KJ9j0k5j9L2J8
6688B5Pk8k2j8K5%L8j9nl3J8QM0k7k7k0K9M2k2j0k6j7J9K5L1k8m1M0pJ9k3k4J9
6721a2J3Mj1M2k0J3m1J8K0mk7J9k8K8j0L1k6m0RJ6MmK1j5l1ML4J8Ml6j1j0L9O
6755A7mj6j3RKJ1Qj6k6M0MKj8Oj6k4M5Qj6pj4J4J4K2k4j3l0L9Jpj6J5k2J3J0L3
6791C1l0ql1K1L2lJl6j2MP6m6%J2m7N3j1J3k3LJ6j3j4K3K1k7Lk3K5J6j3l2rJ4
$$ y = [-25, -36, -15, 9, 28, 11, 11, -34, -13, -9, 11, 26, 20, -23, -29, -8, 8, 22, 12, 1, -22, 14, 20, 22, 4, 5, -36, 3, -12, 9, -2, -20, -32, -13, 11, 39, -9, -16, -11, -10, 29, 33, -26, -45, -62, -22, -6, 36, 13, -28, -7, 2, -9, 11, 5, -22, -37, 11, 20, 13, 19, 3, -18, -17, 30, 2, -1, -7, -44, -36, 4, 32, 1, -12, -33, 15, 4, -7, 0, -26, -40, -35, 4, 27, -11, -30, -25, -32, 18, 36, -10, -26, -19, 14, 8, 6, 9, -23, -16, -19, 21, -2, 20, -4, -21, -10, 19, 12, 15, -3, -39, -8, 11, 19, 1, -10, -40, -30, -2, 12, 12, -45, 0, -39, 6, 28, -14, -19, -23, -26, 21, 13, 10, -20, -25, 8, 10, 29, 19, -6, -25, 7, 25, 32, 4, -18, -36, -11, -11, 27, 8, 3, -30, -12, -4, 36, 9, -18, -38, -9, 33, 11, 1, -25, -42, -23, 2, 33, 5, -36, 4, -3, 16, -7, -31, -12, 1, 5, -6, 36, 16, 29, -12, 6, 26, 22, -5, 14, -14, 14, 4, 35, 9, -31, -22, -6, -2, -6, 15, 0, -31, -27, 7, 25, 29, -7, -18, -28, 11, 17, 13, -3, -16, -7, -5, 6, 14, -2, -28, 12, 16, 18, 0, 6, -10, -34, 11, 19, 3, -4, -18, -4, 10, 32, 8, -5, -35, 4, 5, -2, -18, -3, -25, -12, -2, 31, 1, -7, -38, -17, 15, 12, 13, -23, -35, -31, 45, -1, -1, 11, -36, 17, 6, 19, -4, -1, 15, 2, -12, 11, 32, 5, 8, -15, 10, 26, 13, -19, -28, -14]
6825a4OJ8k4j1m0M8ML1j9j9J4k1K7K8k1k5j8K5L9qpm1L1l0N1njm5j6M7J3Lkl1
6859a3k9K6J8jj7oj7L9j2K7l5J5l5L3QK6j1m5J2RJ1J9Nk9j5mN6lNn2K3rK9J7l5
6894A0k7kMK7Oj8nj5rJ8M6l0pl6L9pK8n5K2kj3K1j8L9oj5j8K0M2Pn4k1K5L1j0
6929A7J1l3RNk5N5on1J0LlJ2%j3nqJ1L1j5j9J9qJ7oKk6j1JN0noj8J1j1J3j1K2
6966A9rm9O9l0%J7l8k6N0MK0l8j1qJ0K7M6m5k9RK4j8MJ8j3j5MKJ1O%k3QPJ4j9
7002bJ6l6%J1L3Kl5j7J8NO4n8Qj7%J3qK7m9J1QJ6jKj3j4k2L1PJ9mn1L0J5L4k6
7038A7Nk2mJ3j0L8l2j6L6j5PMk7L2n1M9k0J8l8J2J2rJ5%k5NJ4rJ0j3jK3l0olO
7074a5Jj1OJ6PR%lk7J9M2l3j9jNJ7l0L2nj3J4j8LJ5k0J0j0LJ8nk1qL8k4K6k0o
$$ y = [-14, -8, 10, -14, -25, -65, -17, -13, 18, -1, -20, -6, -27, 0, 28, 7, -18, -36, -11, 28, 20, 13, -28, 3, -27, 24, 19, 18, -27, -43, 4, 17, 20, 18, -13, -42, -16, 2, 1, -16, -22, -39, 0, -12, 15, -20, -5, -40, -7, 1, 27, 16, -29, -17, -8, 3, 22, 27, -2, -17, -21, 35, 32, 37, -15, 8, -1, 28, 45, 10, -17, -19, -15, 12, 18, 0, -5, -20, -29, -11, 35, 5, -2, -38, 1, -6, 22, -33, -11, -13, -26, -5, -23, 16, 10, -5, -23, -3, 39, 46, -8, -29, -4, 27, 17, 28, -5, 4, 9, -16, 39, 33, -18, -8, -5, -8, 4, 4, -9, -14, -22, -11, 20, 5, -14, 5, -3, 14, 8, 10, -16, -27, -26, 24, 19, 13, -5, 6, -5, 8, -3, 19, 10, -39, 30, 0, 0, 17, -21, -47, 3, 7, 27, -11, -22, -30, -20, 7, 53, 8, -21, -12, 12, -6, -2, 16, 3, -12, -8, -6, 5, 11, 11, -12, -4, 3, 17, -2, 14, -22, -22, -11, 22, 24, -11, -28, -10, -5, 59, 1, 9, -8, -8, 5, -3, 24, -25, -14, -6, 10, 9, 11, -2, -16, -38, -7, 0, 19, 15, -36, -6, 9, 43, 17, 22, 0, -4, 9, -1, 37, 5, -11, 25, 10, 17, 21, -6, 26, -25, 24, 4, 22, -16, -4, 8, -1, 14, 14, -11, -6, 8, -1, 9, -4, -5, 18, -12, -18, -21, -15, -14, -25, -19, -3, 4, 13, 13, 10, -17, 2, 44, 11, -8, -9, -4, 13, -17, 15, 10, -3, 11, -7, -4, 11, -9, 1, -9, -6, 12, 7, -14, -22, 16, -8, 18, -2, -8]
7111hj7J1rK2J9k7j5nM3Pnl1pJ4J8K4m0J5l9L4K5pqOj3l3M3Ojl7j3KPK5qoqJ9
7149CkM6m6J9k5j1j5M8J7m3NpL2%j4k3lKK1KJJ5k5j6M6m0J3Pk1J1oJ6J0j7j8j8
7185c6N6Pk0j1q%kL6k0j5qJ3J7oqmJ1m7L9J8K6l4k8QJL0J8l5K6l1j6M3k5J3k5
7220a7rK7j5QMj7J7k6L1j1L2n0l8P2Ojl3J0NJ5lMk8Nk7N1%nOl8K6rNL4kl0l2L6
$$ y = [-8, -25, -14, -23, -1, 18, -9, -24, -29, 14, 21, 16, -15, -22, -8, 10, 34, -6, 9, -30, 4, 29, 22, 14, 20, 7, -26, 17, 23, 22, -15, -28, -26, -19, 6, -2, -8, -16, 3, 1, 47, 1, 20, -5, -16, -31, 17, 34, -9, -4, -11, 21, 21, 7, -16, -19, -17, 4, 6, 7, 22, -3, -19, 27, -13, 0, 7, -14, -3, -9, 7, 17, 0, -18, -36, 20, 27, 7, -4, -12, -12, -14, 22, 2, -13, -21, -8, 9, 3, -5, -9, 2, -45, -6, 12, 38, 4, -24, -16, -15, 15, 33, -2, 24, -7, -23, 20, -5, 8, -17, -26, 1, -14, -6, -2, -19, -2, -28, 3, -8, 24, -26, -64, 8, 14, 13, -20, -10, -5, 10, 7, 11, -17, -12, -39, 12, 12, 7, 13, -25, 1, -8, -3, 31, 29, -1, -33, 3]
$$ [...]
8191c
##END NTUPLES=NMR FID
##END=
