##TITLE=1H_PR192_5ACN
 D2O, 8 sc, 
 22.10.2020
##JCAMPDX= 6.0         $$ Bruker NMR JCAMP-DX V2.0
##DATA TYPE= NMR FID
##DATA CLASS= NTUPLES
##ORIGIN= UXNMR, Bruker Analytische Messtechnik GmbH
##OWNER= root
$$ XWIN-NMR		Version 3.5
$$ Thu Oct 22 11:54:20 2020 Russian Standard Time (UT+4h)  she@DPX200
##.OBSERVE FREQUENCY= 200.1315066352
##.OBSERVE NUCLEUS= ^1H
##.DELAY= (6, 6)
##.ACQUISITION MODE= SIMULTANEOUS
##.ACQUISITION SCHEME= undefined
##.AVERAGES= 8
##.DIGITISER RES= 18
##SPECTROMETER/DATA SYSTEM= spect
##.PULSE SEQUENCE= zg30
##.SOLVENT NAME= D2O
##.SHIFT REFERENCE= (INTERNAL, D2O, 0, 15.7039)
##AUDIT TRAIL= $$ (NUMBER, WHEN, WHO, WHERE, WHAT)
$$ ##TITLE= Audit trail, XWIN-NMR		Version 3.5
$$ ##JCAMPDX= 5.01
$$ ##ORIGIN= Bruker BioSpin GmbH
$$ ##OWNER= she
$$ F:/spectra/data/she/nmr/H-F/1/audita.txt
$$ ##AUDIT TRAIL=  $$ (NUMBER, WHEN, WHO, WHERE, WHAT)
(   1,<2020-10-22 11:53:11.60 +0400>,<she>,<DPX200>,
      <created by zg, POWCHK disabled, PULCHK disabled
       configuration hash MD5:
       00 E9 B6 7A A2 85 ED C7 34 08 36 98 17 FE 4E 26
       data hash MD5: 16K
       81 A3 7C E1 B4 8F 3C 10 87 D9 97 4F D1 FB 3E CE>)
$$ ##END=
$$ 
$$ hash MD5
$$ B7 4C 1A BF 41 1D 47 FE 7D 6D 25 B8 D9 72 F0 6C
##$RELAX= 
##$RELAX= 
##$RELAX= 
##$RELAX= 
##$RELAX= 
##$RELAX= 
$$ Bruker specific parameters
$$ --------------------------
##$DU= <F:/spectra>
##$EXPNO= 1
##$NAME= <H-F>
##$PROCNO= 1
##$TYPE= <nmr>
##$USER= <she>
##$AMP= (0..31)
100 100 100 100 100 100 100 100 100 100 100 100 100 100 100 100 100 100 
100 100 100 100 100 100 100 100 100 100 100 100 100 100 
##$AQSEQ= 0
##$AQ_mod= 1
##$AUNM= <au_zg>
##$AUTOPOS= <>
##$BF1= 200.13
##$BF2= 200.13
##$BF3= 200.13
##$BF4= 200.13
##$BF5= 200.13
##$BF6= 200.13
##$BF7= 200.13
##$BF8= 200.13
##$BYTORDA= 1
##$CFDGTYP= 0
##$CFRGTYP= 5
##$CHEMSTR= <none>
##$CNST= (0..31)
1 1 145 1 1 1 1 1 1 1 1 1 1 1 1 1 1 1 1 1 1 1 1 1 1 1 1 1 1 1 1 1 
##$CPDPRG= <>
##$CPDPRG1= <>
##$CPDPRG2= <>
##$CPDPRG3= <>
##$CPDPRG4= <mlev>
##$CPDPRG5= <mlev>
##$CPDPRG6= <mlev>
##$CPDPRG7= <mlev>
##$CPDPRG8= <mlev>
##$CPDPRGB= <>
##$CPDPRGT= <>
##$D= (0..31)
0 1.2 0 0 0 0 0 0 0 0.06 0 0.03 0 0 0 0 0.0002 0 0 0 0 0 0 0 0 0 0 0 0 
0 0 0 
##$DATE= 1603353191
##$DBL= (0..7)
120 120 120 120 120 120 120 120 
##$DBP= (0..7)
150 150 150 150 150 150 150 150 
##$DBP07= 0
##$DBPNAM0= <>
##$DBPNAM1= <>
##$DBPNAM2= <>
##$DBPNAM3= <>
##$DBPNAM4= <>
##$DBPNAM5= <>
##$DBPNAM6= <>
##$DBPNAM7= <>
##$DBPOAL= (0..7)
0.5 0.5 0.5 0.5 0.5 0.5 0.5 0.5 
##$DBPOFFS= (0..7)
0 0 0 0 0 0 0 0 
##$DE= 6
##$DECBNUC= <off>
##$DECIM= 32
##$DECNUC= <off>
##$DECSTAT= 4
##$DIGMOD= 1
##$DIGTYP= 9
##$DL= (0..7)
0 120 120 120 120 120 120 120 
##$DP= (0..7)
150 150 150 150 150 150 150 150 
##$DP07= 0
##$DPNAME0= <>
##$DPNAME1= <>
##$DPNAME2= <>
##$DPNAME3= <>
##$DPNAME4= <>
##$DPNAME5= <>
##$DPNAME6= <>
##$DPNAME7= <>
##$DPOAL= (0..7)
0.5 0.5 0.5 0.5 0.5 0.5 0.5 0.5 
##$DPOFFS= (0..7)
0 0 0 0 0 0 0 0 
##$DQDMODE= 0
##$DR= 18
##$DS= 0
##$DSLIST= <SSSSSSSSSSSSSSS>
$$ [...]
##$SUBNAM2= <"">
##$SUBNAM3= <"">
##$SUBNAM4= <"">
##$SUBNAM5= <"">
##$SUBNAM6= <"">
##$SUBNAM7= <"">
##$SUBNAM8= <"">
##$SUBNAM9= <"">
##$SW= 16.880792210976
##$SWIBOX= (0..15)
0 0 2 0 0 0 0 0 0 0 0 0 0 0 0 0 
##$SW_h= 3378.37837837838
##$TD= 16384
##$TD0= 1
##$TE= 0
##$TE2= 300
##$TE3= 300
##$TEG= 300
##$TL= (0..7)
0 120 120 120 120 120 120 120 
##$TP= (0..7)
150 150 150 150 150 150 150 150 
##$TP07= 0
##$TPNAME0= <>
##$TPNAME1= <>
##$TPNAME2= <>
##$TPNAME3= <>
##$TPNAME4= <>
##$TPNAME5= <>
##$TPNAME6= <>
##$TPNAME7= <>
##$TPOAL= (0..7)
0.5 0.5 0.5 0.5 0.5 0.5 0.5 0.5 
##$TPOFFS= (0..7)
0 0 0 0 0 0 0 0 
##$TUNHIN= 0
##$TUNHOUT= 0
##$TUNXOUT= 0
##$USERA1= <user>
##$USERA2= <user>
##$USERA3= <user>
##$USERA4= <user>
##$USERA5= <user>
##$V9= 5
##$VALIST= <valist>
##$VCLIST= <CCCCCCCCCCCCCCC>
##$VD= 0
##$VDLIST= <DDDDDDDDDDDDDDD>
##$VPLIST= <PPPPPPPPPPPPPPP>
##$VTLIST= <TTTTTTTTTTTTTTT>
##$WBST= 1024
##$WBSW= 4
##$XGAIN= (0..3)
0 0 0 0 
##$XL= 0
##$YL= 0
##$YMAX_a= 93631
##$YMIN_a= -90121
##$ZGOPTNS= <>
##$ZL1= 120
##$ZL2= 120
##$ZL3= 120
##$ZL4= 120
##$ABSF1= 10
##$ABSF2= 0
##$ABSG= 5
##$ABSL= 3
##$ALPHA= 0
##$AQORDER= 0
##$ASSFAC= 0
##$ASSFACI= 0
##$ASSFACX= 0
##$ASSWID= 0
##$AUNMP= <proc_1d>
##$AZFE= 0.1
##$AZFW= 0.1
##$BCFW= 1
##$BC_mod= 2
##$BYTORDP= 1
##$COROFFS= 0
##$CY= 11.3945322036743
##$DATMOD= 1
##$DC= 2
##$DFILT= <>
##$DTYPP= 0
##$F1P= 16.9975609425685
##$F2P= -3.02152046262296
##$FCOR= 0.5
##$FTSIZE= 0
##$FT_mod= 4
##$GAMMA= 1
##$GB= 0.15
##$INTBC= 1
##$INTSCL= 1
##$ISEN= 128
##$LB= 0.24
##$LEV0= 0
##$LPBIN= 0
##$MAXI= 10000
##$MC2= 0
##$MEAN= 0
##$ME_mod= 0
##$MI= 1.114404
##$NCOEF= 0
##$NC_proc= 0
##$NLEV= 6
##$NOISF1= 3.799351
##$NOISF2= 2.8
##$NSP= 1
##$NTH_PI= 0
##$NZP= 0
##$OFFSET= 15.70392
##$PC= 1
##$PHC0= -10688.29
##$PHC1= 7.200889
##$PH_mod= 1
##$PKNL= yes
##$PPARMOD= 0
##$PSCAL= 0
##$PSIGN= 0
##$REVERSE= no
##$SF= 200.130013532006
##$SI= 16384
##$SIGF1= 3
##$SIGF2= 2
##$SINO= 400
##$SIOLD= 16384
##$SREGLST= <1H.CDCl3>
##$SSB= 0
##$STSI= 0
##$STSR= 0
##$SW_p= 3612.71676300578
##$SYMM= 0
##$S_DEV= 0
##$TDeff= 0
##$TDoff= 0
##$TI= <>
##$TILT= no
##$TM1= 0
##$TM2= 0
##$TOPLEV= 0
##$USERP1= <user>
##$USERP2= <user>
##$USERP3= <user>
##$USERP4= <user>
##$USERP5= <user>
##$WDW= 1
##$XDIM= 8192
##$YMAX_p= 0
##$YMIN_p= 0
$$ End of Bruker specific parameters
$$ ---------------------------------
##NTUPLES= NMR FID
##VAR_NAME=  TIME,          FID/REAL,        FID/IMAG
##SYMBOL=    X,             R,               I
##VAR_TYPE=  INDEPENDENT,   DEPENDENT,       DEPENDENT
##VAR_FORM=  AFFN,          ASDF,            ASDF
##VAR_DIM=   8192,          8192,            8192
##UNITS=     SECONDS,       ARBITRARY UNITS, ARBITRARY UNITS
##FACTOR=    0.000296,      1,               1
##FIRST=     0,             0,               0
##LAST=      2.424536,      0,               0
##MIN=       0,             -90121,          0
##MAX=       2.424536,      93631,           0
$$ Real data points
##PAGE= N=1
##DATA TABLE= (X++(R..R)), XYDATA
0 0 0 0 0 0 0 0 0 0 0 0 0 0 0 0 0 0 0 0 4 -8 8 -8 8 -8 12 -16 16 -17 24 -24 31 -32 39 -42 48 -55 62 -70 78 -86
40 -86 96 -108 119 -133 147 -163 180 -197 219 -241 266 -290 322 -354 391 -432 479 -531 592 -663
60 -663 747 -848 974 -1134 1344 -1633 2067 -2793 4325 -17780 53184 76728 29900 -29107
74 -29107 -90121 -34579 45574 84775 40062 -43576 -63730 -31260 37738 87160 31797 -32520
86 -32520 -64799 -36096 44533 61735 34654 -18393 -80176 -34157 36492 52774 40360 -24890
98 -24890 -71204 -42179 23865 69898 32257 -26655 -58172 -52422 28918 73519 32266 -20332
110 -20332 -66279 -40424 32789 61532 45279 -25471 -70314 -27125 26403 60908 40557 -27278
122 -27278 -58466 -35886 29340 63229 25285 -16041 -53319 -40621 32791 56397 29895 -14080
134 -14080 -52941 -30188 21418 56062 40204 -20895 -46721 -29033 14695 59055 36027 -17443
146 -17443 -47757 -37645 20874 51516 31002 -11396 -56192 -37861 20615 46559 32470 -17602
158 -17602 -52073 -34855 13123 52879 30502 -20566 -42598 -35615 14506 53787 29109 -13097
170 -13097 -43397 -31740 18777 46685 34225 -10213 -45161 -27773 14840 45639 34094 -13145
182 -13145 -40843 -32288 11298 47565 27879 -11909 -39879 -36480 11417 43592 27733 -11074
194 -11074 -43129 -32676 9373 40643 31363 -12709 -41127 -30124 7288 41817 30398 -10834
206 -10834 -37802 -32116 9669 41535 28667 -7422 -38357 -31293 10092 39004 30164 -8108 -38000
219 -38000 -29316 7081 39144 30707 -9424 -35394 -29296 6483 39098 29799 -7396 -35322 -29278
232 -29278 7318 36857 30061 -6407 -35656 -27780 6304 35862 30640 -6791 -34544 -27417 4662
245 4662 36138 29794 -6664 -33470 -27636 5078 35134 29626 -5778 -33344 -26633 4865 33806
258 33806 30518 -5521 -32297 -25483 3973 33449 30505 -5306 -30980 -25118 3578 32560 30103
271 30103 -4325 -30534 -25124 2950 31615 30381 -3760 -30285 -25302 1459 30938 30677 -3981
284 -3981 -30532 -25758 1100 31028 30290 -3800 -30222 -25605 1449 30462 29736 -4181 -29876
297 -29876 -24628 1746 29957 28988 -4246 -28555 -23711 1634 28394 27909 -3399 -27033 -23296
310 -23296 484 27321 27158 -2155 -26546 -24072 -995 25590 27470 -1843 -26786 -25257 -2304
323 -2304 25321 27822 -1732 -27225 -26252 -2358 25852 27470 -1509 -27873 -26374 -874 25842
336 25842 27188 -1362 -27865 -24400 210 25408 26436 -2148 -26041 -22924 -227 24855 24914
349 24914 -1716 -24397 -23155 -732 22514 23815 195 -24561 -23441 -2070 19746 24468 905
362 905 -24448 -23709 -4089 20178 25000 1197 -23659 -25854 -3896 21674 24398 2150 -24479
375 -24479 -26032 -2177 21105 25747 1759 -25371 -23333 -2163 21196 26145 273 -23649 -22164
388 -22164 -1596 21586 23223 1835 -21831 -22688 34 19103 22126 3927 -21786 -21427 -1505
401 -1505 17783 23587 2557 -20643 -21116 -5183 18630 23087 2051 -19450 -23458 -4229 18041
414 18041 22520 4419 -21678 -23323 -2275 16096 24017 4492 -22301 -21332 -3290 18547 23921
427 23921 2328 -18643 -22003 -3176 20618 20955 3597 -17633 -22030 -1673 17297 21782 4830
440 4830 -19570 -19061 -3005 15065 23765 3691 -18077 -19404 -4673 17078 20696 4640 -15715
453 -15715 -23298 -3044 16997 18797 6730 -17286 -22737 -3432 15060 21313 3969 -17524 -19724
466 -19724 -6742 16114 21678 2259 -15455 -21292 -5169 16562 18681 6411 -16083 -22314 -1613
479 -1613 14144 19011 7613 -16516 -19970 -3794 15507 20634 4206 -12594 -20369 -6737 18029
492 18029 18104 4239 -12348 -21994 -4513 14334 17771 6685 -16599 -20305 -4158 11381 19464
505 19464 5186 -15477 -19760 -5943 14553 17428 4732 -11360 -22404 -5037 16199 15265 6989
518 6989 -12168 -21018 -3781 13113 18738 6290 -13861 -17475 -6203 12713 19818 4639 -12066
531 -12066 -18929 -6226 14194 16213 6930 -11723 -21604 -3323 12503 15727 8271 -12620 -19313
544 -19313 -5215 12160 18512 5328 -10671 -17679 -7744 14129 17667 5439 -9711 -19333 -5946
557 -5946 12589 16472 7883 -12086 -18814 -4542 10228 17443 7206 -11919 -17290 -6574 12259
570 12259 16904 5118 -8428 -18453 -6986 13412 15914 6814 -8620 -17923 -5172 11129 17184
583 17184 7872 -10240 -15595 -6679 10144 18318 6301 -9437 -16943 -7899 11637 15784 6661 -8284
597 -8284 -18987 -6716 11018 15396 7045 -9539 -17480 -6629 10277 17108 5797 -8844 -15206
610 -15206 -7897 11280 16694 5509 -7412 -16099 -6658 10735 14907 6861 -7831 -16513 -6295
623 -6295 9041 15229 6885 -8029 -15532 -8186 9067 15859 6007 -7040 -16034 -8922 9922 15083
637 15083 6775 -6939 -16684 -7977 9228 15732 7465 -8095 -16142 -7471 8770 15979 6541 -7695
651 -7695 -15402 -7768 9562 14600 6027 -7310 -15447 -7293 8781 13934 6508 -7104 -14714 -7183
665 -7183 7247 14238 6721 -6779 -13988 -8128 7120 14522 7041 -6312 -14634 -8460 7109 14376
679 14376 7899 -6409 -14946 -7801 7172 14991 7849 -6819 -14426 -7943 7013 14918 7225 -6960
693 -6960 -14251 -7681 7148 14276 6780 -6682 -13845 -7295 6385 13562 7039 -6441 -13035 -7445
707 -7445 5573 13597 7212 -5886 -12647 -7836 5408 13915 7763 -5904 -12969 -8030 5201 13859
721 13859 8113 -5655 -13007 -7987 4746 14051 7854 -5970 -12625 -8109 4877 13997 7558 -6003
735 -6003 -12798 -8328 5026 13679 7516 -5866 -12229 -7456 4487 13545 7817 -5823 -11926 -7674
749 -7674 4437 13548 7734 -5061 -11677 -7521 4189 13018 7762 -5052 -11720 -7907 4076 12562
763 12562 7714 -4947 -12163 -7945 3626 12509 7844 -4976 -11941 -8026 3748 12630 7816 -4813
777 -4813 -11787 -7770 3927 12668 8188 -4303 -11389 -7453 3290 12375 8234 -4623 -11020 -7756
791 -7756 3135 12022 7793 -4498 -11324 -8149 3031 11493 7777 -4229 -11528 -7645 3002 11272
805 11272 8598 -4334 -11296 -7257 2618 11465 8500 -3750 -10604 -7396 3009 11356 8143 -2987
819 -2987 -11006 -7468 2803 10757 8653 -3773 -11310 -7000 1724 10808 8641 -3919 -10662 -7579
833 -7579 1957 11047 8268 -3418 -10884 -7561 2587 10406 8667 -2789 -10697 -6609 2409 10551
847 10551 9146 -3354 -10174 -6480 1828 10913 8262 -3094 -9766 -7710 1935 10146 8464 -2673
861 -2673 -10810 -7082 1943 9391 8907 -3129 -10619 -6470 1323 10166 8783 -2933 -9037 -7358 1786
876 1786 10325 7672 -1911 -9683 -7383 2215 9126 8461 -2268 -9994 -6848 638 9026 8912 -2816
891 -2816 -9323 -7307 623 9548 7808 -1619 -9287 -8083 1615 8783 7907 -808 -9564 -7280 1439
906 1439 8900 8954 -1898 -9136 -6989 414 10022 7910 -2020 -8719 -7872 1265 8652 7344 -957 -9627
922 -9627 -7450 1767 7762 7870 -1249 -9624 -6803 443 8138 7648 -1347 -7967 -7998 715 8944 7020
938 7020 -116 -8260 -8032 1307 7774 7829 -45 -9311 -7106 663 7531 8669 -892 -8767 -7151 518
954 518 8551 7540 -306 -8083 -8166 1664 7915 6867 597 -8750 -7493 1307 7080 7647 -395 -8533
970 -8533 -6528 170 7691 7740 -733 -7192 -7551 466 7482 6929 990 -7924 -8050 1099 6394 7616
986 7616 1048 -8348 -7229 108 7102 7996 -41 -7296 -7948 -331 8049 7221 174 -7280 -8196 622
1002 622 7231 7074 776 -7765 -7104 600 6539 7399 1 -7353 -7106 -170 7123 6777 324 -6553
1018 -6553 -7871 -31 6967 6098 1056 -6765 -7567 121 6424 7113 858 -6766 -6975 -573 6709 7080
1034 7080 274 -6476 -7789 -670 7142 6789 984 -6336 -7978 66 6658 6377 1166 -6666 -7398 -456
1050 -456 6262 6555 385 -6093 -7308 -626 6858 6522 792 -5534 -7947 -368 6250 6103 1295 -6207
1066 -6207 -7643 -419 6119 6391 925 -6021 -7297 -842 6311 6269 904 -5431 -7567 -920 6371 5691
1082 5691 1569 -5487 -7638 -631 5797 6378 1452 -5747 -7116 -1238 5806 6462 1230 -5520 -7157
1097 -7157 -1411 6046 6190 1340 -5293 -7561 -861 5573 6231 1661 -5429 -7054 -930 5448 6332 1426
1113 1426 -5023 -6950 -1545 5738 6208 1366 -4700 -7179 -1070 5540 6174 1916 -5044 -6465 -882
1128 -882 5197 6094 1667 -4975 -6441 -1349 5333 6413 1400 -4598 -6751 -1672 5280 6188 1421 -4403
1144 -4403 -6672 -1243 5149 6163 1454 -4616 -6541 -1529 5101 6184 1562 -4449 -6255 -1537 4969
1159 4969 6061 1440 -4041 -6079 -1806 5115 6076 1824 -4460 -6019 -1767 4544 6318 1377 -4170
1174 -4170 -6111 -1994 4576 6212 1443 -3893 -6289 -1784 4798 6143 1246 -4027 -6355 -1893 4448
1189 4448 6131 1607 -3968 -5596 -2024 4553 5818 1505 -3756 -5480 -2107 4210 6091 1515 -3649
1204 -3649 -6124 -1925 4351 5964 1628 -3960 -5989 -2095 4171 6278 2066 -3646 -5848 -2103 4429
1219 4429 6013 1731 -3635 -5815 -2238 4124 5666 1817 -3666 -5616 -2025 3942 5545 1798 -3789
1234 -3789 -5419 -2381 3474 5594 1809 -3416 -5651 -2373 3527 5537 1884 -3183 -5566 -2145 3277
1249 3277 5692 2519 -3437 -5136 -2222 3103 5991 2211 -3434 -5127 -2286 3224 5740 2226 -3463
1264 -3463 -5527 -1957 3378 5417 2482 -3480 -5291 -2126 2692 5866 2068 -3550 -4756 -2291 2821
1279 2821 5653 2037 -3168 -4900 -2312 2903 5719 2417 -3061 -4892 -1949 2438 5796 2525 -3506
1294 -3506 -4628 -2420 2431 5658 2258 -3158 -4605 -2748 2619 5521 2442 -3079 -4979 -2107 2404
1309 2404 5282 2684 -3200 -4820 -2094 2233 5706 2278 -2937 -4322 -2505 2613 5387 2170 -2539
1324 -2539 -4860 -2375 2357 4927 2453 -2896 -4829 -2319 1774 4868 2321 -3083 -4095 -2738 1985
1339 1985 5193 2423 -2291 -4799 -2496 2296 4825 2778 -2448 -4748 -2117 2180 4772 2877 -2702
1354 -2702 -4640 -2421 1517 5018 2402 -2742 -4318 -2670 1872 4611 2501 -2366 -5105 -2263 2076
1369 2076 4278 2807 -2666 -4937 -2174 1472 4690 2481 -2497 -4147 -2906 1763 4867 2254 -1966
1384 -1966 -4394 -2558 2042 4235 2836 -2205 -4676 -1977 1511 4025 2934 -2614 -4235 -2516 1235
1399 1235 4581 2442 -2002 -4321 -2522 1900 3860 2844 -1826 -4729 -2153 1458 4049 3136 -2146
1414 -2146 -4259 -2160 1406 4430 2553 -2127 -4231 -2818 1486 4266 2617 -1660 -4666 -2290 1722
1429 1722 3729 3095 -1835 -4427 -1959 1263 4002 2937 -1927 -3856 -2670 1433 4254 2551 -1540
1444 -1540 -4084 -2545 1380 3845 2707 -1400 -4286 -2229 1190 3710 2742 -1574 -3946 -2383 1190
1459 1190 3895 2405 -1233 -3711 -2937 1413 3834 2613 -1146 -4022 -2561 1325 3328 2845 -1246
1474 -1246 -3834 -2241 863 3945 2556 -1314 -3833 -2684 1209 3546 2589 -1030 -3813 -2773 1408
1489 1408 3638 2431 -867 -3963 -2496 1046 3710 2670 -1076 -3567 -2653 987 3719 2252 -912
1504 -912 -3766 -2711 1462 3138 2459 -914 -3727 -2696 1323 2971 2641 -525 -3574 -2499 1065 3382
1520 3382 2659 -770 -3736 -2953 1099 3355 2175 -564 -3590 -2886 1139 3223 2640 -523 -3890 -2403
1536 -2403 1076 3248 2568 -913 -3472 -2656 1081 3256 2085 -415 -3253 -2695 677 2959 2482 -359
1552 -359 -3142 -2519 622 2742 2664 -714 -3278 -2541 767 3077 2315 -536 -3192 -2678 740 3181 2261
1569 2261 -514 -3210 -2493 1066 3078 2357 -475 -3001 -2381 758 3029 2357 -383 -3220 -2531 830
1585 830 2798 2277 -387 -2608 -2398 846 2854 2289 -383 -2888 -2505 507 3003 2193 -386 -2541
1601 -2541 -2628 573 3062 2049 -285 -2725 -2619 648 2983 2234 -227 -2934 -2605 553 2911 2329
1617 2329 -310 -2764 -2604 552 3131 2118 -180 -2687 -2551 750 2730 2076 -174 -2565 -2528 491
1633 491 2758 2088 183 -2629 -2628 462 2835 2147 -379 -2543 -2492 377 2739 2123 -300 -2374 -2653
1650 -2653 462 2423 2135 9 -2440 -2227 480 2612 2113 -127 -2671 -2694 182 2514 2373 -176
1666 -176 -2603 -2481 232 2621 2103 118 -2645 -2652 226 2651 2258 -212 -2483 -2385 137 2710 2136
1683 2136 -329 -2347 -2386 4 2446 2232 -312 -2203 -2319 86 2334 2161 5 -2329 -2372 -258 2362
1700 2362 2338 -76 -2140 -2365 3 2236 2329 -133 -2112 -2321 -2 2091 2193 -319 -2338 -2073 -274
1717 -274 2323 2298 -237 -2171 -2253 -289 2577 2278 -199 -1918 -2139 -325 2255 2161 152 -2046 -1952 -234
1735 -234 1958 2252 152 -2006 -1883 -385 2279 2207 -391 -2075 -2214 -290 2041 2540 146 -1830 -2124
1752 -2124 130 1790 2300 67 -1938 -2056 -415 1997 2131 22 -2057 -2397 -390 2269 2167 -94
1768 -94 -2005 -2319 -160 1840 2193 117 -1840 -2252 -300 2036 2210 197 -1724 -1894 -534 1900 2254
1785 2254 -44 -1529 -2164 -121 2000 1983 446 -1742 -2069 -242 1466 2183 199 -1967 -2066 -661 1476
1802 1476 2288 49 -1819 -1822 -153 1916 2147 298 -1726 -1887 -387 1214 1987 315 -1900 -1697 -476
1819 -476 1474 2018 219 -1655 -1704 -295 1673 1978 288 -1834 -2001 -284 1419 1793 508 -1992 -2144
1836 -2144 -485 1248 2462 319 -1909 -1763 -633 1410 2312 -117 -1564 -1719 -562 1788 2113 389
1852 389 -1553 -1697 -143 1217 1972 555 -1588 -1421 -533 1124 2241 202 -1516 -1815 -410 1506
1868 1506 2089 396 -1394 -2012 -401 1376 1865 552 -1726 -1529 -562 1341 2186 433 -1893 -1614 -450
1885 -450 1440 1971 204 -1429 -1950 -312 1280 1813 262 -1586 -1830 -157 1237 2022 436 -1664
1901 -1664 -1612 -451 1166 1940 132 -1565 -1385 -557 1159 1990 504 -1398 -1939 -201 1314 1604 573
1918 573 -1407 -1813 -581 1059 1991 255 -1362 -1658 -725 1301 1872 486 -1083 -1598 -543 1240 1603
1935 1603 894 -1002 -1830 -394 1328 1736 387 -1519 -1599 -538 1064 1837 584 -1201 -1544 -559 1053
1952 1053 1576 802 -1063 -2045 -399 1080 1538 560 -1317 -1469 -316 928 1850 824 -1062 -1594 -367
1969 -367 941 1745 718 -1001 -1855 -320 1061 1462 584 -1238 -1931 -398 877 1778 697 -1187 -1837
1986 -1837 -466 1007 1531 816 -1163 -1587 -525 1227 1690 964 -1018 -1801 -383 941 1739 581 -1049
2003 -1049 -1334 -673 980 1612 523 -841 -1508 -747 1095 1501 676 -819 -1663 -597 1010 1510 571
2020 571 -1295 -1610 -640 1007 1701 841 -889 -1506 -673 1185 1563 631 -1007 -1559 -757 1019 1456 537
2038 537 -750 -1520 -704 1010 1236 429 -1144 -1270 -442 830 1659 468 -615 -1548 -797 902 1392 630
2056 630 -684 -1638 -643 1060 1457 515 -400 -1742 -587 979 1508 701 -683 -1714 -677 935 1143
2073 1143 677 -881 -1708 -551 1013 1257 824 -344 -1543 -667 936 1477 536 -718 -1542 -365 865
2090 865 1274 478 -914 -1644 -776 974 1246 628 -514 -1441 -646 1062 1438 455 -511 -1545 -627 768
2108 768 1254 789 -702 -1571 -810 750 1067 756 -553 -1433 -688 1147 1377 497 -708 -1407 -646 559
2126 559 1298 537 -562 -1287 -773 743 1201 823 -594 -1329 -755 854 1433 701 -629 -1512 -496 536
2144 536 1402 618 -516 -925 -727 814 1495 642 -588 -1373 -899 727 1263 603 -693 -1355 -479 731
2162 731 1422 721 -565 -1096 -791 527 1087 701 -796 -1194 -715 749 1188 641 -467 -874 -570 620
2180 620 1368 752 -631 -1278 -322 384 1437 677 -277 -1256 -751 735 1499 446 -536 -1073 -634 690
2198 690 1072 548 -534 -1252 -618 389 1333 687 -348 -852 -513 778 1251 380 -284 -989 -729 548
2216 548 1132 534 -414 -1080 -918 336 1047 569 -360 -1202 -787 351 1369 663 -492 -1022 -798 400
2234 400 1024 625 -436 -842 -754 540 1181 779 -533 -1075 -753 350 1129 890 -634 -953 -567 565
2252 565 1223 647 -314 -849 -961 366 1135 623 -435 -965 -666 226 1010 644 -634 -1125 -504 -46 1094
2271 1094 598 -424 -945 -649 544 951 598 -387 -943 -543 306 825 701 -493 -950 -417 304 1147 859
2290 859 -569 -973 -573 214 914 523 -66 -850 -541 67 823 778 -252 -1056 -564 27 923 578 -253 -988
2310 -988 -485 449 890 887 -441 -1053 -219 296 1147 630 -458 -918 -577 137 1040 594 -154 -811 -686 187
2330 187 969 851 -520 -972 -857 275 1087 767 -180 -926 -495 207 842 831 -295 -800 -417 -40 1054
2349 1054 698 -392 -917 -688 112 967 632 -279 -964 -656 291 1214 676 -321 -839 -358 311 901 729
2368 729 -325 -901 -882 64 654 597 -78 -851 -641 286 982 735 -292 -852 -410 180 887 661 -163 -807
2388 -807 -609 176 757 650 -354 -656 -599 178 829 702 -30 -621 -406 204 849 955 -138 -1020 -672 172
2408 172 732 738 -296 -886 -445 33 765 624 -186 -765 -443 226 736 761 -434 -840 -704 408 835 569
2428 569 -146 -735 -488 282 672 585 3 -865 -630 -61 650 617 -41 -840 -501 139 813 653 -214 -803 -490
2449 -490 56 766 504 -145 -898 -341 326 575 544 -95 -639 -572 318 716 637 55 -941 -700 312 723 746
2470 746 -81 -607 -529 -63 632 641 9 -525 -550 -292 583 585 17 -790 -651 423 570 705 -92 -833 -532 -37
2492 -37 631 682 -152 -613 -863 115 705 542 -95 -829 -664 129 639 379 129 -616 -720 186 360 361 -256
2513 -256 -714 -675 -194 745 752 -31 -583 -894 169 384 671 54 -571 -580 172 629 494 -170 -729 -730 165 525
2535 525 523 -283 -862 -567 65 792 550 -78 -538 -641 -154 629 790 -66 -299 -545 7 800 486 -8 -688
2556 -688 -388 121 510 360 -48 -626 -513 -119 550 694 153 -440 -359 236 586 570 -10 -811 -641 -7 555
2577 555 531 -47 -544 -358 329 503 456 -3 -510 -597 130 544 496 -93 -746 -552 366 630 371 142 -459
2598 -459 -835 81 349 714 -6 -459 -509 112 550 388 205 -475 -353 177 724 439 -179 -190 -638 44 682
2619 682 427 -58 -456 -433 -23 617 367 16 -540 -380 254 478 469 146 -216 -683 105 537 546 -64 -375 -660
2641 -660 -12 542 571 249 -229 -542 -255 543 357 78 -522 -663 5 506 335 -86 -418 -593 51 929
2661 929 319 169 -457 -509 -16 755 546 -32 -435 -499 -97 524 617 165 -439 -548 -54 704 252 -241 -369
2682 -369 -651 100 786 376 23 -456 -438 181 484 344 248 -385 -701 -231 309 353 -240 -332 -501 -49 481
2703 481 572 87 -221 -619 20 584 430 46 -378 -328 55 363 291 71 -646 -469 -20 312 54 17 -312
2724 -312 -402 64 305 480 141 -575 -621 86 355 518 -251 -422 -504 32 423 466 446 -316 -406 -40 362 614
2746 614 50 -239 -283 24 479 650 -31 -529 -455 -186 371 535 -9 -378 -543 -154 478 479 -90 -648 -618 90
2768 90 442 523 76 -565 -351 -212 225 453 67 -209 -461 6 313 454 193 -327 -556 -79 374 434 43
2789 43 -620 -583 -119 478 656 146 -540 -419 -46 36 492 -160 -303 -320 -12 502 545 140 -328 -392 -149 459
2811 459 378 -180 -331 -302 -105 348 511 24 -572 -284 -256 271 590 275 -376 -465 -12 359 509 -119 -199 -265
2833 -265 -54 263 658 213 -435 -385 -358 269 464 141 -347 -358 12 270 259 24 -417 -276 -160 42 518
2854 518 179 -397 -427 -270 76 647 149 -403 -398 -76 246 402 -209 -487 -386 -187 294 490 30 -439 -400
2875 -400 46 526 425 108 -438 -557 -203 249 441 -23 -300 -493 1 181 400 109 -434 -425 -399 312 468
2896 468 -39 -530 -312 -43 125 488 13 -329 -394 -36 413 346 85 -347 -211 -157 388 524 -108 -454 -77
2917 -77 -328 328 568 -72 -382 -587 -76 359 312 210 -136 -208 4 292 465 463 -361 -321 34 307 335 -11
2939 -11 -158 -485 -76 339 470 303 -277 -434 -82 315 354 28 -244 -500 172 253 554 -86 -78 -439 -391 184
2961 184 196 51 -148 -311 -16 381 481 399 -207 -478 -252 444 251 573 -172 -161 57 175 286 365 -268
2982 -268 -802 -246 544 491 239 -475 -369 48 422 738 138 -243 -304 -155 328 188 37 -86 -558 -243 104
3003 104 316 128 -277 -356 -143 407 152 -15 -94 -350 -164 397 308 141 -570 -211 -140 302 401 105 -306 -307
3025 -307 -218 249 419 24 -100 -304 -118 487 378 63 -116 -508 28 357 538 170 -267 -291 18 356 452
3046 452 83 -263 -521 -251 281 225 90 -95 -239 -15 246 295 208 -216 -269 73 374 369 74 -225 -425 -28
3068 -28 89 253 -133 -264 -205 -51 294 391 59 -275 -265 -137 458 270 268 -88 -266 -287 331 428 212 -246 -358
3091 -358 -216 232 549 -120 -269 -128 -156 186 342 67 -151 -479 -49 4 575 -50 -171 -148 -422 141 324
3112 324 59 -326 -144 -29 242 326 148 -29 -309 -236 109 532 80 -252 -238 -200 322 407 30 -379 -364 -121
3134 -121 173 599 232 91 -465 -65 130 306 -3 -229 -508 -164 201 488 -214 -203 -310 -175 189 329
3154 329 190 -294 -402 23 220 158 116 -249 -423 -227 248 92 7 -149 -361 -415 236 339 241 -72 -149 -18
3176 -18 212 106 37 -197 -244 -5 310 239 92 -18 -390 -289 27 332 58 -47 -252 -122 330 264 170 -310
3198 -310 -248 12 319 453 3 -333 -277 -96 421 200 57 -203 -209 -340 193 248 85 -93 -454 -475 -73 382
3220 382 72 -258 -357 46 256 190 204 -163 -130 -95 445 238 186 -129 -340 -98 225 612 137 -284 -179 33
3242 33 -153 337 234 -128 -337 -206 315 367 312 -99 -437 -43 152 262 110 -89 -231 -76 173 242 338 -130
3264 -130 -101 -52 203 398 169 -313 -337 46 -4 173 95 19 -138 -135 126 185 226 -151 -292 -49 -27 235 227 -358
3288 -358 -243 -229 336 633 360 -85 -115 -194 -6 218 63 -332 -313 -163 192 251 92 -322 -303 -141 -102 248
3310 248 77 -306 -36 -209 -107 218 -32 -167 -76 -131 -175 291 263 121 -249 -149 24 271 257 -296 -343 -11
3332 -11 71 427 147 -406 -135 -157 365 340 96 -241 4 -263 202 393 132 -119 -481 311 -92 160 269
3353 269 -107 -178 -10 -98 153 168 -59 -385 -27 115 216 142 5 -359 -245 93 294 147 -77 -284 -79
3374 -79 154 169 88 -60 -330 -203 12 336 395 -51 -211 -323 80 294 193 -125 -254 -120 44 154 127 43
3396 43 -267 -116 -74 268 -61 17 -103 -174 117 344 -32 -279 -348 -46 152 368 431 -245 -196 -326 74 277
3418 277 235 -228 -299 -13 -6 295 309 -173 -235 -126 351 228 468 -208 -254 -73 302 252 165 -47 -335 101 143
3441 143 6 59 -103 -273 -169 162 384 36 -235 -378 -79 195 257 338 -90 -186 -133 89 224 346 -77 -361
3463 -361 2 193 173 213 17 118 -160 89 168 -151 77 -324 -315 205 446 237 -85 -225 3 43 335 423
3485 423 -55 -238 -382 93 259 64 -113 -106 -165 110 279 209 -166 -5 31 298 428 -92 -233 -215 -200 270
3507 270 335 29 -364 -260 -423 178 312 246 165 -349 -272 -76 424 158 -202 -6 -86 -4 40 -100 -118 -425 -198
3530 -198 44 153 238 -226 -180 -351 9 163 -75 72 -300 -231 158 337 234 -116 -376 -63 55 175 284
3551 284 -54 -382 -78 255 76 85 157 -424 -167 247 -18 113 -50 -299 -197 142 -45 110 -62 131 -204
3572 -204 -88 228 233 -44 -393 -222 123 160 -40 66 -21 -14 97 336 169 -50 -202 -190 122 359 86 -380
3594 -380 -266 -154 97 85 133 -76 -337 -342 -57 135 -57 71 -15 -215 224 331 188 212 -26 -480 158 197
3616 197 278 52 -199 -233 -55 172 208 8 -224 -89 52 0 -108 -78 -298 -175 -79 44 -287 -90 -21 -237
3638 -237 181 262 270 -103 -444 -129 -13 379 158 128 -318 -264 -68 374 488 -150 -398 -325 191 464 335 10
3660 10 -472 -324 -23 78 149 -389 -290 -248 322 372 278 31 -175 70 -143 12 423 88 -267 -159 103 277
3682 277 159 2 -274 -227 12 215 258 83 -143 -114 79 393 49 190 -71 -226 -65 271 207 -85 -146 -42
3704 -42 12 86 33 -36 -246 153 48 157 204 18 -358 -150 0 171 290 -114 -252 -27 181 403 321 -102
3726 -102 -223 -180 14 125 140 23 -24 -345 -110 294 386 -37 -100 -161 194 130 337 -94 -233 -277 29 80 214
3749 214 -72 -453 -169 119 168 271 -69 -515 -19 210 362 327 -82 -16 -76 -36 241 363 132 -341 -55 -100
3771 -100 79 63 -100 -164 -162 164 186 96 108 -336 -103 69 132 144 227 -216 28 40 273 42 -249 -50 -130 114
3795 114 176 339 -25 -225 -56 161 -123 161 -169 -245 -90 -132 219 311 113 -239 -49 74 147 -188 128 -54
3817 -54 -141 -160 334 369 -33 -288 88 88 136 119 -26 -71 -315 -187 214 304 142 -208 -35 185 258 174 105 -187
3841 -187 -215 -169 -20 180 -139 -106 -191 86 242 -47 107 47 -416 200 170 134 -86 -271 -42 104 -62 300
3863 300 160 -105 -278 56 385 -19 89 -168 12 1 109 383 116 -291 -185 -97 -36 316 4 -293 -317
3884 -317 -93 -108 129 113 -106 39 -39 69 -5 -102 17 7 309 357 50 274 -141 -285 290 -61 238 -203
3906 -203 -229 -212 -210 103 6 -98 -202 18 -157 277 -16 -69 -118 -61 -3 280 -73 -27 -176 -357 -13 69 411 -18
3930 -18 88 -175 -23 57 278 -165 -267 -282 254 162 -225 65 42 -173 -151 203 245 -357 -202 -58 -30 94 -59
3953 -59 -48 -75 -126 -116 279 100 58 -234 -103 -223 -151 -130 103 -291 -232 35 443 149 17 -225 -302 -47 374
3976 374 268 175 -190 -358 -53 79 217 206 -38 -14 159 218 193 94 -53 -229 -116 368 128 -55 -270 -175
3998 -175 -83 -67 135 131 -274 -392 -103 47 342 149 -11 -234 -72 268 -102 132 -65 19 -121 226 146 116
4020 116 -78 -3 -46 455 -47 -8 -49 -108 -69 150 163 -195 -357 -106 -145 24 -14 -13 -61 -244 150 -143 118 58
4044 58 82 -86 -136 -33 152 124 249 -99 -75 155 179 227 -240 -147 33 71 33 -70 -262 -67 249 69 406
4067 406 66 41 -358 78 344 230 -46 -317 -125 -69 145 130 38 -60 -125 -91 67 110 -279 -287 -140 -216 63 36
4091 36 113 -383 -87 -43 265 213 6 21 -456 -45 126 2 -153 -210 -162 -4 130 170 25 -213 -33 -268 352
4114 352 -26 227 -271 -5 -163 21 219 145 124 -225 -59 288 209 116 -187 -159 138 155 174 -210 32 -268
4136 -268 -39 253 98 -20 -103 -230 -230 244 309 71 -41 -231 -314 110 318 66 -287 -116 -10 251 396 -4
4158 -4 -239 -115 10 215 226 126 91 13 -25 -6 393 132 -230 -123 -85 85 68 16 -170 -90 143 39 -37 142
4182 142 -149 -162 315 211 170 120 16 -53 306 66 137 40 -36 -190 -88 180 110 346 244 -178 -35 123 32
4205 32 47 -89 -50 -114 130 119 133 69 -158 -339 259 183 -326 -323 -60 -118 71 99 222 -440 -132 -30 98 123
4229 123 -68 -58 -256 174 73 427 171 -162 -51 -152 228 37 -226 81 132 184 190 221 -243 -213 -261 34 172
4252 172 18 136 69 -253 61 81 213 191 -110 -3 -67 192 306 108 -151 -99 143 37 215 136 -294 -359
4274 -359 -181 221 229 389 -209 -265 -197 3 94 -67 -164 -14 -140 230 352 66 -178 -156 -257 168 327 -77
4296 -77 -59 -201 -236 -32 199 127 -113 -160 198 230 51 102 19 -258 -103 94 193 -47 114 -63 55 -21 243
4319 243 236 135 -205 54 137 13 101 -120 -147 -128 216 98 -113 -185 25 -187 -60 81 6 -8 4 29 414 304
4343 304 282 -77 -370 -106 -153 132 81 -205 -94 -115 113 149 113 -278 -249 48 89 201 198 71 4 -85 40 -12
4367 -12 -21 -30 -114 -87 155 119 234 49 -110 142 47 297 417 -191 -334 -7 4 127 19 -103 -237 47 23 284
4391 284 306 -26 -208 -293 47 133 7 -116 -66 -295 3 66 205 75 -224 -12 -110 286 331 8 -165 -224 -73
4414 -73 170 135 43 -209 -140 -64 209 228 -256 200 -137 199 117 -66 -39 -204 -71 144 -177 132 -113 -38 -113
4437 -113 275 182 22 201 -232 -258 64 -122 184 -307 -268 -26 -122 -78 -36 -59 -301 152 36 -42 -23 92 -247
4460 -247 90 119 225 184 -8 -5 -163 -78 81 241 -191 -152 -116 14 -121 -6 -4 -85 2 5 163 58 40 -53 -98
4485 -98 124 303 365 -138 -117 42 -54 61 253 133 -134 -289 -5 444 171 -26 -214 -188 66 63 170 -32
4507 -32 122 33 4 114 74 -1 -272 77 209 123 139 29 0 -84 112 168 425 -95 -191 -95 34 -112 294 16
4531 16 -257 -29 49 55 -2 159 -271 119 39 357 9 -11 -170 -252 177 -35 49 65 -55 -191 72 118 354 80
4555 80 -126 -122 146 84 10 -230 -360 -108 -25 220 141 129 -172 -61 121 -35 -70 -3 -14 -143 12 422 -206 -7
4579 -7 -65 -89 121 290 94 90 61 56 83 168 297 49 -190 -265 148 111 21 -55 -250 -347 256 232 66 -233 -290 -67
4605 -67 38 7 120 -81 -174 -154 202 -109 160 -44 -33 15 -330 47 -6 -152 -216 -188 26 252 -34 219 -229
4628 -229 -208 61 -209 57 -57 -283 -321 -105 278 0 -76 -168 -33 -17 26 302 141 11 -231 37 103 129 -83
4651 -83 -17 -169 222 27 109 185 -345 102 55 255 162 -88 -30 0 -80 185 257 27 10 -71 -101 260 380 -59
4675 -59 -180 -294 218 143 114 -61 -211 31 110 154 96 -153 -359 -90 64 -125 3 -115 -144 112 51 85 -2
4698 -2 136 -228 -50 -185 119 -182 -27 65 -53 75 98 148 -58 -244 -25 153 171 -56 -4 52 -230 142 221
4721 221 114 -214 -302 -138 -289 267 51 -18 -32 2 91 203 100 54 273 -183 -340 7 126 -171 -375 -81
4743 -81 -99 186 -8 70 -107 -45 297 286 68 95 69 -159 -8 202 -8 -110 -68 -337 111 215 291 -205 -174
4766 -174 -135 139 191 124 -132 -294 -278 -319 246 142 133 80 -193 -64 122 259 -164 -261 8 -56 144 149 173 -250
4790 -250 -221 35 -65 163 6 -117 -204 -42 101 163 -76 -135 -160 -120 158 245 -12 -23 -362 176 327 98 45
4813 45 117 -60 -63 -85 -201 -19 -391 -213 -4 341 113 128 -43 -14 83 154 223 -84 -27 -11 59 107 -36 -113 -49
4838 -49 23 181 372 275 4 -175 -263 2 227 -14 -5 -14 -329 -14 -203 120 -53 -206 -128 -143 14 201 78
4861 78 -174 -16 13 79 206 115 -254 -347 -94 137 276 -23 -139 -10 63 171 122 -230 -167 -141 0 -88 221
4884 221 140 -277 -114 -24 158 80 37 -209 -29 -41 108 276 -264 -60 -88 -143 82 215 -182 -76 91 -60
4906 -60 40 167 256 -276 -142 202 -96 111 -109 39 -196 -121 67 146 50 160 -338 141 92 119 84 -18 -81
4929 -81 -129 -85 44 5 65 107 -51 3 73 -41 -117 -8 -210 233 266 215 -60 97 -88 -63 -35 -33 9 -43 -173 171
4955 171 98 64 -276 -118 16 274 110 -11 -181 -148 60 95 252 69 -99 -316 -200 -55 -246 106 100 -256
4977 -256 113 72 -70 41 -109 16 152 22 219 64 13 -176 7 20 -2 -149 55 -49 280 79 143 -64
4999 -64 -229 -357 -31 141 241 -110 69 -73 83 -61 271 152 151 -100 167 232 251 34 -38 -111 -118 235 -240
5022 -240 -13 18 35 -96 121 226 310 -191 81 -373 241 135 108 108 81 12 -41 73 64 -121 -301 -146 134 64
5046 64 35 65 -14 -128 -2 238 403 6 -167 62 205 100 -31 113 -108 -261 195 285 120 24 -237 -148
5068 -148 123 131 219 0 -108 -77 136 149 54 -422 -145 -278 -68 217 -41 -50 -90 -86 43 135 -90 -52 44 -58 74
5093 74 119 79 144 139 -199 104 -137 232 33 -253 -100 139 227 -87 0 -55 -89 46 182 212 -95 -225 -117 156
5117 156 136 32 105 -74 -110 99 278 130 -134 -88 91 -6 176 -144 -131 38 -17 -44 -116 -43 -65 99 27 -24
5141 -24 300 40 12 0 -173 1 138 197 52 -36 -107 112 165 122 -181 27 198 -13 190 -219 -3 -188 -2
5164 -2 -210 169 200 66 69 -52 12 180 137 107 -55 40 286 241 141 -206 59 95 35 184 139 117 -381 37 66
5189 66 110 91 -179 8 -215 -103 -25 34 -106 121 -228 81 -40 93 75 -71 -115 -65 72 -167 28 -79 -174
5212 -174 -40 249 79 -89 -192 -25 137 68 1 -13 27 -265 59 13 -99 -16 -237 4 -107 85 116 108 95
5235 95 29 -85 -187 -81 -30 16 102 -182 186 120 -153 -203 -146 274 168 -152 -157 -239 -221 115 -42 39 59 -75 -54
5260 -54 -36 7 155 -158 -221 -71 55 8 415 101 -310 -232 33 198 144 -95 53 -199 -102 73 -174 -265 -300
5283 -300 -72 -111 64 210 -264 -336 5 9 272 277 -159 -150 203 15 -113 -198 24 -160 -64 51 4 -94 104 -173
5307 -173 -190 49 178 -119 -18 -337 -91 -135 179 -126 -42 62 -57 -73 176 39 121 -158 -192 -33 -60 -76 -37
5330 -37 -55 -107 -100 157 69 79 -129 142 141 264 89 -45 24 -127 -110 -162 30 -99 -84 112 -93 150 16 26 67
5355 67 -110 -94 -54 114 106 -55 -209 56 114 51 115 6 -298 -436 183 189 -44 -5 5 183 96 -20 -85 91 -103
5380 -103 -99 116 138 -187 -28 -51 -149 322 -12 -132 -304 170 -23 102 159 -84 0 7 -11 96 267 -70 -172
5403 -172 -37 -1 209 49 180 6 -294 11 -27 31 97 9 -107 254 97 67 -76 250 -96 -5 70 20 -167
5426 -167 -391 -76 -39 -44 -66 67 -393 52 117 56 195 -224 -199 -74 153 -182 -15 -195 -279 2 95 376 324
5449 324 -116 80 -86 2 89 79 -83 -71 -426 161 134 121 -97 124 -96 -98 -240 118 -100 -200 -117 60 -5
5472 -5 64 -188 83 54 -46 210 129 28 60 -122 -12 -95 -18 112 149 168 -23 75 46 -59 -175 -22 43 81 82
5497 82 61 25 -191 -122 -39 109 -289 80 -330 75 156 199 -66 -334 -24 13 -50 92 -58 -56 68 46 -154 62
5521 62 -10 -88 -214 -23 154 48 -5 -39 -48 -64 139 96 7 -237 -74 -120 106 28 298 22 119 70 -56 30 106
5546 106 -76 -180 -24 -68 140 10 -17 -76 -3 69 75 70 75 90 49 144 189 167 -304 -158 -165 -43 -125 -59 -41 -24 31 62
5574 62 75 100 43 14 296 -344 24 -149 -96 -155 231 -118 -57 -63 -152 -67 68 -86 -21 -47 -15 40 262 13 -43 -118
5600 -118 50 -218 -98 15 33 301 -121 54 187 143 51 -57 -98 -127 185 328 212 119 24 -85 173 -287
5622 -287 13 -6 -315 130 -98 158 34 -26 -194 -95 -205 20 56 29 -203 20 12 -83 131 195 -238 -114 -161
5645 -161 119 60 -13 -192 16 80 115 -4 48 -36 -41 -171 163 161 149 110 -114 94 150 45 88 -40 -102 -74 -36 195
5671 195 -82 147 -166 43 18 130 -117 -58 -118 124 20 325 67 -118 -27 367 303 211 -27 11 -196 31
5693 31 -172 97 28 -145 32 32 -59 -50 -277 101 46 27 -177 -10 264 -51 -228 -143 -48 -33 -46 -121 -167 186 250
5718 250 -131 141 -165 -155 -268 247 -48 149 -186 14 -25 198 -164 -79 -77 237 84 -60 -103 117 -123 122
5740 122 -94 -35 50 -137 -53 -7 -216 184 81 -102 -138 -182 -143 61 112 78 -112 -80 90 47 44 161 2 -87 -77
5765 -77 -38 -63 -145 -82 235 11 -21 148 215 62 -68 -138 183 -194 -30 -102 -184 -45 -76 166 119 139 -53 -45 -150
5790 -150 -17 240 106 -144 91 -85 -1 -87 -53 95 1 -36 65 -54 -110 199 -100 -65 170 -42 145 -153
5812 -153 29 162 -157 64 -42 -130 -122 157 154 100 82 -164 185 -121 89 386 -80 118 4 -124 104 -26
5834 -26 90 -183 -47 -117 34 18 -3 -156 -130 -11 92 281 -163 -259 117 96 35 90 -23 -232 -124 -158 46
5857 46 180 -18 0 57 -187 -110 73 52 -251 174 -56 -83 71 -98 70 -340 44 -255 69 243 6 -24
5879 -24 15 44 -66 -91 -78 10 -27 -20 -45 72 116 -33 25 -79 118 71 57 122 -147 190 78 -99 -89 -89 118 135
5905 135 66 136 74 60 6 159 27 264 28 -38 52 84 128 -99 -71 69 -1 90 222 120 -113 -135 28 -72
5929 -72 -144 119 -127 -90 -317 80 85 -45 52 -37 -98 -23 99 11 -225 -175 52 110 -27 -91 -75 -62 -36 179 -53
5954 -53 -211 -284 -55 -94 -73 38 -28 -78 -106 47 190 -209 -160 -43 0 160 -19 -250 -17 130 -145 69 -57
5977 -57 -59 69 -156 220 232 4 38 -58 -12 -93 -21 -22 -98 125 -142 151 164 -92 35 108 -63 -52 -75 -82 -75 34 84
6004 84 127 7 -77 4 -106 -169 -41 65 -22 178 42 -102 -150 -310 57 300 -25 171 101 -205 18 73 206
6027 206 -105 51 155 -29 -74 -66 -83 132 -101 -38 85 22 -256 -60 39 141 132 -210 -2 75 153 -80 237 -179
6051 -179 -117 109 33 84 -53 -42 148 -34 256 15 -210 -60 -4 3 107 -84 -133 254 -116 34 186 147 163
6074 163 -147 -231 -88 70 -41 130 73 -38 41 -138 115 149 -177 -16 -115 100 188 77 93 -141 -80 -15 168
6097 168 40 -66 13 -213 21 219 156 60 54 51 -154 274 12 45 -247 -24 34 191 -42 -131 125 207 -163 80
6121 80 -59 32 112 -6 -54 89 214 189 296 -42 -3 2 -302 -51 94 -334 -70 -142 -121 -236 -141 -201 11 -69
6145 -69 33 52 72 55 -170 34 64 129 -41 55 16 40 4 -94 212 -145 -103 -1 -10 167 -87 -97 150 71 234
6170 234 27 -28 -142 -205 143 -115 109 198 -8 51 95 116 39 189 -71 -149 1 -198 147 -323 -39 -22 64
6193 64 -27 41 7 -113 -195 -48 12 -24 -57 0 113 156 343 -76 -243 -6 -205 -60 46 -29 14 177 -301 -57
6217 -57 -18 42 144 -134 69 -78 213 2 67 38 229 38 35 -119 9 -157 -165 131 -6 -180 139 -350 26
6240 26 216 -173 -31 0 -199 139 -138 -156 101 -107 28 -168 101 -168 -256 -25 74 274 96 150 128 145 -469
6263 -469 -149 38 13 -33 -181 3 -143 163 96 -258 -91 9 -112 -224 55 99 -272 164 77 -149 164 107
6285 107 21 -23 95 -53 111 -251 -365 65 33 28 335 107 -64 -68 -75 73 -92 124 50 157 69 -97 130 -29
6309 -29 -141 106 -254 38 -1 63 22 69 -85 -160 38 133 -12 79 67 -136 -28 -169 90 84 -198 120 165 284
6333 284 169 -55 160 34 -177 -83 -279 145 -273 -140 -125 142 -46 102 12 9 16 -191 -200 -95 87 -52 45
6356 45 65 -85 156 20 218 -2 -22 15 17 -98 -223 188 -164 -183 95 54 -247 -102 147 -38 52 61 -36 121
6380 121 76 -135 -8 10 -230 -94 -71 -102 -29 -71 -82 -176 12 -203 163 -125 33 -118 -86 -101 -31 -188 -113 82
6404 82 -49 -153 -86 -225 -118 -61 -76 -4 -16 -7 0 77 -38 149 116 70 196 12 52 23 -200 -69 -91 -125 54 -235
6430 -235 70 79 85 71 109 57 -176 -99 -26 45 -179 -38 -2 -46 -234 -66 135 297 133 -265 51 -7 184 73
6454 73 54 26 91 80 180 16 -233 -19 -26 -155 58 -27 -49 142 28 52 -57 -79 -85 49 92 27 182 66 -196
6479 -196 149 105 0 343 -136 -131 -95 71 236 6 -246 87 -96 148 -34 -47 148 198 108 92 -132 -42 -74
6502 -74 22 -253 160 56 27 79 -24 13 -115 39 -385 160 -175 122 -92 -160 176 156 80 6 95 75 -86 55
6526 55 -108 -36 -63 68 43 -158 -202 3 -38 269 -94 40 215 135 164 -44 -158 -169 3 46 -67 -68 127 186
6550 186 49 -49 258 215 78 -4 117 54 133 21 54 -234 17 -11 -131 148 -119 177 -104 -19 -44 -238 -123
6573 -123 67 16 -47 70 180 157 -70 -39 -10 -134 -95 211 -56 139 76 23 18 -16 177 -69 -187 26 192 -127
6597 -127 -57 -174 -159 156 53 184 -186 -42 52 202 262 327 -113 170 -13 34 -86 42 166 13 -37 127
6619 127 -41 220 168 197 89 -104 -160 64 2 -4 -151 79 32 31 107 -56 56 26 -132 9 -166 51 345 87
6643 87 95 160 -5 -241 -91 181 -29 -258 -68 57 -159 -249 -48 -69 29 20 -115 -57 -12 242 276 7 52 16 189
6668 189 69 -138 -14 287 207 153 -240 143 53 84 -3 52 -158 166 142 -130 -19 -51 116 -64 141 -8 188
6691 188 -56 -19 -14 -105 -96 -79 -178 70 31 -48 -69 -48 56 111 79 118 118 164 32 -73 80 -73 130 -90 -76 -200
6717 -200 50 -134 221 213 -78 -151 -44 38 -4 -25 153 -10 152 10 -18 1 -51 263 37 5 -259 -82 170
6740 170 -47 13 175 -235 176 177 -74 -89 233 181 68 -29 -1 4 -193 -42 -36 108 -96 -161 117 -46 -128 -10
6764 -10 -21 15 298 -29 -58 140 -57 0 19 -120 -57 -180 -32 117 125 77 -62 6 83 -49 205 90 20 10 124
6789 124 -195 -290 -35 -176 51 31 25 59 -175 21 -33 131 -37 17 -69 -73 -4 -21 43 -95 -23 47 152 26 -37
6814 -37 102 -150 60 53 -199 -22 283 -47 -366 -57 -70 -17 -153 85 -315 -15 248 76 -148 -63 -140 85
6836 85 -74 8 -96 32 -160 -11 -68 23 -59 -77 241 -167 -182 53 -146 31 61 106 139 -102 -309 -65 -29 63
6860 63 274 -60 88 -60 177 -149 -15 -90 3 -102 -77 59 -162 139 194 192 -56 58 -59 9 -24 -131 87
6883 87 -18 -93 82 147 -64 -137 -168 74 28 -20 52 38 -180 -14 88 -66 106 39 184 -90 -55 -126 -50 -102 -9
6908 -9 -186 -103 96 -93 44 -69 -216 165 85 221 -128 -24 178 -261 -80 -102 -16 -174 -63 13 -56 -12 46
6931 46 135 13 -166 70 -206 31 78 92 5 18 55 181 155 94 -172 -45 -185 13 -120 68 -126 -215 111
6954 111 -21 224 55 -409 80 -20 -206 -122 -7 8 133 -76 141 -85 99 203 176 -108 -106 -21 -94 18
6976 18 133 -66 13 227 -69 20 81 -381 -175 -148 299 -69 82 36 -5 108 -28 112 -97 -8 107 -6 -10
6999 -10 -66 -214 71 302 -107 -121 74 -62 373 67 45 58 35 -51 -68 137 -48 2 -5 -26 16 -166 7 19 -33
7024 -33 -15 -9 -52 116 -11 154 100 -194 112 167 189 -99 42 -110 -30 163 -116 -3 -56 -63 -3 40 280 107 -211
7049 -211 -61 -44 -259 -56 -163 136 -76 -103 107 -166 -97 -71 23 -98 -35 75 -150 -97 448 17 117 -10
7071 -10 -119 -25 165 -145 196 -133 156 -114 24 249 209 -52 324 84 -36 77 -118 138 69 156 -65 99
7093 99 105 75 40 -32 -69 39 19 -145 -157 27 13 78 231 -111 196 -213 -3 -206 -158 -72 125 -19 -34 25 139
7118 139 -66 -35 -3 436 40 91 10 172 65 121 51 -127 46 129 74 157 -105 45 100 -40 13 -53 -106 -345
7142 -345 -12 -13 11 -256 -238 -38 15 60 -107 215 -138 -138 79 141 14 -19 -33 -164 -276 -168 -203 -87 80 -18
7166 -18 186 80 -57 -224 73 -71 -139 129 229 151 39 -84 157 -97 -185 -113 -126 -32 262 -229 -101 28
7188 28 72 11 44 -27 90 -92 -64 -228 -67 -93 -181 -71 -8 -172 -84 -145 -62 47 -2 -41 111 15 -185 -162 96
7213 96 18 -15 43 -16 -274 139 -19 182 150 -7 -39 -143 -89 128 -41 -10 -7 95 -119 66 -160 -100 96 -190
7237 -190 -100 149 -60 138 255 163 -58 -69 184 276 -47 -181 -117 32 34 24 42 -81 40 154 117 -2 -128
7260 -128 90 -165 88 383 36 -113 2 337 147 73 13 -222 26 -51 31 -108 -108 -45 -57 -18 38 -96 25
7283 25 127 32 -89 46 -17 -13 -95 -148 116 -161 156 148 -160 -70 -51 80 -155 38 157 73 53 67 66 -53 -11 20
7309 20 -175 -230 202 108 -154 -55 123 -116 166 287 -43 -73 134 -64 -196 -43 52 -233 -59 -90 -102 2 191
7332 191 -193 164 -120 -126 76 -151 5 -393 6 61 54 -178 96 62 -46 24 -74 -24 -93 73 -155 65 237
7355 237 16 -74 -32 -198 -63 73 -153 46 196 2 43 -66 -17 128 -222 86 -10 -225 5 61 -102 -39
7377 -39 -21 -169 -54 -203 28 -97 -114 24 91 -138 40 -94 17 33 154 126 19 3 44 -29 -188 8 -26
7400 -26 -342 -232 -9 -93 -167 62 -160 142 -9 -131 64 50 127 157 -76 -175 3 0 -327 157 185 100 73 -27
7424 -27 19 -37 215 211 -105 -265 148 -152 127 150 83 93 112 -203 -129 6 -175 17 -86 -30 -31 -122 -139 181 -139
7449 -139 37 -102 57 33 12 285 -235 266 136 -237 68 73 47 -68 -102 146 57 -92 -279 -77 25 82 146
7472 146 58 -106 -227 13 -171 -109 12 78 -37 56 2 63 75 -24 77 -129 25 119 -234 40 -37 120 102 -2
7496 -2 13 -35 -69 13 -37 143 -28 85 153 55 -101 58 63 -128 28 -221 145 137 -210 125 22 -12 21 -385 12
7521 12 -63 186 -72 -25 120 137 130 -221 110 -59 48 26 146 120 6 244 56 -201 350 -102 71 -158 83
7544 83 124 -26 0 3 -259 -212 97 -44 -91 -96 82 333 -191 217 10 -139 -55 114 -203 113 36 -115 21 -43
7568 -43 135 219 74 116 56 -92 108 33 19 -52 317 157 -217 -112 74 -64 11 -111 -188 207 124 111 -13 -4
7592 -4 19 222 54 -92 65 -54 65 -307 113 -314 162 -103 -103 -130 -148 -250 -7 -142 8 280 -67 -122 -100
7615 -100 27 -79 -110 -76 -132 51 -140 137 -240 -90 82 -34 110 -117 3 -104 6 -149 265 -127 102
7636 102 113 -13 102 19 106 206 86 24 148 109 196 -101 -26 19 -155 44 151 -244 31 -19 -60 -112 18 -169
7660 -169 -163 93 0 -160 137 -166 -214 -87 -98 -144 85 -121 -79 -69 20 65 -138 49 -62 39 17 29 -13 33 -10
7685 -10 -58 -56 8 -132 93 -157 -52 -114 156 153 152 201 -148 -40 33 44 -117 139 -126 -47 246 -45 -211 -67 -63
7710 -63 -78 67 -12 -145 84 16 198 -69 -48 39 90 -120 -17 71 -79 -179 -41 129 -151 158 -180 -279 27
7733 27 411 67 70 77 192 -337 -46 162 5 193 93 -28 -173 111 5 126 134 -181 281 21 -106 -62 291
7756 291 -137 -7 148 56 4 226 -6 128 -71 -69 -78 -242 81 35 11 -168 -61 114 153 151 49 -86 113 -245
7780 -245 -140 -31 164 110 -86 -53 -174 -21 6 -93 -184 87 56 133 -30 47 107 -166 -26 -26 -143 165 -136 -143
7804 -143 102 135 -59 216 98 178 194 64 129 -139 249 37 172 -84 -77 -97 -18 33 -93 -109 36 -76 -23 -55
7828 -55 -6 36 149 -46 -10 62 65 -8 250 77 -390 123 -19 194 -21 177 70 -91 43 93 -4 6 -21 -142
7852 -142 -51 0 399 185 -62 -68 -49 -64 -10 336 223 171 28 31 -2 66 -204 -131 -348 -55 31 191 77 30 29 36
7878 36 94 197 84 158 -49 -13 116 68 -4 37 -66 -39 -113 -36 -34 95 134 14 -34 32 -78 -230 43 -42 -147
7903 -147 57 106 -282 -117 -43 155 108 -190 -65 17 -14 -94 132 -35 -93 6 120 -39 151 10 14 -99 -40 99
7927 99 19 98 -107 -78 -141 -26 -9 -5 72 -203 135 -22 -12 -111 54 -25 -137 129 -20 211 -96 -9 69 -45 14
7952 14 -86 25 -56 -243 -52 163 -8 -77 232 -200 -46 -102 12 152 45 59 -208 -226 20 -25 121 94 143
7975 143 -6 -18 -96 -31 90 -9 -66 256 46 -162 -25 177 17 -2 -193 -18 -58 228 161 -134 -13 51 133
7998 133 14 99 -276 2 -147 222 -66 179 -209 224 47 -85 -61 -107 138 198 139 55 -102 13 -146 73
8020 73 267 -137 -144 157 50 -27 43 -266 210 -111 -84 148 190 -175 -274 25 -79 34 -30 -43 -224 -237 93 56
8044 56 -6 -55 67 -82 -96 -26 180 203 -132 71 40 -210 -5 -101 86 45 25 76 108 107 33 -83 23 18 -141 114
8070 114 -46 142 256 272 50 -145 211 273 -99 116 143 50 6 -10 243 -318 32 -101 -25 -84 -88 135 -141
8093 -141 -273 -4 206 -167 26 -202 53 -83 -126 -115 92 44 -79 -182 38 -11 -39 -37 -73 -41 -31 47 -147 -190
8117 -190 -112 149 149 132 226 28 -6 71 103 213 -77 30 81 48 -120 -4 -28 63 139 -84 221 48 152 90 -80
8142 -80 -41 -59 321 -158 26 133 -88 -14 106 -105 -149 -3 149 -71 -138 -13 130 23 -170 -86 80 -13 -36
8165 -36 76 50 144 -223 3 -234 -12 131 -39 113 -11 -50 -10 203 28 -48 -29 55 184 -31 137 -258 -70
8188 -70 -146 -121 -312
8191c12
$$ Imaginary data points
##PAGE= N=2
##DATA TABLE= (X++(I..I)), XYDATA
0 0 0 0 0 0 0 0 0 0 0 0 0 0 0 0 0 8 -8 8 -8 8 -16 16 -16 24 -24 30 -32 40 -45 51 -57 65 -75 85 -97 109 -123
37 -123 136 -154 171 -190 210 -232 257 -287 313 -347 384 -423 467 -513 566 -624 688 -762 842
56 842 -935 1044 -1167 1315 -1491 1710 -1983 2348 -2847 3576 -4752 6967 -12608 60604 93631
71 93631 -15020 -45615 -68386 8126 82886 74928 2995 -67916 -57658 12577 58964 73225
83 73225 -2575 -67682 -54335 -4149 62688 58113 -8594 -45746 -68529 -9988 67838 49334
95 49334 3279 -44809 -65350 -6898 55176 66489 7955 -54959 -49042 -12099 52803 76448
107 76448 3243 -49928 -54010 -10771 61406 60217 8858 -46785 -65773 990 56859 51955 10829
120 10829 -50727 -55509 -3078 50412 60071 -563 -45196 -43599 -14088 51895 57788 -672 -38362
133 -38362 -48129 -8330 44740 49060 11651 -44521 -51483 -4420 33936 50544 11304 -46399 -49112
146 -49112 -14085 37816 50743 2998 -37657 -51616 -17023 43797 46997 6574 -36941 -49883
158 -49883 -8698 37613 50973 11994 -41681 -40536 -7326 34334 53961 9455 -36896 -40225
170 -40225 -10580 37512 46080 8954 -32248 -46346 -10243 34361 41188 10657 -35620 -44759 -12044
183 -12044 27739 45103 8095 -36059 -40138 -15578 28602 45260 8251 -31417 -41450 -12976
195 -12976 30448 41979 13390 -30148 -41936 -9430 28450 42426 14106 -30062 -38414 -11643
207 -11643 27931 43464 11172 -27533 -38009 -13790 28768 40748 12129 -26487 -39387 -11921
219 -11921 26187 39628 14157 -27755 -38245 -11223 24059 39894 13670 -26715 -37088 -12615
231 -12615 24819 38486 13215 -24477 -37968 -12282 24408 36726 14615 -24517 -37588 -11609
243 -11609 22790 37058 14641 -24521 -36534 -12159 22437 36568 14237 -23478 -36381 -11703
255 -11703 22327 34988 15117 -22624 -36469 -11467 21158 33963 15189 -22498 -35514 -11718
267 -11718 19731 33343 15121 -21876 -35213 -12656 18672 32490 15492 -20884 -35666 -12831
279 -12831 17876 31976 16201 -20569 -35512 -13176 17657 32100 16346 -20674 -35502 -12825
291 -12825 18063 31697 15564 -20493 -34867 -12477 17925 30787 15318 -20065 -33940 -12166
303 -12166 16733 29360 14751 -19320 -32872 -12439 15141 28429 14479 -18244 -32364 -14019
315 -14019 13920 27665 15025 -17038 -32797 -14716 13379 27972 16530 -16305 -32461 -14735
327 -14735 13712 29524 16704 -16342 -32561 -14624 15237 29747 15920 -15710 -31821 -13657
339 -13657 15823 28711 15028 -16089 -30861 -12471 14292 27237 14130 -15888 -29205 -13236
351 -13236 12706 25883 13316 -13471 -28687 -14352 12556 24383 14821 -11415 -28899 -14743
363 -14743 11154 25254 16672 -11362 -27911 -15510 11177 27616 16609 -10989 -27825 -16202
375 -16202 13527 27439 16427 -10523 -29088 -14108 14051 26044 16955 -11613 -28243 -12165
387 -12165 12818 25623 14886 -11208 -25507 -14125 12505 24484 12567 -8639 -25718 -14724
399 -14724 11727 22447 14422 -8603 -25716 -13603 8706 22669 16454 -9810 -24700 -14894 8571
412 8571 24396 15837 -7446 -25060 -15994 12105 23238 15459 -6084 -26601 -14430 11570 23193
425 23193 16684 -8932 -24166 -13263 9002 24881 14579 -9620 -21765 -15099 9393 23207
437 23207 13236 -6927 -24135 -14019 9836 19308 15541 -6690 -24702 -13183 7140 21003 14781
450 14781 -7733 -20860 -16475 6639 23674 12015 -5944 -20785 -17455 7947 21431 14192 -6154
463 -6154 -22878 -13439 6135 20587 16956 -8249 -21150 -13370 5607 22491 14110 -5667 -19126
476 -19126 -16359 8763 21714 12202 -3105 -20467 -15450 7647 19979 14235 -6666 -19511 -14130
489 -14130 2980 21817 14406 -8198 -17662 -16152 3755 20968 12020 -4538 -19837 -15997 7170
502 7170 18085 13858 -3215 -20186 -13827 5548 20135 14459 -5494 -16150 -15367 3963 23249
515 23249 12262 -4848 -15475 -16096 5559 20095 13073 -3200 -19369 -13411 4510 17351 15543
528 15543 -4748 -18396 -13367 2950 19586 12849 -4186 -15598 -16826 5119 19827 11023 -2076
541 -2076 -16433 -15842 4864 18001 14452 -3632 -16852 -12661 1676 18210 15247 -5157 -15136
554 -15136 -14130 1979 18877 12454 -2323 -16263 -15461 4953 16857 12805 -1394 -16801 -13221
567 -13221 3212 17040 14528 -3663 -14209 -13058 1273 18822 13126 -3506 -13479 -14523 2057
580 2057 16604 12882 -1808 -16209 -13573 1984 14636 14288 -2405 -16017 -13334 260 16268
593 16268 13770 -3055 -13761 -15049 929 17573 12468 -1991 -14150 -14278 1910 16103 13990
606 13990 -2218 -15367 -11977 808 15579 14375 -3320 -13927 -12497 -67 15688 12081 -2588
619 -2588 -12988 -14219 614 14530 12139 -1145 -14139 -13379 -106 13751 13803 -1916 -12937 -12743
633 -12743 -1304 14972 13778 -2006 -12694 -13723 -306 14812 13140 -1111 -13732 -13248 522
646 522 13971 13700 -1459 -14007 -12465 -271 14133 12886 -2006 -12515 -12574 -382 13783 12006
660 12006 -1284 -12126 -12542 -304 12530 12434 -259 -12188 -12050 -728 12236 13213 -253 -12107
674 -12107 -12273 -1314 12635 13053 384 -12101 -13136 -898 12772 12954 525 -12703 -12779 -519
688 -519 12398 13205 85 -12718 -12166 -761 12003 12740 -359 -12120 -12125 -478 11797 12017 726
703 726 -11974 -11751 -133 11046 12341 950 -11562 -11333 -921 10424 12640 1346 -11411 -11648
717 -11648 -1321 10312 12456 1499 -11340 -12021 -1239 10189 12704 1589 -11690 -12099 -1252
730 -1252 10059 12565 1521 -11504 -11722 -1134 10215 12539 1847 -10982 -11386 -1061 10047
743 10047 12313 1545 -10761 -11384 -1078 9619 12035 1742 -10488 -11294 -1662 9105 12036 1544
757 1544 -10338 -11728 -1991 9083 11684 2321 -10371 -11470 -1763 8685 11727 2679 -10223 -11422
771 -11422 -1730 8830 11968 2476 -9755 -11083 -1650 9203 11860 2670 -9585 -11581 -1833 8400
785 8400 11070 2637 -9697 -11466 -2010 7928 11164 2596 -9807 -10988 -2135 8149 11275 2799
799 2799 -9169 -11309 -2049 8785 11130 3551 -8993 -11271 -1367 8022 10933 3732 -8730 -10766
813 -10766 -2014 7627 10910 2926 -8276 -11297 -2596 8133 10356 3361 -8486 -11681 -2076 7369
827 7369 10110 3974 -8802 -11248 -2056 7084 10507 3815 -8268 -10462 -2161 7982 10277 3598
841 3598 -7270 -11210 -1993 7932 9819 3925 -8020 -11180 -1992 6605 10341 3745 -8391 -10550
855 -10550 -2878 6236 10367 3380 -7409 -10997 -2675 7244 9124 4129 -7194 -11342 -1880 6676
869 6676 9675 4314 -7678 -10373 -2453 6246 10354 3504 -7227 -10047 -3667 6657 9202 3364
883 3364 -6682 -10947 -2426 6148 8769 4676 -7074 -10636 -2433 5316 9721 4195 -6562 -9562
897 -9562 -3985 6436 9961 3678 -5312 -10096 -3872 6678 9462 4294 -6383 -10496 -2908 5578
911 5578 9708 4246 -7108 -9589 -3593 5511 9750 3170 -5612 -9621 -4108 6726 8612 3520 -4679
926 -4679 -10238 -3183 5969 8591 4389 -5596 -8836 -3436 5086 9996 3843 -5439 -8683 -4884 5660
941 5660 9285 3986 -4343 -9903 -4033 5924 8261 4546 -5153 -10176 -3838 5218 8973 4006 -5424
956 -5424 -9003 -4429 5298 9523 2903 -4128 -9037 -4577 5985 8397 3752 -4217 -9451 -3394 4922
971 4922 8102 4523 -5049 -8585 -3947 4204 8705 3637 -3956 -8389 -5093 5509 8233 3658 -2968
986 -2968 -9450 -4705 5079 8099 4926 -4391 -8543 -4391 3715 9017 4569 -4625 -8146 -4980 4498
1001 4498 8867 3463 -3893 -8960 -4695 4974 7623 4106 -3725 -8823 -4048 4033 7972 4085 -4195
1016 -4195 -7874 -4869 3559 8770 3417 -3380 -7690 -5376 3955 8046 3916 -3003 -8326 -4399 3620
1031 3620 7670 4638 -3797 -7983 -4378 3539 8537 3980 -3829 -7469 -5392 3839 8403 3504 -3064
1046 -3064 -7509 -4931 3712 7919 4361 -3598 -7502 -4424 2943 8006 4226 -3489 -6653 -4968 2984
1061 2984 8374 3629 -2987 -7061 -5182 3234 7763 4020 -2641 -7097 -4595 2981 8036 4238 -3110
1076 -3110 -6462 -4891 2397 8163 4081 -2703 -6584 -5194 3058 7866 3996 -2475 -6976 -4622 3018
1091 3018 7546 4313 -2676 -6914 -4464 2470 7633 4222 -2908 -6186 -4999 2535 7527 4265 -2477
1106 -2477 -6262 -4855 2560 7442 4241 -2236 -6750 -4645 2168 7490 4524 -2550 -6455 -4790 2152
1121 2152 7140 4086 -2427 -6356 -4990 2452 7130 4198 -2354 -6562 -4716 2121 7199 4604 -2309
1136 -2309 -6352 -4571 1873 6639 4287 -2182 -6189 -4679 1850 6953 4413 -1969 -6219 -4667 2089
1151 2089 6608 4749 -1972 -6138 -4437 1491 6949 4743 -2078 -6116 -4352 1374 6502 4468 -2051
1166 -2051 -6081 -4679 1583 6176 4560 -1924 -6171 -4268 1616 6234 4598 -1884 -5934 -4312 879
1181 879 6281 4816 -1888 -5807 -4288 1345 6230 4679 -1749 -5888 -4515 1250 5704 4747 -1763
1196 -1763 -5589 -4366 783 5866 4844 -1517 -5638 -4520 939 5721 4629 -1222 -5513 -4427 1055
1211 1055 6104 4693 -1301 -5754 -4348 825 5645 4727 -1520 -5775 -4455 675 5658 4399 -1351
1226 -1351 -5692 -4455 1121 5211 4275 -1169 -5638 -4387 824 5356 4548 -848 -5167 -3953 556
1241 556 5389 4899 -843 -5123 -4191 1048 5230 4688 -480 -5006 -4306 813 4976 4889 -543 -5247 -4421
1258 -4421 640 5109 4652 -800 -5249 -4539 722 5010 4383 -667 -5277 -4019 847 4706 4331 -495
1274 -495 -5274 -3935 683 4486 4827 -429 -5065 -4195 638 4391 4570 -349 -5074 -4420 551 4320
1290 4320 4484 69 -5088 -4093 515 4100 5079 -179 -5348 -4115 124 4318 4631 -21 -4868 -4365
1306 -4365 589 4466 4317 -85 -4950 -4323 849 3971 4792 33 -5150 -4032 116 3629 4430 -248
1322 -248 -4760 -4260 136 4108 4217 124 -4559 -4325 142 3766 4481 636 -4816 -3825 290 3491
1338 3491 4474 277 -4693 -3944 -107 4301 4015 -145 -4215 -4393 5 3888 3888 297 -4436 -4071 237
1355 237 3516 4121 249 -4751 -3962 -379 3560 4218 222 -4220 -4298 -39 3764 3624 473 -3953 -4492
1372 -4492 230 3613 4134 795 -4505 -3945 -221 3501 4261 302 -3940 -4142 -427 3672 3933 487
1388 487 -3669 -4328 22 3594 3742 989 -3910 -4133 101 3099 4092 750 -4014 -3680 -366 3529
1404 3529 3898 374 -3281 -4146 -110 3465 3579 811 -3523 -4080 -76 2948 3823 903 -3741 -3785 -394
1421 -394 3159 4098 664 -3063 -4003 -357 3418 3483 924 -3201 -4216 19 3331 3397 979 -3352 -3931
1438 -3931 -392 2889 3941 613 -3101 -3818 -746 3251 3796 838 -2804 -4036 -584 3182 3261 1139
1454 1139 -3420 -4065 -441 2889 3731 847 -2869 -3331 -977 3071 3888 367 -2752 -3653 -838 3338
1470 3338 3461 917 -2694 -4184 -856 3076 3669 820 -2979 -3588 -681 2712 3844 681 -2802 -3811
1486 -3811 -1164 3091 3501 565 -2232 -4185 -936 2871 3448 816 -2815 -3683 -703 2641 3394 678
1502 678 -2431 -3383 -1090 2853 3705 453 -2413 -3490 -993 3132 3263 1073 -2459 -3773 -1278 2895
1518 2895 3582 939 -2506 -3368 -1309 2770 3567 511 -2380 -3488 -1273 2963 3227 663 -2159 -3579
1534 -3579 -991 2772 3270 1072 -2350 -3145 -993 2661 3302 745 -2076 -3196 -1308 2460 3197 793
1550 793 -2123 -3383 -1016 2465 3107 862 -2069 -3385 -1177 2637 3425 1081 -2076 -3234 -1500 2232
1566 2232 3405 839 -1793 -3257 -1127 2372 3310 1013 -2043 -3448 -1040 2277 3186 879 -1873
1581 -1873 -2979 -1216 2114 3246 648 -2149 -2987 -1130 2210 3196 1011 -1790 -3059 -1144 2135
1596 2135 3243 784 -1946 -2971 -1189 1812 3170 1000 -2107 -2862 -1252 2049 3333 1025 -2210
1611 -2210 -2762 -1622 1742 3288 1134 -1902 -3063 -1387 1775 3184 1136 -1936 -2814 -1461 2220
1626 2220 3316 893 -1927 -2673 -1364 1579 3096 907 -1725 -2824 -1377 1681 3012 1286 -1807
1641 -1807 -2650 -1248 1443 3010 1032 -1560 -2552 -1493 1802 3167 872 -1295 -2797 -1438 1608
1656 1608 2830 1104 -1607 -2728 -1165 1550 2972 1025 -1760 -2703 -1749 1409 2937 998 -1188
1671 -1188 -2403 -1421 1653 2725 1144 -1490 -2779 -1151 1252 2794 1269 -1606 -2794 -1436 1475
1686 1475 2984 1092 -1395 -2557 -1386 1333 2874 1344 -1499 -2617 -1320 1328 2852 1641 -1496
1701 -1496 -2402 -1341 1372 2724 1319 -1247 -2609 -1478 1161 2793 1292 -1383 -2473 -1349 1437
1716 1437 2564 1331 -1246 -2707 -1301 1212 2648 1732 -1454 -2392 -1538 1294 2480 1569 -1386 -2311
1732 -2311 -1424 1152 2427 1393 -1235 -2521 -1214 812 2605 1683 -1320 -2456 -1364 897 2495
1747 2495 1436 -1138 -2482 -1465 1098 2586 1325 -1166 -2545 -1330 958 2370 1432 -1080 -2422
1762 -2422 -1103 802 2268 1491 -947 -2457 -1232 837 2141 1384 -1033 -2372 -1231 825 2076
1777 2076 1664 -998 -2432 -1037 931 2242 1587 -1157 -2183 -990 990 2481 1584 -946 -2252 -1641
1793 -1641 875 2125 1220 -1031 -2404 -1022 772 1959 1645 -1027 -2430 -979 795 2270 1211
1808 1211 -974 -2152 -1506 791 2017 1427 -960 -2313 -1275 968 1794 1390 -546 -2323 -1141 641
1824 641 1952 1305 -768 -2162 -1177 772 2057 1364 -870 -2107 -1387 774 1652 1360 -582 -2354 -995
1841 -995 678 1710 1553 -821 -2255 -1137 844 1890 1389 -727 -2111 -1386 823 1959 1209 -750
1857 -750 -2209 -1217 718 1767 1440 -364 -2141 -923 879 1652 1296 -843 -1920 -1272 761 2019
1873 2019 1466 -384 -2116 -1480 812 1569 1545 -506 -2318 -1129 696 1478 1609 -625 -2209 -1356 812
1890 812 1822 1400 -473 -1987 -1372 708 1814 1537 -157 -2261 -1201 580 1731 1387 -434 -1746
1906 -1746 -1298 263 1746 1529 -642 -1809 -1481 255 1585 1251 -340 -1894 -1116 662 1702 1243
1922 1243 -163 -1781 -1444 705 1726 1398 -506 -1559 -1371 530 1815 995 -402 -1659 -1256 849
1938 849 1776 1380 -355 -1742 -1153 501 1664 1331 -307 -1585 -1417 253 1622 1250 -359 -1612 -1446
1955 -1446 269 1627 1068 -285 -1801 -1318 423 1609 1519 -513 -1712 -1454 221 1613 1183 -291
1971 -291 -1357 -1469 346 1667 1440 -317 -1598 -1171 339 1470 1015 -211 -1489 -1385 507 1560
1987 1560 1124 -301 -1363 -1363 168 1513 1221 -427 -1354 -1413 479 1694 1061 -63 -1396 -1307 240 1442
2005 1442 1243 -215 -1743 -1298 245 1647 1255 -314 -1643 -1591 172 1453 1186 -239 -1505 -1193 285
2022 285 1485 1340 -170 -1466 -1254 11 1616 1199 -271 -1404 -1296 108 1457 1138 -241 -1252
2038 -1252 -1448 -12 1538 1324 -160 -1362 -1116 125 1686 1068 -235 -1355 -1231 -4 1524 1166
2054 1166 -306 -1100 -1323 138 1494 1222 -413 -1212 -1141 271 1462 1464 -427 -1421 -1138 72 1444 1302
2072 1302 -280 -1168 -1298 -157 1557 1283 -161 -1231 -1506 91 1457 1270 20 -1062 -1244 -198
2088 -198 1290 1119 -378 -1218 -1485 -273 1530 1041 -313 -1048 -1179 -56 1341 1080 20 -1065 -1128
2105 -1128 -37 1343 1243 -223 -914 -1166 -170 1126 1137 -133 -1097 -1194 -83 1194 1378 -90 -1089 -1183
2123 -1183 84 1278 1110 -93 -987 -1091 -122 1148 944 83 -1144 -1151 58 1315 1393 -92 -983 -1127
2141 -1127 -133 1022 1198 -222 -1272 -1091 22 950 1110 -21 -1062 -1198 77 1067 916 162 -1134
2158 -1134 -1188 -20 1223 956 -44 -1324 -900 -276 1079 1099 -12 -1049 -799 8 1147 1459 -176
2175 -176 -1061 -1153 -297 1193 1193 82 -989 -1047 -141 844 1125 -40 -951 -1004 -152 993 1341 214 -1114
2194 -1114 -1046 -305 935 964 199 -828 -1412 -116 914 1211 107 -894 -1063 6 942 1263 33 -943
2212 -943 -1005 -210 962 1106 -87 -925 -1247 -131 1008 1255 327 -1162 -928 -193 880 1007 239 -858
2230 -858 -731 -75 582 1154 70 -866 -873 -237 858 1122 326 -951 -958 -116 717 1054 125 -1009 -745 -194
2250 -194 783 1248 116 -904 -791 -67 942 836 221 -802 -1197 -89 610 961 268 -785 -887 -30
2268 -30 786 1213 277 -824 -803 -127 913 1087 191 -586 -1002 -56 733 904 492 -801 -865 -265 515 1014
2288 1014 281 -731 -1013 -239 761 1004 238 -769 -799 -74 868 924 171 -799 -1041 27 749 943 482
2307 482 -1104 -998 -215 874 998 161 -1009 -1015 -124 578 801 309 -844 -1068 -156 670 743 356 -675
2326 -675 -741 86 403 1158 319 -908 -947 -254 714 891 477 -930 -763 -229 700 734 239 -792 -916 -188
2346 -188 369 728 393 -858 -920 129 413 1294 316 -732 -924 -278 555 1088 252 -916 -693 -58 738
2365 738 924 441 -473 -1141 -117 728 831 356 -665 -654 -200 620 769 237 -634 -968 -116 605 717 239
2385 239 -646 -773 -173 642 557 360 -878 -847 -247 726 892 329 -504 -909 35 755 765 204 -536 -895 -117
2406 -117 562 606 337 -595 -817 -331 514 695 314 -580 -647 -75 391 738 327 -373 -808 -313 556 605 315
2427 315 -424 -1111 -20 537 604 284 -738 -1068 -330 329 814 244 -173 -801 -321 695 633 495 -583
2446 -583 -1124 -291 637 618 256 -367 -764 -214 591 704 331 -327 -676 -225 524 676 56 -619 -809 -435
2466 -435 528 834 580 -497 -563 -292 437 783 13 -367 -913 -352 568 599 230 -430 -851 -106 608 623 97
2487 97 -467 -644 -228 425 573 356 -528 -852 -313 542 876 345 -534 -571 -13 313 554 255 -379 -653 -243
2508 -243 581 475 196 -456 -539 -271 510 777 172 -346 -604 -100 750 622 211 -460 -711 -250 323 749
2528 749 244 -302 -803 -382 344 684 267 -565 -556 -206 460 930 -102 -518 -757 -359 520 731 111 -270
2548 -270 -546 -493 424 888 450 -282 -633 -213 -53 717 179 -391 -738 -474 421 608 -47 -357 -746 -295
2568 -295 334 811 281 -517 -751 -419 452 844 492 -339 -594 -365 369 703 158 -496 -531 -561 397 715 158
2589 158 -435 -613 -388 238 579 347 -340 -688 -217 342 333 404 -230 -631 -114 455 795 222 -170 -493 -504
2610 -504 302 786 118 -216 -331 -525 310 575 90 -395 -687 -521 391 746 538 -250 -512 -530 382 579
2630 579 251 -289 -725 -360 325 650 385 -350 -495 -349 318 586 300 -450 -665 -488 250 718 388 -359
2650 -359 -421 -500 544 537 409 -304 -570 -415 222 753 178 -371 -627 -174 178 573 292 -340 -350 -363 9 542
2672 542 403 -382 -520 -480 267 505 461 -458 -620 -337 217 488 546 -206 -473 -530 105 671 333 -236 -366
2693 -366 -345 277 430 363 -249 -620 -436 363 635 331 -531 -639 -165 216 418 93 -76 -525 23 386 488
2714 488 271 -352 -317 -165 292 410 195 -300 -584 -366 243 639 159 -138 -780 -104 212 544 418 -316
2734 -316 -596 -159 180 633 376 -216 -320 -211 134 776 319 -360 -605 -145 60 390 211 -301 -761 -301
2754 -301 -115 550 112 -426 -418 -271 111 554 293 -523 -549 -321 370 447 548 -94 -602 187 80 552 317
2775 317 -104 -392 -300 147 442 448 -451 -426 -364 366 418 551 -179 -314 -51 177 341 364 -171 -474 -380 74 469
2798 469 385 -71 -413 -286 360 464 273 -49 -214 -264 304 554 167 -302 -590 -458 64 359 311 -290 -586
2819 -586 -118 56 94 209 -176 -424 -254 58 310 210 -81 -373 -252 -19 296 382 -259 -358 -178 54 722
2840 722 404 -118 -451 -120 222 514 -4 -279 -442 -333 370 352 274 122 -530 19 78 617 570 -59 -723
2861 -723 -471 265 447 435 -131 -331 -318 278 360 251 -216 -505 -453 247 562 204 54 -396 -329 168 356 208
2883 208 -127 -558 -244 180 342 157 -121 -280 -245 131 317 147 -181 -503 -2 422 492 390 -302 -494 -415
2904 -415 -34 371 572 -224 -470 -289 -58 410 324 -171 -553 -446 118 269 473 -91 -455 -401 89 292 388
2925 388 83 -172 -386 -96 92 305 -166 -286 -148 264 391 201 81 -583 -99 41 422 278 -99 -507
2945 -507 -105 164 326 242 -343 -402 -354 256 487 -91 -195 -584 -121 124 573 481 52 -540 -312 -242 491 248
2967 248 65 -202 -328 -142 536 76 -168 -189 -231 242 292 294 -6 -381 -473 53 471 95 24 -154 -49 143
2989 143 343 103 -144 -563 -283 28 183 272 -32 -148 -628 -4 319 375 -51 -342 -169 146 637 267 -119
3010 -119 -167 -446 -6 229 -9 -181 -462 -284 338 432 116 -25 -414 -246 133 240 441 -270 -416 -95 9
3031 9 289 339 -216 -264 -62 68 522 143 96 -430 -185 177 440 265 -180 -252 -170 15 288 183 -207 -502
3053 -502 -177 177 268 175 43 -329 -191 64 402 173 -95 -201 -84 -45 304 182 10 -391 -146 76 542
3074 542 142 -132 -228 -378 159 331 394 99 -313 -408 139 334 549 -57 -448 -226 121 296 172 -302 -252
3095 -252 -321 52 545 445 -34 -373 -207 157 591 577 -170 -280 -100 13 477 295 -320 -230 -231 -28 258 483
3117 483 22 -418 -279 83 403 336 25 -642 -46 -63 243 17 -224 -317 -175 16 618 434 -212 -428 -282
3138 -282 -106 588 343 46 -251 -122 -109 211 203 -85 -204 -335 54 109 356 -108 -167 -118 -116 384 283 -113 -293
3161 -293 -447 86 354 281 17 -365 -193 54 235 142 92 -403 -27 116 402 443 -42 -236 -192 382 276 367
3183 367 46 -241 -185 -3 265 352 -67 -340 -333 29 224 96 102 -266 -119 52 504 352 -192 -350 5 34
3205 34 89 244 203 -421 -377 -195 420 216 72 -264 -360 135 107 233 -51 -460 -147 -13 370 279 -257 -511
3227 -511 -147 -326 272 415 -221 -296 -249 -131 184 417 -73 -212 -411 -129 210 598 53 -271 -296 160 49
3248 49 203 -94 -263 -69 74 279 286 78 -318 -35 -54 483 520 93 -34 -136 42 179 267 -66 -269 -108
3270 -108 168 141 243 174 -193 -426 42 273 -58 115 -578 -462 176 104 350 -83 -274 -212 19 188 218 259
3292 259 -564 -336 146 19 55 -60 -282 -442 117 171 577 -107 -230 -377 107 234 288 -78 -413 14 143
3313 143 239 271 18 -243 -223 25 42 170 35 -292 -302 -101 350 292 263 -456 -76 198 352 345 10 -145 -301
3336 -301 -44 262 88 -248 -71 -73 -40 2 225 -125 -297 -193 166 202 254 0 -485 -408 -171 358 290 51 -220
3359 -220 -197 -7 223 489 374 -474 -292 -84 482 138 -42 -151 -348 130 251 253 271 -246 -538 -46 265
3380 265 202 -113 -274 -157 -53 379 503 131 -239 -210 -60 133 254 135 -184 -373 -82 67 295 209 -72
3401 -72 -494 -99 131 180 202 -400 -124 130 133 470 -169 -139 -230 -74 240 237 94 -270 -201 -217 312 231 131 -200
3425 -200 -351 132 429 284 -130 -108 -85 362 484 18 130 -16 -267 -244 305 81 -84 -159 -413 94 282
3446 282 336 -34 -22 -346 -241 -12 326 22 -484 -476 147 351 229 204 -5 -260 -43 347 114 227 -99 -341
3468 -341 -122 342 283 -18 -366 -163 -318 29 324 250 -76 -460 110 323 101 275 -12 -127 120 99 22
3489 22 -67 -172 -356 -55 173 153 -60 -200 -365 17 220 248 -131 -206 -76 -179 262 215 171 -183 2 -25 76
3512 76 255 -19 -216 -380 45 196 347 210 -53 -307 -56 58 329 58 -143 -221 219 225 170 -5 -288 -380
3534 -380 -172 293 318 -356 -145 -62 -11 111 228 -8 -248 -294 -100 -88 254 121 -186 -3 -261 -10 316 -140
3556 -140 -322 -246 -62 265 283 34 -232 -431 24 116 577 46 36 -210 -255 256 17 259 -200 -180 134 344
3578 344 446 -88 -50 -215 8 298 228 -35 -287 -310 -272 73 252 94 -196 -1 -100 272 258 90 -159 -265
3600 -265 -125 14 75 -56 -339 -138 76 242 116 -110 -310 -87 -143 -90 264 77 -104 -257 -180 142 320
3621 320 -20 -62 -34 -75 277 283 62 -176 -98 -90 302 257 47 -83 -265 -85 223 206 202 -108 -584 -164 290 246
3645 246 25 -199 -100 14 -12 279 -144 -156 4 -74 114 100 -144 -206 56 -100 172 70 102 -160 -394 -105
3667 -105 129 526 97 -141 -390 -212 38 301 -199 -324 -190 -20 54 127 244 -319 -180 67 186 155 177
3688 177 2 -395 69 -13 401 79 64 -234 -39 370 114 -113 29 -401 -141 -54 318 32 -239 -166 -158 313
3710 313 187 215 -340 -172 44 -79 304 -72 -72 -99 -274 154 80 64 -179 -165 -82 136 457 138 -132 -242 -117
3733 -117 166 375 46 -64 -274 53 118 288 178 63 -232 -134 118 235 -9 -219 -382 -126 28 84 87 -320
3755 -320 -370 23 163 106 26 -465 -383 -146 13 132 173 -7 -230 102 127 38 86 -225 -98 -124 287 152 418
3778 418 -191 -44 30 -75 132 -32 90 -144 -234 164 180 172 -18 -128 -125 45 504 79 54 -433 16 -7 1 125
3802 125 -149 -122 150 -9 366 223 -110 -137 -23 -128 423 13 159 -333 86 191 374 -8 -227 -222 -123 43
3824 43 -42 -53 -169 -383 -207 69 139 176 -101 -279 84 55 170 229 13 -155 49 57 264 233 -174 -192 -36 20
3848 20 262 131 -157 -170 -7 316 44 91 -40 29 -44 204 421 197 -40 -323 -146 176 131 170 -230 -166 -174
3871 -174 313 205 259 -147 -306 -80 134 61 66 251 -304 -123 3 48 175 127 -230 31 71 371 155 27
3893 27 -106 -216 135 129 -55 -210 -126 -130 94 -32 71 64 -242 -298 298 424 -65 -49 -492 -187 172 173 104 -133
3917 -133 -131 -142 34 -120 23 207 21 -201 3 181 252 -289 -323 38 83 -23 208 -17 -97 23 224 383
3939 383 2 -110 -385 -143 60 78 175 -162 -287 4 226 449 215 -180 -358 -144 176 361 237 36 -237
3960 -237 8 33 -55 346 64 7 -165 114 86 70 -146 -53 -33 309 105 260 -90 -89 29 87 339 99 -235
3983 -235 -192 -285 204 345 56 -65 -145 -243 219 188 276 -214 -178 -116 -16 232 -126 -72 -195 -138 176 25 236
4006 236 -282 -155 -8 146 364 369 -106 -204 -236 92 144 -2 -7 9 -4 -115 -49 42 -321 -251 -84 269 199 -64
4030 -64 -154 -49 -38 38 166 -126 161 -51 -83 24 329 133 -48 43 -279 0 175 317 -281 -186 -134 228 361
4053 361 98 -22 -17 -247 -133 130 -94 -134 1 -30 -248 247 163 -46 -240 -179 -19 261 118 -80 122 -17
4075 -17 -71 299 118 58 -174 -141 161 -134 178 -161 -144 -70 -278 209 69 3 -167 -227 48 420 297 -8 -200
4098 -200 -375 -80 60 137 -287 92 -30 29 192 163 -66 -107 -304 306 74 143 -116 -45 -117 -143 280 61 -76
4121 -76 -291 -170 -96 367 197 -61 -128 -80 25 295 399 -33 -12 -290 191 16 -58 20 -182 -67 117 -71
4143 -71 112 -14 32 -204 -4 -5 268 23 -280 -223 168 296 52 -10 -87 -89 129 194 -105 -51 -144 11 -83 73
4167 73 -115 21 26 10 -30 226 -6 -267 -165 -416 46 102 95 -124 24 -90 10 176 274 3 -56 -194 -117 303
4191 303 120 45 88 97 -2 98 20 -15 101 -254 -83 136 272 -113 -124 -200 -120 71 228 -49 -181 -107 156 106
4215 106 76 145 -150 -46 -203 73 96 -25 -326 47 74 150 240 -242 -374 -259 -167 117 243 128 -75 -132 202
4238 202 239 114 -30 -235 -28 -103 272 -1 58 -193 -254 2 114 336 -129 -81 -52 -30 232 184 -463 -129 -170
4261 -170 -100 -127 147 87 -112 -126 94 207 50 120 -396 -88 9 150 163 77 -122 -216 -112 67 39 93 -140 -176
4285 -176 -224 167 230 253 -135 -230 -170 -64 -7 -213 -53 -153 154 244 113 128 63 -194 -134 211 270 -3 -42 -246
4309 -246 -139 255 24 71 -142 -78 77 176 439 -81 -218 17 -114 230 175 23 -239 -23 9 375 120 -138
4331 -138 -35 -221 42 40 238 191 -195 -55 -73 -117 173 -147 -191 -254 37 298 15 -29 -71 -74 86 -66 173 -17
4355 -17 -466 -155 -97 355 345 -67 -91 -271 -100 34 106 158 -43 -134 -24 232 534 14 -172 -258 62 155 139
4378 139 102 -112 -193 -107 145 -163 -1 -88 -96 -66 335 70 180 -378 -119 95 205 62 -136 -156 -203 80 170
4401 170 318 -23 -189 124 -74 -24 101 42 -212 -330 175 39 -40 193 -46 -16 81 25 17 9 -318 -45 -83 -3
4425 -3 -95 173 8 -150 -34 17 365 76 -73 -364 -14 64 -97 5 -171 -199 -233 -157 199 112 -136 -169 -113 -161
4449 -161 145 53 -57 -273 -24 -70 197 198 -104 -110 21 126 14 -147 -58 4 -17 3 271 -281 -207 -4 232 109
4473 109 68 118 -229 -170 -66 103 172 52 108 -45 -229 264 130 -116 -67 -222 -122 -17 166 -22 -38 -253
4495 -253 85 -25 205 391 -60 -4 -151 89 146 -195 -361 -131 8 221 30 121 -186 -57 -146 100 38 -9
4517 -9 228 -54 55 -56 392 134 -222 -294 -110 -118 121 47 -170 -130 -209 81 331 220 -92 -362 -199 134 366
4540 366 -8 -200 -37 37 125 -3 -4 -137 -193 42 83 -25 -36 -103 -244 -125 177 -4 178 -159 -47 3 101
4563 101 -207 299 -19 -88 -81 79 330 195 -277 -177 -156 152 52 -71 -300 -311 -193 -14 45 -6 57 92 -106
4586 -106 205 358 168 -66 -223 -67 84 12 -60 -6 -199 -62 233 407 152 -274 -174 -41 50 280 -113
4607 -113 -25 -202 -320 146 289 -86 -54 41 0 39 13 89 -202 -346 -74 -107 249 330 -342 -132 -49 -57 238 -88
4631 -88 -61 -158 -179 9 139 1 -222 -212 80 17 -29 -210 -107 -81 18 134 118 -2 -14 25 28 -39 -9 119 -113
4656 -113 -101 -185 137 290 -201 -330 -43 60 198 114 224 -44 -280 17 165 66 120 45 60 -126 46 170
4678 170 -211 -304 -153 -96 -36 157 -86 94 -143 -3 -156 26 -88 -124 -143 -149 39 167 295 -175 -257 -77 104
4701 104 122 -160 -280 10 23 78 316 -27 -263 -190 -83 359 266 120 -168 -94 -142 240 158 151 -188 -306 -144
4724 -144 145 77 163 193 -368 -96 152 250 115 -173 42 -114 -125 103 308 -31 -223 296 -59 7 21 -128
4746 -128 292 180 157 143 -15 174 -192 -103 146 137 43 -126 31 8 -179 47 341 -240 -182 179 86 154 42
4769 42 -12 -271 -260 307 9 -19 24 -174 147 66 231 79 -268 -226 40 10 -78 -18 -223 -98 -10 124 -122 194
4793 194 -329 -225 158 109 145 93 -137 65 -48 108 23 77 -149 -118 -40 172 111 -19 -243 -106 -4 61 39
4816 39 -103 96 -199 -147 452 156 58 -183 -69 -107 -81 88 -89 -106 -61 -267 -37 158 308 -71 -167 -125 -59
4839 -59 296 -15 180 -99 -182 8 295 131 168 -182 -76 259 73 255 15 -247 -164 94 306 155 -19
4860 -19 -59 174 13 239 210 23 -333 -160 -131 63 203 -167 -8 -216 92 15 219 152 33 -64 127 -38
4882 -38 257 -20 -200 -63 195 188 65 189 -158 -144 -20 1 98 70 -28 -37 222 -46 158 -163 5 -96 -25 72
4906 72 -125 215 -60 -141 -36 92 172 -121 -220 -333 145 352 30 -54 -137 -301 -95 167 112 19 -215 -171 96
4929 96 264 -31 -6 -404 -241 -40 59 107 -41 50 -147 -275 147 100 -247 -238 21 -8 197 -11 60 -168 -230 133
4953 133 216 25 -87 -242 -352 -147 221 -61 -13 -287 -252 141 -67 -25 -106 -54 -180 -146 -23 -88 207 -229 -176
4976 -176 90 140 -110 118 -37 23 122 -15 216 -52 -90 -205 206 -78 -60 -19 60 -20 39 31 -218 -82 195 -19
5000 -19 236 -34 141 9 3 -77 220 17 140 -130 -14 11 -159 420 -104 -87 -300 17 -82 13 63 -75 -22
5023 -22 -439 -137 192 4 26 -282 -72 -104 140 8 279 20 -287 183 232 -25 70 -10 -140 -20 11 120
5045 120 118 -27 -81 -51 56 166 -145 2 -103 72 156 74 -195 -462 -131 63 74 46 -193 -143 -139 47 89 -129
5069 -129 -158 -182 -171 -102 15 -109 102 -148 -63 -110 23 142 71 -194 -277 -62 101 86 -10 -99 -164 115 213 68
5093 68 -116 -105 -16 26 10 188 -44 -264 -153 -155 471 81 145 -313 7 -3 -18 135 160 -161 -310 -414 96 125
5117 125 254 29 204 47 -73 -57 -120 -205 -98 -63 208 71 -127 8 -182 35 -15 269 -63 -23 -9 -67 13
5140 13 122 15 -139 -200 -277 -58 23 -2 -191 16 -80 68 123 0 -185 -365 90 283 134 81 -45 -23 -145
5163 -145 -38 262 -56 14 2 -162 82 59 172 -385 -135 -335 -38 -84 -395 28 -65 -10 -104 -13 -56 -116 -82 137
5187 137 -149 233 281 -4 2 87 75 125 -28 -70 55 -63 -9 26 -96 -274 -197 88 -20 203 5 47 -160 -18
5211 -18 89 43 -102 -215 -135 -59 -123 140 104 -178 15 77 5 24 49 1 -267 -105 267 93 -24 -288 -335 51
5235 51 22 149 66 -191 -73 31 -81 -65 235 -196 -59 -155 -30 223 126 146 100 -116 -115 362 -14 -159 -326
5258 -326 -113 88 136 -115 -260 19 39 -39 238 119 -46 -124 -131 47 -76 180 -224 -99 216 229 235 118 -43
5281 -43 0 -83 20 78 -107 -87 -57 24 102 262 66 -85 -85 48 155 69 -131 90 -327 -103 139 388 70 -54
5305 -54 -78 8 261 41 -8 -53 -9 -87 -134 87 206 -148 -118 27 111 46 110 94 -205 -72 18 7 29 151 -35
5330 -35 52 173 193 145 -51 113 39 203 143 130 -72 131 -35 8 -118 41 -184 -148 -249 -57 122 -76 -43
5353 -43 40 35 -177 -127 149 30 -293 -77 56 -53 -27 -80 -39 138 258 13 -114 -135 -116 -66 -75 225 -40 -258
5377 -258 -48 -52 154 90 -3 -130 -12 13 63 144 75 83 -144 119 14 -137 83 -61 -171 -239 316 -150 48 -68
5401 -68 -179 39 -114 79 251 16 -287 90 -43 -152 -254 -61 -245 -56 189 48 123 -25 -40 -311 146
5422 146 154 -41 -191 -114 12 25 -113 -113 -26 1 -295 2 271 151 -197 36 -197 83 283 25 13 -137 -58
5445 -58 76 65 -24 75 -244 -37 -67 209 88 76 -90 144 95 110 24 108 -149 -76 31 -183 -71 -62 -115 -286 14
5470 14 -28 34 138 9 -114 -9 183 214 -64 15 -81 -24 -77 -30 43 62 -115 53 -124 -118 105 -279 -19 15 388
5495 388 66 271 52 -94 -44 108 145 105 110 -91 101 -69 -9 -387 -95 42 11 -101 170 220 -283 -88 39
5518 39 223 250 -53 -356 -109 -52 219 251 -171 -162 -70 -55 14 -40 -321 133 156 61 238 -158 -159 -131 -126 -92 211 33
5544 33 25 -443 -41 51 22 24 17 -124 -153 62 180 -63 23 -76 66 -24 10 -71 112 -16 -229 12 99 175 203 -12
5570 -12 89 5 -7 -8 -137 -209 -81 250 -233 98 -18 -166 -130 -142 -182 79 9 -9 -105 -68 232 139 161 -82 -128
5595 -128 36 -70 113 41 -243 42 79 3 -123 -74 113 -14 55 27 204 20 49 -270 -9 391 72 106 -6
5618 -6 -144 -84 -33 151 153 -235 29 -66 134 47 1 -133 -84 84 -108 69 -159 -48 114 58 2 103 -19 -78
5642 -78 90 -143 -44 111 109 -40 -72 -133 57 -20 -37 -91 -150 -197 280 190 -223 -261 -69 -98 -162 128 -106 -89 -70 -162
5668 -162 132 56 166 -58 48 34 -13 -143 100 -89 27 217 -61 229 4 18 -338 -115 -48 -79 -143 150
5690 150 113 -113 3 -91 5 -156 -230 -47 -287 -78 -181 -164 -181 -209 83 -51 -226 -22 68 -39 60 54 82 -82
5714 -82 -14 -285 -17 86 -152 83 -88 -155 257 -17 120 -173 -88 -131 128 31 95 -252 -69 -189 259 128
5736 128 -115 -31 -81 98 65 -80 119 -302 72 114 -23 132 224 39 -140 25 99 67 67 71 -29 -254 -42 -17
5760 -17 298 61 -104 -75 -74 19 -65 59 -249 75 16 -126 36 -98 -293 -117 14 39 56 -17 -68 -86 174 21
5784 21 195 -67 -82 -44 -85 3 -86 -216 -106 -134 -217 81 -63 -41 -43 -184 156 82 118 -2 -163 -52 74 198
5808 198 -191 -130 -28 -157 114 23 12 -105 -118 -140 -56 196 -139 -69 60 438 152 138 0 -188 -200 156 -150
5831 -150 40 107 -236 -58 150 -344 -202 -119 25 166 -55 2 35 -113 -40 -119 68 94 -99 139 -114 -100 36
5854 36 -11 4 -124 -97 -160 -175 -89 67 -90 -73 -192 -18 79 180 48 74 -64 -126 26 -3 -169 -153 -91 -101 -141
5879 -141 -128 -54 -43 -86 -126 -108 40 27 -94 -195 -39 36 134 111 18 -65 148 24 200 -50 -184 -122 120 138 -76
5904 -76 -47 0 28 84 55 14 6 -249 -137 4 -58 159 -100 -175 -160 -136 203 81 -107 -148 -336 89 81 144 -14 199
5930 199 177 68 -27 266 -199 -44 -189 -6 112 147 187 -203 -104 25 -137 -60 188 74 -108 35 -216 -111
5952 -111 6 72 -132 -43 -78 -119 222 -68 -184 216 -124 27 286 74 39 -172 -110 152 302 111 -105 -130
5974 -130 -5 95 -40 -238 -213 -33 81 13 70 54 -222 172 35 64 105 89 -140 50 61 188 3 -5 -73 15
5998 15 7 -6 -28 -137 -134 252 20 -16 167 -204 -45 10 93 -220 -112 -90 -5 -25 92 -29 39 47 -168 73 -64
6023 -64 -4 -79 88 -145 -211 58 58 -186 -54 -29 -65 16 -46 -14 -105 -182 -4 2 -89 -262 -36 -229 -4 248 -324
6048 -324 34 13 -81 55 31 -47 -31 92 3 -253 -76 77 -129 79 -153 41 54 -92 -59 -10 -243 194 36
6071 36 68 173 181 -163 -34 97 71 -3 296 17 -426 67 284 44 13 145 251 -97 222 -55 100 -42
6093 -42 207 190 244 -39 120 -65 -156 75 333 127 54 -17 -36 128 199 -3 -287 -156 99 -51 -50 -56 -143 -129 -161
6118 -161 271 -125 35 -40 -32 74 24 14 -396 141 131 61 18 -174 -2 15 139 208 130 -85 75 18 -265 -46
6142 -46 83 37 -63 -42 -182 108 -136 -52 -12 68 23 -142 -222 123 -124 82 -217 -47 -45 92 14 -99 236 32
6166 32 -8 133 22 -1 145 -158 125 -180 146 -63 -120 -108 -27 104 101 -24 -67 -108 -6 66 29 -192 -14 68
6190 68 -26 68 -103 150 -123 33 -100 -2 -142 -256 183 -24 -56 226 -12 -143 209 -302 140 -47 -64 102
6212 102 71 109 77 66 -244 71 74 -78 107 123 61 -101 -89 216 -314 162 -32 59 -220 -51 -20 64 177 25
6236 25 -174 183 87 -110 63 -108 61 -124 101 -188 21 -289 -103 -117 55 -52 235 81 -186 122 -137
6257 -137 142 163 -124 -109 47 54 -157 -491 -154 -22 169 77 -198 -155 152 131 164 -24 133 29 -50 -208 -252
6280 -252 156 54 45 46 -277 -208 82 -40 133 -108 -122 255 -16 109 -63 -31 -92 -71 111 153 -39 -5 -27 184
6304 184 68 6 -46 157 -3 -136 -1 54 62 -163 -169 168 213 -174 77 42 145 -403 126 159 -6 93 -351 16
6328 16 121 110 123 136 -150 -91 -52 -280 23 -25 14 130 -162 257 -305 -110 -15 51 0 -84 156 -194 -219 -59
6352 -59 -23 -75 41 -107 -288 -39 58 13 -29 256 21 73 -40 -29 121 22 148 -87 -160 -70 62 -94 -257 -77
6376 -77 155 -38 119 -62 -26 -168 179 -42 125 -237 19 74 119 63 45 77 -120 87 -237 -111 26 86 41
6399 41 -70 93 -68 117 92 135 95 4 -27 -39 153 146 -10 -331 157 -13 -98 90 -53 90 -172 -109 62 -17
6423 -17 137 18 131 104 193 107 152 -20 200 -44 264 -56 47 144 253 -274 -140 130 -96 68 -128 -103
6445 -103 -11 167 -55 75 -158 -172 -45 68 -131 -152 69 -88 -163 57 119 -107 191 163 -237 352 139 -186
6467 -186 247 14 28 60 66 -17 -113 -75 -17 8 -131 36 59 -73 217 -202 -134 138 188 117 19 -29 -122 0 83 -46
6493 -46 160 -17 -334 -186 260 -11 58 -3 -229 -153 98 38 58 -60 -180 45 83 130 -110 -335 -28 -219 -25
6516 -25 26 -44 136 -171 -45 19 39 40 -132 -175 112 -204 119 -74 -52 -18 -16 37 63 -229 201 -177 17 52 -43
6541 -43 -39 -105 -149 -138 159 26 178 4 115 22 25 37 -132 -51 51 190 108 136 -75 -116 -45 150 -79 -16 -298
6566 -298 -117 172 -74 -22 28 78 152 97 -137 -266 -93 154 17 68 -2 -154 104 78 -94 -79 -113 -32 218 104
6590 104 69 146 -84 97 21 100 4 -13 -64 13 -209 -54 205 -186 -13 73 117 -166 -147 94 -302 -47 -92 -13
6614 -13 189 39 -46 -95 212 146 -109 177 -121 71 72 -156 -14 10 -56 -294 49 -49 141 54 118 -17 29 -225
6638 -225 121 238 16 94 12 105 -96 205 -41 -195 106 195 -222 -42 283 -4 -69 96 -7 -398 73 129
6660 129 -83 -168 287 -4 79 117 2 -32 -38 -150 -145 -154 25 188 69 52 -108 -50 -99 101 -314 -8 80 63 181
6685 181 26 71 -188 275 -4 -39 312 -232 155 35 -44 36 209 -70 20 -4 92 -30 -6 110 -27 27 -21
6708 -21 -96 35 -47 -259 -19 19 28 161 -40 -248 187 -95 224 70 -194 -95 -133 -52 156 -2 115 -256 52
6731 52 150 156 -60 -31 244 -364 -109 -7 -74 48 -80 -33 -35 161 -28 -250 -82 35 223 17 -67 171 70
6754 70 -72 -80 -133 212 -104 -142 -35 51 173 -59 197 -295 -120 -140 -175 132 33 -145 -181 -92 -19 83 211 -107
6778 -107 22 222 -50 200 -26 -250 -89 -290 -175 19 170 -62 -253 181 85 161 141 125 -231 70 46 32
6800 32 -69 26 3 41 -70 254 85 73 -88 42 -144 -142 81 -70 -94 -221 39 -218 -62 56 130 -95 -4
6823 -4 108 -142 -3 91 -1 143 -307 -343 -169 -117 -63 40 39 13 -70 -100 -77 -85 29 -107 -7 -108 -174 -9 186
6848 186 139 10 -108 13 180 -178 159 -60 -83 22 -216 178 -33 -206 4 -24 322 209 362 79 -142
6869 -142 -69 -64 -160 145 -218 -109 -128 173 -163 67 24 -83 163 -44 -60 -42 27 -44 39 44 109 31 -157 -115 -85 -37
6895 -37 99 32 -162 -150 -217 -291 -46 73 7 112 267 118 -131 -148 -3 71 42 -66 -128 107 -117 50 -74
6918 -74 27 62 -26 191 -328 -74 -7 111 -253 -52 145 38 -14 185 82 86 -86 175 -20 141 95 135 126 -180
6942 -180 40 -68 -15 92 120 -49 -5 7 153 83 -142 -341 -48 65 102 -187 -116 250 -117 -13 245 -109
6964 -109 79 -85 -117 -25 -136 174 -34 5 162 -110 59 -128 -34 -29 -122 71 34 16 -64 183 -153 12 -20 31
6988 31 11 -87 13 97 -48 57 -352 -112 170 -50 -76 248 281 50 -11 -117 -22 -100 -158 104 94 -289 -138 -132
7012 -132 -79 -133 -28 22 -176 153 17 224 129 -83 -7 -72 105 -74 -44 -186 226 71 -248 3 127 -88
7034 -88 40 -188 254 -81 83 -128 74 -106 198 -203 -132 32 -36 -39 -39 -160 -23 -196 -203 -1 -115 220 47
7057 47 -1 134 -8 -39 255 -46 154 144 76 22 68 269 -67 -11 14 -82 155 306 -31 52 41 -137 -110 -67 40
7082 40 -44 143 -56 85 -159 -220 17 -141 42 -97 184 -67 -208 -23 6 -194 214 -10 168 -94 -282
7103 -282 -36 -136 -37 186 51 -50 63 79 53 -172 180 -46 -131 -136 -74 202 21 76 17 -140 -197 148 -174
7126 -174 116 -42 45 264 73 -102 248 58 135 77 -186 -206 109 -114 77 115 89 16 -195 -183 127 -199 -139
7149 -139 -51 -41 139 6 43 -21 -113 140 -3 161 178 -118 330 31 -77 60 29 -230 14 41 -77 -235 76
7172 76 160 29 -59 -42 181 72 116 50 49 175 -12 29 -39 14 -222 31 21 119 -65 73 37 36 -109 -138 28 14
7198 14 115 147 86 5 8 240 -61 -2 -2 24 187 139 -13 37 26 118 251 -90 -182 209 78 -10 -149 3 -29 41
7224 41 57 32 153 -158 -81 -30 134 -274 93 -69 -340 -402 -191 -265 3 276 41 -17 -62 19 131 37 -186 176
7248 176 15 214 -63 48 -33 -90 63 -88 82 192 49 20 -198 -181 -78 -129 -150 181 3 -164 -217 -103
7270 -103 -43 73 9 1 8 -113 151 21 -59 19 161 -52 -60 0 -264 -16 184 -124 233 236 -67 83 -219 -98
7294 -98 -29 -160 91 84 -42 -104 29 -38 103 80 72 -158 67 -76 -27 -178 96 92 -111 -240 2 181 -49 30
7318 30 -93 -254 29 46 92 -23 -5 -21 -80 -64 110 -21 53 -10 167 -33 215 -22 -129 -69 82 -63 -149 -49
7342 -49 -153 18 -77 -62 -200 47 181 25 204 -85 95 86 -30 20 -90 97 -64 -75 194 75 -33 231
7364 231 -190 -93 -94 -156 22 9 -67 36 -41 -147 4 -30 -20 -26 -48 -3 70 -13 93 -37 86 -30 209 176 191 198
7390 198 106 37 248 125 34 56 112 -182 -43 104 64 -73 -131 7 -153 127 -140 -34 -108 -20 -92 95 99 -46
7414 -46 25 117 -146 205 -193 196 102 -14 -91 -78 62 -34 204 -137 -81 102 32 -193 99 -109 -62 69 -110
7437 -110 -78 -127 94 -215 -112 99 -48 -80 -75 -125 -117 -177 -55 -75 43 -1 -19 -136 223 83 229 -163 263 229
7461 229 181 -17 116 54 -132 53 105 -113 83 -211 23 -23 -16 161 -316 40 126 -128 142 -57 3 157 75
7484 75 25 131 -36 -27 -70 -236 -59 -242 -153 -194 -81 10 -89 -2 -42 -207 110 -167 120 -16 -81 -78 -134 232 -24
7509 -24 -54 -39 -90 88 8 -79 -88 121 -96 -169 -185 -114 -1 -59 -45 128 106 53 92 -120 50 127 92 -30 -4 37 -89
7536 -89 -59 -61 97 -161 -69 210 24 144 -91 -81 -212 -87 17 -16 49 42 39 -116 162 -128 63 75 -238 -105
7560 -105 7 -5 91 68 75 85 -5 -48 -12 73 58 84 68 23 -102 54 103 -107 -152 126 108 302 -99 124 -49 -235
7586 -235 193 -226 -184 84 284 144 -82 53 190 -80 -41 -92 6 -116 13 39 225 -186 -64 85 -159 -31
7608 -31 -25 283 9 -223 100 -154 99 -190 -99 252 -97 87 370 8 134 150 -97 109 -135 -27 -13 -193
7630 -193 -210 96 59 20 142 96 -41 154 141 178 103 -70 -116 -60 23 -81 57 366 16 -205 26 113 114 -232
7654 -232 -15 -148 -122 -43 -55 -13 -13 -25 -86 -115 -160 -119 40 -44 -171 -119 -260 -171 -67 229 97 142 70 -84 -19 -156
7680 -156 44 74 -36 -67 -26 56 112 143 382 -2 138 -58 -9 -150 2 -69 -13 -71 117 -47 -195 67 0 -138
7704 -138 -94 80 -124 -38 -215 -236 -17 -109 -30 187 27 -373 32 84 37 260 -165 105 -173 -42 28 -211 281
7727 281 20 132 64 12 71 11 -272 -132 -68 -67 215 94 317 -105 -21 114 145 62 -188 -86 67 90 -61 -137
7751 -137 167 -123 -39 -30 25 -132 -54 -36 -139 -158 -10 -5 -101 6 -160 -80 -20 12 -178 107 -141 28 -113 92
7775 92 -120 -84 -73 -160 -65 160 -29 384 -202 -347 -133 113 101 6 -165 -60 105 -169 -134 144 142 -151 -157 86
7799 86 13 160 67 4 34 2 -54 -30 35 -126 94 99 -12 48 73 14 -96 79 -73 -113 -177 79 -111 92 -130
7824 -130 -12 -91 -225 48 160 109 -6 118 142 -32 -199 -140 180 0 88 -46 139 -55 -14 86 190 119
7846 119 -96 -62 -59 178 -68 -216 -47 209 -111 -90 51 -91 53 -57 -129 -162 51 40 -57 66 -20 88 -146
7869 -146 33 -112 78 -3 147 -89 -236 -21 196 19 -39 -24 74 231 -9 -47 152 130 28 -253 245 101
7891 101 -132 -79 -30 110 81 -178 153 -158 64 -99 -249 311 -5 -128 -186 -304 -73 22 89 -136 145 66
7913 66 -113 -48 -64 41 159 0 262 15 20 -20 -144 87 -4 139 12 -208 1 -60 -213 -4 68 -38 -100
7936 -100 107 88 -290 -120 -103 -283 27 -47 74 -152 143 -176 44 -171 8 -175 -230 22 -120 342 -217
7957 -217 29 48 81 -279 -40 373 109 -115 -76 -72 -109 110 -13 18 -94 140 -115 235 286 -204 -130 -130 -7 -2
7981 -2 24 52 -103 -38 38 -13 155 170 56 -4 -52 -51 -107 28 285 122 181 22 105 -82 -3 129 36 72 -156 -12
8007 -12 -166 262 54 -68 51 -193 -15 5 -19 -251 29 -81 166 98 -125 -202 -24 11 -63 -54 34 -32 237 104
8031 104 -144 265 -208 213 -10 -200 221 -159 -3 62 -97 -38 124 -3 -95 -101 -200 79 94 11 227 151 3
8054 3 20 58 -7 -37 -1 248 160 -249 -54 151 151 14 49 51 -35 136 76 200 99 -30 277 348 -5 -16 143 -42
8080 -42 53 -102 -13 -85 159 -110 96 213 -1 -103 102 138 31 5 46 130 -43 151 197 -117 162 -122 19
8103 19 108 33 169 19 -207 -27 -106 -55 -100 38 80 -57 68 -22 13 112 52 10 -8 -96 31 -142 -162 59 -132
8128 -132 0 164 150 3 -54 -13 -6 87 7 -131 96 -23 9 262 -219 334 75 161 -87 -62 43 -36 -60 45
8152 45 -8 -209 -74 198 -76 -108 -40 190 65 -52 -223 467 -119 -314 116 -82 57 50 -90 -360 46 351
8174 351 172 13 -71 23 16 -85 -155 12 134 -30 86 145 -48 17 -36 -62 171
8191A71
##END NTUPLES=NMR FID
##END=
