##TITLE=1H_PR192M_ost pu8
 CDcl3, 8 sc, 
 23.10.2020
##JCAMPDX= 6.0         $$ Bruker NMR JCAMP-DX V2.0
##DATA TYPE= NMR FID
##DATA CLASS= NTUPLES
##ORIGIN= UXNMR, Bruker Analytische Messtechnik GmbH
##OWNER= root
$$ XWIN-NMR		Version 3.5
$$ Fri Oct 23 13:35:26 2020 Russian Standard Time (UT+4h)  she@DPX200
##.OBSERVE FREQUENCY= 200.1315066352
##.OBSERVE NUCLEUS= ^1H
##.DELAY= (6, 6)
##.ACQUISITION MODE= SIMULTANEOUS
##.ACQUISITION SCHEME= undefined
##.AVERAGES= 8
##.DIGITISER RES= 18
##SPECTROMETER/DATA SYSTEM= spect
##.PULSE SEQUENCE= zg30
##.SOLVENT NAME= D2O
##.SHIFT REFERENCE= (INTERNAL, D2O, 0, 15.7039)
##AUDIT TRAIL= $$ (NUMBER, WHEN, WHO, WHERE, WHAT)
$$ ##TITLE= Audit trail, XWIN-NMR		Version 3.5
$$ ##JCAMPDX= 5.01
$$ ##ORIGIN= Bruker BioSpin GmbH
$$ ##OWNER= she
$$ F:/spectra/data/she/nmr/H-F/1/audita.txt
$$ ##AUDIT TRAIL=  $$ (NUMBER, WHEN, WHO, WHERE, WHAT)
(   1,<2020-10-23 13:33:58.12 +0400>,<she>,<DPX200>,
      <created by zg, POWCHK disabled, PULCHK disabled
       configuration hash MD5:
       00 E9 B6 7A A2 85 ED C7 34 08 36 98 17 FE 4E 26
       data hash MD5: 16K
       0E F1 DA C0 9C 99 2B 1E FB 1C D0 30 3D 1B 5F 7B>)
$$ ##END=
$$ 
$$ hash MD5
$$ 8D C3 FF 28 C8 21 79 48 5D 72 C6 71 9D 97 B6 5E
##$RELAX= 
##$RELAX= 
##$RELAX= 
##$RELAX= 
##$RELAX= 
##$RELAX= 
$$ Bruker specific parameters
$$ --------------------------
##$DU= <F:/spectra>
##$EXPNO= 1
##$NAME= <H-F>
##$PROCNO= 1
##$TYPE= <nmr>
##$USER= <she>
##$AMP= (0..31)
100 100 100 100 100 100 100 100 100 100 100 100 100 100 100 100 100 100 
100 100 100 100 100 100 100 100 100 100 100 100 100 100 
##$AQSEQ= 0
##$AQ_mod= 1
##$AUNM= <au_zg>
##$AUTOPOS= <>
##$BF1= 200.13
##$BF2= 200.13
##$BF3= 200.13
##$BF4= 200.13
##$BF5= 200.13
##$BF6= 200.13
##$BF7= 200.13
##$BF8= 200.13
##$BYTORDA= 1
##$CFDGTYP= 0
##$CFRGTYP= 5
##$CHEMSTR= <none>
##$CNST= (0..31)
1 1 145 1 1 1 1 1 1 1 1 1 1 1 1 1 1 1 1 1 1 1 1 1 1 1 1 1 1 1 1 1 
##$CPDPRG= <>
##$CPDPRG1= <>
##$CPDPRG2= <>
##$CPDPRG3= <>
##$CPDPRG4= <mlev>
##$CPDPRG5= <mlev>
##$CPDPRG6= <mlev>
##$CPDPRG7= <mlev>
##$CPDPRG8= <mlev>
##$CPDPRGB= <>
##$CPDPRGT= <>
##$D= (0..31)
0 1.2 0 0 0 0 0 0 0 0.06 0 0.03 0 0 0 0 0.0002 0 0 0 0 0 0 0 0 0 0 0 0 
0 0 0 
##$DATE= 1603445637
##$DBL= (0..7)
120 120 120 120 120 120 120 120 
##$DBP= (0..7)
150 150 150 150 150 150 150 150 
##$DBP07= 0
##$DBPNAM0= <>
##$DBPNAM1= <>
##$DBPNAM2= <>
##$DBPNAM3= <>
##$DBPNAM4= <>
##$DBPNAM5= <>
##$DBPNAM6= <>
##$DBPNAM7= <>
##$DBPOAL= (0..7)
0.5 0.5 0.5 0.5 0.5 0.5 0.5 0.5 
##$DBPOFFS= (0..7)
0 0 0 0 0 0 0 0 
##$DE= 6
##$DECBNUC= <off>
##$DECIM= 32
##$DECNUC= <off>
##$DECSTAT= 4
##$DIGMOD= 1
##$DIGTYP= 9
##$DL= (0..7)
0 120 120 120 120 120 120 120 
##$DP= (0..7)
150 150 150 150 150 150 150 150 
##$DP07= 0
##$DPNAME0= <>
##$DPNAME1= <>
##$DPNAME2= <>
##$DPNAME3= <>
##$DPNAME4= <>
##$DPNAME5= <>
##$DPNAME6= <>
##$DPNAME7= <>
##$DPOAL= (0..7)
0.5 0.5 0.5 0.5 0.5 0.5 0.5 0.5 
##$DPOFFS= (0..7)
0 0 0 0 0 0 0 0 
##$DQDMODE= 0
##$DR= 18
##$DS= 0
##$DSLIST= <SSSSSSSSSSSSSSS>
$$ [...]
##$SUBNAM2= <"">
##$SUBNAM3= <"">
##$SUBNAM4= <"">
##$SUBNAM5= <"">
##$SUBNAM6= <"">
##$SUBNAM7= <"">
##$SUBNAM8= <"">
##$SUBNAM9= <"">
##$SW= 16.880792210976
##$SWIBOX= (0..15)
0 0 2 0 0 0 0 0 0 0 0 0 0 0 0 0 
##$SW_h= 3378.37837837838
##$TD= 16384
##$TD0= 1
##$TE= 0
##$TE2= 300
##$TE3= 300
##$TEG= 300
##$TL= (0..7)
0 120 120 120 120 120 120 120 
##$TP= (0..7)
150 150 150 150 150 150 150 150 
##$TP07= 0
##$TPNAME0= <>
##$TPNAME1= <>
##$TPNAME2= <>
##$TPNAME3= <>
##$TPNAME4= <>
##$TPNAME5= <>
##$TPNAME6= <>
##$TPNAME7= <>
##$TPOAL= (0..7)
0.5 0.5 0.5 0.5 0.5 0.5 0.5 0.5 
##$TPOFFS= (0..7)
0 0 0 0 0 0 0 0 
##$TUNHIN= 0
##$TUNHOUT= 0
##$TUNXOUT= 0
##$USERA1= <user>
##$USERA2= <user>
##$USERA3= <user>
##$USERA4= <user>
##$USERA5= <user>
##$V9= 5
##$VALIST= <valist>
##$VCLIST= <CCCCCCCCCCCCCCC>
##$VD= 0
##$VDLIST= <DDDDDDDDDDDDDDD>
##$VPLIST= <PPPPPPPPPPPPPPP>
##$VTLIST= <TTTTTTTTTTTTTTT>
##$WBST= 1024
##$WBSW= 4
##$XGAIN= (0..3)
0 0 0 0 
##$XL= 0
##$YL= 0
##$YMAX_a= 367878
##$YMIN_a= -366442
##$ZGOPTNS= <>
##$ZL1= 120
##$ZL2= 120
##$ZL3= 120
##$ZL4= 120
##$ABSF1= 10
##$ABSF2= 0
##$ABSG= 5
##$ABSL= 3
##$ALPHA= 0
##$AQORDER= 0
##$ASSFAC= 0
##$ASSFACI= 0
##$ASSFACX= 0
##$ASSWID= 0
##$AUNMP= <proc_1d>
##$AZFE= 0.1
##$AZFW= 0.1
##$BCFW= 1
##$BC_mod= 2
##$BYTORDP= 1
##$COROFFS= 0
##$CY= 11.3945322036743
##$DATMOD= 1
##$DC= 2
##$DFILT= <>
##$DTYPP= 0
##$F1P= 16.9975609425685
##$F2P= -3.02152046262296
##$FCOR= 0.5
##$FTSIZE= 0
##$FT_mod= 4
##$GAMMA= 1
##$GB= 0.15
##$INTBC= 1
##$INTSCL= 1
##$ISEN= 128
##$LB= 0.24
##$LEV0= 0
##$LPBIN= 0
##$MAXI= 10000
##$MC2= 0
##$MEAN= 0
##$ME_mod= 0
##$MI= 1.114404
##$NCOEF= 0
##$NC_proc= 0
##$NLEV= 6
##$NOISF1= 3.799351
##$NOISF2= 2.8
##$NSP= 1
##$NTH_PI= 0
##$NZP= 0
##$OFFSET= 15.70392
##$PC= 1
##$PHC0= -10702.42
##$PHC1= 23.40088
##$PH_mod= 1
##$PKNL= yes
##$PPARMOD= 0
##$PSCAL= 0
##$PSIGN= 0
##$REVERSE= no
##$SF= 200.130013532006
##$SI= 16384
##$SIGF1= 3
##$SIGF2= 2
##$SINO= 400
##$SIOLD= 16384
##$SREGLST= <1H.CDCl3>
##$SSB= 0
##$STSI= 0
##$STSR= 0
##$SW_p= 3612.71676300578
##$SYMM= 0
##$S_DEV= 0
##$TDeff= 0
##$TDoff= 0
##$TI= <>
##$TILT= no
##$TM1= 0
##$TM2= 0
##$TOPLEV= 0
##$USERP1= <user>
##$USERP2= <user>
##$USERP3= <user>
##$USERP4= <user>
##$USERP5= <user>
##$WDW= 1
##$XDIM= 8192
##$YMAX_p= 0
##$YMIN_p= 0
$$ End of Bruker specific parameters
$$ ---------------------------------
##NTUPLES= NMR FID
##VAR_NAME=  TIME,          FID/REAL,        FID/IMAG
##SYMBOL=    X,             R,               I
##VAR_TYPE=  INDEPENDENT,   DEPENDENT,       DEPENDENT
##VAR_FORM=  AFFN,          ASDF,            ASDF
##VAR_DIM=   8192,          8192,            8192
##UNITS=     SECONDS,       ARBITRARY UNITS, ARBITRARY UNITS
##FACTOR=    0.000296,      1,               1
##FIRST=     0,             0,               0
##LAST=      2.424536,      0,               0
##MIN=       0,             -366442,         0
##MAX=       2.424536,      367878,          0
$$ Real data points
##PAGE= N=1
##DATA TABLE= (X++(R..R)), XYDATA
$$ [...]
1710F91q22m31J78P51K79J08q50l09q1O57L88m05n58l65O34N35M19l79l44n50
1730d54J55N46O70l58q33j78K5N48O78l98n95l76J29M59O02k22m31m62R7L83M43
1751D28o5m94m44K74M69L09N8m90l58j44N71M73j41l96o54P6N58N07l20m04l37
1772e24K53M70N52m35j88o56P3N11N30l91j62n58L7O82R3P7m08m88L3L24M46J98
1794D69o52l08m4L35N83J4j78p45mP49K33o5m53m05j44R24P9O4o31k77K29J51
1816g6N88kn75m79K26K05O21p8q6p62N5O15j11K67l40k37n29N67M50O5l80m94
1838d90J57mQ66r6m15k77j82L35L91K69l20r91M74K56L58J65j73n34j37L61L50
1859C63J90m58k43n05M34J78K92j84j56j25L55Q5J83l9p36R3J38K57J59k12n32
$$ y = [691, -131, -562, -384, 367, 646, 754, -96, -405, -486, 171, 559, 154, -404, -769, -135, 400, 819, 440, 96, -454, -299, 247, 917, 559, -274, -452, -427, 121, 799, 401, -194, -570, -441, 18, 620, 398, -33, -495, -398, -15, 428, 363, -131, -575, -301, 168, 477, 535, 45, -313, -457, 114, 587, 446, 50, -604, -528, 30, 537, 217, -187, -524, -271, 199, 751, 316, 128, -528, -455, 56, 586, 195, 33, -525, -488, 194, 287, 364, -44, -532, -499, -175, 271, 469, -183, -491, -535, -200, 383, 397, 219, -526, -530, 219, 452, 387, -66, -471, -615, 309, 388, 452, -179, -456, -227, -76, 512, 510, -65, -544, -318, -113, 508, 430, 344, -418, -363, 252, 141, 408, 68, -169, -698, -131, 319, 384, 4, -490, -333, -337, 529, 433, 18, -259, -441, -106, 285, 554, 234, -757, -283, -27, 331, 496, 323, -211, -348, 13, 363, 553, 95, -148, -653, -219, -41, 251, 67, -89, -214, 141, 226, 409, 370, -366, -273, -135, 122, 281, 69, -463]
1880d63J74K55L26L6k02m42l29O27J40K26k62l91K12j51L32N43l28n51k99L01
1900b46M70k09K07m76j22L69K20L08l95m34J06K54P3J76j59k77j00J50K25K81
1920D21j46m86RK25j8J53k15l08K2L68R9k1O8l72q4J86L46K12k76k29m25J62M40
1943A31J60j18j75j72r4K97L93k87Qj55l66O79p1k30J30n38L51p9K04K01n32l0
1965b93K29J48Q3r4j93j84L40J41K67k54k38j23L2J31L36k11k30k39K57M47o7
1986B85j18k61o6q2K32L28k29l54J32j7J09L77q4l68j25J03J97l9N6k47j6J81
2008fK14l4j81M5l16K10O2L10k50k23r1M6L47J6K74o7n92jL17J2j5j04l85R9L73
2033F0rJ62j02l85J32k39L89K59j33m2j71m7K87l07J16j18R2J87K33k36j93j18
$$ y = [-463, -289, -34, 292, 328, 126, -316, -645, -18, 122, 348, 86, -305, -93, -244, 88, 631, 303, -248, -547, -246, 224, 15, 222, -254, -376, -7, 213, 521, 126, -308, -202, 52, 125, 301, 142, -135, -235, -85, 140, 421, 275, -211, -202, 23, 5, 158, -57, -365, -343, 25, 124, 103, 171, -201, -285, -99, 247, 459, 183, -46, -471, -309, 131, 291, 173, -2, -174, -268, 29, 422, 135, 143, -12, -378, 301, 230, 0, 130, -408, -57, -136, 68, 269, -263, -293, -64, 84, 167, 73, -120, -304, 36, 177, 444, 190, -48, -171, -139, -8, 328, 117, -113, -352, -95, 352, 285, 167, -94, -160, -242, -10, 318, 89, -265, -133, -150, -41, 336, 252, -116, -241, -138, 59, 20, 76, -171, -187, -6, 208, 174, -7, 38, -278, -68, -6, 304, 54, -169, -260, -214, 133, 149, 423, 356, -236, -237, 80, 92, 77, -27, -412, -313, 60, 51, 213, 111, -274, -142, -381, 8, 267, 134, 92, -79, -126, 161, -146, -30, -148, -56, 131, 364, 128, -65, -183]
2055a83J48m0K6K22P8j58l31R7K44K15l73P9k45J22M30k9k48J01j85o3J94K29
2077C30k60j64q6K69j42L70l94J92j98Q8P6PnJ48l15k07N25j62J78l1l08j05L90
2100A96j08k99Q5L5J14q2Q3K3J29l16R7J84j94K10k96j70K35k2N0J48J56j70r1
2123co3M19k66j17j20K18L7k72K85P8l09J30J14k1j47O2j09J9MN04m00r1k57K45
2147f0K2J25J32l06n5o1L24J62P8m91J40m8J61J55l85o4K7K3Q0K01k6j2j65j08
2171a51%L95l52J12Q0j98J50l8J0o9P7J4j21M3L78l63l01K86p9J09K06k33j76
2194b21N5J4j9N49l78Ml3J95r5k23J44L08k07M0k22L64m08pK12K6K1j84P9K5L
2219D2j62J89N4j66N0j36q5J81K66k71j43R1k82K68J72j16O4j69J48J78k33K01
$$ y = [-183, -35, -75, -49, 173, 251, 93, -238, -141, 103, 318, -55, 24, -221, -99, 331, 302, 54, 155, -30, -93, 101, 330, 70, -94, -180, 89, -53, 317, -77, 115, -83, 5, 81, 88, 83, 231, -84, -291, 234, 72, 250, 219, -89, -194, 196, 88, -211, -126, -91, 23, -59, 24, 47, 176, -140, -43, 141, -53, 157, -139, -309, -74, -96, -46, 102, 258, 88, -3, -66, 353, 87, -30, -150, 68, 105, -167, 118, 196, -113, 17, 131, 110, -37, 25, -84, -65, -61, 443, 43, -48, -305, -60, -38, 87, 219, -87, -142, -203, 121, 283, 361, -130, 10, -38, 123, 278, -107, -171, -144, -121, -41, 160, 134, 122, -43, -151, -151, 244, -108, 4, 84, -114, 36, -2, 8, -61, 16, 30, -91, -48, 330, -33, -334, -48, -127, -18, 188, -45, -221, -166, -152, -171, 378, 0, 4, -29, 166, 71, -152, -8, 300, 93, 133, -89, 275, -133, -140, 72, 98, 119, -65, 14, 39, 42, -120, 69, 123, -43, 7, -129, -214, -33, 233, -38, -181, -90, -372, -104, 68, -48, 16, -153, -5, 173, -60, 141]
2241A41l92J84Q8m3M2J9k98J73J33p2o5j73N34m19L11Kl17J0J74j10O1k4J93M0
2265A92m10J41n4J59NNLj59j28J57K52j67j03M0n1K00o5K59m69K00J1O8o0lJ0
2290C3j52K25k54L0J74J10l15M6K08j80K39K1j67m05J71J87R4k49J92j0J20P6
2312A94l14PK61j93K8J0J58l3j50O3j78J95J8O3j48q9j47K76R5r2L2k44J73N6
2336D1l1R4l58K76lJ32k13j00J87J41k25L23m87k4J90j74J53J10J94j08l07N0
2358a39J71j09j01M44l56J9p6J56J24j6j0L1J48k67J1M0l31K53R1M9j13Q7k88
2381a82k4R2R6k29K99o8p7J38k2Lj42J06J1j54J32K70j44R6l53J36M8LJ29k52
2405h8J11l3l1K06j18q9O3R1K2j65j9M9K35j30J83l99J0J27j54J11M1L7q3j79
$$ y = [141, -251, -67, 21, -22, 20, 39, -259, -86, 47, -25, -90, -263, 271, -148, 163, 165, -152, -142, 32, -78, -17, -41, 152, 192, -218, -77, -131, 28, 33, 38, 41, -118, -246, -89, 163, -4, -107, -67, -118, 82, 17, 276, -193, 7, 18, 86, 26, 23, 33, -119, 106, -148, -118, 56, 166, -149, -103, 105, -75, 164, 185, 18, -387, -216, -29, 65, -184, 8, -2, 118, 194, -120, -113, 148, -45, -17, -7, 151, 118, -32, 31, -147, 48, 66, 129, -19, -108, -255, 21, 116, 24, 56, -188, -15, 41, 10, 104, -254, 22, 19, 151, -62, -162, 25, 166, -59, 264, -223, -247, -57, -231, -78, 32, 226, 118, -189, -139, 32, -77, -178, 266, -90, -71, -147, 9, 133, 117, 107, 138, 286, 19, 30, 70, -261, -8, 83, 132, 19, 106, -182, -206, -114, -18, -247, 52, -16, -93, 45, 23, 26, -116, -10, 1, -153, -21, 249, 105, 201, -152, -16, 32, 35, 164, -88, 23, -10, -41, 165, 47, -42, 21, 112, 134, -31, -50, -1, 234, 104, 287, -112, -102, 25, -129, -18, 23, 60, -23, -202]
2429b02R7O4LJ42K4k5k47J96N9j7Rj17j1j56N33l55J92k33n3j56M17n9r3p3j26
2454a87J10m3N14m59Q5j47J65j04KJ47k59J85Q6j58J68k12Q3j7J92k43J26L4j15
2477d7l4M3J16J70j70p4J19k30lK48K34k39P6l90J90K2M6K7k06M0P4J43k80J46
2501B1j15k4L10k27K80m15Q9N0q7P5j04J46P2j14M0J93k25J49k02J06k75L44j03
2524a6L01n30Q6K88P6o7k64J30m4Q3k40j03M06q2Nn4j2l9j18K71O1p2l2m3p7J09
2550B3m16M94J34k10j27p2N6j32L75k16K80k47J35m48L72J5M6J76k97P7J0m4J63
2573A47k45N4j33M3o8L37j43j40L34k62m8M7J97j01j93L96l30K83k69K50M7k47
2595d4l5J22k6j46J54l9K3J14N6Mk93K08j18L32m21j59L03q5R1P1j68n1K73o7
$$ y = [-202, -105, -41, -38, 104, 128, 103, -144, 52, 111, 94, 103, -14, -25, -181, 352, -3, 189, -44, -97, -253, 164, 105, 12, -61, -187, -77, -120, 394, -65, 20, -127, 38, -66, -64, 83, -176, 9, 95, -63, 105, -107, -24, -41, 151, -92, 34, 68, -47, -81, -38, 78, 248, 78, 4, 123, -107, -110, 138, 372, 133, 209, -181, 9, 31, 77, 104, -102, -62, 12, 155, -125, 21, -94, -118, 192, -35, 245, -170, -81, -31, -118, -43, -147, -1, 71, -43, -3, 190, -35, 114, -88, 18, -257, 87, -16, 285, -245, -159, 129, 205, 138, -126, 4, -40, 43, -197, -300, 106, 24, 29, -25, -37, -76, -194, 77, 138, 66, 34, -9, -86, 23, -393, 101, 235, 25, -102, -174, -118, -250, 125, -91, 189, -58, 77, -371, 1, 16, 62, 238, -59, 18, 28, -16, 147, -98, -44, -177, -134, -202, 135, -8, -148, 186, -76, -124, -77, 120, 19, -174, 222, -108, 175, -94, 156, 203, -44, -79, 43, 17, -129, 25, -14, 9, 123, 179, 183, -110, 98, -20, 312, -109, -268, 35, -50, 41, 112, -56, -107, 166, 99]
2619I9K13m94J69N7j13K42j59j72J34KJ07p0J39p4o3m6J42j61J91j76Q7ok83K92
2643E7J16j13J33K48m43P6K8J51m37J86K6j1k9q5J92j65J28j5K4k88K33k6P7j54
2667i1J40R3m77L74Qj34J57j33L70k92j8K4L7P3j68r4K42m1j74Q8j40K82k67K7
2691a14P2J79j91NK75l41L16j06m8p4J03j67R5N5j56K72l24K70p7L1k40k9J41
2714e3j5M05j81j85l5J88k2J11m47K64j49L68j38MM7r4J40j65p8r0j73M18J18
2737B38j84j60K63k91R4P9l80J81M21j29p1M4j87J53J75j00p3n8R8k61p9j1Q0
2760a58K15km3lK20k35n4nnj8J02J44j36k4N5r2J17l30M00n3j21k2O0m0j11l9
2786a78N2J24l0L3J34j79M8p8k0J07k03K71J31j58j25k36L29k19M20m24K48n1
$$ y = [99, 312, -182, -13, 44, -69, 173, 14, -158, -24, -22, 85, 15, 154, 80, 17, -29, 113, -48, 143, -33, 54, 48, -235, 57, 173, 60, 193, 441, -2, 74, 102, 253, -184, 2, 28, 17, -12, -97, 95, -70, 58, 43, 67, -221, 12, -14, 63, -91, 49, 142, -335, 39, 47, -87, 70, -63, 307, 15, -3, 21, 58, 131, -37, -131, 111, 70, -104, -16, -156, 126, -141, -114, -42, 137, -54, -49, 226, -115, 201, 95, 47, -27, 76, -91, 4, 59, -97, 175, -149, 121, 44, 75, -165, -194, -53, -68, 337, 156, -29, -64, 124, 102, 213, -234, 30, -119, 249, 111, 115, 162, 68, 208, 43, -35, -125, -298, 120, 238, 54, -106, 157, -134, -40, 39, -341, -160, 261, 132, 61, 105, -82, 71, 246, 146, 73, 15, 113, -148, -227, -238, -158, 57, 55, 12, 9, 229, -6, -60, -65, -70, -88, 14, 158, 22, -2, 53, -39, 78, -252, 148, 95, -26, -48, 12, -28, -139, -178, -126, -2, -32, 1, 135, -44, 4, -74, -94, 13, -190, 81, 212, 54, -71, -307, 22, -197, 223, -201, 47, -4]
2808dp4n0L01l54K06J14k34O1m9K34l78K76Rl6j82J65J45o7l36J25K71k93n6M83
2832B77k84Q0M3R4j66lJ79n20K48P4K07k91k54M04k33K61M1j35M9j68J32q0K45
2855B00j27k13K06j04k5o7L32k30j93J31L44l35k61J76J91N2l7R5N2O2k47J10
2877A12j16J35j3p9p2M8R9Qk69L3o0J82O3R0R9n09J88k04L11R3J25k58r2P0j12
2902a28N3L8Oj08L31j38J13k68J33k37Q9K62L3m39Q8K23p0J76k84M79l83Q6q4
2925b9n5J53k7K4P9k03J18M2k4P9k61K66j72j8J78j65J15j11P6j14J63ko5k12
2949a65M83k35o3j25j03K03m0Q8J6l43L3J57L8k4P6J15m44L07L82k27k44Q6k2
2972e1o0J71J75j76j42O8M6J51n24L76O1r7k64L80Q1o4j60Q9j20K76l86K15pq2
$$ y = [-4, -78, -128, 173, -181, 25, 139, -95, -34, -83, 151, -227, 49, 58, 22, -160, 5, 150, 83, -253, -128, 143, -150, -206, 277, -7, 73, 116, 210, 44, 41, 220, -300, -52, 22, 229, -62, -316, 88, -145, 116, 157, 22, 71, -97, 35, -45, 200, 73, -140, 66, -38, -63, -130, 202, -28, -221, -90, 254, -81, -342, -166, 25, 77, 40, 135, 187, 249, 2, 112, -4, 131, 118, 39, -33, 15, 114, 122, -147, -114, -174, 8, 71, 161, 260, -249, -61, -265, 46, 139, 264, 6, -86, -16, -128, -75, -37, -31, -139, 192, 54, 167, -101, 32, -205, -116, 146, 179, -260, -172, 51, -19, 157, -127, 352, -31, 55, -29, -84, 69, 42, 66, 145, -58, 60, 102, 78, 157, -104, 162, -10, -28, 150, -15, 100, -11, 65, -49, 114, 112, 47, -165, 318, 83, 20, -105, -208, -5, -45, 43, 59, -284, -251, -94, -56, -80, -4, 111, -333, -26, 356, 129, -115, -29, -51, -111, 60, 235, 59, -83, -15, 31, 182, -342, 34, 95, -2, -266, 114, 195, 131, -29, 60, -60, 216, -170, 45, 38, -44]
2996d4r3j0R0J42jr5jJ45m73M19j16R6kj0J7k38rP0Q7r0J78J18j00P1L6l12K37
3023A12j97k4K22j92N5J29j15J63k39J20k1L7m7O9k54OK81j01r0K70j15l65K99
3046CP7J01j03j19r2J41j25K75j47O9j02l3q8K56jk87K82j52K6m2kj03K05K19
3070B58k45m4J92k05L8J79k77K49q4k81K94j44J74K23j12j55r1p5N7K10j68J89
3092A82P0l18R9j05J51j0q7j65K40j17K34j38m8N0q9J04o2J2mk7j78K52l24R8
3116a80J84j05O6J44m03K18J67O6m4j5Or1m4k41M40j20O5k52N4J56k29K65J76
3139B83j90m40K15k1J25l8J77l89J68L7J0J38l06K17L3r5J06p1lJ19m5R4j25j58
3163a59M23l79j29M09n2j73j43M01l71K6M9J23o6L8J8q5J97j57Q2q4J7p1K71k58
$$ y = [-44, -137, -147, -57, 85, 84, -11, -12, 133, -340, 79, -37, 59, 57, 47, 64, -174, -183, -113, -26, -116, 62, 180, 80, 151, 187, -125, 112, -85, -109, 113, -79, -24, 105, -10, 153, -86, 34, 13, 50, 3, 72, -182, -176, 105, 4, -86, 184, 69, -296, 3, 80, 181, 78, -41, -133, 8, -117, 158, 11, 80, -22, -55, -143, 113, 112, -175, 107, -45, -19, -61, -63, -166, 39, 258, 13, -31, 161, -44, -6, 173, -104, 145, 61, -220, 74, -70, 104, 327, 215, 60, -31, -106, -49, 161, -7, 182, 252, -66, 33, -72, 79, 69, -18, -183, 57, -60, 174, 36, -12, 38, -51, 53, -9, 3, -1, -28, -206, 46, -278, -180, 4, -101, -35, 109, -294, -76, 91, 157, 113, 98, 104, 13, -31, -272, 168, 48, 113, -139, -85, 71, -158, 107, 283, 93, -347, -132, -153, -28, -66, 111, -278, -110, -73, -63, 75, -231, -14, 19, -76, 30, -41, -44, 75, 30, 124, -1, -159, 264, -115, -244, 165, 113, -60, -203, 198, -173, -147, -98, 25, -41, -3, 15, -70, 127, -30, 52, -32, -15, -86, 185, -73]
3187g3j89L01K5j61L37J72k49k76J91l0j11J3J33j45J05q4K00j16k7k5J5j78K13
3210D1k48J36J28J36M0l10J55j63J50j93L67k10k12O5P1J04J49j78K22k80l2j55
3232b17K06P9j21J02j41K12J47j31k09J32j60L0N0M1L25n59oK71k17R6j09L09
3254A30n5l0k7k27K12k11J35K22k18L58j68l48K24NR7j26K0k01J61J10N8k05r5
3277a79J75J04k26K34K8r2r0K36j76j14O2K90k03r6P8R9j9j68O1j13R3l60L31
3300d5J52k05J0j54J54Q1J95o6J13j69o9j40j09J14J96k0j74K09k81L21R3j90
3322A6oOn1M0j05J16n5J7k8l4J00M8j16j99L25l28L72j50j39K08M8Mj98K40k7
3347A04M4l7j31L9j11oJ21r5J21k15K92M2k25J88k88r7J93P8k6K89l84lQ4R7j60
$$ y = [-73, -262, 39, 64, -97, 240, 412, 163, -113, 78, 48, -63, -50, 83, -62, 43, -41, 159, 43, 16, -9, 6, -172, 41, -207, -71, 57, 193, 233, -77, 78, -85, 65, -128, 239, 29, -183, -118, -47, 57, 206, 28, 250, -30, -62, -217, -11, 68, -53, 49, -92, 120, 267, 136, -73, 59, -101, -71, -21, 20, 345, -214, -220, 51, -166, -70, -179, 130, 75, 45, 18, -209, 3, -208, -73, 149, -69, 289, 121, -227, -3, 2, 99, -27, -7, -208, -47, 63, 121, -84, -179, -4, 100, -126, 108, 136, 44, -46, 190, 14, -100, -38, 252, 49, -47, 31, 130, 111, -57, 4, -109, -16, -376, -45, 107, -98, -88, -242, -88, -7, 188, 122, 235, 66, -3, -143, -252, -138, 58, 38, -136, 73, -208, 113, 206, 16, 10, 16, -35, 5, -100, 16, -39, -22, -50, -84, 16, 64, -52, -251, 74, -254, 118, -32, -171, 37, 85, 89, -109, 131, 104, 148, 111, -20, 19, -92, -98, 23, -72, 49, -166, 126, 168, -57, 131, -157, -254, -61, 17, -9, 280, -104, -107, -23, 74, -86]
3372h6l6L17k63n4J60j2q3o6J58O4m9k00J45J45N5l41J16J56M1P4l29m6RK23J06
3397B04k86O8j51O8k0L2L9N4Q9j14K6Q7j45J04kj19K39l47j25L02J67k5j4k66
3421a35K06K53k13o4k14J32r1K14o2K87n71L24j61Q5ml2J11M6q0J95k97J35p9
3444a5J91m2l1p9K01k62m4K03LR8l58L10l16Q8M7P2j32K56j03k01N5K14r2l73
3468c10K95J67k71p4J47l3j48J93J51l3L6L0l9n8MJ2n9j14J39J20l64K21k0j66
3492a74P9J03o2J13J66j00o6l03L74k28P0p1P1P8K1j39n0j2J42K7jJ08k21q2Q3
3517g4r2J46k51L19k52o2J40K81j98L1K53k93j99J62K63l60J40nj51m1R2J70j5
3540Dj03j6J78n0j17j22K29J38l15J64j1k7j34j92L95k0J65k22K15M6j60J12k44
$$ y = [-86, -122, 195, -68, -122, 38, 26, -57, -123, 35, 99, 50, -150, -5, 140, 195, -146, -30, 126, 167, 241, -88, -134, -125, 98, 204, -82, -14, -165, -97, -117, -85, -46, 8, 97, -17, 9, 96, -49, 55, 53, -66, 173, -174, -299, 3, 170, 145, 131, -135, 71, 324, 111, 47, -167, -35, -126, 88, 26, 313, -258, 66, -95, -10, -14, -46, 65, 111, 31, 226, -71, 64, -15, 176, 134, 103, 24, 225, -37, -81, 122, 125, 223, -135, 175, -141, -53, -6, 66, -66, 190, 87, -114, -59, 155, 63, -310, -15, 152, -119, -193, -46, -79, -227, -34, 117, 84, 120, 150, 111, 53, 57, 69, 10, -104, 35, 155, -209, 12, -8, -174, -95, 8, -54, 59, 225, 125, 59, -244, 130, -98, -28, -99, -28, 50, 71, -68, -118, -130, 12, 39, 38, 146, -75, -157, -74, -166, -20, -271, 48, -204, -266, -126, 155, -43, -12, 241, -52, -251, -89, 174, -186, -46, -51, -202, -243, -151, 19, 4, -99, -115, 63, 13, -104, -226, 3, 141, -174, -10, -21, -48, -182, -374, 21, 1, 166, -56, 159, 205, 45, 157, -87]
3563h7n0L3K22j48j5M3J02k50L35m28O9K83j74n0K00k69J27m5k56K14J18r4O0
3586f0L7J25j72n2k8J44j52K02j25J37k41L23K18m54L0P6n7Q0q9K7L7o5K2J85
3610A48j64j00P5Qj18j4L66l35j29K19J15k45K48L58m96J66j46k92L32M4L7n1
3632B6j19J36j73J06j4O7j39j4J75L1k32K69J11r7j70K57k68M5Q7j52J65m4j01
3655d8n9j39J23K59j81P2r4q0K45j44NM9j01p5J0K41Q6k82M1L31m01q7P4J30o9
3680i4K00m4j43J16m0r7mL37j21J95l40J18j64R8o8J35k14pJ90l58L26j8J8l1
3704a0rk7J55k64L77k13j36J54j22Q8j89J32K29l25J30j80L57k25j8K19j27J22
3726A18q1j66J19k1O7p0j9n1O6K18r7J75l11J27l1L3J22k63j1J92j04k21K52j21
$$ y = [-87, -137, -104, 118, -30, -45, -2, 100, -150, 185, -243, -174, 109, -65, -115, 85, -184, -57, -102, -358, -144, -26, -120, -60, -23, 102, -70, -122, -150, -6, -158, 44, -81, 56, -185, 138, 356, -98, -68, 8, -49, 31, -58, -31, 6, -59, -37, 148, -16, -116, -41, -33, -151, -165, 201, -134, -263, -44, 71, -174, 74, 432, -64, 102, -44, -336, -4, 40, 77, 26, -93, 43, -130, -24, -38, 29, -110, -124, 51, 82, -150, 119, 230, 133, -37, 220, -48, -3, 84, -68, 97, 53, -48, -107, -246, -123, 136, -45, 27, -67, -147, 98, -46, -41, 8, -93, -168, -158, 83, 169, -113, -72, 259, -142, -229, -155, -25, -94, 106, 62, -81, 35, -5, -102, -106, 231, 110, 305, -35, 83, -81, 17, -51, 84, -130, -137, 53, -305, 21, 3, 21, -10, -19, -46, 109, -155, 222, 9, -127, 27, -95, -7, -196, -64, 165, -160, -30, -210, 147, -78, -96, 123, -4, 118, 37, -129, -10, -31, 36, -34, -53, -104, -38, 180, 83, 258, -53, 74, 43, 76, 198, -65, -76, 116, 12, -209, 43, -78]
3750g8j24K93j79Q5o5KJ84P9qk06j17L13j64p8JQ1j78K74j97K37o1p6J34j09k13
3775a70R5J11l07L10q5q2N0Nk83M24k42K27R5n0k19RJ44QN2j8j11O4j9K77l26
3800d1J09R8j76K09j36K1k52j8K55K8k98O7J23p8J06J5O5Nk27K64l67L60Qk84
3824a44P7O8L79l57n2P9m5O3L6J14j04rp9j04j18L17p1p7j47K50r8j9m1J71j63
3849g4K23k46M6k95L74j52L25r8Q4k14MJ14p0k10K2L18k35n0O8K2o9J06L8n9M5
3874A7j25K16j74Q6m7P9K3J1r9Q0j31j8J20k02K28j50r7J08J18k02n4J70P3j52
3898a22P3k0R2k6J3k45L27q3rj75j2M71l23J46j62J75l67J55L4Q3j92o8M65l52
3922a22P9M2j30M13m57L0P5m6J23O3kK0k41K01l9k43K10k1J48j99K47j45O4j44
$$ y = [-78, -202, 91, -88, -3, -68, -66, 118, 197, 189, -17, -134, 179, 15, -63, -62, 19, -159, 115, -82, 155, 94, 18, 152, 43, -170, -75, 36, -271, 39, -46, -128, -78, -73, -356, 68, -174, 53, 148, 98, -121, -112, 32, 40, 92, 74, -37, 27, 8, 285, -41, 68, 166, -10, 199, 63, 84, -168, -186, 69, 97, -201, -134, -11, -89, 17, 32, 97, 102, -125, 139, -228, 132, 140, -144, -67, 1, 380, 23, -29, 50, 5, 68, 104, 218, 114, 105, 26, -78, -196, 121, 50, -27, -174, 76, -22, -41, -82, 89, -74, 149, -97, -51, -346, 28, -124, 201, 103, 187, -27, -23, 91, 21, -189, -167, 151, -84, -134, -66, -44, -113, -7, 31, -28, 17, -108, 108, -66, 20, -27, 52, 75, 86, -13, 67, -64, -82, 38, -164, 64, -86, -183, -75, 43, -159, -213, -43, 30, -122, -49, -69, 23, -3, 10, -235, 92, 9, 0, -175, -187, 284, -39, 107, -55, 120, -247, -92, -58, 25, -167, -235, 230, -122, -43, -1, -131, 282, -175, -145, -70, -116, 7, 70, 68, 88, -153, 48, 9, -234, -24, -45, 103, -96, 151, 6, 70, -74]
3946g4J66pNk85o5K17K95l12pl7Q7OK58j91L6O3j97k58J85K3J95j62J39j83j66
3971b69M87n33L44n2L8q6P0Lk66K63n9q5J69j10j81K43j34M81l25K73l27JK23
3994A68j29j37J93j38l32M20j26j07K70o8R5j3m5J33k80j63J97l8L1J05q0o6K05
4017I5Rk18M2K5r1J72J85k00r5M91n62J49J01R0k18N8j7K72k58j05o4K02K8k79
4041a88K48R3j37j29Q1Q2J56k16K53k44n0K77l33P9J7p9J21m7j53l1Q4K5O4K20
4065A93k89R6J5K3N3r6oK36j71j12j76M22k36K19M1r0l5N6r4j81K08l3l8N7k01
4090a39nL39r0k66J46m0J46l3k33j26M54l9o7Q4l32L27n2r0N8l2k62K72M9j93
4114a24Q8O9j23K10j30n5O4J76n1j23J95j18J9j41j73J89j50N2J36J10j57o2K90
$$ y = [-74, 92, 85, 90, -195, -260, -43, 252, -60, -67, -104, -17, -11, 247, 56, 92, 155, -42, -300, -115, -92, 103, -59, 80, -103, -269, 218, -315, 29, -23, 15, -71, -1, 2, -264, -1, -60, -145, 24, -86, -267, -24, -158, 323, -2, 271, -56, -55, 168, 39, -98, 95, -43, -375, 45, -81, -188, 82, 14, 109, 96, 51, 184, -96, -259, -62, -100, -69, 36, -44, -110, 95, 104, -114, -72, -47, -138, 34, 219, 19, -76, 415, -147, 2, 103, 193, -25, 33, 16, 288, 30, -75, -139, 63, 91, -188, 60, 153, 16, -113, -32, 50, 206, -10, 243, -1, -51, 226, -107, -28, -11, -90, 31, -16, -169, -200, -116, -91, -27, 193, -96, 0, 15, 38, 91, -5, -11, 225, 54, -58, -234, 188, -48, 171, 212, 122, 87, 143, 49, -132, 76, 43, 5, 62, -139, -144, 195, 105, -161, -15, -55, 91, 58, -175, -301, 153, 114, 47, 131, -201, 126, 74, -16, 42, 10, -252, 20, 69, -124, -36, 33, -90, 120, -10, -65, -1, 175, 124, 1, 196, 78, 97, -44, -217, -28, -178, -126, 10, 120, -37, -99, 191]
4137A91m52K47J82r7j73j1L3j14K33j79L01k54mO0J16l13L83k21R6K30k75l5l
4160e9l1J60R7q1j46K4J0j35P5N3pJ6j98J77q2M11k08O6m9l0j88J41qj8Q1j28
4186e7k2J00j86J20K01k8J26ql69P7j12K02r2n4J0J05J98l90r1L68j05k43M7K95
4210I2o9J67k00L1J84l95K52k22j7K60R9k52J25j32P0j6J46Ppq4q9K6L01j75O5
4235A67J60m56J56Oq8P2J32m39M64K06m56k8J41r4n7J24k93K11J27N9n6j2q3l4
4259g1O7J55j60l30L59p1M5j15L61r3j21N1j23L44L4q5j86k6Mj61K96k36j7N7
4283b2j5N8p6j14K22k7J09Pm3j69J37P9P7l48K08q2p0K4m7P8J74J72l78J93k82
4308a35K68j61j79J67J5k92L41k7J22j6L8k9k82J77O7m6j80J99j75P2j16L10k93
$$ y = [191, -261, -14, 168, 71, -102, -113, -80, -194, 39, -140, 161, -93, -97, -37, 79, -234, 149, -72, 24, 254, -21, -56, -59, -90, 70, 167, 86, -60, -36, -26, -161, -86, -33, -40, -24, -222, -45, -127, 284, 76, 142, 93, 63, -125, 16, 8, -10, 71, -57, -79, 21, -165, -45, 156, 128, 254, 246, -123, -46, -158, 44, -48, -102, -92, 13, 211, -179, -270, 98, -7, -250, -203, 92, 23, 190, -10, 21, 205, -190, 62, -160, -177, 83, 182, -70, 55, -77, -7, -23, 123, 130, 123, 39, -50, -24, 277, 102, 167, 327, -129, 27, 33, -55, 17, 149, -290, 174, 380, -76, -104, 37, -57, -114, 10, -283, -72, 55, 114, 58, 46, -37, -71, -4, 151, -9, -339, 20, -51, -6, -121, 240, 147, 26, 77, -46, 298, 332, 247, 61, 35, 39, -122, 174, -62, -79, -22, -37, 21, -55, -169, 53, 26, 135, 142, 99, -70, 67, 146, 223, -125, 83, 1, -69, -45, -92, -14, 160, 332, -46, 147, -135, 133, -28, -207, -40, -25, -317, 24, -3, 119, 103, 141, 112, -170, 7, 74, 28, -152, 47, -128, -56, -172, 138, -155]
4331a55L22K4k34K36l71J18R9j35K42j86nkJ91k17J10L4j16p9J97J64j85Q8j93
4354e3L03k29J62k24j15J29L8r6R2J07q7P2k1O4k72K3K27k42R6j98K31K7j57K09
4378H6qQ8k11k7J38j17K18r2k41M5K72r1l86K46OL31l19J18j61k2J38M6j66j29
4402b38L86N5k27j17K29L9k01K18k14m1M0M9o1m5o6M74k11q5K5j92K95j28J50
4425A34k17M3p0R4m2J70o0j15j14L5m1L98j53p8l6j46NJ87K9k79K54o0J20j63
4449a05J37Q7j13n0Jj18N0Q0p7J18J40k78PK58Pl51nK06J31j12jq0j16L86k43
4474d1P3O3j42j59M26l83Q2J95K8k59K36m7j60R2o9p1J34L6O5K5l60K11k52L70
4498I3n6pJ7j59J71m4l2K3q7L4Op6K19r8q6L46q5l16K59mj53L85l33Q9J5j48j4
$$ y = [-155, 167, 191, -43, 193, -178, -60, 39, -96, 146, -40, -45, -47, 144, -73, 37, 71, -45, -124, 73, 237, 52, 140, -53, 250, 21, 183, -41, -156, -27, 11, -85, 7, 114, 27, 99, 78, 142, -130, -107, 120, -122, -26, -224, 7, 34, -123, 86, 78, 166, -45, -72, 66, -51, 167, 75, -166, -121, 151, 60, -326, -80, -74, 257, -62, 56, -105, -127, 11, 57, -109, -238, 148, 203, -24, -141, 88, 127, -74, 144, -70, -111, -71, -22, -83, -128, -194, 280, 69, -16, 9, -183, 112, -16, 134, -83, -40, -110, -16, -58, 112, 52, -63, -177, -142, -183, 215, 62, -16, -52, -198, -193, -6, 23, -256, -2, -62, 58, -105, 32, 119, 6, -44, -43, -161, -111, -31, -108, 10, 150, -128, -121, 137, 144, -207, -212, -6, 125, 13, 12, -68, -184, 202, -41, 32, 95, -47, -206, 220, -163, -81, 114, 142, -117, 119, 72, -88, 4, -65, -136, -2, 34, 99, 124, -236, -25, -277, 93, 37, 30, 47, -112, 59, 15, -17, 6, -81, -47, -41, -117, 102, 4, -82, 264, 179, -137, 122, 118, -35, 350, 17, 106, 121, -27, -41]
4525d1J43m46L59j38J79q5j00K4K57l36L68l86L19J42m39K51j06M7K35l83j68
4546c04N17j34j41R8j08J26k77K19l24M30k34R0N4j03o2qJ14j19j0K2L37l1m06
4569b54L01q0j41J63j51j11L26K8p9J03K0j88O8l3j03J53P4J90j86p6j18K76k83
4592a01R7o8R7o1K28j76l35K23O4q1M2j4N4R2j1L0j7k07J36J57jj59L7k91M38
4617A73l17K75q4K9k17J73q7O7J18j93J1m3K29O8K0l73K12q7O0r5k1j10N6K14
4641G8k15M05m39L12ok27K37k39Q5J72l06R3j83L72k4q5k3j01K10l69O2J14P6
4664aL2j40K8L69j41p3j3j2k20K98l57L42M5k65M4N3N4j97J38L1K40k15M8J11
4688A99%j70J3L0j20j78K79k34J84k00J0J31mJ3O2l8O5k2M2j86J88j31m3JKK88
$$ y = [-41, 102, -344, 15, -123, 56, -29, -129, -105, 152, -184, 184, -202, 117, 259, -180, 71, -35, 12, 247, -136, -304, 213, 79, -62, 36, -72, 54, -223, -4, -328, 102, -132, -42, 12, -91, -153, -161, -47, -166, -176, -154, 183, 152, -254, 47, -33, -174, -11, -162, -273, 53, 81, 2, 105, 125, -63, 5, -28, -131, 22, 96, 286, 100, 24, -94, 182, -101, -4, -72, 25, -36, 192, 16, -319, -96, -32, -113, -71, -85, -31, 61, 50, 80, 63, -144, -8, 149, 148, -11, 26, -265, 173, -144, 131, 47, 76, -141, 32, -55, 12, 130, -63, -52, -95, 134, 202, 222, -151, 61, -26, 34, -61, -82, -192, -136, 78, -137, 268, -171, 141, 135, -92, 145, -94, -9, 163, -143, -50, -233, 139, 115, 30, 7, -94, 116, -253, -191, -77, -1, 31, -109, -81, 288, 147, 74, 61, 49, -171, 127, -230, 112, 157, -108, -64, -11, 43, -154, -16, 15, 255, 40, 88, 199, 199, 29, 42, 72, -48, -226, 53, -181, 3, -197, -187, -56, -60, -47, 15, -23, 42, 20, 62, -124, 64, -67, -110, -109, -107, 181]
4714A81j46n3r8J52j5k5j34n5K36k55J42J86j45L58l16J28j21p2J44j75K2R4j41
4737a08J77O9j12l0l1L30m4k84k3M11m78Q6J52r3m0m15N50j5m69M29q9q6J09J57
4761A53k03O2N2k29K30m18M96o5K9Qj3M0k95J50J71l77J20Q5K03k73O0J91n4k25
4785a02NK4J59l3J0J18m9m7K0k4r5RP6l25M35J6k09K8k4j36P6k76L12Q5k24J74
4811Ck2MN9o0Q6j15P7j13OJ22J13p7j38J01J19l20n9K12J49j77j03J60j67K16
4835G6J06O1N7q8l15J66lj93K78j6r1kK3r5K5k81K61N2p2K58l12P1J60p6j35M8
4861c7M2K52l20J30j15Q7j03j23J90j45K85j01k94L94p9l09L36j67q0J23J38q4
4883B0P6j96J36Lk22R1J67k59K82k90M9N2J36o1O0qj78J63o7J42l79Q7L36mk94
$$ y = [181, 35, -18, -116, 36, 21, -4, -138, -193, 43, -212, -70, 116, -29, 329, 13, 141, 20, -52, 92, -83, -61, 33, -108, 69, 138, 26, -4, -35, 295, 251, -33, -56, 355, -123, -37, 115, 22, -18, -433, 117, 102, -367, 62, -27, -113, -4, 153, -50, 12, 64, -165, 65, -353, 143, 78, 107, 115, 102, 142, -153, -3, 168, -209, -89, -4, 199, -74, -14, 177, 123, -102, -97, -73, 86, 53, 63, 181, 132, 85, 105, 81, -14, -5, 71, -254, 181, 197, -12, 16, -8, -144, -68, -344, -32, 53, -171, 3, -19, -15, 44, -16, 70, -45, 32, -81, -75, 47, 160, 83, -55, 46, 165, -155, -214, -2, 147, -30, -133, 27, -140, 76, 182, 243, 300, 212, -103, 63, 60, -133, 145, 129, 38, 36, 59, -36, -11, -292, -31, 21, -51, 207, -105, -34, 126, 50, -85, -37, 5, 257, -63, 67, -48, 39, -64, -187, 3, -142, 143, 42, -252, 142, 63, -246, 90, -77, -157, -34, 104, 20, 96, -100, 36, 39, -183, -92, 75, -184, 98, -192, -143, -91, 45, -16, 44, 36, -142, 21, -46, 96, -283, -196, 140, 136, -158]
4908a58J85n0J52K26m26J97K4l01P9L35m11K45K7l75K48q0O5J03j45J52j43K45
4930A94j87n0N8j70L41l14K55J73l56j40K93J74m31J25J43j7j55j03P5J23j59
4951a28m7L47o0j38J20j02J37j49M4j83j0JJ4L35k55J46R2j52J37J6p8k7J01j56
4975El6l28L50J33k64j26L70r7K12j82l0J83k55RJ18lk19K45k73R6K5P3n9L1l0
5000e2L9R6K63m71j1l7RK73K5p1j48j33j1J31Q8J55k72K52NJ4q7j2r4J40j31R
5026c1J93J9k55M9O5j93J56j11j13O0J86j56L18Kk13K12l21L75j6l82K85j31o4
5049f6Q1j26JJ19M3o2Q5r7M8%j03n8K03m1k95K89n2J09l5j23l1j22K73K58n01
5074b03K16q7O8o2Q3r7j6j8O2j6J16q9J93P5l19LJ34o0j51K45M4j61J82j03o7
$$ y = [-158, 27, -23, 129, 355, -71, 126, 150, -151, -72, 263, -148, 97, 124, -251, -3, -83, -18, 85, -60, 92, -51, 194, 7, -43, 15, -155, 186, -128, 127, 300, -56, -196, 97, 271, -160, -35, 108, 91, -64, -167, -92, 31, -128, -175, 172, 112, -26, 94, -8, 129, -20, 24, -159, -169, -168, -154, 181, -74, 72, 164, 12, 149, 165, 87, 60, 161, 5, -31, -359, -9, 124, -140, -266, 104, 7, 219, 37, 7, 190, -65, -56, 62, 59, -160, 85, -188, -92, -67, 6, -53, -22, -52, -13, 83, 346, -125, -136, -173, -164, 109, 134, 63, -85, -218, -229, -98, -10, 145, -127, 125, 130, 144, 57, 45, -49, 91, -40, -31, 162, 181, -74, -25, 40, -153, 3, -108, -221, -161, 25, -131, 187, 189, -24, 188, -133, 242, 226, -156, 129, -2, -66, 15, -111, -110, 9, 52, -10, 75, -22, 26, 26, -77, -135, 68, 27, -268, 21, -31, 78, 43, -80, -111, -233, 40, 298, -203, 13, -74, -6, -68, 15, -82, -98, -116, -54, -70, 46, -43, 150, 225, -94, -91, 43, -17, -168, 77, 121, -40, 142, 39, -28]
5099b8j88K55q9J16q0o5K40j14J02k18j1k3J07pJ06m47k9K74K18o3M2N4Q1k19
5123A4j10K60j41n6P7j61K35m6k57R3j54J67j68K18Nj10L23j02lk21l2j5K44O6
5147A26J1l47L05K1N8l17M4J4K03j3k10J81%k16J66l8J6m8nJ59k30ON1J61j31
5172c3K71k10j39j23K89J60j94l1m4j76J5J64k1K47k46L00k84J40k20j7K78k30
5194a04rm8J42Rj56J01j08o3J98R7j85M8m8J18j65j12M29j91J38m4j87j35K23
5217e2k0J58lj16p6K16q0Q0k22J43%o8J27o4J02k58J68k79L70k24J83q5J16Q3
5241A99k82L37k82l7J34k1q2l1k78K73K32j67J71j00j55o5K03m2J77j11k19J26
5263b0K3k72J68j33L20k6k36J29k26K53j32j9J71K55k45j9RRQ3j28k3j76J69n6
$$ y = [-28, -216, 39, -50, 66, -14, -79, 161, 47, 149, -69, -80, -103, 4, -3, 103, -344, -373, -99, 119, 56, 98, 152, 233, 14, -96, 164, 23, -33, 44, -117, 118, 72, -185, -92, -246, -79, -247, -29, -24, -134, 189, 87, 84, -137, -169, -184, 60, 126, 137, -210, 95, 116, 174, -143, -99, -85, 118, 105, -105, 76, 76, -140, 26, -12, 4, -44, -49, 110, -120, -114, -63, 98, -33, 238, 28, -111, -234, 55, 215, 21, -10, -54, -230, -215, -51, -72, 175, -71, 229, -55, 85, -135, -152, 126, -104, -113, -161, -19, -10, -166, -65, -173, -236, -38, 59, -126, -78, -126, -8, -173, -285, 144, -47, 91, 47, -140, -275, -52, -72, 86, 83, -33, -109, 107, 27, 107, -115, 28, 28, -40, 87, 23, 125, -133, 35, -244, 126, -98, 85, 0, 116, 199, -83, 254, -28, -65, 69, 48, -34, -65, -343, -70, 162, -5, 166, 66, -89, -154, 49, 7, 184, 73, -146, -20, 3, -269, -101, -234, 86, 60, -176, -47, -273, -20, -152, -171, 0, 255, 10, -9, 0, 9, 92, -36, -59, -235, -66, -122]
5287a22J85K9K22l48J0K8J22j07k47M65k66J86j84J99o9N1j32J8o5MK50j86p2
5310b9J29j86K03j75K57j42k17K18k27J73j63l0n5J25R0P3n2J51q9J56k14P8l29
5333b55K97k54L70j32j20K4p8J86l6m7J49J7q3j14R1k5L4l9L15k59j02Q4j3L67
5357C77o65J66l1K0L49k04J26Rj47rj44J4K91K0j75l6J48m3j7r7J39kJ8k12P7
5382b8L1J11J44l43J1j8P7N7N0n6j35K09p8p2J43k36L92l44K07l71K0K76j51M0
5406f4J25o5j05j28P5J78r0R3L2j36P4L41l45R4j88K77j43L5J23M8j42J09K16
5429D14l32k07KJ98j22qK21j43j56P2J68j87N5q6J14o1J02K13k52q5K2J16j90
5452a32J22J05j89k2J36K03l32K10j06j5j86L5K85m3q5L22l03k36K57k21O50m38
$$ y = [-122, 63, 92, 314, -34, -24, 4, 126, 19, -228, 237, -29, 157, -27, 172, 103, 154, 22, 40, -25, -21, 229, 43, -29, 100, -86, 117, -58, 199, 57, -160, 58, -169, 4, -159, -189, -244, -119, -29, 44, -8, 143, 54, 210, -4, 74, -255, 42, -212, 158, 26, -94, -70, -148, 38, 2, -45, 104, 121, 38, -76, 15, -10, 24, -15, 300, 41, -61, 23, 10, 377, -288, -122, -153, -133, 216, 12, 138, 147, 0, -9, -153, -139, 152, 172, -3, -39, 109, 66, 49, -48, 91, 89, 107, -105, -28, 3, 114, 258, -85, -74, -92, -15, 42, 92, 36, -99, 110, 32, -40, 103, -133, 259, -85, 122, -249, -229, 47, -104, -64, 61, -4, -109, -237, -162, 16, -74, 19, 51, -85, -11, 330, -15, 79, -109, 168, 25, 60, 183, 231, 89, 198, 414, 82, -125, -123, 75, -47, -55, 166, 23, -133, -61, 107, -80, -25, -111, 3, -58, 44, 257, 5, -80, -58, 58, -132, -10, 95, -94, -116, 20, 223, -109, 101, -5, -20, -206, -171, 114, 71, -14, 308, 5, -231, 26, -195, 455, 17]
5474A7O0k52J91q2k0j16L46P9j06k27K35j80O3K36o1m37M47l81M07k49j60p9K66
5497cl9j12J30j6Nn8J20M8j0K8k74J73O4j56J15q7M1J71J65m40K52k03PPm1K08
5523I5k0k40J36j94L45k00o3K43k13Q5k9J9n1J98m8r6J61K3q0pN4l9j29R8Q7j29
5549FL19n18K55n8j55O3K6j69M04j16l5j01J53r7q5N3N7j94J01p4L25j87J85k16
5573e8K93k2K8j37N8j23k50M89l51K35k30J78Q7kj34j04K9N3n3J41oO0j60O4r3
5598hR6q9J1J04L2j90n1O1Q7j34J04M3j68o4M1M6J15K9j18k44J83K87k19N4j3
5623em5m5m9O0J50q9p7J91P9O1l43%O3N4J14j81Jp1J63lk00J74N7P4l6k72J24
5650e1J8J63J02j50j9k7l2R0j2L0j05J37j31l2K8O8j68j02L44k59K7M9J01j92
$$ y = [17, 77, -175, 16, -66, -86, -202, 144, 223, 117, -110, 125, -55, 8, 244, 183, -254, 193, -188, 219, -30, -190, -269, -3, -42, -154, -24, -40, -35, -93, 27, 75, 65, 93, -181, -8, 56, -100, 15, -72, -31, 140, 305, -135, 117, -86, -79, -72, -113, 95, 75, -165, -29, -223, 122, -78, -141, 102, -111, -26, -55, -36, -87, 111, 63, -33, 128, 151, 71, 64, 118, 79, -50, 48, 135, 6, 325, -193, 62, 4, -151, -88, -62, -231, 173, 57, 22, -79, 74, -23, -108, -55, 2, -192, -91, -165, 160, -27, 158, -58, 235, 213, 241, 104, 162, 39, -211, 278, -73, 162, -68, 110, 197, 195, 61, -43, -14, 39, -14, 127, 121, 181, 21, 85, -8, 88, -1, 10, 114, 146, -44, -95, -34, 53, -81, 23, 66, -102, -166, -125, -79, 36, 65, -53, -297, -114, 173, -46, 8, -5, -50, -95, -144, -84, 66, -23, -100, 91, 170, 231, -112, -112, -49, 5, 119, -62, -61, -132, 31, 28, -172, 2, 59, 133, 97, -175, -51, -33, 130, 232, 82, 63, 36, 4, 94, 82, 112, 7, 144, 13, -19, 9, 77, -91, -193, 151, -108, -81, -32, 69, -123]
5674a23N8K10j66q0K36j65J25k93J92L25l96L7J52l19K53j56j03J73P5J10j57
5695a2J18l28K19R4j85K17k06M76l64j22p2K19K7N9j49j76K81j73P7p0n3k1J03
5718d1j11J82r8J23L2j1K07m27J97j84M22j71j77p0L16%k97L45k27m2J11k27L69
5741B21l55P5j0n1R2J70j70J66l03L20o5l1j58r6J68k77L50J20k36J38l9q4J46
5764I1o6J48m68L33J93j99N3j52J65J5j03O5k7j35l4J47l9J24m8ML0l66K27l6
5788g8P7J32m9J63K4j38k02J35j24J41j97L7J28N9j67J59P0q9j99K99M1l46J9
5811a05K89j74j9J93k55Q9m9p7K89j85N5j71J50N8j59K53j49k1k59K88q5K3r2
5834a13m5J45m7P8QK03Pm38K42L3k64P15m84J98k93k9K70R1j98n7l6M8J98k30
$$ y = [-123, -65, 145, -21, -101, 135, -30, 95, -198, -6, 319, -77, -40, 112, -207, 46, -110, -213, -40, 35, 145, -12, 106, -222, -3, 91, -94, 123, -83, 393, 29, -93, -165, 54, 81, 140, -9, -185, 96, -77, 0, -70, -123, -144, -41, -152, 30, -68, 55, 87, 76, 283, -144, 53, -131, 291, 120, -57, -127, 189, 189, -108, 237, 10, -32, 79, -148, 221, -134, -59, -69, -120, -28, 142, -28, 138, -165, 155, 90, 59, -99, -195, -27, -304, 46, 166, -70, 68, 29, -55, 91, 25, 173, -295, 38, 231, 32, 85, -67, 98, 113, 10, 75, 48, -87, -121, 26, -13, 111, 63, 67, 97, -269, -42, -78, -1, 131, 82, 245, 269, 131, -71, 64, -60, 81, -116, -79, 49, 108, -59, 100, 170, 81, -118, 181, 222, -124, -105, 184, 10, -9, 184, -71, 18, -31, -108, 181, -4, 51, -120, 30, 88, -71, 182, 33, 12, -247, 41, -44, -21, -113, -158, -13, -60, 18, 26, 229, 236, -202, 40, 73, -191, 524, 40, 238, -55, -84, 186, 277, 79, 22, -14, 34, 232, 2]
5858BkknP1j24L2R3j39K87j48m9J08j98N1K09k59K50k79J84rk61K39lm4P7j43
5884f2P6M61k17j39o8O3k6J20n2k68L0k55N26L2k26k8n2n0M6o1P8J36L5j50k37
5909b88L79M8j60J04j72R6O6J9k42J11J35j51L85l34J53j86M4j83o1N1K22K7P3
5932A36j99j07J39n5n3j24K26L7K49k02k7R1j36J66j55j54K79j04O0OJ7j59O7
5955bK22l99K42j79K96k47J37k01L40k84K66k32J33m4K40k38J92n77K08J55p4
5976d6K08l73J41J90j76N4M5k6K3J01J1j69J9p9O3K6M1j40m7M1K99j58r7l3O6
6001a6j50K45m4k0j17j16M77l21K75k09m1K9Nj41l9K74n3j39J27j4j15N6q6J16
6025a7J45Q9l41j22Q4J14k3K56k85J40J49k87j41L03p8Q4J11k41O6j27L1j3J42
$$ y = [2, 0, -2, -7, 64, -60, -28, 65, -74, 213, 65, 16, 124, -74, -23, 186, -73, 177, -102, 82, 73, -188, 51, 48, 4, 81, -62, 14, 475, 258, 119, 51, 114, 88, 208, 156, -112, -82, -337, 189, 221, -5, -33, -85, -135, -89, -150, -72, 64, 99, -51, -288, 91, 139, -21, 83, -89, 7, 73, 92, -150, -39, 96, -55, 330, -4, 149, -37, 7, -176, -237, -186, 36, 63, 136, -63, -170, -31, -86, -139, -263, -37, 0, 249, 47, 20, 111, -25, 141, -14, -168, 111, 7, 67, 73, 90, -69, -2, 220, -179, 63, -116, 180, -67, 70, -131, 209, -75, 191, -41, 92, 48, 288, 50, 242, -335, -127, 28, -46, 162, -211, -70, 120, -56, -2, 43, 17, 40, 141, 152, -17, 2, -77, -14, 12, 53, -87, -134, -93, 206, 48, -49, -82, -16, -166, 79, 35, 15, -102, -218, 259, -62, 213, 4, -37, -8, -3, -144, -183, 91, 38, -101, 26, 12, -103, -47, -133, -17, 128, 217, -124, -246, -162, -48, -71, 185, -100, 40, 189, -98, -239, 64, -14, 70, 181, -60, 6, -121, -90, -103, 39]
6048C9J44k72J19k07l1N6J45r7M19l81J0j44K50J66m79K17L2L67k35j39O5r5N1
6071@j2M7J4j6J67l31K61j69l4J55o5m3J89k56M59l53o7J33j53J58j23O6J93l41
6095a21J97l1lJ06k58J65k45n4M53m4k57Q5j25n6N1L11k27J6J97l76K15J6j4Q6
6119H7l46J99R4qj07Q2j1p1L48q0k21j26K81j22L4N8k53L1M1lJ51j94Q8J48O2
6144A62r2kN4k09Q0K5J55k79K26k09R6L8j62O6j54L93K0m11R4j86L27n4K50o6
6168A62q3Q4J0j70KM9J52j97Mn0K07j35j17J41J57l21j63K69j2J51j77%o9j37
6192b43L13k6K2p7r2j50L73j70k42L32J6j5K34k74J7mp5J40k13J3K4J69k3j46
6216i7K31l9k80J16M8L4L14m8l41Q1j2J76J19k03j34l47M14j25J04P0n0p4l3j73
$$ y = [39, 183, -89, 30, -177, -208, -152, -7, -104, 315, -66, -56, -200, 50, 216, -263, -46, -14, 353, 118, -21, 44, -51, 0, -12, 35, 49, 33, 200, -131, 130, -39, -73, 82, 17, -26, 163, -93, 366, 13, -54, 79, -74, 84, -39, 27, 220, -121, 76, 45, 42, 148, -110, 55, -190, -244, 209, 165, -92, -7, -132, -188, -137, 174, -53, -37, 160, -216, -1, 15, 1, 87, -259, -60, 34, 26, -81, 1, -10, -81, 267, 187, -34, -160, 121, -1, 33, 91, -162, -131, -90, -93, 58, -136, -48, 100, 162, 70, 68, 122, -87, -7, 18, 173, -106, 120, -89, 7, 45, -117, -51, -205, 188, 208, -203, -109, -295, 32, -22, 228, 162, 79, 163, 173, 3, 5, 54, 206, 9, 13, -37, 170, 35, -82, 59, 216, -105, -268, 1, -11, 140, -37, -37, -106, -243, 70, 44, 66, -11, -103, -253, 120, -50, -292, 40, 56, 41, 275, 1, 18, 14, -61, 79, -134, -121, -97, 72, 49, -97, 134, 95, -185, -69, -21, 13, 327, 279, -62, 19, 7, 183, 302, 99, -35, -382, 32, -93, 11, 81, 31, -43, -76, -249]
6240b49J94J94j00K1q7O1p1j5j01Q9k5j07K74l04N1J68m2j76k0J49J0K42k78P
6264a15J53O8k39L30k55J96Q3k54K66l49P8p9J99j24N9M1j53O2R0qK5L9k18N2
6288e3L2j4j6j80L50j83On0P3j13k2J02j0n3L6K26l05J34Q3p7J2j99K24N7J9J37
6314B16k59j05K52O2l2k42M1N3M5j53K75l7Jmj31k9M3J9M8j33J19J43k48r7L74
6339B21k39j0l9Q9r4o2J78l9p6O0r3K02n6j81J91j27j7L0J96m53N65j80l37J57
6363a14K10j06lo7N1j28K49q1n8J17j14K48j39j79J20j07J69k2j55L17m31K53
6385C0L6j26L27l50K02k97J09O3m9J63k4N4r9l28K37lj92L48q1K08j77q6l2r3
6409a60o0K83o8k2j01k54L56K28l05K20j65K26m3n4j07J7J10ML2r8r1K48k42k18
$$ y = [-249, -55, 139, 39, 60, -27, 34, -37, -52, -153, -64, -89, -196, 78, -226, -175, -7, -49, -225, -245, -96, -86, 156, -122, -115, 38, 106, -133, 197, -58, 138, 221, -33, 233, -116, -38, -117, 82, -42, 17, 58, -95, -33, 57, 49, 74, 113, -105, -53, -21, -35, -51, -231, 119, -64, -58, -108, -35, -148, -170, -68, -78, -131, -95, 131, -174, -40, 43, -34, -22, -221, 3, 60, 79, 216, -43, -148, 104, 166, 134, -108, -67, -14, 31, -122, 153, 116, 117, 113, -18, -47, -4, 15, 63, -70, 49, 192, -56, -153, 221, -18, -28, -67, 22, -72, -134, 44, 5, -71, -11, -104, 98, 42, -139, 52, -75, -92, -62, 134, -319, 246, 66, -271, -114, 96, -10, -13, -80, -29, -157, 92, 11, -47, 70, -44, 204, 65, -114, 6, -101, 68, 46, -109, 208, -223, 30, 66, -60, 267, -83, 119, -178, -69, -6, -55, 108, 84, 138, 39, -289, -52, -55, -247, 101, 20, 228, 51, -35, -67, -160, -220, 63, -5, -27, -128, -382, -26, 202, -103, 117, -48, 178, 135, 81, -26, -9, 101, 105, 137, 39, -52, 196, -46, -264]
6433b64J41O5L2K2j81K80j11K6L2J81l13J8o5K35N5k60J95j88R2R7ok03J26K36
6457B42k07J75l41k7N4J52o0j09K2J62j47k4Q9J41j56K80k93M1j4n6J79j32Mj22
6481a47L19j91j06K09J81l54R5n1K48k33J8J53L5J6k14j79L45j36R4j38N9l36
6503c13L12j72J39J39k10K28j15PQ9m3k17O9J59k43L7K22MJk84PP5l6J03M4K08
6528B10Nk31j2k9N8J98k23J42l24K76j17Q9jj75J82m1R2k65K15k51L44l42K88
6551H8j13J41j54O1J6j50R2J43j63%J54k1p3L5J69j20j00K07j17M3R0k84J06P0
6575A20l03q1L70k41K04p6J8j64oQ9R4N8k25K35l0j30K0L4O4J57k37K22%p3j43
6600b4J74k39J39q1J8Jp1%j20J95k10M18l78J96J35l04K34j05o4J65O4n97N64
$$ y = [-264, -123, -58, -26, -4, -185, 95, -16, 10, 42, 223, -90, -72, -137, 98, 153, -107, 88, -100, -8, 89, 83, -120, 6, 242, 35, 210, -131, -158, -104, 48, -12, -121, -99, 63, -84, -108, -19, 122, -34, 246, -47, -6, -20, -76, 103, -29, -25, -147, 172, -19, -125, 84, 265, -89, 6, -45, 203, -30, -12, 141, 176, 192, -22, -201, 144, 8, 102, -36, 23, -313, -1, -173, -34, 105, -105, 123, 8, 15, 104, 61, -156, -87, 72, -171, -134, 88, 92, 93, -191, -184, -109, -145, -42, 2, 210, 215, -16, -28, -57, 1, 199, -24, 118, -206, 70, -47, 42, 41, -134, 48, 7, 99, -166, 49, -202, 142, -200, 88, -25, 116, -38, 23, 39, -111, -19, 124, -39, -39, 115, 94, 21, 56, 225, 105, 5, 212, 95, 138, 228, -56, 50, 120, -183, -264, 106, -135, 69, -7, 11, -153, -159, -70, 24, 82, -143, 92, 62, -68, -48, -14, 50, 207, -30, 192, 192, 119, -24, 150, -89, 50, -31, -13, -12, -83, -83, -203, -8, -218, 200, -178, 18, 153, -151, 83, -22, -86, 79, 143, -454, 110]
6623A10k02J07o2K14j58j8l2J41j45J22K55k99o5l3K4J1n2j14K53M3l6j11N3j28
6647a22P8O6j89R6K8m6K16%j86J09l65L03J99k78J33j15J05n2P7p4r2o6N0J68
6671D3q8L4J5r2K66k71J67O6j89J00JN3j72K17j46J31k40Mr1m4L03r4q7P0j80
6696b24L29k15n8J83J09j57J69l3k49J39l4K04j02r1P2M8l1j10j40K47l49J19
6718a74J09p6q2L27k53p1K00q1J02L7n5J38j52K06k35j03K35k80L21P5l00m0J81
6741B9k88M09k0n9j73J84j1P2j09n2M5l6j10L78k34k74K10j28J70l1J99j05j90
6764a24lpn6L16k23R4J1j38J25n4J61J3j25l5j59J62J56k36K67j73m1J06j77J42
6788BJ40j75p5J93j62p9K05j78L90m02q4L23j21rR0k8P4O0m4j11Kk01K96p8J90
$$ y = [110, -92, 15, -47, 167, 9, -9, -41, 100, -45, 77, 332, 33, -32, -65, -41, -30, -82, -196, 57, 100, 64, -47, 6, -122, -44, 22, -167, -71, -43, -89, 127, 127, -59, 50, -315, -12, 187, -91, 42, -73, 32, -20, 57, -17, -109, -175, -125, 43, -45, -11, 4, -88, 178, -93, 74, 140, -49, 51, 52, 105, -67, 150, 4, 135, -105, -101, -192, -236, 67, -27, -114, -44, -224, 105, -110, -168, 15, 124, -33, 136, 103, -146, -7, -41, 163, 61, -30, 42, 90, 59, -51, -191, 56, -293, -174, -65, -141, -223, 104, -149, -220, -20, -101, 1, 38, -17, 121, -31, 175, -60, -163, 72, -208, 113, 188, -112, -152, 29, -259, 150, 130, 71, -102, 82, 71, 143, 34, -18, 27, -9, -119, 259, 25, -249, -39, -167, 3, -28, 171, 66, -124, -127, -134, -190, 126, -97, -3, 8, -130, -5, -59, 102, 115, -10, -45, -204, -42, 114, -122, 145, -28, -69, 37, -140, 2, 142, -33, -108, 85, -77, -156, 49, -129, 261, -141, -225, 98, -23, -32, 58, 30, 104, 164, 120, 9, 11, -190, 106, 28, 218]
6813B18l45K25j95K62p3j15K70j77Q2j01p6J72O6l16j74L87l37J44J05k01K76
6834I7k97Q2J24o5oJ05k3K0j05J24k02K03L5k87J54MR3P9j33kj95L15J0k45kQ6
6860c1n4L15l65K66j10r4M9O4r2K95k22j7j06K01j27J93j68K28j83J44j87n3K69
6883B15j17k19Q6J24j11N5O4r9J94l03L1J34P1p5k7j12P0L12j19j52O5J17j81
6906B3j52K58n6p1r9O8l7n7R6n1J75K21m03L9o8J37j72J16Q8j47k9K07k57J10
6930f1L16l09j46L34l05R7P3p8J13p9j4R6K2j02N0j85pM19j08j06m4jL8R2n4J06
6956A57k08O4N5k5j43K11j61J67j05R4R9m15J99j3J14Qm8m1L40l03J63l06R5j68
6980a70K18j25j1R4J28j06O2j88p7J80k07P9J31J40k99L3J80qJ19k42Q2k4J01
$$ y = [218, -127, 98, -97, 165, 92, -23, 247, 70, 152, 51, -25, 147, 213, -103, -277, 110, -227, -83, 22, -179, 97, -200, -118, 6, -59, -65, 40, 17, 37, -68, 56, -146, 57, 92, -195, -41, -37, 56, 135, 2, 0, -195, 120, 130, -115, -117, -31, -85, 230, -135, 131, 21, -73, -24, 40, -52, 243, 21, 4, -102, 99, -28, 165, -3, 225, 42, 186, -1, -54, 215, 98, -121, -35, 89, -22, 33, 97, -2, 192, -111, -80, 54, 125, 50, 23, -89, -19, 293, 174, 22, 87, 204, 23, -129, 129, 73, 2, -97, -29, -66, -123, -27, -78, 97, 318, -85, -46, -114, 23, -149, -33, 55, -92, -121, 86, -171, -61, 255, -54, -200, 134, -171, -74, -1, -79, 34, -45, -59, 37, 59, -43, 7, -178, -185, 234, 126, 20, -24, -25, 13, 105, 51, 157, -51, 13, 68, 43, -100, 111, -50, 117, 12, 106, 205, -210, -11, -24, 90, 98, 50, 9, 349, 46, 209, -97, -2, -170, 48, -77, -88, 6, 134, 28, 90, -98, -175, 5, -202, -123, 8, 148, -151, -118, 62, 54, 173, -69, 13, -11, 90]
7003I0K4j68N5r1K31q5j35kp5M18n01J3N21k59j92L57k59j0K8P6J11k53j8K9j9
7028a14pJ27rr1L7J71j49K67l24jP9j66J63P3j2k19K85L1j92K16j16j66K30j44
7052c1Q7m9R7l91N26j79j9n5P9r5j37J47N0j56J73J2k3k1j30Nn5K13j75J34Q4
7077I1m4o0M5r0J42j28p4K46j02J17j04K5O0k33l5O9j55J51mMR6J34J77k90M3
7102H1p2Q9QL0JOj19J93k80MR8k91J47J79J26n8m38M37j19k40K23J02J8r8j49
7127a22K10k9k13K44j18K4j02K34j7K0j27j03J09o3RqR3r8K32j78n6p5J24p6M7
7152c9M2l7N7M4j48Kj91L43j41L81m01p9J93l2N8Lj02K4L7J99m73J66Q7Qn1J11
7178F1J7R6o0m3M4j59Q0l0J35j31J20j51O1P0O5k48k8m4L58r8R3j1j36J06k68
$$ y = [90, 114, -54, 1, -90, 141, 56, -79, -81, -156, 262, -239, -226, 295, 36, -156, 201, -58, -68, -40, 36, 147, -106, -124, -95, -114, -121, 6, -3, -94, -57, 114, -35, 232, -92, -93, -14, -180, -17, 56, 44, -175, 110, 141, -51, 165, 49, -117, 113, -31, 56, 7, 104, -287, 239, 60, 41, -14, 65, -30, -167, -20, 30, -126, 47, 59, 36, 15, -115, -110, -165, 48, -127, 7, 91, 47, -13, 32, -58, 84, -44, -118, 128, 26, 143, 39, 64, 124, -109, -144, -75, -230, -79, -83, -79, 17, 151, 328, 38, 81, 9, 98, 106, 136, 137, 143, 24, 217, -63, -59, 39, -252, -105, 74, 200, 142, -296, 141, 22, -218, 5, 107, 125, 27, -122, 88, 59, -154, 90, -28, -4, -106, 128, 111, 131, 4, -99, 10, -53, -44, -52, 41, -57, 175, -3, -59, -134, -10, -86, -39, 3, -34, 23, 67, -81, -79, -270, 73, -68, 313, -88, -167, 26, -6, 52, 55, -47, -23, 14, 213, -260, -94, -7, 1, -50, 61, 78, 174, 114, 71, 115, -44, 36, 6, 141, 10, 130, -21, 40, 110, 175, -73, -101, -145, 213, 115, 208, 197, 61, 167, -101]
7203a01K80k96m2J87n2Qk35J81Pj35J48J93j89J20K50m85K17j58J40O1k05K38
7225A32N3Rj85%j27J02j97M95m67K54J49q2j8k42J00Jj14L6k4Q5K01l54K04j26
7249a15J35K0O6j74l2Jj7Q9j59L21k96L00j06J16J03l22J33L64k64j42n0J22L7
7272A30j88L7J0j50L64k94J9J26M5k31J55r1RJ79n3j15N0j32K81j05j52l1K68
7295A31k19K36j97j34M38j90j32M3l0J3O4O8M4j55j35K02O3j39J89K6k61K19n7
7318H7Lj01j14L77j57p2j01K80j60j14J49n4q2J61N2l98L32k00K9j23J76N2J50
7341A72k08Q8RP1j50l7j06J58j88K60j46j26K60j1M6k2j00K37k77K4N6o3j5L0
7365c8l06L74m4j01L4K50l04M7J53j95O6L3j38K00N7n6p8J8j7R1j16M4k22M83
$$ y = [-101, 179, -117, -159, 28, -24, -16, -251, -70, -63, -198, -50, 143, -46, 74, 324, -161, 56, -102, 38, 99, -106, 132, 185, 194, 9, 9, -118, -16, -213, 282, -185, 69, 218, 136, 118, -124, -24, -23, -137, -101, -125, -40, 161, -193, 11, -115, 20, 40, 106, -68, -100, -99, -116, -27, -186, 135, -161, 139, 33, 149, 252, -70, 63, 427, 163, 21, -29, 93, 130, -58, -21, -11, -161, 203, -91, -72, 54, 99, -132, 23, -68, -59, 120, 67, -48, 2, -130, 151, 46, -106, -137, 131, -88, 148, -49, -183, 255, 65, -67, -24, -54, -41, 23, 91, 135, -20, -155, 47, 110, -29, 160, 186, -75, 144, 87, 90, -11, -125, 252, 95, 23, -78, 202, 42, -72, 77, 23, -59, 102, 154, -244, 88, -112, -83, -206, -30, 22, 172, -36, 52, 61, 132, -18, -55, -161, -3, -191, 69, -77, -203, 57, 46, 92, 70, -30, 207, -70, -46, 10, -53, -68, -38, -344, 30, -14, -115, -81, 169, -135, -88, 65, -130, -64, -31, -169, 31, 88, 32, -46, -28, -45, 46, -70, -26, -248, 235]
7389B35q6j77Q8l8o4j68J57P1K04r0j18O6j13K9rK53q5m1l41K87j96K53K0j1M5
7414A71j22r6Q9O8j77L21k62n7K6j11L15k13j13J14j41K49p8K57j97qJ4l7j92
7437a80K55p8J11l26l7J76K35k03m5k1M2J64r9j42J24K05L8l61J19O0M6j30j87
7460b34L00j98K66j10j64K81k2j9o1L5j36J63j9p2L0J78k62J68J7k17j10O9K45
7483A28Q1n08L59r8p4J42m3J00j62%N7O6o1N8m0p4j38J69j35L32M2J5J75n69P7
7508a01j32K92j2o4j75N1J4J20q2J78P1k58J61r3m9O0j29k6M13k47r1K24P4l30
7532a31q3J48J86n8O0n7j22R6k32Q6K80k00R9j84J81j13q2K82l21n1O3J11R9k67
7556b10J61PJ24M6j25pl0j11J61K15l30l4jK8L61m18R2K11k63N4n2J45J12j62
$$ y = [235, 149, -28, 60, 22, -42, -210, -53, 18, 222, 132, 14, 80, -33, -4, -13, 240, 155, 114, -227, 60, -136, 117, 137, 126, 171, 49, -47, 42, 110, -67, 254, -8, -65, -39, -150, 165, -48, -161, -47, -188, 61, -17, 240, 43, 35, 49, 12, -180, 75, -3, 108, -218, -255, -79, 156, -47, -92, -113, -71, 93, -6, -148, -24, 181, 219, -142, -23, 37, 83, -47, -234, 66, -132, 134, 24, -140, 141, 119, 100, 39, 74, -62, 101, 82, 10, 40, 218, -44, 124, 141, -76, -186, -117, 128, 209, -299, 60, -38, -112, 30, -13, 87, -75, -75, -18, 48, -13, 45, 5, -69, -207, -38, -173, 159, 201, 216, 391, -178, -101, -233, 59, 47, -17, -192, -141, -127, -7, -89, 89, 160, -98, 63, -30, -79, -19, -148, -174, 239, -8, -99, 125, 199, -131, -214, -66, 120, 62, 122, 65, -57, 39, -193, -107, 173, -27, 72, -112, 69, -44, -126, 156, -165, -216, -153, -42, 57, -210, -49, -42, 82, 128, 3, -4, -34, -145, 16, 231, -99, -133, -134, -106, 255, -163, -71, 140, -123, -69, -121, 24, 136, -26]
7580b6j33J7K40Jp5j72P1L12l89m0J30o5J90J20l39K84k27J78k14K85k58J28O8
7603H6j03O0l25L84k03J89j42K5J69j00L4m3j35Q4K02k49K31j63j51J52PR7j52
7626d6J35j23r8L01k03q9K32k57L46j85Lk13M43l44l2J40PN4L8j6MJ6j82J58j50
7651f1J19O1K9k62J28j10K8j39J99R0J65j32Ql19L73j09j77J58J3pP7k00J3K01
7675A46o9P1M3o5J8J03l62L9j20Q5K20J0p9j64J74k4k19L71k24J68k5m5p5j20
7699a43n0J14J63k9L20j96o9q7J97j52L8m5p3K64k21R1j58J87k41pK15j42M1J10
7723A27j33J83j26r7n0J63r6J17l10J32R2j25J0K06j97P7j30K93j63k29J95N6
7745eo3K89Lm66K30jJ36k23J13J79j52RN5m23L53l34R9J64K2p6Q2q3L92j68k50
$$ y = [-26, -159, -142, 98, 99, 24, -148, -77, 235, -154, -194, -64, -129, 61, 181, -158, 126, -101, 77, -137, 148, -110, 18, 86, -17, 43, -282, 102, -101, 88, -54, -29, 140, 40, 74, 31, -104, -20, 182, -67, 164, 1, -150, 2, 9, 106, -46, 89, -34, -132, 169, -34, -123, 109, -148, 198, 13, 16, -197, 246, -98, -130, 10, 17, 71, 109, 93, 97, 113, -69, 89, -61, 58, 119, 148, -114, 14, -96, -68, -207, -8, 82, 247, 115, 123, -196, 177, 68, -109, 49, 62, 55, 132, -68, -55, 146, 77, 148, 191, 126, 144, 247, -115, -76, -196, -111, 109, 119, 40, -124, 50, 26, -193, 178, -46, 122, 97, 52, -23, -143, -193, -79, 84, 55, 375, 179, 110, 23, 220, 68, 106, 61, -12, 252, 31, 122, -36, 151, -90, -97, 118, -24, 17, 127, -6, 177, 51, -46, -96, 67, -29, 88, -222, -90, 2, -123, -113, 93, -104, -27, -157, 136, -27, -256, -61, -5, -68, 221, 224, -242, -12, -13, 123, -100, 13, 192, 40, 49, 104, -319, 34, -300, -201, -37, -15, -91, -9, -92, 300, 132, -118]
7770a18J54n6j4kj87J73J0K16k12j01K35q8n2P8j27J49j90K6J61K5j19QO4M4j42
7795f5k97K64J17j86J37j61Q1K94j85P0L8k18P6k47L48K9m41L07K18j93J51j24
7817A3Q2l2r0j88M1K11M6K36k75J33k44N3r5J90M4k74J11j15J81J08j53L2j19
7840a04J9J17L8k16M2J4K43j75q1L15k55J52L9n2j65j75K91K09j55k67J62O1j39
7863h2j56J38K68j99k8Q7r8L7J20p5j49l3L64j81j02k9K00J82k37k5l4J09q2L4
7887B9p0%j84L66l52M26l56J66k3J04j87J1L6q9L29n27N90k45K18j73j26J52R7
7910A92k46J03k46J44k3P1k55j90M69k2m7l6L8k92K93O9k4J0j64J30j11KK27K
7934I4l17K28N0o1J26p1K28m09O7J72O1k05n6l5J96j87L28l98K87j51k1L66j94
$$ y = [-118, 36, -20, -34, -36, -223, -50, -40, 176, -36, -137, 98, 10, -42, 36, -91, 58, -132, -106, 55, 80, -39, -31, 33, 77, -65, -362, -98, 19, -167, -30, -191, -110, 184, -1, 69, 107, -111, -35, -282, 66, 95, -346, -39, 179, -14, 137, 13, 95, 63, -27, -215, -174, 37, 83, 319, 44, 177, -67, -14, -109, 81, 125, -149, -38, -153, 28, 136, -17, 15, -104, -85, 32, 70, -146, -104, -90, 153, -22, -103, 212, -43, 109, 148, 96, -69, -244, 47, 256, 101, -166, -4, 57, -82, -238, -100, 168, -31, -59, 28, -70, -33, 87, 12, -137, -170, 194, 13, -89, -118, 82, 264, 27, 2, -32, 77, -5, 29, -41, -41, -225, 141, -211, 215, -141, 25, 2, 106, -81, -70, -34, -123, 206, -321, 269, 24, 242, 69, -57, 95, 192, -54, 49, -197, -53, -76, -5, -260, -450, 19, -3, -50, -86, -48, -340, -47, 22, -2, 8, -156, -26, -137, -135, 92, 94, -223, 5, 55, -6, 120, 49, 277, -132, -65, 107, 168, -37, -93, -128, 68, -119, 209, -189, 98, -53, -74, 292, 98]
7957I8j65l71N49k46K2J72k78K62k43L28Lj24j24%L56k58r8J00j5O3l8Jl3R9l20
7982b60L51k04J73k36l5K89p2r3R4k28K22Q9j63J60j30p2K09o1q2m1M3L2q5J80
8006H0k36J71q7m6J22j14O8l9Nl6J08j43L88j20N8j42j80K45j1L2j08P8M8j60
8030a9J29j58J27k44K05K19k16J11j84K87k28P3%j23K6j26j5K32l87L47j2r1r0
8053a37r5J70K01L9l30K47m6K81m81J07J76k11lM0n2K92k39R5l2J80l57N3l6K82
8077A44Q4l34K7j57L8K38j69J78r6j65mR7J91j22j05M5j35K81J65k87J9J14J06
8100A53k11P3p8K5J89j35J2l7Q2l88N06k95J14j01K28j95p5K41o8j4j96K81j56
8123d5J09l56L49nM0J24j46K04k33j25J36j21O8r5K41r2j09K16k02Q1j53J90k39
$$ y = [98, -67, -438, 111, -135, -113, 59, -219, 43, -200, 128, 131, 7, -117, -117, 239, -19, -117, -17, -32, 31, -7, -6, -39, 60, -260, 91, -113, 60, -176, -211, 78, 6, -87, 7, -221, 1, 90, -73, 87, -43, -115, 94, 33, -49, -90, -47, -15, -100, 80, -156, 15, -72, -118, 4, -110, -42, -81, -76, -112, -4, -147, 241, 121, 179, 37, -143, 102, 91, 123, 15, 93, 141, -19, 110, -48, 79, -165, 40, 259, 43, 154, -30, 257, 29, 102, 102, -21, 5, -121, -136, 96, -291, 56, 44, -47, -137, -232, -62, 139, 178, -152, 95, 49, 330, -151, -44, 132, -79, -82, -42, -94, 198, -41, 54, 22, 202, -155, -102, -138, 144, 228, -106, -79, -236, -198, 40, -129, 49, -47, -212, -216, -119, 72, -50, -155, -110, -245, 36, 201, -86, -67, 47, 153, -58, 15, -63, -38, 151, 16, 28, -9, 73, -315, 191, -104, 10, -91, 137, -58, -133, 108, 40, 26, -170, 111, -45, 64, -292, 57, 52, 92, 216, 70, 274, 41, -84, 52, -69, -1, -96, 145, 53, -56, 160, -42, 39, -114, 76, -163]
8146a63L93l25J26J84l17K60q3k83O5J98k23J27J13m25K64J5R8j23p0L35k42P4
8168bJ17j34p4l6M69l32k9J2K4p0q5J98l21P7J49J08k3j57Q1L9qj31N5
$$ y = [-163, 230, -95, 31, 215, -102, 158, 75, -208, -143, 55, -168, -41, 72, -353, -89, -74, 24, -99, -169, 166, -76, -2, 115, -19, -93, -129, 340, 8, -21, -9, 15, -55, -140, 58, -263, -186, -37, 71, 48, -109, -28, 11, 3, -128, -73]
8191g3
$$ Imaginary data points
##PAGE= N=2
##DATA TABLE= (X++(I..I)), XYDATA
0@%%%%%%%%%Qj6J6j6J6k4L2l9M7n6P2q0R6j20J36j60J87k14K51k89L29l79M35
32B32m93N58o32P12q01Q99j005J120j246J384j536J704j886K086k303K537k798
49a468L081l392L740m122M545n021N556o161O856p660Q604r734J1110j2827J5046
64H153j8039K2315k8975M0852o8476K53623J55874m08324j89677n9683L40983
75D8626K66497k0614k72457l24937L9180L07498J90805O9555k97701l04214N8185
86b39577K51719K63133j6009k76511j94034m5124K70422K74884p2599k05518k24683
97b13897l5351K63108K14693J5796k44895k54182M9309J82722K19078N5993k64477
108a2103k11135m33J91506K42705j072j79556k26444n9990K50661J98851L925
$$ y = [0, 0, 0, 0, 0, 0, 0, 0, 0, 0, 8, -8, 8, -8, 8, -16, 16, -23, 24, -32, 40, -40, 56, -64, 72, -88, 99, -115, 136, -153, 176, -203, 232, -261, 297, -335, 377, -424, 475, -530, 590, -656, 728, -808, 896, -990, 1096, -1207, 1330, -1468, 1613, -1779, 1961, -2161, 2384, -2637, 2919, -3242, 3614, -4046, 4558, -5176, 5934, -6893, 8153, -9886, 12429, -16546, 24306, -44170, 209453, 365327, -42997, -232674, -292357, 48626, 315123, 294509, 22052, -302885, -263705, 43793, 234598, 304153, 6452, -297762, -239577, 12142, 275275, 259266, -17245, -211279, -256403, 14019, 288903, 216304, 10786, -213897, -249248, 13860, 228553, 244349, -546, -254728, -205419, -22697, 196381, 252374, -12103, -223238, -223671, -32165, 210540, 209468, 29912, -196532, -256522, -5861, 192990, 196915]
119A96915j50073k44568k5408J90855K07810N1327k12555j91316j8082J38326
129e6769K49534K5810k02441j76699m3540J80426J98997K1220j45266k33905k2644
140b05277J93606J62786N1096j64491k17473j4196J54078K06374K8363j74010
150B0856j60087n6142J49707K16353J2838j39697j79550n1512J54898J67311N0570
161A85545j37458j99638j5974J21241J58268O3263j42985j66095l9768J17114
171e6487J79795K9056j13152j54041o3849J38018J62671L2224j01708j69213m2829
182a59515J14596J53079O1324j24504j59895l9113R1417J68121N5101j14330j49382
193a03101o0798J06398J57635M9093q4531j60763n9894J05573J41529O2870q8967
$$ y = [196915, 46842, -197726, -223134, -32279, 175531, 226858, 14303, -177013, -195095, -56769, 192765, 218575, 16134, -160565, -204105, -23679, 175318, 196538, 51272, -182633, -205277, -11671, 151115, 202211, 37720, -179753, -193949, -39871, 166503, 194866, 20856, -139231, -195373, -45666, 170687, 183525, 43828, -135722, -187234, -32336, 134975, 185545, 48087, -151551, -167525, -46284, 111984, 175247, 32262, -133833, -173601, -56487, 123308, 152364, 39212, -114829, -178678, -40660, 122011, 154235, 52527, -116686, -159515, -44919, 108160, 169484, 44980, -114915, -154028, -62611, 105510, 160611, 46281, -103101, -163899, -57501, 100134, 149227, 64696, -96067, -155961, -50388, 91141, 154011, 65044]
204F5044j54114n2193Q2339J48687N9315r5722j34722o0498Q0043J48359N0870
215A37408q1048j38323o0869Q8068J34317N9364p6781j45852n2155P9364J32821
226G6314O3773q1502j35580n9788O9872J39731N8484p2341j29955o9312P2185
237f8119J33827O0806o2646j30817o3060O5311J24101O7663o1104j26478o1372
248a21888N6120J23241O4793o1357j20263o4011N7406J20859O0059n5678j17876
259e8595o3313N7701J17548O4113n3158j18403o2873N4577J17426O4888n2764
270F7147j16134o4710M8711J13848O5329m6993j13384o7953M4253J11487O7716
281A09317m2628j09489o5887M1858J07269O6139l8816j03184o4953L7155J02934
$$ y = [65044, -89070, -141263, -58924, 89763, 149078, 53356, -81366, -141864, -61821, 86538, 137408, 56360, -81963, -142832, -54764, 79553, 138917, 62136, -83716, -135871, -56507, 76314, 140087, 58585, -76995, -136783, -66911, 72820, 131304, 58963, -70992, -140304, -68119, 65708, 126514, 63868, -66949, -130009, -64698, 59403, 127066, 65962, -60516, -121888, -65768, 57473, 122266, 60909, -59354, -123365, -65959, 54900, 114959, 59281, -58595, -121908, -64207, 53341, 117454, 64296, -54107, -116980, -62403, 55023, 119911, 67147, -48987, -113697, -64986, 48862, 114191, 67198, -46186, -114139, -69886, 41601, 109317, 66689, -42800, -108687, -66829, 40440, 106579, 67763, -35421, -100374, -63219, 39715]
292C9715O5349l7259j02214o5971L6775J00967O3258l6653j00842o3642L5742
303f4775R8781O5107l3498r8446o5355L2922R9819O7378l1972r7408o6829K9995
315f4281R6096O5686k7935r4052o8363K5562R0909O7485k3726r1790o6100K3304
327f7205Q9097O6431k3389q5384o3580K0974Q6768O2354k0579q3403o5255K1290
339f1881Q3265O2621k0180q6120o1903J9911Q0342O4928j9698q1855o2029J5510
351f7089Q2588O4898j5879p7467o7371J5735Q0007O0847j0153p7051o5130J2452
363f3613P0941O5336j0817p4238n9421N260P2305O4702j2837o6944o0140Q149
375f1317P1120N6741m874o6971o2910J2654O3893N8240m031p1200n7218O284O4421
$$ y = [39715, 105064, 67805, -34409, -100380, -63605, 37362, 100620, 63967, -36875, -100517, -64775, 34006, 99113, 65615, -32831, -98186, -65264, 34555, 101933, 69961, -27447, -94276, -64281, 31815, 97501, 69566, -24486, -92849, -67287, 23622, 91107, 67381, -24409, -90509, -67205, 21892, 88323, 64934, -20450, -84030, -63056, 23712, 86066, 65487, -17916, -83171, -61881, 21384, 84005, 63825, -22295, -84198, -64287, 16055, 80983, 61285, -20570, -82599, -67089, 15499, 80397, 64518, -12949, -80320, -64585, 15422, 76269, 66116, -10935, -76065, -63613, 7328, 72664, 61847, -12391, -71812, -66552, 5753, 70455, 57618, -9326, -69466, -61317, 9803, 66544, 61670, -5301, -68211, -55557, 8336, 66576, 62545, -8655, -65873, -59589, 4832]
388D832O1838j1201o1548n7546j023O9411N8098m551n8057o2567M723O0326N7620
401F0355M432o5318n5725L309M9870O1687J31n8518n3901n792N7979N4125k043
414E0591m6411o1003q33N8814M7739N452n1527n5450J762M6838N8953K195n7907
427g87m5610p885M8153O0283k382m7667n4841o843N3170M6550J1394m4737o2870
440e4072J720M5285M8805J4071m8690m9212q916M0442N8764j54l9416m4540j8822
453e4735M6671N0590M026l6877n3122m199L8965M4002J7841m6603m8993j56L1339
466a1251N1233J1543m1474m5085j5639M3279M8424L342k8128n3063j6061M4301
478h579M2475J4070l5542m8979q126K6946N2000J7208m2279l7334j4687K6465
$$ y = [4832, 66670, 55469, -6079, -63625, -64648, 4763, 62861, 58310, 253, -62314, -57591, 2735, 60355, 64787, -531, -56256, -52947, -3077, 58610, 58741, 223, -53678, -59470, -1491, 52634, 50591, 4180, -56823, -57656, 1158, 48897, 54349, 2822, -52628, -50866, -4028, 54925, 57120, -787, -46397, -54282, -6129, 54154, 51772, 4105, -50736, -57579, -4409, 42141, 53535, 8798, -54072, -52352, -7067, 41738, 55809, 7119, -42093, -51009, -10567, 48197, 48043, 8627, -35913, -54735, -8064, 42526, 46552, 9675, -43447, -47646, -8681, 35321, 53162, 6559, -42434, -42590, -11251, 39982, 51525, 10051, -35034, -50673, -7394, 41030, 44372, 16244, -36819, -52880, -8579, 33896, 47966, 12424, -36555, -44681, -17735, 34265, 51473, 9194, -28140, -42827, -16362]
490a6362N1716J0377k8558m6954j6653L8137L5128J5467k4286n3935p909L0818
502a3014L8979J7908l3450l8768j4947K4313N3958Q358l0948l4757k2532L1836
514a3064M4733J1789k3932m8669j1457K7359L4020K5861k9426m7301r433J9732
526a9788M3099J7682k6688l4812k2548K6641M4182P650j5375l8666k1649K8091
538a2181L5080J7645k2289m1849r787J5704L7639K2619l0685l4145j4569J6693
550b0125M2409J3677j8858l7482k1482K7845L3814J4946j2533m2817j7164K1008
562a6762L3836K1657k2112l4150j7103J1402M1388J7025k1485k8685k1005J6760
574a9234L4827J5880j2370l7013j6217J9502K7136K1480j5508l6928j3299J3849
$$ y = [-16362, 35354, 45731, 17173, -29781, -46434, -8297, 26831, 42298, 18012, -35923, -43832, -13014, 25965, 43873, 10423, -28345, -43292, -18979, 34979, 43337, 12389, -22368, -44900, -13064, 31669, 43458, 19526, -29143, -40600, -13241, 20779, 46640, 17214, -30087, -39520, -19788, 23311, 40993, 14305, -20507, -43055, -16414, 27768, 35418, 20043, -18623, -40272, -12181, 22899, 40544, 18255, -23594, -33381, -17677, 19962, 42581, 11896, -22249, -36818, -20125, 22284, 35961, 17103, -20379, -41861, -14016, 19798, 34744, 22211, -20606, -37770, -16762, 17074, 38731, 16619, -17531, -34634, -23232, 18156, 35181, 13696, -14989, -35994, -19234, 15593, 31473, 19103, -17910, -34127, -14625, 12511, 33991, 18483, -18445, -31744, -17895]
586a7895L3294J7257j8343k8412k0573J4624L6675J3253j2337l0974k0943J7195
598a7179L0416J9671j2598l4882j4298J0485K9232K2500j5187k9871j7294Q958
610b0047L1334J6463j0197k7446k1303J3730K8030J5377p125k9406j7137J1303
622a6424K6700J9528j2040k7615j5523P640K8677J7666j2430k5292j8647R186
634a8574K7632J6774p634k7977j8460J0371K4739J9501p257k7140j6724O484K5698
647G433J8904q012k3289j8972N428K5710J6212n890k3470j8257O944K1858J7336
660B1935n020k4016j5664N619K2049J8621o141k2473j6795M958K3856J5720n314
673A7335k1769j8411N392K1917J6597l404k2600j7717L977K1149J8750l340k1487
$$ y = [-17895, 15399, 32656, 14313, -14099, -34672, -20048, 16627, 29880, 17543, -13431, -34374, -17179, 13237, 32908, 20310, -14572, -28870, -18385, 10847, 33347, 18160, -11711, -29005, -20047, 11287, 27750, 17553, -9893, -31196, -17466, 10564, 25941, 18816, -10590, -27727, -16424, 10276, 29804, 17764, -9851, -25374, -17734, 10943, 28609, 16179, -9113, -27760, -18574, 9058, 25832, 18198, -9779, -28239, -17868, 6871, 26372, 19115, -8025, -24749, -18265, 7433, 26337, 18325, -4964, -23936, -18508, 7202, 23414, 17524, -5946, -24203, -17259, 4599, 21935, 16915, -7101, -22765, -17146, 4903, 23524, 17383, -5090, -21885, -16927, 6929, 22649, 17335, -4434, -22845, -17453, 4464, 21061, 17657, -4943, -22660, -18683, 2466, 21216, 17876, -3611]
686c611j6550J893K1006J8052l012j8936j8118K236J9861J6472j870j9183j7588
699a9348K758J7786J6910j904j9270j5851K094J8073J7132k179j8042j6095J447
712a6489J9177J6428j409j8190j6865J029J7720J6767k70j8170j7294J24J6662
725g80J7542k24j6586j6453o04J6024J7045P76j5160j6460j018J5283J6440Q61
739A6686j5106j6009p93J4753J5316O87j4912j5557j201J4937J5682J145j4895
752G33j5629j409J5176J5858J895j4280j6672j271J3763J6315K321j4124j6232
765a3556l009J3238J6447K387j2966j5424l310J2937J5239L009j1134j5838k698
778a4678J1903J4834L530j2397j4305l199J1207J5040K495j2000j4004l834J1907
$$ y = [-3611, -20161, -18268, 2738, 20790, 17778, -1158, -19276, -17040, 2821, 19293, 17423, -1760, -19348, -16590, 1196, 18106, 16202, -3068, -18919, -16825, 1248, 18380, 16201, -1841, -17936, -16489, 2688, 19116, 17707, -483, -17348, -16319, 1401, 18168, 17898, -272, -17566, -17442, -780, 16762, 16538, -48, -16501, -17105, -1081, 15964, 16740, 1580, -14880, -15898, -615, 15825, 16686, 1580, -14429, -15222, -469, 14847, 15534, 622, -14935, -16136, -1199, 14483, 15628, 733, -14896, -16305, -1129, 14729, 16624, 2344, -14328, -15599, -1836, 14479, 16800, 2676, -13556, -16565, -3327, 13120, 15507, 2541, -12883, -16193, -3256, 11983, 14992, 3858, -11980, -14678, -2775, 12059, 15589, 3192, -11113, -14312, -3105, 11935, 14430, 2430, -11574, -15408, -3501]
791c501J4856K657j0958j5109l419J2039J4438M423j1597j4884k860J0204J5092
804A1381M292j1160j4298m879J0086J4935L342r419j4250m909J0203J3057M953
817A3334r023j4069l368Q773J2986N629j0135j2744l851Q461J3871L331q660j2899
831h364n190R584J2781L504p780j3952m414R015J2645N676q968j3099l942P118
845e386J3987N057q593j1765n862P710J2544M652o275j3347n417P950J0532N615
859A1402o522j2431l797N847J2162M926p509r881n327O012J3148L166n961j1413
873f178n434P369J0504M859n603j3087l833O010J0734O480p176j0801m918M853
887f221J2353M785n310r424p444O451J0538M485l779j1274n374N297Q506P034
$$ y = [-3501, 11355, 14012, 3054, -12055, -15474, -3435, 11003, 15426, 3829, -11055, -13915, -3711, 11381, 15673, 4513, -9785, -14664, -4578, 10357, 13699, 4280, -9970, -14879, -4676, 8381, 13334, 4311, -9758, -13126, -4353, 8633, 14262, 4127, -8617, -12468, -4007, 9864, 13195, 4535, -8364, -13554, -3970, 8811, 12315, 4535, -9417, -13831, -4816, 7829, 13505, 4537, -8562, -12504, -5386, 8601, 13658, 5065, -6700, -12562, -4852, 7692, 12344, 6069, -7278, -12695, -4745, 5787, 11402, 4880, -7551, -11348, -5501, 6661, 11587, 4078, -5803, -11130, -5118, 8030, 11196, 5235, -6178, -11612, -4243, 6261, 11120, 5517, -7570, -11403, -5393, 5341, 11821, 4645, -6156, -11074, -6221, 6132, 10917, 5607, -3817, -11261, -4810, 5728, 10213, 6434, -4840, -10214, -4917, 3589, 10623]
901A0623n805j0463l472K887J0495N753n862q367o022N148J0251M049k977j0157
915c919o274O288Q303N336l358j1444m260L183R672O455n403q106n539K127J0645
930C706N341l368q174o881M330Q002N620j758j0061m605K995P107O674l853p822
945b747n005J450R356M883l375o992o609L420R014M059j307q802n355L401P029
960B420O395k463r065m628J066Q116O552l119o886o626J790Q765M313o05p276
975a251o904K968O503N577m53q160m529J194O321O646k989o169m703o9P703M772
991F457j592o064o647K522O520M849k84p485n134J719O046O358j564o773m937
1006f009j0P375N458j496n519o474Q31O706M755n5n773o163J106N200N820K15
$$ y = [10623, 4818, -5645, -9117, -6230, 4265, 10018, 4156, -4211, -10233, -5085, 5166, 9215, 6238, -3919, -10193, -3905, 4398, 9734, 6376, -5068, -9328, -6145, 3527, 9982, 4579, -3527, -9066, -6939, 3706, 9047, 5679, -2495, -9376, -5046, 2956, 8576, 6818, -3243, -7848, -4853, 2254, 8928, 5075, -2747, -7752, -6302, 3054, 7937, 4562, -2430, -9039, -5619, 3395, 7454, 6147, -2655, -8010, -4609, 2420, 8815, 6352, -2713, -7341, -6275, 1841, 8393, 5274, -1612, -8238, -6448, 2317, 6630, 6025, -1251, -8155, -5187, 1316, 6893, 6440, -1720, -6249, -5055, 1266, 7912, 4923, -1246, -5949, -6018, 1685, 6457, 4865, -1199, -7846, -5324, 1196, 6045, 5761, -1724, -6858, -5139, 907, 7265, 5701, -1072, -6009, -6019, 1356, 6814, 5318, -201, -6675, -5844, 862, 5617, 5562, -211, -6374, -5268, -68, 5752, 5967]
1022E967o473m560L8N556N950j481m942n381N6O292M411m26n134n839Q00N327
1038A61N375q5o426m621M93M843O216m90n461m802n23N433N432J90m932o377K32
1055e342N318M457R18m973n365q6M493N239K76n002m138p40M809N421k33m556
1071D96n124l44N054M476N21m741n263N6M434N091L10m992m788m12M482N389J94
1088D839m186m762j060M639M980M90l670n272p03M055M474R99m199m470q10L500
1104a156M577Q29l918l982r74L800M613N66l390m774m02L570M448Q17l656m676
1120c708o79L351M575R45l795m580q56L451M774Q82l420m130j308L514M197J294
1136D507l038m359j078K799M407J067l228l954j045K769L979Q75k968l688j211
$$ y = [5967, -506, -5066, -5028, 528, 6478, 4997, 55, -5326, -5270, 1022, 5433, 5007, -127, -5966, -5166, 161, 5536, 5451, -975, -5596, -5103, -260, 5956, 5466, 5, -4797, -5320, 113, 5545, 5735, 803, -5574, -5342, -24, 4433, 5351, 378, -4987, -5073, -580, 4659, 4935, -67, -4205, -4945, -136, 5285, 5052, 496, -4628, -4972, 82, 4558, 5079, 338, -4925, -4869, -435, 4656, 4966, -26, -4814, -5226, -744, 4645, 4839, 653, -4109, -5169, -530, 4450, 4940, 1270, -4002, -4705, -650, 3824, 4823, 624, -3846, -4656, -1156, 3421, 4250, 332, -3650, -4624, -824, 3789, 4355, 965, -3809, -4211, -641, 3807, 4624, 968, -3708, -4387, -1036, 3539, 4484, 689, -3891, -4747, -1296, 3478, 4360, 940, -3190, -4498, -984, 3213, 4507, 1469, -2890, -3968, -1169, 3238, 4305, 1077, -2877, -3922, -1153, 2826, 3701, 733, -2955, -4166]
1151d166L101L870J230k960m053p98K880L793J466k871m485p82K447M107J437
1166D216k819m156j556K640L805J807k464l949j714K302L990J568k300l745j317
1181c692K356L443J672k092l944j080J999L507J282k259l277j804K139L662J139
1196C051j962l565j322K328L632J535k117l449j586K004L541J765k063l698j567
1211c473J543L776J724j708l297j962J599L053K269j742l229j680J155L571J820
1226C419j631k680j912J220L304J674j550l114k030J668L339J590j775l044j809
1241c331J691L309J632j529l060k135J420L433J983j146l265k062P16L464J829
1256B949p46l136k276Q24L175K051q83k941j836J040L113J718j320k284k033R66
$$ y = [-4166, -1065, 2805, 4035, 1075, -2978, -3776, -896, 2897, 4363, 1492, -2993, -3775, -1328, 2779, 4216, 1397, -2759, -4315, -1675, 2130, 3937, 1473, -2476, -4190, -1888, 2102, 3670, 1370, -2375, -3692, -1336, 2107, 3779, 1687, -2257, -3337, -1338, 2169, 3451, 1192, -2085, -3889, -1750, 1912, 3051, 1089, -2476, -3798, -1470, 2162, 3697, 1580, -1869, -3455, -1451, 2090, 3855, 1792, -1906, -3473, -1930, 1846, 3570, 1862, -1435, -3397, -1798, 1255, 3524, 1782, -1447, -3127, -1972, 1599, 3419, 1788, -892, -2804, -1584, 1720, 3394, 1844, -1270, -3300, -1632, 1707, 3297, 1522, -1522, -3331, -1640, 1669, 3301, 1772, -1288, -3423, -2003, 1430, 3413, 2267, -998, -3060, -2344, 1120, 2949, 2203, -933, -3209, -2385, 790, 2841, 1958, -983, -2819, -1779, 1334, 3052, 1732, -552, -2585, -1619]
1272a619L132J389r12k813j965R03L039J865j125l127j532N07L129J971j245k455
1288h58k152R80K973J827k67l291j814N47K970J701l77k831k197N70K594K074
1304B449j018k182j938O42K619J733p58j999k320J093K367J412q3k391j989M67
1320a896K568J968p89k797j459M09K450J923p01k074k285O43K449K111j97k576
1336b53k169N70K178K242n86k292j669K91J679K100n12j703j951J08K182J613
1352A828j32j908k181Q20K118J475q8k106j811K01K159K081n78k011j789k41K513
1369C50J804n32j589k232O0K286J638K06k114j994L44J693K028J59j875j990O1
1386a697J452K135j53j458k096l5J847J472k5j760j552J73J460J954N2j932j298
$$ y = [-1619, 1513, 2902, 1990, -823, -2788, -1885, 1154, 3019, 1894, -1233, -2765, -2258, 871, 2842, 1597, -858, -3010, -2030, 943, 2770, 2503, -788, -2602, -2055, 915, 2616, 2239, -592, -2789, -2219, 375, 2449, 1431, -751, -2689, -2047, 572, 2305, 1547, -452, -2772, -1679, 688, 2100, 2017, -374, -2363, -1896, 672, 2640, 1851, -946, -2405, -1996, 454, 2377, 1676, -398, -2683, -2040, 409, 2520, 2323, -253, -2422, -1852, 326, 2568, 1982, -310, -1979, -1688, -9, 2091, 1579, -124, -2075, -1967, 215, 1828, 1696, -212, -2393, -1573, 545, 2020, 1932, -174, -1985, -1784, 375, 2456, 1878, -133, -1922, -2163, 350, 2154, 1622, 33, -2199, -2139, 147, 1785, 1991, -123, -2117, -1773, -80, 1948, 2107, 232, -1758, -1697, -245, 1890, 1737, 279, -1817, -1852, -5, 1467, 1442, -318, -1870, -1697, -237, 1717, 1769, -163, -1461]
1403a461k47J659J905n9j665j953P7J838J636m0j423k192l0J687J426O82j702
1420A38j557l89J212J936M82j582j426m96J481J569M20j399j926j60J517J410
1436A230L74j205j865j47J498J138O18j370j321p01J495J840J40r67k137j89J335
1453b34J613L16j109j808l28P77J743P86j316j646l26Q16J741O34j127j377p28
1470a573J085J446M54m66j916k11Q77J322M02j289j423j35R56J423M66j149j292
1487a023n86J265J356M27o82j732l88R01J552N00p72j637o54O06J624N00n07j187
1505d37j158P51J580O79o50j392q57J010Q62J044r92j248l15O47J413M76q58j388
1523h33m44M67J613L16p40j245p13P89J512N53m11j728m87Q42J223O52o89j237
$$ y = [-1461, -1708, -49, 1856, 1797, 132, -1821, -1744, 94, 1730, 1690, 267, -1925, -1955, -268, 1158, 1840, 138, -1419, -1808, -596, 1340, 1822, 240, -1186, -1682, -201, 1368, 1788, 389, -1537, -1697, -180, 1230, 1604, 399, -1466, -1613, -115, 1023, 1641, 271, -1050, -1751, -256, 1584, 1724, 757, -1380, -1569, -234, 1379, 1695, 586, -1222, -1550, -773, 970, 1756, 440, -1206, -1532, -716, 1025, 1659, 532, -845, -1573, -488, 958, 1412, 946, -970, -1181, -304, 1018, 1420, 131, -1292, -1427, -471, 952, 1418, 269, -1023, -1609, -344, 1012, 1439, 757, -975, -1363, -462, 1090, 1590, 818, -819, -1473, -867, 757, 1257, 750, -437, -1595, -844, 736, 1415, 765, -627, -1484, -474, 388, 1432, 440, -808, -1123, -476, 937, 1413, 555, -833, -1277, -810, 803, 1119, 379, -866, -1579, -790, 722, 1275, 864, -864, -1351, -509, 714, 1366, 677, -560]
1541e60l23j36J590O99o59j087j192P85J351N62m76j190m78K04J402O30l89j240
1559e07n31M15J167O07l13j153j131O05J544O40n12j262j002O57J231P52m18j350
1577e61o23K70J315P56m90r27o81J33J210Q25k88q83r72K41R69Q49m96r40q43
1596a136N44J048N11l62q38q18L47J173O44n21p71n47J77Q67Q61n36r20r61L26
1615i12J320M90j02j148p08K60Q75P22L7j074o74K10J021M22Q1p68r32P6R67M97
1635F60N7r12o84K16N74Q11l92n65m40l79J082P13l9j028m67J59P19J094m99p62
1655h2n77J12N56J052n07q14n69j3O93J061l59n05n50l29O82O52J82q80m98J3
1675f80P62P23j05m42q23J91M56M82P5p23n36J02N69P70p2p82o75L0P91Q39l19
$$ y = [-560, -883, -1019, 571, 1270, 611, -476, -1668, -883, 468, 1030, 554, -636, -1114, -910, 492, 1122, 733, -507, -1038, -623, 544, 1151, 838, -315, -1446, -841, 703, 1343, 831, -431, -1433, -776, 455, 1207, 789, -561, -1184, -914, 401, 1157, 667, -260, -941, -808, 402, 1227, 939, 56, -916, -675, 294, 1143, 647, -293, -1136, -592, 456, 967, 605, -233, -1051, -704, 469, 1113, 592, -179, -726, -549, 318, 1179, 643, -277, -1238, -912, 408, 898, 796, -352, -1060, -800, 75, 797, 834, -240, -914, -704, 317, 739, 820, 52, -880, -804, 163, 660, 717, -195, -879, -663, -89, 722, 330, -235, -675, -1054, 28, 741, 702, -326, -793, -634, 85, 1179, 680, -82, -659, -547, 9, 1061, 554, -260, -829, -842, -149, 912, 553, 48, -502, -831, -149, 503, 685, -195, -693, -680, 82, 805, 700, 258, -565, -374, 82, 564, 639, -84, -620, -518, 51, 821, 749, -33, -708, -678, 113, 952, 633]
1696F33n35r15R0N58Q68M5p37n00l63O85P40q7l18o62l92P02N51K76n68p14M9
1717e94O63N92o5k49r96J16N93L26J61n91p61k45P87O04K91n78o08p2L29Q65K60
1738H28m70q34n4L01Q07J37n57o28j65M05M16L48m05o23k83O76J56N46k54p36
1758c89k2r3P77M16m90l47l30N64K98J30m45k90k58M49O17j71j38p40J2L55L51
1779B56L43j51o74j03J61M59K30l90j47m63K14L97L85k32o23n0K55L02J46k42
1799G3m63j38L38M22O00m92m57j71J00N53J41j31o06n76N62L51N94m55m49j59
1819c63R1N76L40l08l20k82J3K22O76l27k55n38J28N47K12l7o75k45K51L37L18
1840C61k26o09L7P2N38K84o1n12l98K03N14L07k82m03l10M66J16K81k13n44r0
$$ y = [633, 98, -817, -727, -169, 699, 744, 7, -493, -856, -171, 569, 482, 164, -498, -890, -188, 363, 639, 71, -643, -594, 69, 661, 596, 347, -649, -533, 60, 386, 547, -44, -805, -1050, -263, 341, 632, 54, -554, -626, -297, 568, 828, 358, -476, -530, -229, 578, 715, 158, -470, -635, -230, 186, 534, 129, -494, -777, -101, 55, 601, 347, -389, -411, -504, 273, 689, 199, -148, -478, 86, 384, 514, 69, -221, -479, -30, 587, 416, 278, -462, -450, -95, 256, 599, 448, -226, -329, -168, 291, 521, 131, -16, -479, -265, 132, 517, 285, -338, -388, -133, 169, 315, 73, -390, -528, -190, 232, 832, 340, -117, -288, -188, 365, 506, 375, -231, -807, -245, 106, 700, 245, -204, -363, -272, 304, 644, 336, 16, -266, -253, -31, 645, 318, 63, -475, -347, 200, 412, 375, -300, -545, -294, 43, 361, 135, -474, -437, -365, 173, 457, 396, -116, -514, -311, 203, 510, 228, -175, -485, -19, 97, 378, 165, -379, -469]
1861d69J75M11Q3k27r3j85j29N27J19m6j00k51J7J70P7O0j24l88K36K64K80k12
1883A95k01m31kO24K83r7n44m20K72M69K8o1j69l94K42J10N51l00q6o7m85N98
1905A15K52r1p6l88kJ14L54k13K4m00J36K63L2J68l64j88j2P7O56l23j92k10m7
1928c15M66N4L56l14q17M75M1K42p0N5m56J44%L95P3l39l33J63L61J8kj28j15
1951d6k18M12j22j00K29m29N4K51J32O0k46j88J76Kj2L59j42j37k33P3J37J66
1973A78j31l39J10K02K64j19k53j16j45L00p9M47m36%j51J86L55j73j91o4j17
1994b72J40L36K19m04j29Q3k40K77M23l93n4r3j1L21M7J47n51L1RK35J81n16L5
2017a79l24J65O54k41j83o6k09J69K01J33o5j26j15p2K95J69j88L8kj43K07j98
$$ y = [-469, -294, 117, 200, -27, -120, -305, -434, 93, 212, 166, 66, -185, -168, 2, 79, 139, 15, -373, -137, 127, 407, 195, -6, -437, -439, 185, 468, 371, -173, -593, -321, 148, 176, 115, -54, -448, -206, -96, 455, 155, 69, 2, -483, 115, 367, 276, 200, -188, -190, -76, 278, 65, 89, -311, -175, 88, 120, 288, -76, -264, -276, -199, 457, 134, -58, -268, -315, 151, 205, 561, 247, -570, -95, -54, 188, 118, 173, -283, -139, -139, 256, 329, -10, -343, -180, 181, 199, 197, 69, -46, -264, 148, 26, -74, 155, -274, -220, 31, 163, 223, -23, -211, -35, -33, -45, 314, 172, 35, -198, -125, 12, 178, 47, -292, -182, 20, 284, 165, -88, -204, -349, -49, -128, 319, -117, -117, -268, -82, 273, 100, -91, -155, -272, -132, 204, 423, 19, -110, -27, -267, 10, 433, 40, -14, -107, -118, 203, 250, 397, -154, -123, -114, 121, 302, -214, -179, -503, -338, 316, 75, -108, -174, -383, -214, -13, 120, 55, -71, -186, -258, 37, 206, 18, 56, 54, -89, 118, -80]
2039h0K21l64k01K99L47l37K15k13K08m7m4L78m29J33k87j06M01K9J00k70j69
2060b16P5Q6J02p9k54L53j03K60m6j68k69K42q9N6R5Oj06J35j47LO0L9k51L85
2084A69m85L70J3j20J91l05j9J56J90j54k1k82L19J14J97k52J43j84l56L43M0
2105F7K6k77K8J80m5K14m35K24Oj09J24L0K38k13m5J46j80J54j44j92K60j4j9
2128B4K46k03k49n7L56k80P6K44k35k5j20K7L67o8j55Ll61M80mo1r5k00K56n8
2152i2J21N32n15j47L1J22J17j15k19J89l4k82L53l8Ok02O5J43N4j03K33m21L52
2175A50n12N26j5r1k19qL47r6q5Q4k21M0m2K07j18q4P7r2M9J58K34l38K7n8j07
2200a87K58lO9l51K82j01J10K16k77J33k42j04K42K73m12J4l7J09R6Np5j40P7
$$ y = [-80, 141, -223, -424, -125, 222, -115, 100, -113, 95, 48, 4, 382, -47, 86, -201, -307, 94, 123, 223, -47, -216, -141, -55, 47, -32, -286, 67, -36, 224, 178, 10, -259, -17, -106, -50, 45, 51, -55, 80, -67, -64, -4, 35, -216, 169, -316, 54, 67, -53, 138, -167, -186, -30, 160, 6, -15, -297, 22, 136, 333, 81, 224, 40, -316, 27, 67, 93, -184, -156, 24, -21, 193, -242, -18, -12, -121, 3, 33, 271, 58, 13, 159, -21, 133, -11, -203, 57, 43, 24, 270, 67, -182, -239, 117, -163, -87, 157, -78, -103, -223, -196, 171, 103, -52, -49, -410, 70, 66, 5, -90, -290, -34, -92, 29, 561, 46, -101, -70, 52, 169, 54, -165, 24, -10, -292, 61, 23, 29, -173, -108, 35, 89, -14, 219, -202, 150, -362, 164, 149, 58, -161, -169, 178, 82, -3, 81, -140, -100, -142, 65, -53, -137, -60, -152, -103, 55, 289, -49, -22, -80, -187, 71, 68, 137, -214, 68, -33, 77, 293, 16, 149, -93, -197, 45, 318, -94, -80, -117, -8, 88, 93, 18, -122, -45]
2223d5L4n1K49r5k99JJ14Q8J76k3j93K82n23M56k06K9J88l38RK0J93k58L02j58
2247d8J55J82k37O3j26k13L25j60J31p5j6n1j01N3J47k78P06l65j55M06l74K04
2269A73j92j07J26J71K42j29l79j28K42n2L6Q5j78J54o9j7J09J39k88K1J1L87
2291C57m00J76o7m8J42j46Q5oo6k74K4K60P3r3p3j91n6K01K92M7k41J27m4m11
2315c32K55L04k26q7K68j73J57l40J54j10mK04j68L58q8l48J32J8J06R7j82r0
2337i5J08J17J46k9k12R5l13r8L09j16J39J35j14j19j97L3L20m2k39O4J85k1J45
2360B01n5l00Rj8j11N46k15P3j39n9L59j29l71J83j96K1J53J75j96o8O7L36q3
2383A83j10P9j71J15j64J77K33m78J62j67K33n0j18q7K02j05mK01k33R2k3O2k06
$$ y = [-45, -11, -62, 187, 92, -207, -206, -92, -4, 172, 149, -44, 238, -285, 171, -35, -6, 182, -156, -147, -127, 66, -192, 110, -48, 107, 289, 52, 115, -11, -224, 101, -59, 72, -3, -19, -70, -171, -118, 29, -249, 457, 92, -63, 343, -31, 173, -19, -126, 0, 171, 413, 284, -95, -223, 19, -33, 3, 88, -90, 64, -5, -22, 87, 226, -62, -41, -30, 357, -43, 133, 66, 18, 160, 14, 99, 93, 27, -247, -223, 37, 110, 17, -56, -247, -303, -102, 190, 237, -4, 123, 79, -332, -77, 227, 1, -86, 182, 9, 166, -174, -20, -130, -134, 70, -98, 260, 172, -176, -44, -26, 80, 177, -5, -95, 13, 130, 276, 247, 35, 130, -183, -281, 28, -88, 51, 186, 72, -47, -244, -211, 109, 67, -172, -108, 77, 56, 201, 146, -154, -145, -163, -274, 272, 57, 130, -9, -68, 291, 162, -209, -26, -222, -201, -48, 127, -69, -137, -70, 266, 183, 73, 152, -19, 96, -68, 109, 342, -136, 26, -141, 92, 42, -76, -163, 39, -66, -70, 131, -102, -10, -33, 29, -177]
2406a77K88j40n9L6k08L87p4j32n8K30P7PQ1j92l1l78L34R8l3L0k4j14Q4K43m54
2431a79J61m6l15L71J69j25K03k41J70l19J92l9q8L50m62J89j5k0J44n2j73K4
2453a01J39j07J35k68J43o8r7M7M24j88l69N96l27p6P6kK27j98kL75k15r2k96
2476b44J27j40J62K04k04j1R0l1K71k18J94j40o1r7L51k52l0K41k44%k8M2m7K49
2500A84j19L78n29J07P1l41L45j55J46k6O1l80j44P26k7k41j92k3j46K82j35J96
2522C8m6k12r2l1L44N5k0O0k8l59L16L2lk26j73K05J96j2l2j5j0j77K30p0K6N0
2548D6k35J49J49r7P1o2K1k98J44L47k14K10m39NK46J46P0k11J07k99q9K50K09
2571B26k18k0Q2J97l33J36k03k72M61l85K76M7j31J02N2j0PJ41J90j70r3j40J88
$$ y = [-177, 111, -29, -88, -52, -260, 127, 53, -79, -137, 93, 170, 177, 258, 66, 35, -343, -9, 89, 56, 86, 62, -52, 32, 275, -179, -18, -64, -379, -8, 161, 36, 239, -2, 168, -151, 41, 2, -86, 264, -198, -9, -24, -44, 100, 48, -125, -101, 38, -69, 66, -202, -59, -127, -224, -177, 247, 59, -310, 286, -41, -117, -41, -43, 184, -14, -16, 359, 144, 52, -244, -117, -257, -95, 109, -95, -106, -16, -47, 224, 6, 200, 60, -1, -98, 253, 1, -29, 212, -32, -32, -60, -18, -65, 184, 65, 443, -86, 21, 92, -249, 96, -59, 87, 61, 122, -258, -402, 324, 297, 56, -136, -159, -305, -23, -158, 38, -8, -220, -312, -343, 1, 56, 36, 96, 68, -291, 25, 57, 54, -172, -345, -140, 56, 44, 12, -3, -13, -190, 40, -30, -4, 46, -189, -40, 109, 12, 83, 21, 42, -256, -112, 235, 21, 231, -208, -203, 43, 189, 259, 48, 155, -144, -233, 17, 226, 8, -12, 70, 267, -66, 70, -133, -405, 56, -329, -53, -6, -137, -35, 17, 7, 14, 155, 345, 175, 82, -58, 130]
2594A30j79Q8L0N3l52L06K3r7J34r3J57k11k3J06j97j4Q0J67j34J89j56n3K24
2617A78k51J80j8r5j08r0J88Kj87J05M3J65l07J03j89L67l34M21k2nk38J35o6
2640b3J16k21M16k56K9l4k96J70L00j8l73L35k12J67o2l0j07Q6P8l64J59R0p9
2663a29J40N7M4j02o1k04J44J96m0N3l49oJ83J97n6j01j85K19OK88j82j3Pl85
2687b79L39j99J27L01j53k27r7J01K78l36L61l57o6J59K68l84J83j31L9J59j58
2708g2K25j18j40Q1KPk3K02Q7n0l27J71l6j29N8q2J26NK76l19n4K14j20K08k10
2733a8j00R2o1J32J80l11o2k3J08k32N33j52k40q6J69o0j26L01q8N3J65q9J6k9
2757G2O7j51j73K31k98L88k6k93L50l79M64j61q8Q9j78J87P4R2J23l70j19K44
$$ y = [130, -49, 39, 69, 122, -230, 76, 99, 2, 136, 43, 200, -11, -34, 72, -125, -139, -59, 108, -26, 163, 7, -46, 178, -73, 107, 89, -6, -114, -204, -16, -14, -201, -96, -53, 112, -195, -92, -281, 86, -248, 173, 151, 146, -92, 43, -23, 93, -128, 288, 32, 61, 27, -269, -99, 201, 183, -190, 145, -67, 100, 38, 8, -99, -13, 65, -299, -140, -50, -129, 11, 68, 112, 10, -51, -255, -111, 85, 45, 98, -251, -257, -74, 123, 67, -34, -219, 0, 6, 294, 112, 99, 106, -279, 60, -139, -12, 289, 136, -91, -188, -87, 191, -145, 216, -141, -207, -48, 220, -164, 19, -112, -73, 86, -72, 153, 35, -105, -24, -22, -15, -38, 164, 251, 201, -126, 45, 9, -120, -62, -144, -18, -13, 263, -56, -110, 104, -16, 192, -18, -118, -26, -87, 45, 225, -86, -148, -171, -63, -295, 238, 86, -154, -240, -71, -131, -257, 44, -44, 9, 174, 85, 101, 72, 139, -12, -185, 46, -252, 136, 110, -183, 167, -212, 252, 91, 3, 92, -86, 101, 175, 267, 390, 20, -99, 145]
2779A45J34j11k24L24k32K2k40R4P0j4Qj71K67KN6k11l1N1k1O7J78l20J34J0J61
2804A48M1l15K5J06LJ9J8k35K38l34K23L48m60L37o9j36J71j72L4L5K9l94J72
2827a68OL9M7M4J16J06M2j6j99k50O7J22l8K65k3p2k10J30J91o8j00k05pK9L68
2852B16n1J7k15q8J08j66J20K18k23k16K60K6Q4j4m03N8J60J61K83k53j20J30
2874I2R5n0PJ30l68R7m4K05j57J10k3k22J92k11K61k9rj70J6K5Q9p6J38j72J54
2899H0j17o1N9J79kk14J05Q6o0k39M28l61L20n2o6J04k97L6L38j38J13k16O3k12
2923a24J8L16j21l3rnJ2m5M0rr0K9j43K34K4k07J67r7J57r3K08m13K26K01k85
2948d2K09m15M43m29K03J08J64j4m24K40k10L04Pj5l8j25k35K50J4j50J68j74
$$ y = [145, 279, 168, -56, 268, 36, 58, -182, -88, -18, -32, -24, -195, 72, 74, 130, -81, -112, -61, -82, -15, 163, -157, -23, -13, 148, 189, -126, -101, 5, 8, 27, 45, -190, 48, -286, -63, 285, -175, 162, 93, -43, 128, -44, -10, 25, 54, -340, -168, -162, -123, -76, -32, 84, 190, 232, 216, 17, -233, -166, -44, -82, 183, 160, 88, -122, 8, 199, 131, 31, -174, -181, -152, 216, 165, 182, -33, -121, -13, -179, -59, 159, -64, -280, -20, 6, 90, 76, -327, -269, -109, 52, 335, 82, -38, 92, 187, 137, 144, 274, -94, 3, -41, 164, 7, 117, 94, -128, 64, -147, 114, 85, 76, -94, -78, -53, 36, -40, 98, -74, 80, -37, -98, -39, 140, 138, -76, 29, 115, 55, -184, 244, -117, 203, 151, 85, 189, -108, -72, 266, 128, 241, 25, 88, -124, -106, 210, 89, 56, 47, 42, 54, 9, 49, 40, -50, -21, -164, 70, 94, -113, 54, -43, 114, 21, 229, -184, 42, 243, -42, 167, -248, 195, -234, -31, 77, 241, 227, -197, 43, -167, 137, 144, 129, 91, -34, -269, -19, -5, -155, 13, -161]
2970a61K12K23k97J41j79J52J4j60L32k66J06r9j66J17knJ88j02J30j54k12K05
2992A7K9L3k08P5J87Q5j87j7o1K06o7K63l96L6L6o2j33J85j89M1J55Q7Nk04K12
3017A28o0q4lm3J4j43j07L89k44L25k08J53p2k97K74r0j14K90k11J35j74M35k70
3040B3k62J09J34k19J52J92l13L54l69L06n4M8j04J52k94K31k10J12j2N6j3Mj85
3063a62L64k15o6K53k24K25m1Pk81mJ59N7j54K77j74j45K96k37K54J29j00l73
3085a55J78P7r0j7j22J7J03P6p0l8j31J1J20j84OJ37R9r3j8J54M4Ql2l22K50m0
3111c2J47k37O0J92j77j07J81J34L7q3k91J02N3L7l7p6PJ32K33k11K02k29J2n1
3135bj26j3J73k12J45J64k03K97j33J80n05J18K78j09J64l45J10J42j75j87L64
$$ y = [-161, 51, 274, -23, 118, -61, 91, 105, -55, 277, 11, 117, 18, -148, -31, -33, -38, 150, 48, 178, 24, -188, 17, 46, 79, -129, -54, 133, 218, 31, 14, -47, 159, 92, 355, -41, -5, 31, -31, -164, 21, -168, -127, 28, 115, 120, -84, 128, 68, -16, -19, -62, -48, -191, -298, 91, -153, 172, -36, 117, 45, -252, 22, -68, -182, 108, -103, 32, -142, 293, 23, -239, -130, 4, -215, -63, 129, -184, 170, -199, 107, 53, 101, -3, 149, -145, 86, -124, -12, -24, 32, 19, 23, -162, 202, -13, -79, 174, -50, 175, 134, 141, -140, -144, 15, 72, -82, 195, 21, -124, 172, -65, 189, 318, 218, -155, 23, 100, 10, -7, -129, -112, -9, 67, -3, -41, -172, -161, -41, -225, -219, -82, 17, -76, -94, 60, 104, 112, 80, -242, 8, -32, 115, -122, -62, 130, -47, -154, 27, 161, 198, 115, -176, -74, -21, 16, -21, -97, -90, 42, 275, 64, 266, 37, 49, -2, -128, -141, 32, -180, -35, 129, -74, 223, 90, 270, -235, -117, 161, 52, 216, -129, -19, 123, -52, -239, 125]
3156A25k90K65k54J41K3J56k63Q3n4o4P2l8L2Q9L14m3j90l5l7O9j31n9J07M9m02
3181c35L36J96n2qj57r8Qm8l5QM1K83j35j8J65l26J21J35j46q4L4J63J14l39Q2
3206i5J5Q8j4J14k24J22q9r5K07k21l3J26J87l2J81k94O9K28l36R5j4j52K66p9
3230B0J99k73P4j6o9j04K39Nj61L7j23J23j56K70J06j44K82m56J01J4O5k7k16
3253b10J83P3k53K31J45m44K91r8K01j33q6j29K39l9K36l76NK65M3q9O4Q1l67
3276a67J59J53q0J4j4n9N6j30K12j16j02J56q0j40J85K0r3k3k4l4J32j61K76R
3300A49K2k90J45J25o2o4J4n4J91j28m5K8Jr6j92L94l19K20q8k77M11J11k30J50
3324A16qo0m3n5J82k24q3J24J10n6m4P9k45J67J67J06J03m55j27N87m77j49L25
$$ y = [125, -165, 100, -154, -13, 10, 166, -97, -14, -68, -132, -60, -98, -66, 23, 337, 294, 104, 69, 32, 101, -30, -89, 18, 67, -335, 1, 197, 145, 137, -20, -118, -110, -158, -193, -185, -144, 139, 4, -14, 151, -175, -54, 81, -65, -149, -115, 48, 162, -177, -95, -80, 8, -6, 108, -116, 6, -83, -178, 29, -192, -225, -99, 88, 56, 237, -57, 12, 240, -96, -1, -15, -167, 99, 20, 219, -54, 20, 4, -65, -169, 70, 75, -86, -49, -172, -49, -205, 65, 171, 27, 309, -147, -46, -32, 33, 6, -210, -27, 46, -207, 24, 169, -275, 16, -82, 119, -14, -100, -229, 10, -29, 207, -169, -164, 101, 144, 55, 119, 200, -167, -8, 145, 65, 79, 65, 6, 62, -68, 144, 28, -74, 82, 2, -138, 47, 67, -26, -49, -73, -107, 25, -136, 140, 149, 171, -119, 26, 151, 89, 25, 39, -15, 176, 48, 3, 31, 32, -64, -256, 138, -181, 39, -49, -326, 85, 196, -34, 116, 108, 48, 5, -50, 132, -92, -175, -51, 59, 3, -41, 38, -207, -40, 127, 233, 336, -119, -246, 341, -136, -285, 40]
3347D0k6j77K20k21K12J99j35J12m15K57r3J24L3p2q0J48j08K96k10j36J33k90
3369a89J41j14P6o7l7K09k1j42OJ80J55o2P8k67K36k40o5o6K92n6j06%L2j43K67
3394I7J8j71L09k52j37P2J41k23j42L12LP1j15K4N7J34j19j65L99l52M51n35J21
3417brj8j5o6K25j48P0J4J37j18K7j84o5K34j42J8J34j67L66k36L18n52J08J3
3441e8J39N7j07k4J65j78Q4Pk34J11J86n6k37M6l4l4J16N9r4J56j40L8J19j92
3465a05J89J21j22R5j67Q5k37K47k89J03M0NK02j59k3J65j23n1L1J5j9j17L24
3488B10k32l0R2p4J87o8l35J62m5Q9J75j20Qj1j42J96O0O1K77n35l04L75K91k94
3512gP5j88l2Q7j15J98r3OL47k64L9M7l0j70j98L07n8k0J2l1p2K86n2l46P1J42
$$ y = [40, 14, -163, 57, -164, 48, 247, 112, 224, -191, 66, -27, 97, 130, 58, -22, 126, 18, 314, 104, -32, 101, -189, -48, -162, -86, -153, -190, 19, -2, -144, -138, 42, 197, 135, 213, -54, 182, -58, -123, -189, 103, 47, -59, -59, -27, -170, 97, 115, -56, 253, 1, -136, -64, 77, -146, -288, 24, 27, 98, -17, 7, 64, 198, 79, -86, 313, -39, 412, -123, -2, -11, -29, -44, -110, 115, -33, 37, 51, 188, 70, 97, -87, -152, 82, -60, -42, 92, -75, 291, 55, 373, -179, -71, -58, 81, 138, 31, 7, 172, -6, 78, 85, -149, -38, 148, 92, -145, -99, -133, -167, -51, 8, -86, 70, -70, -32, 87, -105, 84, 205, 83, 178, 11, 96, -141, 106, -183, -80, -40, -35, 167, 8, -15, 150, 27, -24, 7, 22, 3, -114, 210, -22, -52, 40, -34, 153, 85, -250, -88, -133, -44, 131, 11, 19, 8, -134, 62, 122, 183, 460, -75, -379, -4, 287, -7, 68, -120, -152, -65, -180, 18, -75, -69, 278, 14, 53, 100, 70, -100, -298, 9, -49, -69, -57, -88, -160, 126, 74, -272, -201, -59]
3538e9J01j43J64nm00L18M4q1Q9k12J40k1l74K37J50K32j43J21j62J13J20l67
3560a38L54j53P1l44K22j89J15kOK7J69k14j73L91o2j9q0j94K88k01K77j92k27
3583b68P6L07j35r1L9LL19n9j63k12K33J70l46K57k34J77O9j60o4J57j47K3L27
3606B78n44J50J64J99l04J39o9LK0j61p2N0J47N4r4K29l13J40l3M5J10k03K09
3629A44k25N5j15L19M1j44m1o7J45j83J5l1J27p4J19j74M7n6j4o1O8Q1l9m3K40
3654A34k07P4M4n9J34M2j14q9K04Ko1r3K27k67J08M7m40K45O6L0j0q1%o3K1l0
3680a36J34RL7o8K1K4l4K7l20M07J0j85J44k78K92Q1j02j42r0N20l53R5q1J13
3704A25k12J74k13K34Jl26J77M4M5J06j41Q1k49L85k64R4j51K44k12p2rK09l9
$$ y = [-59, 42, -101, 63, 58, -342, -24, 20, -61, 28, -184, -44, -65, -439, -202, -52, 180, 37, 158, -4, 109, 229, -138, 216, 63, 134, -210, 12, -177, -62, -64, -58, -31, 138, -76, -249, 142, 80, 61, -19, -213, 75, -126, 151, -41, -268, -192, 115, -20, -111, -72, -69, 250, 191, 28, -184, 49, 219, -127, 130, -104, 73, 142, -18, -82, 75, -72, -49, 278, -266, -116, 48, 247, -57, 82, 13, 16, 36, -125, -197, -147, 0, 54, -40, 189, -124, 16, -17, 28, 138, -65, 144, -81, -26, -141, 178, 219, 75, 34, -33, 112, -71, -56, -87, 40, -34, 85, -89, -42, -98, -112, -173, -105, -24, -63, -106, 134, -73, 1, 45, -14, 120, 162, 48, -41, 163, 165, 104, 11, 238, -29, 79, 126, -314, -69, -3, 27, 17, -64, -64, -127, -106, -136, -2, 7, 44, -24, -3, 21, -13, 14, -306, 101, 111, -74, 70, -208, 84, 165, 63, -79, -169, 351, -2, 93, 12, 125, -87, 87, -126, 108, 109, -217, -40, 4, 49, 155, 14, 95, -154, 231, -33, 61, -90, 154, -58, -130, -139, 70, 31]
3727C1j48J58R6rl2p9k05K95k27r4J71J43l33L18l34K26L06j68J3j36p1N7o3j50
3751b35P2l7J62j54K16J01L1o1j38O6l9p6R2Q3k1k05J76N9K6j76o5L8j20J70K0
3776a5N8R0j22j26K57j43n5j36J90j65K4K08j16j02J8N8N7J40j26L62k12N1j35
3799F0l22K82j92O2M5J12r9L7k23L65n0k27K10p9N6O2j8R9j59N6M3o7J38j29J8
3824H0j71J99j84K14k01K01l62K04J8k3j85L07j06l4m8K65k97J44j11Q9J55K0
3846A74j15j59J59n6o4K37m6k40J21n1M1m6l50K74N7K58n3j74K24j93m1j52J79
3869a6L24j13m4j79j0L0L0l5Q3m1o7P6r0K57p9J13j40k6j69K04M2r2m3o4L6j15
3895a28J23P6J18k80J68N8l11L4J89m1K6n8j0P7k16K74J25m11L33j77m5J95m6
$$ y = [31, -117, 41, 137, 128, 96, 17, -188, 107, -120, -214, -43, 100, -233, 85, -249, -23, 283, 115, 128, -8, -79, -22, -85, -235, -163, -200, -38, -192, 24, 125, 156, 95, -43, 23, -16, -92, 0, 83, 62, -143, 33, 92, 118, -58, -123, -85, -205, -35, -15, 43, 133, 11, -115, 142, -1, -56, -192, -2, -167, -143, 65, -51, -153, -135, -77, -20, 120, -6, 356, 144, 195, 60, -262, 20, -172, -110, -65, 47, -52, -15, -238, 127, 77, -150, 60, -19, 37, 99, 81, 180, 21, 77, 120, 53, 191, 62, 80, -91, 108, -76, 138, -63, 138, -224, -20, -2, -25, -210, 97, -9, -43, -91, 174, -123, 21, -90, -1, 154, 174, 59, -100, 59, 3, -61, 176, 130, -110, 11, -40, 1, -45, -395, -121, -64, 194, 141, -33, 191, -2, -43, -195, -16, 308, 195, 151, -28, -38, -8, 22, -13, 70, 29, -38, 38, -52, 205, 126, 239, 99, 73, -96, 108, 150, 58, 15, -49, -13, -128, -5, 71, 189, -91, 77, 135, -176, -142, 47, 6, 32, -26, -36, 41, -175, 99, 224, -187, 146, -31, -76, 119, 73]
3918G3j18oJ07j81j45J08K43k31k7L59l52P2K01k22J15N6K14l31L0n0O7K27j5
3941A94k53J71r4q6J33k37L04J4p1Q8j17j78K94j88K96l69J94pJJ5J40m4l85O6
3965a19k7K03M8p6k27J69r5r7K15P0OM9l0P5j95O6k64J72J26J66j65j85K39%j32
3990hj64K17k05K58j93P1j86k0J48J38l58J76J91j40J11p2J88nj37N9K28k97R
4013IJ07r9L9j74J42m2K22j69O3o5j72L30l32M3J41j8l8K03k04p1J32J32k16K4
4037a3l4O6j20k1J52J1K6j76p7L61k44l7R9l9J61j75Q2n1j9M6j3Q2k13N7J27k4
4063A4m6j29P2J10K19j35m9K59o06L21o6NO5Q1j34J08J25j03q2o6J7J08l61l5
4087c08K25P5Q1r5p3J86o9j6n1j15O5P9O8P6k46L5J99r2J08j27J27Q9k36L3Pp7
$$ y = [73, -45, -51, 56, -125, -270, -162, 81, -150, -177, 182, -170, -98, 103, -119, -4, 52, 266, -65, -35, -85, -18, 209, 194, -59, 112, 18, -68, 65, -172, 132, 146, 75, 163, 46, -132, 162, -26, 270, -99, 95, 88, 89, 104, 244, 200, -185, -119, -146, 57, 105, 29, -198, -29, -124, -221, -6, 64, 70, 119, 89, 164, -31, 35, -229, -57, 69, 235, 70, -115, 124, 124, -8, -172, 45, -160, 98, -95, -24, -210, -230, -82, 56, -302, -126, 65, -75, 36, -36, 152, 147, 10, 69, 297, 0, 9, 116, 17, 56, -118, 24, -18, 204, 35, 98, 33, -139, 191, -141, -98, 43, 25, -13, 190, -14, -85, 47, 179, -37, -13, -47, 19, -101, -122, 30, 41, 67, -109, -186, 175, -69, -106, -7, -46, 115, -60, 22, -29, -48, -2, -15, 67, -146, -89, 38, 14, -32, -161, -89, 21, 240, 105, 56, 315, -291, 30, -36, -31, 34, 115, -19, 89, 214, 111, 29, -37, -20, 88, -273, -308, -83, -8, 73, -22, -95, 91, 22, 6, -45, -160, -95, -16, 52, 128, -118, -83, 116, 24, 132, 5, 132, 221, -15, 18, 25, -52]
4113e2j3J49K5j12n4k01J78K19j85J39j00L6j36K67j12R9l44R6j4o4J83K5k75
4136b46K29n9J33J1j49K95j38n7J41l39J9J69J13j21j71J16q9K90j20O3j14K40
4158B16l06P0P4k07L21m15J82J97l3k21K83r2OJ1k03O6J68j09J64k82J25k33M77
4181B59q7m15L83j04lN6O9m43L08J83k20O1mL4j74K42l44K37o5o0j9K24P5m04
4205b11K92j94K85j17j09J46o4k07J29J68j76o3J58q6mqK21p5rj59L30j94k58
4228b05J81R5j61l4J49J82m52J95J32j02P9k6J17n2q6P1J33k15k68M13p8k34R6
4251g0J83n8j39p8P1K53J47m66J18R4J3J32m3n9LOj09mk39L49L1j96j1O0R2J61
4277B41k80M0j77L95m04K4J77K3j26M3j71j39L17j61L58l42K60j46j45J74R1k1
$$ y = [-52, -65, 84, 109, -3, -57, -258, -80, 139, -46, 93, -7, 29, -107, 160, 48, 147, -197, -101, -115, -179, 4, 29, -246, -17, -76, 57, 68, -81, 214, 76, 19, 160, -179, -160, 9, 122, 1, -170, -54, -143, 147, 27, 90, -24, 216, -90, -20, 54, -153, 168, -247, -65, 132, 99, -122, 161, 69, 75, 86, -117, -51, 117, 8, 172, -110, 15, -218, 259, 172, -243, 140, 36, 33, 89, 158, -285, 23, 206, -14, 47, 43, 77, -97, 145, -199, 38, -27, -87, -106, 118, 193, -211, 81, -113, 172, 55, -54, 92, 28, -179, -50, 118, -58, -121, 37, -49, -53, -61, 160, 85, 76, -83, 247, 53, -205, -24, 71, -90, -124, 25, 207, -245, -50, 82, -20, 59, 33, 150, 98, 12, 83, 216, 1, -267, 146, 68, -166, -70, 113, 55, -84, -162, -91, 162, 309, -157, -39, 55, 68, 200, 157, 98, 101, 107, -2, -6, -245, 104, 135, -61, -72, -12, 80, 241, -39, 1, -176, 219, -185, -161, 16, 39, -87, -44, -215, -354, -37, -198, 160, -182, 78, -68, -213, -39, 52, 31]
4299C1M3J43l45J17L6j3k33L47k3j84o0L64k33J53k94K86j35P5l59L30P3L5l9
4322A15k83K29j8k54L07o2L1o3k6J14JJ91k38q7K21j67r6P8k18L52j39q4KK45
4346A51k15o8J85k4j25P6l92L40J06p7l8j24K1J39j73L46j86K29q7k14L56k30
4368dL4j92K57L5j41k3Q9J67l94J85M6l01K12k1j9N5o7J50J13k24j67J90K47k84
4392e7K11Q4l57J38r8j24L32j5j03Q7j91K24j37p9R6j43L59k81J22J4j24K86k85
4415d1J32r0J70l27J91j36K44o2j12J44j21J42k50O3N7k2k9J28o5j48M9N4K3L3
4439B7n7j7K9o2m7l3K87j50P6k2L1j18OJ83l00J92j32N7J33q1J4k08J80K2j09
4464i9J58k36k6K00k54L76j31p0K27j86J01j29O1Nl1J41j98K96k51K19k00QO3
$$ y = [31, 74, 217, -128, -11, 25, 12, -221, 126, 103, -81, -141, 223, -10, 143, -151, 135, 0, 75, -284, 46, 119, 154, 115, -168, 61, 43, -211, 96, 34, 65, 2, -24, 90, 91, 282, 44, -43, 178, 11, -85, -7, -225, 127, -12, -96, -94, 151, -64, -132, 53, 29, -96, -20, -412, -72, 34, -43, -81, -205, -184, -45, -218, 128, -58, 171, 84, -130, 226, -4, 30, -162, 95, 130, -11, -34, 55, 222, -172, 13, 59, -242, -30, -51, -70, -15, -82, 68, 181, -43, -210, -20, 227, -57, 154, 238, -119, 19, -79, -203, 129, 114, 11, 98, -93, 131, -6, -85, 11, -132, 227, -54, 68, 82, -42, 244, -41, 91, 1, 171, -156, 35, -101, 143, 81, -31, 113, -8, 134, -116, -53, 4, -18, -47, 81, 16, -132, -83, -29, -6, 27, -30, -47, -18, -80, -127, -160, 127, -23, 53, 31, 62, -56, -50, 133, -167, 25, -107, -50, 83, 2, 16, -192, -12, 10, -99, 59, -177, -203, -3, -257, 119, -12, -82, 145, -41, 60, -69, -8, -3, -34, 107, -91, 205, -46, 173, -27, -19, 44]
4487D4j57o7J51L50m01K00k23L4J02j54K19k78J32J27j86Qj68L14K12m26J45j08
4509a30J03K33l25k7J88k3O3p3j81J37P3K6ol1J47k24J70k04P5r7j41M09J06o0
4533B08k90J14j88N6O9O2J94k45P8k64K37j21n9J41j62N01l93mj14L2J60O5p1
4556Fm4M4J5J34j65J89j39j9J38k63K01p8O7K2M3n6j4j49J07lj31r4J75J09m6
4581D9O0j0j58P4l0Q8j39J49j18J78J28l99o8N5J67m8p4J23k3J3p1R2j43K41j91
4606e5J62l48M04j98J90L5j44J92k21j71K44j74K26o0n5j4Jj01p1J58P9j13K05
4629A71l93K42j09M9mJ66q4J33r2k10O2J78n2l7j55M4m5j18K47K0N9l0k98L75
4653A19K7l83M20l27L65l90K07k6o0J82l43K0J35Q6ML8j36K08M0%J6j74J3j20
$$ y = [44, -113, -180, -29, 321, -80, 120, -103, -69, 33, -121, 98, -180, -48, 79, -107, -99, -267, 47, 259, -167, -22, -130, -27, 206, -119, -146, 42, 19, 82, 9, -172, -35, 38, 64, 58, 27, 174, -50, 120, -84, -9, -106, -247, 162, 268, 208, -82, 32, -156, -100, -31, 31, 225, -20, 58, -206, 31, -90, -149, -8, -170, 331, -62, -66, -180, -148, 12, 77, 6, -38, 6, 21, 155, -10, 179, 40, 21, 159, -104, 97, 19, 86, 108, 151, 95, 81, -68, 39, 36, -95, -189, -14, 95, 49, 109, 99, -59, 15, -15, 73, -66, 83, -35, 143, 271, -128, -196, -141, 26, -22, -96, 27, 4, 17, -54, 38, -105, 136, -55, 107, -241, 163, -35, 155, 190, 46, 238, 17, -154, 90, -84, 142, 82, 27, 13, 14, -87, -158, 0, 79, -34, 171, -222, 20, -89, -40, -44, 122, 38, 171, 79, -131, -69, 109, 57, 20, -135, -91, -136, -254, -7, 13, 72, 42, -256, 119, 146, -237, 183, -144, 221, -169, 38, 12, -48, 134, -209, -189, -54, 32, 36, 74, -62, 146, 186, 186, 202, 28, 41, -79]
4677g9J57l9q3K0m4j14J58K16j62J71l04J88j30m0K19J3k60J60k79L74k14K17
4699A45j88ML1j24r6L5J77j1k3j28J95J08j76O5J60k14L08l24R6l5q8J25j8k60
4723b36K48o4j17q0L72o2K9k02J75R4j02J36L0N5l72L44k92m3Nj08K19N6m6l5
4747DJ61j99O1k31M1K85k30l1K51N5k9j10R5j61q2L11j90l2J66j28Kk08mK11j3
4772eR7K72m44K66O0k28K79l25Q4l8n1n9J06j42L92j46n9k71J37j7N40n07p0L72
4796B43j34j95q0OJ54J82j10j11M9j04K7J76Q4l0j46j52P9j92L76j26M8k95M10
4819A59j58J1K13j9j66oJ22n7k47J45J04l98L7J07PK65j94J53j09Q1l5K18j48
4842H5k5p5k1j1l2L0J11j34N0J82j01j84J97m9k09M03k91Q7N9Q7j13P7l35L45
$$ y = [-79, 78, 39, -44, -24, -68, -182, -24, 192, 30, 201, -103, 85, -45, -85, 134, 147, -113, 47, -232, 142, -72, 145, -43, -39, -8, -132, -228, -193, -16, -27, -50, -178, 17, 125, -51, 14, 174, -40, 268, -56, 40, 5, -83, 42, 24, -236, 12, -52, -169, -249, 123, 61, 90, -112, 63, 157, 55, 191, 221, 276, -96, 248, -44, -87, -82, -190, 29, 85, 39, 4, 165, -34, 27, -204, -163, 122, -108, -139, 112, 167, 138, 28, 123, -38, -120, 191, 1, -31, 135, 7, 9, -199, -203, 8, -5, 92, 364, -80, 186, 246, 18, 297, -28, 56, 18, -33, -92, 14, -128, 264, 118, 59, -212, -75, -92, 448, -59, -129, 243, 109, -86, -166, -160, -6, 176, 66, -45, 4, -100, -73, 103, 187, 157, 11, -141, -62, -254, 122, -4, 44, -251, 159, 1, 12, 225, 206, 40, 34, 156, 99, -148, -3, 101, -297, -260, -153, -146, 119, -75, 78, -31, 50, 15, 233, 85, 60, -15, -36, -47, -79, -49, 62, -72, -22, 160, 59, -125, 72, 23, -186, 217, -74, 13, 72, 159, 46, 123, -212, 133]
4866A33lj64P3k1Q5j98K29P2k20l7L9k64J09L64o3p7o7O9q3N7k15M8K47j94P8
4891cJ14l5k75L0k2J57J79j81O1p7j31K60j63J27j29M9N0J75k44j3J27J32l12
4914a24o7K98j80Mq0J90m3Q0o2lJ89l30J04j7k66M17l0j54j07O6J08L40j09l95
4938a71p4K65K0K8k54q1K08K00p5O6j65K7k6R4J9k09J08J64P3m73L94j30J46j94
4962d0kpj36J59r8K8J33J1j86J63L9k43J74J43l46K87J72l81J99k47K11J9M1k63
4986a70K83l49L33l15K86k5j04P7j29K41m0k24J39Ln1K44k69K05L0l1J76j71j01
5009C8k03J67o9J1m1K09J52l86R0j26MJ6N0K4J7j01MQ7K6O8o5q2K49m6M7j40L7
5036C7Q6k90J15pJ70l82M09l8j46J13j3k56J20J16q2J06k32N0n7K79o4j44J01
$$ y = [133, 130, -34, 39, 18, 103, -95, 134, 206, -14, -51, -12, -276, -167, 197, 134, 57, -10, 59, -24, 33, -182, -134, 113, -81, -3, 111, 76, -199, -169, -191, -34, 145, -36, 25, -52, -183, 77, -86, 41, -88, -39, 11, 186, -58, -71, 56, 188, -124, -191, 107, -73, -69, -149, 41, -2, 78, 16, 13, 202, -128, -24, -41, -307, 110, 80, -74, -181, -115, -7, 333, 224, -171, -245, 20, 40, 68, -186, -267, -59, 141, 66, 132, -33, -6, -32, 62, 81, -128, -20, 144, 217, -256, 138, 8, 154, -40, -42, -49, -185, -26, -124, -96, 37, 48, -138, 25, 64, -179, -5, 138, -208, 79, 251, -130, 69, -178, 33, 52, 93, -170, 113, -236, 97, -218, 68, 43, -61, 16, -113, 128, 88, -136, 3, 6, -45, 199, -70, 135, 165, 134, 310, 139, 38, -165, 2, -67, -56, -97, 112, 264, -122, -32, -158, -154, -138, -88, -64, -47, -148, -144, -57, -31, 37, -28, -110, 139, 93, 140, 0, 37, 123, -167, -52, -59, 111, -271, 138, 100, -46, 67, 54, -202, -82, 34, -48, 58, -174, -124, -181, 98, 34, -110, -9]
5059iK15l99L7L82j31J47k15j66M29k82J68J26m27O8Q0j73J11J60k58J67MM3R6
5082A73j90J54jr9oQ9k49M5R8J73j56J84l01j7J6P6rK55l87jQ7R5M0o4M0j34K29
5109A40K64k89l2j30J20j32j86J87J42jk82K34l0j01l6K65k87pJ38k38L8M31k53
5132d5k5j6m3K05k02K66L6q3J1m7K6j69R7Qj58K14r2Kr6L5J6R5K2k48K66o1L9
5159E3Q7l79J53J77J09j67J3J5n8K5J25j96l1L50j76j93J02Qjm3K59l13k4J54
5183D9j47J71p4j29K58p5l95K53on7l7j62M87K0j07J51k18k94J28L94k19J73m82
5206c18L79j13j11J2m5J47J41Or3j15j27P3K70M6j3j94L8r8J02J07l09M20j16
5229H9p6J8k35K54N0K4K4j92k05J93O9J75j48j19K8K1j9K25l15P1r8J93k73M70
$$ y = [-9, 206, -193, -156, 226, 95, 242, 27, -139, 290, 8, 176, 302, -125, -57, 23, -150, -39, 121, -137, 30, 34, 77, 173, -17, 137, 136, 37, 31, 120, -129, -84, 14, 187, 31, 215, -86, -103, -87, -11, -20, 235, -152, -153, -66, 29, 69, 5, 45, -89, 140, 404, 115, 83, -47, 73, -59, -245, -58, 84, 83, -199, 35, 5, -96, -132, 133, -154, -161, -23, -261, -223, 208, -45, -70, -86, -129, 76, -126, 140, 176, 93, 104, 57, 83, -86, 11, 19, -139, 75, -17, -15, -111, -76, -60, 35, 57, -191, 75, 14, 53, 140, -239, -86, 91, 200, 33, 46, 61, 3, 28, 153, -43, -74, 276, 100, -93, 9, 17, 16, -27, 232, -81, -105, 49, -98, 73, -1, -130, 128, 53, -342, -89, -95, -152, -189, -351, 136, 156, 49, 200, -18, -312, -184, 210, -9, 164, -318, 61, -52, -163, -151, -196, -49, 92, 98, 5, -110, -237, -164, 106, 152, 139, -55, -17, -115, -13, 94, -215, 205, 89, 13, 31, -204, 50, 100, 124, 148, -44, -249, -56, 13, 188, 40, -79, -51, -30, -49, 176, -139, -68, -166, 27, -246, 224]
5253B24l08r6O9J65n7j27K45l72M2L44Q9l31q1R6J12Nk00K56j35K4J01J66k66
5276c5n4M4J21j92L5j86M37k85J14j5O6n1R0O7j68l5k44L64P6k04j19J33J07J9
5300H5l0J4j16l0pR1O5J99k80nM7j14J97j18q7lK60j94n8k35J34J08K47j1j68
5325iL5q4n0J50K11l84J21q3M9L8rJ62k18K2M2K55j2m0l79J28K78k48K2j61L41
5350A77r2j49j93K94j80L06r2J50m44J94j69J27J5j04L71l78J66j73K16l4J73
5371A81k5l8k63M6L65k36N3j51J11k32K05J17M6q8k83n9M14K8kk53J13j45L0k12
5395b78J44P9J36j96O0J78m20J10K12j38P2J11n7j98k0L45l24K70k40J56J27l90
5417b61K65j43J17J38r2m2M3l3J36J29j20n4J04j91J24k23K75l38J21N4j15J88
$$ y = [224, -84, -180, -111, 54, -3, -130, 115, -257, -215, 129, 218, -113, -194, -98, 14, 19, -181, 75, -60, -36, 65, 231, -35, -89, -45, 76, -116, -81, -267, 170, -115, -1, -16, 50, -1, 89, 156, -12, -47, -291, 73, 149, -55, -174, -41, 66, 85, 55, 69, -47, -77, -84, 7, 72, 271, -9, -14, 33, -81, 116, -2, -89, -92, 168, -26, -84, -319, -185, -77, 170, 159, -9, 26, -58, -108, 42, 253, -131, -10, -93, -44, -6, -15, 147, -71, -49, -7, 248, 236, 196, -183, -55, 223, -25, -3, -164, 177, 85, -64, -257, 37, -143, 163, 71, 221, -223, -29, -198, -71, -56, -160, 211, -167, -1, -174, 42, 8, 181, 156, 118, -145, -99, 266, 30, 83, -68, 43, -189, 16, 133, 179, 91, -192, -251, 163, 191, 189, -64, 49, -96, -66, -278, -134, -55, 81, -115, -55, 123, -297, -187, 25, -113, -41, 70, 13, -185, -205, 140, -184, 86, -154, 2, 129, -261, 4, -139, -22, 116, 24, -18, 25, -8, 128, 257, 137, 83, 187, -4, 120, -103, 172, -166, -45, 9, -106, 82]
5439H2J3m11P59n16K67J4k25Q1j50J92L6L3j5l11J7K6K20j24k63M90j83J04j41
5462eJ36k34q3J19L56k79m3J3j33N9r4j6M14j12n5J6l04L75k02j38J10P7qN1l65
5487c45K97N7J06mm9P2k14J75j36j01J79N2j33lJ28r5K46l71M25m05K60k33N7
5510c5L9k14J17K75k26L37l91qR0M1mK0%k33J93R0q3J27j00j8N8j82l8R2L9J8
5536Dj6J00p5j82M33k73Q8J84k72K36k02p6O3J93r8k9Nj07K90m41L12j12L6k33
5560a72J86K8QK69n02K89Nk91M03q3p3j0J02m13M67j53j9O9j10r6K67k9m2n3J8
5585F5l8j89r6J75J69j07j99L46k19RP9Q7k2j90Q1O3j11L1J30k13N9J78O8l4o1
5610F1K4J43l63M46j91j56J31q7N7K0m52J11L97j83j36L12k31Q1j07J20l9n9L81
$$ y = [82, 95, -316, 443, -73, 194, 208, -17, 64, -86, 106, 142, 175, 160, -151, -134, -108, 112, -12, -275, 215, 32, 136, -5, 131, -103, -186, -67, 289, 10, -33, -20, -153, -94, -188, -204, 210, 98, 43, 59, -245, 130, -72, -210, -100, -23, -31, 20, -345, -48, 9, 115, 111, 62, 134, -80, 95, -41, -142, 37, 89, -44, -47, 81, -14, 232, -139, 286, -119, 141, -92, -35, 4, -210, -93, 182, -44, 293, -98, -106, -16, 25, 21, 41, 41, -192, 1, 91, 8, 135, 35, 17, 75, -107, -145, -53, -14, 4, -12, 88, 13, -169, 264, -9, 79, 263, -9, 227, 25, -51, 12, 205, 107, 78, 83, -24, 266, -175, 137, 25, 61, -172, 14, 42, 50, 319, -183, 106, 111, -180, 223, 140, 67, 57, 159, -254, 213, 60, 41, 110, 0, -96, 171, 142, 100, 47, 65, 27, -162, -258, -83, 86, -21, -220, 126, -93, -84, -5, 82, 60, -130, -49, 14, -97, -66, 64, -149, -90, 88, 156, 122, 61, 85, 228, -135, 311, 120, -36, 95, 8, 65, 85, -367, -256, 141, -42, -178, 134, -97, -16, -123, -3, -42, -101, 280]
5633B80m94L99k26L01m46J2Q1o1R3j31O0R2J22k08J04m2m6J20J87j43j2n8l26
$$ y = [280, -214, 185, -41, 260, -186, -174, -93, -154, -61, -192, -132, -40, 82, -126, -22, -64, -110, 10, 197, 54, 42, -16, -342]
$$ [...]
8191A94
##END NTUPLES=NMR FID
##END=
