##TITLE=1H_PR192M_W
 D2O, 8 sc, 
 27.10.2020
##JCAMPDX= 6.0         $$ Bruker NMR JCAMP-DX V2.0
##DATA TYPE= NMR FID
##DATA CLASS= NTUPLES
##ORIGIN= UXNMR, Bruker Analytische Messtechnik GmbH
##OWNER= root
$$ XWIN-NMR		Version 3.5
$$ Tue Oct 27 10:15:03 2020 Russian Standard Time (UT+4h)  she@DPX200
##.OBSERVE FREQUENCY= 200.1315066352
##.OBSERVE NUCLEUS= ^1H
##.DELAY= (6, 6)
##.ACQUISITION MODE= SIMULTANEOUS
##.ACQUISITION SCHEME= undefined
##.AVERAGES= 8
##.DIGITISER RES= 18
##SPECTROMETER/DATA SYSTEM= spect
##.PULSE SEQUENCE= zg30
##.SOLVENT NAME= D2O
##.SHIFT REFERENCE= (INTERNAL, D2O, 0, 15.7039)
##AUDIT TRAIL= $$ (NUMBER, WHEN, WHO, WHERE, WHAT)
$$ ##TITLE= Audit trail, XWIN-NMR		Version 3.5
$$ ##JCAMPDX= 5.01
$$ ##ORIGIN= Bruker BioSpin GmbH
$$ ##OWNER= she
$$ F:/spectra/data/she/nmr/H-F/1/audita.txt
$$ ##AUDIT TRAIL=  $$ (NUMBER, WHEN, WHO, WHERE, WHAT)
(   1,<2020-10-27 10:14:06.43 +0400>,<she>,<DPX200>,
      <created by zg, POWCHK disabled, PULCHK disabled
       configuration hash MD5:
       00 E9 B6 7A A2 85 ED C7 34 08 36 98 17 FE 4E 26
       data hash MD5: 16K
       FB B0 F4 10 08 6B CB 80 97 DC 9B 84 F7 88 49 27>)
$$ ##END=
$$ 
$$ hash MD5
$$ 99 8D 6B BC 2F FB 5D DF 02 FF 11 6D C0 4E 1C EE
##$RELAX= 
##$RELAX= 
##$RELAX= 
##$RELAX= 
##$RELAX= 
##$RELAX= 
$$ Bruker specific parameters
$$ --------------------------
##$DU= <F:/spectra>
##$EXPNO= 1
##$NAME= <H-F>
##$PROCNO= 1
##$TYPE= <nmr>
##$USER= <she>
##$AMP= (0..31)
100 100 100 100 100 100 100 100 100 100 100 100 100 100 100 100 100 100 
100 100 100 100 100 100 100 100 100 100 100 100 100 100 
##$AQSEQ= 0
##$AQ_mod= 1
##$AUNM= <au_zg>
##$AUTOPOS= <>
##$BF1= 200.13
##$BF2= 200.13
##$BF3= 200.13
##$BF4= 200.13
##$BF5= 200.13
##$BF6= 200.13
##$BF7= 200.13
##$BF8= 200.13
##$BYTORDA= 1
##$CFDGTYP= 0
##$CFRGTYP= 5
##$CHEMSTR= <none>
##$CNST= (0..31)
1 1 145 1 1 1 1 1 1 1 1 1 1 1 1 1 1 1 1 1 1 1 1 1 1 1 1 1 1 1 1 1 
##$CPDPRG= <>
##$CPDPRG1= <>
##$CPDPRG2= <>
##$CPDPRG3= <>
##$CPDPRG4= <mlev>
##$CPDPRG5= <mlev>
##$CPDPRG6= <mlev>
##$CPDPRG7= <mlev>
##$CPDPRG8= <mlev>
##$CPDPRGB= <>
##$CPDPRGT= <>
##$D= (0..31)
0 1.2 0 0 0 0 0 0 0 0.06 0 0.03 0 0 0 0 0.0002 0 0 0 0 0 0 0 0 0 0 0 0 
0 0 0 
##$DATE= 1603779245
##$DBL= (0..7)
120 120 120 120 120 120 120 120 
##$DBP= (0..7)
150 150 150 150 150 150 150 150 
##$DBP07= 0
##$DBPNAM0= <>
##$DBPNAM1= <>
##$DBPNAM2= <>
##$DBPNAM3= <>
##$DBPNAM4= <>
##$DBPNAM5= <>
##$DBPNAM6= <>
##$DBPNAM7= <>
##$DBPOAL= (0..7)
0.5 0.5 0.5 0.5 0.5 0.5 0.5 0.5 
##$DBPOFFS= (0..7)
0 0 0 0 0 0 0 0 
##$DE= 6
##$DECBNUC= <off>
##$DECIM= 32
##$DECNUC= <off>
##$DECSTAT= 4
##$DIGMOD= 1
##$DIGTYP= 9
##$DL= (0..7)
0 120 120 120 120 120 120 120 
##$DP= (0..7)
150 150 150 150 150 150 150 150 
##$DP07= 0
##$DPNAME0= <>
##$DPNAME1= <>
##$DPNAME2= <>
##$DPNAME3= <>
##$DPNAME4= <>
##$DPNAME5= <>
##$DPNAME6= <>
##$DPNAME7= <>
##$DPOAL= (0..7)
0.5 0.5 0.5 0.5 0.5 0.5 0.5 0.5 
##$DPOFFS= (0..7)
0 0 0 0 0 0 0 0 
##$DQDMODE= 0
##$DR= 18
##$DS= 0
##$DSLIST= <SSSSSSSSSSSSSSS>
$$ [...]
##$SUBNAM2= <"">
##$SUBNAM3= <"">
##$SUBNAM4= <"">
##$SUBNAM5= <"">
##$SUBNAM6= <"">
##$SUBNAM7= <"">
##$SUBNAM8= <"">
##$SUBNAM9= <"">
##$SW= 16.880792210976
##$SWIBOX= (0..15)
0 0 2 0 0 0 0 0 0 0 0 0 0 0 0 0 
##$SW_h= 3378.37837837838
##$TD= 16384
##$TD0= 1
##$TE= 0
##$TE2= 300
##$TE3= 300
##$TEG= 300
##$TL= (0..7)
0 120 120 120 120 120 120 120 
##$TP= (0..7)
150 150 150 150 150 150 150 150 
##$TP07= 0
##$TPNAME0= <>
##$TPNAME1= <>
##$TPNAME2= <>
##$TPNAME3= <>
##$TPNAME4= <>
##$TPNAME5= <>
##$TPNAME6= <>
##$TPNAME7= <>
##$TPOAL= (0..7)
0.5 0.5 0.5 0.5 0.5 0.5 0.5 0.5 
##$TPOFFS= (0..7)
0 0 0 0 0 0 0 0 
##$TUNHIN= 0
##$TUNHOUT= 0
##$TUNXOUT= 0
##$USERA1= <user>
##$USERA2= <user>
##$USERA3= <user>
##$USERA4= <user>
##$USERA5= <user>
##$V9= 5
##$VALIST= <valist>
##$VCLIST= <CCCCCCCCCCCCCCC>
##$VD= 0
##$VDLIST= <DDDDDDDDDDDDDDD>
##$VPLIST= <PPPPPPPPPPPPPPP>
##$VTLIST= <TTTTTTTTTTTTTTT>
##$WBST= 1024
##$WBSW= 4
##$XGAIN= (0..3)
0 0 0 0 
##$XL= 0
##$YL= 0
##$YMAX_a= 237063
##$YMIN_a= -234757
##$ZGOPTNS= <>
##$ZL1= 120
##$ZL2= 120
##$ZL3= 120
##$ZL4= 120
##$ABSF1= 10
##$ABSF2= 0
##$ABSG= 5
##$ABSL= 3
##$ALPHA= 0
##$AQORDER= 0
##$ASSFAC= 0
##$ASSFACI= 0
##$ASSFACX= 0
##$ASSWID= 0
##$AUNMP= <proc_1d>
##$AZFE= 0.1
##$AZFW= 0.1
##$BCFW= 1
##$BC_mod= 2
##$BYTORDP= 1
##$COROFFS= 0
##$CY= 11.3945322036743
##$DATMOD= 1
##$DC= 2
##$DFILT= <>
##$DTYPP= 0
##$F1P= 16.9975609425685
##$F2P= -3.02152046262296
##$FCOR= 0.5
##$FTSIZE= 0
##$FT_mod= 4
##$GAMMA= 1
##$GB= 0.15
##$INTBC= 1
##$INTSCL= 1
##$ISEN= 128
##$LB= 0.24
##$LEV0= 0
##$LPBIN= 0
##$MAXI= 10000
##$MC2= 0
##$MEAN= 0
##$ME_mod= 0
##$MI= 1.114404
##$NCOEF= 0
##$NC_proc= 0
##$NLEV= 6
##$NOISF1= 3.799351
##$NOISF2= 2.8
##$NSP= 1
##$NTH_PI= 0
##$NZP= 0
##$OFFSET= 15.70392
##$PC= 1
##$PHC0= -10697.87
##$PHC1= 18.40088
##$PH_mod= 1
##$PKNL= yes
##$PPARMOD= 0
##$PSCAL= 0
##$PSIGN= 0
##$REVERSE= no
##$SF= 200.130013532006
##$SI= 16384
##$SIGF1= 3
##$SIGF2= 2
##$SINO= 400
##$SIOLD= 16384
##$SREGLST= <1H.CDCl3>
##$SSB= 0
##$STSI= 0
##$STSR= 0
##$SW_p= 3612.71676300578
##$SYMM= 0
##$S_DEV= 0
##$TDeff= 0
##$TDoff= 0
##$TI= <>
##$TILT= no
##$TM1= 0
##$TM2= 0
##$TOPLEV= 0
##$USERP1= <user>
##$USERP2= <user>
##$USERP3= <user>
##$USERP4= <user>
##$USERP5= <user>
##$WDW= 1
##$XDIM= 8192
##$YMAX_p= 0
##$YMIN_p= 0
$$ End of Bruker specific parameters
$$ ---------------------------------
##NTUPLES= NMR FID
##VAR_NAME=  TIME,          FID/REAL,        FID/IMAG
##SYMBOL=    X,             R,               I
##VAR_TYPE=  INDEPENDENT,   DEPENDENT,       DEPENDENT
##VAR_FORM=  AFFN,          ASDF,            ASDF
##VAR_DIM=   8192,          8192,            8192
##UNITS=     SECONDS,       ARBITRARY UNITS, ARBITRARY UNITS
##FACTOR=    0.000296,      1,               1
##FIRST=     0,             0,               0
##LAST=      2.424536,      0,               0
##MIN=       0,             -234757,         0
##MAX=       2.424536,      237063,          0
$$ Real data points
##PAGE= N=1
##DATA TABLE= (X++(R..R)), XYDATA
0@%%%%%%%%%%%%%%%qJ6j6J6j6K2l0L2m0M8n6O4p2Q8j02J16j32J49j69J92k16K44
$$ 0 0 0 0 0 0 0 0 0 0 0 0 0 0 0 0 -8 8 -8 8 -8 14 -16 16 -24 24 -32 32 -40 48 -54 62 -70 79 -90 102 -114 130
37A30k76L08l44L86m29M75n28N85o49P17p89Q71r61J059j165J283j414J559j725
$$ 130 -146 162 -182 204 -225 250 -278 307 -342 375 -414 457 -504 555 -610 673 -741 818 -907
56i07J910k117K358k637K964l355L831m430N209o264P796j0246J4964m2157J64112
$$ -907 1003 -1114 1244 -1393 1571 -1784 2047 -2383 2826 -3438 4358 -5888 9076 -33081 131031
71A31031Q6380j25319j94988j31861J48177J96959J19500j17534k35009m9489
$$ 131031 217411 92092 -102896 -234757 -86580 110379 229879 112345 -122664 -172153
81a72153Q1524J73995J48651j28554j90200r2597O8344K03384Q8997o0845j80822
$$ -172153 -90629 83366 232017 103463 -86737 -179334 -110990 92394 181391 120546 -60276
92f0276j61770J13736J85029R1239l7559k12518j24605Q3106J84516J38984j03690
$$ -60276 -222046 -108310 76719 167958 130399 -82119 -206724 -123618 60898 199882 96192
103I6192j79817q9290L5130K12213J16222j00832j50941j13157O7884J71238R3685
$$ 96192 -83625 -172915 -137785 74428 190650 89818 -61123 -174280 -106396 64842 158527
114A58527l2174j87379j08547Q2774J24739J24082l3646j81296r9526L5635J63661
$$ 158527 126353 -61026 -169573 -86799 37940 162022 128376 -52920 -152446 -116811 46850
125D6850J18315n9866j30801j33809K9175J88738R2452l8520j43095j28970N0788
$$ 46850 165165 105299 -25502 -159311 -130136 58602 151054 112534 -30561 -159531 -108743
136a08743J43346J18956l1774j70201q7229K9129J26924J34878m3874j42716j02886
$$ -108743 34603 153559 121785 -48416 -135645 -106516 20408 155286 111412 -31304 -134190
147a34190J7585J47982J00886k0365j24369j35897L6496J36724R6845k818j39168
$$ -134190 -116605 31377 132263 111898 -12471 -148368 -111872 24852 121697 118879 -20289
158b0289j15820K2311J23060J26231k5985j29590r8261l936J35179J20585k5779
$$ -20289 -136109 -113798 9262 135493 109508 -20082 -118343 -122279 12900 133485 107706
169A07706j13364j15743J0343J25887J03866M087j26960j17003K0809J04725J14114
$$ 107706 -5658 -121401 -111058 14829 118695 122782 -4178 -121181 -100372 4353 118467
180A18467K712j25834j05872j228J14514J15053j1088j02896j14812p819J20992
$$ 118467 121179 -4655 -110527 -111755 2759 117812 106724 3828 -110984 -118803 2189
191B189J03039J548j02834j17415R78J02970J10971J0535j12638j04220n869R6098
$$ 2189 105228 106776 3942 -113473 -112495 -9525 101446 111981 -657 -104877 -110746 -14648
203a4648J18426N522j01832j06162j4231J04084J07407J1231r2041j16421r724
$$ -14648 103778 109300 7468 -98694 -112925 -8841 98566 109797 17756 -98665 -108389
214a08389R7876J03886J9747r6013j10169j4277Q8702J12415J6009r3016j04922
$$ -108389 -10513 93373 113120 17107 -93062 -107339 -18637 93778 109787 16771 -88151
225h8151k3928R0264J11045J6146q5179j09825k1824Q8283J04476K4662q5129
$$ -88151 -112079 -21815 89230 105376 20197 -89628 -111452 -23169 81307 105969 20840
236B0840j08709j9893P9899J06140K6745q2314j03257k7471P7387J07081K7485
$$ 20840 -87869 -107762 -27863 78277 105022 22708 -80549 -108020 -30633 76448 103933
247A03933p4643j05351l2616P6420J05306L2363p2728j08071l2114P2903J06254
$$ 103933 29290 -76061 -108677 -32257 73049 105412 32684 -75387 -107501 -34598 71656
258G1656L4431p4297j05353l2873P0479J05270L2702p0113j02040l4396O7451
$$ 71656 106087 31790 -73563 -106436 -35957 69313 102015 31902 -70138 -104534 -37083
269c7083J00529L4311o3471j00343l6800O1744R8426M0153n9159r9726m1458N7236
$$ -37083 63446 97757 34286 -66057 -102857 -41113 57313 97466 38307 -61419 -102877 -45641
281d5641J01033M3862n7216j00961m5026N7622J02267M4044n6814j01553m4019
$$ -45641 55392 99254 42038 -58923 -103949 -46327 55940 99984 43170 -58383 -102402
292a02402N7736R9901M2641n5904r7600m2386N3296R5274M3249n0914r3282m4795
$$ -102402 -44666 55235 97876 41972 -55628 -98014 -44718 50556 93805 42891 -50391 -95186
304i5186M6739R2970M6583m4705r2280m9498M3043R2434N1635m1570r4891n2113
$$ -95186 -48447 44523 91106 46401 -45879 -95377 -52334 40100 91735 50165 -44726 -96839
316i6839M1777R4833N3220m2380r4337n2192M1828R4438N0702m1369r0739n1432
$$ -96839 -55062 39771 92991 50611 -43726 -95918 -54090 40348 91050 49681 -41058 -92490
328i2490M0826Q9313N0000l6433q8210n0584L4953Q5159N4004l3042q5549n3203
$$ -92490 -51664 37649 87649 51216 -36994 -87578 -52625 32534 86538 53496 -32053 -85256
340h5256K8699Q5888N6599k9587q4634n9092K9133Q7066N5981k6071q7438n8872
$$ -85256 -56557 29331 85930 56343 -28291 -87383 -58250 28816 84797 58726 -28712 -87584
352h7584K9796Q3981N8220k7759q5199n5520K4408Q3785N8241k8061p8481n7124
$$ -87584 -57788 26193 84413 56654 -28545 -84065 -59657 24128 82369 54308 -24173 -81297
364h1297K0858Q2195N6134j9972p8335o0210K2112P5761O0444j5097q1918n8166
$$ -81297 -60439 21756 77890 57918 -20417 -80627 -58515 17246 77690 62593 -19325 -77491
376g7491J7565P5351O3920j8223p6132o0668J3069Q0525N8710j5962p1484o5760
$$ -77491 -59926 15425 79345 61122 -15010 -75678 -62609 17916 76626 60664 -10820 -76580
388g6580J5523P5589N8842j0121p6520n9832J2434O8488O7111j3260p4419n6906
$$ -76580 -61057 14532 73374 63253 -13267 -73099 -60665 7823 74934 61674 -12745 -69651
400f9651M865P2518O3523j0816o6996o6293R096P2422N6384o60o9628o6454J1137
$$ -69651 -64786 7732 71255 60439 -6557 -72850 -63754 8668 65052 64392 -5236 -71690 -60553
413f0553O3901O3496k584o9329n8645j383O6938O8149r313o0814o2441l733P0008
$$ -60553 3348 66844 64260 -5069 -63714 -65097 1841 69990 60677 -137 -62578 -66311 3697
426C697O0850M66o3084o7964O314N8325O3073P818p0982o0173J052N6334O8134
$$ 3697 64547 65013 1929 -66035 -59721 -1396 61677 69495 -1487 -61660 -60608 -4274 63860
439F3860j267n9186o2082r195O7618N8914P78n0431p0642l759O0837N9029J0694
$$ 63860 62593 3407 -58675 -67870 -252 58662 59440 9009 -61633 -65392 -4555 54474 65168
452F5168o1449o1571m740M8799P2464N834o1894n5413j2973N5355O6856M966m9232
$$ 65168 3719 -57852 -62592 -13793 58671 64505 2611 -52802 -65775 -10420 56436 61402 12170
465A2170o8773p593N8956N3723J7781n2056p0131l614M8180O3695J3312n5573
$$ 12170 -56603 -64196 -5240 48483 66264 14208 -55923 -59537 -11357 52338 65650 10077
477A0077n6756j8272M9999P0800K748m4943n9894k1701N4670N9945J5122m6551
$$ 10077 -46679 -64951 -14952 55848 58596 13653 -46241 -67942 -13272 46673 61795 15244
489A5244o8611o938M2059N9495K5675n5433o0007j2024L9057O7388J4368m2994
$$ 15244 -53367 -60305 -18246 41249 66924 11491 -48516 -60540 -21483 45905 60273 17279
501A7279n9643k5892N3070N9894J3203l3505o9164j9413M7519N7132K4392m6436
$$ 17279 -42364 -68256 -15186 44708 57911 24406 -44758 -64171 -16652 40480 64872 18436
513A8436o0850j5726L2481O8760K0734m8508n2470k5114L8142O4164J7406l3292
$$ 18436 -42414 -58140 -25659 43101 63835 15327 -37143 -62257 -24115 40049 57455 24163
525B4163o4987k2768M4044N0956K8849l3629o8301j7889L3683O0302K7956m0686
$$ 24163 -40824 -63592 -19548 31408 60257 26628 -41673 -59562 -25879 34423 62379 21693
537B1693n4606k9802L3594O9452J6598l2506n6224l2376L9767N7331K5182l0603
$$ 21693 -32913 -62715 -29121 40331 56929 24423 -31801 -64177 -24410 32921 58103 27500
549B7500o4922j9437K9636N4081L5614l7961n7875k2677K4824O1905K5961k8994
$$ 27500 -37422 -56859 -27223 26858 62472 24511 -33364 -56041 -31217 30688 56649 27655
561B7655n4192l5984L4455N7897K4413k0464o2572l1577L1949N4173L4421l0396
$$ 27655 -26537 -62521 -28066 29831 54244 33780 -28792 -60369 -28420 25753 60174 29778
573B9778n8648k5669K0232O1669L1918l2713n0762l3099K4633N8989K6831k0638
$$ 29778 -28870 -54539 -34307 27362 59280 26567 -24195 -57294 -32661 26328 53159 32521
585C2521n7928l2941K8830M9231L4572j9975o0474k8568K0847N4238L6183k5268
$$ 32521 -25407 -58348 -29518 19713 54285 34310 -26164 -54732 -33885 20353 56536 31268
597C1268n1373l5020J8563O0764K9440k0442n1484l8057K3415N3021L3253j7058
$$ 31268 -20105 -55125 -36562 24202 53642 33200 -18284 -56341 -32926 20095 53348 36290
609C6290n7565l0892J8812M9348L9555k1486n2860l2170J3730N5054L4046j7733
$$ 36290 -21275 -52167 -33355 15993 55548 34062 -18798 -50968 -37238 17816 51862 34129
621C4129m8909l9583J8470N2464L2339j1454n2998l6977J6905M8459L8590j4931
$$ 34129 -14780 -54363 -35893 16571 48910 37456 -15542 -52519 -35614 12845 51435 36504
633C6504n1184l4173J0331N1566L8407j5380m7397l8061J1278N0970L5758r738
$$ 36504 -14680 -48853 -38522 13044 51451 36071 -11326 -49387 -38109 12861 48619 38881
645C8881m9621l9187J2951M6598L8762q654n0554l6695Q999M7095M0134j1034
$$ 38881 -10740 -49927 -36976 9622 48384 39730 -10824 -47519 -38520 8575 48709 37675
657C7675m5842l8693O724M9017L7312p992m4902m0714Q266M5457L8801m781m7006
$$ 37675 -8167 -46860 -40136 8881 46193 38201 -6701 -47415 -39149 6308 45109 40328 -6678
670f678l8609N868M4012M1332n883m5083l9098L232M5242M0589m356m3328m1510
$$ -6678 -45287 -39419 4593 45925 40042 -5041 -44139 -40907 4335 44924 40568 -2760 -44270
683d4270L761M4450L9338k001m3619m0819K957M1459M1366j669m2889l9880O67
$$ -44270 -40509 3941 43279 41278 -2341 -43160 -40203 1256 42622 40953 -1936 -41816 -41149
696d1149M1121M1436q42m0198m1338j043M1208M0846J518l9858m2597p25L9648
$$ -41149 -28 41408 40566 368 -40970 -42013 -805 40041 41559 1701 -40896 -41621 -1973
709a973M1693K473l9977m1312k611L8754M2236K657l8134m1811m030L8300M1659
$$ -1973 39720 42193 2216 -39096 -41707 -2953 39283 41940 3806 -38005 -42035 -3735 37924
722C7924M217l7540m2203m359L6811M1493N804l6739m2137n702L5782M2405N964
$$ 37924 42141 4601 -37602 -41961 -5150 36343 42147 5408 -36729 -42431 -6649 35756 41720
735D1720l5504m1614p482L5748M2020O913l4293m1857p923L4427M1713Q658l3567
$$ 41720 6216 -35398 -42880 -7132 34888 41801 7508 -34349 -42272 -7845 33868 42526 8959
748H959m2392q291L2645M2501R378l3284m1967r750L2359M2314R538l1538m2581
$$ 8959 -33433 -41724 -9079 33422 42800 9516 -32451 -42201 -9842 32472 42010 10472 -32109
761c2109j0981L2520M1565J0819l1178m2435j0275K9894M2407J1759l0659m0880
$$ -32109 -43090 -10570 30995 41814 10636 -31799 -42074 -12180 30227 41986 11327 -29553
773b9553j2362K9190M2089J2092k8170m1546j3588K8736M1220J4025k7428m2457
$$ -29553 -41915 -12725 29364 41456 13286 -28260 -41848 -13112 28108 42133 14705 -27752
785b7752j3841K7405M1306J5544k7700m1902j4757K6019M2720J3972k6117m0634
$$ -27752 -41593 -14188 27118 42662 14962 -26940 -41697 -15678 27042 41014 14897 -25737
797b5737j6523K6647M1078J4865k4175m1541j5839K4746L9748J7829k4050m1084
$$ -25737 -42260 -15613 25465 40330 16155 -25386 -41225 -16479 23269 41098 17048 -24036
809b4036j5845K1815M1300J8409k3988l9191j9353K2503M1275J7642k0832m1359
$$ -24036 -39881 -18066 23234 41643 17655 -21536 -40889 -18386 22889 40531 19699 -21660
821b1660j9634K3225L9301J9429k0478m1966j8097K0116L9742K0811k2261l8323
$$ -21660 -41294 -18069 21232 40661 20183 -21783 -39880 -19764 19978 40789 18528 -19795
833a9795j9898J8393M1102J9347j9154l8157k2182J9847L8578K0974j6264m0911
$$ -19795 -39693 -21300 19802 39149 19995 -18162 -40344 -20497 18081 39055 22791 -18120
845a8120k0748J7800L7526K3687j7968l8912k1292J4885M0860K1159j6773l6437
$$ -18120 -38868 -21068 16458 40145 22177 -16735 -38027 -23142 17718 38877 22104 -14333
857a4333k5264J6594L9377K1065j3593l9181k3328J5738L6137K5845j5427l9106
$$ -14333 -39597 -23003 16374 37439 23846 -15335 -38663 -22925 13212 39057 23630 -15476
869a5476k0723J1388L8227K5215j5304l5236k5730J3049L8817K1695r856l7183
$$ -15476 -36199 -24811 13416 38631 23327 -11909 -37639 -24590 14227 35922 26066 -11117
881a1117k7058J5069L4460K5527j0168l8548k3538R702L5962K7663j3636l4159
$$ -11117 -38175 -23106 11354 36881 26713 -11835 -35373 -25671 10291 37954 24318 -9841
893i841k5196P132L8917K4513r908l4403k8372J1335L4354K5908o074l8692k5099
$$ -9841 -35037 -27905 11012 35525 25617 -8786 -37158 -25823 8531 34439 28365 -10327 -35426
906c5426R606L2380K9461r573l4513k5709N059L7283K5769q269l0667l0700P432
$$ -35426 -25820 6560 36021 26448 -8065 -33774 -28715 8568 34337 26068 -4599 -35299 -27867
919b7867L5579K4811l597l4887k7992P543L0085L1151n936l5507k4854K545L3141
$$ -27867 7712 32523 28926 -5961 -33953 -26410 3675 34826 28890 -6617 -31471 -28926 4215
932D215L0097p266l0482k9550L640L4729K5015p35l1938l2055P028K9767K8306
$$ 4215 34312 27046 -3436 -32986 -29346 5383 30398 29663 -2275 -34330 -27302 2465 30771
945C0771n11l3962k6681Q53L0465L1970n539k8854k7795k065L3493K8301j817
$$ 30771 30260 -3702 -30383 -29530 935 32905 27366 -1488 -29283 -31348 2145 30446 28629
958B8629k8421l1773L186K8823K8240L325l3233k8504J632K6255L2163m43k9595
$$ 28629 208 -31565 -28379 444 28684 32009 -1224 -29728 -28096 -1841 30322 29879 284
971B84k7865l871L1473K9156p86k4599l2766j935L0649K7060M087k8245l0762
$$ 284 -27581 -31452 21 29177 28391 3792 -28974 -30909 -260 26800 30887 2642 -28120
984b8120o69K4346L2501L120k9778k6803n512K6718L1983J283k4554l1128m445
$$ -28120 -28789 -4443 28058 31178 1400 -25403 -30915 -4197 27786 29069 4515 -26613 -31058
997c1058K8298K6916O663k4778l3424j893K3957K9858P151k7171k8733o242K3680
$$ -31058 -2760 24156 30819 6041 -27383 -29276 -5319 24539 31690 4519 -24214 -30456 -6776
1010f776L3407K871k3575k8752r038K6202K9927N838k2138l2635m830K3008K8447
$$ -6776 26631 29502 5927 -22825 -31863 -5661 24266 30104 7966 -24669 -29499 -6491 21956
1023B1956J0169k5299l0123n590K0139L1820P621k2676k8887j0821K3628L0413
$$ 21956 32125 6826 -23297 -28887 -8748 23072 30693 8017 -20870 -31691 -8063 22350
1035B2350P163j8983l2353r323K2837K8643J0946k1527l1100p968J8607L1615
$$ 22350 29513 10530 -21823 -31146 -8309 20334 31280 9753 -21347 -29315 -10708 20907
1047B0907J0181k2034k7924j1394J9278L1937Q591j8244k9942j1806K0404K8341
$$ 20907 31088 9054 -18870 -30264 -10986 20951 29542 11298 -18644 -30450 -10046 18295
1059A8295J2126j8063l1740r736J7852K9241J2896j9060k8886j2757J6658L1929
$$ 18295 30421 12358 -19382 -29118 -11266 17975 30871 11811 -17075 -29832 -13174 18755
1071A8755J1156j7248k8942j4460J8417K9505J2282j5442l0617j2631J6216K8421
$$ 18755 29911 12663 -16279 -30739 -12322 17183 29465 14023 -16594 -29225 -13009 15412
1083A5412J5052j6914k9599j2500J4038L0282J4079j5845k8096j5594J5148K9736
$$ 15412 30464 13550 -16049 -28549 -14511 15771 29850 14005 -14091 -29685 -14537 15199
1095A5199J3367j3084k9254j5407J4900K8079J5676j3809k9537j4252J2273K9321
$$ 15199 28566 15482 -13772 -29179 -14279 13800 29476 15667 -13870 -28122 -15849 13472
1107A3472J6111j4052k7827j6276J2634K9135J5056j1634k8530j6840J2907K7368
$$ 13472 29583 15531 -12296 -28572 -15938 13197 28253 16619 -11911 -28751 -15844 11524
1119A1524J6714j1441k8675j6070J1113K7652J7592j1762k7182j6823J0100K8072
$$ 11524 28238 16797 -11878 -27948 -16835 10817 28409 16647 -10535 -27358 -17258 10814
1131A0814J7120j0701k6928j8019J0101K7505J7140q511k8025j7439R240K6671
$$ 10814 27934 17233 -9695 -27714 -17613 9892 27032 18521 -9504 -26943 -17703 8968
1143H968J8423q933k7170j7793P963K6930J8303q367k6008j8768P421K6811J8389
$$ 8968 27391 18458 -8712 -26505 -18542 8388 26691 18324 -7684 -26452 -19031 7780 26169
1156B6169p115k6288j9325P591K5774J9320p006k6158j8441O170K5386J9851o575
$$ 26169 19054 -7234 -26559 -18968 6806 26126 19120 -7038 -25479 -19309 6077 25928 19353
1169A9353k4736j9988N290K5588J9979n393k5027k0033N252K4812J9872m556k4970
$$ 19353 -5383 -25371 -20081 5507 25486 20093 -4934 -24967 -19715 5097 24969 20413 -4557
1182d557k0307M620K4218K0973m484k4506k0185L412K4416K0181l424k3670k0701
$$ -4557 -24864 -20244 3974 24947 20463 -4043 -24228 -20816 3600 23781 20357 -3313 -24014
1195b4014L319K3548K0539k487k3621k0492K049K3038K1442k069k3336k1085J615
$$ -24014 -20695 2853 23392 20905 -2716 -23208 -21159 1879 23321 21252 -2084 -23169 -21554
1208b1554K3220K1493j748k2361k1629J112K2643K1055n51k2437k1560Q48K1524
$$ -21554 1666 23159 21411 -950 -22579 -21467 1176 22231 21680 -757 -22317 -21469 55
1221E5K2248l03k2246k1132n97K1631K2182k95k0955k1550q97K1093K1288J352
$$ 55 22303 22000 -246 -21378 -21975 -344 21838 21543 588 -20962 -21859 -766 20522 21874
1235B1874k0506k2342n63K0161K1923J827k0893k1405j970J9662K2817J385j9349
$$ 21874 1368 -20974 -21537 -1376 20547 22374 1481 -19924 -21894 -2232 20585 21970 2621
1248B621k2262l052K0319K1956K445j8806k2967k343J9104K1706L790j9169k2522
$$ 2621 -19641 -22693 -2374 19582 22027 3221 -19746 -22089 -2985 18721 22511 3342 -19180
1261a9180l124J8178K3100L326j8675k1652m537J8749K2695L017j7038k2744m332
$$ -19180 -22304 -4126 18974 22300 3625 -18027 -22564 -3815 18880 21897 4859 -17885 -22217
1274b2217J8336K1518N465j8079k2715m005J6775K2488N532j8494k1168n876J6828
$$ -22217 -3881 17637 23102 5023 -17692 -21697 -4922 17566 23098 4604 -16564 -22440 -5612
1287e612K2697M756j6087k2386o278J6920K1836O318j5431k3316n433J5629K2237
$$ -5612 17085 21841 5754 -16632 -22910 -5990 15846 22164 6733 -16583 -22016 -6387 15850
1300A5850P528j6870k1937o336J4333K3765O239j5281k1553q272J5869K1749P541
$$ 15850 23378 6508 -15429 -21765 -7432 16333 22572 7291 -14262 -22534 -6665 15084 22625
1313B2625j3799k3807p104J4895K0911R378j4784k2427p708J2907K3425P874j3884
$$ 22625 8826 -14981 -22085 -7190 13721 23099 8315 -14112 -21820 -8913 14512 22386 8502
1326H502k1186r867J3738K2578P695j1881k2509r401J3922K0865J0246j2766k3107
$$ 8502 -12684 -22551 -8813 13765 21460 9579 -12930 -22331 -8409 12456 22702 9936 -13171
1339a3171p897J1388K1710J0911j3707k0418j0768J1727K2887Q683j0383k1881
$$ -13171 -21068 -9680 12030 22941 9234 -11184 -21952 -10225 12662 21345 10962 -10919
1351a0919j1630J2996K0840J0055j0105k2638r811J0707K0975J1757j1712k0765
$$ -10919 -22549 -9553 11287 21342 11237 -11401 -21212 -10505 10470 22227 10515 -10250
1363a0250j0740R174K3007J0164j0270k0123j2870J0808K1283J1050q537k2543
$$ -10250 -20990 -11816 11191 21355 11085 -9038 -21908 -11100 10183 21233 12696 -9847
1375i847j1158R719J9797J3251r852k1147j1059P433K2017J2011r539j9191j3461
$$ -9847 -21005 -11286 8511 21762 11910 -9237 -20296 -12863 9154 21165 11626 -7565 -21026
1388b1026Q446K1599J1190o993k1238j2826Q766J9164J3540p311k1372j1672O576
$$ -21026 -12580 9019 20209 13216 -8022 -20848 -12082 7082 20622 13311 -8061 -19733 -13157
1401a3157K0346J4066q489j9187j3804O543K1289J2103n917j9863j4704P985J8953
$$ -13157 7189 21255 12766 -6421 -20225 -13682 7607 19710 13793 -6070 -20774 -12789 6164
1414F164J3313m926k1177j2958N776J9044J4938o731j8791j3517L951K0623J3749
$$ 6164 19477 14551 -6626 -19584 -13808 5236 20174 13443 -5348 -18865 -14914 5709 19458
1427A9458n728j8315j5446N798J9108J3851l523k0283j4140N346J7823J5487m852
$$ 19458 13730 -4585 -20031 -14233 4875 18726 15203 -5080 -19220 -13874 3949 19436 14584
1440A4584j8878j3805K909J9433J4721m641j7484j5624L601J9204J3529k152j8724
$$ 14584 -4294 -18099 -15190 4243 18964 14323 -3161 -18785 -15184 4020 17549 15397 -3327
1453c327j5714M266J7263J5813k505j9192j3851J717J7513J6422l454j6935j5469
$$ -3327 -19041 -14775 2488 18301 15796 -3396 -17247 -15530 1983 18405 14951 -1984 -17453
1466a7453J547J8350J4581j727j6827j6378K651J6687J5229n38j7796j5316J447
$$ -17453 -15906 2444 17025 15298 -1529 -17907 -15256 1431 16660 16122 -1674 -16990 -15543
1479a5543J6053J6868j850j6532j5114n82J7505J5696r77j5238j7086Q32J6312
$$ -15543 510 17378 15528 -1004 -16118 -16700 805 16501 15524 286 -16800 -15968 344
1492C44J5447P56j6840j6059P23J4811J6731M82j6153j5458j708J6123J6723j40
$$ 344 15791 16547 -293 -16352 -15629 -818 15913 16395 242 -15216 -16924 -801 15922 15782
1506A5782j4348j6748j021J5500J5509J798j4978j6660p05J3867J6576K623j5730
$$ 15782 1434 -15314 -16335 -835 14674 16472 1494 -15166 -15871 -2004 14572 17195 1465
1519A465j5845k203J4415J7046J425j3939j6473k854J4847J6017K570j3414j7391
$$ 1465 -14380 -16583 -2168 14878 16303 2364 -14109 -16963 -2116 13901 16471 3057 -14334
1532a4334j828J3240J6372L548j4266j6482k769J3284J6835L087j3291j6123m421
$$ -14334 -16162 -2922 13450 16998 2732 -13750 -16519 -3235 13600 16687 3396 -12727 -17148
1545a7148J4017J6420L233j2548j6941l772J3095J6284M387j2797j6676l975J1939
$$ -17148 -3131 13289 16522 3974 -12967 -16739 -3644 12640 17027 4230 -12446 -16421 -4482
1558d482J6903M527j2704j6046m994J2312J6637M529j1721j6730n087J1969J6470
$$ -4482 12421 16948 4244 -11802 -16796 -4484 12153 16682 4961 -11769 -16856 -4887 11583
1571A1583N167j1411j6735m974J0949J6576N729j1515j6317n329J0637J6813N192
$$ 11583 16750 5339 -11396 -16370 -5421 11155 16884 5369 -10948 -16277 -5640 11173 16365
1584A6365j0612j6208o312J1003J6238O145j0146j6785o145J0215J5990P038j0331
$$ 16365 5753 -10455 -16767 -5764 10474 16619 6473 -10312 -16457 -6242 9748 16786 6455
1597F455j6126o571R099J7279O460r837j5879p146R340J6486O745q871j6369p252
$$ 6455 -9671 -16242 -7143 10136 16596 6759 -9120 -16266 -6926 9560 16305 7434 -8935 -16187
1611a6187R251J5813P479q794j6463p165Q297J6457P504q662j5790p967Q364J6237
$$ -16187 -6936 8877 16356 7562 -8901 -16066 -7769 8688 16192 7530 -8260 -16227 -7863 8374
1625H374P568p781j6171q144Q411J5513Q344p697j5901q094P156J5758Q527p635
$$ 8374 15942 8161 -8010 -16154 -7743 7770 16114 8417 -7484 -15578 -8422 7336 15863 8228
1639H228j5348q558O873J6097Q416o947j5383r346P371J5247Q764o342j5646q921
$$ 8228 -7120 -15678 -8805 7292 15708 8761 -6622 -15968 -8597 6650 15414 9072 -6574 -15495
1653a5495O483J5403R245o295j5555q877N668J5704R178n990j5055r722N699J5302
$$ -15495 -9012 6391 15636 9341 -6214 -15091 -9423 6281 15459 9469 -5586 -15308 -9609 5693
1667E693R390n374j5225r519N390J4630J0209n409j4836r623M705J4892R887m956
$$ 5693 15083 9709 -5516 -15035 -9645 4985 15194 9785 -5051 -14674 -9969 4923 14810 9854
1681I854j4087j0510M606J5069R456m071j4535j0518M582J4237J0212l950j4384
$$ 9854 -4233 -14743 -10137 4932 14388 10317 -4218 -14736 -10154 4083 14295 10345 -4039
1694d039j0303L895J4124J1116m342j3931j0353L024J4634J0083l231j3735j1241
$$ -4039 -14342 -10447 3677 14793 10451 -3480 -13833 -10809 3825 13908 10677 -3058 -14299
1707a4299L691J3458J1098k847j4070j0771K588J3628J1304k899j3414j1047J922
$$ -14299 -10608 2850 13948 11101 -2969 -13740 -11152 2476 13780 10881 -2533 -13580 -11658
1720a1658J3734J1346k760j2758j1595K451J3565J0817j501j3738j1469K491J2619
$$ -11658 2076 13422 10662 -2096 -13691 -11240 2325 13142 11641 -2097 -13566 -11075 1544
1733A544J1879j972j3264j0905J053J3153J1682j739j2207j1902R52J3093J1040
$$ 1544 13423 11451 -1813 -12718 -11665 1488 13170 11431 -776 -12678 -11726 1367 12407
1746A2407p17j2635j1800J023J2135J1893l18j2888j1321J34J2372J2222j038
$$ 12407 11690 -945 -12745 -11722 413 12306 11988 -900 -12221 -12087 285 12507 11469
1759A1469j1564j2026j31J2639J1415L27j1686j2898O40J1494J1837R04j2374
$$ 11469 -95 -12121 -12252 387 11802 12129 443 -12455 -11815 -321 11516 12420 46
1772D6j1616j67J0779J2782K68j1392j1556j647J1684J2162P69j0592j2835r63
$$ 46 -11570 -11737 -958 11824 12092 700 -10856 -12503 -819 11343 12112 1520 -11315 -12278
1786a2278J1130J1716J872j1136j2431r90J0204J2875J614j1159j1578k275J0568
$$ -12278 -1148 10568 12440 1304 -11127 -12117 -1913 10962 12576 1417 -10161 -12436 -1868
1799a868J2672R56r759j2241k270J0782J1721K445j0075j2567j896R475J2328
$$ -1868 10804 11760 2001 -10240 -12510 -1728 9993 12438 2363 -10204 -12100 -2625 9703
1812I703L064j0533j1740k690R264J2801J954q882j2194l486J0187J1811K863
$$ 9703 12767 2234 -9506 -12196 -2932 9869 11823 2941 -9253 -12739 -2552 9259 12122
1825A2122q703j2810k723Q782J2122L941r709j2010l128Q247J2929K871q687j1447
$$ 12122 3419 -9391 -12114 -3332 8790 12731 3022 -8988 -12116 -3869 9060 11931 3244 -8203
1839h203m185Q874J2480L226q094j2692l671Q500J1707M814q705j2354l768P647
$$ -8203 -12388 -3514 8966 12192 4098 -8594 -12265 -3765 7942 12756 4051 -8303 -12071 -4424
1853d424J2645M173q468j1371n016Q069J2353L758o897j2406m774P984J1568N185
$$ -4424 8221 12394 3926 -7445 -12461 -4392 7961 11719 4822 -7584 -12358 -4374 7194 12379
1867A2379p256j2680l997O615J2067N307p974j1696m665O637J2793M141o608j1367
$$ 12379 5123 -7557 -11554 -4939 7128 12435 4461 -7235 -11900 -5263 7530 11671 5063 -6304
1881f304o024P355J1485N116n993j2735m818O433J1611N870o710j1589n331N581
$$ -6304 -12328 -4973 6512 11628 5635 -7100 -11918 -5485 6126 11996 5286 -6303 -11634 -6053
1895f053J2364N397n975j1402o266O229J1581N568m914j2244o141N905J1249O603
$$ -6053 6311 11708 5733 -5669 -11935 -5706 5875 11443 6529 -5715 -11856 -5951 5298 11901
1909A1901n688j1767n579M722J1872O350n606j1079p048N372J1848O099m731j1459
$$ 11901 6213 -5554 -11133 -6411 5461 11811 6205 -4874 -11922 -6550 5298 11397 6666 -4793
1923d793o925N402J0729P200m979j1505o452M184J1554P206n278j0710o969L921
$$ -4793 -11718 -6316 4413 11613 6634 -4871 -11323 -7139 4415 11621 6343 -4367 -11336 -7415
1937g415J1990O254l935j0968p243M433J0820O981l548j1081p194L784J0668P495
$$ -7415 4575 10829 6894 -4074 -11317 -6884 3936 10917 7369 -3712 -10906 -7122 3546 11041
1951A1041l782j0915p181L092J1552O911l442j0178q226L541J0711P277k816j0743
$$ 11041 7259 -3656 -10837 -7745 3807 10718 7276 -2902 -11128 -7587 3124 10401 7585 -3158
1965c158p695L374J0242P873l108j0651p243K197J0658Q164k817j0205p892K341
$$ -3158 -10853 -7479 2763 10636 7528 -3123 -10366 -8169 2489 10653 7836 -2369 -10261 -7920
1979g920J0483P757k259j0375q081K676R740Q111j918j0686p696K234R712Q218
$$ -7920 2563 10320 8061 -2314 -10395 -7719 2021 10132 8214 -2472 -10168 -7934 1778 9996
1993I996k112r408q417J542J0076Q108j577r870q338J918R393Q057p50j0096q228
$$ 9996 7884 -1524 -9941 -8399 1677 9785 8208 -1662 -10000 -8082 1311 9368 8618 -1478 -9706
2008i706J218R264Q800j126r650q202J210R265Q198j026q894q831J031R251Q373
$$ -9706 -8488 776 9576 8450 -1200 -9402 -8192 1073 9271 8245 -649 -9480 -8449 802 9175
2023I175o61r298q269P08Q467Q854l11r161q558L89Q922Q801m72q655q704M2Q947
$$ 9175 8514 -784 -9053 -8345 122 8976 8665 -496 -9054 -8665 257 9058 8586 -69 -8773 -8731 216
2040B16Q205L32q491q950K7Q299Q560L82q471q359l98Q029R141J86q103q770p57
$$ 216 8421 8753 262 -8688 -8661 -362 8198 8580 109 -8250 -8648 -619 8522 8708 605 -8165 -8922
2057h922Q408Q704O78p939r178n29P930Q899J101q177r047j093Q182Q940J043
$$ -8922 -514 8190 8868 929 -8249 -8778 -848 8051 9152 975 -8072 -9165 -983 7957 9000
2072I000p838q787j341P836Q843J204p649q803j404P566R217J141p263r147j486
$$ 9000 1162 -7625 -8966 -1130 7713 8917 1268 -7535 -8939 -1373 7844 8985 1722 -7425 -8911
2087h911P147R149J624p486q286j951O855R007J783p029r141j841P005R271J888
$$ -8911 -1764 7385 9009 1523 -6763 -8714 -1859 7148 8931 1902 -7239 -9080 -2075 7196 9084
2102I084o961q972k075O816Q755K573o885q917k490O664Q918K618o623q946k639
$$ 9084 2123 -6849 -8924 -2108 6647 9220 2335 -6582 -9072 -2408 6510 9128 2505 -6441 -9080
2117i080O678Q575K741o365q918k572O244Q827K941o263r034k758O016R008K800
$$ -9080 -2402 6173 8914 2549 -6369 -8941 -2697 6130 9071 2808 -6226 -8984 -2968 6040 8840
2132H840n770q947k984N977Q819K871n452r183l020N856Q447L367n433r093l293
$$ 8840 3070 -5877 -8861 -2884 5935 8806 3354 -5829 -8849 -2993 5454 8821 3388 -5705 -8998
2147h998N634Q854L300n382q883l213N145Q666L527n007q798l713N305Q588L751
$$ -8998 -3364 5490 8790 3408 -5475 -8688 -3543 5123 8650 3643 -5155 -8868 -3563 5025 8776
2162H776m879r070l427M586Q979L722m850q580l886M583Q710L966m493q711m096
$$ 8776 3897 -5173 -8600 -4014 4965 8687 3837 -4743 -8629 -4046 4664 8630 4137 -4574 -8670
2177h670M633Q650L948m263q857m153M663Q210M544m365q717m120M002Q767M282
$$ -8670 -4037 4613 8561 4298 -4559 -8712 -4049 4161 8705 4340 -4377 -8497 -4495 4272 8554
2192H554m275q230m704M146Q776M148l603q751m452M082P990M693l690q522m614
$$ 8554 4279 -3951 -8655 -4509 4267 8415 4812 -3939 -8391 -4309 3681 8374 4684 -3838 -8452
2207h452L608Q186N110l861p855n054L479Q188M820l194q066n272L568P920N010
$$ -8452 -4844 3342 8452 4591 -3264 -8318 -4839 3349 8169 4975 -3091 -8363 -4795 3125 8135
2222H135k940q166n026K779Q078N398l313p592n457K654Q347M915k591p727n639
$$ 8135 5195 -2971 -7997 -5218 2860 8258 4945 -2647 -8104 -5450 2897 7812 5221 -2506 -8145
2237h145L081P752N276k266q115n505K392P678O044k751p452n816K282P997N444
$$ -8145 -5064 2688 7964 5698 -2417 -7922 -5530 2148 8192 5441 -2011 -7827 -5545 2452 7896
2252G896k747p216n751K330P515N347j666p863n384J808P415O040j859p692n769
$$ 7896 5149 -2067 -7818 -5488 2027 7374 5708 -2155 -7539 -5731 1684 7724 5865 -1827 -7596
2267g596K040P332N863j936p098o077J370P688N645j133p327o359J804P198N617
$$ -7596 -5556 1776 7639 5703 -1395 -7472 -6102 1586 7231 6098 -1229 -7588 -5784 1414 7031
2282G031p08p722n959J296P114O199j226p237n921Q12P348N933r11o742o653J078
$$ 7031 6323 -1399 -7358 -6062 1052 7251 6025 -1212 -7133 -6321 1027 6960 6049 -693 -7346 -6268
2298f268P268N708k57p269o006N45O805O451q09o830n826M6O795O541p89o439
$$ -6268 1000 6708 6451 -818 -6824 -6279 526 6977 6168 -662 -6488 -6442 353 6894 6105 -334
2314c34o596O11O825N896J45o713o429L32O281O746n02o184o441m44O657O816
$$ -334 -6930 -6319 506 6402 6547 -166 -6595 -6263 18 6764 6262 78 -6363 -6807 -150 6666
2330F666j81o685o107m27O712N973L73o140o489q6N939O498N95o348o563j91N734
$$ 6666 6485 -200 -6307 -6734 -22 5951 6324 184 -6305 -6391 -452 6046 6641 293 -6270 -6461 -727
2347g27O916J19n918o274p35N958O491N71n668o594p41N842O275J091n619o551
$$ -727 6189 6308 390 -5884 -6619 -661 5830 6401 733 -5861 -6602 -760 5515 6606 987 -5564
2363e564r86N361O829Q32n423o354j514N671O538J039m900p008j258N557O353
$$ -5564 -6550 -1189 5640 6472 1049 -5305 -6819 -1148 5390 6429 1529 -5479 -6737 -1180 5173
2378E173J475n237o904j233N063O788J740n394o272j751M695P220J261n115o449
$$ 5173 6648 1411 -5493 -6726 -1663 5125 6865 1471 -4801 -6552 -1857 5363 6624 1509 -4940
2393d940j982N397O264J799m727o711j491M551O790J979n170o531j846M802O423
$$ -4940 -6922 -1525 4739 6538 1811 -4900 -6391 -1840 4950 6929 1759 -4772 -6618 -1816 4607
2408D607K047m676o554k181M739O422J970l991o688k326M348O485K236l776o933
$$ 4607 6654 1978 -4576 -6757 -2018 4404 6374 2383 -4305 -6631 -2283 4202 6438 2662 -4271
2423d271k441M208O779K528m272o445k896M123O881K346m021o481k485L563O740
$$ -4271 -6712 -2504 4275 6803 2531 -3914 -6810 -2687 4194 6540 2519 -3962 -6447 -2884 3856
2438C856K851l873o599k714L764O511K745l942o155l029L472O742K847l753o293
$$ 3856 6707 2834 -3765 -6479 -2715 3796 6541 2599 -3556 -6585 -3113 3629 6476 2723 -3570
2453c570k880L566O429K872l250o550k820L303O121L278l272o006l677L280O429
$$ -3570 -6450 -2884 3545 6417 3167 -3383 -6203 -2900 3221 6499 3227 -2779 -6456 -3176 3253
2468C253L277l413n909l633L355O313L234l044o565l101L132N808L581k946n983
$$ 3253 6530 3117 -2792 -6425 -3070 3243 6477 3433 -3132 -6233 -3101 2707 6288 3342 -2641
2483b641l352K410O460L413k906n943l526K387O355L352k105o433l540K412N929
$$ -2641 -5993 -3583 2877 6290 3384 -2559 -6085 -3698 2657 6009 3904 -2529 -6069 -3657 2272
2498B272L888k452o428l102J989O050L872k296n904l940K280O201L573k108n995
$$ 2272 6160 3708 -2720 -5822 -3833 2217 6089 3793 -2111 -6051 -3771 2430 6003 3895 -2100
2513b100l849K042O092L608k006n724l895J711N870M268k146n747l850J631O004
$$ -2100 -5949 -3907 2185 5793 3787 -1937 -5832 -4121 1749 6017 3871 -1876 -5726 -4095 1909
2528A909L828j757n649m413K050N775M091j537n889m164J656N569L964j276n843
$$ 1909 5737 3980 -1669 -6082 -4032 1743 5834 4297 -1592 -5756 -4100 1469 5433 4157 -1686
2543a686l851Q74O016M385j575n411m555J436N524M235p38n677m401J213N426
$$ -1686 -5537 -4663 1353 5738 4163 -1248 -5803 -4367 1157 5392 4654 -1023 -5424 -4211 1215
2558A215M072p85n623m241Q72N716M131r38n097m747R95N252M485p98n398m364
$$ 1215 5287 4502 -1121 -5362 -4490 1226 5357 4419 -678 -5425 -4430 822 5307 4509 -889 -5253
2574e253R86M737M782o53n393m573J034M874M827q31n043m466J27N355M457m81
$$ -5253 -4267 470 5252 4599 -794 -5367 -4333 541 5368 4537 -506 -4972 -4845 510 4967 4486
2590D486m800m786O47M894M470j65n184m436M38M653N056m81m786m681N1M686
$$ 4486 -314 -5100 -4453 441 4911 4746 -438 -4874 -4436 217 5273 4792 6 -4675 -4624 62
2606F2M679K2m770m831K57M813M638l32m371m840j8M388M900J55m997m361j84
$$ 62 4741 4763 -7 -4838 -4581 232 4870 4538 167 -4673 -4691 -303 4597 4752 -245 -4606 -4790
2623d790M504M767O1l945n017n15M787M327N97m473m741l14L915N020P39m448
$$ -4790 -286 4481 4542 597 -4420 -4935 -148 4179 4776 303 -4438 -4752 -837 4183 4922 474
2639D74m848l27L920N082O29m443m433j018M432M508P58l969m959n95M279M295
$$ 474 -4374 -4701 -781 4301 4930 487 -3946 -4964 -532 3976 4734 765 -4194 -4789 -510 3785
2655C785Q70m042m823k52L614M743Q60l765m504j470M034M676J159l730m857j145
$$ 3785 4655 613 -4210 -4462 -848 3895 4755 990 -3514 -4984 -950 3726 4885 1155 -3702 -4847
2671d847L997M689J114l797m884j007L691M553J514m114m396j440L706N035P96
$$ -4847 -850 3839 4953 1156 -3728 -4735 -1044 3509 5023 909 -3487 -4927 -1221 3814 4610
2686D610l176n107j094L597M561J546l446m827j508L412M868J513l433m557j748
$$ 4610 1434 -3673 -4767 -1170 3391 4937 1491 -3336 -4844 -1432 3436 4949 1516 -3041 -4789
2701d789L049M894J641l109m711j675L081M773J714l156m905j361K960M585K190
$$ -4789 -1740 3154 4795 1686 -3025 -4700 -1619 3154 4868 1712 -3193 -4554 -1594 2991 5181
2716E181l340m846j535K459M834K008k990m738j917K728N324J434k813m642k020
$$ 5181 1841 -3005 -4540 -2081 2753 4761 1771 -2967 -4884 -2156 3168 4602 1789 -2853 -4873
2731d873K909M551K137k840m489k160K703M707K168k882m488k248K483N014K044
$$ -4873 -1964 2587 4724 1884 -2605 -4765 -2062 2645 4813 1931 -2557 -4805 -2322 2692 4736
2746D736k880m295k398K695M904J827k084m987j923K244M640K202k500m449k191
$$ 4736 1856 -2439 -4837 -2142 2762 4589 2505 -2482 -4405 -2161 2479 4681 2181 -2268 -4459
2761d459K214M503K575k390m668k497K237M747K143j928m624k450K113M443K653
$$ -4459 -2245 2258 4833 2443 -2225 -4722 -2485 2262 4405 2477 -2147 -4597 -2484 1959 4612
2776D612k067m815j929J552M599K429j911m292k810K051M453K599k053m221k812
$$ 4612 2545 -2270 -4199 -2647 1952 4381 2470 -1822 -4632 -2581 1872 4471 2418 -1803 -4615
2791d615K309L941K639j722m316k647J787M488K388j687m239k573J606M307K595
$$ -4615 -2306 1635 4274 2552 -1764 -4411 -2624 1864 4252 2565 -1674 -4247 -2641 1666 4261
2806D261j354m627k674J843M208K694j456m329k963J508M257K971j442m277k852
$$ 4261 2907 -1720 -4394 -2551 1657 4351 2895 -1434 -4397 -2889 1368 4339 2897 -1380 -4232
2821d232J295M475K441j110m189k853J347M139K747j144m083k849R02M213K872
$$ -4232 -2937 1538 3979 2869 -1320 -4173 -2826 1313 4060 2916 -1167 -4016 -3114 1099 3971
2836C971q22m142l429J281M221K976j088l863l199O88M336L097j032l699l425
$$ 3971 3149 -993 -4422 -3141 1080 4056 2968 -895 -4094 -3406 930 4027 2995 -704 -4129
2851d129R32M146L199j094l981k998Q29L885L301r16m001l143O60M083L054p25
$$ -4129 -3197 949 4148 3054 -927 -3925 -3096 789 4090 3174 -827 -3970 -3310 773 3827 3102
2867C102l799l409R72L735L210m28l984l075N32L522L535n33m011k914O6L951
$$ 3102 -697 -4106 -3134 601 3811 3383 -601 -3676 -3144 378 3913 3380 -631 -3545 -3479 472
2883D72L330o40l656l396N13L674L430k86l967l030J21L683L285l02l518l279
$$ 472 3802 3162 -494 -3890 -3377 297 3727 3441 -526 -3556 -3435 248 3533 3231 -287 -3566
2899c566P0L690L342k61l505l476L81L480L161J06l501l543J11L592L263J01l271
$$ -3566 -3496 194 3536 3275 -230 -3706 -3325 155 3316 3422 -79 -3622 -3511 81 3344 3445 174
2916A74l589J4L356L592k16l152l626j23L489L397J8l077l629r7L279L371M59
$$ 174 -3415 -3401 -45 3547 3331 179 -3447 -3570 -81 3316 3334 257 -3372 -3469 -190 3181 3640
2933C640l345l289n50L295L590J06l050l294m39K857L450O44l113l387n62K950
$$ 3640 295 -2994 -3544 -249 3341 3447 397 -2897 -3336 -479 2971 3615 502 -2885 -3447 -497
2949d97L402O88l070l841l1K816L602M88k896l446o35K764L936P6k542l827n27
$$ -497 2905 3593 523 -3318 -3349 -533 3069 3557 661 -2785 -3420 -656 3280 3356 814 -3013 -3540
2966c540K806L532O37k935l385p01K942L203R11k573l579q40K592L655Q99k682
$$ -3540 -734 2798 3435 500 -2885 -3586 -644 2559 3470 897 -2682 -3522 -930 2725 3624 942
2982I42l777p46K598L343J213k630l490r68K473L545J103k695l540q60K260M027
$$ 942 -2835 -3581 -983 2360 3573 943 -2547 -3515 -1042 2503 3606 911 -2629 -3489 -1229 2798
2998B798P48k435l458j236K203L845J159k555l647r08K398L314J294k264l598
$$ 2798 3546 1111 -2347 -3583 -1380 2465 3624 1069 -2578 -3486 -1088 2226 3520 1256 -2342
3013b342j030K206L548J156k286l491j213K201L422J218k076l752j107K358L327
$$ -2342 -3372 -1166 2382 3538 1252 -2239 -3452 -1251 2171 3389 1313 -2439 -3546 -1188 2139
3028B139J411k056l638j465K387L495J223k020l659j229J907L662J575k428l288
$$ 2139 3550 1494 -2144 -3609 -1222 2273 3496 1476 -2183 -3412 -1505 2157 3732 1304 -1984
3043a984j386K149L021J441j674l616j213J656L279J853k228l082j590J652L795
$$ -1984 -3370 -1221 1800 3241 1567 -2049 -3262 -1606 1673 3526 1298 -1784 -3374 -1722 2073
3058B073J341j747l591j841K023L639J213j165l623j657J609L467J726j565l478
$$ 2073 3414 1667 -1924 -3765 -1742 1897 3110 1945 -1678 -3335 -1726 1741 3467 1902 -1576
3073a576j767J488L546J664j460l222k076J522L629J273j011l437k035J704L045
$$ -1576 -3343 -1855 1691 3355 1895 -1327 -3403 -1881 1748 3021 2010 -1427 -3462 -1758 1287
3088A287K222j616l427j950J253L554K251j568l187k108J446L157J991j243l480
$$ 1287 3509 1893 -1534 -3484 -2231 1323 3574 2006 -1181 -3289 -1843 1314 3305 2062 -1418
3103a418j818J348L268K077j431l276k227J359L343K006j128k976k130P45L358
$$ -1418 -3236 -1888 1380 3457 2026 -1250 -3477 -2118 1225 3231 2103 -873 -3003 -2258 1100
3118A100K115r57l347k027Q85L492K231j326l180k130P42L514K045r75l233j995
$$ 1100 3215 2258 -1089 -3116 -2231 1261 3492 2166 -1014 -3144 -2402 1112 3157 2182 -1051 -3046
3134c046P59L199K161q99k804k343O58L070K358r45k744k412P38L200K287q93
$$ -3046 -2287 912 3073 2174 -630 -2973 -2315 755 3113 2168 -576 -2988 -2250 950 3237 2344
3150B344k994k141O40K877K125o46l053j995M91L049K339q02k930k360Q86L018
$$ 2344 -650 -2791 -2151 726 2851 2205 -848 -2843 -2352 697 3036 2234 -696 -3056 -2170 848
3166H48K277o89l096k238N90K649K539m92l092k321N07L113K259m38k596k713
$$ 848 3125 2436 -660 -2898 -2308 341 2880 2388 -704 -3025 -2518 595 2854 2416 -180 -2893
3182b893N22K826K288n01k669k356K09K817K830o55k828k131q0K737K688p14k444
$$ -2893 -2371 455 2743 2242 -427 -2783 -2574 243 3073 2418 -410 -2541 -2621 116 2804 2090 -354
3199c54k472L48K544K655j39k645k573J08K638K485q9k853k039k54K595K745j56
$$ -354 -2826 -2478 66 2721 2582 -63 -2636 -2528 110 2595 2506 -347 -2386 -2640 -45 2700 2544
3216B544k573k433%K675K443j76k253k908K02K700J996M16k508k665p3K597K209
$$ 2544 -29 -2462 -2462 213 2656 2480 227 -2681 -2479 221 2217 2633 125 -2540 -2613 -16 2193
3233B193K25k321k601jK279K760R2k573k427n9J954K567P96k395k938m2K154K654
$$ 2193 2418 97 -2504 -2505 -226 2534 2626 53 -2374 -2433 -479 2088 2884 489 -2449 -2491 -337 2317
3251B317K69k214k554m95K471K379L85k108k633l48K131K645M12k061k857o00
$$ 2317 2586 372 -2182 -2677 -206 2173 2558 450 -2183 -2531 -400 2245 2657 596 -2261 -2861
3267b861K255K651O41k285k450n87K165K647M31j854k807m72K003K469O72j971
$$ -2861 -606 2045 2686 401 -2049 -2636 -471 2176 2607 753 -2054 -2526 -523 1946 2618 647
3283F47k638n49J963K614N81j974k582q01K114K484Q38j894k768o86J987K818
$$ 647 -1991 -2540 -577 2037 2618 644 -1938 -2739 -625 1859 2697 803 -1965 -2651 -664 2154
3299B154O62k164k941k80J843K706Q11j970k670q39J635K939N46j454k801j023
$$ 2154 2816 652 -2289 -2569 -726 1980 2791 821 -1849 -2688 -1053 1886 2432 978 -1823 -2846
3315b846J992K976P32k215k447q98J958K451P65j445k637q57J598K442J307k094
$$ -2846 -854 2122 2854 639 -1808 -2706 -748 1703 2468 1023 -1614 -2471 -873 1569 2876 782
3331G82k324r71J498K561J037j568k571j189J656K685J124j604k738r95J694K350
$$ 782 -1542 -2513 -1015 1546 2583 1015 -1556 -2745 -1089 1596 2720 1116 -1622 -2617 -923 1427
3347A427J239j297k814j101J395K466J257j304k463j695J866K644J031j687k460
$$ 1427 2666 1369 -1445 -2546 -1151 1315 2572 1268 -1195 -2890 -1024 1620 2651 964 -1496
3362a496j118J309K624J291j293k695j114J401K655P03r43k394j412J190K679
$$ -1496 -2614 -1305 1319 2610 1317 -1378 -2492 -1091 1564 2267 1324 -1070 -2482 -1292 1387
3377A387R02r55k318j750J339K756J081j179k518j227J300K252J439j436k126
$$ 1387 2289 1334 -984 -2734 -1395 1361 2442 1263 -1255 -2482 -1182 1070 2509 1073 -1053
3392a053j433J043K765R46r55k219j383P51K694J206q93k587j770J508K317J466
$$ -1053 -2486 -1443 1322 2268 1313 -906 -2289 -1538 1156 2362 1469 -1118 -2888 -1380 937 2403
3408B403r36k186j734Q50K552J625j113k408j561Q76K627J190p01k358j394P41
$$ 2403 1467 -719 -2453 -1603 949 2574 1461 -947 -2508 -1632 995 2185 1484 -874 -2268 -1527
3424a527K392J710j063k376j628R85K331J803j243k209j253M26K470J423q08k209
$$ -1527 865 2575 1512 -864 -2492 -1507 824 2627 1384 -825 -2078 -1652 818 2241 1433 -776
3440g76j680Q12K289J668q65k293j405M19K337J841n88k405j476L62K479J512
$$ -776 -2456 -1644 645 2313 1448 -845 -2250 -1831 506 2347 1759 -646 -2122 -1760 719 2231
3456B231n82k205j654N47K376J523m56k384j649Q36K234J448l31k418j703M53
$$ 2231 1649 -556 -2210 -1663 713 2236 1780 -604 -2253 -1417 817 2265 1934 -484 -2187 -1734
3472a734K168J839p11k018j839N45K282J649l35k374j681M54J782K197m22k294
$$ -1734 434 2273 1562 -456 -2295 -1750 532 2181 1846 -528 -2209 -1755 27 2224 1802 -492
3488d92j821N77K410J761n04j973k296M72K285J762n39j802j939K05K290J801
$$ -492 -2313 -1736 674 2435 1931 -42 -2338 -1866 419 2181 1642 -160 -2099 -1894 396 2197
3504B197l14k310j591N41J572J905k77k000j778K23J884J915j87j968j789L7J987
$$ 2197 1883 -427 -2018 -1477 95 2000 1723 -277 -2055 -1832 52 1967 1780 -188 -1977 -1940 47
3521D7J949j16k062j666J91J941J786j07k216j502r3J873K212l03k243j604L19
$$ 47 1996 1880 -182 -1848 -1657 284 2070 1963 -253 -1755 -1848 25 2237 1934 -309 -1913 -1594
3538a594J653J913k66j883j739J00J966J932Pk014j864M1J736J974J94j973j961
$$ -1594 59 1972 1706 -177 -1916 -1816 150 2082 2089 75 -1789 -1748 -12 1962 2156 183 -1778
3555a778p7J760K068j49j633j922l46J858J967J58j719j825k29J886J810K81j808
$$ -1778 -1855 -95 1973 1824 191 -1731 -2077 -219 1748 1906 187 -1638 -1867 19 1829 2110 302
3572C02j953k48J930J841J09j573k305k29J989J719L46j913j809j18J516K190
$$ 302 -1651 -1899 31 1872 1981 408 -1897 -2126 -137 1582 1928 15 -1794 -1912 -396 1794
3588A794kj493k089k77J806J856L51j689k122PJ656J691N58j845j749l65J666
$$ 1794 1792 299 -1790 -2067 -261 1595 1946 257 -1865 -1858 -202 1489 2047 202 -1547 -1912 -246
3605b46K108kj450j873l28J456J954L25j630j754n68J465K310K17j728j863n88
$$ -246 1862 1860 410 -1463 -1791 -335 1619 1944 314 -1440 -2008 -543 1767 1984 256 -1607 -2195
3622b195J748K018N06j787j451q48J270K053P63j707j663o94J322K219M48j347
$$ -2195 -447 1571 2077 290 -1161 -2009 -739 1314 2077 370 -1293 -1987 -665 1554 2002 655
3638F55k148n07J240K302L64j267k196l68J222J974Q17j556j697r40J294K081
$$ 655 -1493 -2000 -760 1542 1906 639 -1557 -1925 -703 1271 2088 532 -1165 -2105 -811 1270
3654A270Q10j456j855o74J349J578R05j173k232k86J028J998P57j030k229p87
$$ 1270 2080 624 -1231 -1905 -556 1022 1927 754 -1478 -1764 -736 1262 2019 989 -1240 -2027
3670b027J142K406N99j148k305p50J241K055R06j242k117q81J526J743Q28r81
$$ -2027 -885 1521 2120 972 -1333 -2083 -842 1213 2119 877 -1240 -2121 -595 1148 1976 995
3686I95k151n48P01K176P18p09k189j093J171K062O74j008j916r59J334J707J057
$$ 995 -1156 -1704 -1003 1173 1891 1182 -1007 -2100 -929 1133 1807 799 -1117 -2076 -742 965 2022
3703B022r92k229p62R81K011O80p05k066r01J069J945R47r08j913r93R01J803
$$ 2022 1030 -1199 -1961 -980 1031 1711 1006 -1060 -1961 -892 1053 2000 1092 -821 -1814 -913 890
3720H90J094p97k050j139Q89K008J071r22j736j237R85J689J056o92j797j118
$$ 890 1984 1187 -863 -2002 -1113 895 1966 1044 -692 -1929 -944 745 1801 1109 -688 -1806
3736a806O10J991J012m46k443o70N94J853J173o74j857j162L70K161J451j025
$$ -1806 -1196 795 1807 1361 -1082 -1752 -1158 695 1868 1194 -663 -1825 -1455 706 2157 1132
3752A132j523j572R78J586J371p79k143o86L53J780J311m88j897j281N34J874
$$ 1132 -391 -1963 -985 601 1972 1193 -950 -1636 -1283 497 1808 1320 -577 -1858 -1324 550
3768E50J283n67j921j253O55J772J285p35j609j291N40J774J477m66k232j075
$$ 550 1833 1266 -655 -1908 -1253 519 1804 1069 -540 -1831 -1291 483 1960 1494 -738 -1813
3784a813M49J676J577m13j884j406L41K032J200l33j728j512K53J981J382m27
$$ -1813 -1364 312 1889 1476 -408 -1814 -1473 559 1759 1426 -302 -1814 -1561 420 1802 1375
3800A375j940j122L03J706J598n25k018j140N38J602J308l51j463j739N37J710
$$ 1375 -565 -1687 -1384 322 1920 1395 -623 -1763 -1225 377 1685 1334 -129 -1868 -1331 379
3816C79J177k05j818j533N41J582J556k34j595j482MJ824J815p88j579j203P3
$$ 379 1556 1351 -467 -2000 -1459 123 1679 1445 -150 -1632 -1628 196 2011 1223 -356 -1559 -1486
3833a486J388J626o0j581j580L14J713J484j25k037j463K55J679J757l33j653
$$ -1486 -98 1528 1468 -113 -1693 -1379 334 1818 1693 -344 -1807 -1552 127 1884 1551 -102
3849a02j494j28K096J366L4j862j710K53J596J539L7j791j624K61J406J567L43
$$ -102 -1596 -1724 372 1738 1772 -90 -1800 -1547 49 1588 1625 -166 -1790 -1529 -123 1444 1787
3866A787j899j581K14J531J593qj750j275j76J575J747Qj702j521M3J455J524
$$ 1787 -112 -1693 -1479 52 1645 1637 -113 -1388 -1564 11 1758 1766 64 -1457 -1414 41 1565
3883A565M8j527j494k54J326J718J98j407j928J34J665J348L43j697j434m06J667
$$ 1565 1613 86 -1408 -1662 -336 1382 1580 173 -1755 -1621 44 1392 1735 38 -1396 -1802 -135
3900a35J568K09j345j786r6J261J839J80j411j607m52J551J613L47j408j739o9
$$ -135 1433 1642 297 -1489 -1585 -324 1515 1695 284 -1323 -1775 -224 1389 1736 328 -1411 -1480
3917a480J437J533K90j402j687l35J201J825J35j057j944j30J465J580K40j335
$$ -1480 -43 1490 1780 378 -1309 -1644 -443 1382 1517 460 -1484 -1614 -149 1431 1671 336
3933C36j733k98J459J705J20j025j749n64J463J372P56j291j661o18J349J724
$$ 336 -1397 -1695 -236 1469 1589 564 -1185 -1749 -286 1086 1842 551 -1110 -1728 -379 1345
3949A345N02j434j682m02J359J417O56j041j907q52J290J693Q54j545j524m79
$$ 1345 1847 413 -1269 -1671 -312 1105 1761 720 -1187 -2039 -749 944 1798 253 -1271 -1750
3965a750J202J499Q33j248j973m77J220J611Q13j030j903n10R04J748Q10j220
$$ -1750 -548 951 1784 536 -1437 -1914 -694 917 1730 700 -1203 -1713 -809 939 1749 529
3981E29j581n59Q21J976L78r72j443r30J204J424Q63r26k094m23J171J612O99
$$ 529 -1052 -1611 -790 1186 1564 592 -851 -1781 -577 847 1710 784 -1310 -1733 -562 1050 1749
3998A749j027j890l83Q51J556O51q74j761n15J011J608Q75j117j557j165J309
$$ 1749 722 -1168 -1551 -700 856 1507 633 -1128 -1643 -632 976 1851 734 -823 -1988 -679
4014f79J281R41p20j497q52O86J906O25j001j609q35P92J655R19q32j565q56N80
$$ -679 602 1543 823 -674 -1526 -840 1066 1691 690 -919 -1754 -962 693 1612 780 -785 -1641 -1061
4032a061J808R83p83j597j007R38J376J006q09j593r54O09J804J073q88j476j147
$$ -1061 747 1730 947 -650 -1657 -719 657 1663 854 -739 -1693 -1084 720 1793 905 -571 -1718
4049a718Q13J629P66m93j717r42N78J721J215r11j592r85P04J589Q07n64j520
$$ -1718 -905 724 1490 997 -720 -1662 -1084 637 1852 941 -651 -1636 -932 657 1464 900 -620
4066f20j106P35J714Q51m00j827j009Q38J413J137p23j534j062M86J821O52l80
$$ -620 -1726 -991 723 1574 1174 -653 -1662 -824 589 1726 1003 -531 -1593 -1107 714 1366 986
4083I86j484j119N20J630J136o29j752j036Q75J248J259o96j566q88M44J668J051
$$ 986 -498 -1617 -1097 533 1669 1040 -712 -1748 -873 375 1634 938 -628 -1516 -1072 596 1647
4100A647m27j599j218N96J318J220l80j358j575O37J566R29j37j709j064L15J302
$$ 1647 1220 -379 -1597 -1001 317 1537 1157 -201 -1776 -1139 427 1356 1219 -490 -1554 -1239 63
4117F3J222l42j112j294M69J326J317l58j741r79J46J524J236l10j329j443N85
$$ 63 1285 943 -169 -1463 -994 332 1649 1291 -450 -1429 -1283 241 1477 1167 -162 -1605 -1020
4134a020J120J456m78j386r44J14J388J204k71j548r88J66J067J523k83j143j154
$$ -1020 100 1556 1078 -308 -1252 -1138 250 1454 1183 -365 -1353 -1187 -120 1403 1120 -23 -1177
4151a177l7J370J135N0j500j236K85J184J426L7j728j233Q8J602J165j51j257
$$ -1177 -1214 156 1291 1341 -159 -1395 -1110 74 1500 1537 -191 -1424 -1336 266 1431 1280 23
4168B3j540J81J523J131L9j442j309o8J556J458l39j540j011l1J319J486k44j150
$$ 23 -1517 -1336 187 1318 1357 -85 -1394 -1462 94 1552 1213 -327 -1338 -1369 -50 1436 1192 42
4186D2j154k50J356J223lj294j434L76J142J506k53j153j337k11J422J101K64
$$ 42 -1112 -1362 -6 1217 1214 -80 -1514 -1138 4 1510 1257 104 -1233 -1444 -22 1079 1343
4203A343j375j043q9Q45J753k39j096j502KJ073J539Q1j377r19l11J146J195K47
$$ 1343 -32 -1075 -1164 -319 1434 1195 99 -1403 -1401 -328 1211 1292 -85 -1004 -1315 -169 1026 1273
4221A273j153j437Q5P30J777n9r85j293l69J072J494L70j501j059l67J065J424
$$ 1273 120 -1317 -1232 -502 1275 1216 231 -1062 -1431 -359 1135 1505 4 -1055 -1422 -357 1067
4238A067K79j309j152j92R74J402K97r25j709k78J139J791J35j430j199j70Q74
$$ 1067 1346 37 -1115 -1307 -333 1069 1366 441 -1268 -1546 -407 1384 1519 89 -1110 -1280 -406
4255d06J406K90q53j448o47J112J830J42j041j538l40R53J611L97j133j329l56
$$ -406 1000 1290 437 -1011 -1658 -546 1284 1426 385 -1153 -1493 -540 1071 1468 335 -994 -1350
4272a350P80J483M78j055j193p92R22J751L09q66j414n25J047J183N05q22j302
$$ -1350 -570 913 1391 336 -857 -1649 -727 1024 1333 467 -947 -1472 -425 758 1263 441 -861
4289h61k86Q78R14P20p53j545m98J088J475M81j005j517n87R59J552M83j102j238
$$ -861 -1147 -269 645 1365 612 -933 -1431 -343 1132 1613 608 -909 -1496 -537 1015 1498 396 -842
4307h42n42J105J011Q41j114j461o15J077J447O48j069j504l70O28J614O05r30
$$ -842 -1384 -279 732 1573 459 -1002 -1617 -540 907 1555 486 -1018 -1388 -760 854 1459 529
4324E29r63j087P98J485O20p12j370p42O27J611P56j058j107q78R42J375N62p10
$$ 529 -434 -1521 -723 762 1382 670 -700 -1442 -815 796 1552 494 -613 -1491 -549 826 1388 678
4342F78j539o62O25J544P93n93j667o03O18J578P08p03j440p69O70J478Q82o12
$$ 678 -861 -1523 -898 646 1439 846 -821 -1424 -806 772 1480 777 -663 -1432 -762 716 1598 986
4360I86j310j036N17J621O65o84j389r00P24J303P67l38j596p52L79J594P63n46
$$ 986 -324 -1360 -843 778 1443 759 -630 -1530 -806 497 1264 926 -670 -1422 -1043 551 1314 768
4378G68j122r27L54J467Q94p19j206r15M81J270J125n99j214j162P21J335J068
$$ 768 -354 -1281 -927 540 1434 715 -491 -1406 -925 345 1470 871 -343 -1505 -784 551 1619
4395A619o97j526p38N04J426Q57n00j589p68M93J431Q41l49j482o37Q7J514J010
$$ 1619 922 -604 -1342 -838 588 1445 945 -644 -1412 -919 512 1353 1004 -478 -1115 -1028 486 1496
4413A496m82j450j090O80J322P02l24j015j225L14J456R95n39r24j293L40J593
$$ 1496 1014 -436 -1526 -846 476 1178 854 -161 -1386 -1072 384 1379 840 -84 -1377 -1037 556
4430E56Q34l83j074p23m37J452J231m20j213j124K87J000J249j56j259r86O3J311
$$ 556 1390 1007 -67 -790 -1227 225 1456 1036 -177 -1301 -1014 -14 1235 1079 -180 -1166 -1103 208
4448B08J231k69j462j094K82J310J338m47j302j060N0J402J012l67j113q57j5
$$ 208 1439 1170 -292 -1386 -1104 206 1544 1097 -205 -1265 -1215 187 1199 832 -281 -1138 -1153
4465a153J387J287m17j245j058n1J514J034m0j443j097J95J028J492j58j360j097
$$ -1153 234 1521 1104 -141 -1199 -1250 264 1298 1258 -185 -1282 -1087 -59 1433 1275 -85 -1182
4482a182K92P43J379j90j301j064J79J279J100K5j381o23l59J215J267k13j034
$$ -1182 -890 -147 1232 1042 -259 -1323 -1144 135 1235 1260 -121 -744 -1103 112 1379 1166 132
4499A32j358J08J280J092j20j214j296M61P89J158K11j184j101k59J285Q41M51
$$ 132 -1226 -1118 162 1254 1134 -80 -1376 -915 -126 1032 1243 59 -1042 -1301 -16 825 1276
4516A276j527q14l76J306J174K37j073j396M3J067J349j35q83j402k36J365J327
$$ 1276 -251 -1065 -1441 -135 1039 1276 203 -1193 -1150 -83 1266 1131 248 -1154 -1390 -25 1302
4533A302r2j084j165j5Q73J360P6j059j419k2Q66J288K61p24j524r2R86J211L11
$$ 1302 1210 126 -1039 -1054 -181 1179 1255 196 -1223 -1245 -379 909 1170 446 -1078 -1170 -184 1027 1338
4552A338j113j330k55R78J393K16j051j058l54R51J490J52j107j225k52R09J389
$$ 1338 225 -1105 -1360 -382 1011 1227 176 -882 -1236 -285 1205 1357 250 -975 -1227 -318 1071
4569A071L51r09j457k45R05J390J65r41r90o31Q76J410K72q45j449l60R17J438
$$ 1071 1422 513 -944 -1189 -284 1106 1271 330 -660 -1291 -415 995 1267 422 -1027 -1387 -470 968
4587I68M21j034j008m89Q32Q10P51q42j428n51J302J039M38q56j025o57P56J269
$$ 968 1389 355 -653 -1142 -310 500 1251 409 -1019 -1570 -268 771 1209 353 -672 -1329 -573 696
4605F96N32p80j369l41J022Q89O23q65j277k84P68J432j5m26j486m89R61J143
$$ 696 1228 448 -921 -1262 -240 649 1272 407 -870 -1154 -386 1046 1031 605 -881 -1370 -409 734
4623G34O82p17j438m46P40J325L90p30j306n81R20R67P92o45j464m61M11J463
$$ 734 1416 699 -739 -1185 -445 880 1270 540 -766 -1347 -427 540 1332 687 -777 -1238 -827 636
4641F36M64m31j305n28P30J017P43o37j209r53O80J505O06p67j128q52M89J615
$$ 636 1100 669 -636 -1164 -434 583 1326 689 -520 -1473 -793 712 1318 551 -577 -1429 -940 675
4659F75O52n93j698l56Q06J035O82n53j338l50K68J258N23l22j231q29N73J379
$$ 675 1327 734 -964 -1320 -514 521 1203 650 -688 -1038 -770 488 1011 689 -542 -1371 -798 581
4677E81P48o38j161p24N66R62J078r77j173o92N03J515P32o80j061r52M86J371
$$ 581 1329 691 -470 -1194 -628 334 1412 435 -738 -1430 -927 588 1320 640 -421 -1373 -887 484
4695D84R39p49j007j042N75J464N81m00j493n88M69J189P62l11j351q24K16J423
$$ 484 1423 674 -333 -1375 -800 664 1245 845 -648 -1236 -767 422 1184 873 -478 -1302 -1086 337
4713C37O61q3j282o53L35J116Q01k90j289r04L39J331R10o02j124o57l1J397P46
$$ 337 998 915 -367 -1020 -685 431 1232 942 -347 -1251 -912 419 1329 727 -397 -1054 -1085 312 1058
4732A058l2j269r61L81J262Q33l81j230r74M64J264O03j12j110j209N87J028J058
$$ 1058 1026 -243 -1204 -823 439 1272 891 -339 -1313 -849 415 1018 906 -204 -1413 -826 202 1260
4750A260m51r26j226L91J200R10j09j068j001J19J104J074j57j240j182N24P71
$$ 1260 809 -117 -1343 -952 248 1158 1049 -19 -1020 -901 203 1277 1120 -120 -1302 -778 -7
4767gJ252l09r03j134L31J197R01l75j070j086J45J224R27j48j078r79O1J171
$$ -7 1245 936 33 -1101 -770 427 1328 953 -117 -1203 -1058 166 1093 945 -133 -1112 -1051 120
4785A20R95Rj192r88J91J062Q21J64j260j019p4J185R35p8p99j274L33R95J055
$$ 120 1115 1124 -68 -1056 -865 197 1018 1182 -78 -1097 -1171 14 949 871 72 -1202 -869 126 1181
4804A181m31p06j173J60R30J164M2j146q91k57J201J024j02j102r37P5Q71J208
$$ 1181 750 44 -1129 -969 -39 1125 1167 21 -870 -1127 74 1098 996 -106 -1043 -968 -97 1111
4822A111J01j070j131r6Q17J246R7j127q42k45Q89J180J89j436n04l84J065J043
$$ 1111 1212 142 -989 -1085 -268 978 1075 -52 -894 -1139 -250 930 1119 -317 -821 -1205 -140 903
4840I03L85j072j318l78J474R83J07p75j452J54O95J392qj010j199R8N50J266
$$ 903 1288 216 -1102 -1480 -6 977 1084 309 -1143 -989 -294 1098 1090 80 -1119 -1021 -471 795
4858G95L41q65j481L3P61J357M07j090j104k41Q93Q51N38j040j083k54Q28J043
$$ 795 1136 271 -1210 -1177 -416 941 1348 258 -846 -1087 -194 657 1195 155 -928 -1182 -354 689
4876F89N47j030j251N1N99J188M81r35r78m10P65J188J18m66j395l87O07J309
$$ 689 1236 206 -1045 -994 -395 793 1274 339 -639 -1049 -284 904 1022 556 -839 -1226 -619 690
4894F90M51r60j075m12R10J191L87q66j442K9N45J384J68m17j349m27N65J553
$$ 690 1141 181 -894 -1306 -396 795 1182 316 -1126 -1097 -552 832 1000 583 -766 -1193 -628 925
4912I25L05p65j236k60P79J027N20j018j074l30O34J100R84q59j628j00M06J234
$$ 925 1230 465 -771 -1031 -252 775 1295 277 -797 -1127 -493 607 1591 732 -896 -996 -590 644
4930F44M97q02j034l72M09J063J036r58j180m44O12J203M35n54j113p32O29J406
$$ 644 1141 339 -695 -1067 -658 405 1441 483 -697 -1141 -529 674 1109 555 -558 -1290 -661 745
4948G45K87o79q12o07N95Q34Q45n08j585j90O92Q19P63k65j392p38P66Q49P51
$$ 745 1032 353 -459 -1066 -471 363 1208 700 -885 -1075 -383 436 1199 934 -458 -1196 -430 419 1170
4967A170o92r53l83L10R72N23k95j224n74L02J532K69k51j177p03L25J230O70
$$ 1170 478 -475 -858 -548 424 947 652 -572 -1146 -844 688 957 706 -471 -1174 -849 381 1051
4985A051l58j062q38M93J207O94l22j455n29M16J186O44l06j229p64N59R80Q43
$$ 1051 693 -369 -1207 -714 493 1187 865 -590 -1119 -703 483 1127 821 -408 -1172 -613 367 1210
5003A210l95j274m65k3J187Q69l27j375n87K41J287Q15l02j229j072O90J178N17
$$ 1210 815 -459 -924 -947 240 1109 782 -593 -1180 -939 348 1163 861 -368 -1440 -750 428 945
5021I45l1j288n23K69P85J179p16n54j183O77R47M54j8j307q27L81J191O69l40
$$ 945 914 -374 -897 -628 157 1336 620 66 -1117 -440 507 961 943 -364 -1191 -810 381 1050 710
5040G10j007q23M96O99J160m08j012q58n2J299J076l34j142q49p6J377P87J0r07
$$ 710 -297 -1120 -624 75 1235 827 -185 -1043 -1095 204 1280 946 -196 -1045 -1121 256 1043 1053 146
5059A46j203J15J146P74p0j107q67P0J173R79j76j329p97L22J182N74j0j129o93
$$ 146 -1057 -942 204 978 908 -199 -1066 -996 177 1156 980 -349 -1146 -824 358 932 922 -207 -900
5078i00J06J041O03O9r67j163M29P78J087J7j055j001M4P88J043M6r41j068J42
$$ -900 -794 247 850 919 -48 -1211 -782 -4 1083 1100 45 -956 -912 -124 919 965 24 -1044 -902
5097i02P45Q74J05r14r29j74J315O28K58r97r23O9J170O69n25l75r86J29Q82P25
$$ -902 -157 717 822 -92 -1021 -1195 120 748 1006 9 -914 -845 325 994 469 94 -892 -763 119 844
5117H44L25j215j010J27Q98J008R5p94j199k06R60J040J00n66j244j19J141O90
$$ 844 1169 -46 -1056 -929 -31 977 1072 278 -921 -1127 -167 873 973 407 -837 -956 185 875
5135H75r9o49j068j50R72J007L59j244p85k65P70J064K55q23r77k88P98J011L06
$$ 875 776 127 -941 -1091 -119 888 1247 3 -782 -1047 -277 787 1042 219 -758 -1046 -248 763 1069
5154A069q37j001k76J078O48L46o61j285j5O59J014M28r72j189j52Q88Q82M49
$$ 1069 232 -769 -1045 33 681 1027 366 -919 -934 -275 739 1167 195 -994 -1146 -258 624 1073
5172A073q04j026l7N18J020J68m72j113k02O54J102K03n41j190l32L86J348M90
$$ 1073 269 -757 -794 -276 744 912 440 -673 -875 -221 881 1084 543 -647 -979 -593 755 1245
5190A245o48j306m28M16J374L68o21j174m33Q51J054K13l63j121l29J003M38L78
$$ 1245 597 -709 -1137 -721 653 1021 400 -774 -1207 -356 698 911 548 -573 -902 101 539 917
5208I17n27r16n19Q87J094J86m17j323l59N97P85O11n59r74n80O03J104M17p69
$$ 917 390 -526 -1045 -158 936 1122 705 -618 -977 -380 405 1016 457 -517 -1097 -494 610 1027 258
5227B58p86n34L18J090J062j065j213k41M31J128N40l53j372m04N69P85Q74n94
$$ 258 -528 -1062 -744 346 1408 343 -870 -1111 -680 448 988 635 -737 -1141 -572 213 1087 493
5245D93j122o58P95Q34P74n37j352l45M01J249O23m32j433k83L03J240M07k70
$$ 493 -629 -1287 -492 342 1116 579 -773 -1118 -717 532 1155 723 -710 -993 -690 550 957 687
5263F87j102o60N84J039M42m98j135m32O87P39Q37l57j355l80M06R73P07n99j101
$$ 687 -415 -1075 -491 548 990 492 -643 -1075 -388 351 1188 831 -524 -904 -498 475 1182 583 -518
5282e18m13K57J030N37k96j112n29N49Q29P63j77j114q28M56R06Q55n27r80j093
$$ -518 -931 -674 356 893 597 -515 -1044 -495 334 1097 920 -194 -1022 -566 340 1195 668 -312 -1405
5301a405N10J161R28p82q78n48K14J131N73j69j197m27qJ269N27k75j080m66J49
$$ -1405 -895 266 1194 412 -466 -1014 -800 331 904 735 -462 -889 -897 372 899 624 -456 -922 -773
5320g73J189O32k69r47o81O3J051P89m86o65j247N29Q57Q91j97p09j065L78J086
$$ -773 416 1048 779 -168 -849 -786 265 1054 568 -97 -1344 -815 42 933 736 27 -1038 -660 426
5339D26M48m5r25r01J96J026P01k28j218n00K78Q81Q68k94p07q12O2Q64R55l13
$$ 426 874 829 -96 -997 -801 225 926 698 -520 -1020 -742 139 1007 713 6 -806 -744 120 1075 762
5359G62j122p12N63O68R95l55o44j150j62J091J094J9j121p92M5J060R08l16j133
$$ 762 -360 -1072 -509 159 1154 799 155 -995 -1157 -66 1028 1047 -74 -866 -821 239 1147 831 -302
5378c02o30P3J106P85l88o65r86j4Q94R80j82p50r85K25P31Q94N0p87j024J49
$$ -302 -932 -859 247 1032 644 -21 -1007 -1021 -127 853 671 -79 -1064 -839 -108 786 836 49 -975 -826
5398h26Q98Q91K6j023p32j25P49J045K29q75j070J3Q20P24J55q14r08K1P09J071
$$ -826 72 963 989 -34 -766 -891 -142 903 1132 257 -813 -800 20 744 899 85 -823 -802 -93 978
5418I78j13q50n99k84P10Q49J44q80m44o98J195P64k7n95q35j77O05J009L36j158
$$ 978 865 15 -584 -868 -158 691 835 -45 -489 -1187 8 772 745 150 -685 -862 -257 752 1088 -70
5438g0q66M7Q11O48M02p43p42l99Q35Q12J69p42j003j33P13J106K99j153o01m95
$$ -70 -936 -889 -78 570 972 229 -513 -912 -77 735 904 162 -841 -974 -261 845 1144 -9 -610 -1105
5458a105Q94R49L03r08q25l04N79J144L38r55o47k66O30R11J54o48r73q5N87Q33
$$ -1105 -211 738 1041 133 -692 -996 -417 727 1065 110 -537 -803 -173 738 892 244 -729 -814 -227 606
5478F06L15p36r94lN28Q87L67p03r31o1L14P20O32p48j035L2M83P34P24q09p34
$$ 606 921 185 -809 -812 -284 603 970 267 -664 -725 -411 309 941 193 -842 -810 -327 407 1131 322 -412
5499d12n79M45J070L49p56q31j44O21R14K50p03p67n57P85J025L57p38q08l93
$$ -412 -991 -546 524 873 117 -714 -858 -237 677 927 224 -543 -1100 -315 710 1067 329 -479 -872
5518h72M19R07M28l15j048n69O84Q56L84l43j030m68N81R59M40n13r19n66N20
$$ -872 -453 454 882 567 -481 -1050 -366 490 874 531 -499 -967 -386 573 1013 500 -419 -985 -465
5537d65Q69O74p57q41m98O01P08Q12p18q58n39N70J099J37l78r04m09M20O20P66
$$ -465 404 1078 321 -520 -1018 -417 291 1103 385 -473 -1012 -442 657 794 416 -488 -897 -477 143 909
5557I09l1j339n50L60R89M39j69j099l06R3J058O89p16o49o77J53J023O95l48
$$ 909 878 -461 -1011 -651 338 777 608 -491 -797 -704 354 1043 327 -322 -999 -846 177 872 524
5576E24p86o83N27O96Q09l03j142n07L95J140K95l13r91n16J67R56N32p4j178
$$ 524 -262 -945 -418 278 1087 784 -358 -865 -470 670 965 652 -339 -855 -688 268 800 726 -452
5595d52m87M69Q23N66m79q41n78L00R02P67l56r62n54N04O42Q43k98j079o82M07
$$ -452 -939 -470 353 919 440 -401 -979 -679 223 990 634 -328 -882 -378 264 1107 809 -270 -952 -545
5615e45N99Q65j67j026m53J28J038N60n07p45n33M7R91O62k03q30p55K23Q73Q23
$$ -545 54 919 752 -274 -727 -599 439 999 492 -253 -786 -739 252 914 711 -119 -874 -651 222 1045
5635A045m77p43o59K1R49R66o65o52p70K85J012M59k07n47q92L44O62O75n7q23
$$ 1045 568 -175 -834 -813 136 1102 437 -215 -985 -700 312 771 564 17 -875 -531 131 806 749 -74
5655g4p14j9Q08O49M1p92m77n3O30O51J19q94o20j62J347J81K25r11p93M3R08
$$ -74 -788 -807 1 650 691 -101 -578 -631 -1 650 769 -125 -745 -907 440 621 846 -65 -858 -815 93
5676I3N68L7p67m99l61J004P13Q5q73n92R9M10Q71j61m82j122J13Q48O99K05q66
$$ 93 661 698 -69 -568 -929 75 788 873 0 -592 -493 -83 788 627 145 -977 -864 -16 683 888 22
5697B2q69N7Q10Q41or53o54K5O64N79M07j058o83P2P46N49M89j132o87K13N87
$$ 22 -847 -790 20 861 855 -98 -752 -727 -63 516 923 -135 -818 -746 0 549 1038 -94 -781 -568 19
5718A9P66j08p89o21j38P69P57o3o39r70L28N00J033J04o11j218j28R78Q02O8
$$ 19 785 677 -112 -733 -871 -102 655 592 -47 -1017 -689 -189 844 948 337 -881 -1009 -31 771 839
5738H39r69o55j05J120M24K00o38p66k10O14N30M89n77r50n1N71O61L28q45n38
$$ 839 -130 -785 -890 230 654 854 216 -550 -760 -146 384 873 296 -654 -705 -134 527 855 10 -528
5758e28l85M44J118M4l61p13n32Q60N88L88q20r24P3O73P06L09n73r11k75P67
$$ -528 -913 -469 649 693 332 -381 -913 -53 535 923 103 -821 -748 -75 631 940 367 -544 -819 -52
5778e2P37K60o60q09k75N77Q67K03n87q02j1K47R91K43o06q14l04N37O85L75n29
$$ -52 685 945 285 -524 -799 -222 645 848 261 -541 -552 -305 686 929 323 -491 -795 -258 427 802 273
5799B73p72m22P01P40L68n68p66o51O35J185M17p45o97n90O69O79K52l75p63m66
$$ 273 -499 -921 -220 520 888 320 -446 -1097 -462 723 1140 395 -302 -892 -223 456 708 333 -430 -896
5819h96O41R19K22o95n62l93M37P11M10m19p98m59N70Q62M78m31j371j37N74O26
$$ -896 -255 664 886 191 -371 -764 -327 384 794 375 -423 -882 -312 550 1028 597 -774 -911 -337 289
5839B89N47m11r15m11L12J009L92m41p35l98K21R08N31n30j061P3J11Q70L76k59
$$ 289 836 425 -490 -901 -589 420 812 371 -364 -762 -541 367 898 368 -693 -620 -509 361 737 478
5859D78r22m54M29O47P60m25o57p50L66P18Q36n00p60o97L47J176K15k59r54m83
$$ 478 -444 -898 -469 178 938 513 -144 -894 -528 190 1026 526 -234 -931 -584 592 807 548 -406 -889
5879h89L35Q51L89k94q08l66K70R76K34j15q76m31l9P68Q51k01j009k86M2J015
$$ -889 -554 297 686 392 -416 -782 -512 464 698 583 -293 -724 -763 5 856 655 -354 -640 -598 417
5899D17M45r0j113n35K58P54N17r5q68l39K30O70M62k3o07j009L66R59L85j80
$$ 417 862 772 -341 -876 -618 136 653 558 -310 -649 -419 251 713 690 83 -926 -560 399 784 604
5919F04r12l76K56M40P46o3q12q74J90R55O30k23o21n55J04M99O89k70m59n55
$$ 604 -308 -684 -428 12 758 695 -117 -991 -801 154 784 561 -60 -615 -511 -12 677 407 -52 -607
5939f07j41J082M84l09n66q35K45P94O12j89j075l87O8Q65O12P0q14n44j0P90
$$ -607 -748 334 818 509 -57 -892 -647 147 759 570 -505 -892 -824 41 653 723 -91 -635 -645 145
5959A45N13p4o56p84L56O21O93j29q76p07J62O37O82J16o56p80n2J059M37j2n91
$$ 145 658 584 -72 -856 -500 121 814 685 -191 -898 -736 -99 583 699 43 -737 -789 270 707 695 104
5980A04p75N3R14L24J88p23q14j24Q27Q75o1q95p09K07M81R32j3p04j028L5Q66
$$ 104 -671 -618 296 620 808 85 -729 -853 -26 849 788 -107 -816 -609 -128 804 791 87 -941 -906 -40
6001d0Q28k33o53n14j05Q24K84L29o13q69K59L30Q30L1n26p36R8N16P28K1q83
$$ -40 788 555 -98 -612 -717 107 391 720 107 -762 -503 -173 657 688 162 -574 -476 40 768 789 -94
6022i4n86K13M81L82M53p19o91o1O25P36r6p17o74Q2L64Q00L40q31n92j98M06
$$ -94 -680 -467 14 396 849 130 -561 -622 3 739 643 -74 -748 -666 -302 498 838 7 -585 -783 -377
6043c77Q84P6l49r62j9N79P07K14p88p03m1P48M54K51m73q24k34O72O16M77q15
$$ -377 507 583 234 -728 -747 -168 539 753 -35 -738 -779 -31 423 674 201 -623 -857 -185 431 908 93
6064I3n71l61N98P09J58n35p34j46L35R09Mj41q19k96L81Q78L32m83r37l28P20
$$ 93 -478 -839 -241 468 626 91 -643 -789 -454 455 459 318 -501 -797 -416 462 794 311 -626 -954 -234
6085b34Q12j87l38m16o36O75Q20K69n78o77m47M11R45K86m78o05m03L31J088K69
$$ -234 578 391 53 -363 -999 -324 496 765 187 -490 -937 -526 419 705 227 -378 -781 -450 638 907
6105I07o36o67k61O64N13M38p56o77j94M13O15M80l70q68m96O29M64P19o45q39
$$ 907 271 -396 -657 7 520 958 202 -475 -669 -256 359 839 469 -399 -895 -266 198 917 272 -567
6125e67l62M18R20M41m65o12n83K99J027L15n49n86l60L94P70J45%j006l90M33
$$ -567 -929 -511 409 850 385 -227 -810 -511 516 831 282 -304 -664 -270 500 645 645 -361 -751 -318
6145c18O32M13n40o91j95L72L67O87J34j315l72J67J019M90l95r13k81L84O45
$$ -318 314 727 187 -504 -699 -327 40 727 861 -454 -826 -659 360 850 455 -458 -739 -355 290
6164B90M62m15p32l88M14P23L38m70k27o30K38O10P01n83n18m55L36M93O71k51
$$ 290 752 337 -395 -783 -369 354 692 222 -5 -635 -397 213 914 331 -187 -642 -306 187 858 607
6184F07q26n47L59P01L68k38n02p15M64M66N37j88n75p24N57N68O58m63q13l36
$$ 607 -219 -766 -407 294 662 424 -78 -793 -329 137 674 486 -89 -813 -256 312 970 507 -306 -642
6204f42J39P75N47l05n60p81M14O10J93J99q50q17N66O32N50j01p60n26L04N34
$$ -642 -503 272 819 514 -46 -827 -413 197 390 589 -261 -1078 -512 120 670 569 -191 -717 -413 121
6224A21M43K1q00k37l67J030M70j92o14n41j38J083M88K09r21n77o6O68M84R7
$$ 121 564 585 -215 -452 -819 211 681 489 -125 -666 -804 279 767 976 55 -522 -588 80 564 661
6244F61n58o65j6M54P26J9n77p55K51O37M16J94r20n69L96K52M80Q9n55n04J6
$$ 661 103 -562 -578 -124 602 621 44 -711 -460 177 593 787 -133 -702 -306 -54 426 515 -40 -544 -528
6265e28P89M79p7p24n48j4O03N40J32o81p17J29P47O68r1n25o41l19O83N68J65
$$ -528 261 740 663 -61 -609 -623 -20 520 652 -29 -746 -617 130 798 707 182 -459 -778 -95 473 638
6286F38n31p79O5N93M81K26r00l47k92P33O57J43o92o31Q3M48O72K8n44o09n0
$$ 638 107 -672 -607 -14 467 693 -207 -554 -846 -113 544 687 -5 -636 -553 -105 567 595 51 -558 -608
6307f08L55J024j11p26n96j21N89L99N50q24n69QN75N43K21n16p82j41O03R67
$$ -608 -253 771 660 -66 -662 -783 -194 205 755 -69 -638 -630 -55 488 709 193 -589 -730 -127 840
6327H40k38n34p62J9O28N80J71n42p46j10M36O35L24p06n59j88O35P38M9m25q94
$$ 840 602 68 -694 -675 -47 533 704 162 -584 -694 -258 377 701 -5 -564 -752 -117 621 670 245 -649
6348f49k2M42Q70K78q49o65j00N07O13J85m09p60J81L77M57M03n67o43k90O96
$$ -649 -671 -229 641 919 70 -595 -695 -188 425 610 201 -559 -378 -1 456 859 292 -351 -641 55
6368E5K16K32j87p63k36M14P64J28l78o16j13K08O60N00o68n49j11K71M64M24
$$ 55 271 503 316 -447 -683 -269 495 623 245 -371 -484 -276 384 884 216 -333 -444 -173 291 715
6388G15n63o25k10N36Q00J73m73n79k65J24O37K67m76m19p6J92O49K31k61o22
$$ 715 152 -473 -683 -147 653 826 353 -226 -491 -367 270 537 61 -358 -434 -242 407 638 377 -245
6408b45n32M89N49M95o26m85l61K98P37K58j36o55l55L63N92K27k49p34k01L11
$$ -245 -777 -288 261 756 130 -355 -716 -418 319 577 441 -214 -569 -206 386 613 364 -370 -571 -260
6428b60P84K20m11o09n86N82M76N29l76q64p5K06P26K71l32o00k97L08N58L10
$$ -260 524 744 333 -276 -862 -280 196 725 349 -515 -590 -384 342 613 281 -319 -616 -308 250 560
6448E60r7o59n19L59O23L27m75n51m04M81N77M49l62n97m05J58R09K61K5j130
$$ 560 463 -196 -715 -356 267 594 119 -432 -836 -355 222 671 309 -288 -693 -535 374 635 660 -470
6468d70j70R0R03K38n01n50l11L17J022K78n88n26l72O1O49P90l09o24n95K8P15
$$ -470 -640 -550 353 591 90 -460 -771 -454 568 846 258 -268 -640 -579 70 860 551 -73 -668 -640 75
6489G5P44n50m14n36L45M24Q30n55o08n01L94O88R2J12o79m68rR94L81k98o44
$$ 75 819 269 -145 -681 -336 88 918 363 -245 -746 -352 336 428 540 -139 -607 -616 378 759 461 -183
6510a83k21k61Q10O37k45p45l29P4O38L11q2n65l62LN62L71K63r80m52J32P20
$$ -183 -404 -665 145 782 537 -208 -537 -463 175 486 404 -161 -523 -520 42 413 676 -304 -756 -624 96
6531I6L75R4n31o31J30K66R36m15l21n77J18L95M57J76n72n82N7L91N59J86n74
$$ 96 471 565 34 -597 -467 -201 735 320 -1 -578 -460 -65 392 568 -4 -586 -529 -138 421 607 33
6552C3n56N0N27P46j2r16o53J73Q36L78ln75q77K59O42N61j13l40o94L1M08N69
$$ 33 -523 -473 54 800 788 -128 -781 -608 228 606 603 28 -849 -590 52 613 500 160 -534 -503 -95 474
6574D74J1o30l00j23O46M36Q1n56n34j79O48N38j9l52q11J31M15P12ln73l68r2
$$ 474 485 -145 -445 -568 78 514 595 39 -495 -674 -26 512 493 141 -670 -539 -124 588 585 12 -356 -448
6596d48N19L48N98j128n00j32N65P80p5m19o44j03O33N21K89q63n74L55J54O24
$$ -448 71 419 1017 -111 -611 -743 -178 602 527 108 -536 -639 -6 515 804 -59 -633 -278 -124 500
6616E00J74n77o33J49N39L75L03r93l44k5M66O49k05j60p63n0K74P09L70n53o04
$$ 500 674 97 -536 -387 152 527 830 -163 -507 -532 -66 583 378 218 -545 -595 -321 388 758 205 -399
6637c99q5K53Q58k2n92n26k9M34N70o4k28o03j48M76N88m4k10p39j33L77O42J46
$$ -399 -484 -231 627 605 13 -513 -542 -108 462 398 170 -433 -581 -105 483 439 229 -510 -643 -266 376 522
6659E22m27m64j50N02M55m5j95q41RM66M82K36k57n26l31J91P47J96n09m17j72
$$ 522 95 -369 -519 -17 438 393 198 -643 -634 -168 314 550 293 -233 -564 -373 374 570 61 -356 -528
6680e28K91Q19J06m97m83n0J46M57M26o24m58j31K94P13J24j02o60m73L45O08
$$ -528 -237 582 688 191 -292 -342 -196 261 687 63 -395 -526 -232 481 605 503 -157 -630 -285 323
6700C23N21p49l67l33M78N55j01j78l65l38M21O05J17m10p37J14O6N39M38r7q97
$$ 323 844 95 -272 -605 -127 428 327 149 -216 -554 -133 472 589 179 -558 -444 -378 161 599 502 -395
6721c95j87R8Q43M08k90p15l00K10M43N70k78p58l04J44Q79L68m35o95k78M47
$$ -395 -582 -484 359 767 477 -238 -538 -328 115 685 407 -351 -655 -511 368 736 301 -394 -672 -225
6741b25M76J24J53q70k35K40P63J00k90m91m12L37L18P75m88m66n70M01N78O44
$$ -225 251 375 528 -342 -577 -337 426 526 236 -255 -667 -330 -12 763 275 -191 -761 -360 218 862
6761H62m46p14m49M12M15O23j71q18k46N89K98K70l77k65m77J73O77K90k76p81
$$ 862 416 -298 -747 -335 80 703 532 -286 -532 57 355 625 248 -17 -494 -321 356 646 370 -411
6781d11p1J11O81K06o1o38m83K05M81N79j76n64m40j5N86P52l09m09n71R8N63
$$ -411 -482 -371 310 516 455 -183 -666 -461 20 599 423 -141 -581 -596 -10 742 433 24 -547 -449 114
6802A14O26j14p93p00M51N86L50j97l89o72M18M22N35k09l72o70M3P18M02l97
$$ 114 740 626 -167 -867 -416 170 520 323 -66 -738 -320 102 637 428 56 -614 -571 147 549 152
6822A52m40k03l3M91M82Nn33o25K50O06K87K79r93k94j32Q84K16lm98n31J67N12
$$ 152 -288 -491 -524 -33 449 454 -79 -704 -454 152 439 718 -275 -569 -701 183 399 396 -102 -633 -466 46
6844D6O76l25l20n05r2O69L19j36l49n35J11L53N52k33k46l89RP39Q6j20m40n57
$$ 46 722 397 77 -428 -520 149 468 332 -17 -552 -441 -88 464 231 -15 -404 -395 344 430 310 -130 -687
6866f87K29M00O22j56m48o01J20N07N39J28n08q73L48P07J67J6n69k00k53N44
$$ -687 -458 -58 564 408 -40 -641 -521 -14 525 653 145 -728 -380 327 494 510 -59 -259 -512 32
6886C2N49j7o31n33j99J148J56j0m03n46j14N66O11j44k65p27O0M32N43K6n67
$$ 32 581 564 -67 -600 -799 349 505 495 92 -454 -568 -2 609 465 200 -527 -467 -35 508 534 -33
6907c3m32k97Q48O60J0q66k28R5J81M10J42m59n47l3O86K62K85m63m68m22O52
$$ -33 -465 -762 86 746 756 -110 -338 -243 -62 348 490 31 -516 -549 137 399 684 221 -247 -669 -17
6928a7K14K18l29m47j70M51L48K78l45q43J84K03M36J92j14p68p2R9Q88K44m49
$$ -17 197 415 86 -361 -531 -80 268 546 201 -642 -458 -255 181 373 259 -509 -581 -482 406 650 201
6949B01p41j81M42P19K37l79r51j38M99O42K18m21m17k52L99K22M74l88p55j5
$$ 201 -540 -721 -279 440 677 298 -653 -791 -292 350 568 147 -270 -522 -123 99 573 185 -570 -585
6969e85K60R18Q5m36l67n35P93M60J42k92q45MN0N91K02k83p26j60M87L28N47
$$ -585 -325 593 678 242 -125 -660 133 593 735 443 -402 -398 -348 243 445 162 -564 -724 -237 91 638
6990F38n41n66J17J09Q19J97m22p85l37O16N21L66n14m04o60Q41K98L00m95l35
$$ 638 97 -469 -352 -243 576 773 351 -434 -771 -155 366 732 218 -186 -846 -5 293 593 98 -237
7010b37p2L09M22m0k44l66l40K44O51J54j59n41o27M13O29L43l90o10P5J28M17
$$ -237 -309 0 422 382 138 -228 -568 -324 327 481 322 -219 -846 -433 196 539 149 -461 -386 -258 159
7031A59M72k01q05j03J57M94L25k86n61k33M15N13J35m4q40j58K54M82L38l05
$$ 159 631 430 -375 -478 -321 173 498 212 -349 -582 -167 346 481 437 -403 -561 -307 175 513 208
7051B08l20o19L31O46M71l18p90Q7j95P10M13k71l09q80K87P00L63j96p08j22
$$ 208 -112 -731 -400 246 717 399 -391 -304 -499 211 624 353 44 -836 -549 151 514 318 -390 -512
7071e12K09L50N32k98m97m26k0R82QJ28o50l33J32O46J46k15k82k77r5O13J67
$$ -512 -303 47 579 281 -216 -642 -662 320 328 456 -194 -527 -395 251 397 182 -100 -377 -472 141 308
7092C08K74n94o57L50N27P6r4l57m94J92N73M40k12l43n99J56O21M14M4p97m45
$$ 308 582 -12 -669 -319 208 284 190 -167 -661 -469 104 544 332 -11 -610 -454 167 581 625 -172 -617
7113f17N50K46L35kn71m70L06J88N93k47m51k60L7M93M59l0o24n60O5N83M65j6
$$ -617 -67 179 514 512 -59 -529 -223 -35 558 311 -140 -400 -363 130 589 559 -65 -625 -560 23 488 472
7135D72o87k32J32L95N76l30n61k42m1N25O00j05m48o31J79M09L58J12n49m31
$$ 472 -215 -447 -315 80 656 326 -235 -477 -518 7 607 502 54 -577 -398 11 369 481 -68 -499
7155d99K13J90P34j22n49m50J4N23M57k12m76j39j29K90N98J96m60p48M2O63L44
$$ -499 -286 -96 638 516 -33 -483 -469 54 511 299 -177 -316 -445 -155 443 639 179 -569 -527 136 480
7176D80r0m08n65k7N04M80L05p50m06K2O70J41j38j06m58J01L99L19j00m02n18
$$ 480 390 -18 -583 -610 -106 374 679 -71 -477 -455 215 356 218 112 -346 -245 154 473 373 -29 -547
7197e47O3L67P32r2m51m69r3N78M43J7l47o37n5M43M48J38m63m44r8K41P28o1
$$ -547 -484 -117 615 523 72 -397 -490 88 531 548 201 -436 -491 -48 400 538 75 -369 -467 -226 502 441
7219D41k90o69J8K94P05J35n63k90m50P02L25J39m80l67k86L74N50J31n49m08
$$ 441 151 -518 -500 -206 499 634 71 -219 -669 33 358 497 17 -350 -636 -262 288 419 -130 -538
7239e38p7L90P09j0m54j58k85J81O73p9k24o92J06M15N54r2k5q02K6P8N10M90
$$ -538 -615 -225 484 474 20 -138 -423 -242 431 352 128 -564 -458 -43 511 419 394 -408 -382 -304 206 696
7261F96n71o04k39N01N37P3R7q94k97N81L27j4j12m36m5K36M22K18l12m84n52
$$ 696 125 -479 -718 -217 320 393 490 -404 -701 -120 207 193 81 -355 -400 -164 258 476 164 -320 -872
7282h72K88P86K79j54n46k73M91K67J70k22p27J08M4N43L08k51l51n06L05L41
$$ -872 -584 202 481 327 -219 -492 -1 266 436 214 -513 -405 -361 182 490 239 -112 -618 -313 28
7302B8N30j93n90n62L28P50J33k52m05j58R4L78N55m31n07k30K90L75J73l83j36
$$ 28 558 365 -225 -787 -459 291 424 172 -233 -391 -297 81 636 205 -302 -532 -242 133 306 -77 -213
7323b13l92Q4P41M76k21m96m66K82M57M46j30r49l63M22M71K54l1o04k57L14O34
$$ -213 -605 -521 220 696 475 -21 -487 -205 252 698 568 -381 -744 -322 149 403 372 -232 -489 -175 459
7344D59P1n2j099o7N64L51K78l23n01j33J23O02L28j4q97k15M25J16L94qp23k32
$$ 459 530 478 -621 -688 -124 227 505 182 -319 -452 -329 273 601 587 -310 -525 -100 16 410 402 -321 -553
7366e53J53O62L58m62m55j84oP66K35k71n95l70L97O31m7J69o18m50L41M02K07
$$ -553 -400 262 620 158 -297 -481 -487 279 514 243 -352 -722 -325 306 259 428 -190 -640 -299 103 310
7387C10j03m39j13m9M88M81k23m02m41K39L02L89l79k27k28K44l0R73l34m72k56
$$ 310 207 -232 -345 -394 94 575 352 -50 -491 -252 50 439 60 -167 -395 -151 -181 792 458 -14 -270
7408b70k13P47K00m04l27j76J02M03M17O6q00l25J27M35O33k57n78k92J20N16
$$ -270 -483 264 464 60 -267 -443 -341 62 479 545 -255 -580 -453 -18 615 358 -220 -512 -392 124
7428A24N10k52k87n30r3M10M54O7m34m44m2N60K87m8l79k71j42P46k2L88m56n20
$$ 124 634 382 95 -435 -528 -118 336 403 -31 -475 -517 43 330 282 -97 -368 -510 236 214 602 146 -374
7450c74m8O12M78k96k69n45p1N89O48m61j30n18j8J64N37Q5m71k64j47M52O34
$$ -374 -422 190 668 372 103 -442 -513 76 724 263 133 -385 -403 -239 298 383 -88 -352 -499 -47 587
7471E87m0n94l58p4L97N71k8m85n89K21M39K30M7n15r1j27M99J96K27j65o77l6
$$ 587 547 -47 -405 -479 -82 489 461 -24 -613 -392 47 277 324 -191 -282 -409 90 286 513 348 -329 -365
7493c65K16P11j94j98m47r9L07M10J37l62m45r0J17O16J54k66o74OM05M58n8l67
$$ -365 -149 562 368 170 -277 -376 -69 341 478 116 -329 -419 -302 314 468 202 -472 -466 -61 397 339 -28
7515b8n19r1O89L70Q7n90k66j23M19L16J76l62l86o9O3Q23j23j28m00m38M41M44
$$ -28 -547 -638 51 421 508 -82 -348 -471 -52 264 440 78 -308 -377 -314 509 386 258 -142 -580 -139 305
7537C05K27k49o28K1L3L24L39k47k55n76K90P05J61l95m29q2J62Q30jl01m30k15
$$ 305 532 283 -345 -324 -291 33 372 125 -130 -706 -416 289 450 55 -374 -456 -294 536 535 234 -196 -411
7559d11L72K01K51k71l77k48M22K67L02k0r42K3M01N80k17J37p01k49K54M24L76
$$ -411 -39 162 413 142 -235 -483 -61 206 508 488 -454 -431 -30 550 333 470 -231 -480 -226 198 574
7580E74k13o31j89K10N86P2k24l81m64M18M83K65j86n46j51J0N39J64j8m51j18
$$ 574 361 -270 -459 -249 337 409 185 -196 -660 -242 241 506 320 -226 -377 -367 172 336 318 -133 -251
7601b51P7L10K06O6q06K3J50K45O24n26k19k75K44N90Rk48n80K9l3N88K84m35
$$ -251 -174 136 342 408 -398 -375 -225 20 644 118 -101 -376 -132 458 467 219 -361 -332 -365 223 507 72
7623G2k60k70P0O10P1m7m30m41N75K35J16k3n18k73L17L69L19l58m72q2J72L38
$$ 72 -188 -458 -388 222 293 246 -184 -625 -50 185 301 278 -240 -513 -196 173 492 134 -338 -420 -248 90
7645I0K15q1k66j09k62L97M68j86m81r2K9M68K88j96m82l75K20N53J70j23n57
$$ 90 305 224 -42 -151 -413 -16 452 266 -215 -307 -278 190 478 282 -200 -575 -355 198 368 245 -312
7666c12k15J87N07J83L0p14l22K26L16O34l44l84l56M66Q6N35k23l81l75K02J79
$$ -312 -527 -340 167 350 380 -334 -656 -430 -114 520 176 -208 -564 -98 -12 523 300 -81 -456 -254 -75
7687g5M88N7n95j75jM86J30L10m78n74N4K71O05j99l97m30L61Q4N69l40l04m10
$$ -75 413 470 -125 -300 -301 185 315 625 147 -427 -373 -102 503 304 -93 -523 -162 -78 491 151 -153 -563
7709e63K82J67L28k4k42j5k06L64K46J01m01l89q1O66N7p5l83l29J77L20L59l09
$$ -563 -281 -114 214 190 -52 -67 -273 91 337 438 37 -352 -433 233 290 215 -168 -497 -320 0 359 50
7731E0r3k41j20P49j3j03j91l95n3M14N74l73l08k99j29M55O05K6o56k77R8J44
$$ 50 -43 -284 -404 345 332 229 38 -357 -410 4 578 205 -103 -402 -531 -76 529 555 -101 -378 -280 -136
7753a36O30j81l33j45l46N90K80O5l09m93K8N57M96l07l35l52j00M08N04q8l81
$$ -136 494 313 -20 -165 -511 79 359 424 115 -378 -350 207 703 396 61 -291 -391 17 521 433 52
7774E2m75J23L70M57j89l18n23P8J90O38Q2p87J35k18L08N14j50j75l21k16L44
$$ 52 -423 -300 70 527 338 20 -503 -425 -235 403 485 -302 -167 -385 -77 437 287 112 -209 -425 -81
7795h1M75n3l66J9l91L24L38M6m75j24k9J00N80l8m44k22l0L00L13j23m2k40k72
$$ -81 394 341 -25 -6 -397 -73 265 311 -164 -288 -317 -217 363 325 -119 -341 -371 -71 242 119 77 -163 -435
7818d35K48L78L82m77m51k06L59M54N3m83K9j81K12K94L7J68o91j9M65K26K3k87
$$ -435 -187 191 573 96 -355 -561 -202 252 305 -178 -149 -330 -118 176 213 381 -310 -329 136 362 385 98
7840I8n86K06J88L13L27k70p92K64J61K83K83l71k61l09K18O41n8k83l43j52J98
$$ 98 -488 -282 -94 219 546 276 -516 -252 -91 192 475 104 -157 -466 -248 393 335 52 -291 -443 -245
7861b45M22K32l33l17k72L73M28J16o2n53j33J18L04K74l7m58l46L83K64L58k36
$$ -245 177 409 76 -241 -513 -140 288 404 342 -211 -344 -226 78 352 315 -143 -489 -106 158 516 280
7882B80n96L8K54K22L45k42m52k72J77K90N31k54m97j61L8J90N22k21l50n20M57
$$ 280 -316 -278 -24 198 543 301 -151 -423 -246 44 575 321 -176 -337 -299 -109 413 192 -158 -678 -221
7903b21O36j91O9j47n44J97M20J22p0m55k28J37L52M63k42o94k3J27O65L06l94
$$ -221 415 224 293 146 -398 -201 219 341 271 -184 -412 -275 77 540 298 -396 -419 -292 373 679 285
7924B85l69l02n3M79L36j56n10L6LN13J60l2p97J4J17K39O97j30q93J0J25L75
$$ 285 -84 -386 -439 40 376 220 -290 -254 -251 262 422 390 -407 -393 -276 -37 660 530 -363 -353 -228 147
7946A47J83j79k03m09M13K53Rk8o0k59L3l7O00k97k59j76j7P05k12J65m85l34
$$ 147 330 151 -52 -461 -48 205 214 186 126 -133 -100 -137 463 166 -93 -269 -286 419 207 372 -113 -447
7968d47L9N71M29j09o47l56J98M85J46P9m10l48J17M74L07j42l77m13N9N84J10
$$ -447 -408 163 592 483 -164 -520 -322 163 309 388 -22 -370 -253 221 528 386 9 -404 -345 239 349
7989C49j72j17m98r8N39L95k68k26o27N66M97J46j99m38l27J41M14N59n51q1l03
$$ 349 177 60 -438 -536 3 398 130 -96 -723 -157 340 486 287 -151 -478 -337 77 636 85 4 -299
8010b99k72N14M11K04m25m82P0K37K12N3k01l43k45P42Q0p4k53l00J46K56K48
$$ -299 -571 -57 354 558 133 -349 -279 -42 170 223 22 -321 -566 176 256 182 -71 -371 -225 31 279
8031B79K77o10n77M03K50M31l54j16m23r3O27L50l14k45l62Q7L76M95l9m53o47
$$ 279 556 -54 -631 -228 22 453 99 -17 -440 -533 94 444 130 -115 -477 -390 -14 481 442 -11 -658
8052f58J50N11M00q1m22l56K5K49M52J48n10m22J90L63J12L82p97j79nL17M60
$$ -658 -508 3 403 322 -100 -456 -431 -182 270 418 -92 -514 -324 39 151 533 -264 -443 -448 -131 329
8073C29nm44J55n24K83N45K84p26k02j65N33J73O3k97l97pJ73N85k1l38j05j96
$$ 329 324 -120 35 -489 -206 339 623 -103 -305 -470 63 236 299 2 -395 -402 -229 356 335 -3 -108 -304
8095c04J79O39k47k8m38P3m0K94M04l77m40j91L90L23J49j35n89Q2n4O60j76k64
$$ -304 -125 514 267 239 -199 -126 -166 128 532 155 -285 -476 -86 237 386 251 -338 -256 -310 350 174 -90
8117i0j45J1J56K74n3j2m00k1M25J98K20n06m75J17K40N4M23k33m33n0J78K72
$$ -90 -235 -224 -68 206 153 141 -259 -280 145 343 563 57 -418 -301 -61 -7 416 183 -250 -300 -122 150
8139A50M57n86l48j8L63J74L95k92o92k7K15N27J01j82n23Q0J07M39K3k33m05
$$ 150 607 21 -327 -345 18 192 587 295 -397 -424 -209 318 419 237 -286 -206 -99 340 363 130 -275
8160b75j04M16J66L97k88l38l98J59M34K88k77n56J33R6N58P2l06m20r6K94L11
$$ -275 -379 37 203 600 312 -26 -424 -265 169 457 180 -376 -243 -147 411 483 177 -243 -339 -45 266
8181B66p8K49o26j56L3O75Ml65l72J03
$$ 266 188 437 -189 -345 -312 363 367 2 -370 -267
8191b67
$$ Imaginary data points
##PAGE= N=2
##DATA TABLE= (X++(I..I)), XYDATA
0@%%%%%%%%%%%%qJ6j6J6k4L2l6M4n0N8p2Q8j04J20j37J61j86K11k43K77l16L61
$$ 0 0 0 0 0 0 0 0 0 0 0 0 0 -8 8 -8 8 -16 16 -20 24 -26 32 -40 48 -56 64 -73 88 -98 113 -130 147 -169 192
34A92m07M57n15N77o44P20q02Q92r90J095j212J340j478J630j799J983k183K406
$$ 192 -215 242 -273 304 -340 380 -422 470 -520 575 -637 703 -775 855 -944 1039 -1144 1262
52A262k652K924l230L573l962M410m928N535o260P145q250R676j1601J4353j8639
$$ 1262 -1390 1534 -1696 1877 -2085 2325 -2603 2932 -3328 3817 -4433 5243 -6358 7995 -10644
67a0644K6284m4085J63427J02081k63818j25458l5653K21013J75654j1773j81852
$$ -10644 15640 -28445 134982 237063 -26755 -152213 -187866 33147 208801 197028 15176
78A5176k06513L0856J90765J18551M8807j85178j94761K0658J43891J74895J4723
$$ 15176 -191337 -160481 30284 148835 197642 12464 -182297 -161639 -17748 157147 171870
89A71870j62914j47358o4184J72438K02680j6025j23942j77478n1375J78691J70315
$$ 171870 8956 -138402 -202586 -30148 172532 156507 32565 -144913 -196288 -17597 152718
100A52718L8298j63032j88668J3195J21674J74186N1868j85681j49019j1394J23664
$$ 152718 191016 27984 -160684 -147489 -25815 148371 200239 14558 -134461 -145855 -22191
111b2191J72098R567j16874j60505n0231J60181J32790K3405q8826j82911l3968
$$ -22191 149907 159474 42600 -117905 -168136 -7955 124835 148240 59414 -123497 -157465
122a57465J24404J48206N3935j33856j44006l9725Q8435J89709L4706j31525j32813
$$ -157465 -33061 115145 169080 35224 -108782 -148507 -60072 129637 164343 32818 -99995
133i9995n7648J15461J57929L5583r5825j70649l3212J17179J20624O5044j00772
$$ -99995 -157643 -42182 115747 151330 55505 -115144 -148356 -31177 89447 154491 53719
144E3719j61923l0966Q7895J47658M9585j01037j26936o8705R2778J60176L2256
$$ 53719 -108204 -139170 -51275 96383 145968 44931 -82005 -150710 -57932 102244 134500
155A34500p7670j37464o6982R7151J35472O1230q3734j50732l9457P1413J35034
$$ 134500 56830 -80634 -147616 -50465 85007 146237 62503 -88229 -127686 -56273 78761
166G8761P3995r5812j32956n2738O9040J42964N1346p0327j32197p3165Q6517
$$ 78761 152756 56944 -76012 -128750 -59710 83254 134600 64273 -67924 -141089 -54572
177e4572J27161N3549n7650j41852o1729P1932J24760P0298p4320j26361n8737
$$ -54572 72589 126138 68488 -73364 -135093 -63161 61599 131897 57577 -68784 -127521
188a27521N2912J37995O4150o9356j17232p0626O1576J27944O2678n0931j29590
$$ -127521 -74609 63386 127536 58180 -59052 -129678 -68102 59842 122520 71589 -58001
199e8001o6887O2687J14784P3660n2251j28225o2987M8778J22159P1112n5009
$$ -58001 -124888 -62201 52583 126243 73992 -54233 -117220 -68442 53717 124829 69820
210F9820j14608p4639M6834J24506O4411m4417j16071p6321M7751J14255P3284
$$ 69820 -44788 -119427 -72593 51913 116324 71907 -44164 -120485 -72734 41521 114805
221A14805m1310j20077o9297L9542J12509P8898m3339j13124p2948L6359J15336
$$ 114805 73495 -46582 -115879 -76337 36172 115070 71731 -41393 -114341 -77982 37354
232C7354P3308l6732j09008p8005L8130J09487P3224k9810j09725p5348L1995
$$ 37354 110662 73930 -35078 -113083 -74953 34534 107758 77948 -31777 -107125 -75130
243g5130J04561P8275k9384j05088p6498K3837J05420P9728k5790j02608q2164
$$ -75130 29431 107706 78322 -26766 -103264 -79427 25993 105721 79931 -22677 -104841
254a04841K3372J05221P9817k2227j04385q1241K3616J01557Q0280k1525j01703
$$ -104841 -81469 23752 103569 81342 -23043 -104284 -80668 20889 101169 79644 -22059
265b2059p7983K0199R8165P8776j8958r4811p8026J5432R3849P8692j2455r1304
$$ -22059 -100042 -79843 18322 97098 78140 -16671 -94697 -79265 14584 93276 80821 -10483
277a0483q0791J0613R0330Q2968p890r1505q3557P335R1420Q5059p604r1752q4242
$$ -10483 -91274 -80661 9669 92637 84747 -6758 -90315 -82980 8440 93499 85895 -5857 -90099
290i0099P055R1598Q3196p959q9899q1753P400Q7169P9733n087q5023p9364L274
$$ -90099 -83044 8554 91750 83791 -6108 -87861 -80461 6708 86441 81354 -3669 -83033 -79759
303g9759Q1209Q0088j70p9479q0813l057P8842Q2499M885p7649q4419n746P8891
$$ -79759 1450 81538 81368 1889 -78924 -81981 -3139 79360 84245 6596 -77823 -83569 -4678
316d678Q4820O776p9103q5229n261P8125Q5211N044p8266q1823o167P6104Q1472
$$ -4678 80142 86918 7815 -77414 -82675 -4550 80661 85705 7439 -74384 -80551 -4447 77025
329G7025N567p2484q0235q852P1603P8354J1307o8400q1338j1662O5808Q1057
$$ 77025 82592 10108 -70127 -78979 -7376 70978 82285 13885 -67453 -79115 -13307 67750
341F7750J6342o7647q1466j7478O5790Q4653J5355o5163q2780j9502O7993Q2449
$$ 67750 84092 16445 -65021 -82499 -16709 67944 83299 18136 -64644 -84146 -16153 66296
353F6296J6330o3686q3742j5622O3430Q0085K0010o4268p9043j7220N7579Q1367
$$ 66296 82626 18940 -64802 -80424 -16994 63091 83101 18833 -60210 -77430 -19851 61516
365F1516K0090n9534p6872k4271N9049P8824K1514n2157q2607k4645N7741P6406
$$ 61516 81606 22072 -54800 -79071 -20022 58802 80316 28159 -54448 -79093 -21352 55054
377E5054K7440n4408q1452k4077N0732Q1732K6662n6542p4701k9575N0223Q2440
$$ 55054 82494 28086 -53366 -77443 -26711 55021 81683 25141 -49560 -79135 -28912 53528
389E3528K3995m9049p8281k9799N2774P3490L1485m6597q2463k4707M5611P4577
$$ 53528 77523 28474 -49807 -79606 -26832 46658 78143 31546 -50917 -75624 -30013 44564
401D4564L5023m9399p4599l1680M3070Q1095K7016m2305p1909l9435M7687P5401
$$ 44564 79587 30188 -44411 -76091 -33021 48074 75090 32785 -39124 -78559 -30872 44529
413D4529L0176l7892p8101l1523L9787P1298M1421m4975p4450l0359L1582P7911
$$ 44529 74705 36813 -41288 -72811 -33024 38274 79695 34720 -39730 -70089 -38507 39404
425C9404L7296m1383p0447m1025M0393P3758L1736k8809p7882l9307M2000O6350
$$ 39404 76700 35317 -35130 -76155 -35762 37996 69732 40923 -36959 -76266 -34266 32084
437C2084L9910l3666p4565l3815K7736P5251L9977l9774o2030m1712K6484P7342
$$ 32084 71994 38328 -36237 -70052 -42316 32935 72912 33138 -28892 -70604 -44120 33222
449C3222L4906k7792o9544m3165L5028O2913M4119k3528p8756l4136K7586O3700
$$ 33222 68128 40336 -29208 -72373 -37345 25568 69687 46159 -32597 -66733 -39147 24553
461B4553M8379l1534o6116m2067K2533P5240L4846k4235o0371n2554K8664O8537
$$ 24553 72932 41398 -24718 -66785 -44252 30988 65834 41599 -18772 -71326 -42662 25875
473B5875L7522j8285p0474m0621K2302O0133N2612k7704o7358l5401J2292O7476
$$ 25875 63397 45112 -25362 -65983 -43681 16452 69064 41360 -25998 -61399 -49107 18369
485A8369M7143k4227n9287m9823K2906O5314L7209p904o7028m9846K6578N5837
$$ 18369 65512 41285 -18002 -67825 -44919 20395 57604 49700 -17328 -67174 -40596 15241
497A5241M7198j4041o5422m0808Q783O4807N0822k4448n2936m8305P555O9045
$$ 15241 62439 48398 -17024 -57832 -49049 15758 66580 42132 -10804 -59109 -51554 17491
509A7491M2238j2471n9589n0910J9551N2830M8529n760o9411m1076J3025N1734
$$ 17491 59729 47258 -12331 -63241 -43690 9140 57669 51909 -17502 -58578 -45553 6181
521F181N3566j3758n5696m6567M351O4681M2150r211m7862n7592J0508N8672M4112
$$ 6181 59747 45989 -9707 -56274 -51923 12758 54908 45697 -2165 -59757 -49249 9423 53535
534E3535j066n9732m7934P322M9560N8424r936n9759m1193j119N6359N1870r144
$$ 53535 52469 -7263 -55197 -47875 1685 60109 50173 -9586 -50779 -51898 4461 56331 47187
547D7187m9321n3431O270N5814M1468M486n3797n4157R526M6457N0195J052n3903
$$ 47187 -2134 -55565 -49295 6519 47987 52473 -1324 -55481 -45955 502 50697 51749 -2154
560b154m5043m743N1105N5345o933m4558n0293p206N5750M8538J584m8316n5089
$$ -2154 -47197 -51940 -835 54510 47577 3019 -47274 -54480 1270 49808 51392 3076 -52013
573e2013L693M5090N0115P724n5759m7127m4M2545N4583P30m6283m8251q475N1568
$$ -52013 -48320 -3230 46885 54609 -1150 -48277 -48321 -5776 48807 49537 3254 -44997 -53472 -1904
587a904M7573K749l9016n5882m284M7128M7122R951m6697n0664m803L9400N5999
$$ -1904 45669 48418 9402 -46480 -50764 -3636 43486 53437 6740 -43924 -48727 -9327 46672
600D6672O201m7439m5763j1449M3774N2940M695l9579n2926q422M4724M5990J2293
$$ 46672 52873 5434 -40329 -51778 -8004 44936 49631 10052 -42874 -51296 -6572 39418 51711
613E1711m1388n3838n379L7980N0543J2248m2582m7861j2914L8949N3931P640
$$ 51711 10323 -43515 -48894 -10914 39629 51877 9295 -38566 -51480 -12531 41400 49040
625D9040l6534m9407j5404M1310M8982J2806l6322n2879j0723L5703M9253J7030
$$ 49040 12506 -36901 -52305 -10995 37987 50793 14471 -38408 -49131 -13428 35825 52855
637E2855l9414m9275j2862L2975N2524J3274l5087m8537j7912L6343M9788J4409
$$ 52855 13441 -35834 -48696 -15721 36803 50077 14990 -33547 -51459 -15116 34672 49081
649D9081l1595n1741j6459L5115M7847J8477l3879n0050j5642L0075N1132J7659
$$ 49081 17486 -34255 -50714 -15599 32248 50725 16846 -33204 -48846 -18771 32361 50020
661E0020l2921m7435j9329L0899M9954J7705k8954m9583j9860L1005M7006K1085
$$ 50020 17099 -30336 -49665 -18766 31188 48893 19939 -29644 -49504 -18499 28507 49592
673D9592k8466n0137j9105K7544M8724K1638k8949m7932k1801K6977M9806K0330
$$ 49592 21126 -29011 -48116 -20572 28152 49790 20841 -27091 -48892 -21915 27891 48221
685D8221k6537m7725k3109K6954M8057K1874k4883m8622k2131K4860M6901K4167
$$ 48221 21684 -26041 -49150 -22196 25861 47735 22852 -25770 -47901 -23041 23860 48027
697D8027k4700m7094k3403K2826M7736K4255k3117m6939k5135K2835M7276K4486
$$ 48027 23327 -23767 -47170 -24344 23392 47647 24530 -22409 -47544 -24709 22567 47053
709D7053k0999m7298k6043K1903M6686K5643k1057m6661k5629J9748M6594K6196
$$ 47053 26054 -21244 -47287 -25384 21302 46945 25888 -20773 -46402 -26654 19940 46136
721D6136k0297m5186k6990J9080M5846K6651j8194m5525k7336J8117M5005K7798
$$ 46136 25839 -19347 -46337 -27257 18589 45240 27046 -18479 -45815 -27698 17307 45105
733D5105j7108m5239k7536J6548M4696K8620j6480m4023k8648J5405M4249K8791
$$ 45105 27997 -17242 -44778 -28230 16466 45086 28606 -15417 -44065 -28660 15589 44380
745D4380j5283m3501k9412J4478M3477K9347j3550m3816k9549J3350M2459L0691
$$ 44380 29097 -14404 -43816 -29338 14139 43486 29936 -13880 -43429 -30079 12380 43071
757D3071j3428m2638k9877J1824M3300K9961j2040m1774l1059J2176M1832L0388
$$ 43071 29643 -12995 -42872 -31048 12252 42213 30173 -11601 -42660 -30484 11348 41736
769D1736j0274m2048l0659J0942M0299L1504r783m1000l0721Q343M0469L1881
$$ 41736 31462 -10586 -41245 -30303 9996 41500 31717 -9283 -40004 -31661 8808 40689
781D0689q959l9254l2715P585M0636L1317o632m0026l3173P660L9153L3242o706
$$ 40689 31730 -7524 -40239 -32654 7982 39299 32667 -7359 -40532 -32872 6281 39523 32817
794C2817m0077l1730N759L8712L3714o526l8242l2385M576L8545L2396l991l6856
$$ 32817 -7260 -38990 -33231 5481 39195 32669 -5573 -37958 -33382 5163 37559 33568 -3288
807c288l4285M953L6627L2688k065l7637l3223K611L5591L5153l005l6119l3732
$$ -3288 -37573 -32620 4007 36695 34630 -3007 -36230 -33619 1972 37125 34120 -1999 -35731
820c5731K93L7403L4161k435l4435l5598J670L5542L3409Q14l6007l3979J420
$$ -35731 -35438 1965 36126 33691 -744 -36342 -34672 870 34279 35093 -914 -34893 -33473
833c3473L2104L5889L32l4463l3090k282L3885L4821N77l1198l6346k493L4746
$$ -33473 -1369 34520 34852 389 -32701 -34983 -1098 33723 34300 3102 -33244 -35737 -991
846i91L2699L630l1899l6603j600L0666L6159M043l4121l2690n164L0438L7871
$$ -991 31708 35338 3439 -33164 -34764 -4098 32061 36104 1983 -30707 -35871 -5433 32438
859C2438K062l0265l4748o268L2582L3672O060k9124l7954k608K8867L3734Q768
$$ 32438 34500 4235 -30513 -36781 -4199 29473 35533 6409 -31545 -34153 -5286 28448 37216
872C7216l1174l5051n948K7545L7986M699k8236l3971j0279L0376L5586N694k5615
$$ 37216 6042 -29009 -34957 -7412 30574 35273 7037 -26934 -37213 -6837 28749 34443 8828
885H828l7423p371K7758L4077J1040k9205l6121n902K3169L7866R793k8873l3113
$$ 8828 -28595 -35966 -8208 25869 36909 7704 -28417 -34319 -11150 26716 36509 7636 -25477
898b5477j1172K6726L6522P674k2487l7709j0974K8314L2510J1869k3949l7715
$$ -25477 -36649 -9923 26599 34273 11786 -25923 -36897 -8583 23927 35796 11847 -25868
910b5868q673K2892L6059J2320k7190l1810j3183K1427L9540R204k2625l4267
$$ -25868 -34541 -11649 24410 36730 9540 -22270 -35453 -14026 25514 34718 12093 -22174
922b2174j4719K5407L3456J3310k0425l9249j0249K1427L3183J6902k3786l4758
$$ -22174 -36893 -11486 21970 35280 14855 -24394 -34643 -13216 19967 36869 13083 -21675
934b1675j3257J9696L7699J2293k1180l2359j8275K2603L5620J1793j6857l6522
$$ -21675 -34932 -15236 22463 34756 13576 -18783 -37058 -14455 21165 32958 16101 -20421
946b0421j4438K0301L2377J8637k1362l5062j2543J4854L6242J7109k0602l1927
$$ -20421 -34859 -14558 17819 36456 15094 -19968 -32511 -17657 18585 35694 15092 -16835
958a6835j8237J8268L5942J3773j4438l5601j8799K0792L1344J7915j5277l6256
$$ -16835 -35072 -16804 19138 32911 18473 -17128 -35927 -15135 16209 34124 18847 -17409
970a7409j5196J4172L4379J9433j9121l0622j8692J2905L6961J6273j4614l2184
$$ -17409 -32605 -18433 15946 35379 16258 -14364 -33056 -20151 16810 33083 18469 -13715
982a3715k0698J6762L1230J9290j1851l6578j7188J4201L0723K2080j4948l2618
$$ -13715 -34413 -17651 13579 32869 21018 -15560 -32748 -18547 12176 34256 19308 -13310
994a3310j8653J0931L4990J8547j2841k9962k3249J3509L3079J8120r379l3249
$$ -13310 -31963 -21032 13958 32505 19664 -10298 -33547 -20038 13041 31161 21782 -11467
1006a1467k0767J2206K9964K3504j2430l3047j7938Q079L2043K2547j2449k9288
$$ -11467 -32234 -20028 9936 33440 21010 -12037 -29975 -21896 10147 32694 20245 -9043
1018i043k2387R456L2695J9028o944l1433k3518J1905K8229K2261p009l2234k0459
$$ -9043 -31430 -21974 10721 29749 22805 -8628 -32146 -20241 7988 30249 23240 -8994 -29453
$$ [...]
8191a17
##END NTUPLES=NMR FID
##END=
