##TITLE=1H_PR192M_TW
 D2O, 8 sc, 
 23.10.2020
##JCAMPDX= 6.0         $$ Bruker NMR JCAMP-DX V2.0
##DATA TYPE= NMR FID
##DATA CLASS= NTUPLES
##ORIGIN= UXNMR, Bruker Analytische Messtechnik GmbH
##OWNER= root
$$ XWIN-NMR		Version 3.5
$$ Fri Oct 23 12:09:32 2020 Russian Standard Time (UT+4h)  she@DPX200
##.OBSERVE FREQUENCY= 200.1315066352
##.OBSERVE NUCLEUS= ^1H
##.DELAY= (6, 6)
##.ACQUISITION MODE= SIMULTANEOUS
##.ACQUISITION SCHEME= undefined
##.AVERAGES= 8
##.DIGITISER RES= 18
##SPECTROMETER/DATA SYSTEM= spect
##.PULSE SEQUENCE= zg30
##.SOLVENT NAME= D2O
##.SHIFT REFERENCE= (INTERNAL, D2O, 0, 15.7039)
##AUDIT TRAIL= $$ (NUMBER, WHEN, WHO, WHERE, WHAT)
$$ ##TITLE= Audit trail, XWIN-NMR		Version 3.5
$$ ##JCAMPDX= 5.01
$$ ##ORIGIN= Bruker BioSpin GmbH
$$ ##OWNER= she
$$ F:/spectra/data/she/nmr/H-F/1/audita.txt
$$ ##AUDIT TRAIL=  $$ (NUMBER, WHEN, WHO, WHERE, WHAT)
(   1,<2020-10-23 12:08:16.20 +0400>,<she>,<DPX200>,
      <created by zg, POWCHK disabled, PULCHK disabled
       configuration hash MD5:
       00 E9 B6 7A A2 85 ED C7 34 08 36 98 17 FE 4E 26
       data hash MD5: 16K
       30 4B 23 98 43 DE 8D CD 14 F4 A7 81 E5 F8 7C 6A>)
$$ ##END=
$$ 
$$ hash MD5
$$ 51 F6 D1 98 39 BC BA 20 EB D6 C9 86 15 10 E9 C4
##$RELAX= 
##$RELAX= 
##$RELAX= 
##$RELAX= 
##$RELAX= 
##$RELAX= 
$$ Bruker specific parameters
$$ --------------------------
##$DU= <F:/spectra>
##$EXPNO= 1
##$NAME= <H-F>
##$PROCNO= 1
##$TYPE= <nmr>
##$USER= <she>
##$AMP= (0..31)
100 100 100 100 100 100 100 100 100 100 100 100 100 100 100 100 100 100 
100 100 100 100 100 100 100 100 100 100 100 100 100 100 
##$AQSEQ= 0
##$AQ_mod= 1
##$AUNM= <au_zg>
##$AUTOPOS= <>
##$BF1= 200.13
##$BF2= 200.13
##$BF3= 200.13
##$BF4= 200.13
##$BF5= 200.13
##$BF6= 200.13
##$BF7= 200.13
##$BF8= 200.13
##$BYTORDA= 1
##$CFDGTYP= 0
##$CFRGTYP= 5
##$CHEMSTR= <none>
##$CNST= (0..31)
1 1 145 1 1 1 1 1 1 1 1 1 1 1 1 1 1 1 1 1 1 1 1 1 1 1 1 1 1 1 1 1 
##$CPDPRG= <>
##$CPDPRG1= <>
##$CPDPRG2= <>
##$CPDPRG3= <>
##$CPDPRG4= <mlev>
##$CPDPRG5= <mlev>
##$CPDPRG6= <mlev>
##$CPDPRG7= <mlev>
##$CPDPRG8= <mlev>
##$CPDPRGB= <>
##$CPDPRGT= <>
##$D= (0..31)
0 1.2 0 0 0 0 0 0 0 0.06 0 0.03 0 0 0 0 0.0002 0 0 0 0 0 0 0 0 0 0 0 0 
0 0 0 
##$DATE= 1603440495
##$DBL= (0..7)
120 120 120 120 120 120 120 120 
##$DBP= (0..7)
150 150 150 150 150 150 150 150 
##$DBP07= 0
##$DBPNAM0= <>
##$DBPNAM1= <>
##$DBPNAM2= <>
##$DBPNAM3= <>
##$DBPNAM4= <>
##$DBPNAM5= <>
##$DBPNAM6= <>
##$DBPNAM7= <>
##$DBPOAL= (0..7)
0.5 0.5 0.5 0.5 0.5 0.5 0.5 0.5 
##$DBPOFFS= (0..7)
0 0 0 0 0 0 0 0 
##$DE= 6
##$DECBNUC= <off>
##$DECIM= 32
##$DECNUC= <off>
##$DECSTAT= 4
##$DIGMOD= 1
##$DIGTYP= 9
##$DL= (0..7)
0 120 120 120 120 120 120 120 
##$DP= (0..7)
150 150 150 150 150 150 150 150 
##$DP07= 0
##$DPNAME0= <>
##$DPNAME1= <>
##$DPNAME2= <>
##$DPNAME3= <>
##$DPNAME4= <>
##$DPNAME5= <>
##$DPNAME6= <>
##$DPNAME7= <>
##$DPOAL= (0..7)
0.5 0.5 0.5 0.5 0.5 0.5 0.5 0.5 
##$DPOFFS= (0..7)
0 0 0 0 0 0 0 0 
##$DQDMODE= 0
##$DR= 18
##$DS= 0
##$DSLIST= <SSSSSSSSSSSSSSS>
$$ [...]
##$SUBNAM2= <"">
##$SUBNAM3= <"">
##$SUBNAM4= <"">
##$SUBNAM5= <"">
##$SUBNAM6= <"">
##$SUBNAM7= <"">
##$SUBNAM8= <"">
##$SUBNAM9= <"">
##$SW= 16.880792210976
##$SWIBOX= (0..15)
0 0 2 0 0 0 0 0 0 0 0 0 0 0 0 0 
##$SW_h= 3378.37837837838
##$TD= 16384
##$TD0= 1
##$TE= 0
##$TE2= 300
##$TE3= 300
##$TEG= 300
##$TL= (0..7)
0 120 120 120 120 120 120 120 
##$TP= (0..7)
150 150 150 150 150 150 150 150 
##$TP07= 0
##$TPNAME0= <>
##$TPNAME1= <>
##$TPNAME2= <>
##$TPNAME3= <>
##$TPNAME4= <>
##$TPNAME5= <>
##$TPNAME6= <>
##$TPNAME7= <>
##$TPOAL= (0..7)
0.5 0.5 0.5 0.5 0.5 0.5 0.5 0.5 
##$TPOFFS= (0..7)
0 0 0 0 0 0 0 0 
##$TUNHIN= 0
##$TUNHOUT= 0
##$TUNXOUT= 0
##$USERA1= <user>
##$USERA2= <user>
##$USERA3= <user>
##$USERA4= <user>
##$USERA5= <user>
##$V9= 5
##$VALIST= <valist>
##$VCLIST= <CCCCCCCCCCCCCCC>
##$VD= 0
##$VDLIST= <DDDDDDDDDDDDDDD>
##$VPLIST= <PPPPPPPPPPPPPPP>
##$VTLIST= <TTTTTTTTTTTTTTT>
##$WBST= 1024
##$WBSW= 4
##$XGAIN= (0..3)
0 0 0 0 
##$XL= 0
##$YL= 0
##$YMAX_a= 239198
##$YMIN_a= -233570
##$ZGOPTNS= <>
##$ZL1= 120
##$ZL2= 120
##$ZL3= 120
##$ZL4= 120
##$ABSF1= 10
##$ABSF2= 0
##$ABSG= 5
##$ABSL= 3
##$ALPHA= 0
##$AQORDER= 0
##$ASSFAC= 0
##$ASSFACI= 0
##$ASSFACX= 0
##$ASSWID= 0
##$AUNMP= <proc_1d>
##$AZFE= 0.1
##$AZFW= 0.1
##$BCFW= 1
##$BC_mod= 2
##$BYTORDP= 1
##$COROFFS= 0
##$CY= 11.3945322036743
##$DATMOD= 1
##$DC= 2
##$DFILT= <>
##$DTYPP= 0
##$F1P= 16.9975609425685
##$F2P= -3.02152046262296
##$FCOR= 0.5
##$FTSIZE= 0
##$FT_mod= 4
##$GAMMA= 1
##$GB= 0.15
##$INTBC= 1
##$INTSCL= 1
##$ISEN= 128
##$LB= 0.24
##$LEV0= 0
##$LPBIN= 0
##$MAXI= 10000
##$MC2= 0
##$MEAN= 0
##$ME_mod= 0
##$MI= 1.114404
##$NCOEF= 0
##$NC_proc= 0
##$NLEV= 6
##$NOISF1= 3.799351
##$NOISF2= 2.8
##$NSP= 1
##$NTH_PI= 0
##$NZP= 0
##$OFFSET= 15.70392
##$PC= 1
##$PHC0= -10699.74
##$PHC1= 19.20088
##$PH_mod= 1
##$PKNL= yes
##$PPARMOD= 0
##$PSCAL= 0
##$PSIGN= 0
##$REVERSE= no
##$SF= 200.130013532006
##$SI= 16384
##$SIGF1= 3
##$SIGF2= 2
##$SINO= 400
##$SIOLD= 16384
##$SREGLST= <1H.CDCl3>
##$SSB= 0
##$STSI= 0
##$STSR= 0
##$SW_p= 3612.71676300578
##$SYMM= 0
##$S_DEV= 0
##$TDeff= 0
##$TDoff= 0
##$TI= <>
##$TILT= no
##$TM1= 0
##$TM2= 0
##$TOPLEV= 0
##$USERP1= <user>
##$USERP2= <user>
##$USERP3= <user>
##$USERP4= <user>
##$USERP5= <user>
##$WDW= 1
##$XDIM= 8192
##$YMAX_p= 0
##$YMIN_p= 0
$$ End of Bruker specific parameters
$$ ---------------------------------
##NTUPLES= NMR FID
##VAR_NAME=  TIME,          FID/REAL,        FID/IMAG
##SYMBOL=    X,             R,               I
##VAR_TYPE=  INDEPENDENT,   DEPENDENT,       DEPENDENT
##VAR_FORM=  AFFN,          ASDF,            ASDF
##VAR_DIM=   8192,          8192,            8192
##UNITS=     SECONDS,       ARBITRARY UNITS, ARBITRARY UNITS
##FACTOR=    0.000296,      1,               1
##FIRST=     0,             0,               0
##LAST=      2.424536,      0,               0
##MIN=       0,             -233570,         0
##MAX=       2.424536,      239198,          0
$$ Real data points
##PAGE= N=1
##DATA TABLE= (X++(R..R)), XYDATA
$$ [...]
2107A923J710k317l382j633J975L405J328j527l035j580J867L020J325j079l339
$$ 1923 3633 1316 -2066 -3699 -1724 1681 3009 1482 -1553 -3133 -1266 1754 3079 2000 -1339
2122a339j801J488L106J501j730k813j537J363L224J507j364l061j755J456L285
$$ -1339 -3140 -1652 1454 2955 1225 -1588 -3125 -1762 1462 2969 1605 -1456 -3211 -1755 1530
2137A530J719j366l053k119J824L076J529r89l398j848Q75L311K234j525l010
$$ 1530 3249 1883 -1170 -3289 -1465 1611 3140 2151 -1247 -3095 -2220 1091 3325 1800 -1210
2152a210k258J235K947K437j041l130j938Q54K473K762p19l203k244O20K734K587
$$ -1210 -3468 -2233 714 3151 2110 -1020 -2958 -2104 369 3131 2412 -791 -3035 -2415 319 2906
2168B906q48k912k181M65K934K392m45k873k246O78K610K300m46k632k291K54
$$ 2906 2058 -854 -3035 -2570 364 2756 2311 -562 -2808 -2130 480 2780 2334 -298 -2589 -2335
2184b335K787K424l73l096k334K93K805K547n82k591k389K26K851K562L4k648
$$ -2335 452 2876 2503 -593 -2927 -2634 171 2718 2136 -455 -2844 -2618 233 2795 2829 181
2200A81k784J94K359K633L14k571k608p41K705K465L06k356k484l70K560K333
$$ 181 -2603 -2409 -50 2583 2897 326 -2282 -3023 -318 2147 2453 97 -2387 -2757 -197 2136
2216B136N05k223k434k63K060K663J08j989k607l34J855K494L26j855k747n14
$$ 2136 2641 418 -2016 -2279 -219 2444 2552 563 -2044 -2378 -523 1971 2297 442 -2305 -2819
2232b819K072K630Q82k232k784k91K132K654O52k272k472p36J924K940L45j626
$$ -2819 -747 1883 2765 533 -2251 -2542 -410 2244 2896 624 -1848 -2584 -660 2280 2625 999
2248I99k617j390J906K597J235j633k980q54J629K731J308j840k381j494J556
$$ 999 -1618 -3008 -1102 1495 2730 1097 -1883 -2737 -1108 1623 2931 1091 -1290 -2784 -1228
2263a228K686J402j526k663j534J471K596J262j340k856o23Q90K866J257j316
$$ -1228 1458 2860 1334 -1329 -2863 -1392 1204 2466 1126 -1730 -2353 -1463 1403 2660 1344
2278A344k428j350J315K727Q49j290k403j331J135K497J373r08k798j435J179
$$ 1344 -1084 -2434 -1119 1608 2457 1167 -1236 -2567 -1432 1065 2438 1530 -1268 -2703 -1524
2293a524K381J706j036k510j468P91K900J435q21k655j821P01K692J515p66k264
$$ -1524 857 2563 1527 -983 -2451 -1660 1240 2675 1854 -801 -2622 -1921 771 2286 1520 -744
2309g44j452M65K225J708o66j921k000M67K414K089n39j965k186O67K010J396
$$ -744 -2196 -1731 494 2202 1536 -385 -2385 -1918 496 2585 2046 81 -2105 -1438 572 1968
2325A968l54k014j877L23K227K089m97k324j681M26K197J924m59k096k181N36
$$ 1968 1614 -400 -2277 -1954 273 2362 1865 -459 -2140 -1714 483 2407 1948 -148 -2329 -1793
2341a793K257J569J6k105k239M13J831K007K08k374j685l08K267K063j58j658
$$ -1793 464 2033 2049 -56 -2295 -1882 -51 1956 2164 -210 -1895 -2203 64 2127 1969 311
2357C11j952m01J943K053M08j928k423o8J752J993L21j666j990n51J597K328K57
$$ 311 -1641 -2042 -99 1954 2362 434 -1989 -2057 -305 1688 2009 343 -1647 -2198 -601 1727 1984
2374A984j560k006m17J547K404Oj454k106m27J767K098L26j941j790o07J316K475
$$ 1984 424 -1582 -1999 -452 1952 1958 504 -1602 -2029 -262 1836 2162 221 -1569 -2176 -860 1615
2391A615N96j440k278o81J688K120L89j034k353q34J451K162O93j501j657r87
$$ 1615 2211 771 -1507 -2188 -500 1620 2009 975 -1378 -2212 -761 1401 2094 593 -1064 -2051
2407b051J047J832Q56r48j767j177J021K336Q01q24j938j111J165J783Q78q09
$$ -2051 -1004 828 1684 736 -1031 -2208 -1187 1149 1950 1126 -812 -1923 -758 1025 1903 1094
2423A094j951r35P83J864R72j151j832r68J168J977P42o61j757j448J014K090
$$ 1094 -857 -1792 -1009 855 1827 676 -1156 -2124 -956 1021 1763 1102 -655 -2103 -1089 1001
2439A001J143r88k179j199J092J789J382q55j958j192M21K199J081m68j867j561
$$ 1001 2144 1156 -1023 -2222 -1130 659 2041 1186 -772 -1964 -1543 656 1737 1269 -598 -2159
2455b159P19J989J536l33k033j538O71J621J465o74j458j519K06J932J056k70
$$ -2159 -1440 549 2085 1752 -281 -1819 -1148 473 1938 1264 -194 -1713 -1507 425 1481 1211
2471A211j765j220K56J763J476j95j659j326K99J562J424j94j947j353j48K087
$$ 1211 -554 -1774 -1518 245 1721 1526 -133 -1459 -1160 402 1826 1632 -315 -1668 -1816 271
2487B71J533k42j855j454O1J577J700K04j739j631r9J404J948J32j475j610n16
$$ 271 1804 1562 -293 -1747 -1686 -109 1591 1795 56 -1575 -1674 -270 1678 1810 335 -1275 -1791
2504a791J484J837P7j592j801j43J678J426L62j489j417P5R52J439N22j190j648
$$ -1791 -307 1530 1607 15 -1786 -1929 -251 1175 1537 48 -1369 -1294 -342 1097 1619 429 -1219
2521a219j89J096J673N2j185j735k13J570J307K35j110j840j47J424J429P48j286
$$ -1219 -1408 -312 1361 1413 228 -1507 -1720 -150 1157 1392 282 -1558 -1705 -281 1148 1896 610
2538F10j734n69J270J770N76j140j900o35J314J302P19r81j808n15Q83J754P07
$$ 610 -1124 -1693 -423 1347 1923 783 -1117 -1752 -438 864 1583 602 -1206 -1721 -838 916 1623
2555A623q84j714n80P44J759O88q10j393j183J049J676N53p54j692q58P50J785
$$ 1623 739 -975 -1555 -811 948 1636 826 -567 -1750 -701 975 1528 774 -918 -1776 -1026 759
2572G59P13m40j769q25O57J950P41q94j484r23Q31J483Q13n58j963r54Q51J622
$$ 759 1472 1032 -737 -1562 -905 1045 1786 892 -592 -1515 -684 799 1612 1054 -909 -1863 -1012 610
2590F10J066o23j761j084O49J851J019o53j384j470P84J601R86l96j588j252N24
$$ 610 1676 1053 -708 -1792 -1143 708 1727 1074 -310 -1780 -996 605 1591 1195 -393 -1645 -1121
2607a121J458J097k83j393j352J30J865J024n08j038j150J32J698R04r4j560j057
$$ -1121 337 1434 1151 -242 -1594 -1464 401 1425 917 -121 -1271 -1139 559 1463 1369 -191 -1248
2624a248J00J212J469n85j508o33J12J127J492m35r45j620K44J492J013K17j287
$$ -1248 -1148 64 1533 948 -560 -1193 -1081 46 1538 1103 158 -1462 -1218 274 1287 1504 217
2641B17j664J37J408J335r5j449j323k32J345J346J46j448r85k74J125J309L94
$$ 217 -1447 -1310 98 1433 1338 -111 -1434 -1666 -321 1025 1171 -277 -1262 -1536 -411 898 1292
2658A292q94j601J3J055J319J51j282j086j54P58J488K70j194r70n32J499R83
$$ 1292 398 -1203 -1190 -135 1184 1335 53 -1033 -1187 -429 1059 1329 135 -835 -1367 132 1115
2675A115rm08j762j79J334Q61M84q84j713j12J020J322K22j008j399m32J270J177
$$ 1115 1106 698 -1064 -1243 91 952 1436 552 -1161 -1273 -253 1069 1291 283 -1116 -1548 -278 899
2693H99N45q88j606j05P08J440M39p17j112j009M22J748O35j161r96p40R05J583
$$ 899 1444 556 -1050 -1155 -447 993 1432 715 -397 -1406 -984 764 1399 238 -758 -1498 -593 990
2711I90R3p38j003m80P09J132P29p79j360m16N32J488M51p56j251n85L88J784
$$ 990 1083 345 -658 -1138 -429 703 1432 653 -707 -1123 -591 897 1348 592 -659 -1244 -856 928
2729I28K52p17j074r32J123J015R43p95j355n47O86J243O70p45j375o60M98J205
$$ 928 1180 463 -611 -1543 -420 595 1538 743 -612 -1159 -473 770 1440 695 -680 -1340 -842 363
2747C63R12l14j372r24N44J253P68k29j285r23L60J050J000k73j117o90j71J352
$$ 363 1275 961 -411 -1335 -791 462 1230 1001 -284 -1207 -847 203 1203 930 -187 -877 -1048 304
2765C04P06k52j135j146N65J137J000k88j156q15L88R71R98m79j120o33J30J038
$$ 304 1010 758 -377 -1523 -958 179 1179 891 -265 -1080 -692 279 1277 798 -322 -955 -825 213
2783B13J138l22j094j150J18J515M53K82j225j207M26P34R88M07j245p55l40J294
$$ 213 1351 1029 -65 -1215 -1097 418 871 1153 -72 -1279 -853 -119 869 1276 31 -724 -1064 230
2801B30J171n71p72q91k95P49J235M3p03j093m0P52J110K1r27q48q1Q35R26K9
$$ 230 1401 830 58 -833 -1128 -379 856 899 196 -897 -937 -185 925 946 19 -829 -910 -75 851 880
2821H80q09r14j68R21Q41L13j122r29j82R88P69O10j005j308J67O56J283K32r43
$$ 880 71 -843 -1011 -90 751 1064 -58 -987 -1169 -181 588 1198 193 -1115 -948 -292 991 1223 280
2840B80r86k56P25J195K18q72j093m70Q70J104L70o62j260j52M83J369L01o35
$$ 280 -706 -962 -237 958 1176 304 -789 -1259 -389 715 1085 423 -837 -989 -506 863 1164 529
2858E29r30q59J092R85K76p68j150k61O37Q59M11m07j156l05P81Q38M10o26p70
$$ 529 -401 -1260 -168 817 1093 325 -825 -1086 -449 410 821 414 -742 -1047 -266 572 982 356 -414
2877d14n99O55J306J82o29j044n15O00J167l8q6r92o84M69J164O93o52j076n90
$$ -414 -1013 -358 948 1130 501 -543 -1058 -458 709 671 585 -407 -1091 -622 542 1235 583 -493 -1083
2896a083M59J169N06l69q11q24J44R97R54n72q16o68K17Q37Q34l53q12o61J8J069
$$ -1083 -624 545 1051 682 -129 -953 -809 188 1142 570 -246 -914 -697 140 974 621 -191 -852 -834 235
2916B35N45m6r84m82J47J037L54j32r01o78l2J316L16j06m80r05l8Q81P46k65
$$ 235 780 734 -250 -732 -585 452 806 674 -227 -905 -937 379 695 589 109 -796 -834 47 793 528
2936E28o61p94L28Q45O55r5r45r43L09N94J102O0j152o39m41J236Q13j63m15q85
$$ 528 -133 -927 -599 246 901 806 -139 -1082 -773 -179 923 983 -169 -808 -1249 -13 800 637 222 -663
2956f63J00M21N29M28n51q08k16P05J018o8o73j035j42Q29Q51j20n18p84q8Q15
$$ -663 -563 -142 387 815 264 -544 -760 -55 963 895 222 -813 -955 -126 725 605 87 -697 -785 30
2976C0Q03J75p38p45j33M11Q57K82o97j057N2L16J147J27p76p20k36O07R18K97
$$ 30 833 1008 270 -475 -608 -197 660 942 245 -812 -760 -444 703 830 54 -666 -902 -295 623 920
2996I20n89j017r3M82J094L3o42p40k89M36J053J12l73p20n64L87Q88N00m54j014
$$ 920 331 -686 -779 -297 797 830 188 -552 -841 -405 648 760 387 -333 -897 -510 378 878 424 -590
3016e90m7J99Q68O76q07m87n32N04O48M45l02j026m61M15Q17L38k66q94n71Q20
$$ -590 -637 -438 430 1106 299 -188 -720 -216 432 877 575 -451 -912 -497 320 658 392 -502 -1073 -253
3036b53N60O71o56p14n14L57R82L72l44r33j96P3P62O02l80q66l8j84Q38O98p8
$$ -253 307 978 322 -392 -906 -549 433 805 461 -472 -668 -595 167 769 389 -477 -515 -699 139 837 759
3057G59p68n53J68M85N60J0q87n31O1R10N11m03m34p38J96O18J074n00q34l45
$$ 759 -9 -562 -394 91 651 661 -226 -757 -696 214 725 322 -112 -850 -654 -36 1038 538 -296 -641
3077f41KR72M64j3o40j103L01Q71M50mq54o94M8R18N98r0m68p28j67O54R22k96
$$ -641 -639 333 797 784 144 -959 -658 213 663 659 -195 -889 -841 77 675 585 117 -611 -778 -124 798 502
3099E02l17r20J7O98P61Q8n65q64j0M32M86J25m72p22L09L15P57l31o6n58j73
$$ 502 185 -735 -718 -20 741 829 264 -600 -610 -178 308 433 -39 -761 -452 -137 620 289 223 -335 -508
3120e08M79P87k41j38r77r3P07L51J96n33o99o3N32Q68J52n86p13j18O55M80K64
$$ -508 -29 758 517 379 -598 -691 16 367 563 30 -669 -732 -200 668 820 234 -479 -597 58 538 802
3141H02o80n68k22N73L80L53l21o56l66K92P69K40l81o09j89N76M32L06o20j95
$$ 802 122 -446 -668 -95 285 638 317 -339 -705 -413 356 596 215 -394 -583 -7 425 731 111 -84
3161h4m44N54M05M68r62o9m90K56O82M32o00m09o16N22O02M33l68q87n8L89O33
$$ -84 -528 26 431 899 -63 -132 -622 -366 316 748 148 -261 -877 -355 247 680 312 -575 -633 -244 389
3182C89K82l04p51r5K64O53M19o10q31J81O0N67K30J49p92m65M05L80M65j61o51
$$ 389 671 367 -384 -479 -215 438 857 247 -584 -403 -343 224 454 603 -189 -654 -249 131 596 435 -216
3203b16m99N69L46N14m61l67k78R6M55N72k18n23n01R4N69L99p6n71m80J49M13
$$ -216 -715 -146 200 714 253 -114 -392 -296 159 731 513 -10 -511 -417 152 551 475 -96 -576 -427 -14
3224a4O64k70n01l65J13M52K94R4l55o97MP59O42l36l64o90P7O60L94j57n35k87
$$ -14 650 380 -121 -486 -373 79 373 467 112 -585 -581 178 820 484 120 -570 -493 167 561 404 -131 -418
3246d18k81O98L03J20m89l63R5J84M44N12m68p90K0N81M37K7m37n20J4L88O16
$$ -418 -699 -1 302 422 -67 -430 -335 -151 293 805 337 -453 -433 148 585 612 175 -345 -331 57 673
3267F73k34n96k50j38L89M29K98l52p37j63Q06N08j19m60l19k08K65Q22nm91n91
$$ 673 439 -157 -407 -545 -156 273 571 219 -518 -681 125 633 514 54 -265 -473 -208 614 609 118 -473
3288d73k16O47K17K36J5p61k70L43Q31K19n39m59l59Q6O69M67m84n45k14M49M08
$$ -473 -689 -42 175 411 426 -335 -605 -262 569 788 249 -210 -569 -483 186 653 169 -376 -590 -141 267
3309B67Q1j78m85l01L09M81M77n21o26m3M17O06N8l76l33m16N33K30L06l41n91
$$ 267 348 170 -315 -616 -307 174 651 130 -496 -539 -122 484 542 166 -167 -583 -50 180 486 145 -446
3330d46j96M38M89L41k73q00k2N5P55K96n7q72k09K39M12M25j21p83j12n1L86
$$ -446 -642 -204 285 626 353 -447 -469 -414 341 637 580 -292 -501 -262 150 575 454 -329 -441 -492 -106
3351a06N67Mp66O8j51M61N08k45m25l29j35O19K49o3j41q64O09M29J18Lo37k47
$$ -106 461 465 -301 -233 -384 77 585 340 -85 -414 -549 70 319 256 115 -749 -140 289 407 410 -227 -474
3373d74M3N35N94o23k14j64l26J076K0Q0n15p55K89N02N54l01l66l94j8N86K66
$$ -474 -431 104 698 75 -139 -303 -629 447 467 547 32 -723 -434 68 622 321 -45 -439 -457 129 395
3394C95q0q2o24j13M29O91Q3n93n14J90K47K07K72o66l22J85L81L51M1m89m50
$$ 395 315 233 -391 -504 -75 616 699 106 -408 -218 29 236 508 -158 -480 -295 86 437 478 -11 -461
3415d61J37L99L77J9n98k66p1M03M32k1j91m40k10N33M60j36l57m11k10N46L17
$$ -461 -324 75 452 471 -127 -393 -464 -61 371 350 159 -281 -491 42 502 366 9 -402 -612 -66 251
3436B51K43m83j12k04L14L22j59J31o57l29J89P52J54j76n27QM1N47K90n1p89
$$ 251 494 11 -101 -305 9 331 172 303 -354 -683 -494 258 412 236 -291 -283 -242 305 595 544 -245
3457b45j31K66L99J76k87l76l60J67N69K14k42m61l84M48M73J99m07l61l78N37
$$ -245 -376 -110 289 465 178 -198 -558 -391 178 392 150 -311 -695 -247 226 425 18 -343 -721 -184
3477a84K81K14k49o8k83j21P53K28o6q12j6j2O58N7m26lm10J07M15K62qm13k6
$$ -184 97 311 62 -6 -289 -410 343 571 505 -307 -323 -335 323 380 -46 -49 -459 -352 63 325 317 -96 -122
3500a22J17L50O0j55m56l8J8J90K17k70J59n33J37N00M6J52m29o2o4L00N29l78
$$ -122 -5 345 405 250 -206 -244 -226 -36 181 -89 70 -463 -326 174 220 372 -57 -119 -183 117 646 268
3522B68n79l5R6M08J85j62k27k81k16O66K60k40k04l04K11J85K16J3j39l16kK14
$$ 268 -311 -346 -250 158 343 181 -46 -327 -543 123 383 143 -61 -365 -154 31 247 260 121 -195 -197 17
3544A7L41j10m65l01J75L20l3K98j0n85R0K16L36j11k79q2j51N44kK12k59o66
$$ 17 358 248 -217 -518 -343 -23 -56 242 232 -353 -263 -47 289 178 -101 -183 -334 210 208 420 161 -505
3566e05J35L46K26Ll39j91J14J05J74J16km70J10p5O79J51l39m07k07L75J36K45
$$ -505 -370 -24 202 205 -134 -325 -211 -106 68 184 182 -288 -178 -253 426 577 238 -169 -376 -1 135 380
3588C80l93l27J61J98L15M6l83k57J44j3L42K36k35j88m83L06K90J42j61k52j14
$$ 380 -13 -340 -179 19 334 380 -3 -260 -116 -129 213 449 214 26 -457 -151 139 281 120 -132 -246
3609b46K57L77k5k00k41rJ24K12R9m45j56q7J15M95J25l12m71k23M50O41k48k06
$$ -246 11 388 363 163 -78 -87 37 249 348 -97 -253 -340 -225 270 395 83 -388 -611 -161 480 232 26
3631B6j91l19J16N06L68k68l21l03J64N08J36l62n3m09L61J12J04p2l19k25K72
$$ 26 -165 -484 -368 138 506 238 -83 -386 -222 286 422 60 7 -402 -41 71 175 103 -216 -441 -169
3652a69K86L49k8o66j56K5P22k13Q1n20M5R4N5M03p1m16J0j64L33K30j07k62n2
$$ -169 117 466 438 -228 -384 -359 363 150 231 -289 -244 -150 -95 308 237 -179 -169 -333 0 230 123 -139 -191
3675a91Q9J77K21J24n31j12L9M52K99n91j94j40N5M08J9K41l28m18K07K86J54
$$ -191 -102 75 296 420 -111 -223 -184 268 567 -24 -218 -358 -303 105 124 365 37 -381 -174 112 266
3696B66j47J51n27j21L91J29J47l66j18p3L52J73K22q46K29j90J30N59j1m47k42
$$ 266 119 270 -257 -378 13 142 289 -77 -195 -268 84 257 479 -367 -138 -328 -198 361 350 -97 -339
3717c39N9K49M44k26r0l44J9J34N34M6n60N0l42M72K58p6j28n02J53J24M31k43
$$ -339 -280 -31 413 187 97 -247 -228 -94 440 486 -74 -24 -366 106 364 288 160 -342 -189 -65 366 123
3739A23j23k94q8J00L26L51l51J10m84J25K41K13J3m14J86J1KL9j08m15K67J31
$$ 123 0 -294 -382 -282 44 395 44 154 -330 -205 36 249 262 -152 34 45 47 86 -22 -437 -170 -39
3761c9L07m0j17j96k82M38J39j45J22j79k68L02j35M91l05m50J84Q8K53M25o29
$$ -39 268 228 111 -85 -367 71 210 65 187 8 -260 42 -93 398 93 -357 -173 -85 168 593 -36
3782c6j17j08l8M63j04o6j96K2LL48J94M3n77j61J58K24L45k64m4j80j76M37R7
$$ -36 -153 -261 -299 164 60 -6 -202 -180 -177 171 365 408 -169 -330 -172 52 397 133 89 -91 -267 170 267
3805B67j2P3n50n1N24q4j3m8k64O8K28m7K69n24P2nJ45L54k86j89k62K27M30k65
$$ 267 255 328 -222 -273 251 167 154 106 -158 -90 138 91 360 -164 -92 -97 48 402 116 -73 -335 -108 322 57
3829E7J29k17k60K56P7J90j75m11K02q7L19L43l71j46j41J94r3M22j56l3m52J75
$$ 57 186 -31 -291 -35 42 232 57 -354 -152 -239 80 423 52 -94 -235 -41 -134 288 132 99 -353 -178
3851a78L01P3k98L07k24p5J51L73j90l10p2j4K9L30J62m80l46L55m1L66J09l70
$$ -178 123 196 -102 205 -19 -94 57 430 240 -70 -142 -156 -127 203 365 -115 -461 -106 -147 219 328 -42
3873d2l53K35J32J27K7l32n7O2J06K58Q2l06j51J52L3K37mm44O5mo6N72q3k19
$$ -42 -395 -160 -28 99 126 -206 -263 -201 -95 163 245 -61 -212 -60 -27 210 206 -238 -173 -177 -243 329 246 27
3897B7l07o4M00Q4nK10o94L28l29M52J34k36l45L39q2J39K09m69J86j62J02L16
$$ 27 -280 -344 56 140 135 345 -349 -21 -350 102 236 0 -345 -6 -88 51 260 -209 -23 -185 -83 233
3919B33N1n9k09k54J12K18m8q6k37J24o9L32M5j98Nj56J23M37j15K9l16l21K91
$$ 233 284 225 16 -238 -126 92 44 -42 -279 -155 -224 108 153 -45 -40 -196 -73 364 249 278 -38 -359 -68
3942f8L86M7l98Jj87J36kK34j52k20j18L25j52L60r6n6m01L58J07O3M5l25j85
$$ -68 318 365 -33 -32 -219 -83 -85 149 -3 -223 -341 -16 -168 192 96 40 -361 -3 104 167 212 -113 -298
3965b98M21N6J5j07l05j3J50J74L78j55m41l3r4O47l31Q6j89j30m9L24n7P9l10
$$ -298 123 179 194 87 -218 -231 -81 93 471 316 -125 -158 -252 395 64 150 -39 -169 -218 106 49 128 -182
3988a82o0l6M65r3nM9k52lJ31K4Jq5k3n7J68k5J6K01l54l41K54N11l98J62k94
$$ -182 -242 -278 187 94 89 138 -114 -117 14 38 39 -46 -69 -126 42 17 33 234 -120 -461 -207 304 -94 68 -226
4013b26j01K65L62l6k06j78L13l59M62k04p3k88p0J01M59j54M8k12J23j42Q4L64
$$ -226 -327 -62 300 264 58 -120 193 -166 296 92 19 -269 -339 -238 221 67 115 -97 26 -116 -32 332
4035C32k10p7rj1K16J00j17k68m3J79K22l22J30m29P9L92l37L97l22j5j10K94
$$ 332 122 45 36 25 241 341 224 -44 -87 92 314 -8 122 -307 -228 164 -173 224 -98 -113 -223 71
4057G1j12K42Kl38Q1k4J28J40j07p8k80L33K3k0J9K6l22K73j70K88P9l77Q1K0
$$ 71 -41 201 203 -135 -54 -78 50 190 83 5 -275 58 81 61 80 106 -216 57 -113 175 254 -123 -42 -22
4081b2J45K69l13K01k75k45M70j04p1k10L6R7J44p8J56j56J65k21O6J91k60O0
$$ -22 123 392 79 280 5 -240 230 126 55 -155 -119 -22 122 44 200 44 209 -12 54 245 -15 45
4103D5k69J51R4PJ82l09j00L09m00L08M3j11j11LJ46J89R4n04J06j60J02L99j0
$$ 45 -224 -73 21 28 210 -99 -199 110 -290 18 61 -50 -161 -158 -12 177 271 -233 -127 -287 -185 214 204
4126B04l15j60J02L34O9L1m98M0L0j2O94l54k84Q3R8j55K12J77l49j34J73R6K19
$$ 204 -111 -271 -169 165 234 265 -233 -193 -163 -175 519 165 -119 -36 62 -93 119 296 -53 -187 -14 82 301
4149C01m86L00j75jk09M84L44n58j45k11K98J50O1j57K4r0j1K87k03q2K39k09
$$ 301 -185 115 -60 -61 -270 214 558 0 -145 -356 -58 92 153 -4 20 -70 -81 206 3 -79 160 -49
4171d9RJ85m0oj21k05L08J07k98L4P7j70K28m3Q1o3k00N1J04K44q3j25l60L30
$$ -49 -40 145 105 99 -22 -227 81 188 -110 -76 1 -169 59 16 97 34 -166 -115 -11 233 150 25 -335 -5
4195eR1q0R5k73m2Q0J62l8J46j01n8J0Q8K16l47M9l3r3j37O23k90K61l80J11J82
$$ -5 86 6 101 -172 -214 -134 28 -10 136 35 -23 -13 75 291 -56 -7 -40 -133 -270 353 63 324 -56 55 237
4220B37j25K27m84k3m2j57K87K32k48J05k96K32J57k1j31j07J65J1J00l68L88
$$ 237 112 339 -145 -168 -210 -367 -80 152 -96 9 -287 -55 102 81 -50 -157 8 19 119 -249 139
4241A39l19oJ48p7J94l2k30j02K22K9J45J59l15j05L03j7O7j20j29j08K75q3p7
$$ 139 -180 -186 -38 -115 79 47 -183 -285 -63 -34 111 270 -45 -150 153 136 203 83 -46 -154 121 38 -39
4264c9J04k3j43l5J64J15l70K13n3J78k55N5J78P2k9j68K33j26J20r5l18K56l67
$$ -39 65 42 -101 -136 28 143 -227 -14 -67 111 -144 -89 89 161 132 -36 197 71 191 96 -222 34 -333
4287c33K35J77Q0k33P4J89k26M36j93k98j74K60Q1J45l5m30mK75Q4j43Ol40K08
$$ -333 -98 79 159 -74 0 189 -37 399 206 -92 -266 -6 75 220 185 -245 -249 26 110 -33 -27 -367 -159
4310a59J99Q1J00k89J0qm0J55J77k91r7j34M27J18J8l31L8j50J93j00Q8K3k00
$$ -159 40 121 221 -68 -58 -66 -106 49 226 -65 -162 -296 131 249 267 -64 -26 -176 17 -83 5 28 -172
4333a72K96j87N8K50k89l2J30Q2n4j69J54l64K43L1J10j11K7k34J48Q0J32J73
$$ -172 124 -63 -5 245 -44 -76 54 136 82 -87 67 -297 -54 -23 87 -24 3 -231 -83 -3 129 302
4355C02k89P8j67J2J13J43k71J56l08J44Q7K8J69m18q2N32j93Q7j16l7K02j06
$$ 302 13 91 -76 -64 49 192 -79 77 -231 -87 0 28 197 -221 -303 229 36 123 7 -30 172 66
4377F6RL23k55q2j2j79K20Q8l65k8J65K25k5r6J6l7j12K79M8k29K2p5K4L2j73
$$ 66 75 398 143 61 49 -130 90 178 -187 -215 -50 175 150 54 70 33 -79 200 248 19 41 -34 -10 22 -151
4402a51M53k36j69R1p9L30m4l97J13P2P8J23l10K85l50Q4j50J71M86l20l73J10
$$ -151 302 66 -103 -12 -91 239 195 -202 -89 -17 61 184 -126 159 -191 -107 -257 -86 400 80 -293 -183
4424a83K22L6Ok01R0k53O3k1K96P2p2l1Q3O1n0j1r6m51L82K9K7J09N4m5k9K53
$$ -183 39 75 81 -120 -30 -283 -220 -241 55 127 55 24 107 168 118 107 11 -440 -58 -29 -2 107 161 116 87 340
4450C40n66N62m60j66K71J17k91K33J4k10R9j1Q6r0L52k80l7K19k23J26j16j34
$$ 340 -226 336 -124 -290 -19 98 -193 40 54 -156 -57 -68 18 -72 280 0 -37 182 -41 85 -31 -165
4472a65p4J83j5M3J00j56J76J70k56R1j01nK03k59R0J55k24M6N1k31J70J35L7
$$ -165 -239 -56 -71 -28 72 -84 92 262 6 97 -4 -9 194 -65 25 180 -44 2 53 -178 -8 127 164
4495A64j64LK03j47P2k1j53j1J76l4n5l12M29M7k58k14O5J21j60J95r4L95J3j79
$$ 164 0 3 206 59 131 110 -43 -54 122 88 33 -279 150 197 -61 -275 -210 -89 -249 -54 -148 247 260 81
4519H1l95J36M17k02R6l22K16K3L7K6k74J60l07P4O9L13M0k39k25J88J83q0K50
$$ 81 -314 -178 239 37 133 -189 27 50 87 113 -161 -1 -308 -234 -165 148 188 -51 -276 -88 95 15 265
4542B65m49L06j85j6L8j5j8Q4j3q5Q5O0l8j36O4r6J44M02o73L32o5j40J33L3L7
$$ 265 -184 122 -63 -79 -41 -56 -74 10 -3 -88 -3 57 19 -117 -53 -149 -5 397 -276 56 -9 -149 -16 17 54
4567E4k45L8L75j99n9L3K02j11J4r9j1Q3J19k45k35K46J09j23J86o8j69L5Lr6
$$ 54 -191 -153 222 23 -36 -3 199 88 102 3 -8 75 194 -51 -286 -40 69 -54 132 64 -105 -70 -67 -163
4591a63J49j44K28q5J24K79m84J62j73m3M84n71K63O3p5l5k5M64m78n9J64K0J2
$$ -163 -14 -158 70 -15 109 388 -96 66 -107 -150 334 -237 26 89 14 -21 -46 418 -60 -119 45 65 77
4614G7j03j47k28K65k9L59r8j84Q7P1PM2j92o5P7j52K71m8J15j82J2Q4J47p1j56
$$ 77 -26 -173 -401 -136 -165 194 96 -88 -1 70 77 119 -73 -138 -61 -213 58 10 125 -57 -45 39 186 115 -41
4639d1M5J43k4lj91J19l8o7O8K7n3N0R8p0NJ7N0n3k42K45k69J00O4o5p4R0J39
$$ -41 4 147 123 120 -71 48 10 -57 11 38 -15 35 133 63 68 85 135 82 -160 85 -184 -84 -20 -85 -159 -69 70
4666G0k85L84P7k59j48K0J54J54M8Rk01K71n91K83J76m81K24L9j22J93J9M3j70
$$ 70 -215 169 246 -13 -161 -141 13 167 215 224 23 294 -297 -14 162 -319 -95 -56 -178 15 34 77 -93
4689i3RK36Q7n4Q6qn59N42O9m67K53j76j88L85j82J70o4p3K66m48J55K09nk10
$$ -93 -84 152 239 185 271 263 -296 246 315 -152 101 -75 -263 122 -60 110 46 -27 239 -209 -54 155 150 -60
4713f0J45j06m5J50j61K37O5l03j64K93J3N5j13J62j23m8k94M71k54r8L36l2K6
$$ -60 85 -21 -66 84 -77 160 225 -78 -242 51 64 119 6 168 45 -3 -297 174 -80 -178 158 126 152
4736A52m27o1L70R3j8k94J72k37K01n7J3K48l10J27j57M24k32k29OJ47k47L73
$$ 152 -275 -336 34 127 109 -185 -13 -250 -49 -106 -93 155 -155 -28 -185 239 7 -222 -216 -69 -316 57
4758E7J26k46P1R5j20l7K51K43m84R1k95K74J19J47m29L5K29m6k1n8l36K94M3
$$ 57 183 -63 8 103 -17 -54 197 440 -44 47 -248 26 145 292 -137 -102 127 81 60 2 -334 -40 3
4781CJ62k2k88J29j31J46j65L87k59K7J8l8J0N3j46K09m7m3j3K6l7J14k75J02
$$ 3 165 143 -145 -16 -147 -1 -166 221 -38 -11 7 -31 -21 32 -114 95 48 5 -8 18 -19 95 -180 -78
4805g8j69K61P6k08K67k01J6Q8J06l54j59R9M00r5m2k27J42R3k39J67OK67k84
$$ -78 -247 14 90 -118 149 -52 -36 52 158 -196 -355 -256 144 49 7 -220 -78 15 -224 -57 -51 216 -68
4828f8J39L2J22Q3l69N5J48p6l9j24L61k73P6R6m3l8n6j87K44m5j07j18jO5K4
$$ -68 71 103 225 308 -61 -6 142 66 27 -97 264 -9 67 163 120 82 26 -161 83 38 -69 -187 -188 -123 -99
4853i9q1L12K3k63Qq9J74j30J09nn2P4L3K51Rk91M8k17L07l9Q6k21j72O0P8L12
$$ -99 -180 132 155 -108 -100 -189 -15 -145 -36 -41 -93 -19 14 265 274 -17 31 -186 121 82 168 -53 -225 -165 -87 225
4879B25n9l76J29p6J66l3R6Nj95j49K56r2l0N9J1K3Nk03O69l74m47M98j81Q1J54
$$ 225 166 -210 -81 -157 9 -24 72 77 -118 -267 -11 -103 -133 -74 -63 -40 -35 -238 431 57 -390 108 -73 8 162
4904A62l54N9J27K04k58k9P9o8j90J80J73J6j01Q2j48J60J04k08J95o7k20Q9Q4
$$ 162 -192 -133 -6 198 -60 -89 -10 -78 -268 -88 85 101 0 82 -66 94 198 -10 185 118 -102 -13 71
4927G1q0kp0oP3L07j30p3M3r6m4o5j02K98k02J55j75m4K62j69k3k63P0M7K24R6
$$ 71 -9 -11 -81 -87 -14 293 163 90 133 37 -7 -72 -174 124 -78 77 -98 -142 120 -49 -72 -335 -265 -218 6 102
4953A02j56J11j4Rj56P1M0l6MJ96N2r9j88J23r7L7j7JK13l40K45o5J84k64r8L13
$$ 102 -54 57 43 52 -104 -33 7 -29 -25 171 223 124 -64 59 -38 -1 -18 -17 196 -144 101 36 220 -44 -142 171
4979A71l5k44L69l99J61q3J37k25M32k34O4k94RL18l38J80n8j79K43J29n8j71
$$ 171 136 -108 261 -138 23 -60 77 -148 284 50 114 -180 -171 147 -191 -11 -69 -248 -5 124 66 -105
5001a05R5r2J46P3m7J50k47p2j19K97j02J92r7J49k39L0J57j72M9j32J68k43K16
$$ -105 -10 -102 44 117 70 220 -27 -99 -218 79 -23 169 72 221 -18 12 169 -3 46 -86 82 -161 55
5024E5k5P7L4k17L18r8o7m7j6j16l2L7M3RJ7R7m4k60K86o2QJ14k12ML13m44K40
$$ 55 30 107 141 -76 242 144 77 30 14 -102 -134 -97 -54 -45 -28 69 25 -235 51 -11 -3 111 -101 -97 216 -228 12
5051A2J11J9k1Ll22P5j30J43J67J7Q7R0k56j47J79J0M8J47j40j71K39K45l17k18
$$ 12 123 142 121 124 -198 -123 -253 -110 57 74 161 251 -5 -152 27 37 85 232 92 -79 160 405 88 -130
5075a30J08J27k85j2M07k52J83n4r5j0q4K74l18P6k83J94J44P9j74N1O3j48K43
$$ -130 -22 105 -180 -192 215 -37 146 92 -3 -13 -97 177 -141 -65 -348 -154 -10 69 -105 -54 9 -139 104
5098A04J75n06K97o1l34L63j89K5L94l65J38J21m8k38J61j15K13Nl08L22J05j99
$$ 104 279 -227 70 9 -325 38 -151 -126 268 -97 41 162 114 -124 37 -78 135 140 -168 154 259 60
5120F0O7l38k8L19k12K44m2m25K42J78j05R4J1Q3j95K05l56J84K31m44K59j81
$$ 60 127 -211 -239 80 -132 112 70 -355 -113 65 -40 54 65 148 -47 158 -198 -14 217 -227 32 -149
5142a49J51j0K6q3j25J68J75j84j1J49qp8j93J64L19j13j31j29O3K56r3l39K26
$$ -149 2 -8 18 -65 -190 -22 153 -31 -42 107 99 21 -172 -8 311 198 67 -62 1 257 164 -175 51
5165E1l28L42p6k42K63J89j71p2q1J78k7q4K02k36j16N3K01l3N6j18M2m9J02L8
$$ 51 -277 65 -11 -253 10 199 28 -44 -125 53 26 -58 144 -92 -208 -155 46 13 69 -49 -7 -56 46 84
5189H4q5m01L50J11k2J6K6j26J24Km8j26n3K67n0j82J94j57O4n1J37L2L2k80j05
$$ 84 -1 -402 -52 59 37 53 79 -47 77 79 31 -95 -148 119 69 -113 81 -76 -12 -63 74 106 138 -142 -247
5214b47M04j30p4lL9j87M27l09L28j55Q1k17o1P5K5J28n4J4Q6j20N1j0j00m2j17
$$ -247 157 27 -47 -50 -11 -198 229 -80 248 93 174 -43 -104 -29 -4 124 70 84 170 50 101 91 -9 -51 -168
5239a68J02K61j16p8k40L69l76L36np5J25p1j56J60o8qJ39Q0j66r3j19J12J04
$$ -168 -66 195 79 1 -239 130 -246 90 85 10 135 64 -92 68 0 -8 131 211 45 -48 -167 -55 49
5262D9j56j37L05k17K13Nj43J27Ok34L26j08J42k04o8K67j34k14K00j83N3K64
$$ 49 -107 -244 61 -156 57 62 -81 46 52 -182 144 36 178 -26 -94 173 39 -175 25 -158 -105 159
5284A59k6j34r2L6l5J45M9jk59K21q7N4k7r8o4J45n8L37j89p2R8j41J94p2j73
$$ 159 133 -1 -93 -57 -92 53 102 101 -158 63 -24 30 3 -95 -159 -14 -72 265 76 4 102 -39 155 83 -90
5309i0q6O2P0l7R4K94l75m4J25J21k8j50R3k03k21K41L57j92j91K1L19k33NJ11
$$ -90 -176 -114 -44 -81 13 307 -68 -112 13 134 106 -44 49 -154 -375 -134 223 31 -160 -139 180 -53 -48 63
5333F3k21O7j15K8J84j10K6m5J35k5J33k16J14j24Q9J62l19O8K71k9K5j15K6j27
$$ 63 -158 -91 -206 -178 6 -104 -78 -123 12 -13 120 -96 18 -106 -17 145 -174 -106 165 136 161 46 72 -55
5357e5q2J28J94k77P9k0j31j9j9J70j59J63o9Q6Jj28K76K4m0L8k32j52J59n1J00
$$ -55 -137 -9 185 -92 -13 -33 -164 -183 -202 -32 -191 -28 -97 -11 -10 -138 138 162 122 160 -72 -224 -65 -116 -16
5382a6j25K72p8l19K37O0o6J49m8j11N9k40K56N3o5K1q2K44j87Q8L12n40K68K6
$$ -16 -141 131 53 -266 -29 31 -35 114 66 -45 14 -226 30 83 18 39 -43 201 14 102 414 -126 142 168
5406A68m53J15J79l4n6J44M7j58l2L03p4k60q4p0J73J59Q1j1m69N74l55J66p3
$$ 168 -285 -170 9 -25 -81 63 110 -48 -80 223 149 -111 -195 -265 -92 67 148 137 -332 242 -113 53 -20
5429b0J52k36K36k29n5J49OO9J06N0m7k94j03L68j14j05O4l1K25k59K9j37M1j03
$$ -20 132 -104 132 -97 -152 -3 3 72 178 228 181 -113 -216 152 38 -67 -3 -34 191 -68 -39 -176 -135 -238
5453b38J52Q7J25k5j06K2Q7oj62J49J59j09k04p2k3n3L6M71k81m7L9M8j25N3l4
$$ -238 -86 1 126 101 -5 17 104 98 -64 85 244 135 -69 -141 -164 -217 -181 290 9 -38 1 49 -76 -23 -57
5478e7Q1l94K99J41m15L21J09j32J01J55j93J0j12O4P5K9j02j01M7J65k05J18
$$ -57 24 -370 -71 70 -345 -24 85 -47 54 209 16 26 -86 -22 53 82 -20 -121 -74 91 -114 4
5500Dk72K99j27m1m1L51j10P8j1r5m6l7k09M13r7k16P9M3J23J62n9q7n2l00J11
$$ 4 -268 31 -96 -137 -178 173 63 141 130 35 -11 -48 -257 156 59 -157 -78 -35 88 250 191 104 52 -248 -137
5525a37K30J25j68k38J77J60j55O3j61K33m08K95j67J5J50r9p9J83O6p9K7J55
$$ -137 93 218 50 -188 -11 149 -6 57 -104 129 -279 16 -151 -136 14 -85 -164 19 85 6 33 188
5547A88k22K76m40L00Qp7j58K44J37J47n05J31l6j80M26m58L44L06o05J45j9R3
$$ 188 -34 242 -198 102 110 33 -125 119 256 403 -102 29 -7 -187 239 -219 125 431 -174 -29 -48 45
5569D5J27j77r9JL52l03k44l4M63O8n0k47K1L9j06J44l1K7N6J7j36k1P8N0k3j71
$$ 45 172 -5 -104 -103 249 -54 -298 -332 131 199 149 -98 -77 -38 -144 0 -31 -4 52 69 -67 -88 -10 40 17 -154
5595a54J2L77k88J03k09LK64j80J98J7n12K06M9k2J57r8L9m2o1K66k04L17j99
$$ -154 -142 235 -53 50 -159 -156 108 -72 126 143 -369 -163 -114 -136 21 -77 -38 -80 -141 125 -79 238 39
5618C9k53L36j51kK30j84k57K81J65j22%L0o9P7k67K32R3p6jk5j70L09l16J54
$$ 39 -214 122 -29 -31 199 15 -242 39 204 82 82 112 43 120 -147 85 178 102 101 76 -94 215 -101 53
5642E3j77r0J79j6K78m25K73j88K24n5n4o0J4j8J40k72J80J82k22J79j82O0R6
$$ 53 -124 -214 -35 -51 227 -198 75 -113 111 56 2 -58 -44 -62 78 -194 -14 168 -54 125 -57 3 99
5665I9k27P4j5O2r4O3m0LJ52j73j04J77j0q3K05K7j37K1p8j05j43M75j22Oj1p0
$$ 99 -128 -54 -69 -7 -101 -38 -78 -75 77 -96 -200 -23 -33 -116 89 116 -21 0 -78 -183 -326 149 27 33 22 -48
5691d8J46j96K78Mk92J37k58J72J53p9l4P3M7l16K55k62j1L12l87K38J90j76n6
$$ -48 98 -98 180 184 -108 29 -229 -57 96 17 -17 56 103 -213 42 -220 -231 81 -306 -68 122 -54 -110
5714a10%K52k83n5J04J17j62Q0J32j08J60j14j72J47K1p4L00m9k19R9j01M3p6
$$ -110 -110 142 -141 -196 -92 25 -137 -57 75 -33 127 13 -159 -12 9 -65 235 186 -33 66 -35 8 -68
5737f8kN6r9L18K2l77j71K32p4L04q0n2P5l3p8j0PK6o4J35J16j22P4K6k99K35
$$ -68 -70 -14 -113 205 227 -150 -321 -89 -163 141 61 9 84 51 -27 -37 -30 -4 -68 67 183 61 135 161 -138 97
5763I7k95J83K4j44K00J8j81p3J71k71J61K63l26m8M97l25K13k01K11l96L30j56
$$ 97 -198 -15 9 -135 65 83 -98 -171 0 -271 -110 153 -173 -221 276 -49 164 -37 174 -222 108 -48
5785d8N2J11k19k6J44J56q1M1l44J70j09J29J56j15k8K5k51L06j66O8L7J38l23
$$ -48 4 115 -104 -130 14 170 89 130 -214 -44 -153 -24 132 17 -11 14 -237 69 -97 -29 8 146 -177
5808a77J88K55l71J59J07m45J60J70p7J37j7N9k57J31m5j67Q6K0J38j16L4K81
$$ -177 11 266 -105 54 161 -284 -124 46 -31 106 89 148 -109 22 -23 -190 -104 -84 54 -62 -28 253
5830B53j83l5J30k9n7l22L91l43K69J3j21K3J95j58r0k48Q6K36O1J6j00j42P8
$$ 253 70 35 165 136 79 -243 148 -195 74 87 -34 -11 184 26 -64 -312 -226 10 71 87 -13 -155 -77
5853g7lL3J46q7j06J46k48J83j31K78l22J94J24j69J20j65j43R3M1L2m6J75Qj86
$$ -77 -80 -47 99 12 -94 52 -196 -13 -144 134 -188 6 130 -39 81 -84 -227 -134 -93 -61 -107 68 76 -110
5877a10J64M6j12O6n3K36k88O8N0J0k21n6J05j01K64p9J76k28k3J15k09K57Q5
$$ -110 54 100 -12 54 1 237 -51 17 67 77 -144 -200 -95 -196 68 -11 165 -63 -86 29 -180 77 162
5900A62J07m88L36j31j01K38j52J71j47K20j32k05J34L03k79j69J79j33O2l3J54
$$ 162 269 -219 117 -14 -115 123 -29 142 -5 215 83 -122 12 315 36 -133 46 -87 -25 -58 96
5921I6J20k35r1Q1L1o1l5K02q6r2K37l78K29j94q3K29rM2M8k71l9J33K02o7j7
$$ 96 216 -19 -110 -29 2 -59 -94 108 22 -70 167 -211 18 -176 -259 -30 -39 3 51 -220 -259 -126 76 9 -8
5946hk14K15J04l36J68K43k83K58l16JJ15l8j7l2Q0J59k55K44J42l18o2M3J02
$$ -8 -222 -7 97 -239 -71 172 -111 147 -169 -168 -53 -91 -108 -140 -60 99 -156 88 230 -88 -150 -107 -5
5969elJ0m8Pk00L3K59j90J69K5J42r9J55k50K9k38m3M06j19l3r4pj4J04J09J32
$$ -5 -8 2 -46 -39 -239 -206 53 -137 32 57 199 100 255 5 34 -204 -247 159 40 7 -87 -94 -108 -4 105 237
5995B37j61m3j68J93k24O2k16L38J1P6k65K03L2o4k48L11j41L6j2K40k34J3r7
$$ 237 76 33 -135 58 -166 -104 -320 18 29 105 -160 43 75 11 -237 74 -67 -31 -43 197 -37 -24 -121
6018a21J02r7O2o4Q1J73j13n3K6k3l23L77jP6j46j56K12j40K45l12K51j49K62
$$ -121 -19 -116 -54 -118 -37 136 23 -30 -4 -27 -350 27 26 102 -44 -200 12 -128 117 -195 56 -93 169
6041A69l94M02j98j84l3J87j48K50J97k03n3l3j13J42L24l22J41j67j06l4O3J08
$$ 169 -225 177 -21 -205 -238 -51 -199 51 248 45 -8 -41 -154 -12 312 -10 131 -36 -142 -176 -113 -5
6063eJ96j69l5K3J43j23k2j10J66m0K5j6J67j98K41k54m7O3L4Oj83L86j65N4l59
$$ -5 191 22 -13 10 153 30 8 -102 64 24 49 33 200 2 243 -11 -58 5 39 45 -138 248 83 137 -222
6088b22J77Q6k32J39N5o1L70k71l2j14J21k3P3J6r7R7o7j05K20oJ26j25j41p4
$$ -222 -45 41 -191 -52 3 -58 312 41 9 -105 16 -7 66 82 -15 82 15 -90 130 124 250 125 -16 -90
6112i0J31j51j57K47J17r9j33L18j02j39J33n9R2j85K15j61J26j43R0j97J51P5
$$ -90 41 -110 -267 -20 97 -2 -135 183 81 -58 75 16 108 -77 138 -23 103 -40 50 -147 4 79
6134G9k08K67P1k27J39r2m2L44n44L27l28J68J0j20K60o2J41l28L17k91J74j31
$$ 79 -129 138 209 -18 121 29 -13 331 -213 114 -214 -46 -36 -156 104 42 183 -145 172 -119 55 -76
6156g6p4L83j88j81R7K7J85p0j42J95k71K67L4o0n1j47q6J76L3l7q0O6J3Q0k19
$$ -76 -150 233 45 -136 -39 -12 173 103 -39 156 -115 152 186 126 75 -72 -158 18 51 14 -66 0 13 93 -126
6181a26J03J75k66K77q0P6L2k26M7n3k8K2J11O1j95J62j11J51k67m2j85L82L0
$$ -126 -23 152 -114 163 83 159 191 -35 12 -41 -69 -47 64 125 -70 92 -19 132 -135 -177 -362 20 50
6204E0m7j51J08rn1K39j02k32L08K0j77p9J66K79j52k65lQ3j21J89J01l7j31K29
$$ 50 3 -148 -40 -49 -100 139 37 -195 113 133 -44 -123 43 322 170 -95 -98 -15 -136 53 154 117 -14 215
6228B15l16r4N02k50j38J47j60K15r2k9J06k02J69j53Q6J19J46k58j59J59p3J53
$$ 215 -101 -195 307 57 -81 66 -94 121 29 0 106 -96 73 -80 6 125 271 13 -146 13 -60 93
6250I3k37L19r5J09j61M6k20J85k3j31K61J10k88J80n9%P3k43J79N3j54q3K9j42
$$ 93 -144 175 80 189 28 74 -146 39 16 -115 146 256 -32 148 89 89 162 -81 98 151 -3 -86 -57 -199
6274a99K30j34K2NJ64k02J22j05J4Q9j60M28m17O6L6k72K23j1K06j92K30l55J29
$$ -199 31 -103 -81 -76 88 -114 8 -97 -83 6 -154 274 -143 -77 -41 -313 -90 -101 105 -87 143 -212 -83
6297h3R4l33L66m2p0j47J48L8k34l7J41MK45M8k43q0J25K3J1J61j51M7N0k77J03
$$ -83 11 -322 44 2 -68 -215 -67 -29 -263 -300 -159 -155 90 138 -105 -185 -60 -37 -26 135 -16 31 81 -196 -93
6322i3Q5o4J27O5j89L17l77j8P1Q2k14K17n1O9j14J7J2J63p1J00l84L75m2p0K63
$$ -93 -8 -72 55 120 -69 248 -129 -147 -76 6 -208 9 -42 27 -87 -70 -58 105 34 134 -250 125 83 13 276
6347B76l54jm2J48J48K9p5r8j78L78k55l3K95o8j35j24k0K03j19O9k37J32O8K56
$$ 276 -78 -79 -121 27 175 204 129 31 -147 231 -24 -57 238 170 35 -89 -109 94 -25 44 -193 -61 7 263
6371B63k55j29J25j38L5n6J05M5m8k33L90J10k21pj08J50n5M3m6k50L11Lj46J92
$$ 263 8 -121 4 -134 -99 -155 -50 -5 -53 -286 104 214 -7 -14 -122 28 -27 16 -30 -280 31 34 -112 80
6395H0q7R9j25K04l94p4M67l08J00J60k24J59j00j57L05M1K0J3k83lJ01r6j5K64
$$ 80 -7 92 -33 171 -223 -297 170 -138 -38 122 -102 57 -43 -200 105 146 166 179 -104 -107 -6 -102 -117 147
6419A47lL6l26N3L68l62N1Rq6L98k20qj38N0K48k95n0K32l5J30j74j30K53k49
$$ 147 144 180 -146 -93 275 -87 -36 -27 -113 285 65 57 -81 -31 217 -78 -128 104 69 199 25 -105 148 -101
6443a01Q3O1j36J78k60K52j02K64l43r5K32l1n3J37J3m10M80j27k43O7K38L0j39
$$ -101 -18 43 -93 85 -175 77 -25 239 -104 -199 33 2 -51 86 99 -311 169 42 -201 -134 104 134 -5
6466e%L2l9p9L25k14o7nJ20j88j15J55r2K81j6J69k38L5J32mP2j41m3k1J08j17
$$ -5 -5 27 -12 -91 234 20 -47 -52 68 -120 -235 -80 -172 109 93 262 24 59 191 187 259 118 75 54 162 45
6492D5K8P0j28P3q5J5o5Q5Q2j13K2j78K48r5L3qJ10l60M08j80k45L19O0m9P3q0
$$ 45 73 143 15 88 3 18 -47 38 120 7 29 -149 99 4 37 29 139 -221 187 7 -238 81 141 92 165 85
6518H5k5K8k18L34j65j74J73q3K8k27J38Q2j20J80n8J08k2L3j07J36k44J02q5
$$ 85 60 88 -130 204 39 -135 38 -45 -17 -244 -106 -24 -144 36 -22 86 64 97 -10 126 -118 -16 -101
6541a01j1R4K4J60k45Q4j0j0N5j01J52l62K55J39j60N6j0r0K7K23k65P0j42J38
$$ -101 -112 -18 6 166 -79 5 -5 -15 40 -61 91 -271 -16 123 -37 19 9 -81 -54 169 -96 -26 -168 -30
6565c0L4j26K10j63j0J88j58J03j38J74N0j09n3k4n8J44J8o7j07R3o8K21k44K32
$$ -30 4 -122 88 -75 -85 103 -55 48 -90 84 134 25 -28 -52 -110 34 52 -15 -122 -29 -97 124 -120 112
6589A12l28L08q4k12K51p9k86N63k09j47L6N9k35J63j02M63m6l44J18O3j83N9
$$ 112 -216 92 8 -204 47 -32 -318 245 36 -111 -75 -16 -251 -88 -190 273 227 -117 1 64 -119 -60
6611f0Mp5J84j88L9k05M35k58K26j13J8j47q9L56p5N6k03K34k46J00J15k53M3
$$ -60 -56 -131 53 -135 -96 -301 134 -124 102 -11 7 -140 -229 127 52 108 -95 139 -107 -7 108 -145 -102
6634a02K06j90p4J29kK32k51J21k9L0Nk43n5K12k09J48N9r6J56j95Q3Q6p3M9r6
$$ -102 104 -86 -160 -31 -33 199 -52 69 40 70 75 -168 -223 -11 -220 -72 -13 -109 47 -148 -65 21 -52 -3 -99
6659i9J43R1j80q5J0K79j07j35K10r8j84Q3K17k65L30l0l62J06P6j39q9K52j75
$$ -99 44 135 -45 -130 -120 159 52 -83 127 29 -155 -72 145 -120 210 180 -182 -76 0 -139 -228 24 -151
6682a51J02j40L15Ll31J14J21kk4k73N5M0K56l09K14L4p5j71K24M7J6q4P6k49
$$ -151 -49 -189 126 129 -202 -88 33 31 7 -266 -211 -171 85 -224 -10 24 -51 -222 2 49 65 -19 57 -192
6706a92K21j42J53j72J74J07r6Rn4L1j96K08j51J53PN6p1k29K90j60K3J32k67
$$ -192 29 -113 40 -132 42 149 53 62 8 39 -157 51 -100 53 60 116 45 -184 106 -54 -31 101 -166
6729a66L91j68j16j47L82l05K26j45M7P7Q3n5j06J76J34j00j95R3j5j58K49m5
$$ -166 225 57 -59 -206 176 -129 97 -48 -1 76 159 104 -2 174 308 208 13 106 91 -67 182 137
6751A37p9J07J4k91L5K50j14J6j21Q0j15K42j66J64m14L57k96o6J89k6j6l7L66
$$ 137 58 165 179 -112 -77 173 59 75 -46 34 -81 161 -5 159 -255 102 -194 -260 -71 -97 -113 -150 216
6774B16m69J45Q0M8J10j6r2O2l37L70j39K7k54K74p3qL7P5m0J04q0k6J60o5O5
$$ 216 -253 -108 -28 20 130 114 22 84 -253 117 -22 5 -249 25 -48 -56 -19 56 16 120 40 14 174 109 174
6799A74L2k27J0J17j02O3j74L80k64k16Q8N3K14r4m0j94J07K97j17j73J59k01
$$ 174 206 -21 -11 106 4 67 -107 273 9 -207 -119 -66 148 54 14 -180 -73 224 107 -66 93 -108
6821a08J58J45k43N3K23P4l03k29L51Q2k27l2J23Pk16J57Lj43J80Q0j63J07K6
$$ -108 50 195 -48 5 228 302 -1 -230 121 203 -24 -56 67 74 -142 15 18 -125 55 135 -28 79 105
6844A05m2K63j05Q6l06J03P3o9q7j19J32j58J86%N1k6q9l6l1K2qK1Q4r8L7M8J41
$$ 105 63 326 221 307 1 104 177 108 21 -98 34 -124 62 62 113 87 -2 -38 -69 -47 -55 -34 50 -48 -11 37 178
6871A78j14q4J65J49j83r2l4K7J9J0O3l8r1p8P2O4N2r3j97J38q2K56j49j28J62
$$ 178 64 -20 145 294 111 19 -15 12 31 41 104 66 -25 -103 -31 33 85 -8 -205 -67 -149 107 -42 -170 -8
6896hJ62k86L37l84L15j94J35j52K73l09J94j72O7J14j38M4J84l08N5J99p6k19
$$ -8 154 -132 205 -179 136 -58 77 -75 198 -111 83 -89 -22 92 -46 -2 182 -126 -71 128 52 -167
6918a67J40L6k60J22J92j17n8j62J52J67l0L1J64l32n9J24J74j38J07L0K4k71
$$ -167 -27 9 -251 -129 63 -54 -112 -274 -122 45 15 46 210 -122 -181 -57 117 -21 86 116 140 -131
6940a31Q4J30P4j5R5k78Q4j28O8J0j31M4O4J38o2k79L52N5k47J00r4q5k41J43
$$ -131 -47 83 157 142 237 -41 43 -85 -17 -7 -138 -94 -30 108 46 -233 119 174 -73 27 -67 -152 -393 -250
6964b50M4K3K37j43j31K65k52J89Lj49J40J5j42K50%N7l65K83j08j72L4J20M4
$$ -250 -206 -183 54 -89 -220 45 -207 -18 -15 -164 -24 -9 -151 99 99 156 -209 74 -34 -206 -172 -52 -8
6987hp7N6l0M1R4l5j11o1r1o5L24j33J75j50NK28j77L4j1P7j50j36J57O5M7mk11
$$ -8 -85 -29 -59 -18 76 41 -70 -131 -222 -287 37 -96 79 -71 -66 162 -15 19 8 85 -65 -201 -44 21 68 64 -147
7014a47r6K58Q4p2j51J69J15j89k5J88l5l52K04L5N2j44J47j71J16l5J77k08J6
$$ -147 -243 15 99 27 -124 45 160 -29 -54 134 99 -253 -49 -14 38 -106 41 -130 -14 -49 128 -80 -64
7037f4QJ44jj7j53J41p7J27M0k71L93q3k9j26r0M3M7M0j17O1J76j39n4o1q1J25
$$ -64 -56 88 87 70 -83 58 -19 108 148 -123 270 187 158 32 -58 -15 32 72 -45 16 192 53 -1 -62 -143 -18
7063a8Q5J6k2j05n2K30j02M2k8O5j03O8K7k43J56j26M7j09J89j37M7R8j24J79
$$ -18 67 83 61 -44 -96 134 32 74 46 111 8 76 103 -140 16 -110 -63 -172 17 -120 -73 25 -99 80
7087H0l55M43q6k55J09N7p4J43j1k6n3J95j35j93L73j13q9j06o0J8K9J41J4k72
$$ 80 -275 168 82 -173 -64 -7 -81 62 51 25 -28 167 32 -161 212 99 10 -96 -156 -138 -109 32 46 -226
7111b26K43o2K2kOJ91r9l88M19Q2k52M4M8r9N6P3l2j51M77m22J26J55j49J24j16
$$ -226 17 -45 -23 -25 -19 172 73 -315 104 186 -66 -22 26 -73 -17 56 24 -127 350 -72 54 209 60 184 68
7136F8o0K88l41K5K93l25J01k08o1J11R4J48j55l0K33l62K24j10k17M76l74J48
$$ 68 8 296 -45 -20 273 -52 49 -159 -220 -109 -15 133 -22 -52 181 -181 43 -67 -284 192 -182 -34
7158c4K25k37R6l8j13J55j53J98j55j48K92j55LJ05k13K11J16l42K60o7O6j68
$$ -34 191 -46 50 12 -101 54 -99 99 -56 -204 88 -67 -64 41 -172 39 155 -187 73 6 72 -96
7180i6Q8j00K2j32RK00Q3o4k28L01j68J83q6K13k48M4M2q0J56q5K15m13K16rj29
$$ -96 -8 -108 -86 -218 -209 -9 74 10 -218 83 -85 98 12 225 -23 21 63 -17 139 54 269 -144 72 63 -66
7205f6r4j8L89m2l89J05L04q0R2j59q6N7N9j1J26k91N9J49J6k61K71q0q4j65J86
$$ -66 -160 -178 211 169 -220 -115 189 109 201 42 -44 13 72 61 187 -104 -45 104 120 -141 130 50 -34 -199 -13
7230a3Q2lm9K19m22M00P2j74k14N9J78l11J34J27j07J6j06K23r8m5p8o1L38j88
$$ -13 69 66 17 236 -186 214 286 112 -102 -43 135 -176 -42 85 -22 -6 -112 111 13 -32 -110 -171 167 -21
7254b1o0L6j50K48k47J65J65n2j77n2K3j57K38O6J24l4j97rO8j6K77l02J20m7
$$ -21 -81 -45 -195 53 -194 -29 136 84 -93 -145 -122 -279 -41 25 149 115 -82 -91 -23 -39 238 -64 56 9
7278IP0j57k15L08j6j3L8J21l14K67k17j6K61l61N72l30j4n3J30l03J35K09N6
$$ 9 79 -78 -293 15 -1 -14 24 145 -169 98 -119 -135 126 -235 337 7 -7 -60 70 -233 -98 111 167
7301A67j39j54R6J16k09J20k14P0K09j6j00o1j32L01J18k29J62J15k6k57M3l45
$$ 167 28 -126 -30 86 -123 -3 -217 -147 62 46 -54 -115 -247 54 172 -57 105 220 194 -63 -20 -365
7323c65M53j16J96k31k63M97k20J01K86l74O3j5q4j69J89J54O3n6k70K68J2K8
$$ -365 88 -28 168 -63 -326 171 -49 52 338 -36 27 12 -72 -241 -52 102 165 109 -161 107 119 147
7345A47k12N8J13L6j82K02K2l42J94J21j90N3j64M67k55j57K0J15r8n7K26j63
$$ 147 -65 -7 106 142 -40 162 184 -158 36 157 -33 20 -144 323 68 -89 -69 46 -52 -109 117 -46
7367d6J4L27m66K28k45K5J00L4j83l4L58r3J38r2j12R4R1q5oj76k0P2J04m1M7
$$ -46 -32 295 -171 57 -188 -163 -63 -29 -212 -246 112 19 157 65 -47 47 138 53 47 -129 -149 -77 27 -14 33
7392C3k18k54M12k2j27J78%K16l07J54j03K00k2l68J01K41o4k83N3J42K11j72
$$ 33 -185 -439 -27 -49 -176 2 2 218 -89 65 -38 162 140 -228 -127 114 50 -233 -180 -38 173 1
7414Ao3R7p6r5J33L07m69Nn1J21K51j12K47k40O7l95L69R1m59P4J14K00q1m3L7
$$ 1 -62 35 -41 -136 -3 304 -165 -160 -211 -90 161 49 296 56 123 -272 97 188 -271 -197 -83 117 36 -7 30
7439C0J41j99l39K23K23q6m1j4k27L84j06o8J46j49O2j08K73k76J18J97l71J16
$$ 30 171 -28 -367 -144 79 -7 -48 -62 -289 95 -11 -79 67 -82 -20 -128 145 -131 -13 184 -187 -71
7461g1J69j41R1P9l36Q3J40k34M70k21O6r4j09J40P3J9j92J51pj51K60k9m30J21
$$ -71 98 -43 48 127 -209 -126 14 -220 250 29 95 1 -108 32 105 124 -68 83 76 -75 185 156 -274 -153
7485a53J11j11J13R0O1k14m9K41l12K06k38M61k37j49J92j22k43M04q9J41j04
$$ -153 -42 -153 -40 50 111 -103 -152 89 -223 -17 -255 206 -31 -180 12 -110 -353 51 -38 103 -1
7506aN3j27k19K34j64K4J97Oq2J31l8j28J94k20j03K7J66J22p1J54k50J97k70
$$ -1 52 -75 -294 -60 -224 -200 -3 3 -79 52 14 -114 80 -140 -243 -216 -50 72 1 155 -95 102 -168
7529a68K95k06K32j02l19L22j04k6j0o0K59o4j17L08l29N9j73L15N5l01l6L78
$$ -168 127 -79 153 51 -268 54 -50 -76 -86 -146 113 49 -68 240 -89 -30 -203 112 167 -134 -170 208
7551B08k62j09J23J08j77r3K00J47k2mn3o8j33m6R6Lj01K28n6j15L01k06J89N2
$$ 208 -54 -163 -40 68 -109 -202 -2 145 123 119 66 -2 -135 -181 -85 -82 -183 45 -11 -126 175 -31 158 210
7575B10j55o4j89r7L23j27L64j75mk20J74J40k1k51K13j91J7j44J14J35Kq3r4
$$ 210 55 -9 -198 -295 28 -99 265 90 86 -134 40 180 159 -92 121 -70 -53 -197 -83 52 54 -29 -123
7598a23J40o0R1k41K76k66K57J2k67J45lJ49q9J42k75j49M04k13j6N9r9J50P9
$$ -123 17 -43 48 -193 83 -183 74 86 -181 -36 -39 110 21 163 -112 -261 143 -70 -86 -27 -126 24 103
7621A03p4J79k20K12k91J83j92o8J27L4m1J06j29K50m73L54O9j81L54l26N0K69
$$ 103 29 208 -12 200 -91 92 -100 -168 -41 -7 -48 58 -71 179 -294 60 129 -52 302 -24 26 295
7643B95l55J17j18j01K17q3j02J33l57J35J17J0J82p7L2j21N1O0K36k53mK99q7
$$ 295 -60 57 -61 -162 55 -28 -130 3 -354 -219 -102 -92 90 13 45 -76 -25 35 271 18 14 313 226
7666B26k74k0J99l64K84j90n3M7J50r0M35k66Lp2K17r7l5j91J31N1j28K6k3l8
$$ 226 -48 -68 131 -233 51 -139 -192 -145 5 -85 350 84 87 15 232 135 100 -91 40 91 -37 -11 -34 -72
7690g2l5O9O9R4k95j76M26j66pj79K49l1J87k21J89Lj74J99j70J54p0o8j01J5
$$ -72 -107 -38 31 125 -170 -346 80 -86 -93 -272 -23 -54 133 -88 101 104 -70 129 -41 113 43 -25 -126 -111
7714a11J09J64j19QR7j99J45J6m0j86K72j6J50m0j48j59j42L38j55K2p0J16k40
$$ -111 -2 162 43 51 148 -51 94 110 70 -116 156 140 290 250 102 -57 -199 139 -16 6 -64 52 -188
7737a88K65j29j4J15J5k6ok48L23m2o7j04k3jK60k50J63kp9j8R4r8n7M3K73j41
$$ -188 77 -52 -66 49 64 38 32 -216 107 65 -2 -106 -129 -130 130 -120 43 41 -38 -56 38 -60 -117 -74 199 58
7763E8Q3j02Q3j8j14JO8o4J48j99N4np0J28q4K32p8J1k95Q6nl1Q8j17J90o9O4
$$ 58 141 39 122 104 -10 -9 59 -5 143 -56 -2 -7 -77 51 -33 199 121 132 -163 -77 -82 -113 -25 -142 48 -21 43
7790D3j49j5J83l01Q6L06r3n0M3p7J49j4K9k60J88j55K29j36J32k66J83j89L06
$$ 43 -106 -121 62 -239 -153 153 60 10 53 -24 125 111 140 -120 68 -87 142 6 138 -128 55 -134 172
7813A72k23l7J15L2Jj25j24L7J53k01J06K20k11j00K0Q0j33L3M07j53l27J67O
$$ 172 -51 -88 27 59 60 -65 -189 -152 1 -200 -94 126 -85 -185 -165 -85 -218 -185 222 69 -258 -91 -85
7836h5J53L19n80K58m1o7k46J64O5J8k15J50N5J84l2k69K16j22R6j2J47J77k95
$$ -85 68 387 -193 65 24 -43 -289 -125 -60 -42 -257 -107 -52 132 100 -169 47 -75 21 9 156 333 38
7859C8K18k31j9K0J95j14O8j70J37l10J70o8Kk5lq9K24j45j02M93l86J71J3j20
$$ 38 256 25 6 26 221 107 175 5 142 -168 2 -66 -64 -89 -92 -181 43 -102 -204 289 -97 74 87 -33
7883c3l6J18Rj85R3pk9j9J83k3r7n3j11L68ok8j57J60kNk53J63Mk55K40R0l39
$$ -33 -69 49 58 -127 -34 -41 -70 -89 94 71 -26 -79 -190 178 172 144 -13 147 145 150 -103 60 64 -191 49 139 -200
7910b00N1K42j00J49l33J89N9O4l36j2K19L7N4k54J06N1n3k2j18K33j3J36l70
$$ -200 -149 93 -7 142 -191 -2 57 121 -215 -227 -8 29 83 -171 -65 -14 -67 -89 -207 26 13 149 -221
7933b21K02n9Q9j50K87k1k67J05k9J32nj32P4J75j91o7J14L4J17j18j27j8K98
$$ -221 -19 -78 11 -139 148 127 -140 -35 -64 68 63 -69 5 180 -11 -78 36 70 187 69 -58 -76 222
7956B22l04q3R0k0M0j6K83O0k72N6K17j81k12qm9K78j99R3Q2pK4l8j30Q9Q3n5
$$ 222 -82 -165 -75 -95 -55 -71 212 272 0 56 273 92 -120 -128 -177 101 -98 -5 77 70 94 56 -74 15 98 43
7982D3n7K81l91R8l0J65j64Nq8J17J13M3k01k1n1K55m08K71J32o4j22K31j93O6
$$ 43 -14 267 -124 -26 -56 109 -55 -50 -138 -21 92 135 -66 -87 -138 117 -291 -20 112 48 -74 157 -36 30
8006C0l4n5N0Q1k00J31r2J10M4j93K00J1L7P9j32R2k27L0Q4j14J43Q6l48J24J58
$$ 30 -4 -59 -9 72 -128 3 -89 21 65 -128 72 83 120 199 67 159 -68 -38 46 -68 75 161 -187 -63 95
8031I5k76J46K21r8j67K16j17n0N6P6kj52R2J08j82L1j43J00qJ50j64j19J08N3
$$ 95 -181 -35 186 88 -79 137 20 -30 26 102 100 -52 40 148 -34 -3 -146 -46 -54 96 -68 -187 -79 -26
8055b6l9R5K74k66j91J72k0qp4P2k04M43j96n0j10J20r5p4K99j97J60l1j51l8
$$ -26 -65 30 304 38 -153 19 -1 -9 -83 -11 -215 228 32 -18 -128 -8 -103 -177 122 -75 85 54 -97 -135
8079a35L51k11q7P3J5n0Q2L23l87j4j60j0K55q5J6J20K21p5o7J5n09K04Mm3P6
$$ -135 216 5 -82 -9 6 -44 38 361 -26 -40 -200 -210 45 -40 -24 96 317 242 175 190 -319 -115 -111 -154 -78
8104g8J08m9j24O2J79l1P1K6k24J28N8m4j32J28L7l07J43rj92Q2J12L1P1l2Q2
$$ -78 30 -19 -143 -81 98 67 138 164 -60 68 126 82 -50 78 115 -192 -49 -58 -250 -168 -56 -25 46 14 96
8129I6k4P4l4l41M04l2k57R4j42K49j33K57l82K02r5J49Q5j09M7q6j5P1j89Q7
$$ 96 72 146 112 -229 175 143 -114 -20 -162 87 -46 211 -171 31 -64 85 170 61 108 22 7 78 -111 -24
8153b4n0K3K73k80l5J10j07j7m4M85j98pk26K15k34J63l17L15l2k3j30J38K9j54
$$ -24 -74 -51 222 -58 -93 17 -90 -107 -151 334 136 129 -97 118 -116 47 -270 45 13 -10 -140 -2 27 -127
8177a27o5J66l5J08j43p4k4Q2P9J22j85M6n1m0
$$ -127 -192 -26 -61 47 -96 -170 -194 -112 -33 89 -96 -50 -101 -141
8191a41
$$ Imaginary data points
##PAGE= N=2
##DATA TABLE= (X++(I..I)), XYDATA
0@%%%%%%%%%%%%qJ6j6J6k4L2m0M8n4O2p2Q8j04J20j39J63j90K17k49K86l23L66
$$ 0 0 0 0 0 0 0 0 0 0 0 0 0 -8 8 -8 8 -16 16 -24 24 -30 32 -40 48 -56 64 -75 88 -102 115 -134 152 -171 195
34A95m14M65n24N88o56P32q16R08j007J114j233J364j506J660j831K018k221K447
$$ 195 -219 246 -278 310 -346 386 -430 478 -529 585 -648 716 -790 870 -961 1057 -1164 1283
52A283k697K974l286L636m030M485n012N628o365P263q385R837j1791J4579j8920
$$ 1283 -1414 1560 -1726 1910 -2120 2365 -2647 2981 -3384 3879 -4506 5331 -6460 8119 -10801
67a0801K6655m4627J66489R5117k59807j18326m2882K16171J69487o452j71862
$$ -10801 15854 -28773 137716 232833 -26974 -145300 -188182 27989 197476 191024 19162
78A9162k11349K2224J86078J30354O0469j92447j96354K2992J52120J80623K659
$$ 19162 -192187 -169963 16115 146469 206938 14491 -181863 -158871 -6751 173872 176531
89A76531j63954j40105n3247J76450J76952k4212j14464j67216l9615J57884J50264
$$ 176531 12577 -127528 -180775 -4325 172627 148415 33951 -133265 -172880 -14996 135268
100A35268L9160j54259j64534J235R5612J73873N1979j59864j43715m0818J17490
$$ 135268 174428 20169 -144365 -143130 -47518 126355 178334 18470 -125245 -166063 -48573
111d8573J69457L0200r8858j83780n4480J49496J33990N6508r2939j82619m3315
$$ -48573 120884 151084 52226 -131554 -186034 -36538 97452 153960 61021 -121598 -164913
122a64913J01318J68818O4189j18980j36214p7642Q6158J91092M1627r6113j47780
$$ -164913 -63595 105223 169412 50432 -85782 -163424 -77266 113826 155453 59340 -88440
133h8440p6865R9865J43422P4163q2087j74469m1433P8064J36702R0900r3175
$$ -88440 -165305 -65440 77982 152145 70058 -104411 -145844 -67780 68922 159822 66647
144F6647j46552o1778P4373J56938N2950o7714j35142r1220Q9673J39689N7247
$$ 66647 -79905 -141683 -67310 89628 142578 74864 -60278 -151498 -61825 77864 135111
155A35111n6165j48615p0611O4210J34818Q8218p6769j31199o6660L9221J47110
$$ 135111 78946 -69669 -140280 -76070 58748 146966 70197 -61002 -127662 -88441 58669
166E8669Q2245n9953j25944r0681N3735J27689P9518l0433j42756q5795M9297
$$ 58669 140914 80961 -44983 -135664 -81929 45760 125278 94845 -47911 -133706 -84409
177h4409J12111R5555l4145j25563q4404K3679J29280Q8918l4335j05658j00588
$$ -84409 27702 123257 89112 -36451 -120855 -97176 32104 121022 86687 -18971 -119559
188a19559K5475J23769Q1745j9958j16352r2518K5603J03420R8127j9824j17544
$$ -119559 -94084 29685 111430 91472 -24880 -117398 -91795 11625 109752 89928 -27616
199b7616q2586J2438J10202R8964j9715j03781r5747J3887J11223Q7814n780j03951
$$ -27616 -110202 -97764 12438 111402 91687 -12094 -107841 -93954 17269 105083 99303 -4648
211d648j02444J2384R8617R6695j956j05065r4735j855R8569J02812k705r1135
$$ -4648 -107092 -94708 3909 100604 98648 -6417 -101152 -103007 -4438 98374 95669 4534
223D534r6658q611R5676R7404R603q7870j01812q414Q4335R6949J5589q8822r5556
$$ 4534 -92124 -100735 -5059 92345 101948 14078 -87734 -96148 -11813 85136 100725 11903 -83653
236h3653j4175P8703R8518J5005p7823r4880j9879Q0547R5312J9497p4135r8275
$$ -83653 -97828 -19125 79393 94398 16575 -78305 -98184 -17637 77675 97172 23037 -75238
248g5238j8882P5178R3556K2979p4988r5108k4356O9020R7529K6184o9657r5700
$$ -75238 -94120 -18942 74614 97593 22605 -72503 -96859 -27839 69690 95874 26217 -69483
260f9483l0084O9158R8327L0547o3601r7015l2575O2531R4929L7112n9284r7003
$$ -69483 -99567 -30409 67918 98465 34864 -62151 -94726 -32195 62734 99846 40562 -56441
272e6441l9108N4901R5785M0599n4918r4036m2013N1387R3324M2803m6807r0567
$$ -56441 -95549 -40648 55137 95736 40818 -53218 -95231 -43844 49480 92283 45476 -45091
284d5091m4380M5612R0637M6294m3624r0659m7112M2055Q8428M6471m2133q7363
$$ -45091 -89471 -43859 46778 93072 49448 -41211 -88323 -46268 42160 88631 46498 -40865
296d0865m8512L8610Q7293M9158l6579q7091n0738L6943Q8015N2333l4595q7159
$$ -40865 -89377 -50767 36526 85684 49105 -37986 -88724 -51781 36234 88567 53972 -33187
308c3187n3122L2281Q5315N4873l0825q5502n7974K6549Q5337N7830k4363q3653
$$ -33187 -86309 -54028 31287 86160 55335 -30167 -88141 -61592 23745 81575 57212 -26441
320b6441o0086K4364Q2035O1032j9061q0225o0695J7106P7956O3111j6254p7003
$$ -26441 -86527 -62163 19872 80904 61843 -18382 -79077 -61971 15985 79096 62842 -14161
332a4161o2790J1797P6334O1668j2513p3012o2978J1500P2304O2648o490p2838
$$ -14161 -76951 -65154 11180 72848 60335 -12677 -75655 -64155 8149 70797 64307 -8531
344h531o1983Q515O9693O5499p800p0018o3919L396P0422O3519m705o6369o8511
$$ -8531 -70514 -61999 7694 73193 65393 -4625 -68544 -65148 5274 68793 64088 -2281 -70792
357g0792K276O8374O5945K852o7737o7070j383O3387P1980L603o4709o5738j0718
$$ -70792 -68516 -142 65803 68655 918 -66152 -67535 -4148 67832 71435 6726 -59012 -69730
370f9730O2195O9755P318n7708p2393j1106N8690O5788J6982n6943p1001j0181
$$ -69730 -7535 62220 69538 11830 -60563 -71669 -12979 52809 69791 12848 -58153 -68334
382f8334N1326O9863J6755n3515o4709k0418N2350O9833J2695m5357o9125k2350
$$ -68334 -17008 52855 69610 16095 -48614 -69032 -16682 53151 65846 20489 -48636 -70986
394g0986N2869O4253K1134m8177o9408j5937M1558P0486K5674n1561o3686k3604
$$ -70986 -18117 46136 67270 19093 -50315 -66252 -24694 45792 71466 19905 -43781 -67385
406f7385M2228P2081K1730m0483p1062k9472M7993O2622K9277l5550p5277k6231
$$ -67385 -25157 46924 68654 28171 -42891 -72363 -24370 38252 67529 31979 -43298 -69529
418f9529L7986O7705L4566m0237o2573l4289L0647P6052K6845l2579o0714m0969
$$ -69529 -31543 36162 70728 30491 -32082 -66371 -35724 40328 67173 34594 -26120 -67089
430f7089L3671O2581L4907k6314p1750k9047K6318N7359M6033l2100o3415l1165
$$ -67089 -33418 29163 64070 37756 -33994 -63041 -36723 20636 66669 34569 -28846 -60011
442f0011K1796O6780L3725k2885n6918m7246L0698O1958L1024j4335o6643m1267
$$ -60011 -38215 28565 62290 39405 -17513 -64759 -34061 27897 58921 44586 -22057 -63324
454f3324K3528N7382M5962k5833n9801l5589P842O7765M6280k3417n3164m7578
$$ -63324 -39796 17586 63548 37715 -22086 -57675 -49833 17932 64212 40795 -12369 -59947
466e9947J5955O0770M1777n529o6142m6246J9782M5712N1399o828o2518m2572
$$ -59947 -43992 16778 58555 53026 -13116 -59362 -39580 6132 57531 50703 -11815 -54387
478e4387L989N9037M7322j3003m3375n4042M332O2636L7257j363m9217n1312Q040
$$ -54387 -50398 8639 55961 42958 -417 -54459 -50127 12509 49766 48403 -814 -52126 -44086
491d4086M4415N3051k899n9479l6518l628M6702N7126q924m6709m7504j566N4167
$$ -44086 329 53380 50481 -8998 -45516 -49144 -2442 54684 45760 -949 -48453 -50019 4148
504D148M0938P825m5450o0788P935M3574M5744J1443n2688m8630p572M3461N8620
$$ 4148 45086 52911 7461 -53327 -45392 -1818 43926 55369 2681 -45949 -53521 -10060 48560
517D8560k645l8935m7034j9540N1369N1337O377l5928n6218o229L6960M8722K0950
$$ 48560 45915 6980 -40054 -59594 -8225 43112 49489 13561 -42657 -48886 -11926 36796 57746
530E7746m8513m8428p815K7783N6316J3138l9024m7066j9630M2417M7137J0926
$$ 57746 9233 -39195 -47010 -19227 37089 50227 11203 -35863 -55493 -13076 34061 44987
542D4987k4979n7862j4095L9737M3103K0667l5162m9984j5183K6359N7957J5368
$$ 44987 20008 -37854 -51949 -12212 30891 51558 16396 -33588 -48771 -22412 35545 50913
554E0913l7742m2062k5185L1248N5437J6240k6321n3444k0321L1909M3817L0104
$$ 50913 13171 -28891 -54076 -22828 32609 48849 22528 -30916 -51237 -19328 24489 54593
566E4593k8245n6411j6927K1540M9870K6910k7882m5962l0263K4313N2870J9574
$$ 54593 26348 -30063 -46990 -25450 24420 51330 23448 -22514 -52777 -28464 24406 43980
578D3980j6669m7459l1100K6290M5380K7781j8623m8715k3004J4309M6938L1724
$$ 43980 27311 -20148 -51248 -24958 20422 48203 29580 -19135 -42139 -27830 19108 50832
590E0832k4500m3227k7586J3955M8113K6437j5810m5739l1599K1592M1348L0089
$$ 50832 26332 -16895 -44481 -30526 17587 44024 28214 -17525 -49124 -27532 13816 43905
602D3905j0614m9787k7695J5009M3354L3820j6069m2156l3139Q613M8923K9512
$$ 43905 33291 -16496 -44191 -29182 14172 47992 31923 -10233 -43372 -34759 14164 43676
614D3676j1517m1180l7140J1292M2720L3372n544m5356l1421P201L8290L8919
$$ 43676 32159 -9021 -46161 -34869 7851 41223 35679 -9677 -41098 -33897 4393 43312
626D3312p540m0891l2652J814M1076L4036m694l6755l8131M912L8309L2265M02
$$ 43312 35772 -5119 -37771 -35957 5119 39155 34461 -2294 -40425 -35513 2796 35061 35463
639C5463l8491l5143L959L4875L7439j950l7442l2891j639L6943L6781k455l4061
$$ 35463 -3028 -38171 -34212 663 38102 36152 -1290 -34181 -35820 1123 37904 35449 1388
652A388l7503j671L6449L4767L518l5082l8466q35L3045L8176N350l4569l6244
$$ 1388 -36115 -37786 -1337 33430 36948 1866 -36600 -37435 -4390 33786 39136 4567 -31677
665c1677n977L2449L8593N726l0462l8948q519L1466L6559Q488k9217l8682q073
$$ -31677 -37654 -5205 33388 39114 8652 -30296 -38815 -7349 29210 37698 8481 -30201 -38274
678c8274K7517L7987J0222k7748l5867j0818K6599L7931R981k5924l6441j1628
$$ -38274 -10757 27230 37452 9704 -26163 -36981 -10382 27549 37530 11606 -24835 -36463
690c6463K5921L5851J1015k4793l7213j1769K3964L6817J3170k4321l6409j3425
$$ -36463 -10542 25309 36324 11531 -25682 -37451 -13487 23330 36500 12179 -24230 -37655
702c7655K3813L8112J3415k2316l6818j5662K2467L6574J5824k0401l8221j7353
$$ -37655 -13842 24270 37685 15369 -21449 -37111 -14644 21930 37754 17353 -20868 -38221
714c8221J9906L6537J8531j9461l6795j7894J7440L7125J8978j6337l5085k0075
$$ -38221 -18315 18222 36753 17292 -19503 -37397 -19957 17168 36146 19809 -15276 -35351
726c5351J6073L5325J9491j4456l5312k0533J4250L3561K0326j3830l3731j9992
$$ -35351 -19278 16047 35538 21082 -14230 -34763 -20513 13048 33374 19544 -14187 -34179
738c4179J2314L4094K0917j2355l2914k1468J2703L3692K1068j1398l3111k2459
$$ -34179 -21865 12229 33146 20791 -12123 -33591 -20888 12804 33872 22474 -10637 -33096
750c3096J1146L2415K2438j0358l3254k3171R062L2930K4549q889l1825k4386
$$ -33096 -21950 10465 32903 22545 -10709 -33880 -24818 8112 32661 23772 -8053 -32439
762c2439P596L2505K4805o030l1551k5730N823L0287K5734m706l0787k5997L320
$$ -32439 -24843 7662 32467 26437 -5114 -30844 -25021 5266 31000 26294 -4493 -30490 -27170
775b7170K9442K6190l098k7908k6409K302K8880K5763j236k6893k6417J743K6608
$$ -27170 2272 28462 25364 -2544 -28953 -26651 2229 27992 26756 -137 -26554 -24811 1797
788A797K5804o22k7592k5521R8K5660K6775r04k6200k5818j199K6657K6490J623
$$ 1797 27601 26979 -613 -26134 -26036 -376 26399 25495 -705 -26523 -27722 -1065 25425 27048
802B7048k4729k8131j043K5000K7131M012k5576k8037l631K3173K8846L993k3537
$$ 27048 2319 -25812 -26855 -1855 25276 29288 3712 -24325 -27956 -4783 24063 28056 4519
815D519k7826o819K3486K8442N668k0308k9008o655K1540K7668Q891k1077k7773
$$ 4519 -23307 -30126 -6640 21802 27470 7162 -21846 -28501 -6961 20707 29598 8521 -19252
828a9252p230J7595K8420P937j9581k6408j0013J8824K7455P787j6191k8067r085
$$ -19252 -26482 -8887 19533 27470 7889 -18519 -28532 -9708 17747 25534 9343 -18724 -27809
841b7809J9210K5238J1366j7279k7754r064J5564K8259J0655j8372k5221j3028
$$ -27809 -8599 16639 28005 10726 -17028 -26092 -10528 17731 28386 10014 -15207 -28235
853b8235J5602K9129R758j4442k7557j3193J6169K5718J5381j3491k9342j1423
$$ -28235 -12633 16496 26254 11812 -15745 -28938 -12769 12949 28330 14839 -14503 -25926
865b5926J1897K6919J6246j4499k5726j5641J1198K7913J2318q861k5946j7970
$$ -25926 -14029 12890 29136 14637 -11089 -26730 -15532 12381 24699 15838 -10108 -28078
877b8078J2805K4170J5729q129k7046j3420Q164K4743J8015j1647k3197j5057
$$ -28078 -15273 8897 24626 16497 -10549 -23969 -15805 8938 26953 15306 -7891 -22948
889b2948N605K6593J5095q363k3711j8501R873K2998J6156m613k6889j5958P676
$$ -22948 -17343 9250 24345 15982 -7729 -26230 -16357 6641 22797 18184 -8705 -24663 -16987
902a6987K2440K0284p133k3840j7602L227K6696J7173n944k1000k2198M735K3663
$$ -16987 5453 25737 18604 -5236 -22838 -19611 7085 24258 18314 -2686 -24884 -20149 3514
915C514J8064j033k4577j9079L177J9740K3471l093k2810j7009j140K2402K0277
$$ 3514 21578 20545 -4032 -23111 -19934 -194 23277 20184 -2626 -19635 -20775 1627 21904
928B1904k109j8830k2230J491K1129J6446L227k1122k1539K494J7594K1460L43
$$ 21904 19795 965 -21265 -19774 1355 17801 21028 -94 -21633 -19139 -1545 19915 20258
941B0258k0789j6968l747K0658K1930k374j6086k1519l013K0737J9000L525j9567
$$ 20258 -531 -17499 -21246 -588 21342 18968 2882 -18637 -21650 -913 18087 21612 2045
954B045k2436K03J5224K2473N858k1092j8893m698J6323K3804K724j4586k2430
$$ 2045 -20391 -20188 -4964 17509 23367 2275 -16618 -21316 -4993 18811 21535 6949 -15481
967a5481p174J9278J8615O162j3703k4422m949J4274K0828Q398j6700j8992p096
$$ -15481 -22655 -3377 15238 21400 7697 -16725 -21674 -7400 13428 21826 5126 -13866 -20962
980b0962J2017K4554N045j3039j9107r405J4992J9333P485j1521k3441o025J2478
$$ -20962 -8945 15609 20654 7615 -11492 -20897 -5905 13428 20913 9392 -14049 -20074 -7596
993g596J8248J0807j4079k0823p663J0684K3137P527j1501j9156j2248J3621K1441
$$ -7596 10652 21459 7380 -13443 -21106 -10422 12715 20242 8741 -10415 -22663 -9042 12399
1006A2399P950q509k2416j0774J1162J9087J2929j1011k1397r713O843K1855J2553
$$ 12399 20349 11840 -10576 -21350 -10188 8899 21828 10817 -10580 -20293 -13450 8405 20958
1019B0958j0008j8584j3348Q707K0674J0886n282k0930j3102Q985J7423J3070
$$ 20958 10950 -7634 -20982 -12275 8399 19285 14003 -6927 -20029 -11044 6379 19449
1031A9449o685k0070j1553N448J9050J3088p129j7232j3431N523K0457J1687m992
$$ 19449 12764 -7306 -18859 -13411 5639 18727 11598 -5634 -19065 -13542 6915 18602 13610
1044A3610j8653j3589O394J7404J4215m655k0256j2523L745J7750J5535n173j7821
$$ 13610 -5043 -18632 -12238 5166 19381 14726 -5530 -18053 -14308 3442 18977 13804 -4017
1057d017j4990L220J9726J3647k163j7281j6416L771J6705J5429q26j8148j4953
$$ -4017 -19007 -15787 3939 17586 15423 -1858 -18274 -14503 2202 17631 16805 -1343 -16296
1070a6296P14J6198J6532k174j6047j4716r83J6941J5249l53j4755j6366R19J5354
$$ -16296 -15582 616 17148 14974 -1073 -15789 -16772 169 15418 15065 310 -16056 -15137 217
1084B17J5030J403j6037j5143k09J3980J5957K41j4666j5588j667J5045J5882
$$ 217 15247 16650 613 -14530 -14739 -759 15198 15439 773 -14815 -16482 -1437 14445
1097A4445J072j3952j6707j469J4874J5869K636j3853j6324k340J2827J7120L328
$$ 14445 15517 1565 -15142 -16611 -1737 14132 16768 2915 -13409 -15749 -2922 14198 17526
1110A7526j3891j6626m249J2696J7140L761j2291j6938m431J2498J5982N629j1513
$$ 17526 3635 -12991 -17240 -4544 12596 16357 4066 -12872 -17303 -4805 11177 16806 5293
1123E293j6426m957J0973J6685N360j1176j5884n858J0361J6043N156j0070j5622
$$ 5293 -11133 -16090 -5117 11568 16928 5752 -10132 -15990 -5629 10414 15570 5500 -10122
1136a0122o244J0179J5918O000r540j6036n766R468J6140O700r854j5902o852
$$ -10122 -16366 -6187 9731 15731 6191 -9845 -15611 -6143 9997 16697 6843 -9059 -15911
1149a5911R090J6260O902r038j6253q195Q996J6165P977p869j6461p840P640J6052
$$ -15911 -6821 9439 16341 7303 -8950 -17145 -8149 8016 15993 8124 -8337 -16177 -8537 7515
1163G515R355p562j5702q988O450J5860Q982o650j5322r906N997J5175R195n235
$$ 7515 16870 9308 -6394 -15382 -8932 6928 15910 9260 -6062 -15968 -9971 5204 14399 9164
1177I164j5040r324N645J4432R709m687j4512r416M652J4678R557m909j4572r941
$$ 9164 -5876 -15200 -9555 4877 14586 9899 -4613 -14029 -9377 5301 14858 9949 -4623 -14564
1191a4564M297J4459R880m238j4516j0559M243J4346J0829l578j4244j0585L086
$$ -14564 -10267 4192 14072 9834 -4682 -15241 -10998 3348 14177 10599 -3645 -14230 -11144
1204a1144J4739J1081l062j3950j1498K201J4145J1025k258j3421j1798J888J2951
$$ -11144 3595 14676 11614 -2336 -13834 -11633 2512 13537 11279 -2142 -13940 -12052 899
1217H99J1933r33j3230j1667R40J2697J2335o78j2176j1593l50J2505J1574m99
$$ 899 12832 11899 -1331 -12998 -12058 639 12974 12296 120 -11473 -11823 682 12256 11757
1231A1757j1587j2099O1J1502J1790J45j1603j1563l16J1374J2467M15j1429j1717
$$ 11757 170 -11929 -11868 -366 11424 11569 -34 -11597 -11913 -539 11928 12343 914 -10803
1245a0803r03J1674J1726J164j0938j2944j380J0747J2226K241j1282j2287k397
$$ -10803 -11706 -32 11694 12858 1920 -11024 -12404 -1657 10569 12810 1528 -10759 -13156
1258a3156R869J3638K471r669j2601l605J0426J2664L268q805j3413l463Q652
$$ -13156 -3287 10351 12822 3153 -9448 -13053 -2627 10037 13305 4500 -8913 -12376 -3724
1271c724J2357M072q990j2469l815P678J2898L920p950j1525n071Q404J2265L936
$$ -3724 8633 12705 3715 -8754 -12569 -4891 8007 11927 3977 -7548 -12619 -4215 8050 11986
1285A1986o789j2670m352P652J1659N292q292j2224m269O552J2361N078p446j1560
$$ 11986 5197 -7473 -11825 -4173 7486 12778 4486 -7738 -12007 -5455 6906 11984 4538 -7022
1299g022o194P632J2790N320n739j3145n937O751J1565O981o264j2584o418M685
$$ -7022 -13216 -5584 7206 12526 6787 -6358 -12295 -5544 6021 13002 6738 -5846 -12264 -7579
1313g579J2942P025o066j1374p510M824J2551O513l746j1812p345M799J0629P878
$$ -7579 5363 12388 6322 -5052 -12562 -7738 4813 11326 7580 -4232 -11577 -6778 3851 11729
1327A1729l746j1823o368K850J1043P711m724j0161p698L406J1881O344l065j0297
$$ 11729 7983 -3840 -10208 -7358 3685 11396 6672 -3489 -11187 -7781 4100 10444 7379 -2918
1341b918q431M192J0326Q327k608j2032p353K598J0549Q816l769j0067q537J389
$$ -2918 -11349 -7157 3169 11496 8888 -3144 -10497 -7899 2650 11466 7697 -2370 -10907 -9518
1355i518J1757P822j471r976j0078K494J0505Q589k81j0696q634Q97Q991J0188
$$ -9518 2239 10061 8590 -1386 -11464 -8970 1535 10124 9843 -853 -9487 -8590 401 10589
1369A0589j433r511q735q65R830R045n27q454r857O02R301Q025J735r648q934
$$ 10589 9156 -355 -9090 -9955 -125 8920 8393 -61 -9918 -9316 -15 8010 9745 97 -8837
1384h837P71P283J0120J05r167q623j321R471Q897k50p376j0304j035R282Q776
$$ -8837 -8066 -783 9337 9442 275 -8348 -9669 -198 8699 8449 1073 -9231 -10266 -984 7792
1399G792K040q316r952q78P469J0508J714q482q855l081P642J0300J607o972r829
$$ 7792 9832 1516 -8436 -9314 -1845 8663 10377 1895 -6960 -10041 -2399 7901 9508 2536 -7293
1414g293l039P511Q810L979o856j0469j931O040R749L753o964q726l748N848R821
$$ -7293 -10332 -2821 5989 9968 3112 -7357 -9288 -3248 6501 10254 3290 -5436 -9184 -3336 6485
1429F485K406n219r422m314O741Q666L625n514j0050k571N471R068M625o636q732
$$ 6485 8891 3672 -5750 -10064 -3323 5343 8968 3454 -6596 -9167 -3696 5372 9997 3361 -5371
1444e371l689M970J0300L542n214r174n266N503R217M310l939j0510m458M503
$$ -5371 -9060 -4090 6210 9752 4538 -4636 -9902 -4399 4818 9128 5189 -5321 -9779 -5276
1458e276R223N822m411r458m665L236R911N339m132q281o620L910Q901N050k658
$$ -5276 3947 9769 5358 -4100 -8765 -5529 4382 9721 5589 -2692 -9312 -5402 3499 8549 5891
1473E891r428n525L412P754O232k838q585n269K311Q915N892k947p995o026K535
$$ 5891 -3537 -9062 -5650 2104 8336 5498 -3087 -8356 -6045 2870 8762 5815 -2180 -8206 -5671
1488e671Q411N620k171q615o371K260Q333O393k107q510o204J892Q519O863k151
$$ -5671 2740 8360 6189 -2426 -8797 -6537 1796 8189 6082 -2428 -8632 -6740 1779 8642 6491
1503F491p787o688R70Q861O461q75p999p695J409P390O919j93q081o810p9P444
$$ 6491 -1296 -7984 -7014 1847 8308 7433 -566 -8261 -6852 538 7457 7264 -817 -7627 -7706 -262
1519b62P515n04o693p148j2P453O799N8o570p513j40O690P049M99p416o711k57
$$ -262 7253 6749 56 -7092 -7104 349 7148 7206 636 -6877 -7017 -327 6722 7221 -195 -6906 -7163
1536g163O509P458J21o863p018k12O634P228R25o375p745p59O440P372J343p073
$$ -7163 -654 6804 6925 62 -6956 -7168 -534 6694 7619 1244 -6501 -7260 -820 6552 7895 822
1552H22p530j398O049P909J624n871p671k042N841P937K208n416p768k528N415
$$ 822 -6708 -8106 -2057 5852 7476 1605 -6066 -8108 -2267 5670 7878 2462 -5306 -7834 -2419
1567b419P813K546n248p796k504M620P305K920m912p333k777M660P806K603m430
$$ -2419 5394 7940 2692 -5104 -7608 -2988 4317 7237 2325 -5008 -7785 -3125 4681 7284 2854
1582B854p165l152N019P048K884m272p683k920M210P352L211m704p323l330M023
$$ 2854 -4311 -7463 -2444 4604 7488 3216 -4467 -7387 -3177 4175 7386 2682 -4641 -7971 -3948
1597c948Q146L114l688p472l844M010P655L956l454p671m234L194P668M083l223
$$ -3948 4198 7312 3624 -3848 -7692 -3682 3973 7929 4475 -3196 -7430 -4236 3432 7515 4292
1612D292p330m487K542P572M125k490o715m531K582P198M386k299o891m286K019
$$ 4292 -3038 -7525 -4983 2589 6714 4224 -2491 -7022 -4440 2758 7144 4845 -2046 -6332 -4313
1627d313O696M832k531o802m562J830O910M550k057o841m983K554O564M868j506
$$ -4313 2383 7215 4684 -2118 -6680 -4850 2060 6610 4553 -2288 -7271 -4717 1847 6715 5209
1642E209p065m655K081O219N375j621o779n202J142O900N219j710o421n609J132
$$ 5209 -1856 -6511 -4430 1789 7164 5543 -1236 -6438 -5296 1604 6823 5113 -1308 -6917 -5785
1657e785O616N303k33o504n674O78O190N537q6n984n464j41N625N636j5n487o106
$$ -5785 831 6134 5901 -603 -6277 -5599 591 6128 6042 58 -5406 -5547 78 5714 5699 212 -5894
1674e894j87N909N303L01n384n582K03N438N359L71n099n748q58N553N850J80
$$ -5894 -6081 -172 5131 5432 48 -5534 -5331 107 5466 5837 738 -5010 -5868 -315 5535 5715
1690E715n330n903p09N526N776O17n044o059o64N240N958J226n083n990j249M811
$$ 5715 385 -5518 -6227 -701 5075 5692 648 -5411 -6075 -835 5123 6349 1266 -4724 -5973 -1162
1706a162O142J256m355o428j935M709N897J844m165o611j507M324N726K157l825
$$ -1162 4980 6236 1881 -4547 -6482 -1773 4124 5968 1803 -4808 -6315 -1991 3735 5892 2067
1721B067n859j912M002N629K253l739n908k270L909N842J716l889n789j920L583
$$ 2067 -3792 -5704 -1702 3927 6180 2441 -3467 -5737 -1828 4014 5730 1841 -3948 -5868 -2285
1736b285N690K442l802n905j929L309O433K254l661n762l012L786N908K537k911
$$ -2285 3405 5847 2045 -3860 -5789 -2480 3953 6207 2546 -3216 -6228 -2442 3466 6003 3092
1751C092o370l081L259N715L366k969o000l135K718N911L298k297n617l212K340
$$ 3092 -3278 -6359 -3100 2615 5981 3012 -2988 -6123 -3405 2506 5804 3507 -2110 -5322 -2982
1766b982N518L055j717n960l545K187N116L490j750n623l202J724N494L797k564
$$ -2982 2536 5591 3874 -2086 -5631 -3444 1672 5162 3412 -2211 -5413 -3689 1805 5602 3038
1781C038m760l614J827N543L441j823n120m001J815N057L698j211n702l758J474
$$ 3038 -1722 -5336 -3509 2034 5475 3652 -1468 -5469 -3654 1403 5101 3890 -1812 -5570 -4096
1796d096N055M562j630n295m092R26O065L998j023m985m592J065M859L981m6n078
$$ -4096 959 5521 3891 -1404 -5496 -4570 1495 5493 4470 -515 -5107 -4042 817 4798 4752 -326
1812c26m723L19M870M581o85m366m097j38M808M465n99l852m578L35M252M305
$$ -326 -5049 -4730 140 4721 4036 -330 -4427 -4565 243 4708 4109 257 -4321 -3986 266 4571
1828D571J25m838m132q4L912M595J79m572m037m29M459M630K4l897m816m05M579
$$ 4571 4696 -142 -4274 -4358 -446 4149 4328 -244 -4281 -4710 -251 4379 4403 506 -4310 -4715 -136
1845a36M307Q03m214m758o41L850M870J009m560m654q22L681N216N38l031m778
$$ -136 4171 4974 760 -3998 -4639 -789 4081 5090 530 -4124 -4946 -1265 3951 4489 1458 -3320
1861c320j492L774M342J628l104m731j420K972M447J826l449m671j584K920M755
$$ -3320 -4812 -1038 3304 4932 1828 -2903 -4323 -1351 3096 4922 1473 -3198 -4782 -1862 2893
1876B893J003k472m596j429L067M671J340k467m697j494K450M768J835k938m763
$$ 2893 3896 1424 -3172 -4601 -1534 3137 4477 2010 -2687 -4181 -1731 3037 4872 1934 -2829
1891b829j998K833M462J797k534m339k181K562M414K525k283m745k167K290M290
$$ -2829 -4827 -1994 2468 4265 1731 -2608 -4789 -2227 2187 4712 2429 -2316 -4483 -2193 2097
1906B097K918k442m447k396J435M627K559j747m595k754J627M473K742j427m433
$$ 2097 5015 2573 -1874 -4270 -2835 1792 4351 2604 -1991 -4745 -3118 1355 4097 2670 -1763
1921a763k535K040L780K779j353m431k233J054L925K973j622l829l036J109M685
$$ -1763 -4298 -2258 1522 4301 2948 -1483 -3716 -2662 1263 4236 2614 -1215 -4251 -3142 1543
1936A543K383j147m050l068J907L450L281j074m296k919P89M084L658j223m216
$$ 1543 3926 2779 -1271 -4339 -2432 1018 4299 3225 -1071 -3990 -3201 883 4541 3318 -898
1951h98l218M00M158L271m53l695l525N62L773L593K9m231l228k9L702L580q7
$$ -898 -4116 -3716 442 3713 3260 -435 -3960 -3398 375 3968 3997 -234 -3462 -3491 211 3791 3704
1968C704l737l368j96L718L192j70l152l616J65L253L377K99l231l396P4L140
$$ 3704 -33 -3401 -3597 121 3313 3143 -9 -3625 -3460 -207 3170 3469 238 -3158 -3084 56
1984E6L546j21l435l084o61L358L633k02k910l726m81L233L801M94l113l481p54
$$ 56 3602 3481 46 -3038 -3699 -341 3292 3090 180 -3546 -4027 -794 3007 3501 388 -3093 -3847
2001c847L100L953J034l187l879q14K687L755J235k828l868j399K867L541J146
$$ -3847 -747 3206 4240 1053 -2826 -3640 -953 2802 4037 1209 -2659 -4058 -1191 2350 3496
2016C496k296l873r89K072M039J448k610l231j456K212L801J179k345l574j773
$$ 3496 1200 -2673 -3662 -1590 2449 3897 1287 -1944 -3400 -1188 2613 3792 1447 -2127 -3900
2031c900K553L701Q99k036l750j171K207L778J313k132l410j759K123L884J447
$$ -3900 -1347 2354 3253 1217 -2533 -3704 -1497 2281 3594 1462 -1948 -3707 -1584 2300 3747
2046C747j591l837k085K290L373J703j584l916k129J983L436K222j448l554k209
$$ 3747 2156 -1681 -3766 -1476 1897 3600 2016 -1900 -4029 -2046 1390 3612 2164 -1390 -3599
2061c599J192L936K242j137l759k322J358L343K185j303l421k260R96L630J828
$$ -3599 -2407 1529 3771 2634 -1125 -3447 -2089 1254 3439 2136 -1285 -3545 -2549 1081 2909
2076B909o63l545k123J000L621K066j036l127k308J015L275K368j008l254k603
$$ 2909 2246 -1299 -3422 -2422 1199 3265 2229 -898 -3206 -2191 1084 3452 2444 -810 -3413
2091c413Q02L100K947j071l476k189N31L324K745l80l428k756O63L409K354j04
$$ -3413 -2611 489 3436 2365 -1111 -3300 -2769 555 3300 2920 -508 -3264 -2601 808 3162 3058
2107C058l198l038K69K912K815k0l202k576N7K814K954n45k389k450l47L145K397
$$ 3058 -140 -3178 -2909 3 2818 2798 -404 -2980 -2923 -109 2845 2300 -89 -2539 -2886 259 2656
2124B656M41k903k912K15K576K703r4k653k855K9K450L073j02k638k904M4K706
$$ 2656 3097 194 -2718 -2503 73 2776 2682 29 -2826 -2797 -347 2726 2624 -14 -2918 -2874 -168
2141a68K905J84k711k691p04K735L312K28k377l181q28K330L349N63k221l060
$$ -168 2737 2921 210 -2481 -3185 -450 2862 3090 713 -2468 -3296 -966 2383 2946 725 -2335
2157b335j164K651K938J072k111l122q15K108K816R78j848l160o47J338L162R72
$$ -2335 -3499 -848 2090 3162 1051 -2071 -2886 -778 2038 3016 1168 -1992 -2639 -1301 1861 2833
2173B833k158k609r07J916K742J168k032k750j117J748L112J247j965k846j397
$$ 2833 675 -1934 -2841 -925 1817 2985 953 -1797 -2914 -1166 1946 3193 1228 -1618 -3015
2188c015J374L671Q54j736k850j352J474L233J165j205l149j897J845L222J569
$$ -3015 -1641 2030 2884 1148 -1702 -3054 -1580 1653 2818 1613 -1536 -3433 -1588 1634 3203
2203C203j327l258j390J036K868J959j405k733j985J002L036J840j219k841j516
$$ 3203 1876 -1382 -2772 -1736 1132 3091 1686 -1047 -3032 -2030 1006 2846 1627 -1214 -2730
2218b730J168K464J965r19k982j512J101K437K015j073k731j847O41L050J217
$$ -2730 -1562 902 2867 1948 -1034 -2546 -1445 992 3007 1934 -797 -2644 -2003 1047 2264
2233B264p33k366j923Q42K730J841o07k931j849Q48K669K270p66k709k199N72
$$ 2264 1531 -835 -2758 -1916 814 2655 2048 -883 -2732 -1884 785 3055 2289 -420 -2619 -2047
2249b047K494K179n25k287k544K04K553K240R6k702k201L06K089K704k45k339
$$ -2047 447 2626 2101 -186 -2730 -2526 27 2267 2363 -339 -2540 -2234 -145 2559 2314 -25
2265b5k103p5K399J949j25k077k215K9K536J592K07k307j965J18K076K103K88
$$ -25 -2128 -2203 196 2145 2020 -57 -2272 -2243 293 1885 2092 -215 -2180 -2062 14 2117 2405
2282B405k557k038k41K520K530l67j891k470l15K175K424Rj687k781j82J992K470
$$ 2405 -152 -2190 -2431 89 2619 2252 361 -2109 -2424 -249 2175 2184 497 -2284 -2466 -474 1996
2299A996L01j815k229p60J772K812L83j623k403p54J836K101Q33j532k537r40
$$ 1996 2297 482 -1747 -2507 -735 2077 2460 837 -1566 -2320 -484 1617 2450 918 -1619 -2559
2315b559J589K392O13j136k343q62J773K247M84j449k034j084J724K308O95j529
$$ -2559 -970 1422 2035 899 -1444 -2306 -533 1714 2198 749 -1285 -2369 -645 1663 2358 829
2331H29k209j073J492K382O51j272k475n91J112K576J079j479k280j235J503K516
$$ 829 -1380 -2453 -961 1421 2072 800 -1675 -2266 -1154 1422 2501 1022 -1258 -2493 -990 1526
2347A526Q28j147k436j472J348K357J188r22k476j068Q59K332J272j044k030j147
$$ 1526 2354 1207 -1229 -2701 -1353 1004 2192 1270 -1206 -2274 -1415 917 2189 1145 -885 -2032
2363b032J049K188Q51o57k225j022M91K104J137n54k203j287P83K140J253q85
$$ -2032 -983 1205 2056 1399 -826 -1848 -1357 747 1884 1330 -873 -2160 -1377 763 2016 1131
2379A131j945j268P65K298J405r67j926j656Q25K009J708p90k356j308N95K092
$$ 1131 -814 -2082 -1317 981 2386 1419 -507 -2163 -1338 671 2379 1589 -767 -2075 -1480 612
2395F12J649q70j828j454Q0K393J474k18j948j941N54J755J585L64k528j563M4
$$ 612 2261 1391 -437 -1891 -1811 582 2056 1838 -110 -2051 -1497 258 1843 2207 -321 -1884 -1840
2412a840J635K136n05j366j797J11J811J516j6j832j610K64J646J529Q2j620j748
$$ -1840 -205 1931 1426 60 -1737 -1626 185 1701 1685 -147 -1757 -1493 153 1682 1764 144 -1604
2429a604j99J894J738k78j623j874j36J825J875j86j263k088L51J531J872K98
$$ -1604 -1803 91 1829 1551 -72 -1946 -2082 -257 1618 1432 169 -1919 -1568 -37 1835 2133
2445B133j761j753o45J692J772N40j683j902n00J768J693L48j165j821o65J441
$$ 2133 372 -1381 -2026 -334 1438 1978 295 -1607 -2107 -339 1354 1702 537 -1284 -1949 -508
2461e08K031K72j250j799l67J007J868P98j284k011p35J226J928N80j364j637
$$ -508 1523 1795 545 -1254 -1621 -614 1254 2052 768 -1243 -1978 -752 1176 1756 392 -1245
2477a245o99J321J752P71j042k084n31J444J663P84j479j632j006J184J780R96
$$ -1245 -1944 -623 1129 1900 858 -1226 -1757 -313 1350 2134 655 -977 -1983 -799 981 1977
2493A977j424j493j093J150J901Q13q41j886q76Q72J770J222q81j846j166R14
$$ 1977 553 -940 -2033 -883 1018 1831 990 -896 -1772 -900 870 2092 1211 -635 -1801 -887
2509h87J687P36n38j650j295R03J483J315n12k064o92M10J758R35l25j627j197
$$ -887 800 1536 998 -652 -1947 -1044 439 1754 1242 -822 -1514 -1104 654 1589 1264 -363 -1560
2526a560N92J745Q14n08j372j438N35J731J145l78j950j163O67J455J444k69j987
$$ -1560 -968 777 1591 1083 -289 -1727 -1192 539 1684 1306 -644 -1807 -1140 315 1759 1490 -497
2543d97j069M85J453J382j99j658j523J89J733J124lj533j519j0J487J766k41
$$ -497 -1566 -1081 372 1754 1555 -103 -1626 -1437 296 1420 1417 -116 -1635 -1645 -158 1608 1367
2560A367j188j630K09J368J594n03j107j614J84J587J114j38j275j542J71J253
$$ 1367 179 -1451 -1242 126 1720 1217 110 -1504 -1320 267 1381 1243 -32 -1574 -1403 -150
2576a50J336K82j603j188q0J302J502n4j212j688J74J404J235L32j425j693k15
$$ -150 1186 1468 -135 -1323 -1403 -101 1401 1347 135 -1553 -1379 25 1260 1592 167 -1526 -1741
2593a741J492J395N12j691j213k77J217J777Q7j194j317n25J070J454L32o05j876
$$ -1741 -249 1146 1658 -33 -1246 -1523 -306 1471 1558 364 -953 -1478 -408 1046 1378 773 -1103
2610a103o26J304J717J01r55j548l66R40J495L46r80j128q14J100J545M10q02
$$ -1103 -1729 -425 1292 1393 438 -1110 -1476 -536 959 1305 325 -803 -1617 -517 1028 1438 636
2627F36j784l51J004J225P46p81j578n44O70J648Q00j062j369r49J136J591M12
$$ 636 -1148 -1499 -495 730 1476 695 -883 -1427 -757 891 1691 629 -740 -1689 -553 1038 1450
2644A450l12j704j195J106J305R65q03j758o81N65J835M65n17j342j001J009J149
$$ 1450 1138 -566 -1761 -655 650 1615 812 -946 -1627 -1062 773 1238 721 -621 -1622 -613 536
2661E36P64m95j258r60P79J207P58l40j642n96M97J171J142o91j261j097O96J300
$$ 536 1300 805 -453 -1413 -634 573 1331 991 -651 -1247 -750 421 1563 872 -389 -1486 -790 510
2679E10N93k53j334r89P09J246J008m45j443j022K75J494J276o77j683n12nJ773
$$ 510 1103 850 -484 -1473 -764 482 1490 1045 -398 -1420 -1145 349 1625 948 -735 -1247 -1252 521
2697E21Q30n1j426j043r5J551J103J9j849p73kJ008J743l06j363r51M2J089Q52
$$ 521 1351 1300 -126 -1169 -1264 287 1390 1409 -440 -1213 -1215 -207 1536 1230 -133 -1084 -1042 47 899
2716H99K04r77j308J50R62J208L3j072j233J59P52J517j08j449p44n61J449J428
$$ 899 1103 126 -1182 -1032 -70 1138 1171 99 -1134 -975 -223 1294 1186 -263 -1007 -1568 -119 1309
2734A309m07o66j271l67J384P71O11j389j226K17P46J434J27j030j036n38R22
$$ 1309 902 236 -1035 -1402 -18 753 1364 -25 -1251 -1034 -288 1146 1273 243 -793 -1331 -409
2751d09J470M8j075r87l03R64J300J49n47j411L0M82J171N01j210p25p06P37J499
$$ -409 1061 1109 34 -953 -1256 -292 1008 1157 610 -801 -771 -289 882 1383 173 -552 -1258 -521 978
2770I78L8n21j344l60Q05J111L95p84r96n00P46J195N01j081p86n76O65J514J49
$$ 978 1016 495 -849 -1209 -404 707 1102 318 -678 -1178 -432 763 1264 183 -603 -1179 -514 1000 1149
2789A149p22r79r04J070R01N53m02j223o90P06J234M46k82j006j102P14J354N28
$$ 1149 427 -552 -1456 -386 515 1068 666 -557 -1247 -541 693 1139 857 -149 -1251 -537 817 1345
2807A345n49j309n34L58R81R54p61j129n46M51J092O98o57r72n19O44J035N29
$$ 1345 796 -513 -1047 -689 292 1246 485 -644 -1190 -739 353 1051 394 -578 -1097 -453 582 1111
2825A111l97q26j314O58J313M28j70j280p99O70Q17Q37l26j180o43L37Q95J261
$$ 1111 714 -112 -1426 -768 545 973 803 -477 -1276 -606 211 1048 722 -458 -1101 -764 131 1392
2843A392o86j074p82L06R28J033k12r56j215L69J063P65J74j162j037k5J390O92
$$ 1392 706 -368 -1150 -844 84 1117 905 -51 -1266 -897 166 931 1105 -57 -1094 -1119 271 963
2861I63k26o91j008J70J020O94k1p98r16r7R92M98J65q93j011J25P90J296k79
$$ 963 737 46 -962 -792 228 922 901 103 -813 -910 82 580 745 -148 -1159 -1034 -244 1052 773
2880G73p95r64K17J016O16R7p79j082NR97Q36K24j104j183J51P95R05Kk94j246
$$ 773 -22 -986 -769 247 863 960 181 -901 -896 101 937 1161 57 -1126 -975 -180 725 727 433 -813
2900h13j45P03J345j73p07r46j78Q97M89K46m83r90j36N52R44L18o43q46k72O27
$$ -813 -958 -255 1090 917 210 -736 -914 -17 472 718 235 -755 -891 -339 605 923 280 -566 -838 -211
2920b11J121K98p14j074m16R07P05M12p34j023o8N43J000Q6o59q21n63R09Q75
$$ -211 910 1208 494 -580 -996 -89 616 1028 294 -729 -797 -254 746 832 173 -648 -1211 -302 573
2939E73J99l94r23m77O08J162K70o44j026m09N21J115M69m57q77n08K73Q71M19
$$ 573 772 378 -545 -1022 -414 748 1018 374 -652 -1061 -540 575 1044 587 -290 -798 -525 346 765
2958G65k05q72n80O58M83P82n14p74o41N13N78N54j34j015l60K32P53P12q91k92
$$ 765 560 -312 -892 -234 249 1031 517 -257 -898 -385 193 747 613 -402 -762 -530 223 935 44 -248
2978b48p15K73J368L31n22p72m30Q3J025M95j25j328k00K47Q03M97p4p05q88L39
$$ -248 -963 -690 678 1009 487 -285 -715 -632 393 888 763 -565 -765 -518 285 782 708 3 -885 -546
2998e46O00Q65j05r07n92J02N91P75k21p53o86J48P86N93J75j021p32L13O31Q40
$$ -546 54 919 814 -93 -685 -583 8 783 562 -191 -877 -729 57 650 825 -196 -928 -615 16 856
3018H56p5q30q28K72O84P53j10p41o77k38Q63P61j55n58r31k0R96O68R5p05q43
$$ 856 781 -49 -877 -605 79 832 722 -19 -696 -934 -71 690 535 -23 -954 -974 22 690 785 80 -763
3039g63K81N05O76J84o32j011K15N08P67J62q08o45k61N24N79L53l83r77O8N01
$$ -763 -482 23 699 883 251 -760 -545 -37 730 892 84 -561 -822 -298 281 634 251 -726 -658 -157
3059a57P14L14p89p14j03P12O10J48n30p77l1L72N83J96m38o56q4N29O07M86r25
$$ -157 557 871 82 -632 -735 -23 587 735 205 -572 -603 -231 352 548 110 -546 -630 -101 506 992 67
3080F7n56j50L93J044Pn67o02m13M96R03O5k08q13n01N23P21K87n64o66m4R3R89
$$ 67 -489 -639 -246 798 805 238 -364 -777 -281 622 687 479 -334 -835 -312 409 696 132 -534 -578 -485 504
3102E04N18n31r15j46K27M70N76j60j090j24J42Q93J96l06o97l88N05O80N14o56
$$ 504 1022 491 -424 -570 -343 127 703 543 -547 -671 -529 364 560 254 -443 -831 -326 354 868 212
3122B12k95p53K77J080J80l24p67j78j0P14L05j52n98m62M04N01P63j02j135l97
$$ 212 -83 -836 -559 521 701 377 -390 -568 -578 136 441 289 -309 -771 -367 134 897 795 -340 -737
3142g37K98P93O9K17o28o98L4N64P32k34m02o84J43O69M64m83j27l50l05P57N18
$$ -737 -439 354 423 640 12 -686 -652 -88 644 410 8 -676 -533 136 600 117 -10 -360 -665 92 610
3163F10K34q50o00j52P32O23J43q67k37k04M62N93K7n59n01m0M80P56J1m49q28
$$ 610 844 -6 -606 -758 -26 597 740 -127 -364 -568 -106 487 514 -45 -546 -586 -106 650 661 212 -616
3184f16K53M34L32K59o55o09J08L03Q29J37p98k56n85Q31O57j25m04n35k27N91
$$ -616 -363 71 403 662 7 -602 -494 -191 638 775 -23 -279 -864 -33 624 499 95 -440 -667 -76
3204g6M75K65o08k65k70K72N37L74o54m68k36L09O72J17k02p00Q6J86P53J37l03
$$ -76 399 664 56 -209 -479 -207 330 704 50 -418 -654 -345 327 444 242 -458 -372 -186 567 704 401
3225D01q32QJ47N86L08n74n01m49O89P86K41p18n59k20N89M62J96k24o33k54J83
$$ 401 -431 -423 -276 310 618 44 -457 -906 -217 569 810 92 -467 -687 -98 364 560 336 -297 -551 -368
3246c68P70L13k31o91n41N50N55J76l22l83l77K4P38L99l53m33l45L63M56K95
$$ -368 402 715 484 -207 -748 -198 357 533 211 -172 -549 -525 213 612 259 -174 -519 -156 300 595
3266E95k46p13j57J20M79O71k37o13o53L17Q31L15l58o91j02J32L35M95r2q09
$$ 595 349 -364 -521 -401 78 749 512 -101 -754 -437 394 709 351 -340 -442 -310 25 520 428 -381
3286c81k08n5P90N14q4o45n26P1O50O7M59p02m51J19K27P86k61n39l10j6N50N56
$$ -381 -589 -644 146 660 576 -69 -595 -524 126 193 652 -50 -501 -382 -155 631 370 -169 -479 -495 55 611
3308F11r3l42q74J91N22J05K55m12l46j18O88K22j31k04n59N4L30O69q3m75l90
$$ 611 518 176 -698 -507 15 120 375 -37 -383 -501 187 409 278 74 -485 -431 -101 568 485 10 -380
3329c80j50N54P01j43n55p40J67M94M82R4l94m37k8J90O21k66p3p38k42N73P39
$$ -380 -530 24 725 582 27 -713 -546 -52 430 524 130 -307 -335 -145 476 210 137 -601 -843 -270 469
3350D69L0l61n03j80M30J99N24n63m04k8K26O22K62o68l53j84L64O87j19j35q41
$$ 469 499 138 -365 -545 -115 84 608 45 -359 -387 -161 461 723 55 -298 -482 -118 569 450 315 -526
3371e26L4L08N14P8k83o45K26p2O35K59l24n66j14K13Q23j9l22o78m4N04L55%
$$ -526 -492 -184 330 408 125 -520 -294 -366 269 528 204 -362 -476 -263 560 541 219 -459 -503 1 356 356
3393C56k69j82l88K96N05M52n98m65l94O62J1K51K24o05n03J45N49K68r0n67n0
$$ 356 87 -95 -483 -187 318 770 172 -293 -687 -25 -14 237 461 -144 -647 -502 47 315 225 -342 -392
3414c92L30K88M48k93n89o60Q26N78Q4k08n38k37j66P37K53K1q80n6r2N91L06
$$ -392 -62 226 674 381 -208 -868 -42 536 620 412 -126 -363 -529 208 461 482 -398 -454 -546 45 351
3435C51j78m60l07K64O46N68m03n77l74J62M46L31j11m72l16N2L34L25n1k56n12
$$ 351 173 -287 -594 -330 316 884 481 -96 -470 -308 138 469 358 -114 -430 -378 -44 281 230 -26 -538
3456e38J62L05M15l28j49j07k7M41L5P8k48l18K6L26K97j63k05k43j08L10M31
$$ -538 -376 -71 344 16 -133 -240 -267 174 209 287 39 -279 -253 73 370 207 2 -241 -349 -39 392
3477C92n7k30l42k50O73J98j2j99n31j3M65J31K72n68n9l82K95M72K6m00m10K18
$$ 392 335 105 -237 -487 186 384 372 173 -358 -371 94 225 497 -71 -130 -512 -217 255 281 -119 -529 -311
3499c11J37O19L7k01n89K2J96K88J37k64l77m7R9L44q7pl88J73J94N64j21n23
$$ -311 -174 445 482 281 -308 -286 -90 198 335 71 -306 -353 -254 90 3 -4 -392 -219 -25 539 418 -105
3521a05n5J09J63M1L31n46k33k15M63J75L17l51m39m23N19N85J00k48m63l88N33
$$ -105 -160 -51 112 153 484 -62 -295 -510 -47 128 445 94 -345 -768 -249 336 436 188 -275 -663 -130
3542a30K35L20l13n56J76l1J68O05j79m12j59J62L48L18l89l25l72M09K19M87
$$ -130 105 425 112 -444 -268 -299 -131 474 295 -117 -276 -114 234 552 163 -162 -534 -125 94 581
3562E81n19l25J82k94M55J72j78j89k74J41K99O2q1l36k55L30J13N73l8o87jO
$$ 581 62 -263 -81 -375 80 252 74 -115 -389 -248 51 113 32 -304 -559 -229 -116 457 419 -268 -269 -263
3584b63Q77l01r4n42Q9m2N27R5n5l84k01l9M61K85k37r5l52O1L23J52K0n08m4
$$ -263 614 313 219 -323 -234 -276 251 346 291 -93 -294 -333 128 413 176 81 -271 -210 113 265 285 -223 -267
3607b67nK82K14J2k56n42L07K98R5o3l58n3k28L85O01k15j61l95J3N29J61J94
$$ -267 -272 10 224 236 -20 -562 -255 43 138 75 -283 -336 -564 -179 422 207 46 -349 -336 193 354 548
3629E48o36n77N13M2N97l66j32l52J83J77N03j02l96l54M5M62J46l19L32m01j98
$$ 548 -88 -665 -152 -110 487 121 -11 -363 -180 -3 500 398 2 -352 -307 155 301 -18 314 -87 -285
3650b85L12J46O0j57l25o3j79M82J54j40k27P0K88J10q0k55K90k21n4K97J6o1
$$ -285 27 173 233 76 -249 -312 -491 -9 145 5 -222 -152 136 246 166 -89 201 -20 -74 223 239 178
3672A78n86qJ72M96K27o03P6m19N08K65j22K21o12O1j32M78J64j09j60l60N8M10
$$ 178 -408 -416 -244 252 479 -124 -48 -467 41 306 184 405 -207 -146 -278 200 364 255 95 -265 -207 203
3694B03K27n17l77K74mM03J76l29o2k35Q3K19K36l70J3l13L18N8L85n6l80nNL13
$$ 203 430 -87 -464 -190 -194 209 385 56 -6 -241 -158 61 297 -73 -60 -373 -55 3 388 332 -48 -53 -48 265
3718B65J76l03k90j17J86L70q7j26k08J32k62M54J4m4k59l22J28K63M42l99k7
$$ 265 441 138 -152 -269 -83 287 200 74 -134 -2 -264 190 204 160 -99 -421 -293 -30 412 13 -14
3739a4l36K01K63M43o97j28K09l87M00M06k20r3l56nN01M8k95n6n01J92M48L44
$$ -14 -350 -149 114 557 -140 -268 -59 -446 -46 360 140 47 -309 -314 187 235 -60 -116 -617 -425 23 367
3761C67j31j69l30J35J44L41K1m58K0j65K54J32K43n29l04j03M21K65J0l25j22
$$ 367 236 67 -263 -128 16 357 378 -80 -60 -225 29 161 404 -125 -429 -532 -111 154 164 -161 -283
3782b83L49k4L84k13m7l23pK23J87R2l67l12j16K85J57L22o7n34L7M44l6j13L7
$$ -283 66 42 426 213 166 -157 -164 59 246 338 -29 -341 -457 -172 -15 307 240 -294 -257 187 151 38 75
3805G5k23r7K08M11l5m23n1j36K31K15K5j99j51k24K49M93j63j86j15l5L4L87
$$ 75 -148 -245 -37 374 339 -84 -135 -271 -40 175 200 1 -150 -374 -125 368 205 19 -96 -131 -97 290
3827B90M7l93Ok78N10m0j45J3k45q8L21K35K36j93l93n9K0N22l93J6j11j55K70
$$ 290 337 -56 -50 -328 182 142 -3 10 -235 -323 -2 233 469 276 -117 -176 -156 366 -27 -11 -122 -277 -7
3850gK3J52J60n09l63L63J29K01J73n26n0J60M73l19J66k92m2r1J52J7J52k7k76
$$ -7 16 168 328 -181 -544 -181 -52 149 322 -204 -254 -94 379 60 226 -66 -108 -199 -47 -30 122 95 -181
3873a81K00O4p3J0Jk15J57L29P6k47j81K28n30M07L27l29j53l84M85J76o7r1l65
$$ -181 19 83 10 20 21 -194 -37 292 368 121 -60 168 -362 45 372 43 -110 -494 -9 167 100 9 -356
3896c56K2K18J49M62j83l83l06J61L02Q5Lk01n1o8O0M45j69j02n4j24K33K8K7
$$ -356 -334 -116 33 495 312 -71 -377 -216 86 171 174 -27 -78 -146 -86 359 190 88 34 -90 143 171 198
3919A98k72O7j19O7K52n1k14k21P9L54M6M0m27k4L37o3p5n4Q2k3k35M84l06L40
$$ 198 -74 -7 -126 -59 193 142 -72 -293 -214 140 186 226 -201 -225 112 49 -26 -80 2 -21 -256 228 -78 262
3943B62j92K01l24oJ72L15m48k35j78N35l7K57j13l14N0K71j11r1K23n20k8N51
$$ 262 70 271 -53 -59 113 428 -20 -255 -433 102 65 322 209 -105 -55 216 105 14 237 -283 -311 240
3965B40k00M0k74p6K25m0M49k85k61J09j51J36L55R9l52J35m49J21M35n4r3k92
$$ 240 40 80 -194 -270 -45 -85 364 79 -182 -73 -224 -88 267 366 14 149 -300 -179 256 202 109 -183
3987a83K32j38M5K85k6m60M9K25J27Rj72j49j91K25J07K02j53rj99L05J9J55j79
$$ -183 49 -89 -44 241 215 -245 -196 29 156 165 -7 -156 -347 -122 -15 187 34 25 -174 131 150 305 126
4010A26k6l61K59J35j81J52l90J69p8J60K82k57k13J91j28K43M53l58j95j44J62
$$ 126 100 -261 -2 133 -48 104 -286 -117 -195 -35 247 -10 -223 -32 -160 83 536 178 -17 -161 1
4031AM6J63j03l8j09oJ24J31l27m1J47o8J83n3J36j92j20LJ24L21k39j91j34P4
$$ 1 47 210 107 69 -40 -46 78 209 -118 -159 -12 -80 103 50 186 -6 -126 -123 1 322 83 -108 -242 -168
4055a68M73j61J37m30K8r7K32J30k2k68K2J52j29N01k29j28j89k05K70Q4R2j66
$$ -168 305 144 281 -149 -121 -218 14 144 122 -146 -124 28 -101 400 171 43 -146 -351 -81 3 95 -71
4077g1j25n6K24L60j98m2k46P8J11J3J84j26p8m28M07r4J63r9l31K16o7L09R8
$$ -71 -196 -252 -28 332 134 92 -154 -76 35 48 232 106 28 -400 7 -87 76 -23 -354 -138 -205 104 202
4100B02k13J63l11L60J51m65L54m71k04M51J49J6o0l43M31k03J34j62j9q2mK41
$$ 202 -11 152 -159 201 352 -113 241 -230 -434 17 166 182 122 -221 210 7 141 -21 -40 -122 -126 115
4122A15Jj97K56k44jJ94j31J96N5l55J29O0j67J85k23J43k50K07K87J73l39j9
$$ 115 116 -81 175 -69 -70 124 -7 189 244 -111 18 78 -89 96 -127 16 -234 -27 260 433 94 75
4144G5k25n5K56K42k61j61M6MK44m6k89J6K06j01K41J37m48K1J2j8M22p4k60j04
$$ 75 -150 -205 51 293 32 -129 -83 -79 165 119 -170 -154 52 -49 192 329 -119 -98 -86 -104 318 244 -16 -120
4168a20j43K86N7J21j5m39rK60J65o5j51j07j12K21j8J62R8m44J31J89M1K22k14
$$ -120 -263 23 80 201 186 -253 -262 -2 163 98 -53 -160 -272 -51 -69 93 191 -253 -122 67 108 330 116
4191A16j14k31K30K8K30l3k77j77K99l83L79l3j50L2j28K82O6n6j47k97M58J08
$$ 116 2 -229 1 29 259 226 -51 -228 71 -312 67 34 -116 -84 -212 70 136 80 -67 -364 94 202
4213B02J51k45j76lN2j05N1K21j40j44J55O4L2Q6k32k34k9J89K96J08l10k34J22
$$ 202 353 108 -68 -71 -19 -124 -73 148 8 -136 19 83 115 201 -31 -265 -294 -105 191 299 -11 -245 -123
4236a23O8J18J82j96k55K07J34j17j5J41l28J31qK29j15q5j03j59J17M31j55j29
$$ -123 -55 63 245 49 -206 1 135 18 3 144 -184 -53 -61 168 53 -32 -135 -294 -177 254 99 -30
4258c0j18J57QJ37k7j71k21J30K08n2K22l07L9j04J92J17j1j66j45L20k80J38
$$ -30 -148 9 17 154 127 -44 -265 -135 73 21 243 -64 -25 -129 63 180 169 3 -142 178 -102 36
4280C6N7l8k3r2q8J8L76Rk00j91j46K46J86p9j93J86j36o2L02j49j19N2RqL44
$$ 36 93 55 32 -60 -148 -130 246 255 55 -136 -282 -36 150 71 -122 64 -72 -134 168 19 -100 -48 -39 -47 297
4305B97k12k44K19l52K44Kk6J58q0k25K66K17j82k23j21K36J23L9k00L7j27K3
$$ 297 85 -159 60 -292 -48 -46 -72 86 6 -219 47 264 82 -141 -262 -26 97 136 -64 -27 -154 -131
4327a31L05j44L9N1k73J43k5j6K98n56J45j8L05Q8j07k95J23j16M59j31J8L6m89
$$ -131 174 30 69 120 -153 -10 -35 -51 247 -309 -164 -182 123 211 104 -191 -68 -184 275 144 162 198 -291
4350b91M91k14J10%j83o3L8J84J83l07K59n25J22K30j60J74j72O4r2L83k3j71
$$ -291 200 -14 96 96 -87 -150 -112 72 255 -52 207 -318 -196 34 -126 48 -124 -60 -152 231 208 37
4372C7n1J1j14K03j09n6j8o5J98j18J78K13m45J34J14k45K93r4j4o4p5K62O1J40
$$ 37 -14 -3 -117 86 -23 -79 -97 -162 36 -82 96 309 -136 -2 112 -133 160 66 52 -12 -87 175 236 376
4396C76k79j23j46J62L08j97j95L2j59K28k9J28J17k58j99L97l54K50m7j05J72
$$ 376 97 -26 -172 -10 298 101 -94 -62 -221 7 -22 106 223 -35 -234 163 -191 59 12 -93 79
4417G9K8L9Q6k09j78k7L7M34j75j04Q4l15J67J78j31J04k60L04j16J41j6q5o4
$$ 79 107 146 232 23 -155 -182 -145 289 114 10 94 -221 -54 124 -7 97 -163 141 25 166 150 65 1
4440Al4j16L28q2j16N2j52l5L24j81mj57j56L69k52J21J39j78R9J31M0J01k16
$$ 1 -33 -149 179 97 -19 33 -119 -154 170 -11 -15 -172 -328 41 -211 -90 49 -129 -30 101 141 242 26
4463B6J20l52L26K08l98N6k3Nqq1J99O2P4j30L5k75mK24M8k24Q5qm3j0j05m1K34
$$ 26 146 -206 120 328 -70 -14 -37 -32 -40 -121 78 140 214 84 119 -156 -160 64 112 -112 -27 -35 -78 -88 -193 -234 0
4490@p3K95q1l94Q4J62J6q6J86J08k64k87N19J10p0l26J04K4J48k04J16l5j34
$$ 0 -73 222 141 -253 -169 -7 9 -77 109 217 -47 -334 185 295 225 -101 3 27 175 -29 87 52 -82
4513h2K15J6p9p9k0O3j47nJ75k26O1n1K31j20J90j3J12k51j5K09r3j54j02N9k7
$$ -82 133 149 70 -9 -29 34 -113 -118 57 -169 -108 -159 72 -48 142 129 241 -10 -25 184 91 -63 -165 -106 -133
4538a33L15j38K1r6j29j8J35M9j0j55K26Jj17J59p0p9l8J17J30k87J74O3k04J51
$$ -133 182 44 65 -31 -160 -178 -43 6 -4 -159 67 68 -49 110 40 -39 -77 40 170 -117 57 120 -84 67
4562F7j66J61J4M0j44l86L12L03j55j24n5J23n3J00L9K9n34K69J81L15j46q4m8
$$ 67 -99 62 76 116 -28 -414 -102 201 46 -78 -133 -10 -63 37 76 105 -429 -160 21 336 190 106 58
4585E8Q3k57L51l04J27j75N7J40j54p2N9J55r2k9J31r7P5q0k01J61K11j30J44
$$ 58 141 -116 235 -69 58 -117 -60 80 -74 -146 -87 68 -24 -53 78 -19 56 -24 -225 -64 147 17 161
4608A61j97j23J18J37k02L6j02J00m2Q6L23m33J51j40J34J30Kk88Q7J52j67K2
$$ 161 -36 -159 -41 96 -106 -70 -172 -72 -114 -28 295 -138 13 -127 7 137 139 -149 -62 90 -77 -55
4630e5J62j64K3J89l4K24k18m4j5J04k78K17q3j9O7l02K42O3j62j75K79k6K7K
$$ -55 107 -57 -34 155 121 345 127 83 68 172 -106 111 28 9 76 -226 16 79 -83 -258 21 -5 22 24
4654B4o9L4k54j7J75jJ02J94l40J5J27j13L43l35Mj34K56J45j97Kj03J02j6o2
$$ 24 -45 -11 -265 -282 -107 -108 -6 188 -152 -137 -10 -123 220 -115 -111 -245 11 156 -41 -39 -142 -40 -56 -118
4678a18R9OR7j06J01L6n2r6K67k96k56K09J51k41L09j40j66N8J68J19j02j10J56
$$ -118 -19 -13 84 -22 79 115 63 -33 234 -62 -318 -109 42 -199 110 -30 -196 -138 30 149 47 -63 93
4701I3k0J01n8j83J26o1J09R4l09l2K7N5J45J13n2k11P3J84j54k09K60j06j33
$$ 93 73 174 116 -67 59 -2 107 201 -108 -140 -113 -58 87 200 148 -63 10 194 40 -169 91 -15 -148
4724a48K44k18J48K8p9K7m7J7J95p7l40NK59k10J12N08m41J05k75L03m2J69l70
$$ -148 96 -122 26 54 -25 2 -45 -28 167 90 -250 -245 14 -196 -84 424 -17 88 -187 116 74 243 -127
4747a27Q7J9K23q6j52j32R2P7j5j48K41j61J54%j2O0l1N8l82L64k00K9OO0j06
$$ -127 -40 -21 202 116 -36 -168 -76 1 -14 -162 79 -82 72 72 60 120 89 147 -235 129 -71 -42 -36 24 -82
4772h2R3Q4m26L53o1J52j86J07pL7k65P2n6L27n8j40J9rL0K19j81l6J2q2J7J02
$$ -82 11 95 -331 22 -39 113 -73 34 27 64 -201 -129 -185 142 84 -56 -37 -46 -16 203 22 -14 -2 -84 -67 35
4798C5P4K15l30K88j75j5j62K4j0PJ72l03L77k57R6o1j81K13J24n8n7K4l6k0o7
$$ 35 109 324 -6 282 107 92 -70 -46 -56 -49 123 -180 197 -60 36 -25 -206 7 131 73 16 40 4 -16 -83
4823h3R7J27j82N6J57l00K40N7k50mK60l7l24K86j5k47J44J20M4j75r0k20L34
$$ -83 14 141 -41 15 172 -128 112 169 -81 -85 175 138 -186 100 85 -162 -18 102 146 -29 -119 -339 -5
4846ej43J47K50k75j00l6N6J13j37N2l07L00K72l36K12N5l03J18k9K66j61P5k09
$$ -5 -148 -1 249 -26 -126 -162 -106 7 -130 -78 -385 -85 187 -149 63 118 -185 -67 -96 170 9 84 -125
4869a25L03j04k00K45R4j56j60j5J33m8J13l7J7K04q5k84J62k42O8Q4M5j20J06
$$ -125 178 74 -126 119 213 57 -103 -118 15 -33 80 43 60 264 179 -105 57 -185 -117 -33 12 -108 -2
$$ [...]
8191a19
##END NTUPLES=NMR FID
##END=
