##TITLE=1H_PR191_rm
 D2O, 8 sc, 
 2.3.2020
##JCAMPDX= 6.0         $$ Bruker NMR JCAMP-DX V2.0
##DATA TYPE= NMR FID
##DATA CLASS= NTUPLES
##ORIGIN= UXNMR, Bruker Analytische Messtechnik GmbH
##OWNER= root
$$ XWIN-NMR		Version 3.5
$$ Mon Mar  2 14:23:42 2020 Russian Standard Time (UT+4h)  she@DPX200
##.OBSERVE FREQUENCY= 200.1315
##.OBSERVE NUCLEUS= ^1H
##.DELAY= (6, 6)
##.ACQUISITION MODE= SIMULTANEOUS
##.ACQUISITION SCHEME= undefined
##.AVERAGES= 8
##.DIGITISER RES= 18
##SPECTROMETER/DATA SYSTEM= spect
##.PULSE SEQUENCE= zg30
##.SOLVENT NAME= CDCl3
##.SHIFT REFERENCE= (INTERNAL, CDCl3, 0, 15.7039)
##AUDIT TRAIL= $$ (NUMBER, WHEN, WHO, WHERE, WHAT)
$$ ##TITLE= Audit trail, XWIN-NMR		Version 3.5
$$ ##JCAMPDX= 5.01
$$ ##ORIGIN= Bruker BioSpin GmbH
$$ ##OWNER= she
$$ F:/spectra/data/she/nmr/H-F/1/audita.txt
$$ ##AUDIT TRAIL=  $$ (NUMBER, WHEN, WHO, WHERE, WHAT)
(   1,<2020-03-02 14:22:19.60 +0400>,<she>,<DPX200>,
      <created by zg, POWCHK disabled, PULCHK disabled
       configuration hash MD5:
       00 E9 B6 7A A2 85 ED C7 34 08 36 98 17 FE 4E 26
       data hash MD5: 16K
       82 2B 4E 35 BB 60 68 BA C0 46 8A 47 69 F6 DC 5D>)
$$ ##END=
$$ 
$$ hash MD5
$$ 1B AE 5A B0 A4 3F CA B8 E2 3A 1D 07 50 16 32 78
##$RELAX= 
##$RELAX= 
##$RELAX= 
##$RELAX= 
##$RELAX= 
##$RELAX= 
$$ Bruker specific parameters
$$ --------------------------
##$DU= <F:/spectra>
##$EXPNO= 1
##$NAME= <H-F>
##$PROCNO= 1
##$TYPE= <nmr>
##$USER= <she>
##$AMP= (0..31)
100 100 100 100 100 100 100 100 100 100 100 100 100 100 100 100 100 100 
100 100 100 100 100 100 100 100 100 100 100 100 100 100 
##$AQSEQ= 0
##$AQ_mod= 1
##$AUNM= <au_zg>
##$AUTOPOS= <>
##$BF1= 200.13
##$BF2= 200.13
##$BF3= 200.13
##$BF4= 200.13
##$BF5= 200.13
##$BF6= 200.13
##$BF7= 200.13
##$BF8= 200.13
##$BYTORDA= 1
##$CFDGTYP= 0
##$CFRGTYP= 5
##$CHEMSTR= <none>
##$CNST= (0..31)
1 1 145 1 1 1 1 1 1 1 1 1 1 1 1 1 1 1 1 1 1 1 1 1 1 1 1 1 1 1 1 1 
##$CPDPRG= <>
##$CPDPRG1= <>
##$CPDPRG2= <>
##$CPDPRG3= <>
##$CPDPRG4= <mlev>
##$CPDPRG5= <mlev>
##$CPDPRG6= <mlev>
##$CPDPRG7= <mlev>
##$CPDPRG8= <mlev>
##$CPDPRGB= <>
##$CPDPRGT= <>
##$D= (0..31)
0 1.2 0 0 0 0 0 0 0 0.06 0 0.03 0 0 0 0 0.0002 0 0 0 0 0 0 0 0 0 0 0 0 
0 0 0 
##$DATE= 1583144538
##$DBL= (0..7)
120 120 120 120 120 120 120 120 
##$DBP= (0..7)
150 150 150 150 150 150 150 150 
##$DBP07= 0
##$DBPNAM0= <>
##$DBPNAM1= <>
##$DBPNAM2= <>
##$DBPNAM3= <>
##$DBPNAM4= <>
##$DBPNAM5= <>
##$DBPNAM6= <>
##$DBPNAM7= <>
##$DBPOAL= (0..7)
0.5 0.5 0.5 0.5 0.5 0.5 0.5 0.5 
##$DBPOFFS= (0..7)
0 0 0 0 0 0 0 0 
##$DE= 6
##$DECBNUC= <off>
##$DECIM= 24
##$DECNUC= <off>
##$DECSTAT= 4
##$DIGMOD= 1
##$DIGTYP= 9
##$DL= (0..7)
0 120 120 120 120 120 120 120 
##$DP= (0..7)
150 150 150 150 150 150 150 150 
##$DP07= 0
##$DPNAME0= <>
##$DPNAME1= <>
##$DPNAME2= <>
##$DPNAME3= <>
##$DPNAME4= <>
##$DPNAME5= <>
##$DPNAME6= <>
##$DPNAME7= <>
##$DPOAL= (0..7)
0.5 0.5 0.5 0.5 0.5 0.5 0.5 0.5 
##$DPOFFS= (0..7)
0 0 0 0 0 0 0 0 
##$DQDMODE= 0
##$DR= 18
##$DS= 0
##$DSLIST= <SSSSSSSSSSSSSSS>
$$ [...]
##$SUBNAM2= <"">
##$SUBNAM3= <"">
##$SUBNAM4= <"">
##$SUBNAM5= <"">
##$SUBNAM6= <"">
##$SUBNAM7= <"">
##$SUBNAM8= <"">
##$SUBNAM9= <"">
##$SW= 24.9337058887773
##$SWIBOX= (0..15)
0 0 2 0 0 0 0 0 0 0 0 0 0 0 0 0 
##$SW_h= 4990.01996007984
##$TD= 16384
##$TD0= 1
##$TE= 0
##$TE2= 300
##$TE3= 300
##$TEG= 300
##$TL= (0..7)
0 120 120 120 120 120 120 120 
##$TP= (0..7)
150 150 150 150 150 150 150 150 
##$TP07= 0
##$TPNAME0= <>
##$TPNAME1= <>
##$TPNAME2= <>
##$TPNAME3= <>
##$TPNAME4= <>
##$TPNAME5= <>
##$TPNAME6= <>
##$TPNAME7= <>
##$TPOAL= (0..7)
0.5 0.5 0.5 0.5 0.5 0.5 0.5 0.5 
##$TPOFFS= (0..7)
0 0 0 0 0 0 0 0 
##$TUNHIN= 0
##$TUNHOUT= 0
##$TUNXOUT= 0
##$USERA1= <user>
##$USERA2= <user>
##$USERA3= <user>
##$USERA4= <user>
##$USERA5= <user>
##$V9= 5
##$VALIST= <valist>
##$VCLIST= <CCCCCCCCCCCCCCC>
##$VD= 0
##$VDLIST= <DDDDDDDDDDDDDDD>
##$VPLIST= <PPPPPPPPPPPPPPP>
##$VTLIST= <TTTTTTTTTTTTTTT>
##$WBST= 1024
##$WBSW= 4
##$XGAIN= (0..3)
0 0 0 0 
##$XL= 0
##$YL= 0
##$YMAX_a= 517881
##$YMIN_a= -342071
##$ZGOPTNS= <>
##$ZL1= 120
##$ZL2= 120
##$ZL3= 120
##$ZL4= 120
##$ABSF1= 10
##$ABSF2= 0
##$ABSG= 5
##$ABSL= 3
##$ALPHA= 0
##$AQORDER= 0
##$ASSFAC= 0
##$ASSFACI= 0
##$ASSFACX= 0
##$ASSWID= 0
##$AUNMP= <proc_1d>
##$AZFE= 0.1
##$AZFW= 0.1
##$BCFW= 1
##$BC_mod= 2
##$BYTORDP= 1
##$COROFFS= 0
##$CY= 11.3945322036743
##$DATMOD= 1
##$DC= 2
##$DFILT= <>
##$DTYPP= 0
##$F1P= 16.9975609425685
##$F2P= -3.02152046262296
##$FCOR= 0.5
##$FTSIZE= 0
##$FT_mod= 4
##$GAMMA= 1
##$GB= 0.15
##$INTBC= 1
##$INTSCL= 1
##$ISEN= 128
##$LB= 0.24
##$LEV0= 0
##$LPBIN= 0
##$MAXI= 10000
##$MC2= 0
##$MEAN= 0
##$ME_mod= 0
##$MI= 1.114404
##$NCOEF= 0
##$NC_proc= 0
##$NLEV= 6
##$NOISF1= 3.799351
##$NOISF2= 2.8
##$NSP= 1
##$NTH_PI= 0
##$NZP= 0
##$OFFSET= 15.70392
##$PC= 1
##$PHC0= -9795.765
##$PHC1= 19.40082
##$PH_mod= 1
##$PKNL= yes
##$PPARMOD= 0
##$PSCAL= 0
##$PSIGN= 0
##$REVERSE= no
##$SF= 200.130013532006
##$SI= 16384
##$SIGF1= 3
##$SIGF2= 2
##$SINO= 400
##$SIOLD= 16384
##$SREGLST= <1H.CDCl3>
##$SSB= 0
##$STSI= 0
##$STSR= 0
##$SW_p= 3612.71676300578
##$SYMM= 0
##$S_DEV= 0
##$TDeff= 0
##$TDoff= 0
##$TI= <>
##$TILT= no
##$TM1= 0
##$TM2= 0
##$TOPLEV= 0
##$USERP1= <user>
##$USERP2= <user>
##$USERP3= <user>
##$USERP4= <user>
##$USERP5= <user>
##$WDW= 1
##$XDIM= 8192
##$YMAX_p= 0
##$YMIN_p= 0
$$ End of Bruker specific parameters
$$ ---------------------------------
##NTUPLES= NMR FID
##VAR_NAME=  TIME,          FID/REAL,        FID/IMAG
##SYMBOL=    X,             R,               I
##VAR_TYPE=  INDEPENDENT,   DEPENDENT,       DEPENDENT
##VAR_FORM=  AFFN,          ASDF,            ASDF
##VAR_DIM=   8192,          8192,            8192
##UNITS=     SECONDS,       ARBITRARY UNITS, ARBITRARY UNITS
##FACTOR=    0.0002004,     1,               1
##FIRST=     0,             0,               0
##LAST=      1.6414764,     0,               0
##MIN=       0,             -342071,         0
##MAX=       1.6414764,     517881,          0
$$ Real data points
##PAGE= N=1
##DATA TABLE= (X++(R..R)), XYDATA
$$ [...]
$$ plain form
2283 1484 3219 3500 2305 -454 -2998 -4227 -3630 -1812 729 2995 3545 2579 89 -2049 -3869 -3400
2299 -3400 -1494 1226 3471 4304 3251 1156 -1584 -3147 -3355 -1926 717 2668 3848 3079 1226 -1499
2315 -1499 -3613 -3733 -2876 -432 1841 3129 2823 1359 -1075 -3167 -3227 -2340 -445 1769 3512 3435 1750
2332 1750 -197 -2159 -2808 -2163 -301 1694 3247 2946 1889 -289 -2172 -3055 -2704 -828 1263 2323
2348 2323 2357 912 -780 -2542 -3317 -2353 -485 1305 2514 2963 2034 -232 -1789 -2761 -2039 -559 1545
2365 1545 3110 3130 1855 -59 -2158 -3168 -2584 -982 1425 2458 2655 1573 -391 -2486 -3306 -2914
2381 -2914 -1361 692 2537 2834 2183 434 -1504 -3158 -2662 -1345 987 2787 3641 3014 1288 -1276
2397 -1276 -3136 -2873 -1754 227 2300 3215 2551 1142 -1644 -2935 -3307 -2210 -466 1329 2910 2607
$$ packed form
2283A484J735K81j195k759k544j229N97J818K541K266N50r66k490k138j820M69
2299c400J906K720K245Q33j053k095k740j563k08J429K643J951J180p69j853k725
2315a499k114j20Q57K444K273J288l06j464k434k092o0Q87J895K214J743p7j685
2332A750j947j962o49O45J862J995J553l01j057k178j883q83L51J876K091J060
2348B323L4j445j692j762p75R64J868J790J209M49r29k266j557r72P22J480K104
2365A545J565K0j275j914k099j010N84J602K407J033J97j082j964k095q20L92
2381b914J553K053J845K97o51j749j938j654M96J317K332J800Q54o27j726k564
2397a276j860K63J119J981K073R15o64j409k786j291l72J097J744J795J581l03
$$ plain form
2413 2607 1176 -446 -2232 -3065 -1848 33 1860 3035 3067 1958 -135 -1842 -2668 -2163 -408 1419
2429 1419 2463 2723 1539 13 -2020 -2876 -2537 -1123 476 2085 2292 1081 -331 -1849 -2489 -1921
2445 -1921 -648 982 2311 2484 1505 88 -1406 -1861 -1839 -564 1088 2311 2272 1530 270 -1706 -2691
2462 -2691 -2260 -1183 597 2143 1881 1511 -228 -1659 -2551 -2129 -1140 351 1879 2921 2101 333 -695
2479 -695 -2191 -2329 -741 719 2328 3063 2138 988 -991 -2512 -2444 -1819 333 1759 2465 2271 571
2496 571 -1243 -2501 -2690 -1863 -569 1345 2527 2273 1025 -730 -1992 -2500 -2018 -252 1570 2749
2512 2749 2331 1654 86 -1682 -2428 -1950 -554 1245 1981 2009 1413 -367 -1955 -2540 -2213 -1317 551 1851
2530 1851 1636 1481 -259 -1186 -1997 -1796 -556 817 1953 2095 1709 507 -940 -1657 -1828 -376 784
$$ packed form
2413B607j431j622j786q33J217J881J827J175L2j109k093j707q26N05J755J827
2429A419J044K60j184j526k033q56L39J414J599J609K07j211j412j518o40N68
2445a921J273J630J329J73r79j417j494m55K2J275J652J223l9p42j260j976r85
2462b691M31J077J780J546k62l70j739j431q92M22R89J491J528J042q20j768j028
2479f95j496j38J588J460J609P35r25j150j979j521O8O25K152J426P06j94j700
2496E71j814j258j89Q27J294J914J182k54j248j755j262n08M82J766J822J179
2512B749m18o77j568j768p46M78J396J799P36K8n96j780j588n85L27Q96J868J300
2530A851k15j55j740r27q11K01J240J373J136J42l86j202j447p17j71J452J160
$$ plain form
2547 784 1783 2234 1509 457 -1353 -2194 -1968 -1176 76 1367 1711 1229 -40 -1621 -2195 -1903 -994 704
2565 704 1599 2352 1986 355 -841 -1867 -1701 -649 546 1650 2201 1815 486 -1190 -2174 -2421 -1520
2582 -1520 -312 1421 1907 1953 754 -1198 -1964 -2497 -1816 -349 1149 2200 2187 879 -31 -1504 -1815
2599 -1815 -1609 -109 1457 2253 2040 1507 -66 -1213 -2293 -1757 -800 352 1465 1746 1014 -148 -1093
2616 -1093 -2189 -2089 -822 444 1654 1898 1321 106 -910 -1380 -1213 -469 478 1553 2126 1191 462
2633 462 -1022 -1586 -1340 -657 128 1263 1920 1109 143 -1074 -1991 -1841 -917 180 1113 1684 681 73
2651 73 -767 -1639 -1453 -783 408 1145 2007 1515 416 -407 -1321 -1730 -784 386 1106 1669 1333 433 -936
2670 -936 -1675 -2059 -1375 115 1053 1414 1140 570 -891 -1659 -1875 -1332 -147 1123 1957 2032 1106 -144 -1485
$$ packed form
2547G84R99M51p25j052j810q41K26P92J252J291L44m82j269j581n74K92R09J698
2565G04Q95P53l66j631j196j026J66J052J195J104N51l86j329j676r84k47R01
2582a520J208J733M86M6j199j952p66n33O81J467J498J051j3j308r10j473l11
2599a815K06J500J566P96k13n33j573j147j080N36R57J152J113K81p32j162r45
2616a093j096J00J267J266J210K44n77j215j016m70J67P44R47J075N73r35p29
2633D62j484n64K46O83P85J135O57q11r66j217r17J50R24J097R33N71j003o08
2651G3q40q72J86O70J191P37Q62m92j099q23r14m09R46J170P20N63l36r00j369
2670i36p39l84O84J490R38L61k74n70j461p68k16N43J185J270Q34P5r26j250j341
$$ plain form
2689 -1485 -1432 -1206 -165 809 1552 1847 1129 -296 -1322 -1826 -1820 -705 734 1255 1589 1020 -135 -1263
2707 -1263 -1723 -1571 -826 313 1323 1702 1156 433 -610 -1433 -1215 -583 351 1036 1770 1421 323 -614
2725 -614 -1172 -1115 -713 333 821 1371 1061 170 -681 -1371 -1587 -838 -149 737 1241 1139 292 -633 -1069 -1381
2745 -1381 -521 362 1229 1404 1094 462 -415 -1322 -1296 -676 77 717 1367 1148 447 -468 -1244 -1432 -1088 -112
2765 -112 912 1406 1256 738 -398 -1001 -1408 -1073 0 1016 1676 1613 991 -127 -1060 -1469 -989 -144 965
2784 965 1223 1374 814 -224 -887 -1236 -1430 -832 495 1106 1287 872 -3 -816 -1507 -1210 -802 161 947
2803 947 1213 1516 304 -606 -1142 -805 -457 459 1200 1373 1278 329 -340 -850 -1351 -1175 -109 265 938 826
2823 826 196 -829 -1117 -952 -1071 16 642 1111 904 873 -355 -811 -853 -552 53 662 1110 809 521 -93
$$ packed form
2689a485N3K26J041R74P43K95p18j425j026n04OJ115J439N21L34n69j155j128
2707a263m60J52P45J139J010L79n46p23j043q23K18O32R34O85P34l49j098r37
2725f14n58N7M02J046M88N50l10q91q51o90k16P49O89Q86N04j02q47r25m36l12
2745a381Q60Q83Q67J75l10o32q77r07K6O20P53O40O50k19p01r15p76j88L44R76
2765a12J024M94j50n18j136o03m07L35J073J016O60o3o22j118r33m09M80Q45J109
2784I65K58J51n60j038o63l49j94N98J327O11J81m15q75q13o91K97M08R63P86
2803I47K66L03j212r10n36L37L48R16P41J73r5r49o69n10n01J76J066L74O73j12
2823H26o30j025k88J65j19J087O26M69k07l1j228m56m2L01O05O09M48l01k88o14
$$ plain form
2843 -93 -1018 -1103 -881 126 824 1033 824 105 -624 -1043 -1196 -767 -385 686 823 879 533 -69 -1030 -1232
2863 -1232 -359 -149 446 1371 1475 801 -182 -827 -1048 -806 -386 614 1026 1129 636 138 -1056 -1496 -1215
2882 -1215 -802 487 805 1132 733 0 -669 -1189 -1153 -577 338 876 1188 1190 456 -233 -1093 -818 -441 113
2902 113 747 1162 1176 158 -339 -925 -1069 -978 -175 642 1140 855 764 -574 -928 -1030 -669 -27 526 901
2922 901 585 570 -171 -630 -796 -662 -341 391 776 844 485 -141 -1090 -1079 -835 -324 250 459 586 -32 -314
2943 -314 -979 -1169 -315 119 610 1045 642 541 -180 -642 -829 -310 61 500 954 938 809 -236 -610 -884
2963 -884 -614 -296 152 887 979 445 -64 -771 -1154 -840 -353 287 508 879 737 116 -500 -980 -715 -229
2983 -229 393 758 1009 936 419 -347 -730 -666 -474 306 421 752 757 255 -468 -803 -1021 -770 -67 288 518
$$ packed form
2843i3r25q5K22J007O98K09k09p19p29m19j53M29L82J071J37N6l46o02r61k02
2863a232Q73K10N95R25J04o74r83o45k21K42M20J000M12J03m93m98j194m40K81
2882a215M13J289L18L27l99p33o69n20L6N76R15N38L12Kp34o89q60K75L77N54
2902A13O34M15J4j018m97n86j44R1Q03Q17M98k85r1j338l54j02L61O42N53L75
2922I01l16j5p41m59j66J34L21P32L85O8l59o26r49J1K44N11N74K09J27o18k82
2943c14o65j90Q54M34M91M35m03j01p21m62j87N19L71M39M54j6j29j045l74k74
2963h84K70L18M48P35R2n34n09p07l83L14M87O40K21L71j42o21o16m80K65M86
2983b29O22L65K51p3n17p66l83O4J92P80J15L31Nn02p23l35k18K51P03L55K30
$$ plain form
3004 518 1167 196 -151 -718 -901 -615 -84 388 804 990 435 -56 -356 -925 -367 -178 653 796 535 352
3024 352 -350 -578 -908 -498 -372 297 822 754 611 55 -460 -981 -395 -67 315 522 916 273 82 -403
3044 -403 -660 -711 -208 219 830 915 735 -392 -641 -623 -593 -189 440 528 800 354 -318 -539 -1001 -617 -92
3065 -92 232 846 764 718 285 -182 -680 -743 -139 214 676 774 808 371 -176 -839 -948 -395 30 760 938 515
3087 515 286 -183 -948 -668 -286 59 384 731 583 293 -26 -819 -721 -173 3 232 909 811 722 -11 -510
3108 -510 -1315 -426 -7 250 755 432 366 -432 -611 -581 -731 -223 220 687 457 221 -23 -243 -802 -98 -376
3129 -376 138 585 616 524 -187 -90 -71 -451 35 378 495 443 376 69 -438 -624 -504 -269 406 672 332 250
3151 250 -135 -342 -677 -411 -95 169 660 564 476 213 -345 -890 -561 -302 315 724 556 497 -23 -387 -586
$$ packed form
3004E18O49r71l47n67j83K86N31M72M16J86n55m91l00n69N58J89Q31J43k61j83
3024C52p02k28l30M10J26O69N25o8j43n56n15n21N86L28L82K07L94o43j91m85
3044d03k57n1N03M27O11Q5j80j127k49J8L0M04O29Q8K72m46o72k21m62L84N25
3065i2L24O14q2m6m33m67m98o3O04L53M62R8L4m37n47o63j09N53M25P30J78m23
3087E15k29m69p65K80L82L45L25L47j48k90l19p93R8N48J76K29O77r8q9p33m99
3108e10q05Q89M19K57N05l23o6p98j79L0j50N08M43M67k30k36k44k20n59P04k78
3129c76N14M47L1r2p11R7J9l80M86L43J17n2o7l07n07j86J20K35O75K66l40q2
3151B50l85k07l35K66L16K64M91r6q8k63n58n45L29K59O17M09j68n9n20l64j99
$$ plain form
3172 -586 -722 -342 -100 403 681 494 47 -501 -584 -1060 -404 -183 553 854 614 335 -336 -474 -701 -334
3192 -334 219 485 665 496 381 -90 -608 -862 -452 19 301 208 676 179 -225 -501 -874 -287 -103 445
3212 445 470 519 456 -198 -238 -730 -241 -27 251 397 538 210 -200 -507 -472 -376 -49 208 400 580 164 -121
3234 -121 -445 -823 -394 34 208 483 522 209 -120 -513 -589 -428 99 215 652 573 578 -41 -262 -467 -204 -340
3256 -340 32 425 666 258 35 -546 -669 -601 -526 290 524 479 243 174 -415 -513 -563 -145 17 190 712 474
3278 474 93 -247 -449 -812 -333 -7 59 760 591 293 -220 -535 -514 -285 -199 260 323 535 398 -117 -451
3299 -451 -723 -639 -85 475 647 606 467 135 -263 -421 -392 31 221 694 484 348 23 -252 -656 -595 -211
3320 -211 269 620 773 295 39 -694 -444 -318 -396 530 689 515 265 -99 -383 -583 -860 -42 618 505
$$ packed form
3172e86j36L80K42N03K78j87m47n48q3m76O56K21P36L01k40k79o71j38k27L67
3192c34N53K66J80j69j15m71n18k54M10M71K82r3M68m97m04k76l73N87J84N48
3212D45K5M9o3o54m0m92M89K14K78J46J41l28m10l07L5R6L27K57J92J80m16k85
3234a21l24l78M29M28J74K75L9l13l29l93p6J61N27J16M37p9No19k21k05K63j36
3256c40L72L93K41m08k23n81j23O8P5Q16K34m5k36o9n89r8n0M18J62J73N22k38
3278D74l81l40k02l63M79L26O6P01j69k98n13l15K1K29Q6M59O3K12j37n15l34
3299d51k72Q4N54N60J72m1j39l32l98j58K9M23J90M73k10j36l25k75m04O1L84
3320b11M80L51J53m78k56p33K50J26p8R26J59j74k50l64k84k00k77Q18O60j13
$$ plain form
3340 505 822 275 63 -166 -559 -814 -158 85 751 690 522 -141 -524 -560 -449 -141 169 482 479 255 49
3361 49 -257 -358 -685 -268 180 596 516 334 398 -42 -514 -675 -487 182 525 438 738 165 -151 -360 -660
3382 -660 -503 -205 198 770 513 25 -163 -368 -758 -770 -111 207 258 812 7 132 -392 -504 -322 -311 157
3403 157 715 741 -43 42 -459 -426 -485 -118 96 762 526 484 -271 -453 -559 -319 -72 136 836 379 418 23
3425 23 -11 -730 -404 -147 296 239 308 182 -167 -276 -474 -423 -131 308 320 558 190 -7 -396 -697 -747 -493
3447 -493 -49 642 613 519 -189 -327 -389 -468 -315 329 720 498 381 38 -607 -685 -509 -191 -39 662 922 442
3469 442 126 -258 -692 -661 -682 -27 460 766 687 392 -118 -436 -851 -415 53 316 198 667 145 1 -455
3490 -455 -611 -480 -24 453 569 731 403 -71 -507 -606 -528 -295 72 520 388 422 -73 -455 -672 -620 -200
$$ packed form
3340E05L17n47k12k29l93k55O56K43O66o1j68o63l83l6J11L08L10L13lk24k06
3361D9l06j01l27M17M48M16q0j82O4m40m72j61J88O69L43q7L00n73l16k09l00
3382f60J57K98M03N72k57m88j88k05l90j2O59L18N1N54q05J25n24j12J82J1M68
3403A57N58K6p84Q5n01L3n9L67K14O66k36m2p55j82j06K40K47K08P00m57L9l95
3425B3l4p19L26K57M43n7O9j26l49j09j98N1K92M39J2K38l68j97l89l01n0K54
3447d93M44O91k9r4p08j38o2p9J53O44L91k22j17l43o45p8J76L18J52P01K60m80
3469D42l16l84m34L1k1O55M87L06p9k95n10l18m15M36M68K63j18M69n22j44m56
3490d55j56J31M56M77J16J62l28m74m36r9P8K33L67M48j32L4m95l82k17N2M20
$$ plain form
3511 -200 332 304 432 439 338 -349 -315 -301 127 -67 595 326 508 138 -190 -269 -425 -323 283 525 501 285
3533 285 158 -372 -743 -615 -175 118 192 394 328 81 -423 -475 -595 -128 223 476 723 519 103 -132 -547
3554 -547 -743 -18 28 547 692 378 89 -393 -365 -839 -332 -31 -37 652 550 195 -160 -800 -548 -451 21 609
3576 609 515 597 741 -142 -255 -509 -594 -236 462 717 402 337 -313 -406 -805 -601 -535 -52 374 155 300 123
3598 123 -557 -371 -521 -1 261 603 729 530 37 -229 -545 -390 41 275 391 782 124 -46 -234 -565
3618 -565 -356 -76 -229 642 673 -90 -202 -534 -635 -329 -319 72 538 564 162 95 -330 -542 -305 -141 28
3639 28 496 397 587 44 -266 -398 -293 -217 265 383 444 340 187 -362 -701 -574 -632 37 405 513 524 -80
3661 -80 -348 -334 -496 -363 209 422 827 852 363 -40 -533 -601 -440 -34 329 972 778 472 27 -377 -850
$$ packed form
3511b00N32k8J28Pj01o87L4J4M28j94O62k69J82l70l28p9j56J02O06K42k4k16
3533B85j27n30l71J28M40K93P4K02o6k47n04n2j20M67L51K53K47k04m16k35m15
3554e47j96P25M6N19J45l14k89m82K8m74N07L01oO89j02l55l55o40K52R7M72N88
3576F09r4Q2J44q83j13k54q5L58O98K55l15o5o50r3l99K04O6M83M26k19J45j77
3598A23o80J86j50N20K62L42J26j99m93k66l16J55M31K34J16L91o58j70j88l31
3618e65K09K80j53Q71L1p63j12l32j01L06J0L91M66K6m02o7m25k12K37J64J69
3639B8M68r9J90n43l10j32J05P6M82J18O1j04j53n49l39J27n8O69L68J08J1o04
3661h0k68J4j62J33N72K13M05K5m89m03m93o8J61M06L63O43j94l06m45m04m73
$$ plain form
3682 -850 -680 -439 103 630 715 375 -49 -312 -749 -377 -65 320 568 509 317 225 -515 -627 -440 -156 172
3703 172 341 669 458 204 -266 -550 -322 -180 -123 377 293 185 -140 -336 -489 -340 -436 39 320 607 268
3724 268 144 -28 -630 -556 -173 75 371 507 495 155 -73 -723 -684 -347 194 283 415 419 154 -404 -414 -804
3746 -804 -67 250 415 668 384 271 -88 -695 -478 -386 50 478 762 735 363 -11 -373 -540 -540 -300 327
3767 327 383 443 153 -316 -408 -834 -404 -231 515 358 532 465 -26 -451 -726 -433 -273 309 563 834 276
3788 276 47 -382 -558 -398 -322 227 404 517 493 7 -228 -563 -909 -185 30 415 735 360 -236 -311 -187
3809 -187 -591 -139 -81 163 395 622 421 -227 -564 -545 53 235 520 470 364 123 -103 -449 -624 -532 238
3830 238 292 295 613 78 -201 -721 -528 -234 296 239 618 759 390 -324 -541 -773 -448 29 774 418 712
$$ packed form
3682h50J70K41N42N27Q5l40m24k63m37L72L12L85K48n9j92r2p40j12J87K84L28
3703A72J69L28k11k54m70k84K28J42N7N00q4j08l25j96j53J49r6M75K81K87l39
3724B68j24j72o02P4L83K48K96J36j2l40k28o50L9L37N41Q9J32Mk65n58j0l90
3746h04P37L17J65K53k84j13l59o07K17R2M36M28K84k7l72l74l62j67%K40O27
3767C27N6O0k90m69r2m26M30J73P46j57J74o7m91m25k75K93J60N82K54K71n58
3788B76k29m29j76J60P6N49J77J13k4m86k35l35l46P24K15L85L20l75n96p5J24
3809a87m04M52N8K44K32K27k01o48l37J9N98J82K85n0j06k41k26l46j75R2P70
3830B38N4LL18n35k79n20J93K94N30n7L79J41l69p14k17k32L25M77P45l56K94
$$ plain form
3851 712 320 111 -629 -637 -516 -105 469 432 480 67 -112 -611 -856 -510 -139 95 615 291 575 -110 -477
3872 -477 -711 -299 -151 117 503 823 425 447 -150 -285 -423 -279 105 249 378 381 194 -844 -844 -790 -464 224
3894 224 334 551 354 -106 -148 -448 -495 -242 236 421 303 663 76 -83 -464 -393 -88 226 572 124 414
3915 414 407 -96 -573 -479 -251 170 259 373 339 65 -339 -231 -279 -96 180 315 541 530 635 -18 -231 -874
3937 -874 -243 -82 527 592 521 319 -441 -662 -810 -730 12 405 406 185 138 -399 -567 -712 -616 57 288 576
3959 576 572 292 -194 -379 -526 -197 -69 -10 631 422 219 140 101 -540 -418 -162 -36 69 408 293 96 -113
3981 -113 -541 -814 -334 138 402 752 202 25 -276 -418 -103 -466 154 290 764 449 322 52 -429 -221
4001 -221 -290 67 351 280 289 109 -94 -365 -267 -273 -256 276 188 418 164 -275 -625 -650 -181 160 235 248 651 495
$$ packed form
3851G12l92k09p40qJ21M11N74l7M8m13j79m99k45L46L71K34N20l24K84o85l67
3872d77k34M12J48K68L86L20l98K2n97j35j38J44L84J44J29Lj87j038%N4L26O88
3894B24J10K17j97m60m2l00m7K53M78J85j18L60n87j59l81P1L05L14L46m48K90
3915D14pn03m77R4K28M21Q9J14l4k74m04J08m8J83K76J35K26j1J05o53k13o43
3937h74O31J61O09O5p1k02p60k21j48Q0P42L93Jk21m7n37j68j45R6O73K31K88
3959E76mk80m86j85j47L29J28N9O41k09k03p9l9o41J22K56J26J05L39j15j97k09
3981a13m28k73M80M72K64L50n50j77l01j42L15l63O20J36M74l15j27k70m81K08
4001b21o9L57K84p1Rj80k03k71R8oJ7N32q8K30k54m39l50k5M69L41P5J3M03j56
$$ plain form
4025 495 -258 -495 -436 -406 44 468 571 608 321 -222 -652 -652 -208 -124 247 545 299 238 -531 -555 -567 -326 41
4048 41 166 326 641 380 -226 -312 -660 -319 -176 300 625 360 224 -101 -494 -618 -635 -13 -87 595 958
4069 958 331 -124 -539 -635 -389 -262 66 361 690 142 160 -133 -465 -331 81 -20 307 599 419 4 18
4090 18 -751 -496 -480 40 355 619 499 224 -326 -288 -788 -186 -145 307 318 207 128 -343 -294 -516 -348 96
4112 96 436 943 488 172 -191 -309 -574 -415 11 233 602 538 297 -117 -463 -695 -315 -117 203 392 377
4133 377 181 38 -487 -277 -305 -16 425 662 377 188 -73 -497 -421 -189 252 335 480 529 555 -247 -204 -538
4155 -538 -617 -330 10 572 385 384 137 -370 -634 -599 -228 -129 432 504 365 119 -177 -202 -457 -306 69 274
4177 274 530 339 199 -61 -444 -482 -434 -39 184 341 543 115 -344 -520 -676 -464 199 312 430 424 218
$$ packed form
4025D95p53k37N9L0M50M24J03L7k87n43m30%M44Q4L71K98k46o1p69k4j2K41L67
4048D1J25J60L15k61o06q6l48L41J43M76L25k65j36l25l93j24j7O22p4O82L63
4069I58o27m55m15r6K46J27L28K95L29n48J8k93l32J34M12j01L27K92j80m15J4
4090A8p69K55J6N20L15K64j20k75n50L8n00O02M1M52J1j11p9m71M9k22J68M44
4112I6L40N07m55l16l63j18k65J59M26K22L69o4k41m14l46k32L80J98L20J89j5
4133C77j96j43n25K10k8K89M41K37k85j89k61m24P6K32M41Q3J45M9K6q02M3l34
4155e38p9K87L40N62j87jk47n07k64L5L71R9N61P2j39k46k96k5k55J51L75K05
4177B74K56j91j40k60l83l8M8L95K23J57K02m28m59j76j56K12O63J13J18ok06
$$ plain form
4198 218 -256 -490 -299 -472 154 414 330 468 386 -82 -398 -391 -490 130 182 447 483 142 -207 -479 -700 -386
4220 -386 -233 336 397 323 334 -61 -588 -425 -498 33 296 610 354 645 28 -443 -629 -678 197 268 462 604
4242 604 468 -97 -313 -649 -271 -223 196 361 598 576 -84 -259 -366 -456 -258 91 330 620 477 411 -222
4263 -222 -14 -660 -159 47 -82 516 257 173 -276 -373 -676 -319 4 359 381 146 127 -78 -376 -373 -478 -1
4285 -1 148 319 461 561 77 -410 -455 -209 -180 603 468 395 380 -101 -209 -754 -708 -45 -24 402 597 138 14
4308 14 -548 -463 -273 -13 686 414 359 -34 -330 -483 -422 -206 -15 196 633 794 328 -59 -213 -186 -592 -124
4330 -124 -121 551 540 421 105 -445 -601 -590 -166 101 328 672 343 32 -361 -485 -631 79 151 505 619 707
4352 707 60 -89 -556 -625 -244 187 111 788 451 -85 -350 -794 -723 -711 -61 -68 25 626 -69 -228 -263 -838 -122
$$ packed form
4198B18m74k34J91j73O26K60q4J38q2m68l16Pr9O20N2K65L6l41l49k72k21L14
4220c86J53N69O1p4J1l95n27J63p3N31K63L14k56K91o17m71j86m9Q75P1J94J42
4242F04j36n65k16l36L78M8M19J65K37k2o60j75j07r0J98L49K39K90j43o6o33
4263b22K08o46N01K06j29N98k59q4m49r7l03L57L23L55K2k35j9k05k98Lj05M77
4285aJ49J71J42J00m84m87m5K46K9P83j35p3j5m81j08n45M6O63K1M26J95m59j24
4308A4n62Q5J90K60O99k72n5l93k96j53O1K16J91K11M37J61m66l87j54K7m06M68
4330a24LO72j1j19l16n50j56J1M24K67K27L44l29l11l93j24j46P10P2L54J14Q8
4352G07o47j49m67o9L81M31p6O77l37n36k65m44P1J2O50pR3O01o95j59l5n75P16
$$ plain form
4375 -122 -56 155 348 561 90 -60 -482 -304 -466 -223 180 476 196 154 101 -429 -421 -84 -75 160 268 444
4397 444 276 -157 -123 -200 -333 -223 261 168 509 591 -48 -151 -486 14 -103 598 280 600 -64 143 -408
4418 -408 -385 -78 15 11 442 302 261 -227 -422 -224 -625 -25 -95 407 101 315 28 -89 -355 -219 183 174 599
4441 599 657 159 287 -308 -359 -511 -355 115 296 258 520 5 -126 -497 -260 -747 41 393 558 641 -18
4462 -18 12 -542 -217 -133 -107 468 419 493 374 23 -245 -156 -271 -125 261 256 54 174 -105 -494 -709 -491 -228
4485 -228 71 485 255 293 35 -203 -600 -194 -277 -144 688 608 221 466 8 -602 -609 86 102 337 487 181
4507 181 102 -397 -207 -276 -198 209 135 562 -3 164 -159 -317 -342 54 -40 321 315 266 26 -269 -182 -375 -23
4530 -23 109 543 519 121 66 -162 -386 -483 -123 -192 -83 222 373 192 -146 -307 -453 94 -88 150 453 565
$$ packed form
4375a22O6K11J93K13m71j50m22J78j62K43M03K96k80m2n3n30QL37RK35J08J76
4397D44j68m33L4p7j33J10M84r3L41Q2o39j03l35N00j17P01l18L20o64K07n51
4418d08K3L07R3mM31j40m1m88j95J98m01O00p0N02l06K14k87j17k66J36M02rM25
4441E99N8m98J28n95n1j52J56M70J81l8K62n15j31l71K37m87P88L52J65Q3o59
4462a8L0n54L25Q4K6N75m9P4j19l51k68Q9j15J46L86nk02J20k79l89k15K18K63
4485b28K99M14k30L8k58k38l97M06q3J33Q32q0l87K45m58o10pO95J6K35J50l06
4507A81p9m99J90o9P8M07p4M27n65J67l23j58k5L96r4L61om9k40k95Q7j93L52
4530b3J32M34k4l98n5k28k24r7L60o9J09L05J51j81l38j61j46N47j82K38L03J12
$$ plain form
4552 565 350 -76 -40 -349 -321 -94 70 513 316 221 -3 -208 -477 -377 -146 24 353 359 207 14 -58 -612
4574 -612 -334 -213 -141 44 518 -9 -143 74 -97 -590 49 31 359 164 161 128 -294 -375 -163 -30 136 78
4596 78 174 19 16 -126 -247 -406 -361 138 -108 218 170 89 -227 -220 -165 -267 -4 349 451 502 64 -96 -211 -178
4620 -178 -174 228 339 227 314 45 -139 -384 -236 -423 -174 -142 103 437 250 -148 -390 -323 -144 -76 96 283
4642 283 -69 9 -392 -185 -455 -223 -129 209 261 537 261 -293 -196 -251 -237 -20 -82 358 298 216 -184 -401 -716
4665 -716 -402 -88 262 447 235 326 -185 -81 -324 -365 52 218 333 166 220 278 -113 -26 -410 -47 81 9
4687 9 406 -56 120 -288 -365 -221 55 -129 -96 407 243 -12 -161 -281 -225 180 -69 304 180 311 278 -178
4709 -178 -451 -346 -54 -14 181 332 44 -15 -252 -213 -267 -206 -161 64 255 150 216 -182 -450 -155 -35 70
$$ packed form
4552E65k15m26L6l09K8K27J64M43j97r5k24k05k69J00K31J70L29Oj52j93p2n54
4574f12K78J21P2J85M74n27j34K17j71m93O39j8L28j95ll3m22q1K12J33J66n8
4596G8R6j55lj42j21j59M5M99k46L26m8q1l16PN5j02K63L53J02N1m38j60j15L3
4620a78MM02J11j12Q7k69j84k45J48j87K49L2K45L34j87l98k42O7J79O8J72J87
4642B83l52P8m01K07k70K32R4L38N2K76k76n54R7n5J4K17o2M40o0q2m00k17l15
4665g16L14L14L50J85k12R1n11J04k43m1M17J66J15j67N4N8l91Q7l84L63J28p2
4687IL97m62J76m08p7J44K76j84L3N03j64k55j49j20N6M05k49L73j24J31l3m56
4709a78k73J05K92M0J95J51k88n9k37L9n4O1M5K25J91j05O6l98k68K95J20J05
$$ plain form
4731 70 45 481 253 89 39 -126 -125 -255 -164 341 -17 347 24 109 -98 -85 -212 -138 126 269 231 211 172 -264
4755 -264 -361 -361 -274 61 305 139 511 86 -51 -413 -176 -61 145 -5 336 331 19 -141 -256 -328 -11 32 259
4778 259 230 -55 250 -9 -216 -374 36 -29 -280 126 129 247 -31 -80 -210 -91 -50 398 348 207 30 -147
4800 -147 -209 -26 -90 -2 123 318 18 29 280 -441 -137 -48 3 456 384 243 259 -242 -492 -261 -46 263 243
4823 243 442 17 79 -68 -460 65 -43 1 208 444 365 -24 -195 -177 -248 -418 110 407 172 439 57 -262
4845 -262 -278 -253 -34 -73 42 295 370 240 -49 -8 -222 25 -238 -250 307 265 384 46 240 -216 -46 -287
4867 -287 -102 69 148 -156 221 -42 -198 -453 -38 -36 242 -43 55 -29 -241 -71 -61 -143 -93 -18 -161 120 -4
4890 -4 -56 -345 -327 -227 -80 -101 218 12 235 -171 -40 -221 35 -7 278 319 209 147 79 -389 -187 -242 -28
$$ packed form
4731G0k5M36k28j64n0j65Jj30R1N05l58L64l23Q5k07J3j27P4K64J43l8k0l9m36
4755b64r7%Q7L35K44j66L72m25j37l62K37J15K06j50L41nl12j60j15p2L17M3K27
4778B59k9k85L05k59k07j58M10o5k51M06LJ18k78m9j30J19M1M48n0j41j77j77
4800a47o2J83o4Q8J25J95l00J1K51p21L04Q9N1M53p2j41J6n01k50K31K15L09k0
4823B43J99m25O2j47l92N25j08M4K07K36p9l89j71J8p1j70N28K97k35K67l82l19
4845b62j6K5K19l9J15K53P5j30k89M1k14K47k63j2N57m2J19l38J94m56J70k41
4867b87J85J71P9l04L77k63j56k55M15KK78k85R8q4k12J70J0q2N0P5j43K81j24
4890dn2k89J8J00J47k1L19k06K23m06J31j81K56m2K85M1j10o2o8m68K02n5K14
$$ plain form
4913 -28 85 26 70 156 -186 -326 -343 -191 64 322 250 192 76 -20 -153 -372 -116 -222 30 246 206 -161 -20
4936 -20 -589 -416 -22 -193 -77 6 257 172 -8 -182 -317 -147 99 -45 205 152 118 -34 3 -306 -252 79
4958 79 -167 -16 70 198 246 -275 -391 -313 -90 95 275 393 41 17 266 -174 -304 90 -12 363 268 218
4980 218 11 -240 -252 -127 18 -188 197 399 -81 79 -204 154 -334 -72 -169 -72 49 76 165 -209 -227 -23
5002 -23 -219 -128 54 79 225 -136 -103 -51 -569 -8 -111 48 282 113 -16 -155 -343 -571 -112 -154 -28 389
5024 389 357 504 -41 -118 13 -63 -573 39 41 175 8 -79 -296 -207 -436 -25 132 184 -9 291 224 -366 -72
5047 -72 -223 -245 26 303 421 243 19 -267 -58 -234 -89 -101 33 332 38 214 90 -352 -174 -152 -18
5068 -18 313 115 321 -52 -244 -230 -363 -265 -2 132 371 89 -164 -157 -176 215 -5 59 254 292 245 140 185
$$ packed form
4913b8J13n9M4Q6l42j40j7J52K55K58p2n8j16r6j33k19K56j06K52K16m0l67J41
4936b0n69J73L94j71J16Q3K51q5j80j74j35J70K46j44K50n3l4j52L7l09N4L31
4958G9k46J51Q6J28M8n21j16P8K23J85J80J18l52k4K49m40j30L94j02L75r5n0
4980B18k07k51j2J25J45k06L85K02m80J60k83L58m88K62r7R7J21K7Q9l74j8K04
5002b3j96R1J82K5J46l61L3N2n18N61j03J59K34j69j29j39j88k28M59m2J26M17
5024C89l2J47n45p7J31p6n10O12KJ34j67q7k17Q9k29M11J57N2j93L00o7n90K94
5047g2j51k2K71K77J18j78k24k86K09j76J45j2J34K99k94J76j24m42J78K2J34
5068a8L31j98K06l73j92J4j33R8K63J34K39k82k53Pj9L91k20O4J95L8m7j05M5
$$ plain form
5091 185 -308 168 -258 59 -47 -13 -149 74 -188 -224 -324 -63 -129 255 332 436 157 107 -79 -292 -238 66
5113 66 -55 352 310 114 -322 -127 77 -252 -359 99 320 -8 148 104 -455 -59 -17 -383 203 -29 292
5134 292 -21 25 -167 -429 -396 -334 218 178 313 325 -194 -199 -41 -345 -306 101 85 -59 276 40 -145 -159 45
5157 45 151 179 28 60 197 132 -229 18 61 -227 -136 138 -50 -37 81 127 -193 -71 -200 -91 -102 426 121
5180 121 -316 -141 24 -563 -58 -158 -150 318 311 -63 -6 -374 56 -119 -23 142 38 324 109 -113 20 -320
5202 -320 -191 -263 66 285 173 89 -17 -77 -202 19 40 -1 229 212 151 -77 84 -127 -407 -82 109 120 60
5225 60 47 -1 -210 -361 -97 -181 15 154 366 93 -258 -124 -202 -166 -318 72 297 213 166 -77 -98 8 -33
5248 -33 -453 95 148 -22 -146 354 44 -289 -174 -222 -90 179 -146 -72 333 -191 -175 -377 378 -19 55 109
$$ packed form
5091A85m93M76m26L17j06L4j36K23k62l6j00K61o6L84P7J04k79n0j86k13N4L04
5113F6j21M07m2j96m36J95K04l29j07M58K21l28J56m4n59L96M2l66N86k32L21
5134B92l13M6j92k62L3O2N52m0J35J2n19nJ58l04L9M07j6j44L35k36j85j4K04
5157D5J06K8j51L2J37o5l61K47M3k88R1K74j88J3J18M6l20J22j29J09j1N28l05
5180A21m37J75J65n87N05j00QM68pl74N7l68M30j75R6J65j04K86k15k22J33l40
5202c20J29p2L29K19j12q4j06o0j25K21K1m1K30j7o1k28J61k11k80L25J91J1o0
5225F0j3m8k09j51K64q4J96J39K12k73l51J34p8L6j52L90K25q4m7k43k1J06m1
5248c3m20N48N3j70j24N00l10l33J15m8J32K69l25P4M05n24J6k02P55l97P4N4
$$ plain form
5270 109 339 67 -259 11 -475 -152 378 161 287 85 144 -173 -59 -43 -13 -32 130 -55 311 -165 164
5291 164 31 236 -375 -133 7 327 221 211 67 -373 -238 -214 -270 43 379 -39 426 -31 -25 -128 -96 -102 256
5314 256 -44 265 270 -129 -47 -359 -62 259 25 193 287 -53 346 -2 -92 -81 -116 74 106 456 -52 172 -8
5337 -8 -381 -78 81 -178 33 170 462 69 -38 104 -397 -88 229 11 66 229 133 37 72 -239 -273 -101
5359 -101 183 80 73 188 -225 -150 -202 -286 239 7 85 134 -42 -94 5 -45 -125 4 67 224 143 174 9 19 -368
5384 -368 -110 384 115 219 -39 -26 70 72 -117 -150 -187 89 23 213 135 15 21 -300 153 70 155 75 181 295
5408 295 119 139 -208 -380 -90 252 468 261 83 -47 62 -155 -45 -71 -16 230 58 -207 -25 92 -100
5429 -100 -182 -215 21 80 58 248 238 268 -300 -130 17 6 329 -39 149 9 -15 -196 -83 -142 -123 226 -10
$$ packed form
5270A09K30k72l26K70m86L23N30k17J26k02N9l17J14J6L0j9J62j85L66m76L29
5291A64j33K05o11K42J40L20j06j0j44m40J35K4n6L13L36m18M65m57Oj03L2oL58
5314B56l00L09Nl99Q2l12K97L21k34J68R4l40L99l48r0J1l5J90L2L50n08K24j80
5337hl73L03J59k59K11J37K92l93j07J42n01L09L17k18N5J63r6r6L5l11l4J72
5359a01K84j03pJ15m13P5n2q4N25k32P8M9j76n2R9n0q0J29O3J57q1L1j65J0l87
5384c68K58M94k69J04k58J3R6Kj89l3l7K76o6J90p8j20Ol21M53q3Q5q0J06J14
5408B95j76K0l47j72K90L42K16k07j78j30J09k17J10k6N5K46j72k65J82J17j92
5429a00q2l3K36N9k2J90j0L0n68J70J47j1L23l68J88j40k4j81J13n9J9L49k36
$$ plain form
5452 -10 254 -58 -24 23 -191 -146 350 -169 226 379 569 -65 -99 -104 270 167 20 355 120 106 -96 -114 -252
5475 -252 -104 97 -13 -60 60 109 209 -41 40 -283 122 75 221 166 -16 -187 -329 -341 -112 -277 2 185
5497 185 108 127 54 -110 64 119 -98 165 221 160 280 -31 -133 25 -41 -101 84 -11 42 -86 -55 186 88 45
5521 45 -227 -86 32 190 31 115 -159 34 -156 211 -186 25 139 130 106 84 -147 -258 -26 58 -28 18 111
5544 111 -19 107 -46 83 -99 63 62 256 400 154 -14 -166 -408 -170 55 68 4 424 -145 64 -10 -58
5566 -58 -54 -340 170 -185 234 181 94 -11 -177 186 228 -66 459 -106 156 -277 -101 -394 -94 -22 67 118 251
5589 251 -90 -20 -107 43 -195 -184 -191 -30 -107 -121 196 -36 -299 -50 157 174 62 -35 235 -70 -34 -274 75
5612 75 84 274 196 211 -7 -3 59 -42 -168 128 9 109 265 62 -86 -68 -86 9 -290 48 4 53 -31 90 18
$$ packed form
5452a0K64l12L4M7k14M5M96n19L95J53J90o34l4nL74j03j47L35k35j4k02j8j38
5475b52J48K01j10m7J20M9J00k50Q1l23M05m7J46n5j82j71j42j2K29j65K79J83
5497A85p7J9p3j64J74N5k17K63N6o1J20l11j02J58o6o0J85r5N3j28L1K41r8m3
5521D5k72J41J18J58j59Q4k74J93j90L67l97K11J14rk4k2k31j11K32Q4q6M6R3
5544A11j30J26j53J29j82J62jJ94J44k46j68j52k42K38K25J3o4M20n69K09p4m8
5566e8Mk86N10l55M19n3q7j05j66L63M2k94N25n65K62m33J76k93L00P2Q9N1J33
5589B51l41P0q7J50k38J1pJ61p7j4L17k32k63K49K07J7j12r7K70l05L6k40L49
5612G5RJ90p8J5k18MO2j01j26K96j19J00J56k03j48J8j8R5k99L38m4M9q4J21p2
$$ plain form
5637 18 -11 -220 99 205 -80 378 213 278 -175 -184 -186 -38 279 -296 108 332 -14 -143 -420 -116 -298 45
5659 45 -126 158 -144 87 -14 184 -46 45 -145 -46 -145 251 10 -164 -197 177 -119 -234 12 146 -59 124
5681 124 -71 28 47 10 -61 43 185 -13 -157 -105 -24 -126 45 148 -52 246 266 -203 110 17 -223 0 80
5704 80 -156 -21 124 136 10 2 -12 42 -121 -66 176 38 -109 -139 -90 -262 -332 -143 176 31 79 268 -180 -82
5728 -82 61 -78 -265 337 381 43 131 -100 -223 269 -302 -137 -37 -142 -131 19 165 -71 -90 73 -3 -116
5750 -116 22 -136 518 -167 -197 26 -116 -208 149 -13 62 -56 -1 -111 -139 -10 -198 -69 -126 233 -64 107
5772 107 60 191 73 -201 -162 -45 355 19 269 -90 15 -9 -103 -57 -27 -20 143 13 -72 -55 -33 -125 -10 204
5796 204 -272 220 176 66 -172 80 -138 -44 84 45 195 12 125 -18 -186 -151 -85 235 -32 49 96 189 372
$$ packed form
5637A8k9k09L19J06k85M58j65O5m53rkJ48L17n75M04K24l46j29k77L04j82L43
5659D5j71K84l02K31j01J98k30R1j90R9r9L96k41j74l3L74k96j15K46J34k05J83
5681A24j95R9J9l7p1J04J42j98j44N2Q1j02J71J03k00K98K0m69L13r3k40K23Q0
5704H0k36J35J45J2j26qj4N4j63N5K42j38j47l0M9j72p0J89L19j45M8J89m48R8
5728h2J43j39j87O02M4l38Q8k31j23M92n71J65J00j05J1J50J46k36j9J63p6j13
5750a16J38j58O54o85l0K23j42r2L57j62P5j18N5j10k8J29j88J29n7L59k97J71
5772A07m7J31j18k74L9J17M00l36K50l59J05k4r4M6L0PJ63j30q5J7K2r2J15K14
5796B04m76M92m4j10k38K52k18R4J28l9J50j83J13j43j68L5O6L20k67Q1M7R3J83
$$ plain form
5819 372 -290 -141 -113 -129 188 241 246 114 166 -118 -67 -228 -185 -57 221 -19 -217 90 -208 25 160 -149 64
5842 64 36 73 205 -128 -95 -307 -19 -15 -141 72 -43 79 -48 251 -53 -273 -5 -149 134 -69 -180 111
5864 111 -174 68 -53 27 243 -57 19 97 242 -317 -95 109 -13 -62 131 -32 -79 268 -333 -35 -33 70
5886 70 87 -112 -219 71 -100 -67 -291 -131 65 160 28 156 -65 22 104 167 -35 -51 -148 136 13 220 4
5909 4 -317 26 -153 -93 11 196 526 232 -19 10 -189 166 -229 -22 106 129 -102 -175 144 123 226 -179
5931 -179 -52 18 58 149 90 -79 -148 150 242 206 218 -136 -102 -12 -219 75 -62 -126 -285 -126 -36 -135 118 -142
5955 -142 152 -62 -79 -34 220 274 182 35 315 -60 111 162 7 -10 -41 -125 222 182 -13 -127 -33 -167 43
5978 43 54 5 -94 140 87 -79 -121 495 -181 128 285 14 -103 -162 142 -47 -101 35 -250 -102 -193 21 7
$$ packed form
5819C72o62J49K8j6L17N3Nj32N2k84N1j61M3J28K78k40j98L07k98K33J35l09K13
5842F4k8L7J32l33L3k12K88Mj26K13j15J22j27K99l04k20K68j44K83k03j11K91
5864A11k85K42j21Q0K16l00P6P8J45n59K22K04j22m9J93j63m7L47o01K98KJ03
5886G0J7j99j07K90j71L3k24J60J96R5j32J28k21Q7Q2O3k02j6r7K84j23K07k16
5909Dl21L43j79O0J04J85L30k94k51K9j99L55l95K07J28K3k31p3L19k1J03m05
5931a79J27P0M0R1n9j69o9K98R2l6J2l54L4R0k07K94j37o4j59J59R0r9K53k60
5955a42K94k14j7M5K54N4r2j47K80l75J71N1j55j7l1q4L47m0j95j14R4j34K10
5978D3J1m9r9K34n3j66m2O16o76L09J57k71j17n9L04j89n4J36k85J48r1K14j4
$$ plain form
6001 7 44 -119 61 155 -48 124 112 63 27 -122 -113 224 70 152 -44 51 -138 -249 249 84 -178 145 64 -4
6025 -4 255 61 297 -104 -122 -77 -23 -151 -156 -131 -236 225 -132 -133 113 80 356 87 129 -100 27 228 23 -197
6049 -197 -280 53 4 277 35 60 41 -125 -84 -127 167 161 37 160 68 49 187 108 -75 -38 71 143 -252 70
6073 70 -9 93 239 -215 -199 -42 318 94 -86 -83 78 -153 -206 -299 118 205 -112 240 13 105 -250 -156 -87 -12
6097 -12 13 26 -170 299 -68 -149 -63 -28 131 144 219 43 -61 -82 -134 53 -103 59 173 -137 135 18 84 115
6121 115 -137 -130 191 -114 -50 231 -211 145 -167 -21 60 -5 96 162 68 181 -26 95 199 297 -46 109 105
6144 105 135 -89 91 -122 -267 226 -310 154 -209 330 93 -87 9 134 -60 18 51 284 101 -90 84
6165 84 182 -440 -46 151 80 20 224 51 -122 191 -125 32 292 286 -126 -67 -76 268 -74 -9 -297 203 -50
$$ packed form
6001GL7j63J80R4k03J72j2m9l6j49RL37j54Q2j96R5j89j11M98j65k62L23q1o8
6025dK59j94K36m01j8M5N4j28nK5j05M61l57jK46l3K76k69M2k29J27K01k05k20
6049a97q3L33m9K73k42K5j9j66M1m3K94oj24J23r2j9J38p9j83L7J09P2l95L22
6073G0p9J02J46m54J6J57L60k24j80LJ61k31n3r3M17Q7l17L52k27R2l55R4O9P5
6097a2K5J3j96M69l67q1Q6L5J59J3P5j76j04k1n2J87j56J62J14l10K72j17O6L1
6121A15k52PL21l05O4K81m42L56l12J46Q1o5J01O6r4J13k07J21J04R8l43J55m
6144A05L0k24J80k13j45M93n36M64l63N39k37j80R6J25j94P8L3K33j83j91J74
6165H4R8o22L94J97p1o0K04j73j73L13l16J57K60om12N9rL44l42O5k88N00k53
$$ plain form
6188 -50 67 -156 -69 59 -157 183 -111 61 210 104 -81 189 -389 9 -265 -259 -174 -94 231 51 197 156
6210 156 -167 -147 75 -22 173 -125 216 -138 -117 60 51 -243 -82 -200 -129 66 396 -104 112 -6 -35 20 87
6233 87 93 297 193 122 221 -109 -255 228 4 -280 84 -134 -45 137 -387 -99 -97 -221 71 178 -72 271 -196
6256 -196 -105 -263 -88 304 -71 147 0 133 -30 76 173 -258 -42 140 152 54 0 62 21 -45 7 -169 244
6279 244 -14 245 3 -121 -75 -97 -162 -136 -1 -215 5 287 -116 -310 -204 -12 140 255 65 94 -34 272
6301 272 -140 -147 7 -201 30 -177 -86 202 -86 -31 -87 -345 -231 133 -110 109 76 45 -295 -212 -176 127 141
6324 141 -263 -46 -220 245 144 159 25 -128 -44 36 -173 175 37 -14 -207 42 -135 -204 -46 -243 277 31
6346 31 -146 129 -21 -81 101 34 89 30 114 -144 10 -20 -153 -158 -67 -77 -27 33 1 -107 -83 57 -318 -68 68
$$ packed form
6188e0J17k23Q7J28k16L40k94J72J49j06j85K70n78L98k74OQ5Q0L25j80J46m1
6210A56l23K0K22r7J95k98L41l54K1J77rk94J61j18P1J95L30n00K16j18k9N5O7
6233H7OK04j04p1R9l30j46M83k24k84L64k18Q9J82n24K88Kj24K92J07k50L43m67
6256a96R1j58J75L92l75K18j47J33j63J06R7m31K16J82J2r8n4O2m1o6N2j76M13
6279B44k58K59k42j24M6k2o5K6J35k14K20K82m03j94J06J92J52J15j90K9j28L06
6301B72m12pJ54k08K31k07R1K88k88N5n6k58J14L64k43K19l3l1l40Q3L6L03J4
6324A41m04K17j74M65j01J5j34j53Q4Q0k09L48j38n1j93K49j77o9J58j97N20k46
6346C1j77K75j50o0J82o7N5n9Q4k58J54l0j33nR1j0N0O0l2j08K4J40l75K50J36
$$ plain form
6371 68 -20 42 -55 -131 -133 168 -63 111 -61 -107 212 -157 -3 202 47 87 19 -230 -140 64 167 30 -75 -275
6395 -275 -131 127 139 -251 -30 -10 354 -81 -13 -8 39 27 485 79 -123 -50 -78 -159 -238 -95 -25 158 238 13
6419 13 123 -158 -138 -16 -60 57 268 36 -243 -29 -135 -156 43 124 -276 122 -10 56 15 64 -332 4 40
6442 40 -17 25 -240 256 248 26 223 80 26 -137 -285 102 96 -95 -70 224 151 -213 66 66 -19 -4 -144 -56 39
6467 39 386 -139 -5 166 -36 -81 -22 -171 176 -72 -297 30 -171 280 329 104 226 -38 -187 176 -67
6488 -67 23 236 215 103 101 -257 8 -274 -113 155 228 372 115 59 257 -5 111 -109 -221 165 87 -63 226
6511 226 -76 -7 -40 226 267 -191 117 -184 245 -191 93 -126 25 143 -99 -205 85 128 294 115 -147
6532 -147 33 -121 -51 -52 -29 -80 -135 27 96 -184 115 -305 -11 197 185 97 -67 88 -33 110 -96 178 -40
$$ packed form
6371F8q8O2r7p6kL01k31J74j72m6L19l69J54K05j55M0o8k49R0K04J03j37j05k00
6395b75J44K58J2l90K21K0L64m35O8NM7j2M58m06k02P3k8q1p9J43P0J83Q0k25
6419A3J10k81K0J22m4J17K11k32k79K14j06k1J99Q1m00L98j32O6m1M9l96L36L6
6442D0n7M2k65M96qk22J97j43n4j63j48L87oj91K5K94p3l64K79%q5J5j40Q8R5
6467C9L47n25J34J71k02m5N9j49L47k48k25L27k01M51M9k25J22k64j49L63k43
6488f7R0K13k1j12kl58K65k82J61K68P3J44k57n6J98k62J16k20j12L86p8j50K89
6511B26l02O9l3K66M1m58L08l01M29m36K84k19J51J18k42j06K90M3J66j79k62
6532a47J80j54P0jK3n1n5J62O9k80K99m20K94K08j2q8j64J55j21J43k06K74k18
$$ plain form
6555 -40 91 -115 -117 -24 -180 -71 124 78 5 31 100 -10 -297 8 249 -48 -5 257 -48 -281 39 -14 264
6578 264 208 -293 28 -170 108 -48 251 67 -103 -166 226 -22 -41 -124 150 -42 -196 50 -136 115 156 44
6600 44 62 13 -102 80 -26 -194 -165 -118 -138 56 36 162 -120 -23 -1 -18 -4 209 -236 11 -467 -28 19 68
6624 68 -210 -117 69 142 309 180 -6 91 -74 183 291 2 -54 -157 176 -82 -203 -99 41 -146 151 -35
6646 -35 -58 -40 59 -107 16 34 123 204 296 131 60 37 -126 272 247 34 -13 -144 42 114 -21 -71 171 248 177
6671 177 -67 83 -62 -188 -218 -189 34 136 118 -39 199 63 9 -111 292 -93 105 236 209 -174 -205 -139
6693 -139 238 82 -55 61 -156 -173 -87 -148 71 -9 192 251 118 -192 147 65 161 -194 -206 181 -259 0 -176
6716 -176 -214 313 14 -23 115 149 -88 -62 103 14 124 167 241 -5 78 359 -275 8 151 -82 -136 31 -151
$$ packed form
6555d0J31k06kR3j56J09J95m6p3K6O9j10k87L05K41k97M3K62l05k33L20n3K78
6578B64n6n01L21j98K78j56K99j84j70o3L92k48j9q3K74j92j54K46j86K51M1j12
6600D4J8m9j15J82j06j68K9M7k0J94k0J26k82R7K2j7J4K13m45K47m78M39M7M9
6624F8k78R3J86P3J67j29j86R7j65K57J08k89n6j03L33k58j21J04J40j87K97j86
6646c5k3J8R9j66J23J8Q9Q1R2j65p1k3j63L98k5k13m7j31J86P2j35n0K42P7p1
6671A77k44J50j45j26l0K9K23J02j8j57K38j36n4j20M03l85J98J31k7l83l1O6
6693a39L77j56j37J16k17j7Q6o1K19q0K01N9j33l10L39q2R6l55j2L87m40K59j76
6716a76l8N27k99l7J38L4k37K6J65q9J10M3P4k46Q3K81o34K83J43k33n4J67j82
$$ plain form
6739 -151 125 -95 30 -21 -371 143 2 45 118 155 -39 -14 2 -205 -119 310 274 17 94 19 113 124 297 -149
6763 -149 113 5 -246 66 55 -34 9 -69 42 170 63 -119 -297 -298 -223 -8 -64 290 134 -31 -11 -222 -287
6786 -287 35 247 97 -155 101 22 133 -138 -60 139 125 -183 20 123 1 2 19 -187 -453 11 116 59
6808 59 116 13 49 -38 -260 -205 -363 142 183 -107 242 11 179 -86 -197 -7 31 -2 -80 3 -145 33 -91
6831 -91 149 -249 -256 -5 196 -133 -98 -31 -174 100 199 27 -74 -77 -83 -78 99 -23 -151 333 -274 186 -68 76
6855 76 113 185 13 47 -91 288 -134 -44 -127 -209 130 74 -41 299 -47 -32 162 -19 313 -228 -160 121 -104
6878 -104 -205 -132 167 50 75 305 -13 -105 128 41 -212 200 69 -23 117 -209 169 -149 38 -156 149 204
6900 204 120 -211 -5 -236 -163 179 -302 68 63 118 55 -46 -6 4 -352 74 144 170 5 321 157 -4 211
$$ packed form
6739a51K76k20J25n1l50N14j41M3P3L7j94K5J6k07Q6M29l6k57P7p5R4J1J73m46
6763a49K62j08k51L12j1q9M3p8J11J28j07j82j78jP5K15n6L54j56j65K0k11o5
6786b87L22K12j50k52K56p9J11k71P8J99j4l08K03J03j22JJ7k06k66M64J05n7
6808E9N7j03L6q7k22N5j58N05M1k90L49k31J68k65j11J90L8l3p8Q3j48J78j24
6831i1K40l98pK51K01l29L5O7j43K74R9j72j01loNJ77j22j28M84o07M60k54J44
6855G6L7P2j72L4j38L79m22R0q3q2L39n6j15L40l46J5J94j81L32n41O8K81k25
6878a04j01P3K99j17K5K30l18r2K33q7k53M12j31r2J40l26L78l18J87j94L05N5
6900B04q4l31K06k31P3L42m81L70nN5o3j01M0J0l56M26P0K6j65L16j64j61K15
$$ plain form
6923 211 -100 -80 150 -192 46 -23 -90 -205 -29 265 345 64 -39 180 180 123 150 -161 135 -42 155 25 -51
6946 -51 -127 -313 -163 -120 -197 120 146 -85 -9 104 46 71 -237 -96 -209 -232 -113 194 85 -194 -291 -203 -289 -267
6970 -267 -30 7 152 -5 -56 9 61 -108 -37 119 -205 41 228 -125 36 192 87 -165 57 68 287 47
6992 47 38 133 207 29 -26 246 57 -77 -228 -14 87 -46 -145 -22 -163 199 372 -38 127 14 -342 -78
7014 -78 -137 134 124 70 78 -212 -19 -280 -183 -187 -29 -143 0 -100 115 145 84 53 -13 -231 37 -41 -172 -196 -90
7039 -90 -229 -93 -19 69 -266 -289 264 70 75 -17 4 140 257 -73 14 104 202 251 22 90 149 93 124 150 -147 11
7065 11 180 72 30 59 30 -24 268 149 176 -19 263 -39 101 18 -155 -262 58 -97 -83 48 142 -2 -130
7088 -130 -179 -56 262 -301 -50 -235 -224 -293 56 -150 56 182 -16 -16 -166 208 -241 -90 93 175 107 174 121
$$ packed form
6923B11l11K0K30l42K38o9o7j15J76K94Q0k81j03K19%n7K7l11K96j77J97j30p6
6946e1p6j86J50M3p7L17K6k31P6J13n8K5l08J41j13k3J19L07j09k79r7Q8q6K2
6970b67K37L7J45j57n1O5N2j69P1J56l24K46J87l53J61J56j05k52K22J1K19k40
6992D7rR5P4j78n5K72j89j34j51K14J01j33r9J23j41L62J73m10J65j13l56K64
7014g8n9K71j0n4Qk90J93k61R7mJ58j14J43j00K15L0o1l1o6k18K68p8j31k4J06
7039i0j39J36P4Q8l35k3N53j94Nr2K1J36J17l30Q7R0R8M9k29O8N9n6L1K6k97J58
7065A1J69j08m2K9k9n4K92j19K7j95K82l02J40q3j73j07L20j55J4J31R4j44j28
7088a30m9J23L18n63K51j85J1o9L49k06K06J26j98%j50L74m49J51J83Q2o8O7n3
$$ plain form
7111 121 -39 -199 -321 108 159 -250 -134 -202 -59 74 -33 -134 51 -113 -44 34 -6 -142 -91 -217 151 -117
7133 -117 -173 45 14 -226 -84 30 165 -136 90 92 -255 -296 54 84 -279 28 -41 50 -186 84 19 320 453
7156 453 -171 405 -83 -21 162 120 85 -48 -44 -19 157 -341 25 -89 38 -29 -110 -48 167 78 141 103 -241 -89
7180 -89 96 176 93 -114 -92 -149 -51 -277 98 151 125 123 -145 139 180 362 -160 -1 -97 269 -53 -257 -10 111
7204 111 -176 -145 -16 -88 116 13 -50 74 179 -69 60 -198 -178 41 -241 38 -240 44 -181 81 -194
7225 -194 -132 41 -10 -16 346 -71 -57 121 51 371 -45 -121 267 -77 -259 104 -79 33 167 -286 48 -153
7247 -153 320 -214 -91 -30 -109 226 1 146 35 -63 -177 -14 125 -154 -353 41 278 -103 -179 -335 81
7268 81 -146 226 68 -374 111 -283 -153 -139 -8 -179 -131 52 192 50 28 -184 157 59 -9 128 -56 111
$$ packed form
7111A21j60j60j22M29N1m09J16o8J43J33j07j01J85j64O9P8m0j36N1j26L68k68
7133a17n6K18l1k40J42J14J35l01K26Kl47m1L50L0l63L07o9R1k36K70o5L01J33
7156D53o24N76m88O2J83m2l5j33MK5J76m98L66j14J27o7q1O2K15q9O3l8l44J52
7180h9J85Q0q3k07K2n7R8k26L75N3k6kk68K84M1J82n22J59r6L66l22k04K47J21
7204A11k87L1J29p2K04j03o3J24J05k48J29k58K0K19k82K79k78K84k25K62k75
7225a94O2J73n1oL62m17J4J78p0L20m16p6L88l44j82L63j83J12J34m53L34k01
7247a53M73n34J23O1p9L35k25J45j11r8j14J63J39k79j99L94K37l81p6j56M16
7268H1k27L72j58m42M85l94J30J4J31j71M8J83J40j42k2k12L41r8o8J37j84J67
$$ plain form
7290 111 17 98 103 -152 261 -85 -142 59 17 119 6 -77 -26 3 232 91 53 125 178 10 -85 133 46 19 -123
7315 -123 -67 -327 -57 -93 -96 211 -455 51 -8 20 51 61 203 -117 200 5 -337 319 11 -45 72 -28 -152
7338 -152 102 -147 -301 227 -38 -300 -3 -202 -95 -285 207 197 -56 -289 53 -30 -79 196 231 -65 -165
7359 -165 -60 -25 -15 -100 -46 -65 256 118 -65 -77 86 -101 95 -97 96 38 36 289 119 71 180 -160 -40
7382 -40 78 81 129 -156 357 -18 -58 95 353 -88 -76 137 -141 -164 -15 -27 -120 91 19 -202 14 -183 64
7405 64 184 -116 40 219 -38 -27 348 -131 282 210 31 60 134 -88 -11 -110 -55 96 -144 71 -86 84 1
7428 1 -283 9 -256 -43 4 25 -416 -62 -37 -59 23 211 -333 -127 -8 -249 -36 39 112 -128 54 42 123 -231
7452 -231 -243 -76 37 -14 114 -16 188 -254 -196 255 129 -203 196 -74 -174 10 114 -104 -127 138 165 -7
$$ packed form
7290A11r4Q1Nk55M13l46n7K01m2J02j13q3N1K9K29j41l8P2N3j68r5K18q7k7j42
7315a23N6k60K70l6lL07o66N06n9K8L1J0J42l20L17j95l42O56l08n6J17j00j24
7338a52K54k49j54N28k65k62K97j99J07j90M92j0k53k33L42q3m9K75L5k96j00
7359a65J05L5J0q5N4j9L21j38j83j2J63j87J96j92J93n8kK53j70m8J09l40J20
7382d0J18LM8k85N13l75m0J53K58m41J2K13k78k3J49j2r3K11p2k21K16j97K47
7405F4J20l00J56J79k57J1L75m79M13p2j79K9P4k22P7r9N5J51k40K15j57J70q3
7428Ak84K92k65K13M7K1m41L54K5k2Q2J88n44K06J19k41K13P5P3k40J82j2Q1l54
7452b31j2J67J13n1J28j30K04m42N8M51j26l32L99k70j00J84J04k18k3K65K7j72
$$ plain form
7474 -7 166 -68 128 146 24 -10 -160 -57 -220 23 -65 130 95 42 89 11 -81 -25 53 -152 14 -127 3 -171
7498 -171 355 -30 135 14 -19 37 54 -23 232 75 -285 -105 -12 -10 -62 158 -127 -23 -91 -21 47 -146 24 -83
7522 -83 46 286 -91 119 -120 -306 99 -298 -212 11 249 41 143 77 -144 67 -158 3 -207 -251 -85
7543 -85 30 -233 -116 -65 -131 -75 94 -16 -14 123 -149 266 60 155 43 184 11 20 75 -122 -27 -115 -177 71
7567 71 31 -182 290 -89 -88 43 75 -11 42 -109 237 -75 139 212 198 92 -52 74 -204 -16 -76 174 -127
7590 -127 -3 188 77 -67 -26 156 16 57 -195 -78 213 234 -165 88 64 -108 40 -144 60 -28 -139 -86
7612 -86 74 354 284 22 320 306 -142 -133 -321 161 34 312 -200 157 -175 -77 14 -16 -84 64 64 -33 170 -125
7636 -125 -67 -302 11 -226 13 102 -46 22 133 -177 -135 -73 -328 -152 367 -32 -138 30 -168 -107 48 -24
$$ packed form
7474gJ73k34J96J8j22l4j50J03j63K43q8J95l5n3M7p8r2N6P8k05J66j41J30j74
7498a71N26l85J65j21l3N6J7p7K55j57l60J80R3Kn2K20k85J04o8P0O8j93J70j07
7522h3J29K40l77K10k39j86M05l97Q6K23K38k08J02o6k21K11k25J61k10m4J66
7543h5J15k63J17N1o6N6J69j10KJ37k72M15k06R5j12J41j73RN5j97R5q8o2K48
7567G1m0k13M72l79JJ31L2q6N3j51L46l12K14P3j4j06j44J26k78J88o0K50l01
7590a27J24J91j11j44M1J82j40M1k52J17K91K1l99K53k4j72J48j84K04q8j11N3
7612h6J60K80p0k62K98j4m48Rj88M82j27K78n12L57l32R8R1l0o8J48%r7K03k95
7636a25N8k35L13k37K39Q9j48O8J11l10M2O2k55J76N19l99j06J68j98O1J55p2
$$ plain form
7658 -24 -113 58 195 -201 111 215 -227 4 -94 -261 72 67 -224 -128 101 -24 -58 -159 -83 -172 132 -135 -104
7681 -104 -202 204 71 21 -166 123 222 11 48 -320 -319 -192 347 -35 -218 24 -108 -155 -79 383 61 196 -126
7704 -126 -10 38 36 -96 -10 225 -22 137 -32 -31 -82 2 153 -64 39 -123 -135 81 -103 -88 0 398 139 69
7728 69 -254 57 -57 70 -1 -119 -104 -3 -51 183 26 -141 -87 -7 -9 -92 30 62 39 235 -123 171 20 -9
7752 -9 50 -151 -4 -67 -226 -2 -78 204 -21 19 23 -53 14 24 -157 119 153 410 301 -112 -34 84 133 146 -147
7777 -147 17 43 -131 -95 284 52 -122 -93 -87 77 -56 -192 110 46 -84 -113 -200 -80 -140 193 183 -167 131
7800 131 -43 -175 -87 123 -109 152 31 -370 31 -121 127 197 -357 35 173 -43 43 -24 89 131 -95 -214
7822 -214 -170 196 -50 -27 91 36 -104 66 150 185 101 -13 -170 -141 111 39 160 -89 286 180 207 26 203
$$ packed form
7658b4q9J71J37l96L12J04m42K31r8j67L33nk91R6K29j25l4j01P6q9L04k67L1
7681a04r8M06j33n0j87K89R9k11L7l68JJ27N39l82j83K42j32m7P6M62l22J35l22
7704a26J16M8kj32Q6K35k47J59j69Jn1Q4J51k17J03j62j2K16j84J5Q8L98k59p0
7728F9l23L11j14J27p1j18J5J01m8K34j57j67N4Q0kq3J22L2k3J96l58K94j51k9
7752iN9k01J47o3j59K24p6K82k25M0Mp6O7J0j81K76L4K57j09m13P8J18M9J3k93
7777a47J64K6j74L6L79k32j74K9OJ64j33j36L02o4j30k9q7J20o0L33j0l50K98
7800A31j74j32Q8K10k32K61j21m01M01j52K48P0n54L92J38k16Q6o7J13M2k26j19
7822b14M4L66k46K3J18n5j40J70Q4L5q4j14j57K9K52p2J21k49L75j06K7j81J77
$$ plain form
7845 203 -71 -206 83 -280 -159 43 -216 -143 -199 383 -44 226 -97 15 188 92 29 131 -46 -24 156 -117
7867 -117 16 -230 147 191 -143 -146 -50 -137 318 -152 -188 0 67 -11 56 248 -40 -182 -233 116 -21 -127 -26
7890 -26 7 -110 -12 -143 -155 -231 106 262 20 44 206 -331 90 81 -78 17 -121 -119 -18 103 -88 327 -79 -53
7914 -53 -144 -145 -153 324 -219 351 -91 -134 8 9 6 223 333 97 -189 -275 108 51 29 -7 53 79 222 31 -12 -162
7940 -162 -46 118 78 167 154 -594 -277 83 269 293 323 120 268 137 -177 -113 36 -130 232 151 9 23 -91
7963 -91 143 43 -60 -40 30 -139 -100 83 -69 20 -55 -107 50 27 -318 -87 314 10 -47 -76 -155 144 13 107
7987 107 74 119 210 -85 -47 -139 -22 189 -65 144 -179 -89 138 18 163 99 17 -88 41 142 61 19 281
8010 281 -73 -86 -98 16 329 -132 -94 -29 294 -93 -7 48 59 147 258 84 83 -214 46 129 42 144 -47 310
$$ packed form
7845B03k74j35K89l63J21K02k59P3n6N82m27K70l23J12J73r6o3J02j77K2J80k73
7867a17J33k46L77M4l34lR6q7M55m70l6J88O7p8O7J92k88j42n1L49j37j06J01
7890b6L3j17R8j31j2p6L37J56k42K4J62n37M21rj59R5j38KJ01J21j91M15m06K6
7914e3r1jqM77n43N70m42m3J42JlK17J10k36k86q6L83n7k2l6O0K6J43j91m3j50
7940a62J16J64m0Q9j3p48L17L60J86K4L0k03J48j31l14O4J49j66L62q1j42J4j14
7963i1K34j00j03K0P0j69L9J83j52Q9p5n2J57k3l45K31M01l04n7k9p9K99j31R4
7987A07l3M5R1k95L8r2J17K11k54K09l23R0K27j20J45o4q2j05J29J01q1m2K62
8010B81l54j3j2J14L13m61L8O5L23l87Q6N5J1Q8J11j74jk97K60Q3q7J02j91L57
$$ plain form
8034 310 191 -47 374 75 139 -12 -169 -106 33 48 -95 80 -23 66 88 -27 -84 -263 31 19 109 -16 -97
8057 -97 203 343 -205 277 4 100 -49 108 -136 45 -4 107 -47 -31 -55 -139 73 52 -7 -164 -47 115 -103
8080 -103 41 76 -146 222 46 130 -193 -133 304 201 79 45 -29 125 -300 -2 -34 66 -25 -65 -56 242 130
8103 130 105 -110 -2 81 126 -7 -24 -163 141 -52 109 341 -195 -40 108 -61 82 446 86 134 -92 -77
8125 -77 42 -54 91 -166 51 -234 3 145 -63 -168 194 90 -111 188 -185 64 -52 -56 -214 100 -1
8146 -1 -84 -108 -20 -88 2 -23 -18 270 -77 -62 -136 -244 -301 14 60 314 -36 387 227 -157 92 -252 248 193 -12
8171 -12 -107 57 -337 -19 3 -92 109 -30 329 150 104 -219 -131 0 100 -213 -136 -257 -71 -143
$$ packed form
8034C10j19k38M21k99O4j51j57O3J39J5j43J75j03Q9K2j15n7j79K94j2R0j25q1
8057i7L00J40n48M82k73R6j49J57k44J81m9J11j54J6k4q4K12k1n9j57J17J62k18
8080a03J44L5k22L68j76Q4l23O0M37j03j22l4p4J54m25K98l2J00r1m0RK98j12
8103A30k5k15J08Q3M5j33j7j39L04j93J61K32n36J55J48j69J43L64l60M8k26J5
8125g7J19r6J45k57K17k85K37J42k08j05L62j04k01K99l73K49j16mj58L14j01
8146aq3k4Q8o8R0k5NK88l47J5p4j08n7L15M6K54l50M23j60l84K49l44N00n5k05
8171a2r5J64l94L18K2r5K01j39L59j79m6l23Q8J31J00l13P7j21J86p2
8191a43
$$ Imaginary data points
##PAGE= N=2
##DATA TABLE= (X++(I..I)), XYDATA
$$ plain form
0 0 0 0 0 -1 8 0 8 -8 8 -16 16 -24 32 -33 48 -52 64 -76 89 -107 121 -145 169 -193 225 -254 290 -332 373
29 373 -422 476 -535 599 -668 747 -834 925 -1029 1139 -1266 1401 -1551 1719 -1901 2108
45 2108 -2339 2596 -2897 3237 -3636 4106 -4669 5365 -6246 7400 -8995 11341 -15165 22481
59 22481 -41718 202705 517881 294856 59176 -208582 -299165 -258210 -64893 133443 292473
70 292473 324932 259357 85270 -117826 -288086 -319043 -201022 33533 261237 378498 308221
81 308221 96772 -149869 -295996 -288047 -138143 66633 238009 300284 241022 86318 -97857
92 -97857 -245256 -291077 -213015 -39389 145517 248956 212491 51575 -156336 -307697 -330728
103 -330728 -221085 -39733 127569 209355 177560 52956 -108778 -235172 -268317 -187298 -20128
$$ packed form
0@%%%jRqQj6J6k4L2m0N6o5Q1j00J16j40J65j96K28k66L14l62M18m79N44o22P05
29C73p95Q98j011J134j267J415j581J759j954K168k405K667k952L270l620M009
45B108m447M935n493O134o873P742q775J0034j1611J3646j6395K0336k6506L7646
59B2481o4199K44423L15176k23025k35680k67758r0583M0955J93317J98336J59030
70B92473L2459o5575j74087k03096j70260l0957J18021K34555K27704J17261p0277
81C08221k11449k46641j46127P949J49904K04776J71376O2275n9262j54704j84175
92i7857j47399m5821P8062J73626J84906J03439l6465j60916k07911j51361k3031
103c30728J09643J81352J67302Q1786l1795j24604j61734j26394l3145Q1019J67170
$$ plain form
114 -20128 160417 268617 250132 112723 -74686 -217645 -247002 -152818 13582 171780 250155
125 250155 218727 93425 -71330 -208078 -260176 -201517 -52450 123599 243742 246566 126321
136 126321 -60511 -221391 -274709 -194616 -21525 160259 270025 264924 154963 -8155 -154457
147 -154457 -222765 -185334 -56630 111536 245803 279006 188504 12157 -170342 -272856 -248980
158 -248980 -110931 70230 206101 236935 154170 986 -155218 -246890 -236473 -128466 30430
169 30430 175016 243739 204258 71766 -91088 -207235 -219665 -123359 36027 182406 246230
180 246230 200889 71970 -79996 -189228 -210658 -140177 -10982 117224 187526 168583 66268
191 66268 -74901 -189423 -222655 -158084 -25588 112053 191276 177124 79351 -51161 -151883
$$ packed form
114b0128J80545J08200j8485j37409j87409j42959k9357R4184J66400J58198P8375
125B50155l1428j25302j64755j36748n2098N8659J49067J76049J20143K824j20245
136A26321j86832j60880n3318Q0093J73091J81784J09766n101j09961j63118j46302
147a54457o8308L7431J28704J68166J34267L3203r0502j76347j82499j02514K3876
158b48980J38049J81161J35871L0834q2765j53184j56204r1672J0417J08007J58896
169C0430J44586O8723l9481j32492j62854j16147j2430R6306J59386J46379O3824
180B46230m5341j28919j51966j09232k1430P0481J29195J28206P0302j8943j02315
191F6268j41169j14522l3232O4571J32496J37641P9223j4152r7773j30512j00722
$$ plain form
202 -151883 -177468 -117551 -35 122379 194732 185567 98175 -28407 -138058 -180689 -134853
213 -134853 -23932 99257 174604 164856 73593 -57474 -166562 -204733 -155819 -44048 80746
224 80746 162423 164896 88305 -33269 -142527 -188947 -148572 -35268 98650 193071 203724
235 203724 127183 -777 -121663 -179732 -149701 -47058 80255 174271 193355 126602 2300
246 2300 -125443 -199689 -187273 -94399 38289 148875 186269 133996 17447 -108667 -185734
257 -185734 -179537 -93175 35418 148590 198082 164784 63325 -60381 -151320 -167055 -101031
268 -101031 16132 130372 187546 159978 60738 -64318 -158497 -181506 -127267 -23296 82195
279 82195 142312 130561 54170 -54078 -145036 -176995 -133240 -32468 79314 150982 149345 77706
$$ packed form
202a51883k5585N9917J17516J22414P2353r165q7392j26582j09651m2631M5836
213a34853J10921J23189P5347r748r1263j31067j09088l8171M8914J11771J24794
224H0746Q1677K473p6591j21574j09258m6420M0375J13304J33918R4421J0653
235B03724p6541j27960j20886n8069L0031J02643J27313R4016J9084o6753j24302
246B300j27743p4246J2416R2874J32688J10586L7394n2273j16549j26114p7067
257a85734O197Q6362J28593J13172M9492l3298j01459j23706r0939j5735O6024
268a01031J17163J14240N7174k7568r9240j25056r4179k3009N4239J03971J05491
279H2195O0117j1751p6391j08248r0958l1959M3755J00772J11782P1668j637p1639
$$ plain form
291 77706 -27942 -114862 -143279 -101270 -10272 86974 146369 143526 79969 -15913 -102968 -142717
303 -142717 -117166 -36830 60298 127680 131502 68061 -33158 -121811 -156690 -121316 -33420 65613
315 65613 130981 135519 79232 -10230 -91763 -129752 -103940 -24623 74523 148204 162236 107480
327 107480 7863 -90330 -140955 -120776 -41128 59212 132119 144737 90681 -5762 -101832 -156228
339 -156228 -145878 -75052 25635 111886 143613 106232 16251 -84220 -147745 -143745 -73818 30352
351 30352 121726 158476 126993 43263 -55478 -125152 -136422 -84206 6539 96025 142328 123133
363 123133 45942 -54534 -133776 -154976 -109946 -21380 69557 121281 111808 47098 -41095 -112477
375 -112477 -135824 -99656 -19688 68813 127094 129276 75580 -8327 -83140 -113247 -85300 -13083
$$ packed form
291G7706j05648q6920k8417M2009R0998R7246N9395k843o3557r5882q7055l9749
303a42717K5551Q0336R7128O7382L822o3441j01219q8653l4879L5374Q7896R9033
315F5613O5368M538n6287q9462q1533l7989K5812P9317R9146P3681J4032n4756
327A07480r9617r8193n0625K0179P9648J00340P2907J2618n4056r6443r6070n4396
339a56228J0350P0826J00687Q6251L1727l7381q9981j00471o3525M000O9927J04170
351C0352R1374L6750l1483q3730r8741o9674j1270N2216R0745Q9486M6303j9195
363A23133p7191j00476p9242k1200M5030Q8566R0937N1724r473o4710q8193p1382
375a12477k3347L6168P9968Q8501N8281K182n3696q3907p4813l0107K7947P2217
$$ plain form
387 -13083 68447 121029 120650 68424 -11778 -83892 -116523 -96195 -33632 42455 96237 102672 57691
400 57691 -17901 -87950 -120042 -96988 -30362 48938 104592 111319 68254 -3203 -69598 -100256
412 -100256 -81272 -21050 53553 109169 119423 78166 2501 -73342 -114617 -101734 -41415 37449
424 37449 96651 107569 64935 -11011 -85706 -125306 -112863 -54421 24532 89114 112205 83433
436 83433 15067 -61628 -111373 -109326 -54946 27776 101813 131587 104480 32705 -50272 -105835
448 -105835 -111229 -65284 9641 78935 112240 93864 32025 -46369 -107770 -124166 -89047 -16760
460 -16760 59258 104851 99425 46078 -29413 -91161 -110049 -78116 -9999 63494 109827 109081 63397
473 63397 -6309 -67548 -93935 -74121 -17455 48722 94422 97343 56315 -10706 -72413 -102020
$$ packed form
387a3083Q1530N2582l79n2226q0202p2114l2631K0328O2563P6087N3782O435m4981
400E7691p5592p0049l2092K3054O6626P9300N5654O727m3065p1457o6395l0658
412a00256J8984O0222P4603N5616J0254m1257p5665p5843m1275J2883O0319P8864
424C7449N9202J0918m2634p5946p4695l9600J2443N8442P8953O4582K3091k8772
436H3433o8366p6695m9745K047N4380Q2722P4037K9774k7107p1775q2977n5563
448a05835n394M5945P4925O9294L3305j8376o1839p8394o1401j6396L5119P2287
460a6760P6018M5593n426n3347p5491o1748j8888L1933O8117P3493M6333p46m5684
473F3397o9706o1239k6387J9814N6666O6177M5700K921m1028o7021o1707k9607
$$ plain form
485 -102020 -86588 -34246 29879 76289 83688 49626 -10130 -66788 -94424 -79121 -27281 37193
497 37193 84702 93812 61146 3441 -52258 -79773 -66626 -19777 39004 82481 90616 59114
509 59114 1677 -57734 -90864 -83926 -39420 22233 71120 83914 53405 -6705 -67015 -99567
521 -99567 -88613 -39461 24887 76132 92311 66868 12720 -45843 -82438 -80285 -39011 24085
533 24085 80380 104261 83204 25736 -41782 -89318 -94072 -55464 8195 65696 91314 72980
545 72980 20026 -44059 -90748 -100008 -68527 -9432 51345 87741 82987 40163 -21646 -72804
557 -72804 -89623 -63594 -6225 56388 95044 92983 52373 -7545 -60574 -82454 -65209 -17103
569 -17103 38162 75958 79215 45747 -9813 -62622 -88187 -75794 -31664 23368 64907 72833
$$ packed form
485a02020J5432N2342O4125M6410P399l4062n9756n6658k7636J5303N1840O4474
497C7193M7509R110l2666n7705n5699k7515J3147M6849N8781M3477Q135l1502
509E9114n7437n9411l3130O938M4506O1653M8887J2794l0509o0110o0310l2552
521i9567J0954M9152O4348N1245J6179k5443n4148n8563l6595K153M1274O3096
533B4085N6295K3881k1057n7468o7518m7536m754L8608O3659N7501K5618j8334
545G2980n2954o4085m6689r260L1481N9095O0777L6396m754m2824o1809n1158
557g2804j6819K6029N7369O2613L8656k061m0610n9918n3029k1880J7245M8106
569a7103N5265L7796L257l3468n5560n2809k5565J2393M4130N5032M1539P926
$$ plain form
581 72833 44919 -4267 -51855 -75414 -64480 -23343 28971 69624 79500 55401 8262 -40210
593 -40210 -66940 -59421 -21985 27082 64312 71704 46164 -1415 -48787 -75173 -69247 -34447 13213
606 13213 52220 64125 43236 -550 -48250 -76308 -70837 -32613 20177 64187 78864 58087
618 58087 12323 -36639 -65222 -62168 -27242 22315 64415 81101 63266 18657 -33713 -71131
630 -71131 -76462 -46557 4342 52735 75432 61681 17762 -36170 -75328 -81187 -52048 -1352
642 -1352 48662 76327 70412 33945 -16637 -58116 -71577 -51145 -4732 46649 78958 77475 42760
655 42760 -9176 -55389 -74564 -59621 -18368 29277 61110 63670 35637 -10770 -55066 -76728
667 -76728 -66788 -29280 18190 55426 64421 41547 -738 -41984 -63514 -54914 -20450 23963 58098
$$ packed form
581G2833k7914m9186m7588k3559J0934M1137N2314M0653R876k4099m7139m8472
593d0210k6730P519L7436M9067L7230P392k5540m7579m7372k6386N926L4800M7660
606A3213L9007J1905k0889m3786m7700k8058N471L8224N2790M4010J4677k0777
618E8087m5764m8962k8583L054L4926M9557M2100J6686j7835m4609n2370l7418
630g1131n331K9905N0899M8393K2697j3751m3919n3932l9158n859K9139N0696
642a352N0014K7665n915l6467n0582m1479j3461K0432M6413N1381L2309j483l4715
655D2760n1936m6213j9175J4943M1253M7645L1833K560k8033m6407m4296k1662
667g6728R940L7508M7470L7236Q995k2874m2285m1246k1530Q600L4464M4413L4135
$$ plain form
680 58098 66904 47600 9414 -31220 -55806 -53180 -24813 15641 49146 59681 41126 1559
692 1559 -40037 -63854 -59607 -29333 11041 44036 53848 37570 2844 -33092 -55175 -52098 -24969
705 -24969 15613 51061 65648 52065 15955 -25594 -53130 -52696 -24671 17051 52627 64862
717 64862 48302 10551 -31806 -59353 -61462 -37233 1817 39055 57755 48312 14977 -27712
729 -27712 -60059 -66267 -42597 577 43701 66989 60677 28014 -15525 -49443 -58905 -39854 -1648
742 -1648 39104 63885 61389 33020 -9771 -47991 -65206 -53022 -17924 23330 52296 54415 29957
755 29957 -10089 -47569 -64830 -54564 -21891 18370 49206 57081 39140 4067 -31937 -51686
767 -51686 -46501 -18124 20205 50912 59127 42145 8038 -27963 -49059 -47031 -23418 10209 37692
$$ packed form
680E8098Q806j9304l8186m0634k4586K626K8367M0454L3505J0535j8555l9567
692A559m1596k3817M247L0274M0374L2995R812j6278l4726l5936k2083L077K7129
705b4969M0582L5448J4587j3583l6110m1549k7536M34K8025M1722L5576J2235
717F4862j6560l7751m2357k7547k109K4229L9050L7238J8700r443l3335m2689
729b7712l2347o208K3670M3174M3124K3288o312l2663m3539l3918r462J9051L8206
742a648M0752K4781k496k8369m2791l8220j7215J2184L5098M1254K8966K119k4458
755B9957m0046l7480j7261J0266L2673M0261L0836P875j7941l5073l6004j9749
767e1686N185K8377L8329L0707Q215j6982l4107l6001k1096K028K3613L3627K7483
$$ plain form
780 37692 47190 33468 3243 -30758 -52756 -51595 -28623 5613 35904 47647 35451 6065
792 6065 -25441 -44799 -42165 -19650 13562 41445 52204 41054 13338 -18923 -41121 -43276 -23797
805 -23797 8133 37701 49747 38882 8289 -27096 -51372 -52920 -31470 2410 32807 46336
817 46336 37838 10393 -21867 -45647 -49545 -31365 1825 35895 55384 51275 24982 -11388 -40778
830 -40778 -49728 -32819 -105 33908 53686 49398 23855 -12046 -42093 -54045 -43070 -14323
842 -14323 19013 42952 45793 26034 -7446 -39075 -54558 -45663 -16620 18855 45191 50997 34226
855 34226 3558 -27038 -43525 -38512 -14980 16299 41533 48829 35260 6437 -24133 -43849
867 -43849 -43349 -23547 5814 31289 39741 28771 3359 -25454 -43626 -43122 -24104 4486 29838
$$ packed form
780C7692R498j3722l0225l4001k1998J161K2972L4236L0291J1743j2196k9386
792F065l1506j9358K634K2515L3212K7883J0759j1150k7716l2261k2198k155J9479
805b3797L1930K9568J2046j0865l0593l5385k4276j548K1450L3880L0397J3529
817D6336q498k7445l2260k3780l898J8180L3190L4070J9489m109k6293l6370k9390
830d0778q950J6909L2714L4013J9778m288k5543l5901l0047j1952J0975K8747
842a4323L3336K3939K841j9759l3480l1629j5483Q895K9043L5475K6336N806j6771
855C4226l0668l0596j6487N013K3532L1279K5234P296j3569k8823l0570j9716
867d3849N00J9802K9361K5475Q452j0970k5412k8813j8172N04J9018K8590K5352
$$ plain form
880 29838 40860 32358 9161 -17622 -35029 -34576 -17288 9819 33173 43049 34495 11153 -15303
893 -15303 -33854 -36006 -21141 4217 27675 38211 30335 6868 -21082 -40877 -42724 -25773 1534
906 1534 26756 38558 31549 9847 -16423 -35268 -38019 -22864 3569 30096 44701 40435 19097
919 19097 -10322 -33853 -40385 -27307 -1270 26262 41839 38302 16341 -12729 -37588 -46225 -36121
932 -36121 -11173 16877 36091 37319 20453 -6888 -32048 -43852 -35494 -11883 17653 39633
944 39633 43973 29822 3169 -22751 -37370 -32856 -13018 13894 35231 41272 28898 3571 -22511
957 -22511 -38643 -37670 -20361 4511 25980 34031 25041 4186 -19681 -35341 -35706 -20027 4313
970 4313 26407 36644 30252 10771 -12495 -28245 -29168 -14987 7274 26693 34922 28124 9193
$$ packed form
880B9838J1022q502k3197k6783j7407M53J7288K7107K3354R876q554k3342k6456
893a5303j8551k152J4865K5358K3458J0536p876k3467k7950j9795j847J6951K7307
906A534K5222J1802p009k1702k6270j8845k751J5155K6433K6527J4605m266k1338
919A9097k9419k3531o532J3078K6037K7532J5577l537k1961k9070k4859q637J0104
932c6121K4948K8050J9214J228j6866k7341k5160j1804Q358K3611K9536K1980
944C9633M340j4151k6653k5920j4619M514J9838K6912K1337O041j2374k5327k6082
957b2511j6132R73J7309K4872K1469Q051q990k0855k3867j5660l65J5679K4340
970D313K2094J0237o392j9481k3266j5750r23J4181K2261J9419Q229o798j8931
$$ plain form
983 9193 -12849 -28347 -30944 -19666 -60 19321 29094 23885 6027 -16418 -32437 -34919 -21877
996 -21877 614 21475 31626 26547 9305 -11989 -27368 -29106 -17155 3520 24252 35385
1008 35385 31758 14635 -8379 -27126 -32927 -23077 -1938 20041 32652 29525 11890 -12103 -31376
1021 -31376 -37506 -28248 -7612 15292 30434 30935 17079 -4763 -25186 -34189 -27162 -7566 16620
1034 16620 34219 36984 24722 1813 -20106 -31515 -27688 -10682 11450 28865 33383 22739
1046 22739 1675 -20095 -33764 -32682 -18249 3687 21942 29565 22090 3753 -16611 -29779
1058 -29779 -29393 -16228 4393 22854 31150 26187 10046 -9014 -23155 -25682 -14904 3387 20786
1071 20786 28846 23958 8090 -11285 -25408 -27762 -18070 -1195 14895 22980 19373 5789 -11498
$$ packed form
983I193k2042j5498k597J1278J9606J9381R773n209j7858k2445j6019k482J3042
996b1877K2491K0861J0151n079j7242k1294j5379j738J1951K0675K0732J1133
1008C5385l627j7123k3014j8747n801R850K1139K1979J2611l127j7635k3993j9273
1021c1376o130R258K0636K2904J5142N01j3856k1842k0423r003P027J9596K4186
1034A6620J7599K765j2262k2909k1919j1409L827J7006K2132J7415M518j0644
1046B2739k1064k1770j3669J082J4433K1936J8255P623p475j8337k0364j3168
1058b9779L86J3165K0621J8461Q296m963j6141j9060j4141k527J0778J8291J7399
1071B0786Q060m888j5868j9375j4123k354R692J6875J6090Q085l607j3584j7287
$$ plain form
1084 -11498 -24846 -27306 -17337 -465 17036 26375 23785 10344 -7056 -21062 -23631 -14094 3134
1097 3134 19981 28660 25081 11218 -7122 -22038 -25979 -18495 -2596 14550 24980 23077 9581
1110 9581 -9252 -25139 -30566 -22965 -5271 14259 26039 26420 14232 -4253 -20293 -26830 -20686
1123 -20686 -4474 14780 28284 30331 19193 691 -17612 -27561 -24159 -9481 8888 23208
1135 23208 26966 17497 -340 -18834 -28984 -27858 -14922 3313 19374 25699 19304 4187 -13366
1148 -13366 -24954 -25129 -13046 4740 20848 28060 22843 8759 -8087 -19901 -22189 -13308 1876
1161 1876 16490 24003 20311 7537 -9235 -21900 -24667 -17238 -2614 12692 20447 17684 6270
1174 6270 -8454 -19475 -21829 -14039 89 14109 22314 20699 10165 -3888 -15771 -19275 -12565
$$ packed form
1084a1498j3348k460R969J6872J7501R339k590j3441j7400j4006k569R537J7228
1097C134J6847Q679l579j3863j8340j4916l941P484J5899J7146J0430j903j3496
1110I581j8833j5887n427P601J7694J9530J1780L81j2188j8485j6040o537O144
1123b0686J6212J9254J3504K047j1138j8502j8303r949L402J4678J8369J4320
1135B3208L758r469j7837j8494j0150J126J2936J8235J6061O325o395j5117j7553
1148a3366j1588j75J2083J7786J6108P212n217j4084j6846j1814k288Q881J5184
1161A876J4614P513l692j2774j6772j2665k767P429J4624J5306P755k763j1414
1174F270j4724j1021k354P790J4128J4020Q205j615j0534j4053j1883l504O710
$$ plain form
1187 -12565 955 14925 22830 20284 8998 -6597 -18986 -22643 -15980 -2813 11223 19464 17750
1200 17750 6984 -7816 -19875 -24263 -17406 -3550 12070 21977 21974 12146 -3163 -16386 -21760 -16366
1214 -16366 -2948 12985 23509 24312 14558 -1201 -16108 -23650 -20214 -7805 7617 19312 21767
1227 21767 13264 -1425 -16418 -24848 -23018 -11239 4469 17823 22938 17069 3700 -11196 -20885
1240 -20885 -20408 -10057 5447 18930 24425 19378 6684 -7941 -18296 -19703 -11738 1223 13714
1253 13714 19744 16611 5459 -8307 -19319 -21988 -15149 -2285 10641 18201 16249 6044 -6826
1266 -6826 -16216 -18315 -11641 415 12586 19272 17633 9290 -3026 -12693 -16296 -11050 -163 11365
1280 11365 18048 16578 6974 -5742 -15870 -19052 -13653 -2337 9068 15604 13923 5809 -5920
$$ packed form
1187a2565J3520J3970P905k546j1286j5595j2389l657O663J3167J4036Q241j714
1200A7750j0766j4800j2059m388O857J3856J5620R907lr828j5309j3223n374N394
1214a6366J3418J5933J0524Q03r754j5759j4907p542L436J2409J5422J1695K455
1227B1767q503j4689j4993q430J830J1779J5708J3354N115n869j3369j4896r689
1240b0885M77J0351J5504J3483N495n047j2694j4625j0355j407P965J2961J2491
1253A3714O030l133j1152j3766j1012k669O839J2864J2926P560j952j0205j2870
1266f826r390k099O674J2056J2171O686j639q343j2316r667l603N246J0887J1528
1280A1365O683j470r604j2716j0128l182N399J1316J1405O536j681q114j1729
$$ plain form
1293 -5920 -15742 -18642 -13141 -1983 10366 18561 18273 10245 -2151 -13126 -17156 -12732 -1436 10943
1307 10943 19527 19283 10493 -2673 -14408 -19831 -16624 -6218 6369 15934 17130 10150 -2515 -14575
1321 -14575 -20969 -18484 -8282 5108 16201 19634 13946 2281 -9676 -17290 -16266 -7575 5188
1334 5188 16350 20472 16094 4959 -7905 -16936 -17600 -10452 1299 11762 16756 13515 3874 -7879
1348 -7879 -17163 -18435 -12339 -1336 9908 15590 14632 6527 -4512 -13221 -15115 -9534 786 11323
1362 11323 16928 15624 7791 -2531 -11081 -13719 -9470 -742 8418 13886 12994 5538 -4831 -13001
1376 -13001 -16360 -12130 -2953 6922 12589 12039 5526 -4659 -12530 -14812 -10508 -1044 8864 15056 14742
1391 14742 8147 -1825 -10393 -14044 -10208 -1720 8342 14872 15056 7666 -2814 -12712 -17042 -13851
$$ packed form
1293e920r822k900N501J1158J2349Q195k88q028j2396j0975m030M424J1296J2379
1307A0943Q584k44q790j3166j1735n423L207J0406J2587R565J196o980j2665j2060
1321a4575o394K485J0202J3390J1093L433n688j1665j1957p614J024Q691J2763
1334E188J1162M122m378j1135j2864r031o64P148J1751J0463M994l241r641j1753
1348g879r284j272O096J1003J1244N682r58q105j1039q709j894N581J0320J0537
1362A1323N605j304p833j0322q550k638M249Q728R160N468q92p456j0369q170
1376a3001l359M230R177R875N667n50o513j0185p871k282M304R464R908O192l14
1391A4742o595r972q568l651L836Q488J0062O530J84p390j0480r898m330L191
$$ plain form
1405 -13851 -5200 5584 12835 13775 7790 -2487 -12012 -16807 -14259 -5609 5779 14486 16672 12016
1419 12016 1943 -8209 -14040 -13143 -5512 5439 14100 16828 13087 3184 -7411 -14889 -15148 -9150
1433 -9150 1068 9919 14380 11494 3084 -7089 -14552 -15588 -10448 -395 9391 14825 13229 5750
1447 5750 -3706 -10825 -12893 -8191 163 9155 14621 13559 6993 -2210 -9847 -13109 -9734 -2139 6383
1462 6383 11269 10732 4468 -4119 -11408 -13921 -10620 -3053 5287 10938 10805 5094 -2553 -8934 -11335
1477 -11335 -8354 -984 7238 12872 12535 7082 -818 -8339 -11394 -8628 -1555 6313 11719 11355 5578
1492 5578 -2995 -10511 -13854 -11006 -3912 4396 10652 11415 6405 -1704 -9328 -13493 -11234 -3507 5982
1507 5982 12854 14131 9724 1114 -7552 -12254 -10953 -4379 4607 11546 13967 10040 1681 -7578 -13382
$$ packed form
1405a3851Q651J0784P251R40n985j0277r525m795K548Q650J1388Q707K186m656
1419A2016j0073j0152n831Q97P631J0951Q661K728l741r903j0595p478k59N998
1433i150J0218Q851M461k886q410j0173p463j036N140J0053R786N434j596p479
1447E750r456p119k068M702Q354Q992N466j062o566r203p637l262L375P595Q522
1462F383M886n37o264q587p289k513L301P567Q340N651j33n711p647o381k401
1477a1335K981P370Q222N634l37n453p900p521l055K766P073P868N406l64n777
1492E578q573p516l343K848P094Q308O256P63n010q109p624m165K259P727R489
1507E982O872J277m407q610q666m702J301O574Q986O939K421l927q359r259n804
$$ plain form
1522 -13382 -13652 -7902 937 8843 12564 9431 2291 -6453 -12593 -13406 -8054 441 8702 13274 12208
1537 12208 5144 -3055 -9369 -11403 -7250 737 8038 12645 11581 5479 -2576 -9426 -12170 -8929 -2146
1552 -2146 5085 10012 9390 4338 -3262 -9572 -11953 -8978 -2450 4904 9487 9883 5597 -1079 -7224
1567 -7224 -9580 -6825 -803 6087 10493 10433 6121 -924 -6855 -9892 -7787 -2137 4649 9092 8935 4512
1583 4512 -2594 -8847 -11391 -9459 -3479 3741 8815 9827 5479 -1255 -7413 -10441 -8304 -2340 5052
1598 5052 10986 12290 8181 910 -6385 -10343 -9082 -3423 3828 9806 11121 7867 680 -7124 -11581
1613 -11581 -11258 -6542 1077 7939 10475 8377 1951 -5600 -10935 -11142 -6561 1408 8475 11983 10265
1628 10265 4589 -2799 -8591 -9855 -6067 52 6968 10940 10011 4552 -3023 -9078 -11275 -8720 -2381
$$ packed form
1522a3382k70N750Q839P906L721l133p140q744o140q13N352Q495Q261M572j066
1537A2208p064q199o314k034M153P987P301M607j064o102q055o850k744L241O783
1552b146P231M927o22n052p600o310k381K975O528P354M583L96m286o676o145
1567g224k356K755O022O890M406o0m312p045n931l037K105N650O786M443j57m423
1583D512p106o253k544J932N980P220N074J012m348o734o158l028K137N964P392
1598E052N934J304m109p271p295l958J261N659P251N978J315l254p187p804m457
1613a1581L23M716P619O862K536k098o426p551n335k07M581P969P067L508j718
1628A0265n676p388n792j264L788O119O916L972r29n459p575o055k197K555O339
$$ plain form
1643 -2381 4275 8773 8468 3603 -2669 -8240 -10696 -7859 -2083 4521 8787 9165 5549 -265 -5906
1658 -5906 -8219 -6600 -1253 4802 8651 9281 5695 -182 -6411 -8789 -7508 -2433 3357 7683 7664 4083
1674 4083 -1900 -7240 -9663 -7868 -2674 3214 7758 8626 5237 -441 -5628 -8679 -7118 -1621 4428
1689 4428 9409 10102 6848 779 -5646 -8985 -7809 -3316 3151 7900 9080 5852 -127 -6689 -10563
1704 -10563 -9730 -5404 1414 7020 9342 7027 1495 -5168 -9266 -9126 -4944 1891 7837 11013 9105
1719 9105 3501 -3005 -7708 -8852 -5654 -73 6190 9453 8437 3068 -3098 -8632 -10093 -7286 -1591
1734 -1591 4299 8026 7710 3706 -1884 -7126 -8939 -6772 -1535 4333 8476 8883 5396 -344 -5182
1749 -5182 -7542 -5850 -1255 3805 7854 7865 4691 -360 -5385 -8044 -7010 -2668 2315 6049 6794 3914
$$ packed form
1643b381O656M498l05m865o272n571k456K837N776O604M266L78l616n814n641
1658e906k313J619N347O055L849O30l586n877o229k378J281N075N790M326j9l581
1674D083n983n340k423J795N194N888M544Q68l389n678n187l051J561N497O049
1689D428M981O93l254o069o425l339J176M493O467M749J180l228n979o562l874
1704a0563Q33M326O818N606K322k315n532o663m098J40M182O835N946L176j908
1719I105n604o506m703j144L198N581O263L263j016n369o166n534j461K807N695
1734a591N890L727l16m004n590n242j813K167N237N868M143M07l487n740m838
1749e182k360J692M595N060M049J1l174n051n025k659J034M342M983L734P45k880
$$ plain form
1765 3914 -1132 -6163 -8116 -6511 -2452 2961 6877 7322 4703 72 -4378 -6697 -5674 -1656 3488
1780 3488 7225 8246 5649 179 -5174 -7888 -7033 -3108 2409 6621 7169 4418 -397 -5915 -8675
1795 -8675 -8067 -4209 1596 6439 8157 5931 1103 -4195 -7390 -7402 -3746 1769 7246 9333 7723 2788
1811 2788 -2682 -7110 -7795 -5011 101 5297 8147 7020 2683 -2959 -7786 -8966 -6704 -1438 3875
1826 3875 7332 7234 3954 -1556 -6022 -7569 -5882 -1079 3679 7720 8373 5506 165 -4685 -6835 -5653
1842 -5653 -1533 2943 6615 7240 4332 -734 -5388 -7287 -6862 -2732 1746 5152 5812 3853 -282 -4582
1858 -4582 -6904 -5905 -2197 2428 6080 6874 5093 618 -3556 -5677 -5036 -1661 2735 6164 7083 4385
1874 4385 321 -4137 -6587 -6338 -3023 1508 5215 5877 4045 -188 -4856 -7244 -6383 -3263 1476 5686
$$ packed form
1765C914n046n031j953J605M059N413L916M45k619m631m450k319J023M018N144
1780C488L737J021k597n470n353k714Q55L925N517M212N48k751m815n518k760
1795h675O08L858N805M843J718k226m828n298l195j2L656N515N477K087j610m935
1811B788n470m428o85K784N112N196K850j127m337n642m827j180K262N266N313
1826C875L457r8l280n510m466j547J687M803M758M041O53k867n341m850k150J182
1842e653M120M476L672O25k908n066m654j899M25M130M478L406O60j959m135m300
1858d582k322R99L708M625L652P94j781m475m174k121O41L375M396L429R19k698
1874D385m064m458k450K49L315M531L707O62j832m233m668k388Q61L120M739M210
$$ plain form
1890 5686 7020 5907 1609 -3298 -6359 -6275 -3400 1960 5786 8126 6559 2306 -2707 -6638 -7144 -4509
1906 -4509 -97 4299 6821 6160 2274 -2823 -7091 -8343 -5704 -938 3697 7042 6583 3492 -1258
1921 -1258 -5264 -6895 -5240 -1100 3818 6841 7500 4838 239 -4196 -6465 -5629 -1915 2379 5592
1936 5592 6204 3541 -636 -4883 -6946 -6179 -2844 1344 4512 5733 3848 41 -3394 -5865 -5296 -2359
1952 -2359 1845 5420 6380 4718 1099 -2726 -5122 -4878 -1837 1794 4682 5740 4064 353 -3576
1967 -3576 -5732 -5875 -3117 937 3925 5005 3655 157 -3612 -5817 -5652 -2980 1601 4970 6272
1982 6272 5131 1506 -2390 -5115 -5205 -2713 1317 5135 6383 5226 1645 -2728 -5791 -6412 -4181 -17
1998 -17 3718 5593 4624 1646 -2546 -5774 -6670 -4568 -622 3393 6390 6193 3031 -1251 -4651 -5968
$$ packed form
1890E686J334j113m298m907l061Q4K875N360L826K340j567m253n013l931n06K635
1906d509M412M396K522o61l886n097m268j252K639M766M635L345m59l091m750
1921a258m006j631J655M140M918L023O59k662m599m435k269Q36L714M294L213
1936E592O12k663m177m247k063P67L335M188L168J221j885l807l435k471N69K937
1952b359M204L575R60j662l619l825k396K44L041L631K888J058j676l711l929
1967c576k156j43K758M054K988J080j350l498l769k205J65K672M581L369J302
1982F272j141l625l896k725r0K492M030L818J248j157l581m373l063o21K231M164
1998a7L735J875r69k978m192l228q96K102L946M015K997j97l162m282l400j317
$$ plain form
2014 -5968 -4445 -827 3669 6186 6484 3854 -386 -4063 -6300 -5068 -1886 1633 4911 5546 3248
2029 3248 -336 -4222 -6408 -5584 -2473 1157 4305 5205 3586 586 -2696 -4712 -4744 -2096 1437 4420
2045 4420 5528 4359 1412 -2148 -4525 -4140 -2115 1305 3604 4909 3684 375 -3104 -5014 -5183
2060 -5183 -2741 674 3241 4332 3471 819 -2570 -4358 -4492 -2400 1285 4296 5557 4470 1433
2075 1433 -2168 -4312 -4171 -2287 1292 3768 5083 4233 959 -2467 -4964 -5643 -3723 -482 2798 4774
2091 4774 4068 1364 -1944 -4434 -5587 -3959 -461 3407 5672 5332 2859 -776 -3920 -5356 -3838
2106 -3838 -482 2918 5476 5470 3320 -585 -3911 -5524 -4472 -2083 1818 4233 4762 3006 -275 -3520
2122 -3520 -5141 -4990 -2233 1255 3962 4918 3905 837 -2165 -4382 -4232 -1580 1407 4042 5026 4128
$$ packed form
2014e968J523L618M496K517K98k630m240l677k237J232L182L519L278O35k298
2029C248l584l886k186Q24L111L630L148R00j619l000l282k016l2K648L533K983
2045D420J108j169k947l560k377L85K025L420K299J305j225l309l479j910j69
2060e183K442L415K567J091q61k652l389j788j34K092L685L011J261j087l037
2075A433l601k144J41J884L579K476J315q50l274l426k497o79J920L241L280J976
2091D774p06k704l308k490j153J628L498L868K265l40k473l635l144j436J518
2106c838L356L400K558ok150l905l326j613J052K389L901K415N29j756l281l245
2122c520j621J51K757L488K707R56j013l068l002k217J50K652K987K635R84q98
$$ plain form
2138 4128 1169 -1871 -3903 -4340 -2174 588 2988 3950 2714 564 -2473 -4493 -4394 -2661 32 2972
2154 2972 3863 3114 854 -1719 -3474 -3681 -2030 827 3216 4455 3912 1251 -1385 -3144 -3895 -2465
2170 -2465 212 2843 4091 3514 767 -2077 -4110 -4550 -3334 -267 2457 4083 3598 1357 -1446 -3894
2186 -3894 -4565 -3129 -379 3089 5090 4648 2497 -502 -3082 -4378 -3341 -717 2538 4638 4647 2537
2202 2537 -696 -3439 -5021 -4128 -1772 1126 3564 4154 2419 -30 -2779 -4729 -4428 -2129 1023 3903
2218 3903 4684 3582 1136 -1969 -3597 -3504 -1866 1119 3219 4004 3501 1055 -1867 -3730 -4181 -2694
2234 -2694 -70 2143 3239 2717 642 -1796 -3638 -4034 -2592 -170 2369 3529 3097 1311 -1330 -2400
2250 -2400 -3200 -1740 788 2372 3688 3331 1588 -947 -3005 -3386 -2338 -306 2034 3041 2902 845
$$ packed form
2138D128k959l040k032m37K166K762K400R62j236k150l037k020R9J733K693K940
2154B972Q91p49k260k573j755k07J651K857K389J239n43k661k636j759p51J430
2170b465K677K631J248n77k747k844k033m40J216L067K724J626m85k241k803k448
2186c894o71J436K750L468K001m42k151k999k580j296J037K624L255K100Rk110
2202B537l233k743j582Q93K356K898K438N90j735k449k749j950L01K299L152K880
2218C903P81j102k446l105j628R3J638K985K100P85n03k446k922j863m51J487
2234b694K624K213J096n22k075k438j842l96J442K422K539J160m32j786k641j070
2250b400q00J460K528J584J316l57j743k535k058l81J048K032K340J007j39k057
$$ plain form
2266 845 -1522 -3372 -3999 -2395 -397 2004 3236 3282 1478 -1194 -2873 -3271 -2384 -74 2600 3943
2282 3943 3884 1900 -945 -2894 -3425 -2939 -582 1980 3840 3629 2028 -803 -3190 -4264 -3559 -1327
2298 -1327 1267 2987 3582 2457 -96 -2308 -3534 -3584 -1579 1083 3246 3952 3158 647 -1869 -3272
2314 -3272 -3435 -1823 674 2778 3755 3017 798 -1564 -3361 -3754 -2271 -379 2051 2974 2574 635
2330 635 -1440 -2708 -3269 -2102 126 1995 3025 3140 1446 -877 -2423 -2798 -1741 62 1840 2966
2346 2966 2688 1024 -773 -2401 -2980 -2071 -139 1444 2314 2063 967 -1160 -2539 -3243 -2096 -119
2362 -119 1718 2803 2500 1462 -476 -2255 -2609 -1770 -93 2004 3009 3537 1401 -502 -2207 -2629
2378 -2629 -2266 -526 1418 2709 2730 1418 -816 -2868 -3724 -2882 -1194 925 2879 2969 2151 -290 -1966
$$ packed form
2266H45k367j850o27J604J998K401J232M6j804k672j679l98Q87K310K674J343
2282C943n9j984k845j949n31M86K357K562J860k11j601k831k387j074P05K232
2298a327K594J720N95j125k553k212j226n0K005K662K163P06p94k511k516j403
2314c272j63J612K497K104R77p38k219k362j797l93J483J892K430R23m00j939
2330F35k075j268n61J167K228J869J030J15j694k323j546l75J057J803J778J126
2346B966k78j664j797j628n79R09J932J583Q70k51j096k127j379p04J147J977
2362a19J837J085l03j038j938j779l54Q39J677K097J005N28k136j903j705m22
2378b629L63J740J944J291K1j312k234k052q56Q42J688K119J954R0q18k441j676
$$ plain form
2395 -1966 -3074 -2755 -1178 993 2914 3474 2717 676 -1226 -2835 -2979 -1508 581 2185 3345 2363
2411 2363 748 -1246 -2923 -3027 -2281 -132 1763 2364 2227 1061 -921 -2542 -2930 -2005 83 1890
2427 1890 2837 2734 1663 -432 -1643 -2214 -1576 -302 1758 2572 2385 1131 -938 -2237 -2832 -2087 -490
2444 -490 760 1944 1778 964 -637 -2072 -2592 -1863 -95 1144 2388 2575 1283 -234 -1439 -2230 -1605
2461 -1605 -372 1402 2558 2626 1346 -302 -1945 -2556 -2121 -661 935 2379 2069 1055 -312 -2133
2477 -2133 -3005 -2540 -1355 985 2262 2776 1849 197 -1588 -2368 -2232 -742 1096 2325 2767 1792 374
2494 374 -1220 -2633 -2771 -1108 710 1853 2423 1932 140 -1418 -2788 -2669 -1807 -116 1644 2598 2223
2511 2223 838 -709 -1798 -2253 -1675 -309 1653 2479 2242 1604 -251 -1591 -2208 -1615 -421 1236 2060
$$ packed form
2395a966j108L19J577K171J921N60p57k041j902j609j44J471K089J604J160r82
2411B363j615j994j677j04P46K149J895O01j37j166j982j621l88R25K088J807
2427A890R47j03j071k095j211n71O38J274K060Q14j87j254k069j299n95P45J597
2444d90J250J184j66q14j601j435n20P29J768J239J244J87j292j517j205p91O25
2461a605J233J774J156O8j280j648j643o11M35J460J596J444l10j014j367j821
2477b133q72M65J185K340J277N14r27j652j785p80J36J490J838J229M42r75j418
2494C74j594j413j38J663J818J143N70m91j792j558j370J19Q62J691J760R54l75
2511B223j385j547j089m55N78J366J962Q26k37o38j855j340o17N93J194J657Q24
$$ plain form
2528 2060 2020 974 -264 -1918 -2314 -2090 -869 911 1535 1930 550 -310 -1539 -1804 -1279 -437 1013
2545 1013 1809 2279 1246 -59 -1180 -1914 -1182 -342 1182 1779 1816 1391 -161 -1759 -2175 -1836 -626 860
2563 860 1555 1525 1049 -235 -1600 -2306 -1727 -806 741 2040 2562 1663 51 -1220 -1782 -1743 -613 714
2581 714 2099 2261 1884 466 -1252 -2295 -2490 -1519 90 1693 2312 1620 282 -1219 -2206 -2566 -1701
2598 -1701 -293 1576 2238 2008 1203 -417 -1673 -1972 -1388 -4 1137 2202 2204 1018 -306 -1637 -2164
2615 -2164 -1460 -426 995 1660 1685 1158 -146 -1197 -2188 -1739 -487 505 1619 1655 1167 -271 -1071 -1637
2633 -1637 -1382 -503 810 1763 1915 1129 -130 -622 -1598 -1278 -531 513 1557 1413 883 -232 -1020 -1625
2651 -1625 -1549 -920 315 1330 1613 810 -41 -1293 -1722 -1387 -509 584 1723 1888 1204 229 -736 -1764
$$ packed form
2528B060m0j046j238j654l96K24J221J780O24L95j380q60j229k65N25Q42J450
2545A013P96M70j033j305j121p34P32Q40J524N97L7m25j552j598m16L39J210J486
2563H60O95l0m76j284j365p06N79R21J547J299N22q99j612j271n62L9J130J327
2581G14J385J62l77j418j718j043j95R71J609J603O19o92j338j501r87l60Q65
2598a701J408J869O62k30q05j620j256k99N84J384J141J065Kj186j324j331n27
2615b164P04J034J421O65K5n27j304j051r91M49J252R92J114L6m88j438q00n66
2633a637K55Q79J313R53J52p86j259m92r76L20P47J044J044j44n30j115p88o05
2651a625P6O29J235J015K83q03q51j252m29L35Q78J093J139J65o84r75r65j028
$$ plain form
2669 -1764 -1614 -373 393 1723 1769 1219 177 -1255 -1923 -1762 -1091 -260 878 1605 1253 402 -894 -1832
2687 -1832 -1983 -1354 -126 1164 1566 1736 814 -306 -1296 -1632 -1098 -293 1071 1656 1815 1051 -27 -1433
2705 -1433 -1948 -1407 -650 667 1338 1359 791 112 -1118 -1493 -1526 -755 333 1125 1438 1296 283 -1012 -1186
2724 -1186 -1041 -285 347 1383 1552 1157 184 -790 -1200 -1271 -635 297 945 1496 1079 79 -807 -1602 -1073
2743 -1073 -549 390 1213 1220 1057 55 -825 -1025 -1244 -707 151 1469 1357 925 325 -772 -1152 -1204 -768 397
2763 397 1006 1370 1228 137 -926 -1492 -1094 -987 -340 900 1413 1180 330 -570 -1105 -1680 -1092 220 1140
2782 1140 1515 1485 750 71 -1290 -1630 -1002 11 780 1258 1704 932 -215 -1177 -1505 -1229 -365 275 1071
2801 1071 1379 804 8 -1102 -1525 -1443 -475 416 1102 1379 1055 383 -803 -1188 -1094 -459 466 1152 1485 980
$$ packed form
2669a764J50J241P66J330M6n50j042j432o68J61O71Q31J138P27l52q51j296r38
2687a832j51O29J228J290M02J70r22j120r90l36N34Q05J364N85J59p64j078j406
2705a433n15N41P57J317O71K1n68o79j230l75l3P71J088P92L13j42j013j295j74
2724a186J45P56O32J036J69l95r73r74m10p1O36R32O48N51m17j000q86p95N29
2743a073N24R39Q23Pj63j002q80k00k19N37Q58J318j12m32o00j097l80n2M36J165
2763C97O09L64j42j091j063n66L98J07O47J240N13k33q50r00n35n75N88J312R20
2782A140L75l0p35o79j361l40O28J013P69M78M46p72j147r62l28K76Q64O40P96
2801A071L08n75p96j110m23Q2R68Q91O86K77l24o72j186l85R4O35R25O86L33n05
$$ plain form
2821 980 166 -598 -1154 -1302 -574 280 952 1032 650 146 -501 -1010 -1259 -603 36 513 1088 757 519 -171
2841 -171 -1072 -891 -322 98 980 1058 1025 588 -432 -1073 -1036 -570 185 740 877 598 193 -694 -1176 -1234 -858
2862 -858 -120 961 949 1220 182 -452 -507 -988 -757 153 913 1213 1229 472 -332 -805 -931 -1037 -71 729
2882 729 1019 881 274 -85 -1021 -1149 -1415 -372 418 560 1244 625 -69 -524 -1261 -940 -395 335 1225 1299
2902 1299 1164 135 -406 -1067 -1002 -325 221 816 1022 845 468 -310 -1034 -790 -465 -95 611 879 965 563
2922 563 -495 -577 -983 -410 75 543 923 878 260 -269 -851 -763 -425 144 701 723 1008 492 -143 -643 -793
2943 -793 -442 159 665 766 596 68 -582 -792 -686 -599 38 486 863 873 329 -375 -651 -880 -600 272 622
2964 622 1039 837 554 -133 -701 -870 -687 -374 476 1024 809 488 -175 -1046 -1094 -671 -125 334 601 990
$$ packed form
2821I80q14p64n56j48P28Q54O72Q0l82n04o47n09k49O56O39M77N75l31k38o90
2841a71r01J81N69M20Q82P8l3m37j020o41L7M66P55N55J37k79m05q87m82n8L76
2862h58P38J081j2K71j038o34n5m81K31R10P60L00J6p57q04m73j26j06R66Q00
2882G29K90j38o07l59r36j28k66J043P90J42O84o19o94m55p37L21N45P30Q90P4
2902A299j35j029n41o61O5O77N46N95K06j77l77p78p24K44L25L70P06K68Q6m02
2922E63j058q2m06N73M85M68L80m5o18n29n82Q8L38N69N57K2K85n16o35n00j50
2943g93L51O01N06J01j70n28o50k10J06Q7O37M48L77J0n44p04k76k29K80Q72L50
2964F22M17k02k83o87n68j69J83L13Q50N48k15l21o63q71m8M23N46M59K67L89
$$ plain form
2984 990 393 -91 -767 -889 -554 -408 316 831 986 724 522 -258 -867 -627 -367 213 615 892 534 -15
3004 -15 -538 -867 -734 -637 -141 323 929 573 20 -609 -901 -946 -690 258 379 1040 769 341 -95 -488 -604
3025 -604 -418 107 539 610 389 315 -570 -749 -699 -580 -47 337 675 500 98 -224 -274 -529 -559 -19 528 676
3047 676 642 375 -310 -599 -634 -280 -110 566 963 653 311 -112 -655 -720 -568 138 404 396 696 237 -130 -561
3069 -561 -739 -982 -5 518 993 990 732 -176 -663 -856 -750 -176 133 683 707 678 210 -665 -917 -702 -411
3090 -411 161 627 734 507 142 -615 -777 -666 -669 -145 535 917 540 230 -220 -443 -579 -355 78 438 802
3111 802 465 356 -62 -659 -780 -379 -269 484 684 455 197 -36 -490 -525 -174 0 379 380 594 413 -69
3132 -69 -509 -604 -220 -214 337 253 686 218 -302 -421 -664 -98 54 197 550 675 124 -24 -293 -501 -536 -17
$$ packed form
2984I90n97m84o76j22L35J46P24N15J55k62k02p80o09K40K60N80M02K77l58n49
3004a5n23l29J33R7M96M64O06l56n53o29k92m5K56R48J21O61k71m28m36l93j16
3025f04J86N25M32P1k21p4q85j79N0J19N33L84L38j75m02l22n0k55l0N40N47J48
3047F76l4k67o85k89l5L54J70O76L97l10l42m23n43o5J52P06K66qL00m59l67m31
3069e61j78k43R77N23M75lk58r08m87j93J06N74L09N50K4k9m68q75k52K15K91
3090d11N72M66J07k27l65p57j62J11lN24O80L82l77l10m50k23j36K24M33L60L64
3111H02l37j09m18n97j21M01J10P53K00k29k58k33m54l5L51J74L79JK14j81m82
3132f9m40r5L84ON51q4M33m68n20j19k43N66J52J43L53J25n51j48k69k08l5N19
$$ plain form
3154 -17 520 509 924 81 -126 -561 -802 -286 -494 355 508 802 584 -129 -514 -475 -486 -94 217 527 799
3175 799 303 208 -542 -486 -436 -595 100 512 419 617 40 -271 -731 -674 -111 71 264 504 266 -56 -255 -661
3197 -661 -492 -298 42 514 674 885 334 -211 -612 -699 -242 182 474 736 611 154 -22 -627 -853 -414
3217 -414 -187 107 509 347 261 -128 -428 -533 -623 -34 416 573 177 223 -89 -368 -537 -215 -12 270 498
3238 498 410 68 -134 -602 -443 -691 -233 412 563 331 389 -39 -513 -758 -545 108 359 605 546 312 35
3259 35 -650 -483 -460 -55 224 605 738 651 -60 -689 -415 -475 -362 380 822 735 373 417 -558 -667 -788 -658
3281 -658 -184 588 803 675 194 -59 -190 -275 -248 153 979 716 375 256 13 -611 -562 -310 33 257 591
3302 591 513 242 -19 -494 -891 -667 -125 285 719 289 271 -122 -298 -440 -370 173 292 548 617 602 -188 -523
$$ packed form
3154a7N37j1M15q43k07m35k41N16k08Q49J53K94k18p13l85L9j1L92L11L10K72
3175G99m96r5p50N6N0j59O95M12r3J98n77l11m60N7N63J82J93K40k38l22j99m06
3197f61J69J94L40M72J60K11n51n45m01q7M57M24K92K62j25m57j76o05k26M39
3217d14K27K94M02j62q6l89l00j05r0N89M50J57l96M6l12k79j69L22K03K82K28
3238D98q8l42k02m68J59k48M58O45J51k32N8m28m74k45K13O53K51K46n9k34k77
3259C5o85J67K3M05K79L81J33q7p11o29K74o0J13P42M42q7l62M4r75j09j21J30
3281f58M74P72K15j28m81k53j31q5K7M01Q26k63l41j19k43o24M9K52L43K24L34
3302E91p8k71k61m75l97K24N42M10M34m30j8l93j76j42P0N43J19K56O9j5p90l35
$$ plain form
3324 -523 -520 -374 75 227 451 560 214 -108 -597 -391 -378 -265 233 321 257 472 -226 -387 -416 -302 -249 253
3346 253 622 402 342 219 -494 -560 -507 -99 406 570 697 223 107 -340 -956 -426 -348 212 619 711 434 -267
3368 -267 -323 -677 -595 -363 323 640 715 430 308 -229 -700 -388 -242 66 589 679 785 570 -28 -628 -757
3389 -757 -530 -124 383 494 426 185 -324 -525 -652 -473 26 533 803 382 231 102 -205 -423 -325 132 12
3410 12 353 490 385 88 -530 -612 -563 -17 280 437 349 30 -174 -329 -433 -404 -113 306 528 538 253 155
3432 155 -438 -543 -250 145 483 557 502 574 -7 -279 -183 -393 -256 224 550 764 504 -193 -405 -700 -670 25
3454 25 170 394 462 421 -148 -411 -826 -472 -53 215 739 609 364 -16 -650 -569 -896 -370 305 514 844
3475 844 634 441 -213 -360 -682 -499 16 502 725 574 343 -232 -406 -645 -395 -133 233 662 332 294
$$ packed form
3324e23LJ46M49J52K24J09l46l22m89K06J3J13M98Q8o4K15o98j61k9J14N3N02
3346B53L69k20o0j23p13o6N3M08N05J64J27m74j16m47o16N30P8N60M07R2k77p01
3368b67n6l54Q2K32O86L17P5k85j22n37m71L12J46L08N23R0J06k15n98o00j29
3389g57K27M06N07J11o8k41n09k01j27J79M99N07K70m21j51j29l07k18R8M57j20
3410A2L41J37j05k97o18q2M9N46K97J57q8l19k04j55j04K9K91M19K22J0k85r8
3432A55n93j05K93L95L38P4n5P2n81k72R6k10J37M80L26K14k60o97k12k95L0O95
3454B5J45K24O8m1n69k63m15L54M19K68N24j30k45l80o34Q1l27N26O75K09L30
3475H44k10j93o54j47l22J83N15M86K23j51k31n75j74k39K50K62L66M29l30l8
$$ plain form
3495 294 62 -612 -673 -567 -285 -30 589 440 40 -76 -485 -395 -462 -268 191 189 454 517 -170 -625 -784 -538
3517 -538 -348 165 236 518 106 -188 -179 -183 -404 -53 157 377 615 279 -241 -366 -759 -580 -108 -140 557 639
3539 639 222 60 -369 -639 -581 93 19 558 264 499 280 -538 -640 -504 -164 579 656 663 493 33 -415 -685
3561 -685 -728 -269 341 571 615 697 -181 -408 -510 -973 -461 -136 569 389 655 174 -279 -404 -460 -277 343
3582 343 368 484 297 419 -221 -291 -621 -731 146 423 625 668 192 -167 -278 -440 -473 -423 122 475 296 204
3604 204 -151 -354 -721 -387 72 471 652 793 378 80 -432 -524 -321 -155 584 582 293 437 -121 -497 -455
3625 -455 -641 -352 304 288 378 85 -482 -518 -697 -410 -64 182 603 587 299 17 -481 -559 -677 33 229 538
3647 538 622 467 -245 -516 -714 -471 -24 172 366 549 343 86 -507 -879 -884 -320 -73 272 413 653 218
$$ packed form
3495B94k32o74o1J06K82K55O19j49m00j16m09R0o7J94M59kK65O3o87m55j59K46
3517e38J90N13P1K82m12k94Rmk21L51K10K20K38l36n20j25l93J79M72l2O97Q2
3539F39m17j62m29k70N8O74p4N39k94K35k19q18j02J36L40P43P7Pj70m60m48k70
3561f85m3M59O10K30M4Q2q78k27j02m63N12L25P05j80K66m81m53j25n6J83O20
3582C43K5J16j87J22o40p0l30j10Q77K77K02M3m76l59j11j62l3N0N45L53j79r2
3604B04l55k03l67L34M59L99J81J41m15k98n12r2K03J66P39kk89J44n58l76M2
3625d55j86K89O56j6R0k93n67l6j79K87L46K46M21j6k88k82m98p8j18P10J96L09
3647E38Q4j55p12k71j98K43M47J96J94J83k06k57n93l72nN64K47L45J41K40m35
$$ plain form
3668 218 -423 -382 -815 -398 113 572 722 647 214 -257 -648 -701 -364 178 336 619 762 269 -149 -272 -715
3689 -715 -654 -168 120 867 589 184 -212 -522 -424 -216 -258 488 589 531 398 85 -378 -232 -226 -64 199 234
3711 234 496 553 -195 -190 -664 -708 -67 187 568 485 221 -347 -529 -446 -595 -176 264 564 612 474 -63 -343
3733 -343 -271 -539 -70 424 615 742 302 -32 -367 -480 -393 -110 84 261 445 481 124 -592 -415 -619 -366
3754 -366 -54 458 460 294 -45 -490 -517 -766 -381 17 578 743 596 457 -40 -419 -745 -422 -65 438 403
3775 403 248 59 118 -729 -623 -733 -447 476 411 469 287 -187 -521 -355 -572 -274 306 415 663 101 -415
3796 -415 -220 -499 -188 -61 284 388 408 524 -122 -334 -557 -372 -276 148 29 278 272 -176 -531 -469 -597 11
3818 11 -17 372 712 294 6 -544 -572 -478 -177 475 233 252 658 -153 -76 -625 -871 -294 -80 324 719 113
$$ packed form
3668B18o41M1m33M17N11M59J50p5m33m71l91n3L37N42J58K83J43m93m18j23m43
3689g15O1M86K88P47k78m05l96l10R8K08m2P46J01n8j33l13m63J46OJ62K63L5
3711B34K62N7p48Nm74m4O41K54L81q3k64n68j82Q3j49M19M40L00M8j38n37k80
3733c43P2k68M69M94J91J27m40l34l35j13Q7K83J94J77J84L6l57p16J77k04K53
3754c66L12N12Kj66l39m45k7k49L85L98N61J65j47j39m97l79l26L23L57N03l5
3775D03j55j89N9q47J06j10K86R23o5N8j82m74l34J66k17K98N80J09K48n62n16
3796d15J95k79L11J27L45J04K0J16o46k12k23J85R6M24j19K49om48l55O2j28O08
3818A1k8L89L40m18k88n50k8R4L01O52k42J9M06q11P7n49k46N77K14M04L95o06
$$ plain form
3840 113 7 -387 -503 -650 -518 163 314 621 569 248 -194 -320 -633 -344 80 504 505 225 162 -191 -279 -481
3862 -481 -405 86 375 393 581 286 -264 -645 -482 -655 -16 382 471 473 480 124 -340 -628 -449 -30 84 692
3884 692 364 573 120 -343 -633 -354 -119 179 607 347 553 -223 -454 -377 -391 -322 61 451 406 292 61
3905 61 -228 -207 -402 -52 62 538 572 261 342 -408 -237 -438 173 236 267 504 331 -59 38 -794 -627 -195
3927 -195 206 234 579 652 42 -331 -350 -683 -449 109 472 788 462 133 -276 -533 -546 -46 -124 442 441 433 165
3950 165 -178 -451 -609 -299 -48 245 792 818 72 -15 -818 -947 -615 155 317 816 387 489 -9 -338 -413
3971 -413 -174 -192 429 520 508 389 -84 -398 -208 -334 -439 290 299 561 315 -230 -463 -640 -391 -240 94 287
3993 287 459 241 117 -248 -476 -371 -189 133 343 574 376 -32 -266 -556 -548 -217 -203 334 524 52 -187
$$ packed form
3840A13j06l94j16j47J32O81J51L07n2l21m42j26l13K89M24M24Jk80o3l53q8k02
3862d81P6M91K89J8J88k95n50l81J63j73O39L98Q9KPl56m64k88J79M19J14O08
3884F92l28K09m53m63k90K79K35K98M28k60K06p76k31P7j4O9L83L90m5j14k31
3905F1k89K1j95L50J14M76L4l11Q1p50J71k01O11O3L1K37j73l90R7q32J67M32
3927a95M01K8L45P3o10l73j9l33K34N58L63L16l26l29m09k57j3N00p8N66jqk68
3950A65l43k73j58L10K51K93N47K6p46q7q03j29L32P70J62M99m29J02m98l29p5
3971d13K39j8O21R1j2j19m73l14J90j26j05P29RK62k46n45k33j77K49J51L34J93
3993B87J72k18j24l65k28J05J82L22K10K31j98m08k34k90QL31J4N37J90m72k39
$$ plain form
4014 -187 -192 -227 -698 -445 -52 474 480 81 56 -372 -411 -721 -7 133 397 336 362 343 -410 -368 -500 -295 179 270
4038 270 444 471 -82 -212 -472 -649 -276 -82 213 415 423 235 -222 -678 -769 -302 39 389 651 649 66 -219
4060 -219 -267 -183 -291 -10 438 499 667 378 -30 -258 -464 -550 -453 187 470 554 302 -59 -370 -503 -492 25
4082 25 281 553 899 353 225 54 -226 -414 -238 379 410 656 422 79 -331 -569 -270 -476 156 383 434
4103 434 479 -71 -208 -378 -645 -258 257 254 366 412 81 -423 -369 -378 -554 72 431 537 287 416 -239 -447
4125 -447 -618 -466 -15 144 637 107 133 -165 -515 -675 -311 -74 346 516 320 462 -140 -620 -671 -801 113
4146 113 133 527 575 463 -96 -257 -612 -579 428 344 688 405 394 70 -693 -711 -625 -372 49 247 478 78
4168 78 80 -416 -334 -658 -326 151 577 477 329 52 -386 -165 -435 -302 -54 569 591 275 215 -204 -477 -552
$$ packed form
4014a87nl5m71K53L93N26Ol99k5m28l9l10P14J40K64o1K6j9p53M2j32K05M74R1
4038B70J74K7n53j30k60j77L73J94K95K02Qj88m57m56r1M67L41L50K62kn83k85
4060b19m8Q4j08K81M48O1J68k89m08k28k06q6R7O40K83Q4k52l61l11j33J1N17
4082B5K56K72L46n46j28j71k80j88J76O17L1K46k34l43m10k38K99k06O32K27N1
4103D34M5n50j37j70k67L87N15lJ12M6l31n04N4rj76O26L59J06k50J29o55k08
4125d47j71J52M51J59M93n30K6k98l50j60L64K37M20J70j96J42o02m80n1j30R14
4146A13K0L94M8j12n59j61l55L3J007q4L44k83j1l24p63j8Q6K53M21J98K31m00
4168G8Km96Q2l24L32M77M26j00j48k77m38K21k70J33K48O23K2l16o0m19k73p5
$$ plain form
4190 -552 -207 -227 229 370 322 253 -104 -419 -768 -36 10 209 244 118 386 -267 -826 -367 -196 161 204 460
4212 460 482 199 -36 -599 -78 -159 -74 250 517 479 68 -226 -681 -329 -512 -41 233 437 607 228 -78
4233 -78 -604 -436 -436 -307 275 713 174 323 -230 -545 -309 -397 -115 263 387 595 477 -137 -806 -286 -548
4254 -548 -373 80 401 653 222 223 -354 -427 -509 -56 -76 523 657 593 -85 -325 -405 -622 -128 107 392 392 222
4277 222 -65 -218 -341 -434 -133 -141 234 380 555 289 -194 -190 -732 -406 -3 330 454 561 326 -13 -287 -313
4299 -313 -37 89 -10 475 477 103 -236 -728 -473 -297 2 174 302 451 519 -76 -587 -298 -195 141 370
4320 370 522 475 171 87 -622 -436 -341 67 559 428 397 327 -104 -326 -423 -270 -105 157 558 515 223 -224
4342 -224 -606 -491 -506 -244 352 -81 464 213 34 -245 -309 -469 -256 147 550 587 409 131 -179 -523 -622
$$ packed form
4190e52L45k0M56J41m8o9l57l15l49P32M6J99L5j26K68o53n59M59J71L57M3K56
4212D60K2k83k35n63N21q1Q5L24K67l8m11k94m55L52j83M71K74K04J70l79l06
4233g8n26J68%J29N82M38n39J49n53l15K36q8K82L78J24K08j18o14o69N20k62
4254e48J75M53L21K52m31Jn77p3q2M53k0N99J34o4o78k40q0k17M94K35K85%j70
4277B22k87j53j23r3L01qL75J46J75k66m83Mn42L26M03L33J24J07k35l39k74k6
4299c13K76J26r9M85Kl74l39m92K55J76K99J72J28J49O8n95n11K89J03L36K29
4320C70J52m7l04q4p09J86R5M08M92j31l1p0m31k22r7J53J65K62M01m3k92m47
4342b24l82J15j5K62N96m33N45k51j79k79o4j60K13M03M03L7j78k78l10l44r9
$$ plain form
4363 -622 -202 68 451 369 568 -51 -133 -628 -790 -262 58 365 720 380 118 -325 -381 -272 -208 13 180
4384 180 339 354 347 45 -61 -520 48 -109 408 579 507 44 -102 -273 -476 -328 -218 122 237 639 -134
4405 -134 -218 -527 -175 -376 -92 20 337 -63 244 -140 -315 -402 -393 -84 85 401 439 -80 -221 -668 -420 -116
4427 -116 -4 -87 452 578 234 -79 -236 -435 -504 176 125 503 311 412 93 -186 -339 -324 -268 196 419 676
4449 676 414 107 -270 -621 -470 -181 363 222 188 278 12 -477 -465 -683 -338 28 38 209 561 215 178 -467
4471 -467 -662 108 140 33 431 490 121 -263 -179 -639 -354 171 254 464 481 285 -274 -535 -415 -305 20 45
4493 45 74 364 391 -36 -590 -388 -389 42 230 443 529 261 -135 -133 -239 -59 -93 328 -6 141 12 -262 -128
4516 -128 -325 -345 -84 56 539 307 304 -102 -407 -460 -401 133 144 557 382 176 -85 -58 -440 -517 2 83 134
$$ packed form
4363f22M20K70L83q2J99o19q2m95j62N28L20L07L55l40k62m43n6J09O4K21J67
4384A80J59J5pl02j06m59N68j57N17J71p2m63j46j71k03J48J10L40J15M02p73
4405a34q4l09L52k01K84J12L17m00L07l84j75q7RL09J69L16L8n19j41m47K48L04
4427a16J12q3N39J26l44l13j57j99o9O80n1L78j92J01l19k79j53J5N6M64K23K57
4449F76k62l07l77l51J51K89N44j41l4R0k66m89J2k18L45L66J0J71L52l46l7o45
4471d67j95P70L2j07L98N9l69l84Q4m60K85N25Q3K10J7j96n59k61J20J10L25K5
4493D5K9K90K7m27n54K02jM31J88K13Q6k68l96Kj06J80l4M21l34J47j29k74J34
4516a28j97k0K61J40M83k32lm06l05n3N9N34J1M13j75k06k61K7l82p7N19Q1N1
$$ plain form
4539 134 326 288 -8 -63 71 -418 -117 -140 97 396 488 247 -236 -419 -651 -115 -260 111 752 234 308 -54
4561 -54 -308 -219 64 45 240 430 350 199 15 -355 -728 -96 256 97 136 727 25 100 -194 -180 -305 -325 14
4584 14 333 264 126 -59 -322 -527 -190 63 -234 254 445 352 95 -161 -64 -286 54 339 388 125 135 282
4606 282 -350 -123 -437 -242 20 355 186 269 -249 -145 -461 -27 -94 219 294 364 526 159 -7 -298 -336 -324
4628 -324 106 39 72 316 -77 23 -159 -229 -287 97 204 429 423 209 -287 -357 -335 32 10 422 108 372 315
4651 315 -345 -130 -229 -25 94 598 241 422 157 -204 -176 -499 -146 -209 93 297 369 395 20 -406 -549 -241
4673 -241 -106 108 289 132 292 42 -493 -70 -566 -381 190 156 261 546 138 -349 -265 -295 -220 90 217
4694 217 437 174 294 -104 -424 -316 -163 -58 240 370 106 -121 -311 -220 -505 -127 31 305 226 140 77
$$ packed form
4539A34J92l8k96n5J34m89L01k3K37K99R2k41m83j83k32N36j45L71O41n18P4l62
4561e4k54Q9K83j9J95J90q0j51j84l70l73O32L52j59L9N91p02P5k94J4j25k0L39
4584A4L19o9j38j85k63k05L37K53k97M88J91r3k57k56R7k22L40K85M9k63J0J47
4606B82o32K27l14J95K62L35j69Q3n18J04l16M34o7L13P5P0J62l67j66k91l8J2
4628c24M30o7L3K44l93J00j82p0n8L84J07K25ok14m96p0K2L67k2M12l14K64n7
4651C15o60K15r9K04J19N04l57J81k65l61K8l23L53o3L02K04P2K6l75m26j43L08
4673b41J35K14J81j57J60k50n35M23m96J85N71l4J05K85m08m87Q4l0P5L10J27
4694B17K20k63J20l98l20J08J53J05K98J30k64k27j90R1k85L78J58K74p9q6o3
$$ plain form
4715 77 -416 -133 -172 -307 -45 308 455 193 -104 -192 -542 -297 -12 248 253 381 260 160 -307 -337 50 -239
4737 -239 107 195 632 317 31 -71 -103 -268 106 -93 328 320 296 131 115 -323 -293 -458 -10 -67 259 311 385
4760 385 -240 -463 -188 -388 -102 -23 273 222 -7 86 -59 -253 -350 -52 117 154 148 566 65 -274 -273 -390 -210
$$ packed form
4715G7m93K83l9j35K62L53J47k62k97q8l50K45K85K60NJ28j21j00m67l0L87k89
4737b39L46Q8M37l15k86j02l2j65L74j99M21qk4j65j6m38L0j65M48n7L26N2P4
4760C85o25k23K75k00K86P9K96n1k29R3j45j94r7K98J69L7oM18n01l39Jj17J80
$$ [...]
8191d3
##END NTUPLES=NMR FID
##END=
