##TITLE=1H_PR190_rm
 D2O, 8 sc, 
 2.3.2020
##JCAMPDX= 6.0         $$ Bruker NMR JCAMP-DX V2.0
##DATA TYPE= NMR FID
##DATA CLASS= NTUPLES
##ORIGIN= UXNMR, Bruker Analytische Messtechnik GmbH
##OWNER= root
$$ XWIN-NMR		Version 3.5
$$ Mon Mar  2 14:31:26 2020 Russian Standard Time (UT+4h)  she@DPX200
##.OBSERVE FREQUENCY= 200.1315
##.OBSERVE NUCLEUS= ^1H
##.DELAY= (6, 6)
##.ACQUISITION MODE= SIMULTANEOUS
##.ACQUISITION SCHEME= undefined
##.AVERAGES= 8
##.DIGITISER RES= 18
##SPECTROMETER/DATA SYSTEM= spect
##.PULSE SEQUENCE= zg30
##.SOLVENT NAME= CDCl3
##.SHIFT REFERENCE= (INTERNAL, CDCl3, 0, 15.7039)
##AUDIT TRAIL= $$ (NUMBER, WHEN, WHO, WHERE, WHAT)
$$ ##TITLE= Audit trail, XWIN-NMR		Version 3.5
$$ ##JCAMPDX= 5.01
$$ ##ORIGIN= Bruker BioSpin GmbH
$$ ##OWNER= she
$$ F:/spectra/data/she/nmr/H-F/1/audita.txt
$$ ##AUDIT TRAIL=  $$ (NUMBER, WHEN, WHO, WHERE, WHAT)
(   1,<2020-03-02 14:30:25.90 +0400>,<she>,<DPX200>,
      <created by zg, POWCHK disabled, PULCHK disabled
       configuration hash MD5:
       00 E9 B6 7A A2 85 ED C7 34 08 36 98 17 FE 4E 26
       data hash MD5: 16K
       B9 F0 78 47 89 18 F8 7B 9D 62 1E 05 32 15 08 54>)
$$ ##END=
$$ 
$$ hash MD5
$$ E8 48 0D 7E 67 98 1E 68 E0 6D 4C B0 AD 46 C5 46
##$RELAX= 
##$RELAX= 
##$RELAX= 
##$RELAX= 
##$RELAX= 
##$RELAX= 
$$ Bruker specific parameters
$$ --------------------------
##$DU= <F:/spectra>
##$EXPNO= 1
##$NAME= <H-F>
##$PROCNO= 1
##$TYPE= <nmr>
##$USER= <she>
##$AMP= (0..31)
100 100 100 100 100 100 100 100 100 100 100 100 100 100 100 100 100 100 
100 100 100 100 100 100 100 100 100 100 100 100 100 100 
##$AQSEQ= 0
##$AQ_mod= 1
##$AUNM= <au_zg>
##$AUTOPOS= <>
##$BF1= 200.13
##$BF2= 200.13
##$BF3= 200.13
##$BF4= 200.13
##$BF5= 200.13
##$BF6= 200.13
##$BF7= 200.13
##$BF8= 200.13
##$BYTORDA= 1
##$CFDGTYP= 0
##$CFRGTYP= 5
##$CHEMSTR= <none>
##$CNST= (0..31)
1 1 145 1 1 1 1 1 1 1 1 1 1 1 1 1 1 1 1 1 1 1 1 1 1 1 1 1 1 1 1 1 
##$CPDPRG= <>
##$CPDPRG1= <>
##$CPDPRG2= <>
##$CPDPRG3= <>
##$CPDPRG4= <mlev>
##$CPDPRG5= <mlev>
##$CPDPRG6= <mlev>
##$CPDPRG7= <mlev>
##$CPDPRG8= <mlev>
##$CPDPRGB= <>
##$CPDPRGT= <>
##$D= (0..31)
0 1.2 0 0 0 0 0 0 0 0.06 0 0.03 0 0 0 0 0.0002 0 0 0 0 0 0 0 0 0 0 0 0 
0 0 0 
##$DATE= 1583145025
##$DBL= (0..7)
120 120 120 120 120 120 120 120 
##$DBP= (0..7)
150 150 150 150 150 150 150 150 
##$DBP07= 0
##$DBPNAM0= <>
##$DBPNAM1= <>
##$DBPNAM2= <>
##$DBPNAM3= <>
##$DBPNAM4= <>
##$DBPNAM5= <>
##$DBPNAM6= <>
##$DBPNAM7= <>
##$DBPOAL= (0..7)
0.5 0.5 0.5 0.5 0.5 0.5 0.5 0.5 
##$DBPOFFS= (0..7)
0 0 0 0 0 0 0 0 
##$DE= 6
##$DECBNUC= <off>
##$DECIM= 24
##$DECNUC= <off>
##$DECSTAT= 4
##$DIGMOD= 1
##$DIGTYP= 9
##$DL= (0..7)
0 120 120 120 120 120 120 120 
##$DP= (0..7)
150 150 150 150 150 150 150 150 
##$DP07= 0
##$DPNAME0= <>
##$DPNAME1= <>
##$DPNAME2= <>
##$DPNAME3= <>
##$DPNAME4= <>
##$DPNAME5= <>
##$DPNAME6= <>
##$DPNAME7= <>
##$DPOAL= (0..7)
0.5 0.5 0.5 0.5 0.5 0.5 0.5 0.5 
##$DPOFFS= (0..7)
0 0 0 0 0 0 0 0 
##$DQDMODE= 0
##$DR= 18
##$DS= 0
##$DSLIST= <SSSSSSSSSSSSSSS>
$$ [...]
##$SUBNAM2= <"">
##$SUBNAM3= <"">
##$SUBNAM4= <"">
##$SUBNAM5= <"">
##$SUBNAM6= <"">
##$SUBNAM7= <"">
##$SUBNAM8= <"">
##$SUBNAM9= <"">
##$SW= 24.9337058887773
##$SWIBOX= (0..15)
0 0 2 0 0 0 0 0 0 0 0 0 0 0 0 0 
##$SW_h= 4990.01996007984
##$TD= 16384
##$TD0= 1
##$TE= 0
##$TE2= 300
##$TE3= 300
##$TEG= 300
##$TL= (0..7)
0 120 120 120 120 120 120 120 
##$TP= (0..7)
150 150 150 150 150 150 150 150 
##$TP07= 0
##$TPNAME0= <>
##$TPNAME1= <>
##$TPNAME2= <>
##$TPNAME3= <>
##$TPNAME4= <>
##$TPNAME5= <>
##$TPNAME6= <>
##$TPNAME7= <>
##$TPOAL= (0..7)
0.5 0.5 0.5 0.5 0.5 0.5 0.5 0.5 
##$TPOFFS= (0..7)
0 0 0 0 0 0 0 0 
##$TUNHIN= 0
##$TUNHOUT= 0
##$TUNXOUT= 0
##$USERA1= <user>
##$USERA2= <user>
##$USERA3= <user>
##$USERA4= <user>
##$USERA5= <user>
##$V9= 5
##$VALIST= <valist>
##$VCLIST= <CCCCCCCCCCCCCCC>
##$VD= 0
##$VDLIST= <DDDDDDDDDDDDDDD>
##$VPLIST= <PPPPPPPPPPPPPPP>
##$VTLIST= <TTTTTTTTTTTTTTT>
##$WBST= 1024
##$WBSW= 4
##$XGAIN= (0..3)
0 0 0 0 
##$XL= 0
##$YL= 0
##$YMAX_a= 507819
##$YMIN_a= -368556
##$ZGOPTNS= <>
##$ZL1= 120
##$ZL2= 120
##$ZL3= 120
##$ZL4= 120
##$ABSF1= 10
##$ABSF2= 0
##$ABSG= 5
##$ABSL= 3
##$ALPHA= 0
##$AQORDER= 0
##$ASSFAC= 0
##$ASSFACI= 0
##$ASSFACX= 0
##$ASSWID= 0
##$AUNMP= <proc_1d>
##$AZFE= 0.1
##$AZFW= 0.1
##$BCFW= 1
##$BC_mod= 2
##$BYTORDP= 1
##$COROFFS= 0
##$CY= 11.3945322036743
##$DATMOD= 1
##$DC= 2
##$DFILT= <>
##$DTYPP= 0
##$F1P= 16.9975609425685
##$F2P= -3.02152046262296
##$FCOR= 0.5
##$FTSIZE= 0
##$FT_mod= 4
##$GAMMA= 1
##$GB= 0.15
##$INTBC= 1
##$INTSCL= 1
##$ISEN= 128
##$LB= 0.24
##$LEV0= 0
##$LPBIN= 0
##$MAXI= 10000
##$MC2= 0
##$MEAN= 0
##$ME_mod= 0
##$MI= 1.114404
##$NCOEF= 0
##$NC_proc= 0
##$NLEV= 6
##$NOISF1= 3.799351
##$NOISF2= 2.8
##$NSP= 1
##$NTH_PI= 0
##$NZP= 0
##$OFFSET= 15.70392
##$PC= 1
##$PHC0= -9795.79
##$PHC1= 19.00082
##$PH_mod= 1
##$PKNL= yes
##$PPARMOD= 0
##$PSCAL= 0
##$PSIGN= 0
##$REVERSE= no
##$SF= 200.130013532006
##$SI= 16384
##$SIGF1= 3
##$SIGF2= 2
##$SINO= 400
##$SIOLD= 16384
##$SREGLST= <1H.CDCl3>
##$SSB= 0
##$STSI= 0
##$STSR= 0
##$SW_p= 3612.71676300578
##$SYMM= 0
##$S_DEV= 0
##$TDeff= 0
##$TDoff= 0
##$TI= <>
##$TILT= no
##$TM1= 0
##$TM2= 0
##$TOPLEV= 0
##$USERP1= <user>
##$USERP2= <user>
##$USERP3= <user>
##$USERP4= <user>
##$USERP5= <user>
##$WDW= 1
##$XDIM= 8192
##$YMAX_p= 0
##$YMIN_p= 0
$$ End of Bruker specific parameters
$$ ---------------------------------
##NTUPLES= NMR FID
##VAR_NAME=  TIME,          FID/REAL,        FID/IMAG
##SYMBOL=    X,             R,               I
##VAR_TYPE=  INDEPENDENT,   DEPENDENT,       DEPENDENT
##VAR_FORM=  AFFN,          ASDF,            ASDF
##VAR_DIM=   8192,          8192,            8192
##UNITS=     SECONDS,       ARBITRARY UNITS, ARBITRARY UNITS
##FACTOR=    0.0002004,     1,               1
##FIRST=     0,             0,               0
##LAST=      1.6414764,     0,               0
##MIN=       0,             -368556,         0
##MAX=       1.6414764,     507819,          0
$$ Real data points
##PAGE= N=1
##DATA TABLE= (X++(R..R)), XYDATA
0@%%%%%%%Qj6J6j6K4l2L2m0N6o4P6r2J08j32J52j76K04k33K71l10L52m01M52n10
31b71N74o45P25q10R05j007J121j248J380j528J692j875K079k301K549k827L144
48A657l507L921m406M981n672O534p628R075j1103J4155j9345L0458r5121J61975
62H5974K89233m8658j81525k01190r3096o9969m1361J3119J59433K42563J93393
73C47916q601j93217k58332j65809j8129J22928J93256J88929R5625l1653j39404
84A33509j73271j44806o7422L1684J31139J82179J50719L1583j17735k13797j92269
95b48487o5345Q7642J73417J61956Q6124O70o6975j12787j32093j00577n163J20307
107a01311J98007J61402K8304j12886j77088j46252n6794L9473J08517J29328
$$ plain form
0 0 0 0 0 0 0 0 0 8 -8 8 -8 16 -16 16 -24 32 -32 44 -48 60 -72 80 -96 108 -125 146 -164 188 -213 239 -271
31 -271 303 -342 383 -427 478 -529 592 -656 724 -804 888 -987 1092 -1209 1340 -1487 1657
48 1657 -1850 2071 -2335 2646 -3026 3508 -4120 4955 -6148 8007 -11338 19120 -76001 85974
62 85974 375207 326549 145024 -56166 -149262 -219231 -260592 -247473 -88040 154523 347916
73 347916 339315 146098 -112234 -278043 -296172 -173244 20012 208941 304566 272913 133509
84 133509 -39762 -184568 -251990 -220306 -89167 93012 243731 275314 157579 -56218 -248487
95 -248487 -313832 -226190 -52773 109183 195307 195977 129002 16215 -115878 -216455 -221618 -101311
107 -101311 96696 258098 286402 173516 -3572 -149824 -206618 -167145 -58628 70700
117G0700R6729K6522n4092j18547j43761j11527j6721J06312J84968J57091L3326
128B31000j01209j56633j15781l8542K0250O3981J12672J43564R7896k9419j57617
139G0162j85944r7967K8949J07998J21394R9515O1199j1185j08522j76108j45703
150b36212k1671J09515J61123J20363M3427k3374p5806j19893j32101p3125M9826
161a97928J63691J85122R9330l0659j20168j34688r7362m1507K2812R2166J39561
172H0370J24189L4178q4032j58808j49509p0727K9415J05291J33755J08273L6273
183A88668n5885j24467j32198p6016Q731Q4639J23906J17347O5145k1399j04914
194G3557j40580j00888q949Q3677J27104J06799M4962k8984q7364j12993r4354
$$ plain form
117 70700 167429 193951 139859 21312 -122449 -233976 -250697 -144385 40583 197674 231000
128 231000 129791 -26842 -142623 -181165 -160915 -96934 15738 159302 257198 227779 70162
139 70162 -115782 -213749 -184800 -76802 44592 144107 205306 194121 85599 -90509 -236212
150 -236212 -257883 -148368 12755 133118 176545 153171 77365 -42528 -174629 -247754 -197928
161 -197928 -34237 150885 250215 219556 99388 -35300 -132662 -174169 -151357 -59191 80370
172 80370 204559 238737 154705 -4103 -153612 -224339 -194924 -89633 44122 152395 188668
183 188668 132783 8316 -123882 -199898 -191167 -106528 17378 134725 199870 178471 73557
194 73557 -67023 -167911 -176860 -93183 33921 140720 185682 156698 69334 -43659 -138013
205a38013l4467M1899J00332J11540P0396n194q1876j21424r9948k7109N7711
216a26153J08014J01231N2576o408n1610q0524q5314n4163J6294R4320J26645
227I4908Q3027r690q9312j08978p3711j9757K3517N6300Q0168P7908K9260n0289
239I3351j12248j10907m5907L7771R1264R7200O5409J5500l9736q4611r5192n7073
251a45179J6193Q3114J06770P8765K0949m0877q5639j00252p1138n231O7972J09432
263C4879R1853K7018m6110r1011r6508o5646j2631M8853R6021J03098N9162j7739
275A31239q4109j07073p6811j3110N2133R4173R7834O1660j725o6570j01935q9776
287a04070l6339L1597Q3293R6887O7117N966n9288r9149r3295m5759J9006P2643
$$ plain form
205 -138013 -172480 -130581 -30249 81291 151687 146493 64617 -56807 -156755 -183864 -126153
216 -126153 -18139 83092 135668 129260 77650 -2874 -88188 -142351 -126057 -31737 94908
227 94908 177935 168245 78933 -30045 -103756 -123513 -99996 -43696 36472 114380 143640 93351
239 93351 -18897 -129804 -175711 -137940 -46676 50524 115933 131433 91697 7086 -88106 -145179
251 -145179 -128986 -45872 60898 139663 160612 119735 34096 -66156 -137294 -142525 -74553 34879
263 34879 126732 153750 107640 16629 -79879 -145525 -158156 -109303 -13282 89816 148978 131239
275 131239 47130 -59943 -136754 -149864 -97731 -3558 94276 155936 154211 87641 -14294 -104070
287 -104070 -140409 -108812 -25519 71368 138485 144451 85163 -13986 -107281 -153040 -134034 -61391
299f1391R2804P3401K1912l9074q3964q9698n1904J1302O7985R1927P4721K9020
311A37041k7267p1645q5112n9583m589N3233Q4061P2621K7553k7254o7809p9175
323d7925n8097j4301L7532P3914P5200L8184j8127o3919p5306n2511o958L8859
335g3455O8531P0080M2723n103n2627p4466n8794j4017L7385O8374O6590L5953
347A11174r308n1908p2902o2726k2503K7376O3844O9671M1204n971m9451p1586
359c3086o1989k3986K6403O6364P5845N1115L375m4037o9733o4085k8288K0162
371h1940O0942P6034N5708J0536m1049p3325p3433m1031R104N3808P4452N9639
383H9445J7677l2980o9926p5254m7427J570M9718P5002O8572L1509j9140o0199
$$ plain form
299 -61391 31413 104814 126726 87652 3688 -86010 -137914 -126612 -58627 33300 108021 137041
311 137041 109774 38129 -46983 -106566 -111155 -57922 26139 98760 126313 99059 31250 -47925
323 -47925 -106022 -120323 -82791 -8877 66323 104507 86380 22461 -52845 -105356 -112314 -73455
335 -73455 -4924 65156 107879 102776 50149 -24317 -83111 -97128 -59743 8631 75221 111174
347 111174 101866 49958 -22944 -85670 -108173 -80797 -16953 52718 93922 87951 38500 -33086
359 -33086 -95075 -119061 -92658 -26294 49551 100666 104041 60004 -9729 -73814 -102102 -81940
371 -81940 -20998 55036 110744 121280 80231 6906 -66527 -107558 -98454 -44646 29806 89445
383 89445 107122 74142 4216 -71038 -118465 -116895 -67177 7825 76397 107906 88766 28567
395B8567p3291n2307p489M1971P2232P0613L7953j1056n4733p3729n9967j9735
407a00971K7908O1780O7056M1297l180m6292o9523o1799k7255J9466N6505O7456
419C2448M8165P751l4604o0818n7609k7822J4362M9945O3897M9385J3323k8228
431G0195n5680n7265l3468N292M0616N6167M6218J2755k5311n3225n6363l5086
443h5155K096L6681N3445M6204J7553j8707m6161n1465l2442J994L5888N4824
455A4755M8397K0482j6234m4229n1882l4889j941L1804N0775M6745J9710j6597
467F6896m5925n5662l9526p155K8892N0552M8842K4659j0981m2779n4185m1548
479g7920r233K8582N3781N5060L2010m706l8454n4524m5110j5412K1971M9529
$$ plain form
395 28567 -44724 -97031 -104520 -62549 9683 80296 118249 107193 52460 -21269 -81236 -100971
407 -100971 -73063 -11283 55773 97070 93890 47598 -21925 -83724 -110979 -91513 -35008 32448
419 32448 80613 88364 53760 -7058 -64667 -92489 -78127 -28182 35715 85100 98423 70195
431 70195 14515 -42750 -76218 -70926 -30310 25857 72075 84830 59519 6294 -50069 -85155
443 -85155 -83059 -46378 7067 53271 70824 52117 5956 -45509 -77951 -75957 -40069 14755
455 14755 63152 83634 67400 23171 -28711 -63600 -65541 -33737 17038 63783 83493 66896
467 66896 20971 -34691 -74217 -81372 -52480 -1928 46914 71573 60592 17813 -36372 -77920
479 -77920 -87153 -58571 -4790 50270 82280 77574 39120 -15404 -60514 -75926 -53955 -4426
491d426N4945L6302J14l6458n7447n2690k5667J3451M4543N5651M0211P848k9628
504D6749n3436n3489k9257P571M1618N6689M7603J7660j8945m6730n2726l4870
516g1563j72L5069N4275M8052K0852j4777m3359n1996l9592j0010K3229M6638
528c354M7387K5703q446l8489n0405l9367j1210K0203M2421M6195K9943J227k9034
541C2774m3844l8498j4237J7071L9553M3946K9053J801k5384m1579l8461j8692
553e6497R693L2836M0383K7865J743k4549m0055l7666j8785Q769L1662L9834L0078
566D5311O726j9999l7043l6006j7633R951L2788M0477L1030P465j8811l5770l7053
579b8567k2254L157K8147M0624L3558Q666k1685m0125m0351k3232K553K6334L7786
$$ plain form
491 -4426 50519 86821 86935 50477 -6970 -59660 -85327 -71876 -27333 28318 68529 76377 46749
504 46749 -6687 -60176 -89433 -81862 -40244 16445 64048 81708 62763 16033 -36693 -71563
516 -71563 -71735 -36666 17609 65661 86513 71736 28377 -23619 -63211 -73221 -49992 -3354
528 -3354 44033 69736 61290 22801 -27604 -66971 -78181 -57978 -15557 30638 60581 61808 32774
541 32774 -11070 -49568 -63805 -46734 -7181 36765 65818 67619 42235 656 -37805 -56497
553 -56497 -46804 -13968 26415 54280 56023 31474 -8581 -46247 -65032 -56263 -24601 15233 45311
566 45311 52037 32038 -5005 -41011 -58644 -48693 -15905 24572 55602 63067 44256 8486 -28567
579 -28567 -50821 -47664 -19517 21107 54665 63331 41646 1521 -38830 -62062 -59509 -33175 4611
592D611L4798J5800j1854l5390m2529k9442m93K9121M3908L9489J8781r614l2854
605B4332m1540l2039p124K0585L8820L9987K2491m402k9960m4230l8915j6690
617f8685J4525L9182M2844K5836j588k6240l8151l3810j6984P061L0204M2500
629A6694L6725J2050j8811m1037l9796j9525Q402K9179L5872K8170J0501j1465
641D6959l0320l7489k9757n968K1470L7650L4285J3630j3059l1395l4427k1745
653e0166j222J7534K9682K9680J8659l25k2053l2632k7827p148J7815L3551L0867
666C6415J4800p262k3496k9024k3040q403R930K4290K7669J7102j606k1322l0424
679a4371k6976r928J2604K9156L1551J7962l470k0975k6771k0836o516R378K2776
$$ plain form
592 4611 39409 55209 43355 7965 -34564 -64006 -64499 -35378 8530 48019 66800 57186 24332
605 24332 -17208 -49247 -56371 -35786 3034 43021 65512 61110 31150 -13080 -51995 -68685
617 -68685 -54160 -14978 27866 53702 52114 25874 -12277 -46087 -63071 -56010 -25806 16694
629 16694 53419 65469 46658 5621 -34175 -53700 -45298 -16119 19753 47923 58424 46959
641 46959 16639 -20850 -50607 -56575 -35105 2545 36830 50460 37401 6006 -28421 -50166
653 -50166 -51388 -33854 -4172 25508 44167 43842 21789 -10843 -38670 -45818 -28003 5548 36415
666 36415 51215 43953 20457 -8567 -31607 -40010 -30080 -5790 21879 38981 37375 16053 -14371
679 -14371 -41347 -51275 -38671 -9515 22036 39998 36528 15553 -11218 -32054 -38570 -29192 -6416
692f416K9341K3697M955j8967l3833l1395j2232J1989K8181K8385J6924n44j6267
705B3818k7157k8276j8306J623K3304L4618K8869P402j6662l0822l0153j5423
717d7165M958K2445L2138K7122J1628r230k6128l1341k2975m185J6860L0924L0584
730C5635J5335p792k8189l4309k4399n608J4725K6469K7941J7734N2j8716k9113
743a0235k6455j1968R819K7688L3361K2321J535j8821k8150k3378r628N996J8183
756i732K3813K1319Q246j0742k7336l0577j7855L967K1646K6071J7744L340j0289
769A9615j9083k1305j4559j241J4908K5240K3101R914p345k0680k2858j4393J342
782b7344J5101K2414J9202P032q286j9219k1597j5190k272J0518J9519K0102J0004
$$ plain form
692 -6416 22925 46622 51577 32610 -1223 -32618 -44850 -32861 -4680 23705 40629 40085 23818
705 23818 -3339 -31615 -49921 -48298 -24994 9624 38493 45895 29233 -1589 -31742 -47165
717 -47165 -42207 -19762 12376 39498 51126 41896 15768 -15573 -38548 -42733 -25873 5051 35635
730 35635 50970 43178 14989 -19320 -43719 -49327 -34602 -8133 19808 37542 37594 18878 -10235
743 -10235 -36690 -48658 -38839 -11151 22210 44531 46066 27245 -905 -24283 -33911 -27915 -9732
756 -9732 14081 35400 43646 32904 5568 -25009 -42864 -38897 -17251 8820 26564 29904 19615
769 19615 532 -20773 -35332 -36573 -21665 3575 26676 36590 29245 8565 -14293 -28686 -27344
782 -27344 -12243 10171 29373 36405 28119 8900 -12697 -27887 -30159 -19641 -122 19980 29984
795B9984n338j9749k4522j6549p50J5355K3147J9639Q706m026j5445j9986j6687
808b6221m530J0726K2432K4259J3838m439j9322k5013j9424m709R832K0017K1029
821A8475J3001o64j5171k4012k3009j0371P307K2335K5640J7697J515j3137k2106
834b500k1395j0945M790J8783K5659K0350N694j0983k2048k2708j4964q54J3825
847a7296K3218K1855R669r047k2982k4449j5772q68J2687J9229J9437J2132n63
860B7250j4771k2256j9762n372J1398K2584K2367J1911k658j3957j8389j6236
872a7891o657M687J4825J8711J3937J823j2050k0449j9360q796N406J6033J8614
885H833J1067Q18r781j4862j4228p617K799J2636J8234J5351N124q466j7411j7194
$$ plain form
795 29984 24646 4897 -19625 -36174 -36924 -21569 1578 21217 29923 25897 10452 -9534 -26221
808 -26221 -30751 -20025 2407 26666 40504 36065 16743 -8270 -27694 -32403 -22571 -2554 18475
821 18475 31476 30812 15641 -8371 -31380 -41751 -34444 -12109 13531 31228 32743 19606 -2500
834 -2500 -23895 -34840 -30050 -11267 14392 34742 40436 29453 7405 -15303 -30267 -31121 -17296
847 -17296 5922 27777 37446 28399 5417 -19032 -34804 -35672 -22985 -3756 15681 27813 27250
860 27250 12479 -9777 -29539 -34911 -23513 -929 21438 33349 30691 16734 -1655 -17891
872 -17891 -24548 -19861 -5036 13675 27612 29435 17385 -3064 -22424 -31220 -25814 -9781 8833
885 8833 19900 20718 10937 -3925 -18153 -25770 -22971 -10335 7899 23250 28374 19908 2497 -14697
899a4697p541M811J4047J6198J1029J359q835j4899j5050r729l15J0567J6799
912C744J4904N156q439j8013j7638q808M326J3808J6735J2850N496m153j2597
925G371j7050j3519j287J2360K0508J7274N893p863j6465j7234j2045l353P486
938a7924J5745J7547J0508k875j4458k0260j5896l926Q662J7510J8665J1765K41
951B5304j1089j7497j5547o770N348J4646J8934J4456L072r630j8586j8276r369
964b5004K740J2400J7084J2886L888o939j5150j7172j1709l51J0702J6954J5331
977A5660O749m372j2735j4816j0819j459Q503J5735J4746P594k343j1256j4945
990c758j1883l274O132J2979J3096O458k541j0223j3524j0990m327M652J1518
$$ plain form
899 -14697 -22238 -17427 -3380 12818 23847 25206 16371 1472 -13578 -23307 -23622 -13055 3744
912 3744 18648 23804 15365 -2648 -20286 -29094 -24768 -10960 5775 18625 24121 19968 7371
925 7371 -9679 -23198 -24485 -12125 8383 25657 31550 23687 7222 -10012 -22057 -25410 -17924
938 -17924 -2179 15368 25876 23001 8543 -11717 -27613 -31539 -22877 -5367 13298 25063 25304
951 25304 14215 -3282 -18829 -25599 -20251 -5605 13329 27785 30857 21227 2641 -15635 -25004
964 -25004 -22264 -9864 7220 20106 23994 17055 1905 -15267 -26976 -27327 -16625 329 15660
977 15660 22409 18037 5302 -9514 -20333 -21792 -13289 2446 17192 24786 22443 11187 -3758
990 -3758 -15641 -18915 -12783 196 13292 19750 17209 6986 -6538 -17528 -21855 -17203 -5685
1003e685J3136Q787o41r267j2765j0148k025N826J1239J1843Q802O96p444j2817
1017d63j1826m690N213J1919J2367O943j387q597j2829j1524n586K567J0982J3305
1031F394R378J224q304j2964j2468n299L971J1508J4592J0763K947o763j2604
1044B375j2865p313J312R667J4693J1928M238o126j4169j4879r650m20Q417J3583
1058G91J2305O020l376j1470j4817j0873k172P619J4025J4193Q233p21r549j3364
1072c156j1448m234N052J2283J3285R719N16q153j3799j3101o154J931J0312J2929
1086E982Q977J815o669j1356j2119o592J004Q462J2702J1054L782m452r971j0641
1100h022o018j18P863J0722R864M225l630r015j1006p498j077N939R743Q209L576
$$ plain form
1003 -5685 7451 16238 15597 6330 -6435 -16583 -18608 -12782 -1543 10300 19102 19798 12354 -463
1017 -463 -12289 -16979 -11766 153 12520 19463 18076 9479 -3350 -14874 -20460 -17893 -6911 6394
1031 6394 15772 16996 8692 -4272 -16740 -22039 -18068 -6560 8032 18795 21742 14979 2375
1044 2375 -10490 -17803 -16491 -6824 7869 19797 24035 17909 3740 -11139 -20789 -21209 -12792 791
1058 791 13096 19116 15740 4270 -10547 -21420 -23592 -15973 -1948 12245 20478 19757 10208 -3156
1072 -3156 -14604 -18838 -13786 -1503 11782 21501 22017 13864 65 -13036 -19190 -17259 -6947 5982
1086 5982 14959 16774 10105 -1251 -13370 -19962 -18958 -10496 2206 13260 17042 12590 2619 -8022
1100 -8022 -14040 -14158 -6295 4427 14291 18516 14886 5871 -5135 -12633 -13710 -7771 1972 10181 13757
1115A3757l050q737j0292p208r12O131R415R037M596k310p201r321p016n44O082
1130g573R996R666M466j996q136r615p805j763N224Q961Q984M712k202q084j0955
1145f120q701k632M483R938J0146O289r35o871j0623q745l566N002R816J1277
1159H758Q073Q47o435j0492j0390m860K303Q630J1006Q278K041o005j0562j1700
1173a0508p082M44P478J1036R396L857l506r460j0984p346m02O585J0786J0868
1187A1162N817j709p840j0531p993k777M923R450R878N573m23p341j0331q998
1201a1140l962K850P743R372O036N59n569q542q314l845K262P322R119P171J447
1216A2509l843p434p652l802J456O491P893O190J245l901p393p689m747J019M972
$$ plain form
1115 13757 10707 1970 -8322 -15530 -16442 -10311 -896 8141 12737 10427 3226 -6095 -13111 -13655 -7573
1130 -7573 2423 12089 16555 14559 6423 -3192 -10997 -12760 -7536 1425 10409 15121 12919 4835 -6120
1145 -6120 -14821 -17453 -12970 -3032 7114 13403 12468 5597 -5026 -13771 -17337 -12335 -2519 8758
1159 8758 16831 17678 11243 751 -9639 -14499 -12196 -3566 7440 15718 17759 11754 1192 -10508
1173 -10508 -17590 -17146 -9668 1368 10764 14621 11115 1655 -9329 -16675 -17077 -10492 294 11162
1187 11162 16979 15270 7430 -3101 -11094 -13871 -8948 502 10380 15953 15530 8189 -2142 -11140
1201 -11140 -15102 -12252 -4509 4863 10899 11458 5889 -2653 -10967 -14812 -12550 -5228 3891 11062 12509
1216 12509 8666 1232 -6420 -10222 -8766 -2275 5618 11808 13053 9152 1759 -5930 -10677 -9658 -4686
1231d686P148N764J786m202p140p379m060J120N559Q070O156J992k948o162p139
1246f121l828J002N542Q246O546K005l074p324p840n073p4M979P445O862K265
1261A1558k793p286q735o364n59N046Q221P989M510j588o617q459o619q11M276
1276h231Q338Q720N127l49n557q681p749m003K882P779Q929N602k25n596q377
1291a391p907m496J126O100Q160P270K544l227p853q287m853Q87O103Q398P177
1306I751L036k202o125p395n219j609L818P085P250L554j471o362p847o226j399
1321a1361L310N867O172L634n42m072o286n350j755K596N748O841M381K9l801
1336E411n744n504j184K283N431N014L252k29l934n188n373k918R04N120O312
$$ plain form
1231 -4686 2462 8226 10012 5810 -1330 -8709 -12769 -11649 -6090 1980 8136 10128 7180 1018 -6121
1246 -6121 -9949 -8947 -3405 4841 11387 13392 10318 2994 -4846 -9919 -9993 -5014 2431 9293 11558
1261 11558 8765 1479 -7256 -13620 -14179 -9133 -912 7077 11587 9999 3382 -5077 -11696 -12507 -8231
1276 -8231 107 8827 13954 13605 8048 -633 -8382 -12385 -9503 -1724 7205 12807 12582 6986 -1391
1291 -1391 -9298 -13794 -12668 -6568 1592 8862 11406 8179 326 -7961 -12814 -11927 -5824 2574 9751
1306 9751 12787 10585 4460 -2935 -8154 -9763 -5945 1140 8390 11944 10473 4111 -3736 -9962 -11361
1321 -11361 -8051 -2184 3988 7622 7080 3008 -3278 -8628 -10383 -7787 -2039 4802 9183 9212 5411
1336 5411 -333 -5837 -7021 -4738 693 5707 8959 8730 4796 -392 -5765 -8683 -7779 -2659 3653
1351C653L593l04m983n619m431j059K076M060N515N194J199k774o149o290k317
1366h636K543N782N886M219K59l271n852n982l941R47M483O211M912J297l162
1381E695n796o653l957l76M473P286O768K188k188n559o291l672n33L315O065
1396G65O718M357o70n432p922n537j486K811N836N793L645j98m405o326n888k905
1412a0844J221N237O882M795J017l104n752n560k400J210M345N905M748J799j747
1427G752m867n714l669r5L364M762M390K070j885m248n903l883o80L135N438M208
1443D175J044j533k905l392k794j369J630M794N833K651j499m244n126j573M79
1458c829K047K651L199K249M41l698n427m241j311L238M997L429J133q38l010
$$ plain form
1351 3653 7246 6942 1959 -3660 -8091 -9150 -7074 -3014 2501 7695 8894 6120 -29 -6319 -8636
1366 -8636 -6093 -311 5575 9794 10053 6782 930 -5052 -8993 -8046 -3563 2648 7560 8857 5695
1381 5695 -101 -6754 -10711 -11087 -6614 672 7440 9628 7440 1881 -4410 -8082 -8615 -5300 765
1396 765 7483 11840 11170 5738 -2184 -7721 -9207 -6396 -560 5233 8878 8680 4275 -2051 -7939 -10844
1412 -10844 -9623 -4386 2496 7291 8308 5204 -548 -6108 -8508 -7298 -2953 2952 7700 9499 7752
1427 7752 2885 -2829 -6498 -6593 -3229 1533 5923 7993 6108 1860 -4043 -7926 -8606 -5471 -33 4175
1443 4175 5219 3686 781 -2611 -5405 -6774 -5144 -350 5483 8134 6635 2391 -2735 -4308 -3829
1458 -3829 -1782 869 4068 6317 6758 3060 -2367 -6608 -7919 -4681 316 3745 4878 4040 1030
1473A030m150l378j137K205M962M764K438j37l068m565l872j500J757M733N525
1488E607K949n06m020n526l698j382N35L271M426M089J672l200n353n645k389
1503i170J451M436N449L877J192j710m068m299l547l83K775N638M922L056j454
1518H165n371n758l532j80K523L858L582K428j66k106n336n052k069K448M650
1533a916M926K231p6k072l218l578k080P01L571N077L549j18k433l607l358j936
1549d337k78K231L725L588P42k334m213l504j311R98J768K665K777K094o91l418
1565E02l992k308J594L427L381J716L78p58k231k981k546j89J996L842L041O00
1581E472j909l398l844j468k31J973L365L485J071j395l249l550k072M64K283
$$ plain form
1473 1030 -3120 -6498 -7635 -5430 -468 4296 6734 6597 3529 -1036 -4908 -6408 -4651 82 5607
1488 5607 8556 8050 4030 -1496 -5194 -6576 -6041 -2770 1656 5745 7417 4217 -1136 -6781 -9170
1503 -9170 -7719 -3283 2166 6043 7235 5525 1457 -2842 -6389 -6772 -3997 1641 6563 9619 8165
1518 8165 2794 -2964 -6496 -6676 -4153 -295 3287 5715 5549 3443 -1893 -6945 -9014 -6566 -1916
1533 -1916 3010 5241 5165 3093 -125 -3703 -5783 -5082 -1511 3566 7115 6997 4564 957 -2401 -4337
1549 -4337 -4615 -2384 1341 4929 5671 3337 -876 -4380 -5691 -4693 -2925 -260 2517 4611 3920 502
1565 502 -3490 -5798 -4204 -777 2604 4320 4698 3940 1709 -1272 -3818 -4007 -2011 1831 4872 5472
1581 5472 3563 165 -3679 -5147 -5378 -3405 -40 3445 4516 3121 -128 -3678 -5750 -5286 -3003
1596c003L955L397J613m25l183l749k917l07J922L495L899J836p12l261m235l273
1612d948j157J360K697L657L131N91k320m500m340j169J774L509L865K459J323
1627E932j196l132m167k679J37L343M442K924N39j591k602l353k981j523J584
1642d323L813L889J551j366k894l296k081o06J130K645L570K689K23k209l960
1657a225k159j90J417K446K445J830M0j064l330l315j332J250K616K589J065p3
1673C010j569k642k314j312P64K509K816J677J71j644j975k009q15M94K505K811
1689B477J905J15j592k737k550p62M39K261K347J903J14j967k651l070q21O7K309
1706b213K785K724N24j643k658k998j205Q71K107L076K472J805j056k761l758
$$ plain form
1596 -3003 952 4349 5962 5537 2354 -1395 -4312 -4619 -2697 798 4697 6533 5821 2560 -1675 -4948
1612 -4948 -6105 -4745 -2048 1609 4740 5331 3011 -1489 -5829 -6998 -5224 -1715 2150 4609 5932
1627 5932 4736 1604 -2563 -5242 -5105 -1762 2680 5604 6143 4552 1950 -1403 -4384 -5907 -4323
1642 -4323 -510 3379 4930 3564 670 -2626 -4707 -5313 -4183 -1538 2032 4721 4944 2735 -1225
1657 -1225 -3384 -3574 -2157 289 2734 4564 4604 3540 210 -3105 -4437 -3187 -571 2018 3083 3010
1673 3010 1441 -1201 -3515 -4827 -4063 -1554 1262 2939 3110 1466 -509 -2518 -3333 -2839 -334 2477
1689 2477 4382 4497 2905 168 -2382 -3144 -2705 -444 1903 3806 3920 1953 -698 -3768 -4589 -4522 -2213
1706 -2213 572 3296 3820 2177 -481 -3479 -4684 -3813 -1706 1370 3842 5647 4591 1830 -1928
1721a928k245j08K301L325K238P40n92k001l449k469j532J217L330L554J957q17
1737C521k296k640k419j061R68K759L279K704K33j700k839k656j409J67K256K938
1753A805K321Q61j539k951k732j686l5J741K067K404Q98o63k029k942j950J87
1769d243J886K555K226J237o60j472k092j866m56J428J871K353J345q49j819k202
1785g58j502n87Q42J966J876N79m18j670k224j298k06J008K033K090J256l51j909
1802G27k028p22l28J139K076J944J181m05j727k352k260k81J105J902J963J183
1818C117k69j650k674k028j049J214K322K271J651j00j642j705k196q49O01K162
1834h24K644J735P63j082k652k407j326P4J690K419J927P97p45k574k190k153
$$ plain form
1721 -1928 -4173 -4281 -1980 1345 3583 4323 3731 1730 -1719 -4188 -5720 -4503 -1173 2381 4338 3521
1737 3521 1225 -1415 -3834 -4895 -3927 -1168 2111 4815 5048 3348 509 -2147 -3556 -3389 -1133 1805
1753 1805 4126 4987 3448 497 -2235 -3921 -3956 -2215 -148 2256 3154 2491 462 -2480 -4430 -4243
1769 -4243 -2357 198 2424 3661 3001 1529 -563 -2429 -2885 -1457 414 2767 4112 3263 1444 -758
1785 -758 -2260 -2847 -2005 -39 1837 2416 1998 328 -1896 -3194 -3400 -2392 -359 1731 2987 2636 727
1802 727 -1301 -2023 -2351 -1212 864 2808 3989 3584 1857 -495 -2755 -3036 -1931 -29 1934 3117
1818 3117 2848 1198 -1476 -3504 -4553 -3339 -1017 1254 2905 2805 1163 -542 -2738 -3587 -2986 -824
1834 -824 1820 3555 4318 3236 584 -1823 -3149 -3075 -1385 1034 2961 3758 3013 439 -1751 -3904
1850c904l37J226K378K565J164n12j316k964j247o71J171K173K578J515k66j208
1866B345k022k132r43M23J985J994J147L39j342j676k353r10k3J224K172J779
1882B007L13r28j838j158j163J8J444K032J444P14q01j565j201r43k41J339J483
1899I56J517L84j039j450j734j112n4J165J446J202N03p04j273j735j122J62J419
1916a469J706J677O41q38j060j645j123O4J203J834J697M47p22j672j683j437
1932b380j49P70J600J847J060j078j097j871j900q5O72J932K169J235K15j313
1948A627k080j567r77R90J670K105J487M43j078k188k012r58J67J077J830J535
1964B071N98r76j868j772j243k81J282K008J467J239m98j076j979j195j68Q86
$$ plain form
1850 -3904 -4241 -3015 -637 1928 3092 2580 1264 -1700 -2947 -3618 -2447 -274 2304 3819 3553 2345
1866 2345 323 -1809 -2752 -2329 -344 1650 2797 3136 1794 118 -2235 -3145 -3168 -1944 228 2007
1882 2007 2320 1392 -446 -1604 -2767 -2749 -1305 727 2171 2885 2084 519 -682 -1625 -1866 -527 956
1899 956 2473 2857 1818 368 -1366 -2478 -2532 -1367 79 1281 1784 1080 -193 -1928 -3050 -2888 -1469
1916 -1469 237 1914 2555 1717 657 -988 -2111 -2047 -844 990 2687 3134 2412 740 -943 -2380
1932 -2380 -2529 -1759 -159 1688 2748 1670 573 -1298 -3198 -3283 -2611 -679 1490 2725 2940 1627
1948 1627 -453 -2020 -2997 -2007 -337 1768 3255 3698 2620 432 -1580 -2538 -2371 -1294 536 2071
1964 2071 2669 1693 -175 -1947 -3190 -3471 -2189 -181 1286 2525 2027 951 -1028 -2223 -2391 -1505
1980a505J712J698J094l75q68j740j648p46Q12J425J384O34L89j328j618j185
1996a865p92O13J190J188J127O8p63j075j189j62J54J128J326O64O35n62j185
2013E00j135o93O5J091J035Q08L81r34j213j416q36M41J122J421K93N85r52j244
2031f81q86m36K35N96J915J293J00o52j180j274q03N55J039J003J353K84n72j533
2049C56j580j018J49O09J349J867n6l14j204j811j306J84J014J609J639P98j3
2066B272j224j341j326n71O12J533J615R87J03j091j801j138j182M66R79J719
2082F12J205M81o59j894j657p41K98J001J459J151M85k97o60j144j157n9M80J365
2100B69J233J065n70j041j468n65l80Q18N46Q98O59j32r47j190n93p21O25J211
$$ plain form
1980 -1505 207 1905 2999 2624 1756 16 -1632 -2378 -1566 -141 1243 1877 2266 938 -680 -1865
1996 -1865 -2657 -2044 -854 334 1461 1529 766 -309 -1498 -1660 -1506 -378 948 1612 2247 1685 500
2013 500 -635 -1328 -1263 -172 863 1671 2052 1118 -95 -1511 -2347 -1906 -784 637 930 1515 563 -681
2031 -681 -1567 -2003 -1768 -1172 743 2036 2136 1484 304 -970 -1773 -1218 -179 824 2177 2461 1889 356
2049 356 -1224 -2242 -2093 -1484 -135 1732 1676 1362 158 -1653 -2959 -2775 -1761 -152 1487 2285 2272
2066 2272 1048 -293 -1619 -2190 -1578 -45 1570 2557 2660 1569 -232 -1370 -2552 -2086 -1107 612
2082 612 1817 2298 1639 -255 -1912 -2653 -2355 -1354 105 1256 1741 1444 784 -360 -1517 -1576 -1096 269
2100 269 1502 2567 1997 956 -512 -1077 -1457 -639 -93 805 1464 1332 385 -805 -1398 -2119 -1494 -283
2118b83P74O22k50l81p83p45k15N55J079R23L55j77p57q44p19j84K84P00Q89R60
2138A803l83j025j339n73k19O77P08P31M56L92j008o41j127m35O65J150J544P56
2156B132k74p29j078o93p97K02Q93J285J080J74p10j500j543p55K87R89J384O70
2174A017N55n93q76j476n32r0O95J431J299M69l8j171q30j267l78Q94J185J119
2192A413O38k02r48j254p98p79J84Q02J430J102j52o34j454r85j79K29P01J020
2210A34P59O69m1j096p89o83k21R50J122O27K34m24q25n91r42j46M85P77P30M50
2230A179j66j104r29l41R2L37J042K63M36J70q28o69k10j18N65R07O71o2j20p77
2250C38p62m31K24P1J206L71N23m09q37j222o32J33L66J000Q39K77P3r05q23j082
$$ plain form
2118 -283 491 1113 863 482 -301 -1046 -1261 -706 373 1296 1651 1474 717 -127 -846 -1030 -746 -46 843 1803
2138 1803 1420 395 -944 -1517 -1736 -1059 -351 380 836 1228 220 -421 -1548 -1983 -1318 -168 1376 2132
2156 2132 1858 1129 51 -642 -1439 -1237 -344 941 2021 2195 1485 -15 -1558 -2313 -2026 -1037 347 1017
2174 1017 1572 979 103 -1373 -1905 -1995 -1300 131 1430 1899 1861 690 -140 -1407 -1785 -891 294 1413
2192 1413 2051 1849 901 -353 -1151 -1930 -1746 -944 486 1588 1436 802 -652 -1637 -1816 -1587 -886 134
2210 134 893 1562 1521 425 -364 -1047 -1268 -318 804 1431 1665 1241 416 -175 -1117 -1263 -778 -1 729 1179
2230 1179 1013 -91 -1020 -1361 -1269 -932 110 373 809 979 151 -518 -728 -846 -281 626 1297 1235 1115 338
2250 338 -424 -855 -631 -560 646 1017 1540 1131 294 -928 -1560 -1427 -1061 -61 778 1055 1128 223 -600 -1682
2270a682J46P12J224P03O09k20q34q04o46n06N57Q16J062L88k8p82p65j205p70
2289b025M67N64J313J022J1p37j024n45o03K04P95P44J002P01l54q06j034j008
2307a313J03O88Q76M50O33m52n30n13j169l85K16R39P90K39L09m11p31p96l28
2326a385N02P67M99P63j64k23o03p44l43M18O12N11N72J95l91j067n46m59L20
2345g66Q52J27N96J1m69o25n15m87K03N67R47N84o5p74j44l60m80K24N30O95O19
2366A270L8l99q86q23k53q2R76N46M20m1l97m74q68m67Q1M47J375M02O8j79o87
2387F7r11k46J51L76Q07J008K96k23m05q93j186j16N54P24P33Q87n05o33j010
2406e25n75o50J95R71R84N51L01l14j054p14n67L79N60J064L94N22k78p94n89
$$ plain form
2270 -1682 -1536 -824 400 1103 1712 1492 658 -146 -792 -1298 -741 75 1137 1525 1497 715 -50 -1255 -2025
2289 -2025 -1558 -994 319 1341 1352 615 -409 -954 -1557 -1353 -558 186 1188 1889 1535 729 -305 -1313
2307 -1313 -1210 -522 354 804 1437 985 455 -58 -1227 -1612 -1396 -457 333 572 881 470 -261 -1057 -1385
2326 -1385 -883 -116 383 1146 982 759 156 -588 -931 -513 99 610 1182 1377 986 -81 -627 -1086 -766
2345 -766 86 213 809 820 351 -274 -789 -1276 -1073 -506 441 1025 960 186 42 -318 -798 -574 -44 651 1270
2366 1270 1308 909 23 -800 -1053 -1135 -159 387 807 766 369 -105 -973 -1440 -1359 -912 463 865 933 754 67
2387 67 -844 -1090 -939 -563 244 1252 1548 1325 920 27 -1159 -1275 -721 3 736 1623 1118 485 -525
2406 -525 -1100 -1750 -1555 -584 400 951 1252 938 -116 -830 -1397 -1018 -458 606 1000 1522 1244 450 -139
2425a39o71J96M2P79O18K78m42o95o34k43k42m8J121L45K76J09m80n14k57m27
2445a028M39N35P54J60k4l42m45k14k31j8P18L13O56l11o71m79m81L6J61K41O27
2466C96j51J97l15o40k67j09L87L32Q10J10k7m85l84l30n4P9P26P14L31o28j4
2487F78p35o51m11L27M65P22M26n5n47m05q05j94LN04J052M78k7o7n27o11o73
2508a053l5P27O57P40L43k15n98r24n10j0L28N33P03O87n28p41o08l74m57L83
2528i52P54M49J80O38m74o55n55k04Q8N88O55N81k56O6j024j96m50L9M88L78N03
2549F41J60j76p25o17r4q9K33O67M22p6K3l44o00L5k60N26M26N18r5P3m60k64
2571g6l07j15J85O51L32n8l91l47k42k06j4qM62L30P4l4j1r12n1J8L71P11L59
$$ plain form
2425 -139 -810 -614 -572 207 825 1103 661 -34 -668 -911 -1153 -1201 -80 265 541 650 170 -344 -601 -1028
2445 -1028 -589 -54 700 860 836 494 49 -165 -396 -414 304 617 1273 962 291 -188 -669 -633 -472 -231 396
2466 396 245 442 127 -513 -780 -889 -502 -170 640 750 723 238 -146 -476 -530 -451 275 989 1320 692 678
2487 678 -57 -708 -1119 -792 -327 395 821 766 219 -186 -991 -1185 -1182 -678 374 852 825 758 231 -380 -1053
2508 -1053 -1088 -361 296 1036 1379 1164 566 -358 -868 -878 -550 -17 686 1373 845 104 -504 -878 -1335 -952
2528 -952 -198 251 431 1069 595 -60 -615 -819 -731 -143 512 1093 837 903 -121 -317 -767 -728 -240 138 641
2549 641 801 625 -100 -717 -811 -900 -667 0 422 346 369 25 -575 -540 -800 -274 152 670 575 648 188 -76
2571 -76 -383 -498 -313 338 670 612 221 -126 -368 -574 -588 -596 -134 196 270 236 225 -687 -738 -720 -349 362 721
2594G21l5j36M4p99j60j35J38O16N55O5j41m58n16m95j32L70M66K85M43j50m29
2615A17n39m43k62M90M56N21M31J26k64j028l6j58lN66N79K53K80l75o32n68q5
2636e74n15M21Q55L60J63k72m53k82o85K86k2M85L80N83J30o30l54j90j70N5M49
2657B0N05J09j41J48n96l57k14j22O23K81L76m39j10Qn46N2l43M92J62K28o7L22
2679C91o42j15l1J71J88N57J17r5q6k64o10J56K1k58J136Mm32L9n14l50M4J36
2701d37K15M44K86J53n43m50k86Q9J23K00L02O53P4k63k94l09o43K82P6N21M42
2722F35l0J00p69k02m49j5J6P71J47M19k3p02r0o06J55K48L1O53K84J38l93k01
2744A17o33L9lL34R9N14N30m19l13k96o95J3K19L62N31k84L39m77l75k09j17O15
$$ plain form
2594 721 686 550 594 -205 -365 -500 -362 254 809 874 733 275 -241 -736 -868 -498 -32 253 696 546 117
2615 117 -422 -865 -1127 -637 -181 340 771 897 633 -395 -431 -589 -592 -26 553 806 1086 711 79 -489 -574
2636 -574 -1089 -668 187 547 710 438 -15 -297 -982 -696 -718 -233 147 730 860 230 -124 -314 -484 -429 20
2657 20 525 634 493 641 45 -312 -526 -648 -25 256 632 193 83 91 -455 -403 -746 -254 -92 136 69 391
2679 391 -251 -366 -397 -226 -38 519 636 541 455 191 -419 -263 -242 -500 636 640 208 247 -267 -617 -573 -437
2701 -437 -222 222 508 661 118 -332 -618 -529 -406 -206 96 749 823 560 266 -43 -686 -404 -328 193 635
2722 635 605 705 -64 -266 -715 -730 -714 57 204 623 600 -102 -192 -798 -643 -395 -364 289 573 711 318 117
2744 117 -516 -477 -480 -146 -47 467 997 578 265 -31 -726 -713 -494 -132 399 115 454 -23 -398 -607 -724 -109
2766a09qM73J41l3Qn89n0p5oj51Q88O6M6n35k60J33o54J15L16M62K51j15m06j91
2790b83j04J07l11K89L78J41J21l15j7l80K80j55N90k16K34K78j08l98m71l5Q6
2811b89M23J60j00J13Nq00M2j87J72K75K98N65k37j27m76j75N5k17L91M54K27
2832E72O5m4m41n59J31n46P42K26N55k73K02o06l73j17l61K90N24K23J12J00l19
2853A03l73l47K24l12P68K42L29j53k11j18l90j09k47L56O59k18N75o2o40n44
2873d68J69k36m2L45P65k6l32o4l99j20kJ33M43L38k52N2j09n19l0M23l10M12
2895A71L25j12k43j6l0n57J35M8M55J74n8l24J4j08k28J35o5M23K12K5l62K20
2917B34k17q0k34L50K10J65J45n49j10R2l56M0K97J61M6J12j99j66l69O1K5K02
$$ plain form
2766 -109 -117 356 497 464 472 -117 -167 -242 -248 -399 489 555 601 66 -194 -61 -715 -600 -284 178 429 314 -92 -283
2790 -283 -387 -280 -591 -302 76 217 338 23 6 -374 -94 -249 341 125 359 637 529 131 -340 -375 -289
2811 -289 134 294 194 307 312 -488 -446 -633 -461 -186 112 677 440 313 -163 -338 -283 -500 -109 345 572
2832 572 637 593 152 -407 -276 -822 -80 146 701 428 630 24 -349 -466 -827 -537 -13 210 322 422 103
2853 103 -270 -617 -393 -705 63 305 634 481 270 152 -238 -347 -594 -238 421 203 778 716 76 -468
2873 -468 -299 -535 -577 -232 533 507 175 111 -288 -408 -410 -277 166 504 252 304 195 -324 -354 69 -241 171
2895 171 496 384 141 125 95 -462 -327 -279 176 350 292 -32 -18 -126 -354 -219 -284 139 351 376 14 234
2917 234 17 -63 -297 53 263 428 573 24 -86 6 -350 -310 -13 148 194 306 107 -59 -428 -367 -342 -140
2939a40oK97J93r7P6k87m36JK80K09L32K21j46k49j04k40k05J84q5K63K89R2n81
2962a39R1k38l59J83k91O97J45L19m15J59l90J07j57J52M48L04J3l22K53n98J37
2983I9k21q7K59J63M38m04l8q0m83r7K27j04K42N33q9l92J09Qm42L24L2p9J29
3006D7K98k69K0j58j80J24M1K99L0k17j52K0j47P0K2j40K70K31K01m62J4l42J28
3029b52j02L31K57k18J37n5k56N5J04k59J75J58j2L44Nl25m65J48k1N9L66J52
3051C26k95m2ql27j88J1O0N12K3P06n92j4m09j9J9J19K17K49J08q2j92k51m57
3074e26O6J84j35M87L38km20k54k12j48K97J50K56J51j43J49r5l17j27j68L68
3095a01L59O0k28j56L25l90j35J38N5n6M87k15M3p9l03j75o4N6L06K01j8j65J00
$$ plain form
2939 -140 -146 151 344 247 323 36 -400 -399 -119 90 422 643 497 248 144 -96 -301 -117 -202 61 350 442 -139
2962 -139 -48 -286 -645 -462 -753 -56 89 408 -7 152 -238 -131 -288 -136 312 616 629 307 560 -38 99
2983 99 -122 -209 50 213 651 247 209 129 -354 -451 -224 -328 -86 447 358 -34 75 83 -359 -35 -3 -82 47
3006 47 345 76 96 -62 -242 -118 -77 222 252 35 -117 -97 -244 -174 -152 -292 -22 209 410 -52 -38 -380 -252
3029 -252 -354 -23 234 16 153 98 -158 -103 1 -258 -83 75 63 407 412 87 -378 -230 -251 -192 174 326
3051 326 31 -11 -19 -346 -534 -523 -463 49 72 778 186 172 -237 -256 -237 -118 99 348 456 374 182 -69 -526
3074 -526 -460 -276 -411 76 414 412 -8 -262 -474 -622 -325 -175 81 232 89 238 143 -174 -301 -469 -101
3095 -101 258 318 90 -66 259 -131 -266 -128 -73 -129 358 143 186 107 -196 -371 -435 -379 -73 128 110 -55 45
3118D5k93K31j02P5J37k08P15n10o1q2l8j0NJ15R0K1K05j4l90k56K12J04j58J48
3142a9K62N7l43q6k09N1OO5L20K55J47m21r4q4J78m46M25L51l21J35j63l0j54
3165a18j95J7J21L24k3K94k57j13q7k50k4K35J84k44L74K45l26R6j66l76J57K84
3187A52j92P12n20N6j35m72J23k08Q5K21L56P3j80K36o29k30L4K03K12R2J90j88
3209iL06k67Po1j07J7L37kJ3q9j49O2r0l3R8O4j94K19J69n86K24j15j28K42O2
3234a0M10k79Lm0l23j06M89J80j2J1J18m79R2k22Q3J63l30N11k41L56l42m25j48
3257e41M01R7M8K6L01n12J22j40LJ3L04M6J26k26J07o0jj22J2J85j45j12J73J63
3281B68j42k21j22l37K45J80j17M45m3J83m91j47l17N45j48K99K87o6O8l1l9k05
$$ plain form
3118 45 -248 -17 -119 -44 93 -115 600 90 29 -53 -91 -101 -96 19 109 130 335 321 -69 -325 -113 -9 -167 -19
3142 -19 243 300 -43 -129 -338 -287 -281 -216 104 359 506 85 -9 -93 85 -361 64 415 94 229 66 36 -118
3165 -118 -313 -296 -175 149 126 420 163 50 -37 -287 -311 -76 108 -136 238 483 157 253 87 -289 -132 152
3187 152 -40 672 152 208 73 -399 -276 -484 -399 -178 178 251 71 307 -322 -552 -518 -315 -103 -11 179 -9
3209 -9 297 30 37 -24 -131 -114 223 221 234 145 -4 58 -32 -65 33 97 -97 122 291 -295 -71 -186 -314 -72 -10
3234 -10 400 121 124 84 -239 -345 144 324 312 323 441 -38 54 -168 -85 78 -252 259 18 374 32 -393 -541
3257 -541 -140 -43 5 31 332 -180 -58 -198 -195 -182 122 168 294 68 175 115 114 -8 4 189 44 -68 105 268
3281 268 126 -95 -217 -554 -309 -129 -246 199 156 339 -152 -299 -616 -71 -219 80 367 301 369 338 299 94
3303I4m88J81K94K40j48N5N5n64N1L2k03J22N21j16l8l28OJ28O2k01p2L14M2K14
3327B53j48R1j87j57L0l4L86k54J92r3k7j8k99P8J15o7J17j53K44rn09J05J46
3350a98K01k28N08k23J4J67l46L23j81M1j39K94M6j04j27J2k28o4L56J50n31L11
3372E4Pp2l26K42j18J59Q4r9R6J2j80J66m74K66J44K33M2k52J26j23k5j44J64
3395a8J68m9mJ84p5m4k86Q7m96J48M54Mj39N34j71k21l24M27k75L3J07O9j8M31
3419E26n74M3p0j46j66M36k5J03J98m63K48j9l22q9L70O5l11J83P9mk88J77k47
3442b96M22K87m84K48L0j90j31J48j28J60k72L72O7j58Lj47k06J50NJ05J93j51
3464B7jj64L9j63L02J2l3j47K66j76M38m70RR9r1Q7L68p8j35j45k37L8k40K86
$$ plain form
3303 94 -394 -213 81 321 173 228 283 -281 -230 -198 -401 -279 242 126 88 -240 -234 -106 -44 -245 -317 -3 39 253
3327 253 105 196 9 -148 -118 -152 234 -20 172 79 52 34 -265 -187 -72 -139 -22 -175 69 60 -449 -344 -198
3350 -198 3 -225 283 60 74 241 -105 218 37 78 -61 233 279 175 48 60 -168 -232 124 274 -257 54
3372 54 61 -11 -337 -95 -213 -54 30 -69 27 39 -141 25 -449 -183 -39 194 236 -16 110 -13 -38 -182 -18
3395 -18 150 101 97 281 206 162 -124 -37 -533 -385 69 73 -66 468 297 76 -248 179 -96 -63 44 113 95 526
3419 526 -48 -5 -75 -221 -387 49 24 127 325 -138 110 91 -231 -320 50 115 -196 -13 66 62 -226 -49 -296
3442 -296 126 413 -71 177 207 17 -114 34 -94 66 -206 166 233 75 78 -69 -275 -125 -120 -15 178 27
3464 27 26 -138 -99 -262 40 52 19 -128 138 -38 400 -70 -61 38 -53 34 402 324 189 44 -193 -155 -395 -109
3488a09n1J72J69k42j11P7r5q9M16LL5N7J43n55q0M23k94K11L58L6m93K08j72
3511A7k55J28K21j17l04J10K56J63k15l45N8k8M51o9K8l5k5J76m19K42l21J38
3533a45J54l8L39j39K67l81j83j5J56l47M26P3K07k02j12j95j55K15L4K3L1Qm2
3556b1J30l55K85k90J58L9L79j1p9N5k16k80J78J61k78P2J71k3m6l13K00n7l0
3579a71K12O4l13J57K14l15M8l54K62J30P3K23k10O9k96J95k69J78J63N2N6N8
3601B26j88J73m06j05Q7J17J28O4j13K19j44k6j57J9K12j32L87m48K45j34L98
3622D22n20r2J94J5L41j56p4k26R7k83K05M2J06k06L17m6j85J61k68j9k72L95
3644e2L65Jj42j70L1j50n1J72N0J73j47M5k56M29m71K07K8j70J69p5K52k13L2
$$ plain form
3488 -109 -160 12 181 -61 -172 -95 -190 -279 137 140 175 232 375 -180 -260 163 -131 80 438 474 -19 189 17
3511 17 -238 -110 111 -6 -310 -200 56 219 4 -341 -283 -311 140 71 99 64 39 215 -204 38 -283 -145
3533 -145 9 -29 310 171 438 57 -126 -141 15 -332 94 167 374 172 60 -135 -290 -75 -41 -18 13 21 -21
3556 -21 109 -246 39 -251 -93 -54 325 314 235 290 74 -206 -28 133 -145 -73 98 75 29 -284 -84 -141 -171
3579 -171 41 105 -208 -51 163 -152 -104 -458 -196 -66 7 230 20 89 -207 -12 -281 -103 60 112 168 226
3601 226 38 211 -195 -300 -213 -96 32 96 -17 202 58 32 -125 -106 106 -26 361 -87 158 24 422
3622 422 -98 -190 4 19 360 204 130 -96 1 -282 -77 -35 71 -135 182 136 -49 112 -156 -175 -447 -52
3644 -52 313 314 172 2 33 -117 -168 4 54 227 80 125 -131 298 -173 34 62 -108 61 -14 238 25 57
3667E7q8r9P4j65J36K54k53M21k75l8L2k00K62N6k98K38j89j3MJ34j29M52m76
3690a03l7P1J6q4j52M0m6K51q2kL71j29m08J18J31J64K8j85j55L65P2j82j88J38
3714A2m1j90J62L69L6o8k92O4r1J26l14L33l94M50m7rk33J07k69J44J71k8K58
3737B56k1O4j94k01M7k32j58N28R7K90k36m85K55l94L05P1m66M79K39n4k57q2
3759a49k44J18k4L34J59J19k37m4Lq9J27l9n2J2j13J21J44r9j51M6N1k01J42K49
3783A83j21n3r9k55PJ39K78L0J90k27p9J66k37J17N0j51K16j49K30P2m86J27Q5
3806C3n5m3RK54j57R2k71l1J88j28j10M26j85O0J45o6o71M49l28L01J70J58j88
3829E2J32R9k77r8l22L13J80K48P8l83M90q44o5L31R8l0p8J50p7J6M5j46k75L40
$$ plain form
3667 57 -31 -130 -56 -221 -85 169 -84 337 62 24 56 -144 118 174 -124 114 -75 -88 -84 50 -79 373 -103
3690 -103 -140 -69 -53 -137 -289 -249 -295 -44 -126 -128 243 114 -294 -176 -45 119 147 -38 -193 172 244 62 -126 12
3714 12 -29 -219 -57 312 348 280 -12 52 -39 87 -227 106 -288 162 115 106 -127 -20 -289 -145 26 -2 256
3737 256 235 299 105 -96 -49 -281 -439 89 186 476 240 -245 10 -384 -79 -8 -474 5 244 190 -67 -149
3759 -149 -393 -275 -299 35 194 313 76 32 35 -54 73 34 -18 -6 -119 2 146 47 -104 -58 -7 -208 -66 183
3783 183 62 9 -90 -345 -338 -199 79 109 299 72 -7 159 -78 39 89 -62 154 5 235 307 -179 -52 33
3806 33 -22 -65 -56 198 41 133 -138 -169 19 -109 -219 207 22 82 227 161 -510 -61 -389 -88 82 240 52
3829 52 184 283 6 -92 -414 -101 79 327 405 22 512 -332 -397 -66 32 2 -76 74 -3 13 58 -88 -363 -23
3853b3J11q7L64J75m54j97K79l70L39r7j05K95J84m12J70k63k79R7J12Q9j23J29
3875f6K06k26j66J21j06K36jOL03j15k59o8J80m6J16K17k48L65o97L67m3j33m77
3898e34M97k2J28R8L2j81l49K81L1l0p7K07j69K24L08l24J51k26R6k18K57J72
3920C52l93J42j14j29J93p7o8J66k3K73l91q1j60q1O48p3l41J80R9j17r4K8K5
3943c6J78k89M27q1M3j45QO0l06L24l13K4K01l20K48m52K01k9j77M24k77K92J3
3966A8m9K4k08q8l26M72J6J57m4K27J07l67R0k95J93k1j05K23J28Rl92K23Q4m07
3990c31jJ09N14k65j07Q7J17l25K16J00j05%L75k79J69m96pK47r0J51j19J27K3
4013A10j60O2k2p8J43j26J20j67N2k14L10J34l87L80k65L0j38K2M33j84j22J75
$$ plain form
3853 -23 88 1 365 540 86 -111 168 -202 137 40 -65 230 414 2 172 -91 -370 -273 -161 -72 -195 -66
3875 -66 140 -86 -252 -131 -237 -1 -2 4 307 192 -67 -135 45 -1 115 332 84 449 -248 119 76 -57 -534
3898 -534 -37 -59 69 167 199 18 -331 -50 -19 -49 -126 81 -88 136 444 120 271 45 141 -77 180 352
3920 352 -41 101 -13 -142 51 -26 -94 72 49 322 -69 -150 -310 -391 257 184 -157 23 122 5 -89 -61 -36
3943 -36 142 -147 280 199 242 97 105 165 -141 183 -130 -106 95 -225 23 -429 -228 -257 -434 -10 -287 5 18
3966 18 -31 -7 -215 -303 -629 -157 -141 16 -28 199 306 -61 29 -266 -73 -94 -199 24 152 161 -231 -8 76 -331
3990 -331 -332 -223 291 26 -81 6 123 -202 14 114 9 9 384 105 274 -222 -229 18 -72 79 -40 87 110
4013 110 -50 12 -10 -88 55 -71 49 -118 -66 -280 30 164 -223 157 -108 -78 -216 -194 239 55 -67 108
4035A08o11M28L29k81K44k20m5l3O3J13Q4j48k9J17k54K86k86k17K10L22k44K8
4057c6L15o6k32J33k56J07r2K18r0K0L42j15l53J91k52M2Q2j9J45L9L8k26l16
4080c81J90j16N76q7q8J36l4j65k54J09Qq3L74j69N7l6P1k86P6J43j44j31K06
4103b8J19J13M1n63qN36k87J06j27L14r3l77N9RK93k04K13N8j46P4k16Q0K6k94
4127c02J80M15l87R9N61n95l5J10oO6m24Q77m18p2K12q2j29N0k76L17K7n5k29
4150i6P8j60N0K63k36K09R8k70L80l76k12Q6O2L10m35L32M2k41j61J78p4L49j70
4173FK1m0O4N6k72J51o8J28p4o6j19M05JO6m13N8N0r0M9K53j67q8K40l52K87j56
4199g0J5l49K96K60l08K55j36j33Q8J7P0L41o90M02jL8r0j7m07M01k02PK22K71
$$ plain form
4035 108 -503 -75 254 -27 217 -3 -48 -81 -18 95 179 31 2 119 -135 151 -135 -352 -142 180 -64 -36
4057 -36 279 213 -19 114 -142 -35 -127 91 1 21 363 248 -105 86 -166 -124 -42 -61 84 123 161 -65 -381
4080 -381 -191 -307 269 182 94 230 196 31 -223 -114 -106 -189 185 16 73 37 108 -178 -102 41 -103 -234 -28
4103 -28 91 204 245 -318 -326 210 -77 29 -98 216 123 -254 -195 -186 107 -97 116 174 28 102 -114 -34 -8 -302
4127 -302 -122 293 -94 5 566 -29 -64 46 40 106 -318 559 141 69 281 199 70 120 -156 161 188 133 -96
4150 -96 -18 -178 -128 135 -101 108 206 -64 316 -60 -272 -186 -124 186 -249 83 125 -116 -277 -99 -173 176 6
4173 6 27 -13 51 107 -165 -14 -82 46 -28 -94 -213 192 193 259 -154 -96 -46 -136 -87 166 -1 -89 151 -201 86 -70
4199 -70 -55 -404 -108 152 -156 99 -37 -170 -82 -65 5 346 -344 58 57 95 5 -12 -419 -18 -220 -213 9 280
4223B80l40p4J77j15J47Q8O5l30N3q7K98J8m94L27J48j16n7L19j41J52m80K15
4245E3p2k38K34J32K04k37R8l17j02K52j7j68K53j24m4Q8N1k12Q6K20K3j88M3
4268A8M5j90J87m9J88j74m2l0r2m3L66r0p5j66qN3R5L26k90r6K73q0l60K27p7
4293h4N88m41P4j05j63P5k57L16K75k11J21M3k71j91p5L01N2k04Q5n4R1Q1L7J80
4317B63m15K09j57Q5j55Q0J78K13l53J31r2L4J75j33j05K35j24j64R2j94j62M33
4339G4q2J81j78J60j73J3k21q0j2K99J41l7j14M2p5Q1k10M43j61LN8K38k91O0
4363A59l16N3j38O2K87p1J3J20k59L01j73j24j58L28M6l3k32K08l8k6K98l89K20
4386A38K7n0o05M15L9J1Q0j66KK64J18ml59j1N9j5N5K88k35K80k40l27J28j12
$$ plain form
4223 280 -60 -134 43 -72 75 163 228 -102 -49 -136 162 180 -314 13 161 45 -12 307 166 318 -162 53
4245 53 -19 -257 -23 109 313 76 174 -143 -245 7 -10 -178 75 -49 -93 -5 46 -166 -80 140 163 -25 18
4268 18 63 -127 60 11 199 25 -17 -47 -139 -182 184 94 19 -147 -155 -102 -7 319 29 -67 206 126 -234 -7 -84
4293 -84 504 63 137 32 -131 -56 -313 3 278 67 188 231 -40 -231 -306 -5 47 -157 -72 -126 -35 46 83 263
4317 263 -152 57 -100 -15 -170 -90 88 301 -52 79 -13 21 196 63 -42 193 69 -95 -3 -197 -359 74
4339 74 -8 173 -5 155 -18 -5 -226 -306 -318 -19 122 85 -29 13 -62 19 -191 252 91 94 152 390 99 159
4363 159 -157 -104 -242 -180 107 36 49 169 -90 211 38 -86 -244 84 130 97 -135 73 35 9 307 -82 138
4386 138 165 115 -490 -75 -36 -25 55 -111 -109 155 273 269 -90 -101 -42 -57 -2 286 51 331 91 -236 -108 -220
4410b20L02R0j99r1K77M6j85O2J38l4j87J89k73N65l41j48k11J48K65l38K40N
4432A00nJ38l38Q3LMJ18o1M8k44K24j62J73q2j87L54j56j14J26M61o69M48m02
4455a40q0L90o9J70k24k33m8J16M5k32K58j40R1J85j17J14k36Q7J89j21L36k17
4477A24P8j07J59j21j84N7n1o9m0j76K60k04J80j49K71k32K33K56o4k07J53r8
4499F9m41L75J81l8L2R5j95k80R3o9lK7r7OL08j3k67k4M35k14l25M54k72J13K54
4524B04k26q4N5k09J12k18L03K63j00J45j35j28r5M49o39J83O6K29k50J33j83
4545a25rm6L89k91J64r5%J64j5k52J10K9K02j32j4j4K05l24J83k13k5K47k37K59
4569A60ol08J23M7J50LJ3j57m8K62l08K4J31J7l72M54l72K85P8n2j33j64O3J45
$$ plain form
4410 -220 82 172 -27 -118 159 205 20 82 220 186 -1 188 -85 480 139 -9 -220 -72 193 -145 95 100
4432 100 95 233 -105 -22 -19 -15 103 42 90 -154 70 -92 81 -1 -188 166 10 -104 22 483 -186 262 -140
4455 -140 -220 170 101 271 47 -186 -234 -118 -73 -305 -47 -187 -96 89 -28 86 -150 -63 126 5 341 124
4477 124 202 95 254 133 -51 6 -45 -114 -154 -330 -70 -274 -94 -243 28 -204 29 285 221 14 167 69
4499 69 -372 3 184 146 178 273 78 -202 -109 -178 -181 -154 -251 -245 63 50 -217 -241 194 -20 -345 109 -163 -50 204
4524 204 -22 -106 -51 -260 -148 -366 -63 200 100 245 110 -18 -113 336 -303 -120 -54 175 -75 58 -125
4545 -125 -134 -180 209 -82 82 -13 -13 151 136 -116 -6 23 225 93 79 65 270 -54 129 -84 -109 138 -99 160
4569 160 154 -154 -31 16 166 169 182 25 -23 239 -69 -45 86 103 -269 185 -187 98 176 124 -9 -173 -110 35
4593C5L05m65J98Km6k60J23k01L82O0k82o2M84l40o6o0J0M5N9K33j15j7l23J70
4617a31J1Q5J91j75RM26m91J37j56q0J34K0k4M44l08k13L08k02K63n24J68j15
4639b23K10N3r5j71L83j76K3j98O8K44j81R3J68m30J73J34l13J91O2L49l69n6
4661f1J55j88O1m6q4o8K26J81m11K21l0j3J28p0k23L70K5l03K88j13J96j69J90
4684B62l57j3J27L5j88Q7R5j04k70O63k94k57J42m1J37j62PP4j42K58N5l02j2
4707b00M83k50j35P2j81K31m22M90l96P41n12J18q2K66m03J10J58j37J57k34K10
4728H4l63N72m14k3O60l95l15Rj34J97L48j13k66M11m3l2m5J75m57J98j36L2P4
4751B4M6l63M19j39j99L48j41n2n8K75l08K80j36l0J60r6M6j07M20l87R5J62l49
$$ plain form
4593 35 340 -125 73 75 29 -231 -108 -309 73 133 -149 -211 273 -67 -133 -193 -183 -138 -79 154 39 22 -301 -131
4617 -131 -120 -35 156 -19 -10 416 -75 62 -94 -174 -40 -20 -44 400 92 -121 187 -15 248 -276 -108 -223
4639 -223 -13 40 -55 -226 157 -19 4 -194 -126 118 -63 30 198 -232 -59 75 -238 -47 15 364 -5 -61
4661 -61 94 -94 -33 -79 -163 -231 -5 176 -235 -14 -44 -57 71 1 -222 148 173 -130 158 45 241 72 262
4684 262 -95 -108 19 54 -134 -47 48 -56 -326 337 43 -214 -72 -113 24 -138 -131 -57 -199 59 114 -188 -200
4707 -200 283 33 -102 -30 -211 20 -402 88 -308 433 -79 39 -43 223 -180 -70 88 -49 108 -126 84
4728 84 -279 293 -121 -144 516 121 -194 -185 -319 -122 226 113 -153 258 215 183 138 313 -144 54 -82 -50 24
4751 24 70 -293 126 -13 -212 136 -5 -57 -115 160 -148 132 -4 -34 126 30 76 -31 389 2 97 259 -90
4774i0J36o7j32L60o4r6j96p5K13k33M50m26J23J33R0K23k25k58J25j22J03K52
4796B24k14M2K1%l78Q5J38J14j32J49k50K28m19N74l95K06j31K46k33L99l21N7
4818A0l82N82J32j63j65J1Q3M2n9R9l99N37k85j44K73l14L34m69K98J54j30l48
4840c03M43q9K6r0j7J13p7n2K78l01K85j50j45l2K31k01k21K96J8J54k30K73l
4863B06k11K12j67N0N2j23P6k41J88J26j91M1K09l83k6K67K13k86J37j58O3j6
4885C8L8k8k3L03m33J23Nj76M29l17K1J93J58j2r3n10M04l26K47k19K72j2O1n6
4909H7j55o9R0K71m39L6J56J16j26J27K3k1j22m8p0Q5J21k91M81l90N7m8J04j58
4933a83K16L63m33k47Q3K26J06l62m0N58r3p7l22L36l67j16L43j65L23l32K66
$$ plain form
4774 -90 46 -21 -153 207 143 47 -149 -224 -11 -244 206 -220 -97 36 126 349 124 -134 -9 -131 -28 224
4796 224 10 52 73 73 -305 -220 -82 32 -100 49 -201 27 -392 182 -213 -7 -138 108 -125 274 -47 10
4818 10 -372 210 342 179 14 25 108 150 91 190 -209 328 43 -101 172 -142 192 -277 21 175 45 -303
4840 -303 140 51 77 -13 -30 83 6 -46 232 -69 216 66 -79 -111 120 -81 -302 -6 12 166 -64 209 206
4863 206 -5 207 40 90 142 19 95 -146 42 168 -23 18 227 -156 -182 85 298 12 149 -9 54 38
4885 38 76 48 25 328 -105 18 23 -153 276 -41 -20 173 331 319 226 -284 120 -206 41 -178 94 82 143 87
4909 87 -68 -137 -47 224 -215 -179 -23 93 -33 94 117 96 -26 -74 -144 -59 62 -229 252 -138 -81 -129 -25 -183
4933 -183 33 396 -37 -284 -201 25 131 -231 -271 287 194 117 -205 131 -236 -352 -9 -174 149 -183 83
4954H3pl79K60K11o1K85n15J52k31J43J79ON3k08O6Pj04J30p0j00L24n42K03J5
4978a00l7L15k44j42K66n4k68K85l6J13j87m1L24k84k9K33N7k78M09J1l80J96
5000A29J54k25k2r4J02j90K47Pj87k8J70P1k0m3j66p1J64q2P9p1o1j06J66J22
5024D5k6K45m0r6j55J33l96L05J00j37J26j01L3L25o50M71r7k45L20k01r4L01
5046A66k76j09J35j63K08J27J34j75j57n7k34L49r1n2L11j16k28N40k72j42J92
5067I0m22NM05o0J67l18J74J62j67L6j75L04j97J81l14M43m36n5R0J50J19k60
5089g8n3m1o9N5M56j90m77L05J63O4m2j05Ql1L4j26J97P0n0q0J16l99J17M71m20
5114a05k6J75K01l10j6J68j64J19k44J43M7O7J8O0L2l19O0J36k3Q1l0P7Q4l63
$$ plain form
4954 83 76 -303 -43 168 107 392 -123 29 -202 -59 120 126 179 -29 37 44 -60 70 0 -100 224 -318 -115 -100
4978 -100 -137 178 -66 -208 58 4 -264 21 -15 98 -89 -130 194 -90 -119 114 171 -107 302 313 -67 129
5000 129 283 58 36 -58 44 -146 101 108 -79 -107 63 134 114 71 -95 -166 -2 -84 -5 -76 -137 -243 -77 45
5024 45 19 264 224 128 -27 106 -290 15 115 -22 104 3 36 361 -289 182 85 -160 160 -41 -135 166
5046 166 -110 -219 -84 -247 -39 88 222 47 -110 -167 -401 -52 -143 -195 116 0 -228 312 40 -102 90
5067 90 -332 -327 78 18 185 -133 41 203 36 72 -103 201 4 185 -129 314 -122 -177 -87 63 182 -78
5089 -78 -131 -172 -241 -186 270 80 -397 -92 71 135 93 -12 -4 -35 -1 -127 70 140 90 10 126 -273 -156 315 -105
5114 -105 -131 44 245 -65 -81 87 -77 42 -202 -59 -12 55 73 133 165 -154 -94 42 19 100 70 147 231 -132
5138a32K21j29L65l01p3J10k31K2l7L82l04M9K17j70n5J00l43K93J93k22p9K40
5160A16k17M27j11l59jK2R6j21M27l75l4M47o3m15K27jj90k76N99l85N70o39L49
5183I3J28j14l51K2N09k16j51k15N6K01j30rJ60k16K41J22J40j94k10n8K04Kj22
5206a08k02L94Qor6J62l66L81j27k12J63PJ13m10L63k38J0P48q27K40n6N7j14
5229a16j84J87K16nk3J00l15J52J0p2M1l9L37k38j51L60k90J42J86k77J29P8j16
5252A12j33o0J43P5l49N8M51k45j51l0K16J18k27J06p5J10l25L90j09l49M17k23
5274h0K09j54k22J69J13P8l68J96J07J1J04k72K71j57J3J87j92j9M5L0K11l26
5296d6J21J61j15k85M92k11l00L21k84J10Q1N2l22K25K1Q7j79j37M23j46k26L69
$$ plain form
5138 -132 89 -40 325 24 -49 61 -170 -148 -185 197 -107 -58 159 -11 -66 34 -309 -16 177 -45 -124 116
5160 116 -101 326 215 -144 -145 -123 -27 -148 279 -96 -130 317 254 -161 66 65 -125 -401 198 -187 383 -256 93
5183 93 221 107 -244 -222 287 71 -80 -295 -239 -38 -168 -177 -17 -233 8 130 270 76 -134 -192 12 14 -108
5206 -108 -310 84 92 86 -10 152 -214 167 40 -172 -9 -2 111 -299 64 -174 -164 584 -243 -3 -59 -2 -116
5229 -116 -300 -113 103 98 75 175 -140 12 22 -50 -9 -48 289 51 -100 260 -30 112 298 21 150 228 112
5252 112 -21 -81 62 137 -212 -154 297 52 -99 -129 87 205 -22 84 9 119 -206 184 75 -274 143 -80
5274 -80 129 -25 -247 -78 35 113 -255 -59 48 59 163 -109 162 5 18 205 13 -6 39 69 280 -46
5296 -46 75 236 121 -164 328 117 -183 138 -146 -36 45 97 -225 0 21 108 -71 -208 215 69 -157 212
5318B12l96J01J83L6j29p7J94r9j55%M4l7K95k08j5r9l3J43k04O17l13k82J36
5341h6j2P2N8M1j00Q4n4m0J13j59L1p4K3n8K97J34j83J43j65j37J16M8j66n5N9
5366g0j8r7K84j51j91K12K27k25p4J54j99J38m2K60l52J52K5j18jJ20m15O20P3
5389C12k02n4j54J96K4l9n4m1k72L15K06l47M63j96m29J3J80j18L10n4m1k48Q0
5412a50K82j87J79m40L25p1J28q5J20j81J2k09L62q9k13K65k80K54j54K9J8K27
5434A42k84K16p3l64M07j87J43l0K57j66m32L39l5J39j11J94j52K1K14k29k59
5455b50K93K13m18J76k0R5L35l59q5p3r8L71k64L43l25M9k45P0K45l03L18m01
5477c33L35j89J36L13Mk07m6K2k58K58j79J47j4k53N27j74l82N64l65M4kK63l90
$$ plain form
5318 212 -184 -83 100 136 7 -70 124 25 -130 -130 -86 -123 172 -36 -51 -150 -183 -40 -244 373 60 -222 -86
5341 -86 -98 -26 32 73 -27 57 3 -37 76 -83 -52 -126 -103 -161 136 270 87 230 65 -72 44 92 -74 -129 -70
5366 -70 -88 -185 99 -52 -243 -31 196 -29 -103 51 -148 -10 -52 208 -144 8 33 -85 -86 34 -381 239 312
5389 312 110 56 -98 98 122 83 29 -12 -284 31 237 -110 353 157 -272 -259 -79 -197 113 59 18 -230 -150
5412 -150 132 -55 124 -316 9 -62 66 -19 101 -80 -68 -277 85 -4 -217 48 -232 22 -132 -103 -85 142
5434 142 -142 74 1 -363 44 -143 0 -30 227 61 -371 -32 -67 72 -39 155 3 24 238 9 -250
5455 -250 43 256 -162 14 -6 89 424 65 -20 -93 -191 180 -84 259 -66 -17 -262 -192 53 -250 68 -333
5477 -333 2 -187 -51 262 266 59 13 35 -223 35 -144 3 -11 -264 263 89 -293 271 -94 -50 -52 211 -179
5500a79J48kK95m63K84J87k10K31l10N8M2l96O06m26M9J08NR6j1k55M6j50O36
5523C89l70j94L09L7k78n7k3j8M7K72rk32J94K1k3k32L99k93o1J07K68l88o4J71
5547b8K15j72j46J26K08L4o1r7j70M68j89l81K53O4j39R5j92J04K28j44l4k12
5569a70L19k01m6Q2P6l8j64J62n3j55j23M53j78J59o6j35K92J2j91K11j20k24
5591i8L27m08R0j86J69k5K3J00j19K31k37J58q7K4J06l08K83K23k76K27p3N1j19
5614G6J28m3J47j52r4Kj28M82p18K71l06M61j67K36l92L00k26l1K4j4L02p1J8
5637A05k63L2L19j24K45m79M0o7L15N5m08L65L3r6q7q3K6J97k61L03j97P0l9M8
5661D9j43j92N86m6K37m40k27K0R5L72j68l75J93Q1K25l70p0m5Q4L6N5j3K81m4
$$ plain form
5500 -179 -31 -33 262 -201 83 270 60 291 -19 39 81 -315 291 -135 -86 22 27 123 112 -143 -97 -247 389
5523 389 19 -175 134 171 -107 -164 -187 -205 -158 114 105 -127 67 88 65 -167 232 -61 -122 -15 253 -135 -199 -28
5547 -28 187 15 -131 -5 203 237 176 79 -91 377 188 -193 60 124 -15 80 -112 -8 220 76 42 -170
5569 -170 149 -52 -98 -16 60 22 -142 20 -33 -188 -311 142 -36 123 57 -78 214 226 35 246 126 -98
5591 -98 229 -179 -89 -275 -106 -131 -108 -8 -127 104 -133 25 -62 -38 68 -240 43 266 -10 217 144 195 76
5614 76 204 161 308 156 62 64 -64 418 -300 -29 -335 126 -41 195 -197 103 -123 -154 -130 -144 158 87 105
5637 105 -158 -126 193 69 314 -165 -125 -192 123 178 -230 135 168 72 -15 -98 -72 125 -136 167 -30 40 1 49
5661 49 -94 -286 300 254 491 51 -176 -156 -61 311 143 -232 -39 42 267 -103 -173 -218 -134 -98 -43 -56 225 181
5685A81k78J62n8j84J91K80m60M05O7o09LM45k03q7L9J48L7m5J1j00p3J05k03
5708b26J2K62J7K1j37J61k70M16k58mj11K9N00j32l80N22m10p1L24m99J66J27
5730E9P6j2k75L56n5k48N7J17L17n45K84k51r6N35m10K11k79K24q5J3J02l5k54
5753a94J63K44J39j45j20R2l14Q7J18n8r7kK89m17M22O3j8p8k94J69J3j3j40J09
5777A8k4Q0q8P7j13L28l81J64P7n3n5k08K69l3L2j20l25O57n18J65J4j95K85J39
5801A92k61j87L38J02L5l06L3j27L49k99J79K90k79k45M01l11q6J77M0J25l24
5822a64J59K4o7L82k35Jj32k3J04K6k9L0J21pl22P1j34Oq8K05j68K92m0j40J71
5847D3J60l74K51q0K7J6j45m8l3L50j33k82M83j10j93J54j70J83l4J32l89%m2
$$ plain form
5685 181 -97 65 7 -177 14 294 -166 239 306 -303 -300 145 -58 -145 -106 42 79 34 45 -55 -128 -23 -226
5708 -226 -214 48 65 86 -51 110 -160 256 -2 -6 -117 -88 412 280 -100 422 12 -59 265 -234 -68 59
5730 59 135 123 -152 204 149 -99 -42 75 392 -153 131 -120 -216 319 -91 120 -159 65 -20 -7 95 60 -194
5753 -194 -31 213 352 207 87 179 -135 -48 70 12 -85 -87 202 -215 207 270 252 174 -120 49 62 49 -91 18
5777 18 -6 74 -14 63 -50 278 -103 61 138 85 30 -178 91 58 90 -30 -355 302 -216 -51 -37 -232 53 192
5801 192 -69 -256 82 184 219 -87 -54 -181 168 -131 48 338 59 -186 215 -96 -182 -5 35 160 -164
5822 -164 -5 19 -48 334 99 100 -32 -55 49 75 46 76 197 190 -132 -61 -195 -189 -277 -72 -240 52 12 -128 43
5847 43 203 -171 80 0 27 43 -102 -150 -183 167 34 -248 235 125 -68 86 -84 99 65 197 -192 -192 -234
5870b34M4K13J82k38njj62L15l25J01L27n1j50p4P9J67k05k62N65m75j89N15j35
5893Bj4O5rq3o1L58m00M02k18lM6P7J12k78j61K45r4j8J75l01J4n6K02m0oM2q7
5920h9K3J80k57N2K45j72p2K63J86o66M35j23K10j94k1k07M1k04L87l6j02M18
5942B97k42j97J87n6J38j41K2p5K73n4k28O2K80l39R9j51J79J43K1l09j15J85
5964b1J59j30n7L03l90K10j22K47j94k8j00K31K16l77O3k30N8L63k48k38K04o8
5986a49J24j74L42l19L71j04K57n63K49k57M59l88K38k4j16K40m45N70m79K45
6006G7j31K3j13M43m9l72M8K96j82m04M05oJ04k30K21q0J3k3Q5l97M9R5l5K10
6030D7P8L8O3j8l16j17j97K54K14J51j60j04J82m68O43k83J75J26l58j53N2J2
$$ plain form
5870 -234 -190 23 205 -33 -38 -39 -201 114 -211 -110 217 166 16 -58 21 188 -17 -279 286 -189 -378 137 2
5893 2 -12 53 44 -39 -100 258 -142 260 42 39 85 162 274 -4 -165 80 -14 -32 143 -158 -144 -200 2 -38 -44 -2 -89
5920 -89 -66 114 -143 -91 154 -18 -90 173 359 -307 128 5 215 21 0 -207 -166 -370 17 -19 -121 297
5942 297 55 -142 45 -11 127 -14 8 -67 206 152 -76 -14 266 -73 26 -125 54 197 218 -91 -206 -21
5964 -21 138 8 -49 254 -136 74 -48 199 5 -23 -123 108 324 -53 10 -220 -162 201 -47 -285 -81 -149
5986 -149 -25 -199 143 -176 195 91 348 -215 34 -223 236 -152 86 62 -54 186 -259 311 -168 77
6006 77 -54 -31 -144 299 250 -122 -74 222 40 -364 41 35 139 -91 130 50 63 40 125 -272 -223 -128 -163 47
6030 47 125 163 226 208 -108 -225 -422 -168 46 197 37 -67 115 -353 290 7 182 308 -50 -203 -151 -139
6052a39j27M78j21M3j26j27J92r0n4q4J6j8J30n5j02M97j42kl93J92r7M12l45
6075f2M00k47o9Q9j96K35j18n4R2j77K84l77J87J75l61M95m37L67l15K1j70K66
6097B8O0o6j18K9J83k52j02J49R5o7M21o81M87j52k3K5R2k37K96k73P6r8l4J34
6121b8K31p5k69M0J67j40J99k07J33L6N3p6j71J18O9J89j90J29qn0k03L16k96
6144c3N8p0Q8j19N3K0J29j58j74L37j06K61l97Q9m9p9K26k39NN7N4J26q9j96J91
6169a5p0J70J36l23J09J35n1m18L07J61k44l5K22l1J03k76j01L25j29J24k72M22
6191B49k84j97K83j25j83M8K73k79j43M26j29j9J15j84J27J7J65l66L05k56P5
6212h2o3M46n33J67K59k42LL7J43k50L80l04q7P3k5N5l6j39J98j97J02K2R8k57
$$ plain form
6052 -139 -266 212 91 134 8 -119 73 -17 -71 -155 -139 -157 -27 -82 -184 313 171 169 -224 -32 -129 283 -62
6075 -62 338 91 22 111 -85 150 32 -22 70 -107 177 -200 -13 162 -199 296 -141 226 -89 -68 -238 28
6097 28 88 22 -96 -67 116 -136 -238 -89 6 -61 360 -321 166 14 -9 16 108 -129 167 -106 -30 -128 -162 -28
6121 -28 203 128 -141 -101 66 -74 125 -82 51 87 140 64 -107 11 80 269 79 208 200 150 -53 263 -33
6144 -33 25 -45 43 -76 -23 -3 126 -32 -206 131 25 286 -111 -22 -71 -150 76 -163 -158 -101 -47 79 -10 -206 -15
6169 -15 -85 85 221 -102 7 142 91 -327 -20 141 -103 -138 84 53 156 -120 -221 104 -25 99 -173 249
6191 249 -35 -232 51 -74 -257 -209 64 -215 -358 68 -61 -80 35 -149 -22 -5 160 -206 99 -157 -82
6212 -82 -145 301 -232 -65 194 -48 -45 -8 135 -115 265 -39 -126 -53 -78 -23 -59 -198 0 -197 -95 -73 25 -232
6236b32L22k96J31K36k10K18l39L62l85M72j87J9L00m98Oj8J21n5Q7j7k41N12
6258C08l50J80q1j85J8K40j4p9P6%o4J09m36P23j07m48J83r4o4j69J76J72j67
6281g3Q2k68K15R2j07j75K40j91K33L5Q2j21J1J9qr5J88k08J23K39m80j09O22
6304C46k62j96K28j03p1Q6J31o1N2J2j67J79k19J2J85k73L49q9m45K74l7M8q6
6327a07J49j35q8K87k79j11K10M15l59J45l17J55o0Q0R0J77l71J66M7j70J87n00
6349c89M72J22k41j55J44J49K73m18J29l77L19N5k31M14l06J45J75k7k86p7j13
6370b23J57Q2m4k42M33k8p2n8R3q6k9N8LK59l87N3J18j85K80m2n4j33l4J4mK75
6396B04o0j54j93K66P4k07R5J7n2j37P6K40q0n0M4p3K49k33M60l59j95J67k0j28
$$ plain form
6236 -232 90 -206 -75 161 -49 169 -170 192 -193 279 92 111 411 -87 -81 -99 22 -33 54 37 -204 308
6258 308 -42 138 57 -128 -110 130 116 37 113 113 49 158 -278 445 338 -110 73 -21 -85 -254 -78 94 -73
6281 -73 9 -259 -44 48 -59 -234 6 -185 48 83 165 44 55 74 66 -29 159 -49 74 313 -167 -276 346
6304 346 84 -112 116 13 -58 28 159 98 150 162 -5 174 -45 -33 152 -121 228 139 -306 -32 -69 -21 -107
6327 -107 42 -93 -181 106 -173 -284 -74 341 -18 127 -190 -35 -95 -15 75 252 -119 47 94 -76 111 -389
6349 -389 83 205 -36 -191 -47 102 375 -43 86 -291 28 83 -148 266 -40 105 280 253 -33 -110 -223
6370 -223 -66 16 -28 -270 163 135 63 5 98 12 -17 41 44 303 -84 -31 87 -98 182 140 86 -47 -81 -67 -71 204
6396 204 144 -10 -203 63 137 -70 25 42 -10 -147 -71 169 89 39 83 10 259 26 486 127 -68 99 79 -49
6420d9K41j42k79M49j71j35p1K07l67L63j42J00m2k45J89L22j76j08o2P6N6o2
6442d8J71j37m0L9J66k4K7l38k4K20J31j58j7j22K91J73m31L38m6j27l47P7J42
6465h4M5l50K79L38l93K86j54J05J08j30j35k78M07Q3k84L5jL89k08j08j81J71
6487f0j91J89J51p2K4%k01M50k12p2K00j1m14j76N47P5K09k80k95P5q9j20N91
6510C18k30P4k61P5oR5J29l36P3Q0J31o4j95J61P2j37k3j20K08l3j12j24L06K32
6534C13l33J5kk12J95J25j66J36q8QM3j29r8n9J82l7K25j62J35k40Q6K34k19j03
6558a51K27l18L9K89j93J53l6m2QM5J30n4J12Om1j75n4J94O8k77P1K6j02K87j84
6583B8jj28N52n96K1P8J23N3j61R7R0l41OK06k30J37K40O5j35j24p8j99O5M13
$$ plain form
6420 -49 192 50 -229 220 49 -86 -157 50 -317 46 -96 4 -38 -283 -94 228 52 -56 -118 -42 14 -48
6442 -48 123 -14 -54 -15 151 127 154 -184 -208 12 143 -15 -32 -154 137 310 -121 217 171 44 -303 -226 -84
6465 -84 -39 -389 -110 228 -165 121 -33 72 180 50 -85 -363 44 127 -157 -122 -123 266 58 -50 -231 -60
6487 -60 -251 -62 89 17 41 41 -160 290 78 6 206 195 -219 -395 152 227 436 156 -139 -64 -153 -273 318
6510 318 88 162 -99 -24 -30 65 194 -142 -69 11 142 78 -117 44 116 -21 -44 -164 44 11 -101 -225 81 313
6534 313 -20 -5 -7 -219 -24 101 -65 71 -17 -9 34 -95 -193 -252 -70 -107 118 -44 91 -149 -63 171 -48 -151
6558 -151 76 -242 -203 86 -107 46 10 -32 -24 21 151 97 209 215 174 -1 -55 139 207 -70 1 27 -75 212 28
6583 28 27 -101 451 -145 -124 -46 77 130 -31 66 156 -185 -179 27 -203 -66 174 239 104 -20 -98 -297 -232 181
6607A81l7n45M67p1j13J12L60k73q3J52J48l94N5J61o4j27Q8n8j53J53p3J16l3
6630c1PJ10j6j5J7j52M1j17J91l48M31l76n1q4J94L06Lk29L24p3j36K14j26L0
6654A14k26R4K5j10K56L6k71J42k14j94N9M70k60O9j37q8M31k73O0qo5j9K6o1
6678a44O6J67j85J47m51K26O9K06l35M18l24J44Q0j3J3j26N2j62O9J5j80J67j01
6701a82J64q2J86k10K20Nj65rL9m8K73n9N9J9k07j15m5M97k16J18k97j31K57k55
6725a84L5L30j49M23n13l7J08j28K45j45m9k2o8r8L03j90l4R3L06l02J64k4j28
6748f4K00q3J63l72J26K1J77k30l45J85O1LM91k65j90L24k96J96n3jj41J57J49
6771B13j57r5J14m0j20n7K13j92N56k06j04j62J76q7Qk1J33Q5j77q7k3M0J24n4
$$ plain form
6607 181 144 -401 66 -5 -118 -6 354 81 -2 150 298 -96 -41 120 56 -71 17 -41 -194 -41 -114 2 -31
6630 -31 -24 86 70 55 72 -80 -39 -156 35 -313 118 -258 -309 -393 -199 107 110 -119 205 132 -4 210 84 114
6654 114 -112 -18 7 -103 153 189 -82 60 -154 -348 -289 181 -79 -10 -147 -235 196 -77 -17 -25 -90 -109 -83 -144
6678 -144 -78 89 -96 51 -400 -174 -105 101 -234 184 -140 4 84 71 84 -42 10 -152 -83 -68 -248 -81 -182
6701 -182 -18 -100 86 -124 96 101 -64 -73 -34 -82 191 132 191 210 3 -112 -157 340 124 242 -55 -186 71 -184
6725 -184 -149 181 32 455 -58 -95 13 -115 130 -15 -64 -86 -154 -252 51 -139 -173 -80 226 -76 88 64 -64
6748 -64 136 53 216 -156 -30 -9 168 -62 -407 -222 -161 -158 333 68 -122 202 -94 102 49 48 -93 64 213
6771 213 56 -39 75 35 -85 -142 71 -121 435 229 125 -37 139 52 60 39 172 257 80 -7 -30 10 134 80
6795H0J28k75J3l5J41n9R3j47J42R2l30K98k52o1J17J54K29m07Q6k47L35R7m43
6818b51K92jJ0K1j05r9K10J73j90j03j12K8J65q0L20k23j64K15K5j95K3K01l17
6841a57r9K71K09m26L10k2R8o3K0J62n00L38r4j47k4M9o3R4M3M4J45l97L04j15
6865b0J17j92L25l08o1J98P9j60p0K11M8k37J90k22J87j36j99L16L6j73J31J89
6887B49j80J99O1o4k99O1j91J85j71J13K5OOk0L3k81L42l7P7P1j10Mk07J6J29
6912A7k42J81r7K55R5j47j12Q2p4N7M3j61K5J94K4q6J22k53q4L16j61n3n0K96
6936A87l94J43M58m31N4Q3j98oJ11Rm7j94J91J25n3L13k88j77N1Q9J39L6k13l6
6960d8j07K15j63Q1n1q3J06J12R3k36K98j65l44L57l0q6L28l50n7N03n55l2J14
$$ plain form
6795 80 208 -67 -54 -89 52 -7 86 -61 81 173 -157 141 -111 -172 -55 99 328 -79 7 -240 95 192 -251
6818 -251 41 40 50 71 -34 -133 77 250 60 -43 -155 -127 38 -42 278 55 -109 106 131 -64 -41 160 -157
6841 -157 -256 15 224 -202 108 86 184 121 141 303 -197 141 47 -100 -124 -75 -138 -44 -1 43 188 -209 95 -20
6865 -20 97 -95 230 -78 -139 59 138 -22 -92 119 167 -70 120 -102 85 -51 -250 66 102 -71 60 249
6887 249 69 268 329 265 -34 27 -164 21 -150 -37 -12 -6 0 -20 13 -268 74 37 114 185 75 79 -128 -112 17
6912 17 -225 -44 -141 114 209 62 -50 32 -42 15 58 -103 -78 116 140 54 176 -77 -161 155 -6 -59 -109 187
6936 187 -207 -64 394 -37 17 100 -98 -104 7 16 -31 -225 -34 91 38 351 63 -114 -63 26 165 201 -12 -48
6960 -48 -155 60 -103 -22 -73 -156 -50 62 155 -81 217 52 -292 65 35 -51 277 -73 -130 373 -182 -214 -100
6983a00m3P3K44k72o3J02l47O47l21j08p8K32k44J8L14j77OK68j26J88j83J38
7005A68m16N84l47J28J79k62J69l1k73J00L5O7K15n03L42j83pJ84j90j45M0QJ84
7028D6J40j47j48j59K54j95J95J05j28J94n3j57K51l30J91k73K93k15J22O1k56
7049b09L13n4O8J29n93J99q8O6N03j98k09J66j9k72K21M4m5J95J6k87p3L1L05
7072B09k38J01j32M8k96M95l03J31R6k17J49k3L6j18j34O0L03j65J73k66R1r8
7094i8J77J79nk80J37k02J72j69k47L36l79K39K08J81k65J37l04L18k10m5L15
7115A95l85k11M83n1k14K47j42j77j88M49q9J51k03O0j4k2L3M9p1J11K22j97k6
7138A0p3n1N7O2j40J75j99P0O3j5J89n7m24O47k92N9N2l59q2N54m01L19l56J81
$$ plain form
6983 -100 -143 -70 174 -98 -161 -59 -406 241 -80 -188 -266 -34 -278 -260 54 -123 -117 151 25 213 30 168
7005 168 -248 336 -11 117 296 34 203 172 -101 -1 34 101 316 -187 155 -28 -35 149 -41 -186 -146 -138 46
7028 46 186 39 -109 -268 -14 -209 -14 91 -37 157 104 -53 198 -132 59 -214 79 -136 -14 47 -209
7049 -209 104 50 118 247 -346 -147 -235 -169 334 136 -73 93 74 -198 23 67 22 217 233 -54 -127 -96 209
7072 209 -29 72 -60 -12 -308 187 -116 15 111 -106 43 20 56 -62 -196 -136 167 2 175 -91 0 -98
7094 -98 79 258 253 -27 110 -92 80 -89 -336 0 -379 -140 68 249 -16 121 -183 135 -75 -120 195
7115 195 -190 -401 82 31 -183 64 -78 -255 -443 6 -83 68 -135 -75 -89 -111 -78 -29 -100 11 233 36 10
7138 10 -63 -114 -57 5 -135 40 -159 -89 -26 -41 148 91 -333 314 22 81 133 -226 -308 246 -155 164 -192 -11
7162a1j80M2L60j53l20k0K58j85J68j22K38l06m0L08p0qJ49q4k56M11m03M8J91
7185A5k6j06L04j65J73q3j01J70l2l79O6K52O8l83L25k67o2J22J01K3r1J07k26
7208a95J29K70k61o6J39jK46r9j87M66o60J88J00P0l46K09j22r8rM12l79J63J17
7231H6Jk51K19P2l23M00k20O2j15L64k87j68L02k97Q2M13n64N03k00K5k24L3j12
7254a99J89L0K41l45K40m08L63j69L0K27j11P7j87M7k46K51o8Q6p3J68j48K45
7276B40k25K34l14J87j97J47J19l46j15K94n9K01j01J9k30Q6L31k21j98L16k78
7297a10O2k24K01L0J29k34K08m7P6k76J94J82l8l63J62J13j09l03O23l88j57K84
7319A5Q2k08M45j85k09K11l6l4l13L31j87L34l25J41j61r3O4qQ5k06o4N97k12
$$ plain form
7162 -11 -191 -149 211 58 -262 -282 -24 -209 -41 -163 75 -231 -271 37 -33 -41 108 24 -232 179 -224 -176 15
7185 15 -11 -117 187 22 195 112 11 181 149 -230 -164 88 156 -227 98 -169 -231 -109 -8 15 -76 31 -195
7208 -195 -66 204 -57 -123 16 15 261 162 -25 441 -219 -31 69 139 -207 2 -120 -218 -227 185 -194 -31 86
7231 86 87 -164 55 127 -196 204 -16 46 -69 295 8 -160 142 -155 -73 340 -224 279 79 104 -120 -87 -199
7254 -199 -10 20 261 -84 156 -252 111 -58 -28 199 88 165 -22 25 -221 30 -38 48 -25 143 -5 240
7276 240 15 249 -65 122 -75 72 191 -155 -270 24 -35 166 65 84 -146 -60 271 50 -148 168 -110
7297 -110 -48 -272 -71 -41 88 -146 62 15 91 -185 9 191 153 -210 -48 65 -44 -347 276 -112 -269 15
7319 15 97 -111 334 149 -60 151 115 81 -232 99 -88 246 -79 62 -99 -192 -128 -136 -51 -257 -321 276 64
7342F4k82J04N7R0J27k68L8J68n7k84L26j34k13L98j56P5K14m89j4K32Jj72Q5
7365i0J10J33l07J88j6j10j25L81l31K33j53J9K30l05K54j36m2R5j19J83j27o3
7387i8kL43k52p5J87L33m20K2r4l6K15j85L46m58j8J45N1j47J60L32j99o3k6Q0
7411A41k18O0q0K11L1l96L04k21R6j6J58M2n1n6j10J76l05K15K06j68K47l16p9
7434a29J95Qon8K06l63K52j07j32l7J49R3k48P9k6J41j04j14OK82j69L80j77o9
7458E2j62K96r5r0k6r3K15o5k05R7J57q9k49L69J41k03K0j74J50Ol2J5Q4j23K51
7483B47k89L01j11L1j73J11pJ02k56k98L58N3l74K28k29N33k63p8J52m3o2o2J64
7506C5k3N7j34J69j22J96m07N61j79j65o4j34N7j26L95q2Q7l75K68J09o2J26k32
$$ plain form
7342 64 -218 -114 -57 33 160 -108 -70 98 41 -243 83 -51 -264 134 -22 53 267 -222 -236 -4 -3 -175 -90
7365 -90 20 153 -154 34 18 -92 -217 164 -167 66 -87 -68 162 -143 111 -25 -67 28 -91 92 -35 -98
7387 -98 -100 243 -9 -84 103 436 16 38 -56 -92 123 -62 284 -174 -192 -47 4 -143 17 349 150 87 61 141
7411 141 -77 -17 -97 114 145 -251 53 -168 -72 -88 70 112 61 5 -105 71 -234 -19 187 19 266 -50 -129
7434 -129 66 74 68 10 216 -147 105 -2 -134 -171 -22 71 -177 -98 -124 17 -87 -201 -195 87 -82 298 121 52
7458 52 -110 186 91 1 -25 -118 97 32 -173 -76 81 -8 -257 112 253 50 70 -104 46 52 20 35 119 -4 247
7483 247 -42 259 148 179 6 117 110 212 -44 -342 16 69 -305 -77 -306 227 -36 -114 38 -5 -67 -129 35
7506 35 12 69 -65 104 -18 178 -229 332 153 -12 -76 -210 -153 -279 116 34 121 -254 14 123 61 187 -45
7529d5j72O28l70j26K39l40J47k9K64j67j19K43j47J16m03K89k8K25K31m12j49
7550a25L05K8p8m8k41N8J90j55Q7m9N0O8m33N37j38k25jJ9l8J59J41l97N05o0
7574A59k30r3j01K95N0k34K18J65j65j10K47l24j05P3k41N96n2j94M4R8j9p7J11
7597A11j57JJ19J46O2j58k35l6K16M0p0l5J90nk98M7OJ37l51J28p6j0L43J07j90
7622C2j64J30lJ33K1j47q0r9J88J86m9j90J40k6O5k77KK18r8j17K35r4M0n3J50
7647A43j07J7l6K8k06L43j39k7J07m60M03j77o3J12j37J21q2L84n79J07K65r3
7669g6K48k60J80j82J32p0o1L28j75o8n7K8p6K76n2k20m8P9m1k25L78q2N7J23
7693A36j57K20k17j04OJ35p8L5K25j10Lo0J11k27K44j87j5K61l39l40N86q9M4
$$ plain form
7529 -45 -217 411 41 -85 154 -186 -39 -68 196 29 -90 153 6 122 -281 8 -20 205 436 24 -125
7550 -125 180 208 130 82 -159 -101 89 -66 21 -28 22 90 -343 194 56 -169 -170 -151 -189 -30 111 -286 219 159
7574 159 -71 -164 -265 30 80 -154 64 229 64 -46 201 -123 -228 -155 -396 200 148 -46 -2 96 77 0 111
7597 111 -46 -45 74 220 282 124 -111 -147 69 109 39 4 194 189 -109 -62 -56 81 -270 -142 -218 -228 115 222 32
7622 32 -132 -2 -5 128 149 2 -78 -177 11 197 148 -42 98 72 137 -140 -138 80 -18 -135 100 6 46 -7 143
7647 143 36 53 17 45 -161 182 43 16 123 -337 66 -111 -174 -62 -199 -78 -160 224 -355 -248 17 -76
7669 -76 172 -88 92 -90 42 -28 -89 239 64 -4 -61 -33 -109 167 115 -105 -153 -74 -115 -340 38 -44 13 136
7693 136 -21 199 -18 -122 -116 19 -59 -24 201 91 94 34 145 -82 162 -25 -40 221 -118 -458 128 39 83
7716H3n8o9K2k8J38l8L9j62J18P3k02R1K0j5r5k0J24n6J94m44L74K95m08J26R1
7741A93n85O36l07O0n7J61l3Mj59J86n8k59j40L93J8NM4l15M9J44J9j04K90l55
7765a70M31m25r3K28j8l5J94j31L40n19jK87j04j00N6o6J84j24J63n1J88l81O6
7788h1K28M9l51K50K9Q2k41K17j09mk36j50K58j82K28k38O4K02N2k16J4J52j10
7811i3J19r8k4K35J29l59J02J70m15M08j30O0K0K4k8j04L8r2O9P4k16o4N9J47
7835C1n2J05Q4l59M39k22K6J75k2l42K32j77L02l27K10J67k36k24j16K40K69r9
7857A04K5m1k93M79l24O1N2r7M5j41K81j56r9K4q4k17K62k6K14q7K64k27k32K33
7881B0m7o9L84k16m6J81j87j56K57k45K38k68L82k70R0k9JN1k09J49R8P2k08q3
$$ plain form
7716 83 25 -44 -22 -50 88 50 89 -73 45 118 -84 7 27 12 -83 -103 21 -35 159 -285 89 384 -24 102 193
7741 193 -392 244 -63 -3 -60 101 68 72 -87 99 41 -218 -358 35 53 58 102 -213 -164 -20 -1 -105 185 -170
7765 -170 261 -164 -257 -29 -47 -82 112 -19 321 -198 -199 88 -16 -116 -60 -126 58 -66 97 46 234 -147 -81
7788 -81 147 196 -155 95 124 206 -35 182 73 69 -167 -317 -59 -241 -13 -251 -187 15 67 -149 -135 17 -93
7811 -93 26 -72 -96 139 268 -91 11 181 -234 174 44 104 124 148 120 16 54 -38 31 105 -111 -175 -116 31
7835 31 -21 84 168 -191 248 26 52 227 205 -137 95 -82 220 -107 103 270 34 -190 -306 -66 203 104
7857 104 129 88 -205 274 -50 11 63 -34 11 -130 151 -5 -104 -80 -164 -381 -119 -145 69 -18 246 19 -213 20
7881 20 -27 -96 288 72 26 207 20 -136 121 -124 114 -154 228 -42 48 19 20 71 -138 11 109 181 -27 -110
7905a10l2M02j77J91o24K84K35L9p1o1j3j66M3J23jk93M52l50L14l36J0J39k90
7928b92J12j31L06Q2J14j87M2J40l29K34j60J24J95l01J51j03jj00J8J71J66k71
7950b0Jj88K34J12m42J38J41r6N8j53K49k63J15J88J72o54O38k00j35j08m9J61
7972a01J07P5j56M85k74j66oK62l79M27k93k80M61k30o5M24j45l40j39M20Q5j51
7994B1j84J99N4k10J54J05j28j89K92j83N7j52J84j19P1M26n11L44k67Q7R1k8
8016A14l11J65kj44J55j49M63l47m4J43j55L1J59N2k32J82J72M3m64N0r2K12J27
8039A28k35J91j78n7K02l9j05n1j12K33J06k72J66k5j24J66J16m8j31n7M13l91
8061a04j60J87R2J27l18L37l36m5K45k32K03L66k65m62L78J29j72j24M90o73K35
$$ plain form
7905 -110 -142 260 83 274 -350 -66 169 208 137 76 63 -103 -60 63 62 -231 221 -129 185 -151 -141 -2 -292
7928 -292 -180 -311 -5 77 191 4 46 186 -143 91 -69 55 250 -51 100 -3 -4 -104 -86 85 251 -20
7950 -20 -19 -207 27 139 -303 -165 -24 -120 -62 -215 34 -229 -114 74 246 -408 230 30 -105 -213 -262 -101
7972 -101 6 81 -75 410 136 -30 -36 226 -153 274 -19 -299 162 -68 -133 291 146 -194 -333 87 172 21
7994 21 -163 36 90 -120 34 139 11 -178 114 -69 -12 -164 20 -99 -28 398 -113 231 -36 51 142 114
8016 114 -197 -32 -34 -178 -23 -172 291 -56 -100 43 -112 -81 78 130 -102 80 252 295 -169 -119 -211 1 128
8039 128 -107 84 -94 -151 51 12 -93 -144 -256 -23 83 -189 -23 -48 -172 -6 110 62 -69 -126 287 -104
8061 -104 -264 -77 15 142 -176 161 -175 -220 25 -207 -4 362 97 -365 13 142 -30 -154 336 -337 -102
8082a02l1j2M02l27K26m8n3K8Q2q7j74K55k41O1k14K32J9J36l78M45j96M05l10
8105A18l57J42P3L78o08M47j80J25k37J35k7Q5j51K20k4J2J27k84N7n5l8l6k10
8128b88L09j90J93r1J22J2j55N9K07k27J58l7k1j47r4M10k22k13L10J31j88l5
8150CK09j41j68k8j19O3pJ45J62m65K58J00N0O1j12L8r5o9K91j12j85K17l5K45
8174C06m76J4K48l0j78L3K6k50J27K95j6k1L60j91j51j53M6
$$ plain form
8082 -102 -133 -145 257 -70 156 108 55 83 165 78 -96 159 -82 -21 -235 -3 16 152 -226 219 23 428 118
8105 118 -239 -97 -24 354 -254 193 13 138 -99 36 9 94 -57 163 139 151 278 -6 51 -4 -42 -78 -288
8128 -288 21 -169 24 -67 55 67 -88 -29 178 -49 109 72 51 -96 -190 220 -2 -215 95 226 38 3
8150 3 212 71 -97 -125 -244 -181 -188 -43 119 -346 -88 12 62 123 11 49 -46 -115 176 64 -121 96 61 306
8174 306 -170 -156 92 62 -116 -83 -57 -307 -180 115 99 78 438 247 96 -57 -11
8191a1
$$ Imaginary data points
##PAGE= N=2
##DATA TABLE= (X++(I..I)), XYDATA
0@%%%nJ3qQj6J6k4L2m0N6p2Q8j04J23j47J74k07K42k81L28l76M32m95N66o46P30
29C87q28R34j048J179j320J475j643J826k030K253k500K769l064L394l759M165
45B190m619N129n710O373p140Q044r118J0427j2067J4182j7042K1144k7564L9149
59B3378o6714K52054K99101l15121k78730j90106K6908N4494Q5640R1717J68335
70A50956J31641M505j99696k68475j87487J6692J69720K32821J76942P1514o7567
81B31566j61208j84242j12860r861R1384J51085J65977J12028L732j27904k07788
92d8091j86763n9958R8866J97188J75640O6312n6555j26928j37828j06401n2291
103b36809K5002J14507J73311J47578K9174j17479j92796j50110k9782Q7161J47465
$$ plain form
0 0 0 0 0 -5 8 0 8 -8 8 -16 16 -24 32 -40 48 -56 67 -80 94 -113 129 -152 176 -200 232 -263 303 -343 387
29 387 -441 493 -555 624 -696 779 -864 962 -1068 1185 -1315 1454 -1610 1784 -1975 2190
45 2190 -2429 2700 -3010 3363 -3777 4267 -4851 5576 -6491 7691 -9351 11793 -15771 23378
59 23378 -43336 208718 507819 192698 -86032 -276138 -249230 -194736 -109096 -17379 150956
70 150956 282597 287102 87406 -181069 -368556 -351864 -182144 50677 227619 299133 231566
81 231566 70358 -113884 -226744 -236605 -145221 5864 171841 283869 287601 159697 -48091
92 -48091 -234854 -294812 -195946 1242 176882 243194 186639 59711 -78117 -184518 -236809
103 -236809 -211807 -97300 76011 223589 252763 135284 -57512 -207622 -237404 -150243 -2778
114b778J39954Q1352m028q3427j27147j22233p2351J0692J02537J59688J37458
125B19717K5995j14461j90434j48263l0983P2444J10199J02201Q6238N2097k8531
136A56219j32449j77084j02709M4155J55972J63172R3030J0866n2309j02768j37683
147h1588j17245j7811J13079J80586J34390J7433q4616j23721j16208q9377l7554
158b22632N0582J42826J70438R5613m3750j52159j63831q9315Q484P7580J12974
169a3190J21950R4209J7852q4954j55783j42564n1390O1945J34826J38850Q4415
180B06166L15q3707j36113j31440o4927L0121J05327J26583R3466K6457n0658
191A21590j12387j30591q5988Q267J02675J45188J11302K9601n4372j03205j06120
$$ plain form
114 -2778 137176 218528 214500 131073 3926 -118307 -190658 -179966 -77429 82259 219717
125 219717 245712 131251 -59183 -207446 -238429 -165985 -55786 46415 132653 184750 156219
136 156219 23770 -153314 -256023 -211868 -55896 107276 200306 211172 158863 56095 -81588
147 -81588 -198833 -216644 -103565 77021 211411 228844 144228 20507 -95701 -185078 -222632
158 -222632 -172050 -29224 141214 236827 193077 40918 -122913 -212228 -203744 -126164 -13190
169 -13190 108760 202969 220821 135867 -19916 -162480 -213870 -151925 -17099 121751 206166
180 206166 206481 122774 -13339 -144779 -209706 -179585 -74258 52325 145791 172248 121590
191 121590 9203 -121388 -207376 -199109 -96434 48754 160056 189657 135285 32080 -74040
202g4040o7657l207O4821J08449J04864N1445k7379r5845j22512r2943j8118O6060
214a06062J14255J00689L6664l8181q4224q9552o4711k3085L1364Q8664J14279
225H0100Q0702o317r3380j20939p5497M724O4491Q2768P2207M7834P431n0568
237I3556j02539j05214m5496M4196J04073J01785M7554j8612o7656r0532q2418
248a21303m0389K5951Q8810J08104P2830L229o1440r2598q3747m2353J9367Q0569
260d2970J10431Q7921J8028o0261j05908r6770m6919J5354O5755R1235Q2382L5016
272A53294l6334r7307j12549p1672K121P0685J02203Q8769L9700k3767p7493r8621
284f0971p4575j4305N4907R8819R8127N5205j0640p1126r9725q3530k7772L8357
$$ plain form
202 -74040 -141697 -144904 -80083 28366 133230 184675 157296 61451 -61061 -154004 -172122 -106062
214 -106062 8193 108882 145546 107365 23141 -66411 -131122 -154207 -122843 -34179 80100
225 80100 160802 154485 61105 -59834 -135331 -130607 -66116 16652 88859 136693 144124 93556
237 93556 -8983 -114197 -159693 -115497 -11424 90361 137915 119303 51647 -38885 -121303
248 -121303 -161692 -135741 -46931 61173 134003 137232 75792 -16806 -100553 -142906 -123539 -42970
260 -42970 67461 155382 173410 113149 7241 -89529 -136448 -121094 -55339 35896 118278 153294
272 153294 116960 19653 -92896 -164568 -162447 -91762 10441 99210 138910 115143 37650 -60971
284 -60971 -135546 -149851 -94944 3875 102002 157207 146567 75441 -24284 -107814 -135586 -97229
296i7229Q5521R0978N6617j991o0356r3256q6846m2377K2807P6469R3157O4500
308A07994Q512m7080p9752p7720m2386J3468O7338R0416P2037J9743l9209p5722
320A7639p5377m2357O565N1135P5008O6557K5383l1236p4903q1477m9612L821
332a08854M9253O9991N9652K4582k1800o0036p2426n1312k110M9564P6729O7202
344H0435K7645k0882n7008o7552m7990o359M0918P0147O6419L1562j9412o1001
356C6922p4566n5736j2299L4694O7102O7717L6388j3947n7594p5025n8006j5165
368a19515L4344O8681P4140M6276j814m8710p3043o3245k3587K8084O6588P6118
380F4317N1552L901m5868p5185p1385l5939J4768N7842P3866N6025J2043l7098
$$ plain form
296 -97229 -11708 79270 135887 133896 73540 -19716 -106562 -148939 -126132 -49663 43494 107994
308 107994 116506 69426 -10326 -88046 -130432 -116964 -49626 40790 112827 132570 93361 17639
320 17639 -57738 -100095 -93530 -42395 32613 99170 124553 93317 18414 -63063 -112675 -108854
332 -108854 -59601 10390 70042 94624 72824 12788 -59638 -110950 -113060 -63496 13233 80435
344 80435 108080 87198 30190 -37362 -85352 -91711 -50793 19354 85773 117335 97923 36922
356 36922 -37644 -93380 -105679 -70985 -3883 63834 100222 86275 28681 -46344 -104350 -119515
368 -119515 -85171 -16490 57650 103926 102112 53402 -19641 -82886 -106473 -78389 -11801 64317
380 64317 115869 119770 73902 -1283 -72668 -108607 -93839 -35997 37869 93894 105937 68839
392F8839p0907p3677m3743O064N2568P6028O4764K5609k3875o1817p0658m7384
404i8189j779M4734P1404O6393L2588j5659n5229p0889n3988j4464L0568O1999
416b511O2838L5767q927m9460o7278n5640k0050K4469N6189O2390M0428J441l7865
429D1791n7843n2196k0916J9598N1468O0723M2764N707l2412n5377n1727k5411
441g3831J2532M3580N4213L8595N074l0817n3406n2047k8035Q742M0560N3003
453A8163M0334R999k5759m8831m9056k6322R847M1665N4740M4293J3356k2056
465F0373m7977n0915k9528N030L7436N3253M3556J3857k2381n0006n5187l6503
477g8992j367L4142N2930M8211K0086j7434m7315n5130l8484l659L3193N5536
$$ plain form
392 68839 -2068 -75745 -119488 -113424 -60856 15172 79936 105545 81670 19853 -50805 -98189
404 -98189 -99968 -55234 16170 82563 115151 99492 44263 -26626 -80614 -95078 -64510 -2511
416 -2511 60327 96094 87167 37707 -29571 -85211 -105261 -80792 -24603 37787 78215 79656 41791
429 41791 -16052 -68248 -89164 -69566 -18098 42625 85389 91096 58684 3307 -48420 -73831
441 -73831 -61299 -17719 36494 75089 80163 49346 -4060 -56107 -84142 -75400 -34840 18163
453 18163 58497 68496 42737 -6094 -55150 -81472 -71625 -29960 24780 69073 82429 60373
465 60373 12396 -38519 -68047 -63017 -25581 27672 71228 85085 62704 12698 -42489 -78992
477 -78992 -80359 -46217 6713 54924 75010 57576 10261 -44869 -83353 -87012 -53819 1717
489A717N3506K8486q271m1494n5601m3883j1807K6299N2709N4934L3043m702l9765
502D5171n7699n0462k1129J6638M6023N4516L7449L404l2146n3161n0787k6883
514h9066J0462M3006N6541M4893J2798k3321m7327m8522k8913L847L5150N0946
526B0494M4929J8605j6481m4472n2022l5201l222K7735M4600M0963J9242j1032
538E4138l7238m7327l6203q370K3755M3894M3235K3022n706l0977m1014l2075
550e0866q577J9848L9583M1387K4752l348k9608m0959l4458j1486J4989L4565
562d178L7371K2736l294k8422m0555l5227j3477J4204L5122L9467K4918l32k4598
575B3735l7441l2413j2723J3171L4161M1718L0107M482k3981m1974l7536j5794
$$ plain form
489 1717 55223 83709 75438 33944 -21657 -65540 -77347 -51048 1661 56595 89638 84936 45171
502 45171 -12528 -62990 -84119 -67481 -21458 33058 70507 73911 41765 -11396 -62183 -89066
514 -89066 -78604 -35598 20943 65836 78634 55313 7986 -40536 -69449 -65602 -30452 20494
526 20494 65423 84028 67547 23075 -28947 -64148 -67370 -39635 4965 45928 65170 54138
538 54138 16900 -30427 -66630 -75000 -51245 -7351 35884 58906 53200 22223 -18791 -50866
550 -50866 -59443 -39595 -12 41375 66127 62779 33171 -7788 -42246 -53732 -38743 -4178
562 -4178 33193 55929 52635 24213 -16342 -51569 -65046 -50842 -15720 23747 48665 48333 23735
575 23735 -13706 -46119 -58842 -45671 -11510 30208 60315 64797 40816 -1158 -38694 -54488
587e4488J2043L2943L8049K7515M164k0709l9152m1382k5266L938L1980M3968
599A3603L4185R222j8931l8089m0034k4434K833K9167M3044L8591J7337j1618
611E4876l3606m1417l0556o275K1968M1690M1790K1085j0218l5962m3464l2217
623e2306q939J5473L2542L7185K6793L050k4736m2846l9339j5503J6434L7550
635a4642M0731K5403K428j8754l1365l2029j9461K724K6504L8720L2743R546j8977
648D3571l6909l7189j9508M247K4016L0163K4318R105j0376k5474l1891k4344
660e0271l158K0605L5275L1784J2639j1424k7251k8473j7133J081J7502K7210
672H386K6198J3719o315k3559l0910k3338n940J5339K8785K8402J2714r590k7466
$$ plain form
587 -54488 -42445 -9502 28547 56062 60226 39517 365 -41017 -66283 -62345 -30365 13603
599 13603 47788 57010 38079 -10 -40044 -64478 -61645 -32478 10566 49157 66494 54876
611 54876 21270 -20147 -50703 -56978 -35010 6680 48470 69555 59337 23375 -20089 -52306
623 -52306 -61245 -45772 -13230 23955 50748 53798 29062 -13784 -53123 -68626 -52192 -14642
635 -14642 26089 51492 53920 35166 3801 -28228 -47689 -44965 -18461 20259 53002 62548 43571
648 43571 6662 -30527 -50035 -45788 -21772 8391 32709 41814 31438 5964 -25927 -50271
660 -50271 -53429 -32824 2451 34235 46874 35450 8199 -20274 -37407 -36326 -18824 8386
672 8386 34584 48303 41988 18429 -12481 -35819 -41759 -26420 2365 30767 43481 33891 6425
685F425l1010j9870j211J6037K4714K5526J6344J70j8897l1268k7308p358J7956
698b9750L3724L1994J4211o267k2577k7681k2630j0498P607K3723L1287K3073
710D6216J416k2492l5475l1063j2339J0759K6915L0875K2193M489j5376k8705
722b587k8951j6047M413K3082L3660K8609J1378j1750k9804l3219k0747J449K1317
735a9197L0149K5756R844q734k4415l0164k4112p655J3123K7930L0510J8034l835
748C7234k3659l1096k2780l866J4967K4383K4918J6702K832j2692k4426k6753
760b4236j3702P334K5187K9005J7164j868j7882k4076k0607j0417K824J5776K2244
773F746J9055N327j1348k3403k3026j2055N256J9500K4212J8191M588j0247k0349
$$ plain form
685 6425 -24585 -44455 -45666 -29629 -4915 20611 36955 37125 18228 -13040 -40348 -47706 -29750
698 -29750 3974 35968 50179 43912 21335 -6346 -28976 -39474 -31867 -8144 23143 46216
710 46216 47632 25140 -10335 -41398 -53737 -42978 -16063 14812 37005 41494 26118 -2587
722 -2587 -31538 -47585 -43172 -20090 13570 42179 53557 41807 12003 -21216 -41963 -40514 -19197
735 -19197 10952 36708 46552 37818 13403 -16761 -40873 -48528 -35405 -7475 23035 41069 37234
748 37234 13575 -17521 -40301 -44167 -29200 -4817 20101 36803 39635 26943 2517 -24236
760 -24236 -37938 -30604 -5417 23588 40752 38884 21002 -3074 -23681 -34098 -31274 -15498 6746
773 6746 25801 31128 19780 -3623 -26649 -38704 -33448 -13948 10264 28455 33043 22796 2447
786B447j9669j0202L680J5644K0753J7590O085q717k0709k4051j5164J265J6719
799a4329K3412J7185L174j1155j9774k0167j2901%J3479K2654K1814J0671o420
812B7643k0244k4034j5732J142J5995K3929K0477R001n122j8491k3129j9227o418
825c4210J0698K2412K3947J3129m503j9439k5337k0080p044R475K0805K4350J6878
838C1081J391j4076k3322k1043r060O321J9222K4319J9667N949j1333k3429k4817
851a9130j3089L731J7556K1419J6319M905p391j7911k2278j7216l803J2478K3331
864a079K1817R299o878j8146j9509j2847r64J0056J7846J8883J1884o38j3078
877A6646j9706j7170n786Q699J7995J8431R516l789j4289j7976j3809n023M975
$$ plain form
786 2447 -17222 -27424 -23744 -8100 12653 30243 36328 27611 6902 -17149 -32313 -31048 -14329
799 -14329 9083 26268 29442 18287 -1487 -21654 -34555 -34555 -21076 1578 23392 34063 27643
812 27643 7399 -16635 -32367 -31225 -15230 8699 29176 38177 33055 14564 -8565 -27792 -34210
825 -34210 -23512 -1100 22847 35976 31473 12034 -13303 -33383 -40427 -30952 -10147 14203 31081
838 31081 32472 18396 -4926 -25969 -35029 -28708 -9486 14833 34500 40449 29116 5687 -19130
851 -19130 -32219 -28488 -10932 10487 26806 31711 24320 6409 -15869 -33085 -36888 -24410 -1079
864 -1079 20738 30037 23159 5013 -14496 -27343 -28307 -18251 -405 18478 30362 29724 16646
877 16646 -3060 -20230 -26016 -17317 678 19109 28625 24836 10547 -7429 -21238 -26261 -21286
890b1286J3423J5856J1779J368j0232j8050j5742n809P733J7363J7594J0552j044
903B3505j0492j4798j2693m844M141J2274J5798J2342K495j0439j8761j8256q198
916b7926O036J5473J6958J0259r99r365j4404j4596r382J375J3153K0126J7481
929B4189M918j0265j8017j6673p838L256J2310J6430J5561O853n590j6325k0271
942a1462j4276j674J1364J8572J6278P306n358j5057j8480j4253l275Q346J7267
955d702J7880J1606J3j1800j7608j6106n589P299J6501J8120J1679O11r860j6491
969A553j5745q967K233J2131J6839J2903K924r004j5296j5922r441J136J0641
982a4015J6035J3231N375m937j2811j4048r135J55J0042J4686J3152O043m181
$$ plain form
890 -21286 -7863 7993 19772 21140 10908 -7142 -22884 -28693 -20960 -3597 13997 24549 23505
903 23505 13013 -1785 -14478 -19322 -15181 -2907 12891 25233 27728 17289 -1472 -19728 -27926
916 -27926 -21890 -6417 10541 20800 19801 10436 -3968 -18564 -27946 -26571 -13418 6708 24189
929 24189 29107 18842 825 -15848 -23686 -20430 -8120 8310 23871 30724 25134 8809 -11462
942 -11462 -25738 -27412 -16048 2524 18802 26108 20750 5693 -12787 -27040 -30315 -21969 -4702
955 -4702 13178 24784 24797 12997 -4611 -20717 -26306 -19007 -2506 15614 27293 27904 18044 1553
969 1553 -14192 -23159 -20926 -8795 8044 20947 23871 14867 -429 -16351 -25792 -24656 -14015
982 -14015 2020 15251 20626 15689 2878 -11170 -20305 -20150 -10108 4578 17730 23773 19592
995A9592j1924j3651r257r60O753J1711J1736O040l570j1712j4657r849j334P603
1009a3479J2117J0985N271k155q893j1710r802k106P341J3725J3233O249k675
1022A8101j0372j1586r451k050N136J1543J2331P156j890j0654j4207j2010l799
1035b1752N575J2202J2910Q206j023r315j3555j1352m178M676J1892J4718J0905
1048A9909K018p387j4035j3294o520L157J1477J4229J0937K494o275j3358j4741
1061a1389r784L2R009J4526J2051N028m927j2243j3682j0141j260Q003J3656J3466
1075A2345P863j844r439j3031j1118l039N946J2119J3322Q034q84q846j2829j1132
1089a2533n218K977R262J1739Q497R27o814j2067j0643n558K723R111J1539Q449
$$ plain form
995 19592 7668 -5983 -15240 -16200 -9447 2264 14000 20040 16470 4758 -9899 -19748 -21082 -13479
1009 -13479 -1362 9623 14894 12739 3846 -7864 -17666 -19772 -12431 1294 14527 20776 18101
1022 18101 7729 -3857 -13308 -15358 -10222 1321 13652 20808 18918 8264 -5943 -17953 -21752
1035 -21752 -16177 -3975 8935 17141 16118 6803 -6752 -18104 -22282 -17606 -5714 9004 19909
1048 19909 21927 14540 505 -12789 -19309 -16152 -4675 9554 20491 22985 16710 3352 -11389
1061 -11389 -21173 -21141 -12132 2394 14445 19473 14546 2303 -11379 -21520 -22780 -14777 -1121 12345
1075 12345 20208 18364 8925 -4106 -15224 -18263 -12317 -198 13124 21158 20274 11428 -1401 -12533
1089 -12533 -17751 -14774 -5512 6227 14724 15651 8837 -3230 -13873 -19431 -16708 -7597 3942 12391
1103A2391K475m630r090r877n528J534Q529J0670Q496K469m782r215r957o098
1117a2613N93O510R405P942K064m881r336r502o294P54O658J0003Q083L545l611
1132I320q699r268n494J376O563J0559R125L262k799r280j0078o934m95O025J0329
1147C512R028L971l538r626j1080q108k062N866J0326J0160N807k015p606j0855
1161f220q877k569N284J0705J1578P570p6p019j1017r846m084L150Q677J1204
1175H460Q127J064o186j1338j1100o276Q63P941J0634R078L218m172r813j0094
1189i594o819k37P192J0657R823N003k336p537j0039p426j533N219R344R032M840
1204A5589j118p651r991p553l036L149P686Q638M813k57n858q787p195k654L324
$$ plain form
1103 12391 14866 10236 1146 -8731 -14259 -12725 -4196 6474 14970 17439 12657 3442 -6515 -12613
1117 -12613 -12020 -5510 3895 11837 13901 9020 -316 -9818 -16112 -15358 -8700 1303 9386 12931 9320
1132 9320 621 -8647 -14141 -12765 -6202 4357 13482 16744 13945 4665 -5413 -12347 -12842 -6817 3512
1147 3512 12540 16511 12973 3347 -7733 -15841 -17903 -12037 -1711 8449 14256 12241 4635 -6220
1161 -6220 -15097 -17666 -12382 -1677 9901 17471 17395 10376 -641 -10487 -14571 -11421 -2744 8460
1175 8460 16587 17651 11465 127 -10973 -17249 -16386 -8445 2189 11267 14485 10313 500 -9594
1189 -9594 -16413 -16650 -9458 1199 11022 16025 13689 6152 -3887 -11313 -12846 -7627 1717 10749 15589
1204 15589 14471 6820 -3171 -10724 -13760 -10611 -2925 5713 10526 10269 4411 -4376 -11571 -14225 -10901
1219a0901P472Q348N652M06m369p432o497k664K954O632P338N280L29m537q067
1234e6o951l338J646N976P307N243n71m845p636o924k863J902O301P882O021J204
1250A0298l992p042p530k988K363O409Q633O062J705m394p529p974m994Q81N989
1265d103P979O640K136l998q086q734n746m20O036Q537P971L273k235o531q367
1280e648o000j692M938Q738R127N504j214p125q523p189k270L399O823Q123N055
1295A2046N70n357q656q249m509K016O639Q498N831J620l978p151o848m299R41
1310a0886N462P750O880L224k378o405p498n067K76M705O610N910K136k220n707
1325B792o689n043j051L181N529N808L422j540m756o321m536l67L207O710N446
$$ plain form
1219 -10901 -3429 4919 10571 10977 6608 -824 -7321 -9985 -7031 -399 6939 12219 12548 8011 -56
1234 -56 -7007 -10345 -8699 -2723 4584 9827 9256 4411 -3225 -10149 -13012 -11110 -4809 3073 9094 10298
1250 10298 6306 -736 -8266 -11254 -8891 -2482 6151 12213 13918 9524 1995 -5979 -10973 -10092 -4103
1265 -4103 3876 10516 12652 8654 568 -8166 -13912 -14332 -8296 241 8212 11485 9250 2719 -5648
1280 -5648 -11648 -13340 -8402 336 9463 14967 13753 6628 -1895 -9084 -11354 -7955 -1132 6991 12046
1295 12046 12616 7259 -1397 -9646 -14155 -12139 -5500 2998 8829 10449 6471 -680 -7528 -11827 -10886
1310 -10886 -5424 2326 9206 12430 10052 3647 -3851 -8918 -8642 -3937 2673 8583 10719 8499 2792
1325 2792 -3897 -8940 -9991 -6810 -1281 4527 7949 6409 1653 -4668 -9204 -9571 -6364 346 5792
1340E792K998j344l938m804l946j085K196N228N788L516j124n416o872m760k37
1355h008K793M715M336K724k50l765o090n694j958L355O523O565L405r87l559
1370D105n898m534k109K410N558P032M202k85m240o468n818k933R98M975O290
1385C285N388Q71m089o919o478l098Q71M777O471N430K746j446n680o806m779
1400i456J30M363P406O262K238j414n092o589m849j580K317N554N979L801n45
1415H525m092o959n765k622K702N160N769L663R46l091n011m897k897J568M815
1430b186N905L803J392k381m786m702l310L68L249N613M050J75k882m621l969
1445d282k132n53K084M150M399K624j599n017n269j838J786L797L769K544J177
$$ plain form
1340 5792 8790 7446 3508 -1296 -5242 -6327 -4131 1097 6885 10401 9277 3861 -3011 -7771 -8008
1355 -8008 -5215 -500 3836 6560 6310 2545 -3545 -9239 -11197 -7842 -1319 5246 8651 7664 4105
1370 4105 -1793 -6327 -8436 -6026 -468 6564 10766 10481 6241 -227 -6045 -8978 -7980 -3005 3285
1385 3285 8673 9544 5455 -1464 -7942 -11040 -10169 -5392 1079 6509 9255 7809 2129 -4677 -9456
1400 -9456 -9326 -4963 2443 8705 10943 9529 4437 -2152 -7001 -8581 -6264 -710 5269 9070 8525
1415 8525 4433 -2526 -8291 -10913 -8211 -3051 2718 6381 7327 4236 -775 -5672 -8569 -7001 -2186
1430 -2186 3719 7522 8914 6533 1747 -2955 -6265 -5897 -2648 2965 7015 7190 4308 -313 -4282
1445 -4282 -6414 -6967 -4883 -733 3666 6290 4691 -326 -5595 -7433 -5647 -1850 1919 4463 5640
1460E640l08k412m297l800n06L365N316L667Q16k951m034l867k362q38K437M216
1476H2L892J993j861l832m731k885l78K844M535N350L126j294m334n213l421J76
1492e951K718M015M112L253N0l182n841n474k395K357M797N454K973r63l042m712
1508a831m071k568O07L930N024M995J977j797m982n697k967R27M468N071L060
1523F146J597j146l054m885m214j893K177N467M725K041j825m315m089k640j128
1538g036J190L569M377L559j14k983m071l106m92J416K964L798L041J052k467
1553D697m283m085r16J541K828K111J929L80q85l151m111k926J260L357M392J947
1569D085r72k001k576j467j286j88K868L682L415M07j975l905l341q93J285K476
$$ plain form
1460 5640 5332 2920 -1377 -5177 -5683 -2318 2998 6665 7481 4530 496 -3371 -5733 -6571 -4134 82
1476 82 3974 5967 4106 274 -4457 -7342 -7720 -4876 -341 5009 8135 6841 2507 -2706 -6127 -5951
1492 -5951 -3233 782 4894 8147 8197 5015 -826 -6300 -8695 -6338 -1541 3913 6886 5923 2881 -1831
1508 -1831 -5902 -8470 -7863 -3933 1091 6086 8063 6266 1284 -4413 -7380 -6453 -1985 3086 6146
1523 6146 7743 6597 3543 -1342 -5556 -7449 -5272 195 4920 6961 5136 821 -3268 -5908 -7036
1538 -7036 -5846 -2277 2100 5659 5545 2562 -1509 -4615 -5107 -3691 -727 3071 6112 7164 4697
1553 4697 414 -3671 -4587 -3046 -218 1893 3822 4202 3317 166 -3945 -6871 -5611 -2254 2138 4085
1569 4085 3113 1112 -1464 -2931 -4217 -4405 -1537 2145 5560 5967 3992 87 -3254 -4147 -2862 -386
1585c86K944K646K9j900l724l487j984N31K536L634L128N94j432l405l922k376
1601f574P46L110L841L964J291r67l361m004k572j13K337L561L393J854m99l159
1617B848m464l987j193J891M341L314J955m01k394l479l144j619K73L423M954
1632B318L418L23k495l512k644j729K39K096L582L709J496j519l921m178j751
1647d568J34J888K253K571K152o84k709l933k834K15K076L226K719J089j8j585
1663A992k460k434p58R69L012L248J317q01k026k752j759j111Q65K258K540J602
1679C702q44k206k867j742n10J211K288K251J960k96j699k632j874k91J499K486
1695D36K417J649j77j551l334j892j313J234K545K285J884k0k435l116k769r37
$$ plain form
1585 -386 2558 5204 5233 3333 -391 -3878 -5862 -5331 -2795 839 3967 4561 3129 -276 -4198 -6574
1601 -6574 -5828 -2718 1123 5087 6378 5411 2050 -1954 -4526 -4639 -2302 1259 4652 6506 6007 2848
1617 2848 -1616 -5603 -6796 -4905 -564 2750 4705 4304 1910 -1569 -4713 -6332 -6059 -2636 2318
1632 2318 5736 6059 3564 52 -2592 -4321 -4082 -1986 1596 5305 6801 5282 1361 -2817 -4568
1647 -4568 -4434 -2546 -293 2278 4430 3746 1037 -2896 -5730 -5515 -3439 -213 2506 3595 3577 1992
1663 1992 -468 -2902 -3660 -2691 321 3569 4886 4085 2059 -693 -2452 -3563 -2698 -440 2100 3702
1679 3702 2858 652 -2215 -3957 -4467 -3256 -968 1283 3243 2947 1248 -1384 -3258 -3549 -2050 436
1695 436 2853 4502 4325 2774 -560 -2452 -3765 -2531 14 2299 4183 4163 1728 -1388 -4157 -5094
1711e094J204K259K962J808O05j491k459l200j595K04L259L867K418L90j901k135
1727A101k638k033n92J723L229L302J696j782k918l444k340k68J359K703K762
1742A860J832J70k236l818k182o13J462K718K917K084K84j247l045k575j192R02
1758b679K439K674J662j54q86k272l009j815J51J624K760J851M81j049k056k097
1774b375j269L0J445K329K361O76n57j380k644r54p8J667K082J647N43r11j861
1791G51j961j173k84Q29K242J527Q31j041k305k207q21M07R91K599J493P71m61
1808B188j478k298j036m09K065K226J946P21n52j972k314j527n63J058K337K052
1824B444J209p15k333k333j602r40J001K155K579J683J22j790k485j905p26R27
$$ plain form
1711 -5094 -3890 -1631 1331 3139 3744 2253 -206 -3406 -5001 -4797 -1538 2329 4747 5137 3236 1101
1727 1101 -1537 -3570 -4162 -2439 790 4092 5788 4006 1088 -2356 -4696 -4964 -3605 -902 1860
1742 1860 3692 3862 1626 -2192 -4374 -4987 -3525 -807 2110 4194 4478 3231 186 -2389 -3581 -2679
1758 -2679 -240 2434 4096 3942 3056 784 -2225 -4040 -3889 -2265 495 2346 2827 1778 -278 -2375
1774 -2375 -3644 -3614 -2169 160 2521 3197 2640 1260 -1384 -2338 -2416 -749 1333 2980 3523 2612 751
1791 751 -1210 -2383 -2667 -1838 404 1931 2762 1721 -584 -2791 -3612 -3205 -2214 385 1878 2649 2188
1808 2188 710 -1588 -2624 -3033 -968 1258 3204 3925 3373 1401 -913 -2440 -3003 -1945 392 2444
1824 2444 3653 2938 605 -1728 -3330 -4270 -3269 -1114 1465 3148 3270 1480 -1005 -2910 -3636 -2709
1840b709K071K541J972L54j212k428k469j338q5J935K643K103L14q16k599k439
1856b162j656k30J370K362J957J281k86j952k007j838R9Q10K217K268J471j61
1872C543j589k042j385r63O32J575J722J550k23j065k065j808r40M17J436J724
1888E19J103l2p09j439j413o27M65J079J952R27O64n08j824j191p40K97J430J299
1906A252J322j09r96j393j664q13K49J181J717Q66N10j213j530j862l93K97J554
1923a025J901J237O37r10j518j778o73L92J325J722J575K01p44j627j835j305
1939b425j17J126J235K199M21k66j695k060j563n94J529J727K130J164Rj426j991
1956e97j759n12O25K123J984J439M22j425k038k086r54M06J621J359J581L18o44
$$ plain form
1840 -2709 -638 1903 3875 4229 3017 589 -1880 -3218 -3303 -1368 1275 3378 3692 2876 277 -2162
1856 -2162 -3818 -4048 -2678 -316 1641 2922 2636 684 -1323 -3161 -3062 -2252 -35 2233 3704 3543
1872 3543 1954 -88 -1473 -2436 -1804 -229 1493 3043 2820 1755 -310 -2118 -3058 -2641 -1205 519
1888 519 1622 1590 881 -558 -1971 -2598 -2133 -1054 898 1825 2489 1981 157 -1034 -1774 -1477 -47 1252
1906 1252 2574 2465 1469 76 -1588 -2401 -2152 -971 746 1612 2122 909 -621 -2483 -2876 -2579 -1025
1923 -1025 876 2113 2750 1840 322 -1456 -2129 -1737 -412 1310 2885 3086 2342 715 -1120 -2425
1939 -2425 -2542 -1416 -181 2018 2439 2173 478 -1582 -3145 -3739 -2210 -483 1647 2811 2820 1394 -597
1956 -597 -2356 -2868 -2243 -120 1864 3303 3725 2300 262 -1824 -2778 -2372 -751 608 2189 2507 1863
1973A863j811j927r97k47J087J674J751J060l42j425j494j265l2O87J521J834
1989A937O45k19q86j485j355l01O86J118J075R65m35r15j825r20j71N85R99J086
2007E84N02M14j188r89p71m89O64J307J323P24k19p24j201r51l62O58J147R98
2025A427O31k46j284r57j271m62P02J065J118J033Mq73j966r99m97Q90J490J060
$$ plain form
1973 1863 52 -1875 -2872 -3119 -2032 -358 1393 2453 2111 686 -808 -2073 -2105 -1418 103 1937
1989 1937 2582 2363 1477 -8 -1363 -1664 -978 140 1215 2180 1745 830 -995 -1915 -2086 -1501 -502 584
2007 584 1086 1500 312 -677 -1448 -1937 -1273 34 1357 2081 1862 1138 -63 -1014 -1376 -718 429 1427
2025 1427 2058 1812 528 -429 -1700 -2162 -1460 -395 723 1756 1760 887 -1079 -2078 -2575 -1685 -195 865
$$ [...]
8191d2
##END NTUPLES=NMR FID
##END=
