##TITLE=1H_PR185_8_2
 D2O, 8 sc, 
 22.11.2019
##JCAMPDX= 6.0         $$ Bruker NMR JCAMP-DX V2.0
##DATA TYPE= NMR FID
##DATA CLASS= NTUPLES
##ORIGIN= UXNMR, Bruker Analytische Messtechnik GmbH
##OWNER= root
$$ XWIN-NMR		Version 3.5
$$ Fri Nov 22 14:16:20 2019 Russian Standard Time (UT+4h)  she@DPX200
##.OBSERVE FREQUENCY= 200.1315
##.OBSERVE NUCLEUS= ^1H
##.DELAY= (6, 6)
##.ACQUISITION MODE= SIMULTANEOUS
##.ACQUISITION SCHEME= undefined
##.AVERAGES= 8
##.DIGITISER RES= 18
##SPECTROMETER/DATA SYSTEM= spect
##.PULSE SEQUENCE= zg30
##.SOLVENT NAME= D2O
##.SHIFT REFERENCE= (INTERNAL, D2O, 0, 15.7039)
##AUDIT TRAIL= $$ (NUMBER, WHEN, WHO, WHERE, WHAT)
$$ ##TITLE= Audit trail, XWIN-NMR		Version 3.5
$$ ##JCAMPDX= 5.01
$$ ##ORIGIN= Bruker BioSpin GmbH
$$ ##OWNER= she
$$ F:/spectra/data/she/nmr/H-F/1/audita.txt
$$ ##AUDIT TRAIL=  $$ (NUMBER, WHEN, WHO, WHERE, WHAT)
(   1,<2019-11-22 14:15:15.45 +0400>,<she>,<DPX200>,
      <created by zg, POWCHK disabled, PULCHK disabled
       configuration hash MD5:
       00 E9 B6 7A A2 85 ED C7 34 08 36 98 17 FE 4E 26
       data hash MD5: 16K
       7C 8C 29 8A 67 E8 E1 22 78 B2 CA 37 2C F2 EE 35>)
$$ ##END=
$$ 
$$ hash MD5
$$ D5 47 94 9A 68 FD 93 88 34 37 5E 73 D1 A3 0A 2A
##$RELAX= 
##$RELAX= 
##$RELAX= 
##$RELAX= 
##$RELAX= 
##$RELAX= 
$$ Bruker specific parameters
$$ --------------------------
##$DU= <F:/spectra>
##$EXPNO= 1
##$NAME= <H-F>
##$PROCNO= 1
##$TYPE= <nmr>
##$USER= <she>
##$AMP= (0..31)
100 100 100 100 100 100 100 100 100 100 100 100 100 100 100 100 100 100 
100 100 100 100 100 100 100 100 100 100 100 100 100 100 
##$AQSEQ= 0
##$AQ_mod= 1
##$AUNM= <au_zg>
##$AUTOPOS= <>
##$BF1= 200.13
##$BF2= 200.13
##$BF3= 200.13
##$BF4= 200.13
##$BF5= 200.13
##$BF6= 200.13
##$BF7= 200.13
##$BF8= 200.13
##$BYTORDA= 1
##$CFDGTYP= 0
##$CFRGTYP= 5
##$CHEMSTR= <none>
##$CNST= (0..31)
1 1 145 1 1 1 1 1 1 1 1 1 1 1 1 1 1 1 1 1 1 1 1 1 1 1 1 1 1 1 1 1 
##$CPDPRG= <>
##$CPDPRG1= <>
##$CPDPRG2= <>
##$CPDPRG3= <>
##$CPDPRG4= <mlev>
##$CPDPRG5= <mlev>
##$CPDPRG6= <mlev>
##$CPDPRG7= <mlev>
##$CPDPRG8= <mlev>
##$CPDPRGB= <>
##$CPDPRGT= <>
##$D= (0..31)
0 1.2 0 0 0 0 0 0 0 0.06 0 0.03 0 0 0 0 0.0002 0 0 0 0 0 0 0 0 0 0 0 0 
0 0 0 
##$DATE= 1574417714
##$DBL= (0..7)
120 120 120 120 120 120 120 120 
##$DBP= (0..7)
150 150 150 150 150 150 150 150 
##$DBP07= 0
##$DBPNAM0= <>
##$DBPNAM1= <>
##$DBPNAM2= <>
##$DBPNAM3= <>
##$DBPNAM4= <>
##$DBPNAM5= <>
##$DBPNAM6= <>
##$DBPNAM7= <>
##$DBPOAL= (0..7)
0.5 0.5 0.5 0.5 0.5 0.5 0.5 0.5 
##$DBPOFFS= (0..7)
0 0 0 0 0 0 0 0 
##$DE= 6
##$DECBNUC= <off>
##$DECIM= 24
##$DECNUC= <off>
##$DECSTAT= 4
##$DIGMOD= 1
##$DIGTYP= 9
##$DL= (0..7)
0 120 120 120 120 120 120 120 
##$DP= (0..7)
150 150 150 150 150 150 150 150 
##$DP07= 0
##$DPNAME0= <>
##$DPNAME1= <>
##$DPNAME2= <>
##$DPNAME3= <>
##$DPNAME4= <>
##$DPNAME5= <>
##$DPNAME6= <>
##$DPNAME7= <>
##$DPOAL= (0..7)
0.5 0.5 0.5 0.5 0.5 0.5 0.5 0.5 
##$DPOFFS= (0..7)
0 0 0 0 0 0 0 0 
##$DQDMODE= 0
##$DR= 18
##$DS= 0
##$DSLIST= <SSSSSSSSSSSSSSS>
##$DSPFIRM= 0
$$ [...]
##$SUBNAM2= <"">
##$SUBNAM3= <"">
##$SUBNAM4= <"">
##$SUBNAM5= <"">
##$SUBNAM6= <"">
##$SUBNAM7= <"">
##$SUBNAM8= <"">
##$SUBNAM9= <"">
##$SW= 24.9337058887773
##$SWIBOX= (0..15)
0 0 2 0 0 0 0 0 0 0 0 0 0 0 0 0 
##$SW_h= 4990.01996007984
##$TD= 16384
##$TD0= 1
##$TE= 0
##$TE2= 300
##$TE3= 300
##$TEG= 300
##$TL= (0..7)
0 120 120 120 120 120 120 120 
##$TP= (0..7)
150 150 150 150 150 150 150 150 
##$TP07= 0
##$TPNAME0= <>
##$TPNAME1= <>
##$TPNAME2= <>
##$TPNAME3= <>
##$TPNAME4= <>
##$TPNAME5= <>
##$TPNAME6= <>
##$TPNAME7= <>
##$TPOAL= (0..7)
0.5 0.5 0.5 0.5 0.5 0.5 0.5 0.5 
##$TPOFFS= (0..7)
0 0 0 0 0 0 0 0 
##$TUNHIN= 0
##$TUNHOUT= 0
##$TUNXOUT= 0
##$USERA1= <user>
##$USERA2= <user>
##$USERA3= <user>
##$USERA4= <user>
##$USERA5= <user>
##$V9= 5
##$VALIST= <valist>
##$VCLIST= <CCCCCCCCCCCCCCC>
##$VD= 0
##$VDLIST= <DDDDDDDDDDDDDDD>
##$VPLIST= <PPPPPPPPPPPPPPP>
##$VTLIST= <TTTTTTTTTTTTTTT>
##$WBST= 1024
##$WBSW= 4
##$XGAIN= (0..3)
0 0 0 0 
##$XL= 0
##$YL= 0
##$YMAX_a= 300157
##$YMIN_a= -193498
##$ZGOPTNS= <>
##$ZL1= 120
##$ZL2= 120
##$ZL3= 120
##$ZL4= 120
##$ABSF1= 10
##$ABSF2= 0
##$ABSG= 5
##$ABSL= 3
##$ALPHA= 0
##$AQORDER= 0
##$ASSFAC= 0
##$ASSFACI= 0
##$ASSFACX= 0
##$ASSWID= 0
##$AUNMP= <proc_1d>
##$AZFE= 0.1
##$AZFW= 0.1
##$BCFW= 1
##$BC_mod= 2
##$BYTORDP= 1
##$COROFFS= 0
##$CY= 11.3945322036743
##$DATMOD= 1
##$DC= 2
##$DFILT= <>
##$DTYPP= 0
##$F1P= 16.9975609425685
##$F2P= -3.02152046262296
##$FCOR= 0.5
##$FTSIZE= 0
##$FT_mod= 4
##$GAMMA= 1
##$GB= 0.15
##$INTBC= 1
##$INTSCL= 1
##$ISEN= 128
##$LB= 0.24
##$LEV0= 0
##$LPBIN= 0
##$MAXI= 10000
##$MC2= 0
##$MEAN= 0
##$ME_mod= 0
##$MI= 1.114404
##$NCOEF= 0
##$NC_proc= 0
##$NLEV= 6
##$NOISF1= 3.799351
##$NOISF2= 2.8
##$NSP= 1
##$NTH_PI= 0
##$NZP= 0
##$OFFSET= 15.70392
##$PC= 1
##$PHC0= -9795.145
##$PHC1= 17.80086
##$PH_mod= 1
##$PKNL= yes
##$PPARMOD= 0
##$PSCAL= 0
##$PSIGN= 0
##$REVERSE= no
##$SF= 200.130013532006
##$SI= 16384
##$SIGF1= 3
##$SIGF2= 2
##$SINO= 400
##$SIOLD= 16384
##$SREGLST= <1H.CDCl3>
##$SSB= 0
##$STSI= 0
##$STSR= 0
##$SW_p= 3612.71676300578
##$SYMM= 0
##$S_DEV= 0
##$TDeff= 0
##$TDoff= 0
##$TI= <>
##$TILT= no
##$TM1= 0
##$TM2= 0
##$TOPLEV= 0
##$USERP1= <user>
##$USERP2= <user>
##$USERP3= <user>
##$USERP4= <user>
##$USERP5= <user>
##$WDW= 1
##$XDIM= 8192
##$YMAX_p= 0
##$YMIN_p= 0
$$ End of Bruker specific parameters
$$ ---------------------------------
##NTUPLES= NMR FID
##VAR_NAME=  TIME,          FID/REAL,        FID/IMAG
##SYMBOL=    X,             R,               I
##VAR_TYPE=  INDEPENDENT,   DEPENDENT,       DEPENDENT
##VAR_FORM=  AFFN,          ASDF,            ASDF
##VAR_DIM=   8192,          8192,            8192
##UNITS=     SECONDS,       ARBITRARY UNITS, ARBITRARY UNITS
##FACTOR=    0.0002004,     1,               1
##FIRST=     0,             0,               0
##LAST=      1.6414764,     0,               0
##MIN=       0,             -193498,         0
##MAX=       1.6414764,     300157,          0
$$ Real data points
##PAGE= N=1
##DATA TABLE= (X++(R..R)), XYDATA
0 0 0 0 0 0 0 0 0 0 -8 8 -8 8 -16 16 -16 24 -24 32 -40 46 -54 62 -73 84 -97 110 -126 143 -164 184 -208
31 -208 234 -263 294 -328 367 -408 454 -505 560 -619 686 -760 841 -930 1032 -1146 1274 -1423
49 -1423 1591 -1791 2028 -2316 2676 -3133 3748 -4613 5936 -8229 13293 -49298 106530 182865
63 182865 -5878 9813 94746 -9886 -193498 -144935 -9211 25888 37363 117921 113796
74 113796 19309 -26257 -28319 -88944 -96620 26740 129611 106911 88522 93558 6276 -101408
86 -101408 -55913 42697 34018 32557 147398 177208 24342 -70142 9655 44206 -32579 -8937
98 -8937 131710 163094 71904 33684 32355 -32278 -60985 30969 105059 79907 82882 127193 63961
111 63961 -69316 -77084 20527 49999 31632 82035 132293 80098 -774 -27781 -49028 -66752
123 -66752 -8330 83157 99585 71713 70721 36937 -66737 -120607 -60790 8852 33517 73392
135 73392 108335 53287 -39254 -65275 -64691 -96040 -74992 38203 107598 59097 4418 1161
147 1161 -40032 -124851 -131232 -41096 31747 47070 51699 38064 -22933 -86693 -103705 -93651 -67296
160 -67296 -6405 53135 52432 8526 -27799 -63590 -107103 -109184 -53366 2650 27990 42633 32946
173 32946 -29310 -97004 -102075 -67205 -44549 -15948 37881 60885 14437 -47087 -72010 -75837
185 -75837 -73184 -41715 13849 48826 45129 18975 -21397 -68123 -87413 -59962 -11252 28143
197 28143 53922 60501 32419 -22758 -66516 -72444 -45169 -2248 42367 71344 70696 37932 -11468
210 -11468 -53349 -65698 -41585 6770 55716 84770 80592 46160 -4301 -46783 -59648 -34619
222 -34619 14514 62091 89861 87770 52182 -421 -39733 -48627 -31174 8057 62126 98886
234 98886 89645 46918 4831 -27860 -51507 -40825 13261 68923 87109 76122 52534 9149
246 9149 -40134 -55178 -26432 13256 48292 77422 80087 41629 -9272 -38327 -46710 -37876 1048
259 1048 52467 73852 56676 28038 -6890 -48234 -64371 -35156 9507 37604 54516 57399
271 57399 23771 -31950 -60422 -54418 -39071 -11370 36175 64915 41979 -1612 -31100 -56300
283 -56300 -75141 -53880 2097 40975 44063 34017 9321 -39750 -80135 -75099 -41436 -9024
295 -9024 25702 54254 42031 -6916 -48595 -67746 -75527 -58872 -7237 40126 46790 28888 5072
308 5072 -35934 -79795 -82235 -41921 -2447 24179 47857 48068 4349 -47885 -67305 -63240 -48409
321 -48409 -10600 39991 57584 34461 3800 -25070 -59433 -72236 -37867 11679 36930 44870
333 44870 45845 18883 -32054 -60860 -49361 -22646 4831 40613 62709 45731 6438 -23706
345 -23706 -42376 -48611 -23886 22746 53495 55403 44118 19682 -22189 -51632 -39641 -5710
357 -5710 22980 49028 68860 54604 8343 -28886 -38397 -34263 -15301 27221 66743 69124 43083
370 43083 13274 -19244 -47095 -43477 -5466 33971 56374 66269 54836 13870 -31636 -47481
382 -47481 -34989 -12425 21332 59709 71525 45608 6576 -24733 -45730 -47707 -18425 25605
394 25605 53887 58168 43528 10022 -31233 -53717 -45028 -18081 14767 45984 56753 35648
406 35648 -1421 -31948 -48991 -49846 -24320 16411 43052 42773 26166 -310 -35483 -58853 -49881
419 -49881 -17932 12332 32515 40895 26282 -10924 -46028 -56734 -45658 -21882 9689 37267
431 37267 41097 17981 -16556 -45126 -58156 -49459 -20237 14637 38363 40039 18395 -17464 -48032
444 -48032 -59133 -47408 -18566 16111 41553 42430 18323 -15780 -44534 -57465 -47091 -15744
456 -15744 20602 43175 43171 22964 -9969 -42655 -55934 -42573 -11599 21420 44786 47446 26898
469 26898 -8915 -39534 -49464 -37116 -9110 23318 48218 50027 26630 -8124 -33848 -42844 -33620
482 -33620 -6696 28445 51287 48396 24615 -4703 -28990 -41388 -31360 -792 32712 50814
494 50814 47125 26336 -3920 -30618 -40135 -27060 1444 32748 51827 47949 24735 -6047 -30545
507 -30545 -40202 -27661 3104 35378 50840 45383 23865 -6701 -34148 -41042 -25600 3271 32278
520 32278 49671 46524 20871 -11310 -33821 -40465 -28598 252 33158 48878 40088 17246 -10375
533 -10375 -35580 -45915 -30102 2511 29864 42072 38216 17842 -14727 -41699 -46152 -27988
545 -27988 273 26393 40766 36666 12871 -18771 -42379 -46564 -29377 -735 25348 37912
557 37912 33027 10608 -21106 -44720 -47367 -29476 -1883 23797 37615 31895 7308 -23552 -44801
570 -44801 -46619 -29932 -1826 24775 37893 29899 5712 -22994 -43147 -46461 -29862 -546 26882
583 26882 37679 29590 6461 -22471 -43424 -44865 -25884 2229 26733 38705 31775 5626 -23255
596 -23255 -39895 -38629 -23856 1971 30001 42344 30832 5879 -18832 -35982 -39214 -21214
608 -21214 8609 32750 41021 33324 9992 -20243 -37958 -33497 -14368 9338 32660 44994 33845
621 33845 6727 -17437 -32092 -33162 -16089 14372 37736 41760 32300 12818 -16190 -38016 -33581
634 -33581 -8596 15688 33551 44272 36472 7598 -20880 -32652 -29381 -14077 13454 39081
646 39081 43185 28560 8151 -14916 -36399 -36642 -11500 17239 33045 39111 33090 6180 -25721
659 -25721 -37133 -28631 -14088 7771 34517 43565 24245 -2642 -20086 -33017 -37209 -18237 13727
672 13727 32937 33272 24219 3121 -26968 -42296 -32083 -12303 5714 27047 39182 22849 -9456
685 -9456 -28948 -34015 -33798 -20118 9665 31895 30193 15948 -2161 -27176 -43980 -35212 -10418
698 -10418 8961 23346 33707 22916 -9730 -34952 -36508 -29147 -17639 8993 33882 32580 11575
711 11575 -6875 -23341 -40543 -38102 -9434 18468 27557 27671 21212 -2590 -32209 -40777 -27709
724 -27709 -8858 12894 34102 36550 15539 -8161 -22885 -34225 -33453 -8411 22867 34699 29790
737 29790 20222 852 -26700 -38289 -24511 -2737 16111 34451 41242 20988 -8764 -23182
749 -23182 -26691 -26520 -9340 23347 42553 33381 16010 1002 -18661 -34494 -25076 1161 21657
762 21657 32744 36695 24407 -3899 -25203 -27542 -19209 -4399 19388 38648 35357 16241 -3219
775 -3219 -20601 -31772 -22719 2343 22345 29409 31154 21584 -4883 -29154 -30382 -15805 -1252
788 -1252 15564 33368 33275 11973 -11238 -23912 -30084 -24588 -1327 23456 30204 22822 11294 -7577
802 -7577 -30068 -36792 -20885 1668 18342 27693 26610 9886 -14945 -32129 -34907 -23740 -1813
815 -1813 20522 29869 23488 7581 -14274 -34434 -38076 -22941 -454 17003 28420 27309 7877
828 7877 -18873 -33542 -33556 -24267 -5996 18335 32529 26369 5768 -15211 -30038 -34689 -25294 -3752
842 -3752 18543 30265 25855 7638 -13544 -28396 -31561 -22808 -2453 19945 30051 23936 8373
855 8373 -9978 -26526 -30754 -17963 2978 19407 26868 25388 10536 -12373 -26446 -24933 -13242
868 -13242 3502 21444 30177 23454 6788 -10292 -23623 -25907 -11868 10059 24732 28313 23769
881 23769 9586 -13009 -27848 -23149 -7638 9745 25715 33463 24958 4694 -14274 -24968 -25459
894 -25459 -11163 12709 29240 31426 24595 8164 -14778 -30708 -25333 -7594 9097 24127 35440
907 35440 28762 3591 -18727 -25841 -23965 -15457 5755 28783 34380 21849 4610 -13398 -28049
920 -28049 -29166 -13264 6920 22507 30798 24955 3264 -18431 -26275 -24117 -16903 1649 24570
933 24570 30276 16080 -636 -12731 -25602 -30118 -15092 7460 19826 21882 17405 2094 -19565
946 -19565 -29650 -23128 -11755 2482 19596 26443 13394 -6202 -17990 -25183 -27313 -13929 9576
959 9576 22401 19208 11257 -540 -19699 -32913 -25242 -6173 8663 18883 25094 15333 -7093
972 -7093 -23555 -27422 -23893 -11274 10756 26706 23581 10508 -2381 -18066 -32056 -26698 -5033
985 -5033 13578 21872 25312 19498 -2299 -23575 -28409 -19973 -7692 9998 28326 29588 14189
998 14189 -3013 -15588 -25490 -24659 -5770 16020 25801 25088 19188 2705 -18212 -26926 -17833 -3583
1012 -3583 11134 25984 30910 17028 -2820 -15079 -20048 -19014 -5586 16055 27374 24138 14930
1025 14930 2465 -14883 -24599 -16639 227 13536 22902 26773 17308 -3547 -18594 -20942 -14497
1038 -14497 -2439 14263 26567 24199 10790 -3849 -17031 -23944 -16711 617 15677 22650 23051
1051 23051 13140 -6238 -22675 -24575 -15102 -1889 13685 25418 23502 8415 -9265 -21186 -25689
1064 -25689 -19388 -2244 15839 23657 19874 8838 -7558 -23666 -28675 -18773 -2582 12738 22702
1077 22702 21854 8454 -10140 -24250 -27300 -20214 -4226 13249 22499 19621 7358 -9195 -23142
1090 -23142 -27649 -19097 -3780 11520 20762 19978 7776 -9813 -22489 -25006 -18075 -4018 12387
1103 12387 22009 18868 5866 -9537 -20764 -23778 -16035 -1237 13479 20752 18443 6339 -9180
1116 -9180 -20777 -22173 -13666 515 14882 22210 18989 5540 -10188 -20743 -20919 -11440 3019
1129 3019 16702 23332 19342 5486 -10531 -20361 -19369 -10285 4103 18266 25598 19882 5498 -10018
1143 -10018 -20013 -20386 -10809 5676 20556 26279 20515 6415 -9515 -20098 -20518 -10514 6212
1156 6212 20870 26447 20697 6795 -8569 -19556 -21150 -10845 5674 19958 25246 20110 7505
1169 7505 -8701 -19685 -20281 -10548 4356 18229 24604 19101 5143 -9275 -18148 -19899 -11774 3778
1183 3778 17861 22097 15855 3985 -9718 -19342 -20286 -10497 4265 16432 20086 14334 1824 -11997
1197 -11997 -20368 -19518 -9818 4279 16256 19020 12322 -443 -13340 -21994 -20154 -8787 5524
1210 5524 15609 18291 11958 -1143 -16249 -23666 -20025 -8905 5264 16514 19535 11643 -2700
1223 -2700 -16746 -23264 -21204 -9578 6482 17843 19107 11667 -1268 -15827 -24592 -21577 -8603
1236 -8603 6461 17611 20125 13026 -737 -15292 -22869 -20177 -8701 6769 17999 20278 13217
1249 13217 142 -13864 -21881 -18850 -7156 6899 17646 20212 13719 -104 -13192 -19315 -15959
1262 -15959 -5961 7182 18345 20584 12872 20 -11906 -17970 -15095 -3905 9266 18434 19672
1275 19672 12425 -364 -12463 -17927 -13300 -2298 10431 19000 19807 12109 -1265 -13072 -17681
1288 -17681 -12860 -1342 11352 19648 19940 11710 -2321 -14319 -18280 -13156 -1747 11494 20442
1301 20442 19781 10817 -3258 -14728 -18801 -14188 -1847 11548 20178 19612 10355 -3221 -14942 -19394
1315 -19394 -14356 -2747 11009 19565 18920 9673 -3849 -15701 -20083 -15238 -2817 10231 18117
1328 18117 17967 8861 -4628 -16451 -19749 -14656 -3051 9082 17378 17230 7842 -5717 -16309 -19753
1342 -19753 -14749 -3272 9307 16756 15908 6200 -5860 -16570 -19589 -13812 -2737 9038 16408
1355 16408 15360 5904 -7165 -16583 -19053 -13237 -2435 10031 17011 14662 5065 -7253 -17480
1368 -17480 -19432 -12175 -461 10368 16520 15323 5253 -8193 -17384 -17748 -11443 -161 11408
1381 11408 18080 15126 4380 -7495 -15999 -18215 -11791 1300 13271 18090 15114 6020 -6927
1394 -6927 -16544 -17927 -10575 1876 13100 19068 15880 5122 -6597 -15000 -17082 -10422 2398 14664
1408 14664 19306 15270 6072 -5696 -15035 -16834 -9241 3027 13724 19717 15607 4983 -7162
1421 -7162 -14005 -15231 -9360 2276 14485 19486 14279 4309 -6315 -13991 -15333 -8524 3188 14191
1435 14191 18170 14421 3662 -7816 -14813 -14636 -8211 2981 13884 18045 13007 3034 -8230 -15372
1449 -15372 -15641 -7303 4138 13304 16840 12851 2233 -9787 -16992 -15546 -7189 3921 13372 16346
1463 16346 11761 1685 -9827 -17535 -16897 -7045 5086 13069 15334 11139 1836 -10696 -18423 -16547
1477 -16547 -7214 3846 12942 16011 11294 601 -10129 -17831 -17123 -7732 4518 13208 15096 10462
1491 10462 1035 -10534 -17950 -15784 -7023 3581 12653 16018 10614 -645 -10563 -15980 -15747 -7990
1505 -7990 4428 13991 15281 9209 -137 -10091 -16908 -14122 -4925 4623 12889 15760 10840 -1461
1519 -1461 -11573 -14571 -12395 -5656 4802 15099 16398 8747 -1067 -10175 -15450 -12958 -3564 7378
1533 7378 13849 15567 10950 -1075 -12394 -15225 -10756 -3099 6456 15361 17421 8547 -1783 -9948
1547 -9948 -14953 -13410 -2857 9882 15457 14469 10196 906 -12004 -17016 -10807 -1154 7023 14246
1561 14246 17236 10271 -2448 -11411 -14226 -12251 -3915 8834 16427 14291 8110 -111 -10565 -17097
1575 -17097 -12109 -1085 7718 13095 15545 9326 -3265 -12613 -13866 -10564 -4289 7181 16109 14487
1589 14487 5531 -3058 -10158 -15318 -12569 -1657 8596 12885 12830 7658 -3953 -14030 -14803 -9119
1603 -9119 -2746 5748 14717 15092 4268 -6327 -11504 -13890 -12362 -2900 9506 14623 11456 5143
1617 5143 -3721 -13397 -16499 -10297 -658 7284 13494 13794 5106 -6670 -13021 -13809 -11141 -2376 9429
1632 9429 15255 11642 3781 -3671 -12106 -16174 -10466 1068 8930 12889 12798 6039 -6136 -14064 -13416
1647 -13416 -8384 -1158 9025 15587 12461 3166 -5115 -11169 -14487 -9951 1160 10813 13328 11636
1661 11636 5468 -4656 -13376 -13946 -7306 1137 9673 14808 12773 3742 -5785 -11438 -13796 -8957 1732
1676 1732 11432 14020 10877 4757 -4547 -13244 -14367 -7080 2400 10043 13912 12269 4051 -6530 -12454
1691 -12454 -12389 -7369 1519 10859 15129 10722 3171 -5129 -11884 -13629 -7145 2688 10539 13516 11158
1706 11158 3263 -6496 -12697 -12424 -6521 2079 10501 13708 10069 1832 -6687 -12433 -12950 -6538 3261
1721 3261 10302 12340 9722 2070 -7294 -13708 -12548 -5451 2805 10282 13107 9800 964 -7814 -13342
1736 -13342 -12508 -5906 3361 10921 12949 8892 1019 -8355 -13982 -12657 -5738 3445 10578 12941 9247
1751 9247 502 -8243 -13495 -12778 -5933 3434 11248 12674 9060 812 -8287 -13781 -12250 -5208 3630
1766 3630 10955 13090 8847 172 -8573 -12590 -11500 -5087 3896 11109 13120 8653 421 -8414 -13191
1781 -13191 -11103 -4216 4093 10883 12813 8692 -598 -9084 -12078 -10186 -3951 4383 11555 13013 7658
1796 7658 -111 -8150 -12242 -10479 -3267 5358 11202 12469 8356 -722 -9107 -11962 -9532 -2798 5210
1811 5210 11999 12705 6800 -1466 -8066 -11763 -9929 -2642 6445 11775 11849 7303 -1236 -9382 -12567 -9239
1827 -9239 -2363 5643 11843 12671 6518 -2146 -9222 -12171 -9947 -2813 6399 12050 11605 6265 -1933
1842 -1933 -9552 -12687 -9566 -2034 5662 11347 11798 6070 -2853 -9897 -11886 -9629 -3013 5675 12294
1857 12294 11306 5123 -2455 -9195 -12821 -9914 -1822 6368 10469 10926 5826 -2972 -9935 -12001 -8804
1872 -8804 -2276 5588 11738 10792 4205 -3086 -8989 -11601 -9296 -1112 7134 10926 9785 4771 -2822
1887 -2822 -9626 -12056 -7855 -791 6605 11382 10178 4130 -4014 -9472 -11210 -8203 -655 8035 11876
1902 11876 9239 3891 -3261 -9831 -12094 -7519 964 7525 11207 10148 4491 -4224 -10334 -11172 -7240
1917 -7240 -31 7959 12052 10010 3724 -3756 -9737 -11792 -7002 1282 8335 11360 10183 4623 -4090
1932 -4090 -10262 -11279 -6646 416 7972 11832 10440 3588 -3801 -9644 -11163 -7075 744 8168 11281
1947 11281 9773 3876 -4119 -10078 -10769 -6012 1148 7406 11153 9820 3184 -4836 -9889 -10166 -6188
1962 -6188 792 8203 11205 8345 2126 -4867 -10005 -10444 -5572 1610 7771 10463 7958 1825 -5581
1977 -5581 -10570 -10018 -5264 1809 8035 10613 7840 1252 -5750 -10931 -10557 -4853 2381 8212 10536
1992 10536 7896 1283 -6519 -11184 -10329 -4894 2233 8458 11068 8087 1026 -6092 -11129 -10396 -5159
2007 -5159 2312 8704 10945 8201 1288 -6338 -11134 -10493 -4660 2183 8616 10733 7856 1087 -6184
2022 -6184 -10402 -10094 -4793 2388 8454 10642 7777 1259 -6156 -10130 -8987 -4209 2841 8278 10582
2037 10582 7168 628 -6102 -9445 -8712 -3763 2963 8636 10302 6670 -16 -6099 -9318 -8843 -3103
2052 -3103 3471 9053 10513 6411 -308 -6590 -9496 -8156 -2785 4298 9485 10106 6198 -756 -6641
2067 -6641 -9747 -8276 -2781 4444 9276 10096 6242 -949 -7616 -10450 -8068 -2753 4573 9576 10190
2082 10190 5843 -1087 -7502 -10007 -8328 -2656 4540 9735 10049 5705 -1174 -7208 -10196 -8463 -2556
2097 -2556 4766 9309 9566 5787 -968 -7196 -10256 -8092 -2391 4741 9244 9388 4967 -1224 -6994
2112 -6994 -9788 -8037 -2085 4627 8616 9126 4970 -1510 -7397 -9733 -7933 -1639 4750 8814 8688
2127 8688 4216 -1888 -7315 -9680 -7168 -1081 5319 8927 8503 4235 -2330 -7588 -9689 -6616 -653
2142 -653 5480 8971 8496 3918 -2530 -8041 -9750 -6404 -625 5739 9073 8672 3841 -2776 -8062 -9781
2158 -9781 -6612 -613 5919 9236 8458 3617 -2476 -8242 -9743 -6257 -258 5824 9440 8529 3598
2173 3598 -3139 -8238 -8927 -6008 -531 6270 9768 8383 3575 -2887 -7882 -9514 -6127 179 5878
2188 5878 8887 7824 3548 -3105 -8165 -9015 -5986 -97 5865 9154 7767 2833 -3300 -7934 -9169
2203 -9169 -5480 565 6184 8611 7618 3320 -3537 -8469 -8785 -4930 923 5701 9272 7534 1996
2218 1996 -4137 -8185 -8577 -5327 1087 6631 8684 6744 1988 -3727 -8590 -8599 -4423 1266 6197 8728
2234 8728 7614 1928 -4599 -8632 -8295 -4577 1323 7214 9255 6691 1638 -4575 -8279 -8469 -4704
2249 -4704 1686 6663 8757 6765 1553 -4724 -8548 -7717 -4406 855 6761 9346 6734 796 -4811
2264 -4811 -7881 -8137 -4418 1743 6815 8452 6467 1393 -4809 -8480 -7579 -3899 1965 6823 8644
2279 8644 6537 427 -4996 -7988 -7478 -4131 1977 7376 8291 5754 557 -5098 -8474 -7540 -3317 2372
2295 2372 6789 8290 6035 658 -5424 -8108 -6910 -3089 2637 7259 8441 5284 -335 -5668 -8242
2310 -8242 -7378 -2603 3066 7709 8110 5441 -234 -5773 -8354 -7185 -2814 2946 7526 8752 4998
2325 4998 -472 -5301 -8258 -7331 -2983 3434 7669 8144 4777 -183 -5521 -8509 -7180 -2483 2937
2340 2937 7411 8195 5199 -551 -5174 -8333 -6969 -2460 3169 7311 7872 4438 -324 -5616 -7889
2355 -7889 -6692 -1986 3581 7259 7461 4357 -580 -5551 -7807 -6259 -1763 3567 7587 7584 4322 -995
2371 -995 -5749 -7800 -6184 -924 4187 7274 7151 3933 -1367 -6111 -8058 -5849 -882 4415 7207
2386 7207 7053 3588 -1876 -6249 -8152 -5730 -453 4416 7500 7322 3558 -1887 -6261 -7822 -5680
2401 -5680 -553 4391 7637 7240 3184 -1829 -6243 -8210 -5855 -573 4781 7278 6919 3404 -1940
2416 -1940 -6624 -7861 -5508 -701 4364 7619 7137 3188 -2194 -6481 -7832 -5457 -406 4854 7091
2431 7091 6580 3369 -2193 -6576 -7927 -5083 -384 4052 7156 6942 2558 -2840 -6309 -7201 -5226 -133
2447 -133 4641 7004 6171 2372 -2291 -6740 -7629 -4643 329 4669 7036 6216 2411 -3162 -6462 -6851
2463 -6851 -4428 77 5060 7578 6008 1726 -3013 -6529 -7223 -4456 886 5434 7113 6140 2309
2478 2309 -3211 -6928 -6728 -3485 721 5018 7650 6278 1460 -3491 -6141 -7007 -4107 673 5723
2493 5723 7243 5653 1877 -3152 -7280 -6781 -3340 1094 5165 7484 6114 1365 -4076 -6530 -6495 -3967
2509 -3967 1009 5915 7352 5227 1490 -3348 -6634 -6864 -3368 1522 5303 7026 5845 1182 -4237
2524 -4237 -6645 -6218 -3535 1272 5842 7771 5055 734 -3548 -6405 -6720 -3472 1975 5846 6836 4905
2540 4905 743 -4286 -6947 -5978 -2309 1331 5663 6874 5069 -16 -4478 -6490 -6194 -2889 2023
2555 2023 6266 6522 4469 79 -3984 -7012 -6226 -2625 2102 5918 6736 4478 -186 -4711 -6714 -6029
2571 -6029 -2599 2226 6408 6704 3912 -153 -4175 -6835 -6155 -2356 2874 5837 6379 4147 -613 -4836
2587 -4836 -7147 -5636 -2125 2514 6302 6760 4133 -384 -4490 -6798 -6069 -1785 2689 6118 6365 3837
2603 3837 -313 -4533 -6968 -5285 -1716 2720 5999 6552 3713 -797 -4927 -6516 -5492 -1530 3064
2618 3064 6288 6061 3640 -583 -4573 -6426 -5466 -1250 3266 6360 6341 3360 -1026 -4765 -6291 -4894
2634 -4894 -904 3428 6382 6257 3023 -1337 -4969 -6541 -5205 -836 3775 6241 6124 3430 -933
2649 -933 -5090 -6528 -4513 -1008 3648 6062 6073 3037 -1136 -5184 -6417 -4425 -498 3630 5820 5930
2665 5930 3093 -1546 -5304 -6436 -4334 -465 3510 6248 5911 2925 -1665 -5514 -6586 -4227 -658
2680 -658 3538 5859 5416 2786 -1907 -5448 -6412 -4111 -162 3566 6114 5179 2476 -2377 -5563 -6100
2696 -6100 -4054 -93 3849 6309 5531 1974 -2350 -5503 -6276 -3903 -23 3866 6064 5220 1919 -2496
2712 -2496 -5465 -5856 -3935 258 3953 5962 5148 1560 -2561 -5305 -6384 -3935 381 4089 6053
2727 6053 5065 1617 -2629 -5680 -5904 -3556 517 4225 6178 4627 1050 -2431 -5877 -5799 -3156 807
2743 807 4290 5876 5019 1138 -2959 -5585 -5378 -3247 732 4560 6194 4705 1105 -2840 -5359 -5593
2759 -5593 -3073 1084 4471 6146 4594 1070 -2976 -5642 -5403 -2751 1171 4609 5939 4587 1167
2774 1167 -3318 -5427 -5422 -2872 1241 4819 5899 4593 831 -3172 -5712 -5215 -2614 1371 4689 6006
2790 6006 4573 621 -3198 -5046 -5225 -2658 1621 4871 5774 3950 510 -3021 -5400 -5168 -2620 1741
2806 1741 5008 5830 3945 485 -3125 -5779 -5323 -1967 1818 5009 5786 3583 286 -3454 -5607 -4994
2822 -4994 -1947 2026 4882 5598 3536 -205 -3743 -5716 -5096 -2148 2069 4837 5294 3410 -10 -3870
2838 -3870 -5807 -5122 -1647 1939 5001 5186 3291 -305 -3939 -5550 -4710 -1693 2071 4872 5200 3205
2854 3205 -343 -4084 -5848 -4820 -1704 2384 4886 5327 3264 -555 -4062 -6010 -4395 -1384 2309
2869 2309 4683 5277 3220 -652 -3678 -5567 -4631 -1280 2432 4805 5324 2928 -533 -3830 -5368 -4243
2885 -4243 -1144 2512 4758 5324 2949 -801 -4283 -5352 -4132 -626 2662 5128 4973 2797 -836
2900 -836 -4268 -5635 -4034 -418 2686 5176 5160 2427 -1138 -4428 -5485 -3754 -435 3155 5279 5070
2916 5070 2119 -1034 -4102 -5091 -3715 -473 2856 5272 4847 2162 -1276 -4408 -5197 -3499 -446 3358
2932 3358 5519 5045 2187 -1459 -4384 -4991 -3407 -361 3268 5314 4744 2243 -1785 -4615 -5319 -3443
2948 -3443 -181 2894 5261 5016 1825 -1696 -4607 -5143 -3549 -220 3414 5236 4578 1724 -1860 -4478
2964 -4478 -5231 -3333 6 3406 5053 4612 1626 -1935 -4598 -5033 -3011 -86 3049 5106 4282 1250
2980 1250 -2211 -4284 -4956 -3432 235 3376 4989 4162 1309 -2338 -4659 -5273 -2858 391 3422 4858
2996 4858 3593 1121 -2518 -4807 -4593 -2796 453 3495 4700 3763 1080 -2387 -4897 -5012 -3079 719
3012 719 3885 4888 4025 490 -2477 -4670 -4715 -2482 731 3833 5021 3780 750 -2503 -4669 -4724
3028 -4724 -2755 916 4048 5152 3543 640 -2302 -4692 -4736 -2419 1187 4199 4932 3621 813 -2520
3044 -2520 -4626 -4514 -2117 1043 3900 5030 3384 615 -2624 -4329 -4483 -2175 1558 4035 4776 3331
3060 3331 730 -2458 -4628 -4272 -1820 1451 4077 4741 3428 560 -2828 -4684 -4132 -1953 1443 4342
3076 4342 4645 3068 161 -2888 -4824 -4114 -1771 1773 4265 4880 2946 437 -3195 -4906 -4246 -1764
3092 -1764 1723 3928 4643 2809 23 -3308 -4922 -3997 -1592 1832 4264 4295 3140 38 -3137 -4777
3108 -4777 -4181 -1404 1675 3906 4595 2809 -322 -3050 -4730 -4180 -1594 1657 3716 4544 2415 -573
3124 -573 -3248 -4869 -3732 -881 2089 3957 4341 2514 -467 -3478 -4910 -3631 -1073 1801 4340
3139 4340 4513 2536 -929 -3093 -4615 -3728 -858 2224 4260 4060 2196 -610 -3595 -4602 -3120 -675
3155 -675 2402 4344 4559 2432 -949 -3514 -4216 -3385 -502 2528 4517 4170 2346 -874 -3862 -4913
3171 -4913 -3378 -284 2346 4206 4405 2149 -940 -3906 -4602 -3039 -625 2604 4586 4438 1897 -1015
3187 -1015 -3631 -4688 -3189 -360 2731 4154 4066 2094 -979 -3907 -4382 -3073 -249 2739 4569 4027
3203 4027 1939 -1232 -3503 -4352 -3052 -231 3036 4651 3976 1833 -1544 -3731 -4177 -2672 101 2943
3219 2943 4297 3910 1665 -1819 -3892 -3868 -2910 -27 2870 4312 3545 1279 -1804 -3878 -4335 -2741
3235 -2741 203 2823 4590 3874 1447 -1793 -3840 -4169 -2564 304 3047 4263 3328 1025 -1947 -4145
3251 -4145 -4295 -2534 247 3157 4262 3224 1068 -1869 -3985 -4054 -2341 265 2785 4375 3137 857
3267 857 -1970 -4054 -4048 -2630 518 3144 4286 3203 669 -2277 -4120 -4301 -2316 713 3021 4059
3283 4059 3109 529 -1584 -3760 -3984 -1922 1067 3112 4077 2792 585 -1805 -3576 -3858 -1687 1259
3299 1259 3298 3857 3122 735 -2259 -3902 -3632 -1824 1221 3626 4207 2990 313 -2348 -4076 -3626
3315 -3626 -1616 1439 3495 4439 2697 559 -2103 -3761 -3709 -1545 1416 3564 4186 2818 345 -2311
3331 -2311 -3843 -3582 -1310 1395 3564 4042 2739 379 -2648 -3983 -3922 -1278 1401 3498 4150 2747
3347 2747 129 -2365 -3943 -3471 -1534 1522 3615 3812 2674 99 -2722 -4055 -3352 -1158 1419 3384
3363 3384 4056 2540 -411 -3015 -4011 -3236 -902 1471 3538 3745 2317 -240 -3020 -4219 -3213 -947
3379 -947 1431 3230 3612 2092 -457 -3203 -4112 -3087 -973 1602 3292 3618 1992 -453 -3061 -3856
3395 -3856 -3036 -1015 1668 3466 3724 2004 -799 -2956 -3767 -3050 -891 1769 3578 3808 2276 -984
3411 -984 -3114 -3569 -3032 -390 1881 3666 3516 2073 -973 -2802 -3674 -2886 -543 1863 3713 3809 2064
3428 2064 -894 -2981 -3632 -2551 -279 2330 3863 3625 1719 -544 -3192 -3742 -2781 -112 2360 3639
3444 3639 3591 1896 -1089 -2703 -3350 -2339 -254 2193 4068 3649 1377 -991 -3054 -3773 -2386 -83
3460 -83 2352 3676 3372 1057 -1294 -3278 -3568 -2213 149 2155 3696 3337 942 -1217 -3059 -3690
3476 -3690 -2353 280 2525 3445 3284 956 -1355 -3114 -3501 -2152 339 2423 3725 2750 1065 -1777
3492 -1777 -3280 -3710 -2384 190 2575 3267 2854 1000 -1942 -3338 -3697 -2031 338 2597 3485 2889
3508 2889 335 -1682 -3487 -3639 -2267 289 2629 3600 2692 774 -1334 -3218 -3383 -2472 473 2611
3524 2611 3555 2368 476 -1679 -3250 -3254 -2079 538 2442 3522 2645 887 -1901 -3396 -3201 -1831
3540 -1831 561 2835 3221 2445 683 -1805 -3223 -3233 -1780 775 2973 3401 2438 506 -1863 -3421
3556 -3421 -3213 -1746 863 3003 3363 2456 778 -1827 -3310 -3235 -1406 1091 3238 3679 2439 279
3572 279 -2032 -3222 -3286 -1234 1094 3104 3572 2490 337 -1777 -3302 -3094 -1569 1212 3183 3464
3588 3464 2418 373 -2163 -3317 -2826 -1276 1376 2877 3312 2481 82 -1999 -3294 -2944 -903 1075
3604 1075 3029 3349 2292 -59 -2276 -3624 -2827 -870 977 2939 3532 2182 -237 -2213 -3384 -2703
3620 -2703 -1133 1495 3116 3228 1877 -406 -2550 -3341 -2401 -820 1459 2914 3153 1755 -449 -2392
3636 -2392 -3582 -2707 -1025 1144 2958 3146 1516 -211 -2239 -3326 -2623 -636 1464 2631 2934 1502
3652 1502 -743 -2552 -3273 -2290 -550 1536 2885 3086 1781 -782 -2636 -3237 -2302 -608 1872 2733
3668 2733 3090 1577 -921 -2623 -2911 -2599 -619 1559 2897 3168 1719 -568 -2633 -3167 -2143 -435
3684 -435 1938 2974 3075 1496 -807 -2634 -3220 -2215 -379 1800 3260 3286 1167 -763 -2367 -3078
3700 -3078 -2245 -310 2096 3344 2882 1322 -812 -2485 -2944 -2031 -145 2129 3109 2933 1302 -976
3716 -976 -2455 -2733 -2117 193 1918 3427 2797 645 -933 -2644 -3016 -2109 313 2328 2877 2438 977
3733 977 -1009 -2778 -2988 -1994 281 2255 3076 2525 1054 -1117 -2328 -3041 -1823 93 1888 3038
3749 3038 2746 653 -1471 -2861 -3306 -1811 487 2159 2915 2502 905 -1455 -2844 -3006 -1607 153
3765 153 1885 2932 2427 761 -1541 -2709 -3103 -1743 534 2246 3059 2028 591 -1311 -2760 -3243
3781 -3243 -1659 575 2174 3140 2354 405 -1248 -2800 -3025 -1567 586 2141 2845 2235 153 -1752
3797 -1752 -2742 -2733 -1762 672 2234 3053 2309 519 -1386 -2848 -2782 -1573 841 2224 2703 2110 611 -1479
3815 -1479 -3022 -2840 -1300 807 2437 3238 2265 362 -1782 -2922 -2536 -1492 758 2329 2876 2466
3831 2466 337 -1631 -2687 -2447 -1098 1168 2504 3098 2085 400 -1582 -2847 -2697 -917 1024 2428
3847 2428 2846 1886 -38 -1568 -2963 -2639 -720 935 2353 2925 1970 -105 -1837 -2911 -2374 -747
3863 -747 921 2303 2744 1827 237 -1880 -2735 -2241 -512 906 2289 2616 1723 -376 -2063 -2879 -2308
3880 -2308 -655 1185 2470 2941 1495 -192 -1891 -2577 -2248 -923 958 2639 2563 1589 -350 -2072
3896 -2072 -2850 -2293 -636 970 2543 2706 1474 -389 -2102 -2626 -2387 -637 1208 2516 2440 1533 -407
3913 -407 -2074 -2987 -2249 -463 1094 2703 2508 1179 -532 -2321 -2849 -2047 -203 1254 2428 2557 1245
3930 1245 -727 -2199 -2530 -2094 -495 1105 2480 2574 1000 -939 -2070 -2813 -2184 -390 1424 2576
3946 2576 2105 1143 -408 -1861 -2607 -2226 -257 1487 2713 2460 1427 -450 -2140 -2309 -1756 -214 1545
3963 1545 2659 2246 815 -673 -2212 -2464 -1867 -417 1707 2473 2215 1078 -787 -1992 -2238 -1895 -125
3980 -125 1858 2513 2198 1292 -677 -2279 -2448 -1592 93 1889 2513 2274 967 -809 -2468 -2790 -1478
3997 -1478 -73 1715 2504 2166 883 -835 -2189 -2490 -1441 -9 1868 2555 2124 1012 -1105 -2357
4013 -2357 -2638 -1529 163 1603 2559 1989 435 -1210 -2415 -2446 -1736 263 2010 2488 1936 559 -1105
4030 -1105 -2537 -2570 -1298 268 1980 2391 1677 575 -1280 -2321 -2443 -1657 376 1991 2371 2022 790
4047 790 -1205 -2591 -2537 -1284 381 1618 2040 1965 649 -1406 -2382 -2278 -1465 633 1882 2663 1617
4064 1617 -25 -1445 -2301 -2352 -1285 529 1797 2443 1596 507 -1477 -2401 -2139 -927 480 1844 2384
4081 2384 1672 231 -1360 -2071 -2150 -1022 598 1991 2470 1846 181 -1459 -2330 -2159 -867 755 2017
4098 2017 2618 1784 130 -1602 -2423 -1821 -1260 1119 2021 2323 1557 10 -1615 -1985 -1887 -891 958 1811
4116 1811 2227 1602 44 -1460 -2228 -1986 -605 1038 2034 2630 1454 -180 -1332 -2115 -1694 -533 940
4133 940 1965 2393 1634 -8 -1359 -2316 -2104 -620 924 1978 2518 1272 -318 -1716 -2336 -1895 -424
4150 -424 1080 1982 2002 1001 -172 -1703 -2059 -2030 -589 1253 2357 2307 1322 -348 -1824 -2389 -1864 -625
4168 -625 1195 1848 2155 1282 -318 -1533 -2439 -1885 -415 873 2028 2210 1255 -378 -1534 -2297 -1460
4185 -1460 -552 1020 1941 2197 761 -572 -1862 -2331 -1644 -378 1141 2436 1938 1036 -657 -1896 -1978
4202 -1978 -1572 -435 1144 2218 1804 1322 -313 -1800 -2182 -1543 -356 1349 1990 2138 953 -490 -1534
4219 -1534 -2215 -1730 -17 1139 1960 1727 1060 -583 -1850 -2271 -1304 -63 1230 2044 1930 679 -824
4236 -824 -2042 -2333 -1078 177 1534 2015 2010 470 -640 -1756 -1902 -1517 -28 1643 2273 1404 664 -711
4254 -711 -1936 -1908 -1497 144 1502 1876 1642 824 -933 -1788 -1964 -1118 127 1489 2022 1925 752 -936
4272 -936 -1794 -2084 -1429 143 1693 1992 1694 355 -827 -1975 -1877 -1320 127 1391 1718 1681 537 -918
4290 -918 -1886 -1952 -1373 368 1599 1991 1447 628 -983 -1908 -1989 -1149 129 1363 1941 1630 632 -1157 -2011
4309 -2011 -1851 -1011 404 1812 1812 1394 619 -1208 -1959 -1848 -982 250 1590 1910 1610 83 -1087 -1842
4327 -1842 -1796 -854 449 1604 2036 1253 144 -1206 -2038 -1897 -774 382 1336 2127 1343 82 -1327
4344 -1327 -1912 -1909 -946 448 1390 1934 1402 216 -1179 -1786 -1771 -701 416 1594 1800 1409 64 -1433
4362 -1433 -2239 -1851 -741 635 1743 1888 1304 -65 -1254 -1839 -1504 -510 769 1562 1977 1396 -212
4379 -212 -1260 -2114 -1816 -752 759 1781 1984 959 -17 -1268 -1942 -1583 -675 468 2156 2089 1010
4396 1010 -140 -1328 -1806 -1642 -647 894 1667 1841 1336 -207 -1228 -1909 -1376 -488 765 1746 1909 1112
4414 1112 -364 -1339 -2036 -1665 -533 994 1697 1951 975 -202 -1346 -1931 -1593 -307 943 1674 1609 542
4432 542 -375 -1494 -1829 -1496 -476 971 1903 1620 1017 10 -1396 -1828 -1537 -221 1002 1637 1637 1063
4450 1063 -660 -1383 -1793 -1469 -409 980 1798 1713 853 -330 -1400 -1613 -1306 -655 915 1731 1730 762 -254
4469 -254 -1290 -1731 -1413 -168 1107 1590 1584 898 -454 -1305 -1616 -1066 38 981 1997 2060 836 -443
4487 -443 -1616 -1811 -1387 39 1145 1752 1444 443 -556 -1531 -1581 -1187 -96 1058 1680 1490 352 -616
4505 -616 -1689 -1720 -813 -14 1112 1680 1300 711 -744 -1669 -1539 -1146 121 1286 1543 1622 792 -589 -1355
4524 -1355 -1908 -911 83 1127 1763 1283 418 -557 -1754 -1433 -1150 -48 1329 1786 1615 153 -745 -1213
4542 -1213 -1462 -838 79 1043 1628 1603 540 -740 -1474 -1597 -829 439 1517 1592 1372 81 -662 -1593 -1564
4561 -1564 -973 113 1469 1787 1138 482 -742 -1571 -1456 -1038 368 1087 1419 1088 192 -981 -1547 -1540 -839
4580 -839 405 1374 1743 1021 495 -765 -1691 -1812 -867 231 1173 1353 1410 408 -972 -1173 -1789 -650
4598 -650 404 1241 1726 1374 -147 -885 -1425 -1705 -801 479 1324 1509 1063 102 -874 -1457 -1455 -665 734
4617 734 1287 1611 1241 278 -984 -1448 -1125 -469 574 1743 1862 1307 151 -1151 -1475 -1438 -750 399
4635 399 1283 1664 710 -94 -895 -1541 -1469 -148 677 1443 1680 1037 309 -851 -1726 -1295 -609 498 1495
4654 1495 1583 1138 -202 -922 -1965 -1513 -775 473 1367 1542 826 -108 -1168 -1693 -1155 -566 842 1441
4672 1441 1619 1027 -329 -919 -1356 -1094 -183 977 1440 1221 934 -29 -1199 -1640 -1249 -247 769 1613
4690 1613 1530 819 -35 -1048 -1652 -1271 -125 833 1612 1420 758 -387 -1305 -1462 -1239 -392 805 1421 1407
4709 1407 634 -315 -1307 -1496 -1295 -269 830 1361 1333 631 -413 -1308 -1551 -1191 -168 1014 1215 1356
4727 1356 655 -423 -1153 -1583 -788 -324 891 1507 1193 697 -221 -1129 -1488 -857 -256 1028 1077 1322 523
4746 523 -307 -1514 -1178 -801 226 854 1413 1366 731 -238 -1570 -1442 -830 -223 1048 1566 1220 567 -540
4765 -540 -1444 -1439 -748 -102 795 1254 1188 646 -371 -1297 -1320 -914 -116 921 1366 1038 518 -633 -1218 -1330
4785 -1330 -933 79 1063 1629 1081 366 -489 -1323 -1215 -691 -79 1111 1390 1275 321 -389 -1229 -1677 -584
4804 -584 120 955 1494 1145 425 -458 -1244 -917 -763 229 1017 1232 1251 56 -866 -1379 -1283 -765 159 1045
4824 1045 1416 1066 26 -934 -1243 -1221 -617 60 926 1166 970 410 -871 -1484 -1136 -758 278 943 1565
4843 1565 1024 411 -694 -1297 -1467 -587 137 1084 1399 1150 187 -793 -1126 -1346 -596 291 1125 1461 652
4862 652 235 -687 -1502 -1293 -363 234 1029 1278 1007 202 -731 -1293 -1267 -329 283 1226 1380 855 65 -932
4882 -932 -1098 -1274 -62 493 1193 1256 642 22 -792 -1210 -1218 -543 329 1128 1325 723 162 -753 -1172 -1216 -338
4903 -338 311 1117 1267 986 150 -709 -1051 -1205 -358 448 1018 1173 595 -143 -842 -1335 -1048 -458 631 1165
4923 1165 1109 720 88 -845 -1417 -816 -503 509 1264 1056 598 -473 -822 -926 -773 -345 374 1334 961
4942 961 697 -127 -820 -1094 -937 -509 558 1297 1282 523 -242 -938 -1108 -1151 -352 506 1309 1123 708 62
4962 62 -944 -1320 -1015 -187 388 971 966 658 -209 -811 -1341 -933 161 798 897 823 418 -153 -929 -1180 -881
4983 -881 -298 746 1266 1000 449 -274 -961 -1515 -936 -133 921 1455 1147 518 -371 -743 -1187 -1046 95
5002 95 458 1255 1305 414 -405 -1038 -1401 -749 -96 480 1437 1373 295 -535 -946 -1194 -982 -73 532 1482 1238
5023 1238 93 -477 -1108 -1019 -717 199 931 969 1024 326 -386 -914 -1319 -780 -138 594 1247 1200 557 -488
5043 -488 -656 -1035 -855 37 786 1111 978 642 -459 -886 -1524 -481 -106 808 931 1034 376 -144 -921
5062 -921 -1252 -590 132 1150 920 565 355 -465 -1188 -1278 -702 -270 783 935 901 15 -586 -1173 -1052 -979
5082 -979 94 970 1198 845 121 -435 -973 -930 -654 190 902 1150 638 95 -551 -1469 -1112 -708 141 579
5102 579 1136 778 -7 -606 -909 -965 -614 258 783 1076 662 -155 -598 -921 -1060 -355 196 864 1452 659
5122 659 115 -689 -1421 -1151 -577 322 1032 1385 823 299 -680 -983 -1041 -526 -61 926 1089 824 334 -1004
5142 -1004 -733 -972 -409 537 675 998 698 288 -657 -868 -798 -390 590 847 924 951 -119 -507 -843 -1044
5162 -1044 -372 390 931 1022 831 -119 -645 -982 -1298 -500 369 881 1271 585 -267 -738 -1209 -864 -567 623
5182 623 1094 1302 511 -160 -764 -1433 -701 -281 676 969 870 741 -301 -668 -976 -916 -164 194 1051 1159
5202 1159 616 -82 -723 -1010 -970 -143 496 968 1021 483 -297 -712 -1181 -956 -429 562 1013 1033 996 -140 -937
5223 -937 -1015 -758 112 543 905 979 589 -12 -837 -1137 -815 -363 585 959 901 416 -386 -911 -1088 -623 -85
5244 -85 507 897 977 724 -337 -918 -1049 -1077 134 644 957 964 535 -456 -683 -915 -514 -160 543 1097 938
5265 938 580 -422 -937 -939 -636 69 617 1057 1060 525 -385 -525 -1039 -769 152 698 965 1126 329 -163 -853
5286 -853 -733 -573 -228 466 1247 1008 425 -199 -932 -907 -783 64 321 1033 868 518 -295 -916 -631 -503
5306 -503 272 601 1180 847 214 -237 -715 -1074 -524 79 709 970 694 267 -387 -840 -1032 -669 56 653
5326 653 855 664 453 -594 -1046 -974 -679 39 782 827 620 195 -284 -676 -711 -661 -91 518 828 749 551
5347 551 -318 -818 -1035 -454 8 785 798 860 215 -153 -865 -901 -659 -63 558 909 846 68 -285 -1006 -1042 -215
5369 -215 -71 534 984 954 70 -705 -1192 -1026 -592 26 969 863 666 461 -388 -958 -883 -935 195 431 774
5390 774 549 163 -720 -722 -1007 -602 260 701 531 501 -101 -605 -713 -820 -542 331 857 942 464 -33 -565
5411 -565 -952 -861 -781 318 979 1172 658 32 -514 -847 -796 -239 144 838 815 458 141 -578 -862 -876 -444
5432 -444 337 787 682 851 122 -359 -1012 -633 -388 -5 889 1164 539 159 -539 -927 -911 -205 369 743
5452 743 616 669 157 -720 -818 -462 70 262 811 812 552 -120 -567 -665 -1050 -444 344 668 697 254 -40 -447
5474 -447 -1009 -737 -127 629 812 685 630 9 -632 -1171 -733 -431 141 861 946 491 213 -433 -945 -818 -198
5495 -198 662 602 968 546 -217 -689 -607 -421 -320 369 995 720 414 -196 -788 -730 -596 -40 307 804 668
5516 668 126 -338 -743 -843 -674 -224 270 1090 1041 589 -89 -557 -787 -542 44 478 746 720 314 -204 -606
5537 -606 -876 -687 -154 338 744 786 230 -317 -667 -458 -257 -441 889 765 623 283 -335 -703 -867 -490
5557 -490 -89 441 846 794 170 -196 -930 -656 -453 -178 229 818 651 -7 81 -983 -699 -281 -21 529
5577 529 797 864 405 -348 -566 -712 -240 73 723 717 724 383 -30 -591 -504 -555 57 739 479 648 113 -122
5599 -122 -576 -662 -724 32 477 883 736 30 -294 -694 -624 -554 144 220 799 698 215 -346 -928 -698 -380 -39
5621 -39 595 984 675 343 -92 -871 -1033 -348 73 642 863 769 172 -165 -1050 -633 -294 212 540 588 523
5642 523 316 -434 -778 -940 -421 -8 523 936 728 166 -68 -513 -707 -456 211 673 737 559 218 -375
5662 -375 -802 -588 -340 -24 650 710 587 -96 -639 -909 -680 -405 382 397 1010 558 -288 -326 -804 -693 -60
5683 -60 352 800 816 664 211 -548 -583 -646 -428 391 558 1004 571 -153 -219 -623 -788 -271 241 378 552 328
5705 328 558 -422 -1239 -704 -248 386 648 965 361 -38 -498 -910 -558 -489 332 526 716 423 -188 -437
5725 -437 -425 -737 -157 328 762 724 112 51 -478 -835 -853 -468 257 418 645 493 -178 -207 -790 -425 41 257
5747 257 570 731 539 -270 -503 -845 -295 97 425 789 669 775 -226 -678 -686 -574 -360 203 590 836
5767 836 30 -132 -703 -975 -476 -240 353 812 588 411 -171 -939 -809 -479 -294 478 642 365 585 -239
5787 -239 -525 -868 -521 -147 719 551 562 462 -267 -519 -345 -592 25 257 606 529 384 131 -401 -626 -635
5808 -635 -13 705 692 327 321 -368 -787 -988 -797 -134 281 821 486 157 -249 -588 -553 -537 -135 387 434 560
5830 560 230 -98 -850 -675 -557 -102 382 647 572 127 -339 -594 -850 -488 305 477 605 677 276 -420 -452
5851 -452 -683 -270 137 367 978 655 434 -319 -286 -845 -312 17 626 949 582 385 -441 -541 -700 -239
5871 -239 7 667 550 787 27 -14 -820 -481 -415 257 565 700 893 137 -105 -524 -533 -191 168 566 586 824
5893 824 377 -258 -351 -466 -504 25 321 448 156 103 -341 -549 -513 -207 228 637 961 255 320 -418 -466 -877
5915 -877 -292 20 564 916 748 314 -510 -237 -990 -81 32 881 575 453 -119 -431 -426 -425 -6 206 635
5936 635 506 403 77 -148 -757 -614 -351 -80 578 679 195 9 -729 -646 -381 -198 224 340 514 367
5956 367 -20 -343 -617 -327 -354 330 645 721 410 173 -430 -659 -527 -327 399 461 575 172 -108 -768 -666
5977 -666 -648 -350 97 330 629 387 193 -261 -829 -608 23 209 578 567 371 -141 -664 -443 -452 -79 453
5998 453 541 624 451 -102 -364 -795 -401 -128 280 490 579 191 -228 -275 -616 -286 -29 8 280 564 157 -336
6020 -336 -386 -568 -545 -162 216 649 292 159 69 -462 -502 -415 6 566 502 505 118 -448 -467 -594 -320 -210 473
6043 473 806 402 81 -175 -445 -531 -571 -244 176 670 453 92 -50 -667 -598 -362 -336 368 374 427 95 -342
6065 -342 -576 -502 -359 -174 379 701 283 258 164 -240 -621 -557 -15 657 502 821 193 -244 -522 -298 -153
6086 -153 -173 326 459 590 330 -228 -670 -497 -585 -230 601 494 377 133 -162 -648 -483 -203 129 134 547
6107 547 412 50 -72 -720 -672 -29 207 301 686 161 174 -330 -515 -589 -459 337 444 781 433 86 -181
6128 -181 -668 -696 -201 -36 549 410 485 142 8 -436 -490 -387 216 460 782 615 56 -365 -545 -591 -71
6149 -71 -97 296 581 562 -45 -309 -445 -675 -58 4 58 391 614 -73 -353 -253 -393 -175 71 390 367 706
6171 706 148 -433 -397 -293 -167 -321 234 246 228 -133 -336 -540 -91 -204 126 628 425 563 -269 -293 -759
6192 -759 -571 -49 271 540 727 351 39 -339 -714 -351 -23 339 323 680 179 57 -156 -238 -855 -403 116
6213 116 293 433 234 253 -242 -507 -535 -71 51 391 172 55 -181 -331 -444 -654 3 302 518 817 -85
6234 -85 148 -590 -339 -435 -49 377 199 497 240 -69 -546 -683 -519 -290 269 647 494 441 185 -467 -578
6255 -578 -755 24 410 281 371 -22 210 -380 -509 -426 -164 56 605 611 217 -184 -272 -513 -418 -16 418 546
6277 546 424 232 -272 -499 -416 -241 -22 210 363 551 180 -255 -499 -386 -574 106 386 537 353 197
6297 197 -260 -176 -631 -19 137 521 575 283 352 -307 -584 -573 -593 29 -26 396 288 144 -182 -201 -532 -265
6319 -265 17 456 628 262 138 20 -222 -375 43 180 225 620 552 -89 -350 -309 -425 -149 6 280 559
6340 559 436 447 -136 -293 -490 -223 242 360 509 467 29 116 -362 -217 -167 82 268 347 255 310 -301 -419
6362 -419 -418 -462 -202 210 571 352 -105 -478 -22 -332 -32 -38 369 316 351 173 -153 -145 -389 -7 249 251 500 364
6386 364 62 -197 -418 -583 -177 21 253 318 146 103 -239 -163 -476 -55 -118 199 490 539 119 -203 -759 -615
6408 -615 -241 33 473 329 106 25 -514 -399 -210 -372 198 129 409 396 -226 -333 -321 -534 -177 -72 254
6429 254 466 522 144 -264 -504 -597 -410 268 235 348 360 32 -303 -305 -440 -218 393 225 102 366 108 -407
6451 -407 -362 -346 -49 276 504 477 47 -30 -298 -524 -106 -228 202 371 398 170 -269 -129 -337 -455 -54 294
6473 294 461 421 448 -22 -319 -496 -127 111 -66 269 152 60 -45 -271 -424 -409 -209 102 373 406 369 -160
6495 -160 -297 -327 -397 156 84 462 637 8 210 -110 -484 -452 -45 254 362 421 327 139 -215 -193 -457 -532 227
6518 227 579 146 352 149 -223 -413 -353 -70 -11 408 488 199 -136 -484 -222 -532 -92 377 388 403 79 -140
6540 -140 -208 -127 -413 48 351 354 190 -3 -165 -446 -247 -274 -70 355 344 328 338 -140 -391 -376 -134 -201 157
6563 157 347 470 53 -54 -418 -216 -526 -76 450 681 368 454 -15 -409 -259 -242 28 259 551 286 192
6584 192 -73 -522 -656 -435 17 337 208 370 -122 24 -549 -438 -169 11 26 464 586 138 -12 -443
6604 -443 -228 -169 13 177 364 163 127 -93 -387 -505 15 32 573 447 302 -38 -292 -304 -406 -330 98 223
6626 223 125 309 46 -296 -506 -295 71 -78 495 544 261 468 -399 -461 -256 -204 62 526 430 91 -50 -351
6648 -351 -382 -320 -70 190 277 340 1 -232 -247 -457 -166 -110 -1 457 420 18 -203 -137 -471 -427 -37 287 211
6671 211 446 232 -63 -77 -568 -355 -43 -39 234 542 283 -98 -151 -438 -233 -34 361 454 310 111 -207 -114
6693 -114 -172 -276 -164 334 345 88 316 41 -158 -221 -131 -90 -5 461 345 -99 65 -280 -157 -311 -6 332
6715 332 315 527 56 -59 -109 -227 -364 -177 191 377 108 124 -145 -563 -364 -426 -25 -135 431 204 305
6736 305 -418 -190 -495 -285 163 301 457 233 134 -182 -217 -89 -340 -73 193 565 99 176 -375 -232 -389
6757 -389 -339 -126 250 521 333 205 -311 -158 -301 -12 -127 204 142 285 238 -342 -689 -376 -82 341 336 336
6779 336 229 150 -407 -203 -482 -120 -44 117 287 499 86 -5 -405 -365 88 96 -278 254 119 64 -98 -247
6801 -247 -301 -264 -26 244 195 127 164 -38 -181 -505 -469 -125 157 420 22 423 -205 -505 -415 -226 15 -6 318
6824 318 -203 108 -87 -269 -403 -94 -212 316 435 329 211 -229 -350 -357 252 219 310 186 197 -49 3 -541
6846 -541 -322 -57 354 558 94 589 52 -359 -440 -514 128 -160 342 609 285 -243 -485 -523 92 -83 148
6867 148 276 235 453 40 -174 -394 -439 44 91 394 217 442 135 4 -209 -57 -277 -58 164 280 310
6888 310 -44 -237 -207 -236 132 148 60 622 76 153 -212 -363 -270 -361 215 51 296 371 -10 -128 -248 -387 -151
6911 -151 215 93 275 384 66 -623 -137 -268 -101 4 320 322 192 -194 -326 -304 -233 -234 236 292 421 401 -181
6934 -181 -2 -83 -208 -30 261 227 85 -37 -86 -454 -486 -339 -364 170 236 135 -6 -5 -93 -416 -437 -28 -113 39
6958 39 68 305 -211 -60 -223 -407 -13 215 520 301 156 135 4 -436 -154 98 162 296 345 -11 -386 -205
6980 -205 -66 -17 110 -120 42 480 91 -391 -92 -437 -152 82 251 145 341 39 160 -576 -114 -95 -98
7001 -98 244 296 -74 -175 -214 -380 -403 51 -76 607 600 264 -193 78 -346 -267 -263 -211 302 261 413 -151 -123 -374
7025 -374 42 -320 -84 173 292 -74 351 26 -337 -252 -328 -73 265 159 439 267 -415 -181 -237 -126 225
7046 225 268 124 47 120 -228 -387 -186 -110 100 288 229 279 415 115 -517 -406 -57 -80 228 240 125 -9 -60
7069 -60 -409 -175 -232 -137 337 515 145 38 -57 -358 138 -199 -91 147 129 8 119 -66 -528 -103 -34 16
7091 16 168 321 104 18 271 143 169 -187 -163 -20 283 259 100 -177 -480 -565 -178 -17 325 254 292 66 -180
7114 -180 -313 -259 131 -14 387 473 444 0 68 -466 -352 53 78 158 308 441 -322 -259 -185 -228 -118 43 115
7137 115 327 119 -216 -107 -172 -214 -130 314 74 387 120 -306 -265 -266 -128 10 301 378 228 128 -173 -314
7159 -314 -265 -397 -259 89 163 280 426 102 -81 -225 -207 -105 245 354 309 9 117 -217 -131 -259 -29 259
7181 259 347 268 186 53 -198 -360 -244 -238 113 95 369 187 -268 140 -217 -193 -26 -11 522 293 -33 -128 -150
7204 -150 -335 -518 -151 9 315 89 259 -16 -295 -276 -46 -241 59 155 204 279 -165 -274 -175 -85 -18 -66 -106
7227 -106 367 111 -40 -315 -515 -264 166 105 369 382 25 257 -367 -377 -11 68 199 421 206 233 29 -64
7249 -64 -187 -94 28 6 344 290 259 -46 -234 -232 -214 -158 -10 213 318 17 184 -288 -275 -403 -8 103 74 470
7273 470 -123 -218 -403 -274 -132 173 451 391 347 275 -216 -476 -67 -367 53 58 385 505 11 -173 -380 -19
7295 -19 -139 -46 415 352 256 54 -112 -263 63 -68 -30 62 -125 103 271 -99 -211 -279 -113 -155 72 217 265
7318 265 175 -309 -223 -153 5 -176 156 227 -34 392 131 -403 -204 -167 -139 131 272 119 108 -165 -66 -425 -207
7341 -207 72 192 109 257 -90 -146 -101 -251 49 -91 212 -5 449 218 16 -225 -92 -92 -52 233 236 139 -48
7364 -48 -100 -344 -385 88 114 110 354 -46 92 -11 -436 -167 -93 104 -18 395 -114 62 118 -25 -424 -77 452
7387 452 143 123 340 265 -408 -459 -302 164 100 286 415 156 -42 -172 178 -272 -192 78 371 79 171 -155
7409 -155 -303 -214 11 -199 276 191 204 353 7 -70 -65 -283 -37 281 266 416 -59 52 172 -377 -436 -19 145
7432 145 311 50 -84 3 -298 -157 -147 -233 189 318 216 229 -48 -290 -195 -150 162 -133 -5 56 232 76
7454 76 -320 -220 -351 -86 115 118 83 16 -258 15 -162 33 112 75 669 166 200 254 -368 -379 -159 165 111 293
7478 293 -51 104 275 -314 -88 -278 10 274 414 -56 100 62 -370 -258 77 296 80 134 437 73 -129
7499 -129 -55 -569 -26 145 14 284 6 -18 66 -314 -160 2 129 138 620 46 185 -12 -343 -549 69 335
7521 335 -125 141 -32 -108 -344 166 -46 -28 89 74 259 297 -12 -9 -429 -271 -178 32 232 -76 129 -25
7543 -25 134 -379 -493 11 -95 -12 30 320 122 233 -293 -329 -308 252 503 241 339 159 -191 38 -136 -5
7565 -5 307 284 222 228 209 -265 -92 -205 -32 65 208 127 225 43 -299 -183 141 -185 -66 197 242 88 189 -48
7589 -48 -173 -265 -46 336 -49 190 -81 -204 -205 -266 -277 70 184 357 184 -138 95 -21 -319 -245 -112 59
7611 59 213 261 -54 174 -118 -238 -166 -116 -267 22 395 97 142 -89 -170 -308 -241 14 284 478 113 -44
7633 -44 -200 -405 -529 203 37 348 231 165 -537 179 -124 -420 105 84 -51 -122 104 71 -200 -238 -216 -191 163
7656 163 308 -47 45 -46 -314 -83 -298 -265 -105 432 279 -153 131 -99 -445 -149 -239 -136 -141 329 -44 107
7678 107 -55 -414 8 -194 131 32 342 70 -30 -311 -55 28 -93 51 285 169 -10 -45 -356 -333 17
7699 17 -46 120 72 191 61 -201 -372 -388 -235 -83 139 278 403 -60 -143 -34 -56 -406 41 129 75 136 112
7722 112 154 25 -246 -424 -180 -70 93 -268 27 52 80 88 -236 -216 377 149 242 -5 -307 -160 -301 -64
7744 -64 229 468 204 378 -43 -75 -376 -312 -3 -25 178 259 399 -17 -134 -96 117 56 80 -7 282 123 -145
7767 -145 -152 -121 -167 -114 313 -89 390 78 -134 -70 -34 -77 -173 47 18 213 167 -330 -437 -327 -67 -10 -57 76
7791 76 2 122 109 10 -270 5 -21 157 26 280 96 -43 1 -76 -406 -110 -117 46 77 139 13 -388 -57 -137
7815 -137 88 -240 -48 528 117 -183 10 -236 -388 -142 -164 106 17 -60 55 -97 -163 -88 -179 10 279 359
7837 359 -105 165 161 -153 -303 96 100 67 10 31 -289 -99 -192 -166 -38 17 271 450 182 170 7 33 23 -104
7861 -104 -21 361 246 82 -73 -365 -135 -68 -102 -7 390 295 270 -229 33 -378 -255 -66 231 348 -51 190
7883 190 85 -207 -10 -180 102 158 176 90 254 42 22 -133 -256 -223 116 344 213 422 -1 28 26 -407 33
7906 33 -197 336 164 -125 141 -312 -375 -206 -34 -105 239 237 79 43 93 -316 -214 32 121 73 314 -123 -346
7929 -346 -262 -150 -232 46 211 295 134 1 152 -118 193 -528 -62 17 164 -6 247 202 -221 -81 304 -38
7951 -38 69 353 152 26 -333 67 -80 -45 180 157 -122 158 65 100 -89 -91 -190 -142 162 71 130 135 16 -358
7975 -358 -395 -1 -302 65 300 79 143 133 -80 71 -46 -132 50 65 219 -60 -32 -139 36 131 53 33 153
7998 153 17 -43 -296 -128 -100 -193 -42 360 -24 162 71 -199 -177 -316 54 -86 252 460 98 69 33 -99
8020 -99 -229 -101 -179 -137 321 263 206 -363 -366 -259 67 -32 293 -67 235 157 22 -150 -466 108 127 53 -25 31
8044 31 16 -4 -27 -212 -275 254 -63 291 377 66 -411 -356 -114 -8 21 119 191 515 -28 -2 -396 -27 -407 -79
8068 -79 -285 175 91 -106 -106 -333 87 -12 -346 153 154 188 17 67 2 -536 -180 -3 124 316 271 44 -14 -310
8092 -310 -14 -62 -76 165 132 9 73 204 -68 -293 -309 -259 155 346 -18 -111 -27 -107 -187 305 -215 181 144 396
8116 396 -193 123 -72 -132 97 -55 109 400 162 62 -239 -347 104 -175 -42 100 82 -158 -288 -146 -270
8137 -270 -115 -112 89 172 64 -124 -63 -141 -42 -271 -18 -57 343 243 -41 273 -151 -292 -196 23 -37 -56 148
8160 148 253 -258 -54 -110 -412 -216 -86 139 29 341 -272 -60 -317 -46 247 -93 232 60 81 364 -124
8181 -124 -190 -166 168 -2 204 368 62 167 -59 -53
8191e3
$$ Imaginary data points
##PAGE= N=2
##DATA TABLE= (X++(I..I)), XYDATA
0 0 0 0 0 0 0 0 8 -8 8 -11 16 -17 24 -29 34 -40 50 -60 72 -83 98 -115 132 -154 178 -202 229 -260 294 -333
30 -333 376 -422 473 -528 593 -657 731 -813 903 -999 1107 -1224 1357 -1501 1663 -1848
46 -1848 2053 -2288 2559 -2870 3242 -3691 4244 -4940 5855 -7118 8977 -11995 17733 -32576
60 -32576 152395 300157 -1814 -25047 60101 2933 -141012 -31172 148113 171992 109570
71 109570 127462 89292 -18646 -60043 -10725 -8086 15565 127088 194374 108997 26860 13650
83 13650 -36266 -95274 -13270 109936 100116 53244 105465 99433 -55804 -131496 -12929 62746
95 62746 -20 6207 117913 111253 -23625 -78453 -44185 -55226 -55538 39343 101417 40386 -8733
108 -8733 5563 -45605 -141704 -106143 26733 61207 10807 16740 36175 -35390 -117786 -110972
120 -110972 -72989 -50629 8280 74882 50454 -26209 -57147 -77981 -135905 -136659 -33206 51456
132 51456 46079 28139 16493 -53308 -135276 -125972 -69130 -51565 -19006 67815 91895 -3727
144 -3727 -87576 -83103 -82538 -115574 -77441 33406 88337 52245 5100 -29292 -80135 -111012 -80987
157 -80987 -25424 17452 57685 76092 34492 -35313 -68427 -70378 -66807 -32545 36893 80217
169 80217 66551 35318 820 -52741 -86551 -49334 19059 51219 59492 75023 61157 -4911
181 -4911 -59752 -52278 -14211 15121 49249 84961 84896 43879 -1889 -32648 -45417 -25650 27471
194 27471 77898 92006 76525 46714 2663 -40336 -49560 -14852 37599 77449 93215 81137
206 81137 43659 -4976 -41970 -48915 -20110 30079 76049 95586 80219 37889 -12778 -49223
218 -49223 -54952 -26612 24269 70873 89200 71994 31219 -19260 -58124 -62714 -31417 13450
230 13450 53246 78363 71677 24585 -34024 -64642 -62583 -44689 -6679 47302 76830 53717
242 53717 5937 -33091 -62785 -78094 -55464 -1336 40308 50171 39919 10253 -40100 -78791
254 -78791 -76286 -46542 -12520 24233 52091 38702 -8976 -49189 -69060 -75814 -57274 -7381
266 -7381 36188 41007 21413 -3693 -43870 -82011 -78689 -37933 -1257 22405 43281 38042 -10365
279 -10365 -60672 -72366 -61542 -44402 -5769 44341 57877 24606 -13007 -41153 -68740 -74452
291 -74452 -35215 18376 45040 50031 41142 3982 -49088 -71587 -53876 -25082 9298 52388
303 52388 72106 43333 -3298 -33048 -52797 -60365 -28884 29515 63913 61343 47274 20289
315 20289 -27866 -62370 -48574 -8622 24135 54192 76145 59520 9132 -28646 -38971 -39557
327 -39557 -21066 28365 71414 70137 42920 18274 -12671 -46215 -45204 -3290 37633 56181
339 56181 63623 54132 15000 -28582 -41573 -29110 -6839 27521 63542 68035 38102 4242 -20862
352 -20862 -42936 -42292 -4893 39624 56946 53374 40138 6538 -38919 -55929 -34033 -1886 25205
365 25205 53019 62761 33204 -13075 -42160 -50866 -45573 -16358 30062 56822 48286 24385 -6719
378 -6719 -45107 -68042 -50809 -10405 22185 42181 49854 30202 -16521 -55122 -63336 -50299 -24325
391 -24325 14192 46801 47215 18872 -16781 -48050 -66809 -57936 -21432 16156 38157 40681 21566
404 21566 -17056 -53054 -62757 -48793 -22910 11172 40611 41785 13342 -20269 -43805 -57218
416 -57218 -50835 -18201 21776 40088 34446 15649 -13226 -45803 -59208 -40856 -6476 22514
428 22514 40313 41631 19443 -17714 -46444 -51318 -34278 -4260 28946 49165 45112 19510 -15024
441 -15024 -42812 -49430 -30698 2686 34505 53135 49711 23274 -13607 -40538 -44805 -27757 3871
454 3871 38052 58032 51717 24349 -9407 -35823 -44377 -28009 6212 40506 57321 51485 27252
467 27252 -6749 -36426 -44112 -24963 8099 38271 54777 51398 26861 -9506 -36908 -40708 -21880
480 -21880 6250 34676 53442 49390 21483 -13928 -36115 -38601 -24401 3950 35554 52196
492 52196 42958 15628 -15044 -37353 -42206 -25737 4500 33958 47494 40034 12670 -20150 -41773
505 -41773 -43963 -26637 2590 32366 46952 36009 7457 -22748 -43804 -46829 -28589 3159
517 3159 31360 42269 32818 6852 -25884 -47584 -47005 -27477 202 27820 42257 32450 2102
530 2102 -28262 -45499 -46993 -31548 43 30937 40687 26817 1545 -25118 -46823 -50070 -28937
543 -28937 4404 30383 37848 27338 2851 -26668 -47310 -46933 -25649 5303 30928 39106 27151
556 27151 2390 -25322 -45033 -45142 -23580 8464 32840 40131 28837 3598 -25042 -43861 -41079
569 -41079 -18743 10568 34566 42435 30807 4046 -24294 -40426 -37256 -16822 12176 37125
581 37125 45223 32008 5184 -21997 -37752 -35515 -13978 16495 39622 44759 32825 7076 -21623
594 -21623 -37725 -31530 -8591 16367 36959 46063 34495 5631 -22491 -34147 -28968 -10848 16770
607 16770 41171 45995 30202 4951 -20014 -36591 -32145 -7108 21063 37987 41431 30333 3563
620 3563 -24897 -36770 -28607 -9511 15829 39024 43247 24538 -1821 -22836 -37151 -35947 -11649
633 -11649 21229 37983 35076 22238 -39 -28828 -43368 -32676 -8824 14088 32432 38604
645 38604 21371 -8595 -29844 -37974 -36450 -17196 15138 36544 32703 15744 -5149 -30314 -47108
658 -47108 -36454 -8753 13848 27204 33501 20835 -10990 -37394 -39775 -30145 -15755 8948 33978
671 33978 34362 12912 -9821 -28776 -42778 -37155 -8596 17824 28004 29163 20402 -7305 -37241
684 -37241 -41783 -24650 -6834 11158 31425 36223 14819 -12145 -28034 -35996 -31825 -6794 23002
697 23002 33876 28572 18368 -3126 -31812 -41285 -21937 2207 17934 32663 39183 19238 -13095
710 -13095 -28702 -28186 -23186 -5996 25317 43660 32996 12391 -3963 -22754 -36249 -24710 4985
723 4985 27267 36444 36713 20455 -9249 -29307 -28428 -18039 -1872 24801 44740 36769 11740
736 11740 -7440 -21868 -32678 -24589 3957 29123 35841 33262 20500 -7787 -33007 -31992 -14824
749 -14824 828 18600 39366 39272 11404 -15619 -25364 -28438 -24717 -2568 26335 36319 26898 11935
763 11935 -7830 -31181 -37155 -19875 2552 18487 30259 30609 10547 -16863 -31332 -31714 -23184
776 -23184 -2672 22525 31533 20875 5160 -11311 -31059 -39373 -22063 4370 19527 23475 23314
789 23314 8270 -19125 -35937 -32299 -18950 -2127 19475 31456 21115 -1570 -18481 -29539
801 -29539 -34665 -23680 3162 24916 27663 18305 2650 -17495 -34707 -34707 -18000 4019 23836
814 23836 32008 22594 1048 -19219 -31843 -33452 -18877 7183 27557 31153 22994 6649 -16632
827 -16632 -34685 -32181 -12967 7122 23932 33969 29592 7078 -18333 -30916 -27373 -13982 6210
840 6210 26648 35646 28407 8299 -14604 -27963 -25931 -12100 7203 25750 35338 27822 6851
853 6851 -13440 -23925 -24284 -12666 9333 28597 32126 22683 7496 -10460 -25317 -24551 -7893
866 -7893 11961 25118 29881 22829 4015 -15376 -24227 -21393 -8958 11409 29155 30161 17046
879 17046 1014 -14591 -27096 -25453 -6705 15107 26709 27245 18718 -584 -21810 -30466 -23489
892 -23489 -8328 11389 28296 30163 15110 -4390 -20141 -31819 -29800 -9442 14892 26042
904 26042 25408 18315 -146 -25496 -36917 -26451 -8474 7231 22807 30738 18791 -6143 -24879
917 -24879 -31107 -28256 -14155 8488 24675 25590 16278 -1479 -23444 -35058 -26368 -9102 5357
930 5357 19139 27988 18045 -6906 -24549 -26379 -22927 -14050 6626 25061 24905 10817 -4038 -18288
944 -18288 -29102 -25137 -5818 11817 20319 23026 15506 -5255 -24034 -25362 -16718 -6272 9800
957 9800 27182 27029 9016 -7452 -16475 -24318 -22657 -3109 19778 26692 22435 13606 -2699 -22610
971 -22610 -27619 -15264 1147 15532 28471 29763 12452 -8603 -18961 -22008 -19613 -2513 22051
984 22051 32517 24932 12492 -1629 -19389 -29070 -17809 3551 18658 27777 30096 16442 -7100
997 -7100 -22160 -22189 -16035 -3310 17689 32439 27345 10850 -3684 -16928 -26670 -20154 1039 18535
1011 18535 25289 24921 15309 -5788 -23617 -24220 -14623 -2161 13213 26741 25068 7458 -8690
1024 -8690 -18291 -23938 -19889 -1747 17318 22912 18007 8936 -6873 -24006 -27587 -15165 708
1037 708 13345 21405 19858 5371 -13097 -23735 -24178 -17093 -1102 15955 22676 15592 3379 -10918
1051 -10918 -25068 -29045 -16410 2361 15541 20812 18323 4557 -15386 -27393 -25769 -15405 -365
1064 -365 16344 24615 17739 1769 -13335 -24351 -27300 -17523 1806 17944 23273 18700 5489
1077 5489 -12649 -25959 -26253 -14589 2041 17578 25060 20071 4809 -11566 -22459 -23939 -14396
1090 -14396 3091 18420 24389 19621 6950 -9446 -22320 -22632 -11089 4256 17792 24673 20804
1103 20804 6184 -10319 -20223 -19353 -9586 5088 19382 24614 19148 5565 -9418 -19048 -18530 -8087
1117 -8087 7632 19652 24080 18686 4992 -10767 -19728 -17741 -6195 9245 21004 24016 17584
1130 17584 3841 -11778 -20921 -17775 -5165 9583 20617 24504 17676 2462 -13806 -21870 -18308
1143 -18308 -6641 8620 21635 25184 16612 882 -14829 -22958 -19970 -8028 7948 20979 24127
1156 24127 16072 123 -15131 -23211 -21073 -10082 6209 20004 23351 14352 -624 -14974 -23939
1169 -23939 -22073 -10661 5494 17698 20997 14064 -765 -15970 -23668 -20541 -9925 3711 16011
1182 16011 20404 12616 -2767 -15749 -22115 -19963 -9998 4889 16656 18486 10202 -3184 -16295
1195 -16295 -22465 -18743 -7177 6348 16569 17744 9576 -4414 -16494 -21374 -17990 -6145 8770
1208 8770 18603 17998 8905 -4035 -16526 -22683 -17611 -3607 10861 19225 19178 10549 -4251 -17435
1222 -17435 -21725 -15931 -3340 11428 21905 21832 10821 -4064 -15743 -20833 -16605 -2944 12928
1235 12928 22753 21827 12148 -2318 -15179 -20733 -15622 -2562 12262 22422 22497 12382 -1762 -13922
1249 -13922 -19532 -15153 -2378 12505 21604 21098 12370 -1002 -13959 -19124 -13556 -1211 11939
1262 11939 20197 20454 11656 -2501 -14026 -17815 -12723 -1460 12065 20089 18703 9196 -3597 -14618
1276 -14618 -18355 -12793 -332 12405 19087 17363 7535 -5061 -15996 -19235 -12598 369 12521
1289 12521 18910 16579 6418 -6720 -17819 -20260 -12529 161 12220 18711 16335 5301 -8510
1302 -8510 -18522 -20447 -13252 -99 12181 18757 15670 4999 -8861 -19066 -20932 -14015 -840
1315 -840 12022 18590 15742 4743 -8797 -19308 -20670 -13830 -1091 11875 18473 14815 4518
1328 4518 -8424 -18616 -20711 -13191 -29 11391 17681 14929 5236 -8686 -18444 -19246 -12095 118
1342 118 11778 18011 14937 4048 -8595 -17326 -18288 -11002 1720 12722 17862 14548 4285 -8261
1356 -8261 -17217 -17358 -9054 2669 13181 18617 15052 4028 -8346 -16568 -16516 -8605 4262 15167
1370 15167 18509 14209 4247 -7870 -16892 -16318 -6760 5439 15098 19008 15187 3802 -9151 -16051
1384 -16051 -15115 -7072 5205 16032 20265 14320 3048 -8432 -16112 -15945 -7269 6151 16232 19623
1398 19623 14546 2931 -9420 -16397 -15063 -7326 4938 16092 20064 13716 1650 -9763 -16002
1411 -16002 -15754 -7606 4938 15398 18458 13101 1888 -10525 -17226 -15292 -6686 4058 13934 18034
1425 18034 12932 327 -11524 -17009 -15010 -7279 4029 14166 16995 10894 -62 -11575 -17659
1438 -17659 -15058 -6524 4593 13593 15819 10441 -1554 -12809 -17534 -15004 -6598 5472 13874 15453
1452 15453 8842 -1790 -12232 -18383 -15793 -5906 6142 14282 15497 8719 -2402 -12880 -17747
1465 -17747 -15347 -5753 7093 15747 15012 7900 -1823 -11674 -18132 -15371 -4905 7280 15176 15727
1479 15727 8737 -2019 -12115 -16930 -14638 -5184 7611 16257 16420 8358 -2010 -11149 -16715 -14078
1493 -14078 -3390 8225 15375 15749 9680 -1561 -12125 -15804 -11384 -3183 7248 16152 17053 8876
1507 8876 -2361 -11060 -14907 -12040 -2247 9338 15358 14925 9343 -1244 -12266 -16222 -9698 -384
1521 -384 8027 14653 16572 9025 -3627 -12530 -14237 -10260 -1508 10232 16447 14320 6929 -2568 -12356
1536 -12356 -16388 -10392 1131 9808 14426 15064 8078 -4485 -13998 -15012 -9907 -1690 10057 17215
1550 17215 14152 4594 -4051 -11752 -16942 -12877 377 11174 14608 12667 7075 -4246 -14885 -16640
1564 -16640 -9878 -1055 8174 15924 14474 4146 -6083 -12554 -15640 -12622 -1709 10890 14959 11069
1578 11069 5033 -4464 -14999 -17463 -9530 134 7584 13743 13933 4957 -7702 -14103 -13467 -10039 -1962
1593 -1962 9639 15176 10964 3155 -5414 -13404 -16427 -9107 2143 9089 12252 12723 5442 -7809
1607 -7809 -15746 -13120 -6956 -59 9146 15911 12611 2085 -7131 -12545 -14680 -9204 2248 11530
1621 11530 13886 11354 4399 -6695 -14872 -14082 -5984 1820 9791 15708 13152 2389 -7951 -12280
1635 -12280 -13129 -8967 2021 12870 15119 10153 3524 -5264 -13784 -14500 -5920 4141 10755 14327
1649 14327 12639 3205 -8366 -12978 -11645 -6799 2333 12545 15832 10681 1338 -6472 -12363 -13802
1663 -13802 -6732 4612 11992 14153 11039 2309 -8166 -13772 -12117 -5752 2900 11879 15669 9883
1677 9883 408 -7579 -12451 -13253 -7053 4181 12407 13620 9248 1675 -7788 -14717 -13117 -5026 3789
1692 3789 10837 14068 10226 -101 -9001 -13378 -12183 -6152 3504 12025 13416 8295 34 -8460 -14266
1707 -14266 -12524 -4824 4350 10899 12926 8775 -439 -9482 -13641 -11385 -5111 4153 11664 12954 7585
1722 7585 -736 -8816 -13519 -12001 -4188 5553 11486 12274 7343 -564 -9667 -14405 -11167 -4014 5373
1737 5373 12037 13051 7168 -1521 -9216 -13666 -11417 -3126 6090 12368 12563 7412 -1433 -9925 -13424
1752 -13424 -10861 -3266 6065 12724 12995 7016 -1531 -9490 -13031 -10764 -2533 6753 12179 12933 7672
1767 7672 -1306 -9830 -13308 -9872 -2284 6258 12629 12896 7207 -1662 -9337 -12503 -9951 -1977 6870
1782 6870 12394 12396 6988 -1602 -9696 -12867 -9177 -1531 6616 12053 11972 6515 -2461 -9789 -12254 -8628
1798 -8628 -1596 7097 12288 11416 5980 -2280 -10352 -12693 -8547 -443 6917 11929 11681 5517 -3740
1813 -3740 -10790 -12104 -8488 -1363 6944 12288 10875 4312 -3698 -10735 -12911 -8870 -582 7084 11488
1828 11488 10700 5144 -4277 -11721 -12890 -7911 -929 7015 12239 11162 3839 -4609 -10734 -12432 -8783
1843 -8783 -574 7881 12017 10541 4569 -4244 -11624 -12963 -7457 -77 6917 12121 11329 3829 -5118
1858 -5118 -10798 -11797 -8025 -684 8168 12193 9953 3671 -4089 -10619 -12111 -7367 822 7523 11466
1873 11466 10254 3777 -5021 -10776 -10798 -6810 127 8188 12593 9824 2608 -4790 -9705 -11311 -6621
1888 -6621 1730 8627 11524 9410 3088 -5198 -10562 -10243 -5343 1251 9042 12671 9469 1844 -5469
1903 -5469 -10107 -10475 -6196 2399 9850 11969 8821 2434 -5352 -11031 -10916 -5597 2486 9270 12431
1918 12431 9230 1885 -6138 -10579 -10862 -6104 2151 9881 12402 8184 1536 -5565 -10690 -11266 -5818
1933 -5818 2811 9113 11381 8813 1750 -6350 -11174 -10510 -5623 1998 9156 11560 8127 923 -6121
1948 -6121 -10473 -11177 -5649 2739 8576 10368 7815 1286 -6395 -11253 -10437 -4613 2142 8194 10525
1963 10525 7591 264 -6807 -10734 -9668 -4546 2932 9009 10300 6618 24 -6956 -10865 -9754 -3841
1978 -3841 3587 9020 10300 6444 -409 -7422 -11057 -9445 -3506 4307 9927 10780 6441 -535 -7451
1993 -7451 -11159 -9954 -3076 4598 10055 10720 6628 -244 -7629 -11246 -9437 -3001 4755 10205 10979
2008 10979 6789 -423 -7653 -11213 -9267 -2917 4799 10325 10802 6705 -571 -7079 -10703 -9180 -2866
2023 -2866 4719 9835 10568 6426 -136 -7088 -10503 -8747 -2562 4614 9539 9959 6277 -530 -7373
2038 -7373 -10203 -7990 -2015 4601 9457 10113 5911 -1636 -7533 -9912 -7266 -1796 4891 9236 9691
2053 9691 4949 -1990 -7940 -10064 -7356 -1184 5237 9517 9430 4435 -2795 -8248 -10186 -6997 -1241
2068 -1241 5554 9966 9208 4410 -2479 -8746 -10315 -7062 -699 5929 9633 9338 4595 -2976 -9271
2083 -9271 -10597 -7402 -899 5800 10073 9803 4210 -3043 -8545 -10155 -7328 -1184 5828 9698 9563
2098 9563 4096 -2926 -8600 -10137 -6998 -889 5490 9683 8704 3353 -3178 -8258 -9797 -6758 -430
2113 -430 6065 9648 8419 3603 -3028 -7976 -9427 -6462 -420 6291 9489 8409 3052 -3394 -8138
2128 -8138 -9291 -6168 376 6189 9390 8097 2619 -3607 -8398 -8859 -5357 480 6768 9770 7551
2143 7551 2237 -3904 -8279 -9477 -5706 1270 7072 9782 7544 2338 -3973 -8683 -9101 -5291 1281
2158 1281 6948 9666 7856 2084 -4392 -8544 -9353 -5071 1181 7156 9680 7660 2014 -4474 -9039
2173 -9039 -8999 -4627 1143 7070 9626 7596 1685 -4640 -8661 -9113 -4982 1528 7274 9561 7182 1911
2189 1911 -4118 -8621 -8785 -4547 1934 7068 9278 7163 1739 -4738 -8872 -8524 -4480 1692 7391
2204 7391 9182 6472 1170 -4660 -8571 -8407 -4123 2465 6954 8613 6440 1090 -5042 -9028 -8235
2219 -8235 -3422 2151 7239 8943 5949 313 -5425 -8658 -8129 -4045 3165 7687 8394 5803 355
2234 355 -5464 -9236 -8267 -3195 3058 7246 8663 6067 133 -6202 -8988 -7682 -3281 2953 7831
2249 7831 8542 5406 -204 -5709 -9050 -8076 -2740 3238 7427 8743 6017 43 -6254 -8741 -7316
2264 -7316 -2911 2922 7495 8782 5496 -232 -5406 -8746 -7539 -2755 3459 7476 7874 5330 -113
2279 -113 -6120 -8537 -6808 -2085 3500 7619 8498 4758 -1051 -5731 -8244 -6920 -2106 3862 7733
2294 7733 7945 4424 -736 -5901 -8550 -6163 -1576 3858 7382 8032 4621 -1474 -6555 -8199 -6459
2309 -6459 -1323 4253 8288 7874 4328 -1304 -6386 -8729 -6284 -1282 4719 7829 8087 4339 -1889
2324 -1889 -6759 -8300 -5880 -1349 4272 8805 8261 3695 -1882 -6354 -8097 -6412 -1065 4844 7948
2339 7948 7748 3832 -1759 -6624 -8078 -5793 -987 4568 7594 7743 3631 -2188 -6551 -8051 -5544
2354 -5544 -857 4387 7907 7159 3303 -2315 -6546 -7880 -5235 -869 4670 7722 7257 2733 -2430
2369 -2430 -6440 -7431 -5329 -354 5128 7862 6670 2492 -2572 -6676 -7850 -5194 195 5297 7885
2384 7885 6381 2259 -3008 -6968 -8065 -4984 772 5331 7764 6350 2091 -3065 -7307 -7698 -4974
2399 -4974 496 5125 8095 6546 1920 -3449 -7084 -7723 -5163 433 5774 8074 6546 1943 -3337
2414 -3337 -7081 -8020 -4926 881 5510 7929 6756 1930 -3481 -7053 -7559 -4700 808 5369 8004
2429 8004 6084 1599 -3064 -7034 -7785 -4333 849 5636 7297 6153 1843 -3511 -7350 -6826 -3681
2444 -3681 1314 5591 7514 5960 1118 -3726 -6397 -6799 -3745 1605 5976 7276 5354 1239 -3852
2459 -3852 -6990 -7174 -2966 1706 6026 7346 5557 940 -4176 -7224 -6578 -3237 1721 6120 7282
2474 7282 5130 940 -3854 -7555 -6954 -2647 2675 6398 7142 5395 906 -4496 -7363 -6109 -2715
2489 -2715 2118 6190 7438 4868 104 -4232 -6947 -6852 -2665 2358 6251 6900 4953 365 -4495 -7712
2505 -7712 -6135 -2195 2355 5761 7094 4685 -508 -4811 -7149 -6205 -2624 2664 6472 7158 4237
2520 4237 141 -4520 -7186 -6225 -1731 2755 5939 6763 4474 -378 -5081 -6960 -5315 -2218 2449
2535 2449 6185 7067 3847 -863 -5016 -6980 -5923 -2061 2972 6304 6597 4261 -641 -5702 -7274
2550 -7274 -5325 -1290 2509 6273 6948 3439 -1345 -5152 -6770 -5487 -1359 3517 6540 6607 3661 -1024
2566 -1024 -5534 -6928 -5281 -1054 2954 6495 6791 3591 -1471 -5475 -6580 -5102 -1492 3807 6684
2581 6684 6256 3357 -1305 -5200 -6802 -5131 -647 3806 6669 6317 2989 -1484 -5735 -6535 -4669 -1003
2597 -1003 3422 6702 6247 2949 -1584 -5179 -6595 -4943 -452 4049 6511 6166 2837 -1538 -5225
2612 -5225 -6344 -4411 -541 3976 6950 6042 2600 -2377 -5284 -6399 -4486 -323 4210 6494 5760
2627 5760 2367 -1977 -5259 -6332 -4194 -207 4201 6435 5555 2198 -2182 -5563 -6398 -4471 -262
2642 -262 4432 6556 5435 2139 -2225 -5715 -6757 -4158 426 4343 6476 5244 1993 -2512 -5891
2657 -5891 -6611 -3928 388 4700 6324 5301 1505 -2478 -5682 -6435 -3790 613 4572 6168 4975
2672 4975 1618 -2477 -5764 -6303 -3822 717 4350 6041 4685 1374 -3041 -5824 -6333 -3221 897
2687 897 4491 5980 4917 1335 -2632 -6131 -6241 -3310 712 4789 6072 5051 808 -2635 -5842
2702 -5842 -5860 -3121 1134 4893 5763 4647 1282 -3047 -6031 -5989 -3089 1482 4764 6280 4772 905
2718 905 -3236 -6169 -5785 -2901 1316 4799 6064 4332 959 -3348 -5873 -5351 -2386 1597 5034 6078
2734 6078 4677 650 -3665 -5931 -5411 -2339 1720 5247 6087 4191 718 -3614 -6054 -4915 -2276
2749 -2276 1927 4929 5705 4159 271 -3722 -5751 -4962 -1982 2030 5197 6061 4271 290 -3649 -5660
2765 -5660 -4855 -1786 2048 5132 5517 3730 10 -4089 -5653 -4997 -1941 2097 5107 5575 3760 -11
2781 -11 -3862 -5870 -4773 -1710 2187 5235 5797 3568 -192 -3964 -5703 -4785 -1782 2169 5115 5853
2797 5853 3253 -606 -4307 -5567 -4751 -1589 2646 5473 5814 3041 -850 -4093 -5694 -4944 -1367 2767
2813 2767 4999 5295 2947 -1034 -4441 -5506 -4547 -1662 2366 5166 5388 2439 -1295 -4537 -5966 -4266
2829 -4266 -1203 2762 5123 5306 2559 -1371 -4383 -5666 -4095 -1370 2962 5604 5353 2533 -1148
2844 -1148 -4346 -5410 -3988 -678 3259 5497 5331 2329 -1274 -4445 -5581 -3984 -494 3105 5501
2859 5501 5100 2529 -1560 -4422 -5598 -3723 -459 3275 5486 5088 2250 -1230 -4360 -5654 -3960
2874 -3960 -51 3337 5786 5038 2194 -1323 -4432 -5098 -3783 -180 3560 5182 4842 2180 -1326 -4338
2890 -4338 -5239 -3798 12 3341 5638 4778 1783 -1743 -4532 -5178 -3470 78 3624 5552 4362 1726
2906 1726 -1994 -4758 -5361 -3343 451 3776 5296 4579 1672 -2222 -4683 -5281 -2907 498 3596 5400
2922 5400 4326 1297 -2018 -5030 -5360 -3258 615 3920 5042 4283 1330 -2421 -5134 -5210 -3141 594
2938 594 3965 5042 4328 1194 -2506 -5003 -5346 -3127 547 4020 4914 3929 1144 -2688 -4900 -5176
2954 -5176 -2903 858 3514 5024 4040 856 -2550 -5073 -4886 -2552 831 3928 5125 3687 1021
2969 1021 -2972 -4942 -4701 -2363 1133 3878 5002 3870 673 -2848 -5065 -4697 -2614 840 3746
2984 3746 5053 3800 288 -3056 -4678 -4791 -2369 1364 4114 4921 3445 362 -2743 -4794 -4206 -1899
3000 -1899 1322 4087 5219 3627 224 -3065 -4772 -4509 -1696 1680 4357 5187 3259 276 -2887
3015 -2887 -5019 -4294 -1630 1903 4674 4973 3199 167 -3386 -4836 -4113 -1625 1859 4244 4808 3353
3031 3353 324 -2993 -4553 -4354 -1498 2089 4348 4648 2912 -139 -3364 -4789 -3934 -1385 2056 4539
3047 4539 4738 3026 105 -3190 -4891 -3899 -1472 1798 4571 4736 2772 -320 -3575 -4562 -3651 -1233
3063 -1233 1872 4314 4548 2505 -828 -3659 -4778 -3722 -1473 2198 4424 4486 2389 -657 -3590 -4852
3079 -4852 -4008 -1234 2250 4601 4499 2030 -890 -3510 -4666 -3943 -1044 2273 4393 4051 2560 -1055
3095 -1055 -3796 -4644 -3821 -769 2542 4423 4292 2110 -1192 -3765 -4804 -3973 -797 2296 4402 4277
3111 4277 1907 -884 -3844 -4848 -3281 -268 2429 4350 4429 1796 -1097 -3725 -4356 -3676 -297 2930
3127 2930 4463 4024 1550 -1066 -3733 -4680 -2855 -152 2816 4153 4128 1856 -1255 -3987 -4428 -2722
3143 -2722 -186 2983 4717 4214 1548 -1075 -3924 -4521 -2899 305 2972 4170 3870 1601 -1203 -3979
3159 -3979 -4276 -2552 261 3142 4358 4160 1458 -1556 -4137 -4232 -2683 718 3258 4622 3553 1353
3175 1353 -1864 -4008 -4317 -2536 613 2848 4604 3695 1128 -1745 -4120 -4401 -2938 568 3012 4510
3191 4510 3673 1133 -1790 -3852 -4339 -2539 468 3351 4439 3644 881 -1987 -4052 -4188 -2642 395
3207 395 3065 4499 3477 736 -2055 -4015 -4064 -2376 745 3163 4179 3322 542 -2397 -3980 -4221
3223 -4221 -2070 839 2950 4219 3411 797 -2582 -4353 -3897 -1919 831 3570 4433 3056 561 -2617
3239 -2617 -4071 -3999 -1721 1065 3452 4303 3090 208 -2701 -4294 -3755 -2075 1083 3622 4589 2895
3255 2895 247 -2495 -4192 -3791 -1833 1179 3722 4144 3283 358 -2642 -3900 -3550 -1787 1264 3711
3271 3711 4268 2802 24 -2950 -4090 -3808 -1453 1406 3575 3996 2816 499 -2431 -3865 -3500 -1640
3287 -1640 1309 3734 4323 3086 187 -2716 -4036 -3467 -1101 1714 3749 4230 2775 -260 -2802 -3834
3303 -3834 -3457 -1171 1692 3676 4023 2564 -309 -3003 -4050 -3201 -915 2100 3837 4029 1967 -432
3319 -432 -2894 -4073 -3540 -1157 2181 3608 3829 1954 -413 -2848 -4190 -3257 -1131 2040 4022 3697
3335 3697 2096 -603 -3379 -4134 -3395 -899 2040 3849 3713 2018 -763 -3073 -4190 -3463 -603 1955
3351 1955 3691 3579 1903 -1165 -3095 -3927 -3142 -562 2130 3995 3566 1710 -723 -3166 -3870 -3244
3367 -3244 -604 2234 3772 3757 1596 -1075 -3128 -4043 -2954 -464 2056 3653 3530 1660 -1041 -3262
3383 -3262 -3926 -2728 -79 2230 3583 3476 1343 -1154 -3019 -3634 -2662 -102 2707 4006 3499 1539
3399 1539 -1133 -3116 -4015 -2610 419 2697 3706 3661 1434 -1282 -3555 -3954 -2267 28 2505 3756
3415 3756 3527 1382 -1518 -3378 -3881 -2319 301 2706 4123 3245 1155 -1282 -3590 -3537 -2102 227
3431 227 2619 3745 2998 949 -1487 -3104 -3645 -2459 138 2701 3647 3278 826 -1422 -3663 -3856
3447 -3856 -1951 462 2330 3659 3234 810 -1707 -3540 -3346 -1970 26 2515 4021 3054 649 -1850
3463 -1850 -3490 -3572 -1943 597 2593 3572 2952 822 -2043 -3300 -3595 -1879 539 2766 3799 2506
3479 2506 369 -2120 -3425 -3549 -1661 840 2605 3746 2724 326 -2142 -3705 -3539 -1606 654
3494 654 2685 3707 2573 189 -2044 -3222 -3394 -1675 594 2659 3423 2751 114 -2316 -3604 -3442
3510 -3442 -1401 1048 3068 3551 2195 89 -2398 -3642 -2896 -1378 1063 3103 3710 2334 202 -2336
3526 -2336 -3566 -3121 -1360 1264 3277 3349 2066 51 -2319 -3633 -3104 -1107 1273 3258 3711 2168
3542 2168 21 -2295 -3314 -2725 -1265 1379 3156 3599 2116 -242 -2232 -3262 -2584 -1038 1603 3392
3558 3392 3389 1968 -161 -2362 -3517 -3253 -1004 1421 3479 3369 1937 -148 -2371 -3506 -2795 -733
3574 -733 1585 3164 3474 2035 -512 -2416 -3188 -3103 -736 1601 3293 3467 1674 -524 -2401 -3731
3590 -3731 -2532 -766 1679 3497 3161 1275 -638 -2772 -3489 -2795 -527 1328 3271 3067 1763 -780
3606 -780 -2643 -3444 -2809 -493 1651 2964 3122 1523 -857 -2798 -3525 -2716 -649 1931 3208 2836 1460
3623 1460 -821 -2895 -3508 -2501 -320 1853 3047 2820 1351 -907 -2834 -3363 -2209 -166 1575 3061
3639 3061 2843 1231 -1039 -2779 -3339 -2251 24 1926 3283 2887 1276 -876 -3086 -3310 -2072 -289
3655 -289 1997 2949 2790 1345 -1055 -2622 -3159 -1925 33 2216 3415 2819 1297 -1121 -2835 -3171
3671 -3171 -1924 -81 2212 2998 3014 1227 -1408 -2888 -2814 -1835 220 2006 2971 2822 775 -1075 -3010
3688 -3010 -3175 -1842 160 2233 3439 2978 1040 -1563 -3059 -2870 -1554 97 1998 3198 2611 742
3704 742 -1468 -3018 -2971 -1554 112 2376 3478 2176 688 -1310 -3212 -2968 -1360 596 2465 3107
3720 3107 2587 592 -1669 -2994 -3109 -1854 550 2211 3249 2305 334 -1391 -2943 -3012 -1737 651
3736 651 2444 3144 2319 441 -1609 -2891 -2627 -1797 593 2394 3041 2115 328 -1670 -3154 -3118 -1513
3753 -1513 652 2557 2824 2203 189 -1903 -2886 -3040 -1233 608 2423 3164 2156 267 -1965 -3093
3769 -3093 -2858 -1537 1010 2563 3209 1848 41 -1761 -2960 -2886 -1168 964 2394 3159 1861 310
3785 310 -1798 -3021 -2627 -1193 690 2761 2898 1778 -132 -1826 -2734 -2515 -1085 1281 2704 3040
3801 3040 1964 193 -1970 -2712 -2344 -782 1158 2884 2870 2237 -26 -2109 -2705 -2505 -547 1178 2854
3818 2854 3065 1950 26 -1930 -3032 -2267 -673 1320 2561 3096 1837 -287 -2102 -2945 -2428 -690
3834 -690 1190 2783 2839 1783 -166 -2348 -2800 -2463 -894 1397 2701 2783 1586 -347 -1757 -2823 -2300
3851 -2300 -789 1419 2689 2707 1393 -361 -2087 -2689 -2061 -384 1598 2743 2279 1354 -557 -2170
3867 -2170 -2945 -1925 -340 1417 2650 2730 1213 -737 -2151 -2822 -2417 -492 1395 2441 2746 1506
3883 1506 -629 -2388 -2717 -2433 -509 1653 2551 2439 1167 -713 -2300 -2902 -2067 -379 1547 2463 2705
3900 2705 933 -898 -2267 -2658 -1900 -223 1475 2610 2335 983 -995 -2283 -2914 -1918 55 1400
3916 1400 2811 2396 999 -853 -2437 -2625 -1486 -105 1970 2661 2310 907 -922 -2580 -2470 -1385
3932 -1385 -178 2003 2748 2588 1383 -993 -2554 -2616 -1531 271 1573 2669 2496 940 -780 -2254
3948 -2254 -2283 -1542 350 1808 2707 2318 936 -1077 -2468 -2161 -1376 198 1885 2917 2022 826 -1365
3965 -1365 -2649 -2559 -1386 482 1967 2595 2235 609 -998 -2486 -2264 -1249 624 2141 2409 1814 348
3982 348 -1089 -2334 -2522 -1410 496 2020 2769 1807 446 -1477 -2316 -2491 -1561 623 1869 2629 1837
3999 1837 454 -1661 -2197 -2192 -1460 244 2010 2620 1754 340 -1734 -2572 -2432 -1182 692 1967 2538
4016 2538 1828 25 -1473 -2298 -2298 -1301 476 1941 2443 1601 91 -1238 -2229 -2043 -1019 577 2012
4033 2012 2480 1560 182 -1626 -2280 -2388 -1254 803 2353 2369 1412 -103 -1786 -2208 -2259 -920 618
4050 618 2261 2053 1755 -20 -1748 -2414 -2238 -679 1202 2361 2261 1395 107 -1816 -2529 -2126 -762
4067 -762 1435 2223 2214 1517 -238 -1912 -2176 -1955 -535 876 2228 2230 1427 -290 -1374 -2456 -2375 -800
4085 -800 1217 2206 2379 1424 -257 -1789 -2253 -1806 -354 986 2262 2020 1525 -314 -1710 -2357 -2029
4102 -2029 -81 1316 2201 2330 1459 -348 -1592 -2170 -1887 -255 1112 2254 2292 1222 -164 -1724 -2370
4119 -2370 -1717 -595 1306 2063 2289 1249 -331 -2073 -2247 -1473 -215 1085 2227 2223 1072 -515 -1866
4136 -1866 -2067 -1672 -376 1665 1957 2017 676 -508 -1929 -2377 -1572 -400 1296 2197 2018 1035 -593
4153 -593 -2160 -2125 -1374 -157 1405 2380 2063 854 -803 -1932 -2363 -1617 -87 1447 2249 2111 853
4170 853 -940 -2010 -2257 -1310 -129 1460 2345 1890 1025 -894 -1971 -2158 -1317 -119 1591 2209 2030
4187 2030 657 -724 -2050 -1912 -1228 -128 1347 2227 1757 650 -827 -2121 -2126 -1539 399 1239 2121
4204 2121 1746 546 -890 -1918 -2109 -1131 -10 1555 2272 1615 583 -1023 -1977 -2108 -1201 165 1688
4221 1688 2377 1820 309 -680 -1840 -1901 -1062 382 1548 2039 1946 475 -968 -1923 -1676 -1464 323 1580
4239 1580 2303 1637 533 -976 -1717 -1773 -859 323 1701 2061 1393 497 -1213 -2015 -2142 -817 510 1491
4257 1491 2435 1625 34 -1252 -1929 -2038 -709 488 1910 2416 1481 298 -996 -1821 -1834 -753 355
4274 355 1725 1959 1549 386 -977 -2023 -1876 -869 487 1669 1929 1361 420 -1426 -2317 -1935 -837
4291 -837 517 1673 1976 1389 182 -1062 -2179 -1906 -989 771 1753 1755 1075 -246 -1193 -2089 -1832 -690
4309 -690 901 1629 2049 1243 8 -1514 -2002 -1724 -675 683 1734 1709 1565 -282 -1259 -2047 -1926 -698
4327 -698 562 1778 1950 1343 -416 -1482 -2022 -1734 -358 850 1650 1850 1115 80 -1391 -1918 -1992 -477
4345 -477 752 1753 1855 1086 -111 -1408 -2002 -1524 -427 957 1933 1865 1276 -444 -1458 -1986 -1547 -299
4363 -299 1045 1722 2005 1058 133 -1231 -1962 -1410 -116 1013 1601 1794 1004 -295 -1440 -1940 -1385 -396
4381 -396 907 1760 1753 856 -140 -1627 -2218 -1153 -125 961 1915 1930 844 -271 -1487 -1862 -1319 -313
4399 -313 650 1905 1880 890 -365 -1766 -1735 -1267 -43 923 1362 1505 894 -473 -1395 -1826 -1165 -126 1133
4418 1133 1875 1540 626 -454 -1637 -1882 -1216 93 901 1753 1717 751 -545 -1526 -1660 -1062 -41 1119
4436 1119 1785 1468 498 -740 -1530 -1593 -1177 -51 996 1829 1857 591 -542 -1578 -1946 -1414 -100 1241
4454 1241 1508 1752 740 -469 -1521 -1565 -1242 44 1200 1930 1352 561 -922 -1497 -1825 -1142 127 1055
4472 1055 1943 1466 621 -675 -1521 -1580 -1044 320 1445 1862 1240 153 -752 -1630 -1612 -909 129 1483
4490 1483 1782 1294 63 -909 -1786 -1803 -711 274 1479 1773 1359 350 -712 -1766 -1776 -914 376 1295
4508 1295 1710 1538 250 -899 -1572 -1738 -666 453 1264 1586 1048 189 -833 -1676 -1870 -1057 289 1657
4526 1657 1818 1392 53 -720 -1981 -1666 -782 420 1531 1558 1481 174 -840 -1493 -1629 -559 475 1454
4544 1454 1711 1371 55 -1126 -1598 -1793 -450 228 1337 1596 1073 255 -861 -1607 -1513 -801 386 1584
4562 1584 1542 947 -2 -1081 -1525 -1367 -589 497 1357 1578 1092 148 -1147 -1748 -1055 -463 645 1349 1648
4581 1648 1055 123 -840 -1660 -1450 -348 497 1645 1707 1117 0 -1396 -1843 -1432 -316 529 1700 1714
4599 1714 801 -181 -1215 -1899 -1409 -48 561 1611 1727 1045 -323 -1200 -1546 -1342 -583 578 1316 1376
4617 1376 587 -49 -1151 -1906 -1176 -303 778 1585 1336 991 -333 -1258 -1530 -1532 -366 689 1437 1609 729
4636 729 -438 -1251 -1512 -1124 -256 624 1373 971 553 -406 -1305 -1417 -1001 -507 552 1381 1605 735 -485
4655 -485 -1188 -1857 -1173 -61 867 1311 1436 687 -216 -1202 -1575 -1284 -17 858 1583 1285 853 -367 -1351
4674 -1351 -1482 -1118 26 853 1337 1285 500 -679 -1411 -1492 -809 211 1094 1612 1282 519 -459 -1316 -1565
4693 -1565 -1264 29 1039 1557 1265 505 -457 -1204 -1356 -949 214 1165 1567 1664 368 -899 -1378 -1306 -531
4712 -531 124 1117 1671 1214 545 -737 -1324 -1331 -992 -8 1132 1189 1256 243 -754 -1227 -1575 -728 42 1139
4732 1139 1539 1003 627 -625 -1296 -1529 -1127 333 1144 1312 1136 589 -700 -1206 -1476 -516 231 855 1327
4751 1327 914 274 -555 -1337 -1445 -974 -174 1011 1414 1197 142 -752 -1491 -1407 -814 287 1053 1322 1068
4770 1068 355 -713 -1257 -1439 -1035 147 719 1537 1149 453 -740 -1481 -1416 -792 641 1008 1445 1257 283
4789 283 -730 -1430 -1222 -715 225 1017 1458 1236 -153 -652 -1316 -1091 -789 95 991 1665 779 -185 -1070
4808 -1070 -1184 -1324 -914 373 1063 1422 788 138 -832 -1452 -1187 -790 358 1030 1565 841 23 -718 -1294
4827 -1294 -1133 45 452 1453 1395 757 -92 -792 -1051 -845 -256 494 1056 986 986 121 -771 -1185 -995 -521
4847 -521 367 1189 1429 440 -140 -781 -1647 -1335 -602 110 966 1445 791 77 -805 -1387 -1162 -331 500 1296
4867 1296 1484 902 -186 -758 -1374 -1036 -432 589 1101 1094 913 -133 -767 -1158 -1054 -674 721 1000 1340
4886 1340 617 -103 -925 -1193 -911 -248 274 1368 1145 945 -236 -919 -1265 -1108 -252 772 1445 1333 611
4905 611 -319 -960 -1362 -992 -135 587 1240 1217 654 25 -940 -1144 -809 -421 453 1403 1124 274 -159 -1024
4925 -1024 -1472 -946 -428 807 1448 1387 692 -365 -1086 -1273 -761 -75 766 1265 1190 425 -192 -1263 -791
4944 -791 -696 -290 834 1243 1204 579 -212 -778 -1268 -868 -96 409 1317 1217 364 -116 -1053 -1128 -1186 -466 860
4965 860 1180 1044 362 -261 -1144 -1280 -953 241 935 1025 1069 210 -240 -1101 -1123 -694 -17 856 1058 930 200
4986 200 -589 -1052 -1279 -750 78 1138 1199 1137 394 -335 -1098 -1481 -792 355 521 1390 1119 363 -400 -1015
5006 -1015 -1135 -790 -53 650 1393 1008 399 -796 -875 -1101 -673 191 709 786 1007 558 -493 -1146 -932 -783
5026 -783 322 1010 1248 680 289 -578 -1160 -1351 -1027 137 821 887 846 359 -579 -1235 -923 -812 268 840
5046 840 1137 722 157 -876 -1016 -1171 -379 170 930 1276 696 205 -611 -1172 -1171 -420 196 860 936 755 -136
5067 -136 -730 -1140 -1198 -462 141 998 1299 1034 371 -575 -1065 -1144 -417 208 1048 1036 612 -78 -570 -883 -1122
5088 -1122 -516 208 942 1259 811 6 -657 -1231 -1044 -313 156 778 1147 990 65 -1141 -1117 -866 -235 371
5108 371 1290 926 785 25 -797 -1190 -1144 -364 336 1322 1214 442 -210 -686 -1004 -798 -521 471 1279 1117
5128 1117 597 -95 -767 -1176 -1147 -583 463 1329 1116 631 -180 -717 -992 -838 -428 510 823 990 725 -173
5148 -173 -596 -920 -951 -82 620 1032 1279 303 -130 -556 -868 -556 -280 570 1413 1046 370 -361 -779 -1471
5168 -1471 -953 -244 544 983 1046 554 -449 -807 -966 -899 -96 455 1050 1159 525 -159 -739 -1083 -743 -210
5188 -210 704 1131 1111 178 -466 -1169 -788 -780 -293 772 864 1108 359 -351 -896 -1016 -726 32 639 1093 1096 392
5210 392 -426 -705 -1047 -662 -4 382 1080 616 493 -194 -728 -995 -478 -441 475 916 1212 533 -411 -886
5230 -886 -1173 -740 -297 770 1272 832 285 -389 -515 -1082 -581 125 693 890 729 93 -244 -734 -815 -592
5250 -592 115 564 1046 829 306 -473 -803 -1051 -712 177 644 993 662 382 -311 -757 -897 -585 -111 877
5270 877 1065 870 256 -508 -657 -1102 -446 105 715 923 785 422 -198 -824 -1167 -504 222 867 999 712
5290 712 148 -461 -900 -969 -534 140 726 980 706 288 -552 -631 -904 -597 266 827 1117 543 18 -532 -1075
5311 -1075 -797 -659 386 573 945 734 156 -560 -906 -915 -340 81 665 1031 835 -96 -656 -860 -919 -642
5331 -642 78 602 1054 818 -262 -630 -899 -903 -579 335 750 940 844 -35 -328 -909 -1019 -304 209 624 836
5352 836 599 -105 -710 -896 -1045 -150 214 839 661 716 101 -791 -772 -900 -237 159 533 1130 701 -9 -724
5373 -724 -737 -926 -194 249 747 853 581 -148 -575 -990 -1018 -546 306 744 1124 411 120 -441 -952 -681 -263
5394 -263 350 736 872 264 34 -509 -642 -685 -252 313 727 877 708 200 -454 -852 -653 -117 36 740
5414 740 1132 484 -344 -879 -844 -653 -366 314 897 758 510 -240 -580 -1072 -662 -261 557 636 786 599 -25
5435 -25 -497 -1204 -612 -151 514 911 839 586 -228 -369 -916 -769 -130 298 996 729 479 -325 -870 -886 -617
5456 -617 -212 418 637 986 673 -182 -770 -961 -736 -129 438 766 727 458 -235 -1144 -919 -444 -83 328
5476 328 876 913 269 -337 -667 -954 -614 -104 521 833 1020 337 -98 -1010 -1060 -725 211 500 1057 819 488
5497 488 -272 -922 -871 -613 84 296 822 616 148 -253 -983 -672 -446 151 568 872 484 432 -333 -429 -1115
5518 -1115 -768 102 655 955 559 397 -424 -760 -850 -611 -182 580 745 650 80 -459 -844 -823 -536 -165 858
5539 858 968 578 -195 -389 -755 -921 -293 239 591 811 701 95 -265 -603 -616 -431 212 598 845 787 165
5560 165 -281 -614 -1006 -484 56 534 1030 783 154 -381 -567 -652 -543 61 247 955 574 189 -368 -671
5580 -671 -753 -453 259 528 1027 785 -188 -617 -851 -858 -761 117 516 772 610 247 -684 -793 -658 -230 505
5601 505 715 956 446 14 -586 -665 -780 -298 4 798 625 729 -193 -540 -726 -754 -247 297 726 621 521
5622 521 218 -651 -758 -589 -370 268 721 952 586 -148 -479 -394 -815 0 112 823 965 516 7 -698
5642 -698 -676 -466 -334 114 258 731 491 51 -488 -657 -856 -248 272 824 667 490 -3 -606 -678 -647 -48
5663 -48 280 942 931 370 -156 -492 -948 -628 -292 172 699 843 454 5 -610 -607 -441 -91 419 601 677 532
5685 532 148 -346 -1184 -601 -198 284 772 935 378 -350 -388 -657 -643 -225 388 491 574 447 -355 -439 -771
5706 -771 -613 -31 313 810 826 515 -212 -475 -763 -476 141 298 842 335 336 -231 -786 -992 -246 56 376
5727 376 884 802 211 -143 -471 -607 -558 -31 285 624 823 399 -215 -860 -600 -737 -35 394 741 693 247
5748 247 -410 -449 -709 -620 195 708 610 684 89 -146 -767 -799 -562 -74 326 622 671 219 -425 -874 -868 -426 -16
5771 -16 288 769 656 189 -475 -781 -829 -661 7 747 441 414 456 -415 -846 -740 -510 -110 584 625 503 53
5793 53 -140 -461 -852 -139 -20 327 844 494 -67 -211 -721 -810 -599 -18 579 844 317 270 -189 -522 -793
5814 -793 -536 188 862 842 614 233 -558 -763 -668 -488 55 462 692 674 152 -338 -777 -714 -203 -122 375 1006
5836 1006 563 -102 -560 -760 -645 -589 213 851 694 85 -127 -485 -649 -568 -356 206 430 428 453 -193 -303
5857 -303 -642 -624 -397 162 488 677 260 11 -279 -472 -632 -190 473 451 939 503 121 -624 -521 -620 -159
5878 -159 91 582 555 471 67 -293 -734 -494 -323 245 462 788 350 70 -239 -771 -732 -202 127 396 432
5899 432 425 143 -326 -438 -641 -96 86 840 571 344 -160 -280 -282 -326 -196 189 273 560 493 -271 -608 -802
5921 -802 -492 -97 412 595 431 397 125 -521 -749 -447 31 137 726 711 121 21 -605 -403 -404 -107 114
5942 114 384 563 134 146 -581 -759 -356 -133 406 782 556 306 -88 -770 -619 -438 40 446 330 807
5962 807 441 -219 -424 -643 -447 -244 498 427 630 387 -230 -516 -778 -272 -19 567 545 355 439 -87 -472
5983 -472 -722 -498 231 531 722 445 311 -114 -407 -533 -535 70 278 452 648 405 -272 -339 -374 -474 186
6004 186 433 927 499 205 -57 -414 -373 -548 -45 407 609 478 117 -421 -647 -530 -340 -72 257 348 392
6025 392 77 -375 -386 -331 -328 80 283 414 609 -170 -234 -651 -413 -286 -152 553 817 436 459 -511 -651 -516
6047 -516 -554 198 631 458 680 38 -102 -288 -606 -207 304 300 462 580 -26 -101 -495 -702 -340 -143 440
6068 440 543 675 76 -228 -632 -377 -453 74 411 148 151 185 -353 -441 -534 -298 235 349 651 629 -30 -247
6090 -247 -458 -494 -474 -279 406 716 394 71 -197 -572 -314 -277 368 331 469 451 147 -473 -545 -404 -250 207
6112 207 625 493 386 169 -277 -660 -703 -166 155 336 481 242 96 -398 -362 -441 -200 241 8 503 232
6133 232 110 -510 -590 -572 -191 142 492 124 156 28 -210 -686 -596 -156 282 566 682 519 -74 -400 -554
6154 -554 -558 207 55 304 455 371 -5 -320 -565 -240 -304 291 243 414 380 -32 -402 -787 -414 -191 220 374
6176 374 338 195 91 -217 -718 -589 -40 28 312 373 215 -4 -405 -590 -692 -110 325 615 783 146 -343
6197 -343 -540 -416 -360 -120 327 552 555 452 -158 -329 -531 -400 106 351 236 242 250 -302 -334 -539 -345 -20 555
6220 555 758 512 233 123 -373 -534 -653 -64 417 661 219 288 -262 -536 -524 -424 -49 292 257 373 210
6241 210 -165 -457 -672 -337 153 330 312 501 -51 -166 -421 -488 -181 168 120 451 294 278 -322 -375 -551 -224
6263 -224 143 592 225 206 514 -367 -533 -536 -237 163 192 366 353 217 -329 -968 -635 -357 -205 26 160 272
6285 272 391 -332 -619 -123 -228 -117 351 490 364 70 -46 -621 -695 -147 47 608 534 371 336 -404 -341
6306 -341 -525 -210 141 58 677 416 151 -305 -431 -527 -450 34 498 631 198 164 21 -378 -177 -349 162
6327 162 431 482 120 0 -191 -659 -469 -421 116 417 501 557 145 -118 -485 -559 -85 285 548 649 142 326
6349 326 -630 -324 -319 -218 190 281 337 247 89 -273 -601 -557 -253 133 109 483 393 47 -406 -622 -324 -545 150
6372 150 205 762 527 -153 -329 -363 -445 21 564 263 401 260 -48 -232 -177 -358 -88 264 261 517 294 126
6394 126 22 -355 -294 -200 170 367 277 284 179 -503 -458 -608 -285 108 515 98 111 -227 -268 -469 -351 -252 80
6417 80 333 392 456 224 -208 -419 -287 -116 217 431 691 144 2 -180 -646 -507 -193 -82 412 367 37
6438 37 -40 -421 -764 -230 -116 497 519 252 -65 -349 -392 -649 -428 -180 241 158 295 157 -278 -359 -419 -277
6460 -277 60 454 411 494 536 -79 -433 -471 -324 11 206 622 542 205 -39 -341 -566 -68 -268 -23 559 197
6482 197 363 -366 -294 -387 -268 -24 324 277 468 226 -74 -513 -553 -584 55 203 484 143 273 -290 -724 -365
6504 -365 -314 -15 85 387 365 318 -132 -467 -317 -364 38 317 132 282 15 -29 -382 -521 -374 42 231 345
6526 345 199 129 -127 -436 -185 -243 68 341 376 212 39 -235 -365 -607 -182 103 412 603 357 79 28
6547 28 -202 -271 -504 96 450 369 207 159 -234 -543 -273 -309 135 317 459 227 217 -285 -312 -208 -290 -26 98
6570 98 456 217 63 -276 -547 -517 -123 50 337 362 211 199 -423 -494 -462 -328 257 252 167 446 264 -202 -368
6593 -368 -363 -291 -174 498 531 234 37 -246 -402 -452 163 306 359 365 213 54 -181 -522 -710 -341 168 226 148
6616 148 347 -46 -215 -536 -548 -137 146 365 336 305 -334 -127 -409 -62 -278 10 503 121 248 -137 -42
6637 -42 -573 -253 -381 70 295 331 366 199 -359 -237 -116 -193 413 255 458 263 -93 -259 -408 -525 2
6658 2 331 384 356 221 -156 9 -354 -328 -59 334 392 717 458 342 -230 -344 -370 -87 342 473 364 335 -165
6681 -165 -400 -58 -523 60 283 224 325 223 -348 -272 -278 -133 -139 138 309 176 162 263 -419 -338 -472 278 371
6704 371 368 285 45 -17 -502 -359 -130 -209 132 380 71 12 -32 -99 -390 -228 -98 37 386 140 -99 54 -176
6727 -176 -231 -214 0 136 327 622 190 104 -210 -568 -148 -167 255 104 486 0 -95 -155 -475 -323 203 -42
6749 -42 418 524 386 94 -443 -458 -273 158 448 190 318 33 -141 -834 -200 -130 -39 331 -1 366 37
6770 37 -247 -343 -339 -288 -65 328 360 407 246 -139 -338 -219 -160 241 249 444 253 69 -166 -184 -237 -6 -50 455
6794 455 289 554 133 -197 -482 -287 -379 129 22 463 120 57 -206 -47 -239 -227 42 100 524 128 -121
6815 -121 -537 -340 -265 -63 80 430 299 157 -224 -261 -284 -260 -40 -42 -30 70 15 116 -332 -507 -215 182 -84
6838 -84 468 550 120 10 -374 -256 -202 -116 132 300 275 34 48 -241 -274 -184 -26 159 130 520 123 -85 -134
6861 -134 -301 -330 84 217 139 412 235 298 -510 -548 -347 27 -168 342 257 177 155 -395 -28 -331 -54 117
6883 117 238 215 -22 214 -438 -558 -230 69 123 205 638 158 143 -288 -241 -399 -80 174 75 372 120 -207
6905 -207 -503 -504 -373 -42 497 257 55 94 -208 31 -342 -230 -187 146 125 291 297 23 -414 -32 -370 20
6927 20 239 418 472 286 -138 -356 -367 -416 40 299 156 343 260 -113 -207 -147 -72 2 13 309 46 291 -71
6950 -71 -297 -211 -465 6 45 44 274 30 -285 -339 -493 -347 68 325 382 275 57 -125 -189 -202 -292 110 380
6973 380 313 157 109 -124 -138 -102 -124 27 480 87 188 -6 -213 -292 -441 -244 -133 23 151 240 111 202 -115
6996 -115 -152 -90 86 216 348 136 142 -232 18 -253 -139 192 188 256 112 -160 -280 -235 -157 -166 217 164 238 46
7020 46 22 7 -361 -113 -183 -155 341 274 221 -146 -245 -207 -121 -74 -213 190 316 172 117 -143 -439 -333 39 237
7044 237 416 316 15 -29 -136 -682 36 -237 -224 163 383 32 138 22 -259 -369 -70 113 -77 144 165
7065 165 -79 -316 -92 -516 -71 120 174 323 -21 -50 -13 -299 -266 -230 186 415 212 -16 16 -179 -551 -30
7087 -30 -205 -26 284 94 316 -70 -147 -140 -291 -109 155 -73 239 209 116 -129 -213 -113 -192 238 169 298 283
7110 283 23 -278 -368 -163 -20 95 363 332 103 67 -145 -282 -199 7 156 143 345 136 -136 -103 -267 -231
7132 -231 -126 -129 399 102 -84 -319 -363 -307 -252 -199 333 89 -11 -59 -31 -205 -250 -294 -89 358 347 561 128 -147
7156 -147 -253 -369 -231 -77 459 296 -68 -28 -89 -232 -270 -505 -46 -3 301 51 -96 -301 -259 -242 -250 -161 79
7179 79 221 211 32 -188 -40 -348 -143 111 -42 276 123 76 -245 -226 -356 -260 6 -1 -19 320 161 -92 -209
7202 -209 -122 -85 -85 400 542 367 92 -213 -248 -327 80 -5 330 251 233 -298 -138 -133 -404 -260 12 52 326 52
7226 52 85 28 -212 -418 -184 99 99 442 256 109 -41 -282 -99 -303 127 43 121 203 32 -187 -323 -346 -205
7249 -205 13 238 319 412 -14 -32 -288 -79 -34 134 165 371 222 -508 -517 -307 -356 -411 83 54 104 203 109 -34
7273 -34 -42 46 -230 209 120 189 -44 -173 -37 103 -357 -302 -319 188 306 290 50 -64 -222 -326 -19 10 52 401
7297 401 446 -13 18 -266 -214 -165 159 163 36 43 209 -499 -100 -107 61 44 -114 -20 260 79 -1 -310 -589 63
7321 63 77 -54 213 398 -108 -284 -445 -181 -315 53 318 -51 273 -121 95 -128 -214 -156 -258 463 340
7342 340 526 1 -376 -97 -284 -61 277 397 -100 -98 204 -114 -193 -320 -312 121 226 199 292 31 19 -380 -185
7365 -185 -295 59 94 275 292 289 -208 -343 39 115 -42 20 455 199 -146 -381 51 6 52 -44 343 194 171
7388 171 -250 -23 -240 -145 -50 -32 163 141 360 -227 -90 -296 -300 104 264 288 107 220 -116 -347 -386 -140 -108
7411 -108 189 135 312 259 -200 -203 -27 -199 -177 -10 292 191 -199 -328 -256 -335 -161 6 263 308 381 200 -185
7434 -185 12 -278 -224 52 210 -121 -30 39 40 45 -78 -183 84 -77 52 -41 466 36 33 -240 -235 26 -1 502
7458 502 311 35 152 -450 -333 -288 28 137 468 340 173 -147 -195 -133 -39 -98 663 305 128 148 -151 -138
7480 -138 -274 -82 119 310 534 336 160 -168 -261 -183 -159 140 440 -59 118 -27 2 -505 -207 161 126 488
7502 488 69 218 102 -222 -277 -57 49 105 1 107 154 144 -232 -288 -296 -178 367 380 178 186 -70 -341 -87
7525 -87 -287 -78 26 89 201 128 131 -44 -133 116 -127 -50 201 218 212 -151 122 -163 -472 -31 309 180 255 153
7549 153 -95 -57 -294 -59 88 45 39 380 199 -74 -225 -349 139 -27 218 52 79 26 -3 -12 -30 -67 -148 198
7573 198 84 315 -114 -137 -80 -181 -273 -253 192 -14 242 107 28 -165 -274 -354 132 -4 268 188 315 17
7595 17 -209 -233 -115 -140 -146 416 185 -56 -27 -64 -64 -273 11 178 221 234 294 32 -92 -135 -210 -112 46 -80 -23
7620 -23 345 78 -1 -110 -398 -306 90 225 56 277 -20 46 -397 -96 -90 169 115 139 270 117 -248 -227 -77
7643 -77 -110 254 163 378 363 -48 -408 -359 -269 -92 27 -66 319 180 -10 9 0 -169 -227 18 23 226 -52 -28 -557
7668 -557 -90 -131 -255 378 221 -11 -58 -241 -299 -260 117 -292 137 143 227 293 -75 -180 -281 -177 55 262 221
7691 221 12 -126 -38 -99 -470 -132 -67 -59 175 138 163 -276 97 -172 -156 -119 107 134 132 79 -75 -268 -123 -261
7715 -261 -98 -56 319 31 61 -241 36 -144 -205 87 88 588 141 22 -46 -130 -285 -329 155 151 272 303 91 -1
7739 -1 -432 -242 -167 84 310 122 94 -61 -74 -201 -46 -85 229 97 64 538 -260 -123 -128 60 -368 141 6
7762 6 -224 130 -102 120 -415 -81 -121 112 243 282 -70 -12 -170 -166 -213 -121 -125 -123 100 521 171 -10 -222 -282 -253
7787 -253 -139 173 430 281 -1 -406 -44 -331 -205 11 77 -119 222 41 -208 -44 -645 -97 312 134
7807 134 10 289 89 -215 -30 -267 -60 15 137 256 -126 260 66 -183 -14 171 137 340 327 15 -174
7828 -174 85 -149 -244 14 256 1 428 56 -270 -200 -121 -129 -43 -2 372 52 -189 119 -193 -65 142 -44
7850 -44 -225 73 279 83 63 -190 -289 92 -219 131 405 129 -34 -249 -292 -238 -291 -113 317 -63 360 52
7872 52 36 -364 -140 93 -107 -211 152 110 -118 144 -640 -242 -387 -95 139 37 150 117 111 -57 -187 332
7894 332 93 -138 167 162 219 138 87 -156 27 105 106 18 169 16 18 -263 -493 -264 142 54 -165 95 261 282
7918 282 -63 -137 -44 -294 163 397 136 47 1 -177 -154 -55 -420 110 147 -104 -111 59 -261 138 -10 23 217
7941 217 99 256 -26 -349 -156 -321 21 88 -61 133 327 -131 212 -200 -229 -338 48 108 174 193 -66 -139
7963 -139 -191 -277 -47 -20 -44 195 167 -91 -33 -201 20 -213 35 37 253 269 50 -216 -351 -59 -23 80 -27
7986 -27 135 232 27 -4 -30 -163 22 299 -96 181 319 -90 -46 -429 -334 -71 85 53 -26 169 -57 101 -121
8009 -121 -354 -33 90 66 54 277 -83 -112 -226 -176 -226 50 0 302 212 -259 -34 -484 -161 -204 22 255 540
8032 540 286 233 -41 36 -71 -146 365 -170 112 176 27 45 -13 -181 -129 -65 47 59 184 -151 -10 -39 42 151
8056 151 -220 37 224 295 -223 114 -326 -138 -175 301 103 28 466 -76 -427 -177 -257 -60 286 223 33 68
8078 68 181 331 -229 111 -14 23 -89 107 -35 -91 235 -310 -157 -149 320 40 516 214 98 -88 -413 -147
8100 -147 -79 -74 -20 23 196 -25 -170 -283 -159 161 13 197 -4 102 23 115 -246 -223 -183 -145 176 242 84 95
8124 95 -211 -218 -114 15 176 51 375 211 58 145 32 -511 -18 -40 191 197 173 -207 -268 -301 -194 -79 34
8147 34 292 0 -21 3 61 -282 105 2 178 14 281 -107 -140 -217 -263 159 38 193 214 257 -126 -13 -424
8170 -424 -116 -219 -168 122 102 -56 0 176 -185 10 -392 -106 -68 45 87 75 -39 -5 -230 -47 178
8191A78
##END NTUPLES=NMR FID
##END=
